##TITLE=1H_SR_Pro_Gly-oil
 CDCl3
 8 sc, 
 10.03.2022
##JCAMPDX= 6.0         $$ Bruker NMR JCAMP-DX V2.0
##DATA TYPE= NMR FID
##DATA CLASS= NTUPLES
##ORIGIN= UXNMR, Bruker Analytische Messtechnik GmbH
##OWNER= root
$$ XWIN-NMR		Version 3.5
$$ Thu Mar 10 12:26:18 2022 Russian Standard Time (UT+4h)  she@DPX200
##.OBSERVE FREQUENCY= 200.131346
##.OBSERVE NUCLEUS= ^1H
##.DELAY= (6, 6)
##.ACQUISITION MODE= SIMULTANEOUS
##.ACQUISITION SCHEME= undefined
##.AVERAGES= 8
##.DIGITISER RES= 18
##SPECTROMETER/DATA SYSTEM= spect
##.PULSE SEQUENCE= zg30
##.SOLVENT NAME= CDCl3
##.SHIFT REFERENCE= (INTERNAL, CDCl3, 0, 15.7039)
##AUDIT TRAIL= $$ (NUMBER, WHEN, WHO, WHERE, WHAT)
$$ ##TITLE= Audit trail, XWIN-NMR		Version 3.5
$$ ##JCAMPDX= 5.01
$$ ##ORIGIN= Bruker BioSpin GmbH
$$ ##OWNER= she
$$ F:/spectra/data/she/nmr/H-F/1/audita.txt
$$ ##AUDIT TRAIL=  $$ (NUMBER, WHEN, WHO, WHERE, WHAT)
(   1,<2022-03-10 12:25:14.81 +0400>,<she>,<DPX200>,
      <created by zg, POWCHK disabled, PULCHK disabled
       configuration hash MD5:
       00 E9 B6 7A A2 85 ED C7 34 08 36 98 17 FE 4E 26
       data hash MD5: 16K
       FD 45 25 96 A4 16 B4 21 FD BE 06 8C F1 FF A9 79>)
$$ ##END=
$$ 
$$ hash MD5
$$ A9 1E BF 57 06 27 4B EF 9B 89 59 4F AA 45 A2 8A
##$RELAX= 
##$RELAX= 
##$RELAX= 
##$RELAX= 
##$RELAX= 
##$RELAX= 
$$ Bruker specific parameters
$$ --------------------------
##$DU= <F:/spectra>
##$EXPNO= 1
##$NAME= <H-F>
##$PROCNO= 1
##$TYPE= <nmr>
##$USER= <she>
##$AMP= (0..31)
100 100 100 100 100 100 100 100 100 100 100 100 100 100 100 100 100 100 
100 100 100 100 100 100 100 100 100 100 100 100 100 100 
##$AQSEQ= 0
##$AQ_mod= 1
##$AUNM= <au_zg>
##$AUTOPOS= <>
##$BF1= 200.13
##$BF2= 200.13
##$BF3= 200.13
##$BF4= 200.13
##$BF5= 200.13
##$BF6= 200.13
##$BF7= 200.13
##$BF8= 200.13
##$BYTORDA= 1
##$CFDGTYP= 0
##$CFRGTYP= 5
##$CHEMSTR= <none>
##$CNST= (0..31)
1 1 145 1 1 1 1 1 1 1 1 1 1 1 1 1 1 1 1 1 1 1 1 1 1 1 1 1 1 1 1 1 
##$CPDPRG= <>
##$CPDPRG1= <>
##$CPDPRG2= <>
##$CPDPRG3= <>
##$CPDPRG4= <mlev>
##$CPDPRG5= <mlev>
##$CPDPRG6= <mlev>
##$CPDPRG7= <mlev>
##$CPDPRG8= <mlev>
##$CPDPRGB= <>
##$CPDPRGT= <>
##$D= (0..31)
0 1.2 0 0 0 0 0 0 0 0.06 0 0.03 0 0 0 0 0.0002 0 0 0 0 0 0 0 0 0 0 0 0 
0 0 0 
##$DATE= 1646900714
##$DBL= (0..7)
120 120 120 120 120 120 120 120 
##$DBP= (0..7)
150 150 150 150 150 150 150 150 
##$DBP07= 0
##$DBPNAM0= <>
##$DBPNAM1= <>
##$DBPNAM2= <>
##$DBPNAM3= <>
##$DBPNAM4= <>
##$DBPNAM5= <>
##$DBPNAM6= <>
##$DBPNAM7= <>
##$DBPOAL= (0..7)
0.5 0.5 0.5 0.5 0.5 0.5 0.5 0.5 
##$DBPOFFS= (0..7)
0 0 0 0 0 0 0 0 
##$DE= 6
##$DECBNUC= <off>
##$DECIM= 32
##$DECNUC= <off>
##$DECSTAT= 4
##$DIGMOD= 1
##$DIGTYP= 9
##$DL= (0..7)
0 120 120 120 120 120 120 120 
##$DP= (0..7)
150 150 150 150 150 150 150 150 
##$DP07= 0
##$DPNAME0= <>
##$DPNAME1= <>
##$DPNAME2= <>
##$DPNAME3= <>
##$DPNAME4= <>
##$DPNAME5= <>
##$DPNAME6= <>
##$DPNAME7= <>
##$DPOAL= (0..7)
0.5 0.5 0.5 0.5 0.5 0.5 0.5 0.5 
##$DPOFFS= (0..7)
0 0 0 0 0 0 0 0 
##$DQDMODE= 0
##$DR= 18
##$DS= 0
##$DSLIST= <SSSSSSSSSSSSSSS>
$$ [...]
##$SUBNAM2= <"">
##$SUBNAM3= <"">
##$SUBNAM4= <"">
##$SUBNAM5= <"">
##$SUBNAM6= <"">
##$SUBNAM7= <"">
##$SUBNAM8= <"">
##$SUBNAM9= <"">
##$SW= 18.0517287032376
##$SWIBOX= (0..15)
0 0 2 0 0 0 0 0 0 0 0 0 0 0 0 0 
##$SW_h= 3612.71676300578
##$TD= 16384
##$TD0= 1
##$TE= 0
##$TE2= 300
##$TE3= 300
##$TEG= 300
##$TL= (0..7)
0 120 120 120 120 120 120 120 
##$TP= (0..7)
150 150 150 150 150 150 150 150 
##$TP07= 0
##$TPNAME0= <>
##$TPNAME1= <>
##$TPNAME2= <>
##$TPNAME3= <>
##$TPNAME4= <>
##$TPNAME5= <>
##$TPNAME6= <>
##$TPNAME7= <>
##$TPOAL= (0..7)
0.5 0.5 0.5 0.5 0.5 0.5 0.5 0.5 
##$TPOFFS= (0..7)
0 0 0 0 0 0 0 0 
##$TUNHIN= 0
##$TUNHOUT= 0
##$TUNXOUT= 0
##$USERA1= <user>
##$USERA2= <user>
##$USERA3= <user>
##$USERA4= <user>
##$USERA5= <user>
##$V9= 5
##$VALIST= <valist>
##$VCLIST= <CCCCCCCCCCCCCCC>
##$VD= 0
##$VDLIST= <DDDDDDDDDDDDDDD>
##$VPLIST= <PPPPPPPPPPPPPPP>
##$VTLIST= <TTTTTTTTTTTTTTT>
##$WBST= 1024
##$WBSW= 4
##$XGAIN= (0..3)
0 0 0 0 
##$XL= 0
##$YL= 0
##$YMAX_a= 204856
##$YMIN_a= -331125
##$ZGOPTNS= <>
##$ZL1= 120
##$ZL2= 120
##$ZL3= 120
##$ZL4= 120
##$ABSF1= 10
##$ABSF2= 0
##$ABSG= 5
##$ABSL= 3
##$ALPHA= 0
##$AQORDER= 0
##$ASSFAC= 0
##$ASSFACI= 0
##$ASSFACX= 0
##$ASSWID= 0
##$AUNMP= <proc_1d>
##$AZFE= 0.1
##$AZFW= 0.1
##$BCFW= 1
##$BC_mod= 2
##$BYTORDP= 1
##$COROFFS= 0
##$CY= 11.3945322036743
##$DATMOD= 1
##$DC= 2
##$DFILT= <>
##$DTYPP= 0
##$F1P= 2.36226072786647
##$F2P= -0.459571619588291
##$FCOR= 0.5
##$FTSIZE= 0
##$FT_mod= 4
##$GAMMA= 1
##$GB= 0.15
##$INTBC= 1
##$INTSCL= 1
##$ISEN= 128
##$LB= 0.24
##$LEV0= 0
##$LPBIN= 0
##$MAXI= 10000
##$MC2= 0
##$MEAN= 0
##$ME_mod= 0
##$MI= 1.114404
##$NCOEF= 0
##$NC_proc= 0
##$NLEV= 6
##$NOISF1= 3.799351
##$NOISF2= 2.8
##$NSP= 1
##$NTH_PI= 0
##$NZP= 0
##$OFFSET= 15.70392
##$PC= 1
##$PHC0= -16587.37
##$PHC1= 9.400779
##$PH_mod= 1
##$PKNL= yes
##$PPARMOD= 0
##$PSCAL= 0
##$PSIGN= 0
##$REVERSE= no
##$SF= 200.130013532006
##$SI= 16384
##$SIGF1= 3
##$SIGF2= 2
##$SINO= 400
##$SIOLD= 16384
##$SREGLST= <1H.CDCl3>
##$SSB= 0
##$STSI= 0
##$STSR= 0
##$SW_p= 3612.71676300578
##$SYMM= 0
##$S_DEV= 0
##$TDeff= 0
##$TDoff= 0
##$TI= <>
##$TILT= no
##$TM1= 0
##$TM2= 0
##$TOPLEV= 0
##$USERP1= <user>
##$USERP2= <user>
##$USERP3= <user>
##$USERP4= <user>
##$USERP5= <user>
##$WDW= 1
##$XDIM= 8192
##$YMAX_p= 0
##$YMIN_p= 0
$$ End of Bruker specific parameters
$$ ---------------------------------
##NTUPLES= NMR FID
##VAR_NAME=  TIME,          FID/REAL,        FID/IMAG
##SYMBOL=    X,             R,               I
##VAR_TYPE=  INDEPENDENT,   DEPENDENT,       DEPENDENT
##VAR_FORM=  AFFN,          ASDF,            ASDF
##VAR_DIM=   8192,          8192,            8192
##UNITS=     SECONDS,       ARBITRARY UNITS, ARBITRARY UNITS
##FACTOR=    0.0002768,     1,               1
##FIRST=     0,             0,               0
##LAST=      2.2672688,     0,               0
##MIN=       0,             -331125,         0
##MAX=       2.2672688,     204856,          0
$$ Real data points
##PAGE= N=1
##DATA TABLE= (X++(R..R)), XYDATA
0@%%%%%%%%%%qJ6j6J6k4L2m0M8n6P2q8J04j27J51j76K08k41K81l27L75m29M90
$$ 0 0 0 0 0 0 0 0 0 0 0 -8 8 -8 8 -16 16 -24 24 -32 40 -48 56 -71 80 -96 112 -129 152 -175 200 -229 261
32B61n57O31p13Q03r04J014j134J267j413J571j743J932k138K364k609K878l174
$$ 261 -296 335 -378 425 -479 535 -599 668 -745 826 -917 1015 -1123 1241 -1368 1510 -1664
49a664L497l852M244m676N156n694O299o983P763q666R725j0984J2511j4410J6849
$$ -1664 1833 -2019 2225 -2451 2705 -2989 3310 -3673 4090 -4576 5149 -5835 6676 -7734 9115
64I115k0113K4725l1804M4167p1949K50372l1098l27387K46950O9265j27062m1264
$$ 9115 -10998 13727 -18077 26090 -45859 204513 173415 -153972 92978 162243 35181 -6083
76f083J10646o9295r9337o228Q2213N068q6786j02215N3018N8703q7168o6324
$$ -6083 104563 35268 -64069 -70297 11916 16984 -69802 -172017 -118999 -60296 -147464 -213788
88b13788J35548Q8969l9740L7851R8973n9123p1570Q2993O8850o5246k3560M2451
$$ -213788 -78240 10729 -29011 8840 107813 48690 -22880 60113 128963 63717 40157 82608
100H2608q727k5176K5136R323o823j6679q6576q5877L3679L7642n6680j8662N9366
$$ 82608 73881 48705 73841 83164 76341 59662 -26914 -112791 -79112 -41470 -98150 -116812 -57446
113e7446N737k0995L9533J9568k8840K5158M0575k4075j0218L6014J2275K0287
$$ -57446 -51709 -72704 -33171 -13603 -42443 -17285 23290 -785 -11003 25011 37286 57573
125E7573N5434l759n2687K547J1813m5614k9411M519l2074k5310L3490Q090l8636
$$ 57573 113007 109248 56561 59108 70921 25307 -4104 415 -31659 -56969 -23479 -15389 -54025
138e4025N787L3286j9740l0401J1913Q503n356K1189L0616J0646J7118K4348M728
$$ -54025 -48238 -14952 -34692 -65093 -53180 -44677 -50033 -28844 1772 12418 29536 53884 58612
151E8612J543Q51j9489j1303R363j9661l3152J6168K4917k5628k1134J9238p882
$$ 58612 60155 61006 41517 30214 39577 19916 -13236 2932 27849 2221 -18913 325 -7557
164g557l8542l701J0801k0401j0452L0042K7968M663M080J6446J8659O087j3665
$$ -7557 -46099 -49800 -38999 -59400 -69852 -39810 -11842 -7179 -3099 13347 32006 38093 24428
177B4428q638J1190K024j5125N000J9899q982j7664J1346M364l3470k6251P117
$$ 24428 15790 26980 29004 13879 18879 38778 29796 12132 23478 27842 -5628 -31879 -24762
190b4762L84k1808o841J6972J3458J584N601J3369R424l673o232O377P761m428
$$ -24762 -24378 -46186 -53027 -36055 -22597 -21013 -15412 -2043 7381 3708 -2524 3853 11614 7186
204G186K460K1328J2417j0198m936Q518o243k3143j3495j834p419j1121k682O192
$$ 7186 9646 30974 43391 33193 28257 36775 30532 7389 -6106 -7940 -15359 -26480 -29162 -22970
218b2970K861q01M120O912l452r171J843J0166L802m76J0857J7099Q147J164M626
$$ -22970 -20109 -20910 -16790 -9878 -13330 -22501 -20658 -10492 -6690 -7166 3691 20790 28937 30101 34727
233C4727K085q489j1262m299n169j0798n138N460J976p652m271K605m046j1642
$$ 34727 36812 28323 17061 12762 7593 -3205 -8343 -2883 -907 -8559 -12830 -10225 -14271 -25913
247b5913m310L882J028q03Q558J3931O963L829J1089R012l208p437K40L207o030
$$ -25913 -30223 -26341 -25313 -26116 -17558 -3627 3336 7165 18254 27266 24058 16621 16861 20068 14038
262A4038p431M026P225m026p111J245k526j4848j1536J48k144q930N47J2780P985
$$ 14038 6607 10633 17858 13832 6721 7966 5440 -9408 -20944 -20796 -22940 -31870 -31323 -18543 -10558
277a0558j186L528J1012M476n315j194Q094K912m896K640J2115L082o846R80N807
$$ -10558 -11744 -8216 2796 7272 1957 763 8857 11769 6873 9513 21628 24710 17864 18844 24651
292B4651q222j6619m805J436p983j1108K457R668j59m477M584O446m576p033L844
$$ 24651 16429 -190 -4995 -3559 -11542 -22650 -20193 -10525 -10684 -15161 -10577 -4131 -8707 -15740 -11896
307a1896Q002j046j343J0959J2538l64k695O318L962r235r115J243q68q654m736
$$ -11896 -3894 -4940 -6283 4676 17214 16850 14155 20473 24435 15200 6085 7328 6460 -2194 -6930
322f930M675K818n204k453L507p26r061n074L830J779l281L917J1319O225m78
$$ -6930 -2255 563 -4641 -7094 -3587 -4313 -13374 -18448 -14618 -12839 -16120 -12203 -884 5341 4863
337D863L840O024j961o246j42K566l145l830K961M095k190l847J267m35p008p692
$$ 4863 8703 14727 12766 6520 6378 8944 5799 1969 4930 9025 6835 2988 4255 3820 -3188 -10880
353a0880j89O17m039j206P010N220p05K554Q073Q59o628p91M343j039l495L549
$$ -10880 -11069 -10452 -14491 -15697 -8687 -3467 -4172 -1618 6455 7314 686 -105 4238 3199 -296 3253
369C253P209Q60l509R33J691n564q774j343K113m356o122M335P157k031l173O160
$$ 3253 10462 11322 7813 8746 10437 4873 -3901 -5244 -3131 -7487 -13609 -9274 -2117 -4148 -7321 -1161
385a161M863o100m529N553L132m268o82Q277N280k163j072M663Q13q514o658K382
$$ -1161 3702 -2398 -6927 -1374 1758 -2510 -3192 5085 10365 8202 7130 11793 12606 4092 -2566 -184
401a84K45p720k641Q994L234p567p04O745j964q726N77O578l40l521M389Q558
$$ -184 61 -7659 -10300 -1306 1928 -5639 -6343 402 -1562 -10288 -9711 -3133 -3473 -6994 -2605 5953
417E953K211l155J702N764p88q520k419M542k527p186K660P805l444p063L468
$$ 5953 8164 5009 6711 12475 11687 3167 748 5290 2763 -4423 -1763 6042 2598 -4465 -997
432i97K852p546o583K792K174l084N00O642N381p7q54L602L756l954m589L999
$$ -997 1855 -5691 -12274 -9482 -7308 -10392 -9892 -3250 2131 2054 1200 4802 8558 4604 15 4014
448D014L742m838j843P228J810o281m52L831m423q474j845J313k301k988K301
$$ 4014 7756 2918 1075 8303 10113 3832 3380 7211 2788 -5686 -7531 -6218 -8519 -11507 -9206
463i206M718J424j053K127L526r95m849J056N167j68j938N815O380k779l455M118
$$ -9206 -4488 -3064 -4117 -1990 1536 541 -4308 -3252 1915 1747 -191 5624 12004 9225 5770 9888
479I888L17p695l808K754j962n266j128L799J217k379p05K519M93n060l054M788
$$ 9888 10205 2510 -1298 1456 -506 -5772 -6900 -3101 -1884 -4263 -4968 -2449 -1956 -7016 -10070 -5282
495e282K805l469J737Q947K569m072L088N106l794o290Q25K781k208l099K081
$$ -5282 -2477 -5946 -4209 4738 7307 3235 6323 11429 7635 1345 2170 4951 2743 -356 1725
510A725L382k351n012P75K416m017o153J160L549l370k456O708O297k743j374
$$ 1725 5107 2756 -2256 -1481 935 -3082 -9235 -8075 -4526 -7896 -10352 -3644 2653 -90 -1464
525a464N058K257m910k336L824J926l364m29N494K910l645k719K051q91p437l143
$$ -1464 3594 5851 941 -1395 2429 4355 991 562 6056 8966 5321 2602 4653 3762 -3675 -6818
541f818M144M16m729J040N936k19l831J543L634j113m159K99L772K54k303K991
$$ -6818 -2674 -2258 -6987 -5947 -11 -230 -4061 -2518 1116 3 -4156 -3857 -85 169 -2134 857
557H57O557j31m548J342K806m501n028J343J505l196j424L775L207j852k397N07
$$ 857 7414 7283 2735 4077 6883 2382 -2646 -1303 202 -2994 -4418 -643 2564 712 -1685 -1178
573a178R93l319k904L201L118k250o04N202K608k700K61L096j294n134o75K030
$$ -1178 -185 -3504 -6408 -3207 -89 -2339 -2943 2259 4867 2167 2428 5524 4230 -904 -1579 451
589D51o90j728J484K797R8k256l55M90j477l447p41K913K93j815L265N087j471
$$ 451 -239 -1967 -483 2314 2412 156 -199 291 -1186 -4633 -5374 -2461 -2168 -3983 -718 4369 2898
606B898k350L019M39m291j067K847K93k204M17J888P28n39j461J08L08l972l611
$$ 2898 548 3567 4006 -285 -1352 1495 1788 -416 1 1889 2617 2078 617 725 1033 -2939 -6550
623f550K616K066k667J07N454J358l421J489L484k672l154J575K492r44m32J848
$$ -6550 -3934 -1868 -4535 -4428 1026 2384 -1037 452 3936 1264 -1890 -315 2177 1233 801 2649
639B649K515m58k553r62J352k066m698K98L045j542l454L220L806k456j993L339
$$ 2649 5164 4706 2153 1191 2543 477 -4221 -3923 -878 -2420 -5874 -2654 1152 -1304 -3297 42
655D2P06l790n30K717J048m09J229K430J946q19k009P28Q69l564k685K506P84
$$ 42 748 -3042 -3572 -855 193 -216 1013 3443 5389 4570 2561 3289 4158 594 -2091 415 1199
672A199l192J50L372j080l551O42J300j865j984R18J363K17K80J631K798J162
$$ 1199 -1993 -1843 1529 449 -3102 -2460 -1160 -3025 -5009 -4091 -2728 -2511 -2231 -600 2198 3360
688C360j209n1J820n75l173N00K284j593q26K311J263l090j208M48j093k933l57
$$ 3360 2151 2100 3920 3345 172 672 2956 1363 537 2848 4111 1021 -187 261 -832 -3765 -4122
705d122Q28j73N21O04J335P43j89m89J624K35j531j0K151r1o72J760K109j111
$$ -4122 -3294 -3467 -2946 -2342 -1007 -264 -453 -942 682 917 -614 -624 1527 1436 764 2524 4633 3522
723C522j758J099l0l277j455N81L66j018j93J418P91j010j384J036O89k269l89
$$ 3522 1764 2863 2833 -444 -1899 -1318 -952 -1970 -2163 -745 46 -964 -2348 -1312 -623 -2892 -3281
740c281K309J657j649R10K809M10k019J39J888r59k233j59J230l28j408N34J798
$$ -3281 -972 685 -964 -54 2755 3165 1146 1285 3173 2214 -19 -178 1052 724 -684 -150 1648
757A648o37j940k13J214j653k030Q55J883l75n47J734J963r87j195J177O98j501
$$ 1648 1011 -929 -1142 72 -1581 -3611 -2756 -873 -1248 -1795 -61 1902 915 -280 897 1595 94
774I4r63J401J037p76q76J518J122j849j156J433k53k281r18J489O54j302M88
$$ 94 -869 532 1569 793 -83 1435 2557 708 -448 985 732 -1549 -2467 -978 -324 -1626 -1138
791a138J915L56j154k38Q59k14j490K76J489K38p59O10J466p94j615M0P02q77
$$ -1138 777 1133 -21 -259 600 386 -1104 -828 661 899 140 750 2216 1422 -193 -153 549 -328
809c28j467Q25J022p14p75J042J308j112m52R26J66j134m54J326N43p39L07J411
$$ -328 -1795 -970 52 -662 -1437 -395 913 -199 -651 275 441 -693 -1147 179 722 -17 290 1701
827A701L09j473n54J104p95j676J88J247k48q25L44J307q93j381O27J206q45j211
$$ 1701 2010 537 -17 1087 292 -1384 -1196 51 -197 -1022 -678 629 -264 -1645 -1018 188 -657 -1868
845a868J234J552r27p52J671J399j242r28J323L23j470j246J390L93j085p47J326
$$ -1868 -634 918 -9 -761 910 2309 1067 139 1462 1785 315 -931 459 852 -233 -980 346
862C46Q64j747j128J073L13j699j56J749K67j207M18J780K88j561M13J532j03
$$ 346 1210 -537 -1665 -592 -279 -1978 -2134 -385 -118 -1325 -907 873 1161 -400 13 1545 1442
879A442j783O63J588k65j583J80J714o59j660K68O30j080j782Q37J497q88q53
$$ 1442 -341 322 1910 1645 62 242 1956 1297 -363 -95 535 -545 -2327 -1490 7 -881 -1734
896a734P92J695j179j545J508Q30j084k72J391J317j155l87J232R32j492r05J244
$$ -1734 -942 753 -426 -1971 -463 367 -717 -989 402 1719 564 177 1409 2341 849 -56 1188
913A188J78j563n29J136Q8j498j1J396m87j128K4Q19o73p20M68J283jm05O82J114
$$ 1188 1366 -197 -726 410 498 -1000 -1011 385 -102 -1230 -1206 -387 -1060 -1780 -1312 -29 -30 -435 247 1361
933A361n38j021N36J130n75r79N58J042q90q54P16P19j536o55R48j6j172l26P66
$$ 1361 823 -198 338 1468 893 -86 472 1514 624 -230 486 1205 -331 -986 -38 -54 -1226 -1552 -786
952g86M59q00j4J469N11j343j78J136K18j345M8J471K92j290L98J498n40j324
$$ -786 -327 -1127 -1141 328 839 -504 -682 454 672 -673 -625 846 1138 -152 246 1744 1204 -120
970a20j33J150o56j023M92P70m59j211O81J173l32j195L78J051j049j039J085
$$ -120 -253 897 241 -782 -290 480 21 -1190 -509 664 332 -863 -485 566 -483 -1522 -437
987d37R14n57m69J278O49j366l60O39N82j193m59P60P38q44p34J376L21j267n48
$$ -437 477 -80 -549 729 1378 12 -348 291 873 -320 -779 -19 719 -125 -859 517 838 -429 -977
1006i77J223J46j069l38J458R5r54j75J434k42o89j29P46l59r77K96O60K12o57
$$ -977 246 392 -677 -1015 443 538 -416 -591 843 601 -88 -217 529 170 -807 -511 149 361 -296
1025b96j3J143m14j048L65O75n13q28P59J024o48n98R56K72n67l42R9J76n32j28
$$ -296 -309 834 420 -628 -263 412 -101 -929 -170 854 206 -392 564 836 269 -73 26 202 -330 -458
1045d58N34J02k21m51M90N16o55m70N24j68q43M74O73L10o47L83M49m3o92K16
$$ -458 76 178 -43 -494 -4 512 -143 -613 -89 -257 -1100 -626 47 357 -290 93 542 499 -193 23
1065B3N52k51p03L06Q32k71n15L36M44n89m23J10N7m35m32M55M28p28J05Q30M18
$$ 23 575 324 -379 -73 759 488 -27 309 753 164 -259 -149 -92 -527 -959 -504 -76 -804 -699 131 549
1086E49p73l7J85J86o51Q4Q44L43m29L18O01k26q40n32J062m16p40J9O21j32n55
$$ 549 -224 -261 -76 110 -541 -457 387 730 301 619 1220 994 154 -378 684 268 -472 -453 168 36 -519
1107e19J07N89q0q07J41M64m50k81M32M53k91Q0M25O50l82o5j0j9l25l77P25J21
$$ -519 -412 177 97 -710 -569 -105 -555 -836 -404 49 -242 -162 263 913 531 466 456 437 112 -265 460 581
1129E81n0l42K49j09n43k75J30J65p11J89M13K30o18K06P41J94m62k08O44n11
$$ 581 531 189 438 329 -214 -489 -359 -194 -905 -716 -303 -73 -691 -485 256 450 -12 -220 424 -87
1149h7r0J1N82K7l92K56M54j55m02k03L23n65l38M64J04j60J44q1K99m12N6j21
$$ -87 -177 -166 416 443 51 307 761 606 204 1 324 -241 -579 -115 -11 -171 -27 -108 191 -221 -165 -286
1171b86K13n22j23Q58O6l23P2N76n3l87k97O66k34m30j1Q74n87l33M85K42l58
$$ -286 -73 -595 -718 140 206 -117 -45 531 478 91 -206 460 226 -204 -215 659 72 -261 224 466 108
1192A08n72M64j27l29p7J38M52Q2l41K25M22l78n45M76L04o87P8J90M65k85k19
$$ 108 -464 0 -127 -456 -533 -395 57 139 -202 23 445 67 -478 -2 302 -385 -307 -117 348 63 -156
1213a56O65L2n51j44L83j47m47L28K06Q7m36K16L21J77o23n9N13l68l94K56M94
$$ -156 509 541 -10 -154 229 82 -365 -37 169 256 -180 36 357 534 -89 -148 365 -3 -397 -141 353
1234C53l18l32M33M74o13j15m9K23k57k02L83L51n09j11M92N16p68j71L72J07
$$ 353 35 -297 136 610 -3 -118 -167 56 -201 -403 -20 331 -178 -289 203 719 -49 -220 152 259
1254B59m16n1M93K1k97j8M43l37Qn81N38j93m24L15M13q8m00j02N45j37m80L33
$$ 259 -157 -208 285 306 9 -9 434 97 105 -476 62 -131 -555 -240 173 85 -315 -417 128 -9 -489 -156
1276a56M40k18k17J3M18l19k1L47J76j76k32K37j5m12j64L99l3j86j42M30j32
$$ -156 284 66 -151 -138 280 -39 -60 287 463 287 55 292 277 -135 -299 100 67 -119 -261 169 37
1297C7k28l37J17M58o05L31O6K06j43k0N18k51j88l5K79L5k76M0Q5K06m80J21
$$ 37 -191 -528 -411 47 -558 -227 -161 45 -98 -118 400 149 -39 -74 205 240 -36 4 89 295 -185 -64
1319f4K33j38l57L07K83o14k55L88J08m1l28L19L53j97k86O61j0l38k23K81J18
$$ -64 169 31 -326 -19 264 -350 -605 -217 -109 -150 -478 -159 194 -3 -289 372 362 24 -199 82 200
1340B00j92j6M04L0l10k10J62p1l01K48J89O5m95o6K67p3k94K20L45j16k33M7
$$ 200 8 -8 396 426 116 -94 68 -3 -304 -56 133 198 -297 -363 -96 -169 -463 -243 102 -14 -247 -200
1362b00M34j01k88L45J80Kl86J73J43p0k83K01n8j58j09L49J56m85J6j48M72l66
$$ -200 234 133 -155 190 370 372 -14 159 302 232 -51 150 92 -66 -175 174 330 -155 -139 -287 185 -181
1384a81l03M05L78m62L5J50J20k71j91N08jl57L3M75j27l86Q8P0K15k37k52N21
$$ -181 -484 -79 299 -163 -128 22 142 -129 -320 188 187 -170 -137 338 211 -175 -87 -17 198 -39 -291 230
1406B30P1n21N7L64j95j13K63k24J84l34K07R1j07k02L74lop2L0L00n68J15M1
$$ 230 301 -220 -163 201 6 -107 156 -68 116 -218 -11 80 -27 -229 145 142 136 64 94 394 -174 -59 -18
1429a8L03k79j76M61r8k77P0J25j61J8R7j07J44l04O9J52P9k66j3L05J27k39L5
$$ -18 285 6 -170 291 193 -84 -14 111 -50 -32 65 -42 102 -202 -133 19 98 -168 -181 124 251 12 47
1452D7j44N3q0N6K99l31J03J04J70n10J26O9K66l33nL04k47J86k72P5J93K0l44
$$ 47 -97 -44 -124 -68 231 -100 3 107 277 -233 -107 -38 228 -105 -110 194 -53 133 -139 -64 129 149 -195
1475a95K21J05k78J15J2J85J72m12R2o1k8k19M53p6k2j23j91K87j10P6k2J37k81
$$ -195 26 131 -147 -32 -20 165 337 -75 17 -44 -72 -291 162 86 64 -59 -250 37 -73 3 -19 118 -163
1498a63J9K23r1J12k8J03J48m13J81r0j60m3O9r5J90l1P7K0j60q4N10Q6k18k66
$$ -163 -144 79 -12 100 72 175 323 -90 91 1 -159 -202 -133 -228 -38 -69 8 28 -132 -216 294 380 162 -104
1522a04J23J66o0j06J31o2j58O6P9j46p6J37K34J2k79qlR3K12q5j33q4J33l35
$$ -104 19 185 125 19 150 88 -70 -4 75 -71 -147 -10 224 236 -43 -51 -54 39 251 166 33 -51 82 -253
1546b53M20j61j43L80J3l40L5J34j6j23K7K63j3k91K8R3o9N5j54J73Jl50P4K93
$$ -253 167 6 -137 243 256 -84 -49 85 69 -54 -27 236 223 -68 -40 53 -16 39 -115 58 59 -291 -217 76
1570G6q1j04p0J8R0J32o9O6q7J96k04l64K46m6J25L89l18j0Q4k30L15j11j78L13
$$ 76 -5 -109 -179 -161 -71 61 -8 58 -29 167 -37 -401 -155 -201 -76 313 -5 -15 69 -161 154 43 -135 178
1594A78m3l17J29O9j14j7j01L93j69j22J85k50J37k0j8M18k25j69L15k53J52k51
$$ 178 135 -182 -53 16 -98 -115 -216 177 8 -114 71 -179 -42 -62 -80 338 113 -56 259 6 158 -93
1616i3K30L4k61J58j43J02J43k63L03L6j79j29J75J51m80K94l01K18j3Ro1K22
$$ -93 137 171 -90 68 -75 27 170 -93 210 246 67 -62 113 264 -216 78 -223 -5 -18 -9 -70 152
1638A52k62j45L84j34m6R9l1j3O8j52L11j86p7q7N2l6R2Q5J94m57J11J70j72K23
$$ 152 -110 -255 129 -5 -51 48 17 4 72 -80 231 45 -32 -119 -67 -103 -11 74 268 -189 -78 92 -80 143
1662A43J5j44k62K29J9n6R6M5l0M3Qj10k60K12L13k81J66l8r9j25O0R0j76J45
$$ 143 158 14 -248 -19 0 -56 40 85 55 98 106 -4 -264 -52 261 -20 146 108 9 -116 -56 34 -142 3
1686Cn6qJ11k22K91NK9O5l53K50k15jJ44N4J54j23LR4o0q5k60K4M1Q0m9K85r5
$$ 3 -53 -61 50 -172 119 124 153 218 -135 115 -100 -101 43 97 251 128 131 225 165 80 -180 -156 -115 -35 -84 201 106
1713A06r2N1k58L88l79M19j14k42o4J44O0j20J58O1rR2j85J2j19J18J6L00k60
$$ 106 14 65 -193 195 -184 235 121 -121 -185 -41 19 -101 57 118 109 201 16 28 -91 27 43 343 83
1736H3j05k0L3M4k20K70m1o3J14l1L9j43j10O2om2J0J00J75j89R5l5L9j26K2O1
$$ 83 -22 -42 -9 35 -185 85 44 -19 95 64 103 -40 -150 -88 -94 -136 -126 -26 149 -40 55 20 59 -67 -45 16
1762A6J8J41l16J34l6K6J59Pl2j53j53M90k65M7j35o6M27k97m9O8p2J43l15K63
$$ 16 34 175 -141 -7 -43 -17 142 149 117 -36 -189 301 36 83 -52 -118 309 12 -37 31 -41 102 -213 50
1786E0j77m4K35j39jk04K48J91k65K42k65K99j00j26k1J73o8K08m12K19J26k23
$$ 50 -127 -171 64 -75 -76 -280 -32 159 -106 136 -129 170 70 -56 -77 96 28 236 -176 43 169 -54
1808e4J16K11k31j11J06j08J56j74j56L17l21K40M2Nk47J58N9j0p4J87J52k96
$$ -54 62 273 42 -69 37 -71 85 -89 -245 72 -249 -9 33 38 -209 -51 8 -2 -76 111 263 -33
1830c3J48j92K61j63N9k68L43j26N1O8K5j68l3k00J70k27K31p5J57Jq1j08L33
$$ -33 115 -77 184 21 80 -188 155 29 80 148 173 5 -28 -228 -58 -285 -54 -129 28 29 -52 -160 173
1853A73k08m1J61j76J2O5L05j73lk19K59j67K19j90J3j02k3J20k15J50k43O04
$$ 173 -35 -76 85 -91 -79 -14 291 118 115 -104 155 -12 207 17 30 -72 -95 25 -190 -40 -283 321
1875C21l44K24k60N6m3k1N5K79j48J52k34j5J88l13K7J97R2m09L64j09J21l53
$$ 321 -23 201 -59 -3 -46 -67 -12 267 119 271 37 22 210 -103 -76 121 213 -196 168 59 180 -173
1897a73R0J26Q3k04p6J74M8kj90J25m0jm8J22j8o4l4K14K04m48KJ86m2k0o4M8
$$ -173 -83 43 126 -78 -154 20 68 66 -124 1 -39 -40 -88 34 16 -48 -82 132 336 -112 -110 76 34 14 -50 -2
1923bj25J14p8J40j09k1Q0J08J20k63m7N5j41%O8O7k09Q5J97J04p1O8j57J66j63
$$ -2 -127 -13 -91 49 -60 -81 -1 107 227 -36 -83 -28 -169 -169 -101 -34 -243 -158 39 143 72 140 -17 149 -14
1948a4p3j79K95q5L71l83o6J43j10K26m7m6N9m2J43j14J62k85J67j88O0o0K8q9
$$ -14 -87 -266 29 -56 315 -68 -134 9 -101 125 78 32 91 49 192 78 240 -45 122 -66 -6 -66 -38 -127
1972a27J59j70K6J58l00L02M8k05J66K0j44K71m30J84O0J5Q6k50K7k87L62J80
$$ -127 32 -138 -112 46 -254 48 96 -109 57 77 -67 204 -226 -42 18 33 119 -131 -104 -391 -29 151
1994A51k36o4M4L29l64q9K26q7K3J5K78j57j64k0L7O5o2J42L83n06J6m1j8j8J04
$$ 151 -85 -149 -105 224 -140 -229 -3 -90 -67 -52 226 69 -95 -115 -78 -13 -75 67 450 -56 -40 -81 -99 -117 -13
2019a3P9p4R5k28J63k6k21J28j12L49m11j4J32K90j23J55Nj60j73K08N8K49l44
$$ -13 66 -8 87 -141 22 -4 -225 -97 -209 140 -271 -285 -153 137 14 169 174 14 -159 49 107 356 12
2042A2j24L42p4j39q0Q0J48j25j39K60k09j08K38k27J10J2NJ01r5J80l12j0J8
$$ 12 -112 230 156 17 -63 17 165 40 -99 161 -48 -156 82 -145 -35 -23 -18 83 -12 168 -144 -154 -136
2065a36J93k14K74L8J48m36L14k07k26L18k21L31j92J88m56Q8N3J24R6r8j22J90
$$ -136 57 -157 117 155 303 -133 181 -26 -252 66 -155 176 -16 172 -284 -196 -143 -19 77 -21 -143 47
2087D7k40J19r5L40j37k12J73J24J1j21r1J47j63J41j96K33ql29K27K74j86j86
$$ 47 -193 -74 -169 171 34 -178 -5 119 130 9 -82 65 -98 43 -153 80 72 -257 -30 244 58 -128
2109a28RJ99j66P7j31L37l04l4j73L41K6J97q8k16J17q9K33m32J47Q8Q0j51j85
$$ -128 -119 80 -86 -9 -140 197 -107 -141 -314 27 53 250 162 -54 63 -26 207 -225 -78 10 90 -61 -246
2132b46J92J44j35o4j24L65k97o6K76l0j70K35n11N01r4J23Q3q2m0N3m2k38O2
$$ -246 -54 90 -45 -109 -233 132 -165 -231 45 15 -155 80 -431 70 -24 99 182 100 60 113 71 -167 -105
2155a05RK96l57O0n1L99j79r5j25L32j50m02L31o7J96k46L47k23J59p4J94k47
$$ -105 -96 200 -157 -97 -148 251 72 -23 -148 184 34 -368 -37 -104 92 -154 193 -30 129 55 249 2
2177Bo0O1Lr4j47K75J45l31K06j8k51K82J07l63M28k68J75k83L56K18l69k21K71
$$ 2 -58 3 6 -88 -235 40 185 -146 60 42 -209 73 180 -183 245 -23 152 -131 225 443 74 -147 124
2200A24K6M6m58M24L1j67k6K48k37oj26o5J85j25L19k19J84l93J86J34j88J52
$$ 124 150 196 -262 162 193 26 0 248 11 5 -121 -186 -1 -126 193 -26 158 -235 -49 85 -103 49
2222D9j44J15k50J58O5N5j94K17k43J57K33k19k81N45p1m27J94J89j95p3M8j57
$$ 49 -95 20 -230 -72 -7 48 -146 71 -172 -15 218 -1 -282 263 192 -235 -41 148 -47 -120 -72 -229
2244b29K47r8J15q9k45K93j92L99ol50l2J26q6K6K41K36j13l82O00l74K39l60
$$ -229 18 -80 35 -54 -299 -6 -198 201 195 -155 -187 -61 -147 -121 120 356 243 -139 461 87 326 -34
2266c4M2j8j46J19m0K45jk58J51k22J92M4R0J4l46J44q1K02j26N6J03j24K9l9
$$ -34 8 -10 -156 -37 -77 168 167 -91 60 -162 30 74 164 178 -168 -24 -105 97 -29 27 130 6 35 -4
2290dJ3L5j65K7J51j95J95j0J75j84l64K66J11l11L16j88J39j43k2O4J07j4m01
$$ -4 9 44 -121 -94 57 -138 57 47 222 38 -326 -60 51 -260 56 -132 7 -136 -158 -94 13 -1 -402
2313d02O45j97j97J39m0J79k51j5J22Q6j06K63P0l54J18p0j25N2O0k59J07K01
$$ -402 243 46 -151 -12 -52 127 -124 -139 -17 69 -37 226 296 -58 60 -10 -135 -83 -23 -282 -175 26
2335B6L8q7q4K2O9J1J93lk79kJ6r1O5M1J14P5l16L36o9l97L72j40J54j49M6k51
$$ 26 64 -23 -107 -85 -16 -5 188 185 -94 -96 -80 -171 -106 -65 49 124 -192 144 75 -322 50 -90 64 -85 -39 -290
2361b90M35k34o9K27n2k59L34n2L8j77j56J40m9R7K00j3k55K42J35r4n1l0R2J23
$$ -290 145 -89 -158 69 17 -242 92 40 78 -99 -255 -115 -164 -67 133 120 -135 107 242 148 97 67 159 282
2385B82l48Q3K20l2l45J1L68k62J15j97J17J81J88l21j98O6m1J44l7o1J80j07
$$ 282 -66 17 237 205 -140 -129 239 -23 92 -105 12 193 381 60 -138 -72 -113 31 -6 -67 113 6
2407Fn1O0k31o4K16L08k98r5qJ3K28O4l05q9J97j4J00J39m72M14l8j50K03o6m1
$$ 6 -45 15 -216 -280 -64 244 -54 -149 -157 -144 84 148 -157 -246 -49 -63 37 176 -296 118 80 -70 133 67 26
2432B6J27l20L2Rk1p6L21o8Q9k23j15J84J0J05l0m7M2J24o8l1k51K40Q4j71R2
$$ 26 153 -167 -135 -126 -147 -223 98 30 119 -104 -219 -35 -25 80 50 3 45 169 101 70 -181 59 143 -28 64
2457F4k31K04Q7k13r7J17K41n07L72k8k28L40O3j35l8l7j14J39o0J32k81J47N
$$ 64 -167 37 124 -89 -186 -69 172 -335 37 9 -219 121 184 49 11 -26 -140 -1 -61 71 -210 -63 -58
2480e8K0J62k38L23l71%J10p4Q8q3K52q1J76k91K9K32k32K06j00p4R3k42O5O1
$$ -58 -38 124 -114 209 -162 -162 -52 -126 -38 -121 131 50 226 -65 -36 196 -36 170 70 -4 89 -153 -88 -27
2504b7K41j97O1ol05J39J39n6K8j2o6j06J64J5J19l68K44L4M6k14jL5L2j32Q8
$$ -27 214 17 78 72 -233 -94 45 -11 17 5 -61 -167 -3 12 131 -237 7 41 87 -127 -128 -93 -61 -193 -105
2529a05J30j03J20m9k8j19K10J29l54L24N3l5j38j90J82l42J13Q2J70k0k7N9m1
$$ -105 25 -78 42 -7 -35 -154 56 185 -169 155 208 173 35 -155 27 -315 -202 -120 50 30 3 62 21
2552B1l6L0J03O5r7j62o1J88N9j94K18m18K76rJ15l1p0k3j24PR1m4M0l1n5rL3
$$ 21 -15 15 118 183 86 -76 -137 51 110 -84 134 -284 -8 -17 98 67 -3 -26 -150 -143 -52 -96 -56 -87 -142 -151 -118
2579a18L1K66j44j4MR0l1q9N5n6k44J30J32l4N9J42l80K06k9O1J3k2n1L6Q0n5
$$ -118 -87 179 35 21 25 115 84 -5 50 -6 -250 -120 12 -22 37 179 -201 5 -24 37 50 28 -23 13 93 38
2605C8P8o0p0j59L56q4j10k60L54j48J86p6O1P6m49L80k41M4Q2j2J67j34j67L60
$$ 38 116 56 -14 -173 183 99 -11 -271 83 -65 121 45 106 182 -267 113 -128 -84 -2 -14 153 19 -148 212
2629B12R0l29K89m20K00J50l28K45j69J16l01J3L98k47n8j03K94k5K8pRj05M9
$$ 212 302 -27 262 -158 42 192 -136 109 -60 56 -245 -232 166 -81 -139 -242 52 27 55 48 57 -48 1
2652Aj45K77j59j04L26j42M4J33J33j54N8m76L47j25M9k67J11k07L87k98N6J55
$$ 1 -144 133 -26 -130 196 54 98 231 364 210 268 -208 139 14 63 -204 -93 -300 87 -211 -155 0
2674@k4p4K5K66k40k72J25Q6K90o5j64J28J17j43K5J7J1k94M7K69J3P6j97p3k3
$$ 0 -24 -98 -73 193 -47 -319 -194 -108 182 117 -47 81 198 55 80 97 108 -186 -139 130 143 219 22 -51 -74
2699g4K22R9k93j24Q5K63j4l28L61r3l20L06k30L26l6k54L2L69k75j57L12N9j43
$$ -74 148 247 -46 -170 -85 178 164 -164 197 104 -216 90 -140 186 150 -104 -72 297 22 -135 177 236 93
2722I3p2k9J25j64k6L3q9J43k4J3N5j05j65L96l18K50N0k24J11j82K99L3Lk5k76
$$ 93 21 -8 117 -47 -73 -40 -129 14 -10 3 58 -47 -212 184 -134 116 166 -58 53 -129 170 203 206 181 -95
2747i5L51k45R2j55pr2J7L72n2l38J33M6k8r7q7L41j92J9P7r0P5J21k33J27k8
$$ -95 256 11 103 -52 -59 -151 -134 238 186 -152 -19 27 -1 -98 -185 156 -36 -17 60 -30 45 166 -67 60 32
2772C2j21J24k0k03L47o3j4q2Q8p3J53q8Q6k82J18j09J67k07J84q8r2k3J86j69
$$ 32 -89 35 15 -188 159 96 82 0 88 15 168 80 166 -116 2 -107 60 -147 37 -51 -143 -166 20 -149
2796a49M0qK57l12L6j08j9L22K6m6O7k86R0j31Q0J51L2k29K37j02j6Q0O3k08j35
$$ -149 -109 -117 140 -172 -136 -244 -263 59 85 39 106 -180 -90 -221 -141 10 42 -187 50 -52 -68 12 75 -133 -268
2821b68L92k05n0J64Nl22J09K54Mq6j7K39j06k13J77k30n4J09J42j67L19k49K25
$$ -268 124 -81 -131 33 38 -284 -175 79 83 -3 -20 219 113 -100 77 -153 -207 -98 44 -123 196 -53 172
2844A72j97K06p9j76lN2PJ57j00lj34J17k06L23k86k26L14J45j40K10j74J14j20
$$ 172 -25 181 102 -74 -77 -25 -18 139 39 36 -98 19 -187 136 -150 -376 -62 83 -57 153 -21 93 -27
2867b7O5j69J41K16j78k08J86J70l47J48j9J12r7k9K00r1k82J59k7J99k81K10
$$ -27 38 -131 10 226 48 -160 26 196 -151 -3 -22 90 -7 -36 164 73 -209 -50 -77 122 -159 51
2889E1M5q4J01k29L0J2K12R4k29o6m6j34K50K26l29J58j18P8j20M6j5K88k09j35
$$ 51 96 12 113 -116 -86 -74 138 232 3 -63 -109 -243 7 233 -96 62 -56 22 -98 -52 -67 221 12 -123
2913a23l2K80k45m1J82N0j76k6k01O77j94k47Q0L5M3L7r4j41K06M9l2j62J35p9
$$ -123 -155 125 -120 -161 21 71 -105 -131 -332 345 151 -96 -16 19 62 99 5 -136 70 119 87 -75 60 -19
2937a9K9L5Nn4O5j02JJ47j36P4j47q9Q0K25j47r6J38R8k5l00J80J84J69k37L3
$$ -19 10 45 50 -4 61 -41 -40 107 -29 45 -102 -191 -111 114 -33 -129 9 107 82 -218 -38 146 315 78 111
2962A11L9j85J17j3L1Lq2J44l31J49r7j88L85q6j94K3k8J02J12l9R9j24mJ27j73
$$ 111 150 -35 82 69 100 103 21 165 -166 -17 -114 -302 83 -3 -197 -174 -202 -100 12 -27 72 -52 -56 71 -102
2987a02j22L5L38j47R7j8l4j1r4J15R3k24Q6q5J16K0k17J49J28J03l65K78J43
$$ -102 -224 -189 149 2 99 81 47 36 -58 57 150 -74 12 -73 43 63 -154 -5 123 226 -139 139 282
3010B82l94M0m9K22lj45j24K92k46J38Q8o1n8k83M57r4l24jL61Rj85J08k9q6R1
$$ 282 -112 -72 -121 101 98 -47 -171 121 -125 13 101 40 -18 -301 156 62 -262 -263 98 107 -78 30 1 -85 6
3035FK23j95k1k55N09l10NJ13l01K53l21L69l10M7M18m05J23J58K4j17l6o7K54
$$ 6 229 34 13 -242 267 -43 -38 75 -226 27 -294 75 -235 -188 230 -175 -52 106 130 13 -23 -90 164
3058A64l68O14l05k44K71j7k07Q5j73L31k08j97J52N6k79L06k83L80o0k0n2K72
$$ 164 -204 410 105 -139 132 115 -92 -7 -180 151 -57 -254 -102 -46 -325 -19 -302 78 18 -2 -54 218
3080B18j75j7j37K20j76J90j62Q4k70M04k83R8J27j29m6L12j77j21J42k57N8J57
$$ 218 43 26 -111 109 -67 123 -39 45 -225 179 -104 -6 121 -8 -54 258 81 -40 102 -155 -97 60
3102F0k20M7J46N4J42l22P7oL6J14j75J26kk81K04J33j03J5O4n05M80j37J55p1
$$ 60 -160 -113 33 87 229 -93 -16 -22 14 128 -47 79 77 -204 0 133 30 45 109 -396 84 -53 102 31
3126C1J41p2j42K51m13J69Q3j58K83k84P3J3L4O4k08O9N0j48P3K08n5j19k54L62
$$ 31 172 100 -42 209 -204 -35 48 -110 173 -111 -38 -25 9 73 -135 -66 -16 -164 -91 117 62 -57 -311 51
3150E1J22k21k36K39J5J04J71j89l14J91Q0KP4j34k4R5r6P7K08l27J52O9j11j05
$$ 51 173 -48 -284 -45 -30 74 245 56 -258 -67 13 15 89 -45 -69 26 -70 7 215 -112 40 109 -2 -107
3174a07J27k23L03J90j05p8j93K92l34K68k1j71J8J52J56k98K31Q0j66K6o9p4
$$ -107 20 -203 100 290 185 107 -86 206 -128 140 119 -52 -34 118 274 -24 207 287 121 147 78 4
3196DJ22k83J99k62M06j27o9P2o0rK00l72J10K6J00kj14J24k22J62p9J40j11J57
$$ 4 126 -157 42 -220 186 59 -10 62 2 -7 193 -179 -69 -43 57 55 -59 65 -157 5 -74 66 -45 112
3220A12j09n1J05p9j00L64k03j61Q6K3PK02q3k0l82M03o7j25m0N5L5oJ65j79o5
$$ 112 3 -48 57 -22 -122 242 39 -122 -36 -13 -6 196 113 93 -289 114 47 -78 -118 -63 -28 -34 131 -48 -113
3245a13J08j68L09j31j29J6K12m3R7J73l87K90j32J8l10M48k31j60J91r7NM0k85
$$ -113 -5 -173 136 5 -124 -108 104 61 158 331 -56 234 102 120 -190 258 27 -133 58 -39 -34 6 -279
3268b79P5J79k2q3j09k3J51M01l00LJ19p1j15L76k25J16j41l1l31N52j33j8k5
$$ -279 -204 -25 -47 -130 -239 -262 -111 290 -10 -7 112 41 -74 302 77 193 52 21 -310 242 109 91 66
3291F6k47J91m2J45j23k24K84o4j4m2j06J65K0k91M32r6Jk12J23N3LJ17r5Ll40
$$ 66 -181 10 -32 113 -10 -234 50 -14 -28 -70 -176 -11 9 -282 150 54 55 -157 -34 19 22 139 44 47 -293
3316b93K31J77j81J73k00J48J19j03j71k4R4J31j9j37j35J60P1J40l64jK07j1
$$ -293 -62 115 -66 107 -93 55 174 71 -100 -124 -30 101 82 -55 -190 -30 41 181 -183 -184 23 12
3338A2j40K34q7J57j41O9q7J3P6k03J72p0j13Q4lj01J83J9M7q6O2K20l34k1J36
$$ 12 -128 106 19 176 35 104 17 30 106 -97 75 5 -108 -24 -27 -128 55 74 121 35 97 317 -17 -38 98
3363I8l27J47j19K34m7LK25j32m7q8L15l66j96L58J8L7j44j27J0J20P1q9j37J96
$$ 98 -229 -82 -201 33 -14 -11 214 82 35 -53 262 -104 -300 58 76 113 -31 -158 -148 -28 43 -46 -183 13
3387A3j34J38j14J8J43k41j71M92J13j62l63L32j12n4K99l67P7J64j07L41l38
$$ 13 -121 17 -97 -79 64 -177 -348 144 257 95 -268 64 -48 -102 197 -170 -93 71 -36 305 -33
3408c3R5o5J60M0l5j82J06m4r1j01P9l1M8R5l9pK0K02m07K81l06K92j94J79j52
$$ -33 62 -3 157 197 162 -20 86 42 -49 -150 -71 -102 -54 41 2 -5 15 217 -190 91 -215 77 -117 62 -90
3433i0N3j21L43k71J38j20o5J75j89J68J60m8j54J59j42J42j70J41j12k68o2N17
$$ -90 -37 -158 185 -86 52 -68 -133 42 -147 21 181 133 -21 138 -4 138 -32 109 -3 -271 -333 184
3455A84k96P9l6L3j08P7J08P6k24K3K83j76Km9q0K17k50L21k60K0N0p1J96J1r2
$$ 184 -112 -33 -69 -36 -144 -67 41 117 -107 -84 199 23 25 -24 -104 113 -137 184 -76 -56 -6 -77 119 130 38
3480C8j40l7J11K8j84J59qJ22k48K50p3k33O58m50K09j15j73J24O3j49K56k03
$$ 38 -102 -139 -28 0 -184 -25 -33 89 -159 91 18 -215 443 -7 202 87 -86 38 101 -48 208 5
3502EQ5k62J99r7r2L73k14m84O19k47J86J59o7k61J26j84R8j47N6P6J1K32mQm49
$$ 5 90 -172 27 -70 -162 211 -3 -487 132 -115 71 230 163 -98 28 -156 -58 -205 -149 -73 -62 170 166 174 -275
3527b75J12J36K34k58K6J05j52J99k48J79L8l08Q2K21J19l69J66j80J87J13l64
$$ -275 -163 -27 207 -51 -25 80 -72 127 -121 58 96 -212 -130 91 210 -159 7 -173 14 127 -237
3548b37P8j57N71m14M21j17m7P8K77m58j43K76J14m29K29N7m4J77m33M72k12Q2
$$ -237 -159 -316 255 -159 262 145 98 176 453 -5 -148 128 242 -187 42 99 55 232 -201 271 59 141
3570A41k95J58n4K5q7k0o4j35J92qL91l15k19L27j29K0K78k16J29l31J56K46j50
$$ 141 -154 4 -50 -25 -112 -132 -196 -331 -139 -147 244 -71 -290 37 -92 -72 206 -10 119 -212 -56 190 40
3593D0q8R1j84J20QLk10K73j41N0Q4m9j31j6J39m2J26J19r3l3J07l42M7K03o0
$$ 40 -48 43 -141 -21 -13 -10 -220 53 -88 -38 46 -3 -134 -150 -11 -53 73 192 99 66 173 -169 -122 81 21
3618B1o9P9m6j18J08J84j03j04j12J60k1j91J06O6qr9J98k69K1K11j0Q1m4k0n
$$ 21 -48 31 -15 -133 -25 159 56 -48 -160 0 -21 -212 -106 -40 -48 -147 51 -218 -197 14 4 85 41 21 16
3643A6K4j48L07J0k96M5K55j50Q8j02j63N1K80k33p3J32R7j22K25k50o1j52J71
$$ 16 40 -108 199 209 -87 -42 213 63 151 49 -114 -63 217 -16 -89 43 140 18 243 -7 -68 -220 -49
3666d9R2k57N56k78n9M9n6J22k11J60p2r7QJ43P7j13j06J97k13P5j05O9M2J04
$$ -49 43 -214 342 64 5 54 -2 120 -91 69 -3 -100 -92 51 128 15 -91 106 -107 -32 -137 -68 -26 78
3690G8o8j76L54j66k3m8J44j39L6j4K8J88k93J97J65l58k2J21k10L52j7k15l3
$$ 78 10 -166 188 22 -1 -49 95 -44 -8 -22 6 194 -99 98 263 -95 -117 4 -206 146 129 -86 -119
3713a19J82l1J43k16K41k46j01O2j32L60n6k54K62Kj09J35k11k1L47j69J09k24
$$ -119 63 32 175 -41 200 -46 -147 -85 -217 143 87 -167 95 97 -12 123 -88 -109 238 69 178 -46
3735d6j35Q8k23L23K38l10L3K19l23L72k40l1J14N2k81L76j37K2k19K5M0J29o0
$$ -46 -181 -93 -316 7 245 -65 -32 187 -136 236 -4 -35 79 131 -150 226 89 111 -108 -83 -43 86 26
3758B6j51j51L49l99M32N2J20j40k00J06n0j5Q5n0Qp7K46k52j30K14J86k85j35
$$ 26 -125 -276 73 -326 106 158 278 138 -62 44 -6 -21 64 14 22 -55 191 -61 -191 23 209 -76 -211
3781b11N5R4J83j46K11j06k39J89k07l2J84j55P8J64o5O9r3m6j44J85O8k35K47
$$ -211 -156 -62 121 -25 186 80 -159 30 -177 -209 -25 -180 -102 62 -3 66 -27 -73 -217 -32 36 -199 48
3804D8j74L03j03j4n9Q2o4j15l2K59j66p8J7N2m2l9K4J44K18l37J47jJ96l86K8
$$ 48 -126 177 74 60 1 83 19 -96 -128 131 -35 -113 -96 -44 -86 -125 -101 43 261 -76 71 70 266 -120 -92
3829i2O4N3P8p9J36j74J56k0JL4k45J40M5k37K69j9l17J24p1J40k48OM05m02M07
$$ -92 -28 25 103 24 160 -14 142 122 123 157 -88 52 97 -140 129 110 -207 -83 -154 -14 -262 -256 149 -253 154
3854A54k43q1J44L7k12Q6J20j38J97k18J40l2O5k3O6N1j87J47J51l24K65j72q
$$ 154 -89 -170 -26 11 -201 -115 5 -133 64 -154 -14 -46 19 -4 62 113 -74 73 224 -100 165 -7 -15
3877a5J32j14Q7l7Lmj1l1j35%L1Q0j29J72Ko5J20j06K32n0l58M08k23qj62L83
$$ -15 117 3 90 53 56 52 41 10 -125 -125 -94 -14 -143 29 31 -34 86 -20 212 162 -196 212 -11 -19 -181 202
3903B02k58q4J40M9o3K0j17Q4l8J00p9J62j49j07J62Pj39P7j3P9k85K49o7j43
$$ 202 -56 -140 0 49 -14 6 -111 -27 -65 35 -44 118 -31 -138 24 31 -108 -31 -44 35 -250 -1 -68 -211
3927b11J86K15j39j6N6j80k12M00k66J42j63K48k24L3m3J72j80J60p0K56l6j86
$$ -211 -25 190 51 35 91 -89 -301 99 -167 -25 -188 60 -164 -131 -174 -2 -182 -22 -92 164 128 -58
3949e8J86J01k53Q8k8j66L12j67o9M6j87O7M9q1J79n4O8j29J03M3l2Pk28K23o6
$$ -58 128 229 -24 64 36 -130 182 15 -54 -8 -195 -128 -79 -160 19 -35 33 -96 7 50 18 25 -203 20 -46
3974d6J48j32L8L5j24J29k59M19Kn4k19J72j09p0J99l8k29R5K24j41j15j99L92
$$ -46 102 -30 8 43 -81 48 -211 208 210 156 -63 109 0 -70 129 91 -138 -43 181 40 -75 -274 118
3997A18M8k03K41m27J59K20l73K39R9j26J8J32j04j16N3J4J80J59l93K28q6j04
$$ 118 166 -37 204 -223 -64 156 -217 22 121 -5 13 145 41 -75 -22 -8 172 331 -62 166 80 -24
4019b4o3L3r2m7K80l55M90k01P3j85J46L4j72P5O3l2k4N8q6K62q6n1p4j18K56
$$ -24 -87 -54 -146 -193 87 -268 222 21 94 -91 55 89 -83 -8 55 23 -1 57 -29 233 147 96 22 -96 160
4044A60J23l84J32j26K65q7j7r1J9M2j6k01k9L5L15%k10J75j03J24N0j50Q9j03
$$ 160 283 -101 31 -95 170 83 66 -25 -6 36 20 -181 -210 -175 140 140 -70 105 2 126 176 26 115 12
4068A2M0j48J67%J6o0J78m40m1L07k6J15oj00p5J96l0N0j30p3K6N6M3j21R9r9
$$ 12 52 -96 71 71 87 27 205 -235 -276 31 5 120 114 14 -61 135 105 155 25 -48 -22 34 77 -44 55 -44
4094d4qK30l22J84L5r0r8m2J20J59k2K4M4K3j68q6m0j11L21j13l05L61O6o0J93
$$ -44 -52 178 -144 40 75 -15 -113 -155 -35 124 102 126 170 193 25 -61 -101 -212 109 -4 -309 52 118 58 251
4119B51k53K28j40j49M7J63Qk58J9MK11m9k1n6j72J44n4K81l47J77O4k32J0l5
$$ 251 -2 226 86 -63 -16 147 155 -103 -84 -80 131 82 61 5 -167 -23 -77 204 -143 34 98 -134 -124 -159
4143a59L40m18K9P2J49j05K11k76K68k73O0L49q2k62Q0m0M2pJ36k55n0K90p8k14
$$ -159 181 -237 -208 -136 13 -92 119 -157 111 -162 -102 247 165 -97 -17 -57 -15 -22 114 -141 -191 99 21 -193
4167a93l6K69J24j63Q2J16k12k70J39K14j8J6J96l51J46o6rj27J6k9K5K24J4j31
$$ -193 -229 40 164 1 83 199 -13 -283 -144 70 52 68 264 -87 59 -7 -16 -143 -127 -156 -131 93 107 -24
4191b4J07M4qj65J53j58O4m6j77p9N20k36L1j19K43k94PJ68r9Q4j16j4m1J32J23
$$ -24 83 127 119 -46 107 -51 13 -33 -210 -289 231 -5 26 -93 150 -144 -137 31 -68 16 -100 -114 -155 -23 100
4216A00O4k17J55k32M2O2N5j93L39j5o4j80O2K6p9J8P3J57j47K28l54Q4P7jl02
$$ 100 164 -53 102 -130 -88 -26 29 -164 175 160 96 -84 -22 4 -75 -57 16 173 26 254 -100 -16 61 60 -242
4241b42J46J3R3J55l86L53k58J66j2o1r2J79j21J21k03K23k20N1L24k74m5Jj9
$$ -242 -96 -83 10 165 -221 132 -126 40 28 -33 -125 54 -67 54 -149 74 -146 -95 229 -45 -90 -89 -108
4264a08J34j97O2m3J93O2J17p3J6j24j41J53n5J41l9j30l1J03k4k47J77o2L61
$$ -108 26 -171 -109 -152 41 103 220 147 163 39 -102 51 -4 137 98 -32 -63 40 16 -231 -54 -116 245
4287B45m68M54k80J27J33m15L50j24k62K41j21J4PJ98n1l10P8K6L36k00p3J91
$$ 245 -223 231 -49 78 211 -204 146 22 -240 1 -120 -106 -99 99 48 -262 -184 -158 178 -22 -95 96
4309I6m07M00p3p7P6m7R8j83j06L90j65L29l62J13j09J69l39K19p2J58l77Q3L1
$$ 96 -311 89 16 -61 15 -32 66 -117 -223 167 2 331 -31 82 -27 142 -197 22 -50 108 -269 -186 -155
4332a55J28K9k02K37k1N1k50J71q1k09J23K26kj6k3p1K86l77J20J34q8K56j72
$$ -155 -27 2 -200 37 16 67 -183 -12 -93 -302 -179 47 45 29 6 -65 221 -156 -36 98 10 266 94
4355I4k51J23K10j73J78j80m5j04R1j57K39p7j18K89Q6j13M0j61J0K0J5j19K90
$$ 94 -157 -34 176 3 181 1 -44 -148 -57 -214 25 -52 -170 119 205 92 132 -29 -19 1 16 -103 187
4378A87r0j06p2J42m7k2L61k76j59K22n3o7k80J65Q4l1j8J18j64p4K55o3l32L09
$$ 187 97 -9 -81 61 14 -8 353 77 -82 140 87 20 -260 -95 -11 -42 -60 58 -106 -180 75 12 -320 -11
4402a1J31K8l1q7M0j07J07k4Q5J2k47J23J48j03k08K24R9k20J49k10k0r7J73m8
$$ -11 120 148 117 30 70 -37 70 46 131 143 -104 19 167 64 -144 80 179 -41 108 -102 -122 -219 -46 -94
4426i4j4K0m5J5K37Q0j90j47L12%j22J05k45L12r2n4l8K02k08j81J22O1n8k4m5
$$ -94 -108 -88 -133 -118 119 199 9 -138 174 174 52 157 -88 224 132 78 40 242 34 -147 -25 36 -22 -46 -91
4451i1J48J9q8k36L90N7k09J26m92L56l1J98j12k34J3L99O6l56K85l62o1K96r6
$$ -91 57 76 -12 -248 142 199 -10 116 -376 -20 -51 147 35 -199 -186 213 279 -77 208 -154 -215 81 -15
4474a5j13r9K94m1k7R3k38M3J34m4P4k43P2K37j4j6m5J4R2k53k3J4J14o3l9q0
$$ -15 -128 -227 67 26 -1 92 -146 -103 31 -13 61 -182 -110 127 113 97 52 66 158 -95 -118 -104 10 -53 -92 -172
4500a72L04k46J21n1j33M64k40K61m05J99k62J09l5j23K45J2j85K65K8j25L28
$$ -172 132 -114 7 -44 -177 287 47 308 -97 102 -160 -51 -86 -209 36 48 -137 128 156 31 359
4521C59l83k1L01l85K4O4K6L4J24l42L02j85m1J40Q5j50K86j99N6m5q1n6J33P7
$$ 359 -24 -45 256 -129 -105 -41 -15 19 143 -199 103 -82 -123 17 102 -48 238 39 95 50 -31 -87 46 123
4545A23j10r7M6J04k53L61k3k95L07j55k76L10o8k1M5k09L39j49J55r2j6j9m29
$$ 123 13 -84 -38 66 -187 174 151 -144 163 8 -268 42 -26 -47 -2 -211 128 -21 134 42 26 7 -422
4568d22L76l8J47P2l05J31J22L6l06L92l65K25m0o6J61k46Q5J64k80J49j68k2
$$ -422 -46 -84 63 135 -170 -39 83 119 -187 205 -160 65 25 -41 120 -126 -41 123 -157 -8 -176 -198
4590a98L30j26m9m6k7K94k11M1k3Q6l03K20J5k41J22R1J1M2j36K54k79o4K22l7
$$ -198 132 6 -43 -89 -116 178 -33 8 -15 71 -232 -12 3 -238 -116 -25 -14 28 -108 146 -133 -197 25 -12
4614a2J20n7L7J6j33L5R0P6Pj99J39k31j6J03N8J06j15J0L9j64L13j54mP8m4O
$$ -12 108 51 88 104 -29 6 96 172 179 -20 119 -112 -128 -25 33 139 24 34 73 -91 222 68 64 142 98 104
4640A04j66J42M6j02R6j84P3R0r6lJ09j13J65k08n5J77j0O1j05n7P3p3K25k40
$$ 104 -62 80 126 24 120 -64 9 99 3 0 109 -4 161 -47 -102 75 65 126 21 -36 37 -36 189 -51
4664e1j5J21j51K63l55J09QQ8k15K00QJ90J29l94m4jJ60J45m29L66j58o7j52N6
$$ -51 -66 55 -96 167 -188 -79 -71 17 -198 2 10 200 329 -65 -109 -110 50 195 -234 132 -26 -93 -245 -189
4688a89K56P5j71j7J7m5J60Q7k22J19l26L10k42K17R5K10l39p4R5j78L53j4k58
$$ -189 67 142 -29 -46 -29 -74 86 173 -49 70 -256 54 -188 29 124 334 -5 -79 16 -162 191 177 -81
4711h1M8K98j54P1k77P7J48j55o9K18j74P1j74J55J33k76L17Lj15q7J24oN8l0
$$ -81 -33 265 111 182 -95 -18 130 -25 -94 124 -50 21 -153 2 135 -141 176 179 64 -23 101 95 153 123
4735A23j65J99K6j52L7J21L2k85K86r5j65k54L33j66K31NJ2O8j78l30K46j64J79
$$ 123 -42 157 183 31 68 189 221 -64 222 127 -38 -292 41 -125 106 111 123 191 13 -317 -71 -235 -56
4758e6J24p5j00L13k51M9P6k00K07M1j14J99l50R3L8P6J93L2j74p8j27M4J6J54
$$ -56 68 -7 -107 206 -45 4 80 -120 87 128 14 213 -137 -44 -6 70 263 295 121 43 -84 -40 -24 130
4782A30j47M1Q7J8k00j04j26K17J26j42J56m6j23J21K02l0l16L3J56k71L59N0
$$ 130 -17 24 111 129 -71 -175 -301 -84 42 -100 56 10 -113 8 210 180 -136 -103 53 -218 141 191
4804A91j70l9O5j22K3Kj41K42j41J95j29j80J64Q1n0J00k31j3J73j3l3j16J13
$$ 191 21 -18 47 -75 -52 -50 -191 51 -90 105 -24 -204 -40 41 -9 91 -140 -153 20 7 -26 -142 -29
4827b9j5K53j9l55O8J00L4m9m0J29j34o0J5K2K4J31j45o7K30j66J15R3k18J56
$$ -29 -44 209 190 -165 -97 3 37 -12 -52 77 -57 -117 -102 -80 -56 75 -70 -137 93 -73 42 135 -83 73
4851G3n7k38J78O5j57M5J98R7p1j52k35Q6K62J20j85j40Q1N5k8j37k7K50j19j33
$$ 73 16 -222 -44 21 -136 -91 107 204 133 -19 -254 -168 94 214 29 -111 -30 25 -3 -140 -167 83 -36 -169
4875a69q3R7P8M7P5j74Q3lK37m36J22k2J96p0k19oL55N3l09K38Q1q9k7j74m2n
$$ -169 -252 -155 -77 -30 45 -129 -46 -49 188 -248 -126 -148 48 -22 -241 -247 108 161 -148 90 171 82 55 -119 -161 -166
4901a66j6K10M9k29R6j65M0J47O1Qp0J98r2J11j34m03M40j99l3J22K10q3j63R
$$ -166 -182 28 77 -152 -56 -221 -181 -34 27 35 -35 163 71 182 48 -355 85 -114 -147 -25 185 102 -61 -52
4925e2N1l5P0m4J6N9k73K91q9J32j22k15J55N7J03RN8j01j51q1J06Q5J80k36O0
$$ -52 -1 -36 34 -10 6 65 -208 83 -6 126 4 -211 -56 1 104 113 171 70 -81 -162 -56 29 209 -27 33
4950C3o3n4kRn4K27n9K4j50M6ol4N4L14l86NQ5j24K43k0j95J31q2m1K89j76LL37
$$ 33 -30 -84 -86 -77 -131 96 37 61 -89 -43 -49 -83 -29 285 -101 -96 -11 -135 108 88 -107 24 -58 -99 190 14 17 354
4978C54j75m28L5M06k01R1J68k30J63k96l8L51q3l01M4L99j34j76J08l8Q5j30
$$ 354 179 -249 -214 192 -9 82 250 20 183 -113 -151 200 117 -184 -140 259 125 -51 57 19 104 -26
5000b6K16j94J73k36Q8j3k76M1K19nj98L30j98J59M0k42o9O8L12l31O8j62K07
$$ -26 190 -4 169 -67 21 8 -268 -227 -8 -13 -211 119 -79 80 120 -122 -191 -123 189 -142 -74 -236 -29
5023b9o9P2J62k76J38O4J42l39J03K16l4j02j54K48m4j06m0R6J84l62K84j73q4
$$ -29 -98 -26 136 -140 -2 62 204 -135 -32 184 150 48 -106 142 98 -8 -48 48 232 -130 154 -19 -103
5046a03K59k64Q5Rr4k37L70qJ13j40O6j21J59j12Q0J58k05Lq5K47k21l3O8K2n9
$$ -103 156 -108 -23 -14 -108 -345 25 17 130 -10 56 -65 94 -18 62 220 15 18 -67 180 -41 -74 -6 16 -43
5071d3J23K3J65l91K07k44RK55k5j26N0nj30J55j82R2K70m15J80K40j2j13q5M7
$$ -43 80 103 268 -123 84 -160 -151 104 79 -47 3 -2 -132 23 -159 -67 203 -212 -32 208 196 83 -2 45
5095D5J85l4k09j36L49K8k85M2kn2k2J18q0J55j47j21J96K64l69J7J72J5%k97
$$ 45 230 196 -13 -149 200 228 -57 -15 -17 -69 -91 27 -53 102 -45 -166 30 294 -75 -58 114 129 129 -168
5119a68N7J21O2k00o4J05j20K16j37J74J74m83L19j11M09l89J0k8j45J66pn3Q5
$$ -168 -111 10 72 -128 -192 -87 -207 9 -128 46 220 -263 56 -55 354 -35 -25 -53 -198 -32 -39 -92 -7
5142gj95J99l0K21m6q5j22K02j76L6R3J9J14k95k6O5M8J15k95M49P7o40K72O1
$$ -7 -202 -3 -33 188 142 57 -65 137 -39 -3 90 109 223 -72 -98 -33 15 130 -165 284 361 -279 -7 54
5166E4j21o3L57j88J0r1M6j89K37p5l3O1QJ04p3k0k98K17%J97l20K43k57Q8r6
$$ 54 -67 -130 227 39 49 -42 4 -185 52 -23 -56 5 13 117 44 24 -274 -57 -57 140 -180 63 -194 -106 -202
5191b02K35j58J10J19l21K21m9J53j08L49l44J20J96n46Q7K60J1n5j10K3l1n0
$$ -202 33 -125 -15 104 -217 4 -45 108 0 349 5 125 321 -225 -138 122 133 78 -32 -9 -40 -90
5213i0n4L07r9j61J47j78Q4J26j3J50k43o0K57j23j01k03R9K75k78M8N7J85l4
$$ -90 -144 163 64 -97 50 -128 -44 82 69 219 -24 -84 173 50 -51 -254 -155 120 -158 -110 -53 132 98
5236I8l8j47N0M5k72K47l4K26k24J8o1N8J58j65R7P8n7j38N9N5k71L16j0j94J21
$$ 98 60 -87 -37 8 -264 -17 -51 175 -49 -31 -92 -34 124 -41 56 134 77 -61 -2 53 -218 98 88 -106 15
5261A5O3j82K73j73M0m7r0J3J79m9J43p3j41k1O4r9L02p0l66K03N0m6J24k79J39
$$ 15 78 -104 169 -4 36 -11 -101 -88 91 42 185 112 -29 -50 14 -85 217 147 -219 -16 34 -12 112 -167 -28
5286b8o9p0J51P3p5R3k46L1j79L44p4l7K38j09Ll62K45K10k0l61J49J09Rj13r8
$$ -28 -97 -167 -16 57 -18 75 -171 -140 -319 25 -49 -86 152 43 46 -316 -71 139 119 -242 -93 16 25 -88 -186
5311a86J25L07j19j29L8j6j24M1N2j58L52j07j56J87k68J42o3L5K71l23K68L2
$$ -186 -61 246 127 -2 36 20 -104 -63 -11 -169 183 76 -80 107 -161 -19 -82 -47 224 -99 169 201
5333B01k77j2J55n2L4J6q0J60Rk20n5J76J08k45L5K27j50L2j91K68k90L7J95J09
$$ 201 -76 -88 67 15 49 65 -15 145 154 -66 -121 55 163 -82 -47 180 30 62 -129 139 -151 -114 81 190
5357A90k5j26K71m44J90j39k8oJ3O8Ql13M42Jk71J15O8j03N2K42J7j68N4j68n9
$$ 190 165 39 310 -134 56 -83 -111 -117 -104 -36 -28 -341 101 102 -169 -54 14 -89 -37 205 222 54 108 -60 -119
5382a19J72j44O5J77k32R0m9j26K08J3j82K29j32K75q1l2j65J57j86J78j22Q6
$$ -119 53 -91 -26 151 -81 9 -40 -166 42 55 -127 102 -30 245 164 132 -33 124 -62 116 -6 80
5404H0m4R0j65O5J87m05KK64q9M2j6j63J47j28LR4J05K08j78l21K22O5K5k84K96
$$ 80 36 126 -39 26 213 -192 -190 74 -15 27 11 -152 -5 -133 -130 -36 69 277 99 -222 0 65 90 -194 102
5429A02j11j43j62K37K11k9J2j10J43pl35L12l49K33Q4n4l60N31J1j94NK0J15
$$ 102 -9 -152 -314 -77 134 105 117 7 150 143 -192 120 -229 4 88 34 -326 205 216 22 27 47 162
5452A62Pk42J05k1O5J44l49J08k8P5J60j95j99L02j20J12j88K00j71O7M0l3j5
$$ 162 169 -73 32 11 76 220 -129 -21 -49 26 186 -9 -208 94 -26 86 -102 98 -73 -6 34 1 -14
5475a4J10J2j03j32M1j54L65kr2j30M0j1J60p3k82M38l12J56J90k86K93l74j6
$$ -14 96 108 5 -127 -86 -240 125 123 31 -99 -59 -70 90 17 -265 173 -139 17 207 -79 214 -160 -176
5498a76L31j98j14K46mp5m6K65j82j85M2j45M13m43K43N0J02k31L9P2J06k66K59
$$ -176 155 -43 -157 89 85 10 -36 229 47 -138 -96 -241 172 -271 -28 22 124 -107 -68 4 110 -156 103
5521A03p8j6J07j65j39M0K17R9j56m3Oj05q3K77r1Q6k88L25k95L2K12o6J04J5
$$ 103 25 9 116 -49 -188 -148 69 168 12 -31 -25 -130 -213 64 -27 59 -229 96 -199 -167 45 -21 83 98
5545I8O6k99j00K36j4P5l9m6J51j66j47K18o9J04m5m3m8K24J11k34p5Q5J73l22
$$ 98 164 -135 -235 1 -13 62 23 -23 128 -38 -185 33 -36 68 23 -20 -68 156 267 33 -42 43 216 -106
5569a06l3J01Q1J28j58K2J0Lj88J84m3O5j44p5j02K85J22L0j54k27J0J23L14P3
$$ -106 -139 -38 43 171 13 35 45 48 -140 44 1 66 -78 -153 -255 30 152 182 28 -199 -189 -66 248 321
5593C21m29R3J02j96K13m9P8j38J28l10L68k47M9j27K12j19L7p8R7O8m3Q8k1j90
$$ 321 -108 -15 87 -109 104 55 133 -5 123 -187 181 -66 -17 -144 68 -51 -14 -92 5 73 30 118 97 -93
5617i3L05n9j73J85K4j20l4O0j07K21k98Q8J46n5k65L11l3n3o3o8J13m1k9nk12
$$ -93 212 153 -20 165 189 69 35 95 -12 209 -89 -1 145 90 -175 136 103 50 -13 -81 32 -9 -38 -43 -255
5642b55J52L61k85N3j29J86k44K51j54k4QO2K5L3L2j71J11O5j08j31J31O9m5R9
$$ -255 -103 258 -27 26 -103 83 -161 90 -64 -88 -80 -18 7 40 72 -99 12 77 -31 -162 -31 38 -7 92
5666I2k70j6J31k95O50m61K3L26m18J67J27%P3L6r5J48l28K75l12K65j13j38K22
$$ 92 -178 -194 -63 -358 292 -169 -146 180 -238 -71 56 56 129 165 70 218 -110 165 -147 118 5 -133 89
5689H9n9J68j43k32K56j16r4K02j8q5K58l29l7p8L59m03K41J82m48K87J6j06j36
$$ 89 30 198 55 -177 79 -37 -131 71 53 -32 226 -103 -140 -218 141 -262 -21 161 -287 0 16 -90 -226
5712b26K79J08K3r4j35J86L4n3k97K66q0m0k7N1n3p4J36j4K9N6l3J5k74J09M4
$$ -226 53 161 184 90 -45 141 175 122 -175 91 11 -29 -56 -5 -58 -132 4 -10 19 75 42 57 -217 -108 -64
5737f4K7j7K43l12O7K94k58jJ28o9o9m3m8J40j46J83r1O1l9j97K56r7L70j35o
$$ -64 -37 -54 189 -123 -56 238 -20 -21 107 38 -31 -74 -122 18 -128 55 -36 25 -14 -211 45 -52 318 183 177
5762A77j72q0L50l62J75o9q4R9j34L08k45K60j59M1J3Ok90K00P0l81O73o03K50
$$ 177 5 -75 275 -87 88 19 -65 34 -100 208 -37 223 64 105 118 124 -166 34 104 -277 396 -207 43
5785D3O7j34j19J10j96K79j62R8J08j18J80j98J29k81O3L51k0j00k57r5K87j26
$$ 43 110 -24 -143 -33 -229 50 -112 -14 94 -24 156 -42 87 -194 -131 220 200 100 -157 -252 35 -91
5807i1m8j08K08J41j06j62M1L05l51N0J96j03j1J83k42J41o8q1J15L2k15K82K0
$$ -91 -139 -247 -39 102 -4 -166 -125 180 -171 -121 75 -28 -39 144 -98 43 -25 -106 9 41 -174 108 128
5830A28q%N6P2l40j42L22j88M5n5J94k56L15k67P2M1R4l0J85j62j27L69p03M00
$$ 128 120 120 176 248 -92 -234 88 -100 -55 -110 84 -172 143 -124 -52 -11 83 53 238 76 -51 318 -385 15
5854A5j10o0K61ok69K11q1J91r9J2l73K50J27j15j5jk90K39J96k52K34l29L38
$$ 15 -95 -155 106 100 -169 42 -39 152 53 65 -308 -58 69 -46 -61 -62 -352 -113 83 -169 65 -264 74
5877G4j99L43l17Q8QL1J11n5N1j05j01k5p5R4J86j84j2R0o3J33j49J99j18J11
$$ 74 -125 218 -99 -11 -3 28 139 84 135 30 -71 -96 -171 -77 109 -75 -87 3 -60 73 -76 123 5 116
5901A16k0J2m6r3J08r4J2o8O2q9K36j14O4OL6j24K6k4J53l5l4P0k05LJ64k30J07
$$ 116 96 108 62 -31 77 -17 -5 -73 -11 -100 136 22 86 92 128 4 30 6 159 124 90 160 -45 -42 122 -108 -1
5928aj45J10o5K13m8j25m8K17j00k0Q6m6K1k15K35q5j6p8J00M2j2n7l6K3K20l33
$$ -1 -146 -36 -101 112 64 -61 -109 108 8 -12 74 28 49 -166 69 -16 -32 -110 -10 32 20 -37 -73 -50 170 -163
5954a63J94j04j97J18L40k81J39q7o4K61n9j05J9R1j22P9j63MJ90j69M6j8o3J63
$$ -163 31 -73 -270 -152 188 -93 46 -41 -105 156 97 -8 11 102 -20 59 -104 -100 90 -79 -33 -51 -114 49
5978D9m7Q0n7Kj16P0J70k61J85J76m25J91n9L5J46l25J36J79j13Q3j81K4l4k4
$$ 49 2 82 25 27 -89 -19 151 -110 75 251 -174 17 -42 -7 139 -186 -50 129 16 99 -82 -58 -92 -116
6002a16K37j07K8k25J23J10j59J03P3j32Q1mJ70k15o3J42J26J84k13k15O5k23
$$ -116 121 14 42 -183 -60 50 -109 -6 67 -65 16 12 182 -33 -96 46 172 356 143 -72 -7 -230
6024b30K86J8p1J95k09q5Q9k76N52l66J30j1r8k1K5K15k6j7j86J02j92J5J57Q2
$$ -230 56 74 3 198 -11 -96 -7 -283 269 -97 33 22 -76 -97 -72 143 117 100 -86 16 -176 -161 -4 78
6048G8j80J19l29M48j23k30K80k73K65j93P6NJ45m7j58J02o7K11j21j1j28K38
$$ 78 -102 17 -312 136 13 -217 63 -210 55 -138 -62 -57 88 41 -117 -15 -82 129 8 -3 -131 107
6070A07oj20m8J57n8J32m0P4l46J38n7j9K42k81K89m0n4l4J70k96J47k04jL06
$$ 107 101 -19 -67 90 32 164 124 198 -148 -10 -67 -86 156 -125 164 124 70 36 206 -90 57 -147 -148 158
6094A58k80LK7r6K86j6j45J61J31L0k04k4k09J54jJ07l1J51m42N23k81%Mr5J58
$$ 158 -122 -119 -92 -188 98 82 -63 98 229 259 55 31 -178 -24 -25 82 51 202 -240 283 2 2 6 -89 69
6119F9o4m9J4J99j97n3K69n7m0j56K01k41p4L06p7n7o0M4P6j33k27K75Lj54K74
$$ 69 5 -44 -30 169 -28 -81 188 131 91 -65 136 -105 -179 127 50 -7 -67 -23 53 -80 -307 -32 -29 -183 91
6144I1o2j88J20J07l6k3r3J84k32K03j28m3L02j62j07J85k8j80J28J47j01q9L
$$ 91 29 -159 -39 68 32 9 -84 100 -132 71 -57 -100 202 40 -67 118 90 -90 38 185 84 -5 -2
6167bq9M8J35o3j45L02k04j8j50P3J5J89l8J1k3j36J32O1L1m6J7k02N7J45J53
$$ -2 -91 -43 92 29 -116 186 -18 -36 -186 -113 -98 91 53 64 41 -95 37 98 129 83 100 -102 -45 100 253
6192B53j04k74J93j25J37l2p0J05J93m19K75k34J28L6o8o7J17j4p7J6J53k13n2
$$ 253 149 -125 68 -57 80 48 -22 83 276 -143 132 -102 26 62 -6 -73 44 30 -47 -31 122 -91 -143
6215a43j7J68J97j54J75m26K76J77l60j59L51k43o1K51p3j86M86r9k07J85J7k43
$$ -143 -160 8 205 51 226 -200 76 253 -107 -266 85 -158 -219 32 -41 -227 259 160 -47 138 155 -88
6237h8R3j68P8J81l76RK7K93J8J65l20K29q4m9j71K34r3k7k7kK01k6J22k96J82
$$ -88 5 -163 -85 96 -280 -271 -244 49 67 232 -88 141 57 8 -163 71 -22 -49 -76 -78 123 97 219 -77 105
6262A05l01L14l01K44l9M7M4q4K0k31J53N8n4P6J29j98n3K02l4j48o3J95j45K80
$$ 105 -196 118 -183 61 22 69 113 29 49 -182 -29 29 -25 51 180 -18 -71 131 97 -51 -114 81 -64 216
6286B16n23J81J15N6R0j39O1j4n9k0N3J1k74L39j03N5P4o4K6k35N3J18J91j39
$$ 216 -307 -126 -11 45 135 -4 57 43 -16 -36 17 28 -246 93 -10 45 119 55 81 -154 -101 17 208 69
6310F9k07k7J57j99K50p2%K58l96L59j16q2M06n67J8J24j52J64J37l21N70k18
$$ 69 -138 -165 -8 -207 43 -29 -29 229 -167 192 76 -6 400 -167 -149 -25 -177 -13 124 -197 373 155
6332A55p1J35j49j14J34j28m3J94m42K28P5j43L16l55J91J16n6K9k04k77L51J94
$$ 155 84 219 70 -44 90 -38 -81 113 -329 -101 -26 -169 147 -208 -17 99 43 72 -132 -409 -58 136
6354A36j96R3q3r3P4RJ86k48p5J85l7K80k72R6j28rK42j42n6J74Pk35Q7j72N43
$$ 136 -60 33 -50 -143 -69 -60 126 -122 -197 -12 -49 231 -41 55 -73 -82 160 18 -38 136 143 -92 -5 -177 366
6379C66l32K0k3n8p9j33M4J96J4j11K77l13k43M64l59L66O6j63j7%J21k36Q5p3
$$ 366 34 54 31 -27 -106 -239 -195 1 15 -96 181 -132 -375 89 -270 96 162 -1 -18 -18 103 -133 -48 -121
6403a21K76j10r5Q8M5J0j37K20j47J08r5N4r8j00J63K1j30J53n5j69J72K05l60
$$ -121 155 45 -50 38 83 93 -44 176 29 137 42 96 -2 -102 61 82 -48 105 50 -119 53 258 -102
6426a02L40l61K83Q5p6K6k42k8j3K27j53j12L06j09j66O6J26j37pN1K12k13J64
$$ -102 238 -123 160 245 169 195 -47 -75 -88 139 -14 -126 180 71 -95 -29 97 -40 -47 4 216 3 167
6449A67k93K02j90K52l07P9J28R9j42J44l48K73J8k88j56K99J18j71j1K83k6q
$$ 167 -126 76 -114 138 -169 -90 38 137 -5 139 -209 64 82 -206 -362 -63 55 -116 -127 156 130 122
6471A22j02N6L79n09J59n29N53j05n7j02Q9j46K33J43k99N8K16j68j0MK23j08
$$ 122 20 76 455 -54 105 -424 129 24 -33 -135 -46 -192 41 184 -115 -57 159 -9 -19 -15 208 100
6493A00r7P0rj86l9K82k59J99j6j3j66L08k32j9J68n1j26J68j6k16Q7J03Q6j97
$$ 100 3 73 64 -122 -161 121 -138 61 45 32 -134 174 -58 -77 91 40 -86 82 66 -150 -63 40 126 -71
6517g1J46P3j87J62k70L70j72j53J56J17j38J26k63KK80l38M4K19k08K0L09l78
$$ -71 75 148 -39 123 -147 223 51 -102 54 171 33 159 -104 -102 178 -160 -116 103 -105 -85 224 -154
6539a54r0K81k64J72j9J09l8J53j13j48N4K9J66rm0J26l14L12k17p5L22o4j76
$$ -154 -244 37 -227 -55 -74 35 -3 150 37 -111 -57 -28 138 129 89 215 -99 213 -4 -79 243 179 3
6562Cj0o7J18n1p2J41KM3k76p7K42j25l3K5R9p8J45k17J93p4j40K12n6l0roK65
$$ 3 -7 -74 44 -7 -79 62 64 107 -169 -246 -4 -129 -162 -137 -38 -116 29 -188 5 -69 -209 3 -53 -83 -92 -98 167
6589A67l80K22K23k16n1l3m7M4N3j57J32n7J69j74M3J28j78n3OJ57n0J41J31j30
$$ 167 -213 9 232 16 -35 -68 -115 -71 -18 -175 -43 -100 69 -105 -62 66 -112 -165 -159 -2 -52 89 220 90
6613I0p0j71J76j61J73j52mK84j02rj97K64l15r4K15K40k07r5L33j75J59j39J81
$$ 90 20 -151 25 -136 37 -115 -119 165 63 54 -143 121 -194 -288 -73 167 -40 -135 198 23 182 43 224
6636B24j86p5J92j54O5n4nK7k63J16K22j49j66N0K69Kq5k0k65L75J8P7m15K16
$$ 224 38 -37 155 1 66 12 7 34 -229 -113 109 -40 -206 -156 113 115 30 10 -255 120 138 215 -200 16
6660A6M1n2j78J68R3J53r5j7m1r3M0j57K85o9j32O8j61J42J10k75J74J6q1j09
$$ 16 57 5 -173 -5 88 241 146 129 88 -5 35 -122 163 94 -38 30 -131 11 121 -154 20 36 -45 -154
6684a54J51l15L38j50N4J89L5r3q6J54O8j20j15j7k01K91J66l11j4J79k03K21
$$ -154 -3 -318 20 -130 -76 113 148 55 -31 123 191 71 -44 -61 -262 29 195 -116 -130 49 -154 67
6706F7j30L15l69j40M37k84NJ36k9J02K2k00n7j9K50j32k23K93m7r1R0j21K38
$$ 67 -63 252 -117 -257 180 -104 -99 37 8 110 132 -68 -125 -144 106 -26 -249 44 -3 -94 -4 -125 113
6729A13j65n3J65k1j07L50k72M5R9k23K9Q8n5l7J68ok32m1J61n9M4J16k62K10
$$ 113 -52 -105 60 39 -68 282 10 55 154 -69 -40 48 -7 -44 124 118 -114 -155 6 -53 -9 107 -155 55
6753E5K38k85OR0J3Lj35J97k73L4O9l31L57k21K20j25J02L1r2K24j50j4K5j09
$$ 55 293 8 14 104 117 120 -15 182 -91 -57 12 -319 38 -183 37 -88 14 45 -47 177 27 13 38 -71
6777g1p3J22J45M5l62K7O4p9K55j36L32k49j37K34j98J88k3j30N3r5J74m8r2J30
$$ -71 -144 -22 123 168 -194 -167 -103 -182 73 -63 269 20 -117 117 -81 107 84 -46 7 -88 86 38 -54 76
6801G6j72O9OK02j00P2k26Q4j84L12j49Q7m2k4J08l5j11Mj24P0J34j17K72k4j93
$$ 76 -96 -27 -21 181 81 153 -73 11 -173 139 -10 77 35 11 119 84 -27 -23 -147 -77 57 -60 212 188 -5
6826eP7j33L49k54k7K51k28OK6k48L59q4J10k87J50j59p3J93Q0N8j79J54l48J64
$$ -5 72 -61 288 34 7 258 30 36 62 -186 173 89 199 -88 62 -97 -170 23 103 161 -18 136 -212 -48
6850d8j52L46Kk36Q8k06J15J16l30L52R7j52N1p9l3L8k97L90n2J35j88J40j62
$$ -48 -200 146 148 -88 0 -206 -91 25 -305 47 144 -8 43 -36 -69 -31 -328 62 10 145 -43 97 -65
6873f5k6P8K01n2j9m0j72L17k15o8J12N3p2m9J4k9K5j11J76k77J70p2J28j21N1
$$ -65 -91 -13 188 136 117 77 -95 222 7 -61 51 104 32 -17 -3 -32 -7 -118 58 -219 -49 -121 7 -114 -63
6898f3J31J57k10n8J92j26k66J80K8M6L79k82j48n8J29j48K8k5J60j91J04J40
$$ -63 68 225 15 -43 149 23 -243 -63 -35 11 390 108 -40 -98 31 -117 -89 -114 46 -145 -41 99
6920I9l46Q9L87q6k19J82J01m00K35P5k25K34k65J23R5k27J58M5o6l4q5kM6jO1
$$ 99 -247 -158 229 143 -76 106 207 -193 42 117 -108 126 -139 -16 79 -148 10 55 -11 -45 -130 -132 -86 -87 -26
6945b6j05J83k97K46k19J38J15J93k93j36J30L33j00j85R6j56J76j77J94J3k10
$$ -26 -131 52 -245 1 -218 -80 35 228 -65 -201 -71 262 162 -23 73 -83 93 -84 110 123 -87
6966h7JK03q6J21k12l7j64L13J15j54m4L3l9J94k71Q0O4J41j94j6k18P6J53J06
$$ -87 -86 117 31 152 -60 -97 -261 52 167 13 -31 2 -37 157 -114 -34 30 171 -23 -39 -257 -181 -28 78
6990G8j4j59L8kM0R2r6l8K97k17j28J64j16J6Q8r9l9P8J6j22K2J7M2R0j0L2j49
$$ 78 64 -95 -57 -59 -19 73 -23 -61 236 19 -109 55 -61 -45 43 -56 -95 -17 -1 -123 -101 -84 -42 48 38 70 -79
7017g9K43l10J32n7j7LQ3k9O9o6J03R0j53K04j72p6j78K71k4j21R5j45K61J60
$$ -79 164 -146 -14 -71 -88 -85 -2 -31 38 -28 75 165 12 216 44 -32 -210 61 37 -84 11 -134 127 287
7041B87k20j58L62j83n7J27k29J21L6k61L69o6k40K38j85J57M0k19M00k17l8j24
$$ 287 67 -91 271 88 31 158 -71 50 86 -175 194 128 -112 126 -59 98 138 -81 319 102 64 -60
7063f0J21J02J03l98K67k86J23Pq2J78J15j68K27m25J61J43k20K82k74J65R5j21
$$ -60 61 163 266 -132 135 -151 -28 -21 -103 75 190 22 249 -176 -15 128 -92 190 -84 81 176 55
7085E5j90P1o1J53J28j98l1K1k2J84Oj0n2p2K10l02J01p7L25l17l9L08k39r7K05
$$ 55 -135 -64 -125 28 156 -42 -73 -52 -74 110 116 106 54 -18 192 -110 -9 -86 239 -78 -117 191 -48 -145 60
7110F0k26L15k39QJ40j48K15J6P2l47K23m01K68P0j58L87k67J21l01L20k66j18
$$ 60 -166 149 -90 -82 58 -90 125 141 213 -134 89 -312 -44 26 -132 255 -12 109 -192 128 -138 -256
7132b56K4J90J50L8j87j42K59j07J11l0J51k7j94J27k02r8L41J30j21J36k30k31
$$ -256 -232 -42 108 146 -41 -183 76 -31 80 50 201 174 -20 107 -95 -193 148 278 157 293 63 -168
7154a68J91M0q3O4n2j24k1J96k80L00q4R7L30n76P1J36J02l63M74k78P0ML1j11
$$ -168 23 63 -20 44 -8 -132 -153 43 -237 63 -21 76 406 -170 -99 37 139 -224 250 -28 42 46 77 -34
7178c4J06p9p2J41Lj86L5l5Q8J70M2l14R9P1j38J96k86J59M4o5L09k14L56j23
$$ -34 72 -7 -79 62 65 -121 -86 -121 -33 137 179 -135 -36 35 -103 93 -193 -34 10 -55 254 40 396 273
7202B73k54l9m8J21l4K0j68P7N3k8K78j80j67Q5M4J9K1JK41l48m7p9R8M5j91K11
$$ 273 19 -20 -68 53 19 39 -129 -52 1 -27 251 71 -96 -11 33 52 73 74 315 -33 -80 -159 -61 -16 -207 4
7228Do6o1o9M20n07J72N6R6k43R5K18k94K73J04j69M0j64J74k63J38L7Q6j80J12
$$ 4 -62 -123 -192 228 -279 -107 -51 45 -198 -103 115 -179 94 198 29 69 -95 79 -184 -46 -9 77 -103 9
7252Ij7P6j17J36m3j50nL8J91j49q9j31K05O6l18M22j96q3L23k57K07j67J67l35
$$ 9 -8 68 -49 87 44 -106 -111 -73 118 -31 -120 -251 -46 20 -298 124 -72 -155 168 -89 118 -49 118 -217
7276b17K53k56K50j79R7J57j92K81j98J86k65J2L11k0m21L72j6j20m3J04j96O8
$$ -217 36 -220 30 -149 -52 105 -87 194 -4 182 -83 -71 240 220 -201 171 155 35 -8 96 -100 -32
7298c2J64k12M4L01k44Pl9m4J56k33K30q0Nn0k2K16k23K10J37l70j75J82K75k56
$$ -32 132 -80 -36 265 21 28 -11 -55 101 -132 98 18 23 -27 -49 167 -56 154 291 -79 -254 -72 203 -53
7322e3K8J14M9k10k8J38j63J5K85Rk16j1j09L53k02P0j15K61j78P0K9q2j48L09
$$ -53 -25 89 138 -72 -100 38 -125 -110 175 184 -32 -43 -152 201 -1 69 -46 215 37 107 136 54 -94 215
7346B15l66J5M25j73j33J19m02J3J75j57N5N0K34j95O2L0m6K21j68j95J64l4J39
$$ 215 -151 -136 289 116 -17 102 -300 -287 -112 -269 -214 -164 70 -125 -63 -33 -79 142 -26 -221 -57 -91 48
7369D8J44j81j11O3kk51K44J50j04j3J10N2k48k2J95Rn5n4J58k78m8K61m7j29
$$ 48 192 11 -100 -37 -39 -290 -46 104 0 -13 97 149 -99 -121 74 83 28 -26 132 -146 -194 67 20 -109
7393a09R7l42L34q4J65j75K69k16J23K4J20l14J83J8p3k9l6j44K51R3j49j02J47
$$ -109 -12 -354 -20 -104 61 -114 155 -61 62 86 206 -108 75 93 20 -9 -45 -189 62 155 6 -96 51
7416E1l52J69L11j84j5R3L3K09j90k18j08J25K09l67J76J4j60R8q1J89n4N8n2
$$ 51 -301 -132 179 -5 -20 73 106 315 125 -93 -201 -76 133 -234 -58 -44 -204 -106 -187 2 -52 6 -46
7439d6K78l49OJ92l1k31J61J1L7P6j32M9j9k67J61J13M5m6Pm9k31N14o2l07k04
$$ -46 232 -117 -111 81 50 -181 -20 -9 28 104 -28 21 2 -265 -104 9 54 8 15 -34 -265 249 187 -120 -324
7464c24L38j49J23K32l05J24J47k22N2j2K45l83m0K16kO2o7j61q8L73j77K46m31
$$ -324 14 -135 -12 220 -85 39 186 -36 16 4 249 -134 -174 42 40 102 35 -126 -214 159 -18 228 -203
7487b03K44l02K40J52l08P1K54r0j89k6Qk7J33N8Rk20L82j40j82M76k37j28J43
$$ -203 41 -261 -21 131 -177 -106 148 58 -131 -157 -149 -176 -43 15 24 -196 186 46 -136 340 103 -25 118
7510A18m3n0m1j51J42Q4k22P8N6K8R0k29K14N0o2n9K79k35l3l6J59k28J65n0K08
$$ 118 75 25 -16 -167 -25 59 -163 -85 -29 -1 89 -140 74 124 62 3 282 47 14 -22 137 -91 74 24 232
7535B32j97j20J69j2j65j06J13N8k61L33j0m1J88l7k95J86J43k64j61J30J51M4
$$ 232 35 -85 84 72 -93 -199 -86 -28 -289 44 34 -7 181 144 -151 35 178 -86 -247 -117 34 78
7557G8K8k77L62R1p7k05L11o90M43j30j19J47J94k12K41m93K88m0J74J26j37j09
$$ 78 106 -171 191 282 205 0 311 -379 64 -66 -185 -38 156 -56 185 -308 -20 -60 114 240 103 -6
7579fj0O0m2k4p0Q4j3m6j00J83j84R4N7q3j5L1k0J19O8j29J2o6K9J63j13j55L96
$$ -6 -16 44 2 -22 -92 -8 -21 -67 -167 16 -168 -74 -17 -100 -115 -84 -104 15 83 -46 -34 -100 -71 92 -21 -176 220
7606B20l40K40j24J0K5n0o5J54j01j48J38J36j29N8O1j27J73j93J24j4K30l71
$$ 220 -120 120 -4 6 31 -19 -84 70 -31 -179 -41 95 -34 24 85 -42 131 -62 62 48 278 -93
7628i3L53k31j8q1M2j32K77r5M7k02K54m5J57n8l3L9k80K26l36K31J06m20M36
$$ -93 260 29 11 -70 -28 -160 117 22 69 -133 121 76 233 175 142 181 -99 127 -209 22 128 -292 144
7651A44Jk4l4r3Jj76L24O7l16j12L85j52p9J93r3M8L4Q0k88o6j5J12m7L14j54
$$ 144 145 121 87 -6 -5 -181 143 210 -106 -218 167 15 -64 129 36 84 118 198 -90 -156 -171 -59 -106 208 54
7676E4KM5j47n2j30K79K06k99K12n15N25k13P0j47K40j02m4N2J38l90J01J44k1
$$ 54 56 101 -46 -98 -228 51 257 -42 170 -345 180 -33 37 -110 130 28 -16 36 174 -216 -115 29 8
7699HJ96k60K55l96K17PN2p6j17K09l0k81j0L40M6j96J42q5K5N0J3o5r4k12L76
$$ 8 204 -56 199 -197 20 27 79 3 -114 95 65 -216 -226 114 160 -36 106 21 46 96 109 44 -50 -262 114
7724A14p5j56j9J23J0j52K51p6k06L37m15N01k34L9k64L13j07J6M9l8j08K14j32
$$ 114 39 -117 -136 -13 -3 -155 96 20 -186 151 -264 237 3 42 -222 91 -16 0 49 11 -97 117 -15
7747a5kN9m8J76k86Q3O6j49J83P5j24j0J7Q0J69r0m1k00k3J56N5k56K54J60l31
$$ -15 -17 42 -6 170 -116 -33 33 -116 67 142 18 8 25 105 274 184 143 -57 -80 76 131 -125 129 289 -42
7772d2r2K15N2j66N0K2j53J05R2j49M8j6n9J26n3k2r8J06o0J08N0l91J52J8L14
$$ -42 -134 81 133 -33 17 39 -114 -9 83 -66 -18 -34 -93 33 -20 -42 -140 -34 -94 14 64 -327 -175 -157 157
7797A57J01j25j30J50o3J55o8j49k1R3n18O49p7k04J30k07J47MMJ10l15K70l07
$$ 157 258 133 3 153 90 245 177 28 7 100 -418 231 154 -50 80 -127 20 24 28 138 -177 93 -214
7820b14J74K87k15J22Q0m85L80J9L2j29M6k3l6lpj03J13j3J05j15J6j34N6R1k41
$$ -214 -40 247 32 154 234 -251 129 148 180 51 97 74 38 35 28 -75 38 25 130 15 31 -103 -47 44 -197
7845a97J95K52j07j29J16q5k0k18J67o5P8k0J89k63J07j02K18j85l17L76jJ4m0
$$ -197 -2 250 143 14 130 45 25 -193 -26 -91 -13 -33 156 -107 0 -102 116 -69 -386 -10 -11 3 -37
7868c7m5K78q4P3k65k74M01k2p6O3J2j48P3l73O27j30O9k92L23j14k62J48q6K17
$$ -37 -82 196 112 185 -80 -354 47 25 -51 12 24 -124 -51 -424 203 73 142 -150 173 59 -203 -55 -141 76
7892G6k27J92K4KM0o9J24nq7j81J79j21M0J52j53M2o9K43j02l6O7J45k88k85L36
$$ 76 -151 41 65 67 107 38 162 157 70 -111 68 -53 -13 139 -14 28 -41 202 100 64 131 276 -12 -297 39
7917C9j15K7Lp0J09N5j35O5J71O0k34J33m7J26k63j15L06k54J12J7M9k6m7P9l4
$$ 39 -76 -49 -46 -116 -7 48 -87 -22 149 209 -25 108 61 187 -76 -191 115 -139 -27 -10 39 13 -34 45 11
7942A1R6j33J4J56J3o5N3m4j99J80L2o0j04J93M2k97J47J49n3J59k80q5J27L9
$$ 11 107 -26 -12 144 157 92 145 101 -98 82 114 54 -50 143 185 -112 35 184 131 290 10 -75 52 91
7966I1O2k65Q0J47l09K4L67k60JQ6M4j17J10j38rr4K3PL21j93J31p8J45m3L5l93
$$ 91 153 -112 -32 115 -194 -170 197 -63 -62 24 68 -49 61 -77 -86 -180 -157 -150 171 -22 109 31 176 133 168 -225
7992b25J47K82j36L1o2p1l3O2L9O7j18L8Q1o3L4l8l6lJ68j18k4j39J07J30k67
$$ -225 -78 204 68 99 37 -34 -67 -5 34 101 -17 21 102 39 73 35 -1 -4 164 46 22 -117 -10 120 -147
8017a47n6L06k41J93j82M7j04r8L53P2l16R8J77j55K62l17J01LJ6j17K36j49K84
$$ -147 -203 103 -138 55 -127 -80 -184 -282 71 143 -173 -75 102 -53 209 -108 -7 -4 12 -105 131 -18 266
8040B66l40k29K19J43k85K33N3J21l99J96K7j15K47j98R2K75l58O9r9MJ53%m2
$$ 266 -74 -303 -84 59 -226 7 60 181 -218 -22 5 -110 137 -61 31 306 -52 17 -82 -78 75 75 33
8063C3k84K33J75k65j1J23j48J30J84k42K36j87J7R6j01q8Q3L3ojj82Q4J83j19
$$ 33 -251 -18 157 -108 -119 4 -144 -14 170 -72 164 -23 -6 90 -11 -99 -16 17 11 10 -172 -88 95 -24
8087b4mL47l11q8J03L1j97L98l29K03j71Q0r2J19L4l6k42K98k15J96j7L0p1k1
$$ -24 -28 319 8 -80 23 54 -143 255 -74 129 -42 38 -54 65 99 63 -179 119 -96 100 83 113 42 21
8111B1J92m53K13o0k05J96Q6j38J36j97j68L75j46J51k06O1JL16k42j04R6K40
$$ 21 213 -240 -27 -87 -292 -96 -10 -148 -12 -209 -377 -2 -148 3 -203 -142 -141 175 -67 -171 -75 165
8133A65l74K02k6J8J04K8J0k51K57j47j07J66L5r4j46K36J06M4j17k34K5J97k91
$$ 165 -209 -7 -33 -15 89 117 127 -124 133 -14 -121 45 80 -14 -160 76 182 226 109 -125 -100 97 -194
8156a94K80j62Qm3K30j67J28j50K78j6k53p6J60q6K31m19K09J92j43N3j5j2m7
$$ -194 86 -76 -68 -111 119 -48 80 -70 208 192 -61 -137 23 -63 168 -251 -42 150 7 60 45 33 -14
8179a4K23k87J11J76j78k7jJ33j31J43%K7
$$ -14 209 -78 33 209 31 4 3 136 5 148 148 175
8191A75
$$ Imaginary data points
##PAGE= N=2
##DATA TABLE= (X++(I..I)), XYDATA
0@%%%%%%%%%%%%%qJ6j6J6j6K4l2L2m0M8n6O8p6Q8j04J20j35J55j78K02k29K58
$$ 0 0 0 0 0 0 0 0 0 0 0 0 0 0 -8 8 -8 8 -8 16 -16 16 -24 24 -32 36 -40 48 -56 64 -71 84 -94 108 -121 137
35A37k91L28l67M08m55N06n63O24o88P61q42R30j025J128j243J370j510J665j838
$$ 137 -154 174 -193 215 -240 266 -297 327 -361 400 -442 488 -537 591 -652 718 -792 873 -965
54i65K033k252K501k787L122l517L993m583N329o309P658r641J2836j8818L3683
$$ -965 1068 -1184 1317 -1470 1652 -1865 2128 -2455 2874 -3435 4223 -5418 7418 -11400 22283
69B2283j35806k17602L35905J61409j59115l488K01270o963j34897n139J05153
$$ 22283 -113523 -331125 4780 166189 7074 3586 204856 197893 62996 57857 163010
80A63010K5291j00617j31792N051O9878m7239p5770O5689L4255q8252n766O7032
$$ 163010 188301 87684 -44108 -39057 30821 -16418 -92188 -26499 7756 -80496 -86262 -19230
92a9230r1002j12894R7923J29232m0639m3823N8006M7543K8045N6465P591l8767
$$ -19230 -110232 -223126 -125203 4029 -36610 -80433 -22427 25116 53161 109626 117217 78450
104G8450r548j7527l1454L6265L5468m9724j7247N2667k8423q8315l200K1687
$$ 78450 68902 51375 19921 56186 91654 41930 24683 77350 48927 -39388 -42588 -20901
116b0901m4290k6398Q174k3864K990N8484J7700o679M3908K2065l2513K627K7428
$$ -20901 -65191 -91589 -83415 -107279 -104289 -45805 -28105 -34784 9124 31189 -1324 1303 28731
129B8731j3077O915M5722m992k7590L3383K7049l9673k6991Q31l6144l8458Q978
$$ 28731 15654 22569 68291 63299 35709 69092 96141 56468 29477 30308 -5836 -44294 -35316
142c5316l33l0092L353L1706N644r252l27k336O918J6145n595n485K7172K1769
$$ -35316 -35649 -65741 -62388 -30682 -25038 -34290 -34617 -36953 -30035 -13890 -19485 -24970 2202 23971
156B3971N40K5550K6952k1132j7701K2782q889n2334j3346K1163j1740k2025J0468
$$ 23971 24511 50061 77013 55881 38180 60962 52073 -261 -13607 7556 -4184 -26209 -15741
169a5741J0753j1719j0295j565m494p939p739M493J9415J0563j647K1285L5992
$$ -15741 -4988 -16707 -27002 -28567 -33061 -41000 -48739 -44246 -24831 -14268 -15915 5370 41362
182D1362P22j9766J0443J5790j9948k0924J0156O337j5283l614J2297k627j8565
$$ 41362 42084 22318 32761 48551 28603 7679 17835 24172 8889 5275 17572 14945 -3620
195c620q745Q11p503k0228j3987Q871J6184K201K087K1398J7702m332k382J0035
$$ -3620 -12365 -11554 -19057 -39285 -53272 -44401 -28217 -26016 -23929 -2531 15171 10839 8457 18492
209A8492L79j0365L448J2578J044o587L942R351k531j4528j0907n306j0423j6421
$$ 18492 18871 8506 11954 24532 25576 18989 22931 32282 29751 15223 4316 -990 -11413 -27834
223b7834o939M127J989Q4P683J0301J401j754N738M774m522k796R338J2624L969
$$ -27834 -34773 -30646 -28657 -28573 -20890 -10589 -9188 -10942 -5204 -430 -4952 -7748 1590 14214 18183
238A8183L513J0040O105o307p299l811r790j4135o016J687m356p551J654P311
$$ 18183 21696 31736 37841 31534 24235 20424 10634 -3501 -9517 -7830 -12186 -19737 -18083 -10772
252a0772j579p064l0L368l429m723M618J0505N270N012J3704J2445o36m535M142
$$ -10772 -12351 -19415 -19445 -16077 -19506 -24229 -19611 -9106 -3836 1176 14880 27325 26689 22154 26296
267B6296N93j2223r952L851K518p763l307N510m78j0863p216K51m845j0550k308
$$ 26296 26889 14666 4714 8565 11083 3320 13 5523 5045 -5818 -13034 -12783 -17628 -28178 -30486
282c0486R026N017k411O336J6249O743m786K084R201k021r475J895R109q20n863
$$ -30486 -21460 -16443 -18854 -12518 3731 10474 5688 7772 16973 14952 5477 7372 16481 15661 9798
297I798N326P592n992j2307k600q18j0982j2737J084O878k020l530P721J0123
$$ 9798 15124 22716 16724 4417 1817 999 -9983 -22720 -21636 -14758 -16778 -20308 -12587 -2464
311b464k467m600N643N189n161k310R006P551j495M48R746M728o454n931O79l499
$$ -2464 -4931 -9531 -3888 1301 -3860 -6170 2836 10387 8892 9340 19086 23814 17360 11429 12108 8609
327H609j0761o635K329J205m559J47O666L14o663j229L165k555n187L195Q389
$$ 8609 -2152 -8787 -6458 -5253 -9812 -9665 -2999 -2685 -9348 -10577 -7412 -9967 -15154 -11959 -3570
342c570K902J396O529O857l50k930J512m61o181n225J716K193l735k703M627J714
$$ -3570 -668 728 7257 14114 13764 10834 12346 11885 5704 479 2195 4388 653 -2050 2577 4291
358D291o335l778J992k764q110j369O448K166m10N921Q470J210l484J383K777
$$ 4291 -2044 -5822 -3830 -6594 -14704 -16073 -9625 -7459 -7869 -1948 6522 7732 4248 5631 8408
373H408l245n563J770N616r83l999L194N103m647p347J038R77q713o451N241L828
$$ 8408 5163 -400 1370 6986 6003 2004 5198 10301 5654 -1693 -655 322 -8391 -14842 -9601 -5773
389e773l863k2Q848N237l544k261M553J620n561l002O357N001l568l45Q532K346
$$ -5773 -9636 -9658 -810 4427 883 -1378 3175 4795 -766 -3768 2589 7590 4022 3677 12209 14555
405A4555r878m419M403l772j0578o67O855j209m752K594O833m43n291O15M805
$$ 14555 4677 258 4661 889 -9689 -10356 -3501 -4710 -9462 -6868 -35 -478 -5769 -5154 -349
420c49l76o162J061Q722K308l732N005Q965k993q065J638L030p719o730L069L181
$$ -349 -725 -6887 -5826 2896 5204 1472 6477 15442 12449 4384 6022 9052 1333 -5397 -2328 853
436H53l800j748M115J461m560m603Q08K108l161l295N614O667j997k75Q349M152
$$ 853 -2947 -4695 -580 881 -3679 -8282 -7474 -5366 -8527 -11822 -6208 459 -1538 -1813 6536 10688
452A0688n667m37N453k608p013Q29M589j019k808J486K249k222n319k414P9l298
$$ 10688 5021 4584 10037 7429 416 1245 5834 4815 2007 3493 5742 3520 -1799 -4213 -4134 -7432
468g432n626R75N766J106j977N100O009l051l677M605L444n106j300O611K149
$$ -7432 -13058 -12083 -6317 -5211 -7188 -2088 3921 870 -2807 1798 5242 136 -1164 5447 7596
483G596l150J234M375L13m469l248m61j782o059l475L805K742m453r1O850L71
$$ 7596 4446 5680 10055 10368 5899 2651 2190 408 -5651 -9126 -5321 -2579 -7032 -7123 -273 98
499I8o188M74M928l287m362M288O956O02q44L864M124k071m293L32K479l732o194
$$ 98 -6090 -5616 -688 -3975 -8337 -4049 2907 3509 2665 6529 10653 8582 4289 4621 7100 3368 -2826
516b826J491M229l375l559M315L359n360n240K849Q14m931k042N391L619j452
$$ -2826 -1335 2894 -481 -4040 275 3634 -1726 -6966 -4117 -3303 -8234 -10276 -4885 -1266 -2718
531b718J015O115K765l723k346K840N72m645j296N786K092m776j4M860k048o191
$$ -2718 -1703 4412 7177 3454 1108 3948 4520 -125 -1421 4365 6457 1681 1667 6527 4479 -1712
547a712o54K207k840m954M55M557N30j860K402N228p34n203J002M027k612l371
$$ -1712 -2366 -159 -2999 -7953 -7498 -2941 -2411 -4271 -1869 3359 2625 -2578 -1576 2451 -161 -3532
563c532L590M274j501r71L648J621l225m149l54K64k819k222K900L150k131j746
$$ -3532 58 4332 2831 1860 5508 7129 3904 -245 -599 -335 -3154 -5376 -2476 674 -1457 -3203
579c203L469J889l744j233K621n99l363Q14M497J141q96K164K355j255k884j030
$$ -3203 266 2155 -1589 -2822 -201 -800 -4163 -3349 1148 2289 1393 3557 5912 4657 1773 743
595G43J42j718k390N0L024O16k316J682L433l017m367J878J068l421r8M699J501
$$ 743 885 -833 -3223 -3173 -149 467 -1849 -167 3266 249 -4118 -2240 -1172 -4593 -4691 8 1509
612A509j285J124K450Q13j080j595m8O8k828k255L125K928l057j199L917m78n359
$$ 1509 224 1348 3798 4611 3531 1936 1888 1956 -872 -3127 -2 2926 -131 -1330 2587 2109 -3250
629c250o35K751k383l266K766L749k78p6J930K550q16k196l38J932n04k756J177
$$ -3250 -3885 -1134 -3517 -6783 -4017 -268 -546 -622 1308 3858 3042 846 508 2440 1936 -820 357
646C57M137q76l620K464K418l807m057K010N4m394q41L225J384q95P19K030P63
$$ 357 4494 3618 -2 2462 4880 1073 -2984 -974 -920 -5314 -6155 -2930 -1546 -2441 -1722 308 1071
663A071j487j923J310K139j426j142L690K988k440k11L405j102m516j91J374k062
$$ 1071 -416 -2339 -1029 1110 -316 -1458 2232 5220 2780 2569 5974 4872 356 165 1539 -523
679e23k078M39J025o70k37K59J072m41k028q63J910J16j633J701L403M16o52K859
$$ -523 -2601 -2162 -1137 -1807 -2044 -1785 -713 -1154 -3182 -4045 -2135 -2019 -3652 -1951 1452 1868 1216 4075
697D075J282k850j333J196k10j899K31J194J8q30K0l12p29j820j371M21J94j466
$$ 4075 5357 2507 1174 2370 2160 261 492 1686 1704 874 894 582 -147 -1967 -3338 -2917 -2723 -4189
715d189j95K825P92q71J655K254j300j526J356J053j607n09K083J398n97k17N91
$$ -4189 -4384 -1559 -767 -1638 17 2271 971 -555 801 1854 247 -262 1821 3219 2622 2405 2996
732B996K73k501j817K22J66k130n94K018J295j983k89K366m0k221K44J901k96
$$ 2996 3269 768 -1049 -827 -661 -2791 -3385 -1367 -72 -2055 -2344 22 -18 -2239 -1995 -94 -390
749c90j378J057K378K51n39M51J624p32k254l02J099j178j815O22K326o23j718
$$ -390 -1768 -711 1667 1918 1379 1830 3454 2722 468 166 1265 87 -1728 -1106 1220 597 -1121
766a121Q20J131j928j682R25J121j008k89J668J662r22p09J544R07j222j278Q99
$$ -1121 -301 830 -1098 -2780 -1855 -734 -1742 -2031 -363 1299 377 -332 1212 2119 897 -381 518
783E18P24j811k15J748N88j583K94J139l54j930n66P83l32r03L50K015J39r12
$$ 518 1242 -569 -784 964 1552 -31 263 1402 1048 -882 -1448 -665 -997 -1900 -1550 465 604 -308
801c08N84J124n77j568M18J081n55q49R54J318q90q93P49L70j415p75L69L93j046
$$ -308 276 1400 823 -745 -327 754 199 -650 304 1622 732 -161 588 958 -457 -1232 -863 -470 -1516
820a516j04J353O90q81j55J692j3j477p8J173j57j218R64J574k42j169J53P75
$$ -1516 -1620 -267 423 -458 -613 1079 1066 -411 -489 684 527 -691 273 1847 1605 436 589 1364
838A364p52j622K57P78o73j388Q14J466j009n66J066J070j070j173J279J023j547
$$ 1364 612 -1010 -753 25 -648 -2036 -1222 244 -765 -1331 -265 805 -265 -1438 -159 864 -683
855f83j52J506J279j198m00J478P08k190r43J180L50j563o71J889j18j470o07
$$ -683 -835 671 1950 752 352 1830 2538 348 -595 585 935 -628 -1299 590 472 -998 -1605
872a605J538m1j794l24J911J91j774O36J912J72j177R62J439l81j624K28J450
$$ -1605 -67 -108 -1902 -2226 -315 -124 -1898 -1262 650 822 -355 607 2046 1665 41 269 1719
889A719n46j549N88J699r19j600Q21Q62j638j904J263P88j100o38J273J008p18
$$ 1719 1173 -376 212 1911 992 -608 213 1075 -563 -2467 -1204 -416 -1516 -2154 -881 127 -591
906e91j106J470P11o03m89J089Q28q78p85J536O97j398L5J111j02j829j76Q29
$$ -591 -1697 -227 484 -119 -608 481 1309 431 -354 1182 1879 481 516 1627 1525 -304 -480 349
924C49k71j721R65J032r02n85Q8J040m63j258P51J124l13r28J178J462p53r87
$$ 349 78 -1643 -678 354 -548 -1133 -1045 -5 -468 -1726 -975 149 -164 -1092 86 1548 795 -192
942a92J239N11j356l57Q44M8p71m61R72L77p74l41O39k12j063m64P46K30r47o
$$ -192 1047 1558 202 -155 689 737 -34 -495 477 854 80 -261 378 166 -897 -1361 -615 -385 -1332 -1338
962a338J566L34j313L99J432l21j514O41J136k97j052O46R32m55j011M47R90n59
$$ -1338 228 562 -751 -352 1080 759 -755 -114 1022 725 -327 319 1251 796 -215 232 1222 663
980F63j455m5J146o74j029Q36J294q96q17J333K92j328m09Q09Q06r80r8R62R11
$$ 663 -792 -837 309 -365 -1394 -558 736 -160 -977 356 648 -680 -1089 -280 526 -454 -552 410 1321
999A321j117l16L57O83j347k32Q24L16q66k94J174J05j144L48Q35l21j091K88
$$ 1321 204 -112 245 928 -419 -651 173 489 -377 -671 503 608 -536 -188 647 326 -765 -477
1017d77R22n90n96J51J076J46p68K2Q08m05q70p6Q12k19r43P26J099q48n11N21
$$ -477 445 -145 -741 -590 486 632 -136 -114 694 289 -581 -657 155 -64 -1007 -281 818 -30 -541 -20
1037b0O42j024r3K34L93j84o7N08M14n54j75M37K56o40n47K69J08p56K98P14K39
$$ -20 622 -402 -495 -261 132 -52 -119 389 803 249 74 511 767 127 -420 -151 -43 -799 -501 213 452
1058D52o57p3N45m53q47M95K64M5m16L92P25J19m80J02O80p73l41M09O23o59l93
$$ 452 -205 -278 267 -186 -1033 -538 -274 -229 -645 -253 472 591 111 213 893 120 -221 188 811 152 -241
1079b41M93M25p41j66M72J04q94m42N53J50l55j02R30J6n44o6O52J46o82j58Q17
$$ -241 252 677 -64 -230 242 346 -548 -990 -437 -287 -642 -744 186 202 -342 -408 244 390 -292 -450 367
1100C67K35q12N05P64l44n66K84J87k77o16J06Q6j69m52J76N93m34j99L96L22
$$ 367 602 -210 295 1059 715 149 433 620 343 -273 -167 -81 -250 -702 -526 67 -367 -566 -170 152
1120A52m25n18K04O73o02M6Q24L68m03j09N36n6m23p21P81J12m01k61O08O2m66
$$ 152 -273 -791 -587 86 -516 -470 354 722 319 210 746 690 267 -454 327 439 38 -223 385 447 -19
1141a9l63K50M2o73K83L70k87j01R2O07p0n24N32K36j76l13R6L48l51j4M43K40
$$ -19 -382 -132 -90 -763 -480 -110 -397 -498 -406 201 131 -393 139 375 199 -114 -18 330 -21 -35 408 648
1163F48k69n32M73R8m85k70M74j62m47L51J5K16k50j82L82N8n41K6M42j74n55
$$ 648 379 -153 320 418 -67 -337 137 -25 -472 -121 -106 110 -140 -322 60 118 -423 -397 45 -129 -684
1184f84O81L20R7l38K70j39l06j05K13K73n56j71N25K41j08m67O24l68k45j88
$$ -684 -3 317 414 76 346 207 -99 -204 9 282 -274 -445 80 321 213 -254 370 2 -243 -431
1204d31L76J39m01R0K52M59n44O2J38J47n86p8L90p2l72L94M77p3m99jO54k85
$$ -431 -55 84 -317 -227 25 484 -60 2 140 287 -299 -377 13 -59 -431 -37 440 367 -132 -133 521 236
1226B36o10K9L91l26q5M31M96l67l84K66J87l53l51O02J22k83j19J15O3j34j99
$$ 236 -374 -345 46 -280 -365 66 562 195 -189 77 264 -89 -440 162 284 1 -118 -3 60 -74 -273
1247b73K75j2k01k84L58L26l17LL71K6p9k14N38j84n40J0M21k40k25K11O8L52
$$ -273 2 -10 -211 -495 -137 189 -128 -125 246 272 193 -21 517 333 -207 -197 224 -16 -241 -30 38 390
1269C90n79k4K53J62n42k43L52J04k98M0K58K05k38J25L78k38l78K45L32j90N1
$$ 390 -189 -213 40 202 -340 -583 -231 -127 -425 -385 -127 78 -160 -35 343 105 -273 -28 304 114 165
1290A65O5J91j76o8K15k53k59l54M84k7m40K25K96k3k89N8K52l16k90M10N02k83
$$ 165 230 421 245 177 392 139 -120 -474 10 -17 -457 -232 64 41 -248 -190 62 -254 -544 -134 368 85
1312H5l52L63L77l6k98k7N06k49n22K91K77o9l88N4J83l76q6n1L04j44k52L59
$$ 85 -267 96 473 437 139 112 618 369 -153 138 415 346 -42 12 195 -181 -267 -318 -14 -158 -410 -51
1334e1N4k16j04J42O39o41j72M08J02l87J90J26J87j93J77kJ84m89k26O64k89
$$ -51 3 -213 -317 -175 464 -177 -349 59 161 -226 -36 90 277 84 261 259 443 -46 -272 392 103
1355A03l58m9L45J32o52J32M54j12l46j39P17j53m18J1L23m8j01J79O97m63o06
$$ 103 -255 -304 41 173 -479 -347 107 -5 -351 -490 227 74 -344 -333 -10 -58 -159 20 717 254 -352
1376c52O36Q8l21j79K1J20k28J70J93L54p60q1J50J23m6J01k5Q0l3o6K25j49k59
$$ -352 284 372 51 -128 -107 13 -215 -45 148 502 -258 -339 -189 -66 -112 -11 -36 44 11 -55 170 21 -238
1399b38L8L96j81j32J4R8K03l61L08K8j28l6j42L07j69k89L22O1k3k88J04L65
$$ -238 -200 196 15 -117 -103 -5 198 -163 145 173 45 9 -133 174 5 -284 38 99 76 -212 -108 257
1421B57k04j76K28j55jj89L19K3k57q7L43p2k08J04J37j1K0j45K57J58m79k49
$$ 257 53 -123 105 -50 -51 -240 79 102 -155 -242 101 29 -179 -75 62 51 71 -74 183 341 -138 -387
1443c87M43J45k89j75K06K81l68q9M00r3j21K67r4j48j12QJ48k19j56N09j12l65
$$ -387 56 201 -88 -263 -57 224 -144 -233 167 74 -47 220 126 -22 -134 -126 22 -197 -353 156 44 -321
1465c21l5M62K56k71k22K7M87m87qK84J0j75m9Q6ojj58K97k43J82j65P2r4j05
$$ -321 -356 106 362 91 -131 -104 383 -104 -112 172 182 7 -42 44 38 37 -121 176 -67 115 -50 22 -72 -177
1489a77L70p8J39l70oj78K58j60R6L69O1n65L01Q2j83Oj45L55j87j96K64j45l5
$$ -177 193 115 254 -116 -122 -300 -42 -202 -106 263 324 -241 60 142 -41 -35 -180 175 -12 -208 56 -89 -124
1512a24r2L13J37k06j57J81j68j53J65J28p3j37K89K1R9l03J31M6n4k42J58J81
$$ -124 -216 97 234 28 -129 52 -116 -269 -104 24 -49 -186 103 124 223 -80 51 97 43 -199 -41 140
1534A40P6j53mj27K22j51l20L50K7j64N2J48j48J37l8Rl0kQ9n8k48K14j6PPj47
$$ 140 216 63 59 -68 154 3 -317 33 60 -104 -52 96 -52 85 47 56 26 24 113 55 -193 21 5 12 19 -128
1560a28J90Q6k49J28j19J54J54k37j65L36k42l43K29M40j57l64K99l8k37J42n0
$$ -128 62 148 -101 27 -92 62 216 -21 -186 150 -92 -435 -206 234 77 -287 12 -26 -263 -121 -171
1581a71K6K87k46M4J68j85k2J77j37P8Q9j71Q5M9K10j23j35k46K55K3n1j82J97
$$ -171 -145 142 -104 -60 108 -77 -99 78 -59 19 108 -63 22 71 281 158 23 -223 32 55 4 -178 19
1604A9k15J02K62k90J27o5j15K84j68j7J06K4k5k51K17K37p8j54O9o2P1k16L03
$$ 19 -196 -94 168 -122 5 -60 -175 109 -59 -76 30 54 29 -222 -5 232 154 0 69 7 78 -138 165
1627A65l0p6k99J76O6q7l8J24L7k90J52N3K00k19K28j71q1K48J02j53N6k12j53
$$ 165 135 59 -240 -64 2 -85 -123 1 38 -252 -100 -47 153 -66 162 -9 -90 158 260 107 163 -49 -202
1650b02J86j61K3J00M5jj76p9M30N9o9l14l7J93r1K40j43k7j69L44k12oK06l40
$$ -202 -16 -177 -154 -54 -9 -10 -186 -265 165 224 155 -159 -196 -3 -94 146 3 -24 -193 151 -61 -67 139 -201
1674b01K77K7P1k13j68J79n6J29j30J77P8l59L24j77j91k21O15k34j27M15k39
$$ -201 76 103 174 -39 -207 -28 -84 45 -85 92 170 -189 135 -42 -233 -454 161 -73 -200 215 -24
1695b4P1j57K33M8l86K88j03N8J13l30P0M5j08R6K11j35j62K48k0j30L45k80K19
$$ -24 47 -110 123 171 -215 73 -30 28 141 -189 -119 -74 -182 -86 125 -10 -172 76 56 -74 271 -9 210
1718B10j30j11Nq0J05j13J1M42m54O5j2k17K35R6j54o4J89l36L25Q9o2q0M8O5
$$ 210 80 -31 -26 -106 -1 -114 -103 339 -115 -50 -62 -279 -44 52 -102 -166 23 -313 12 101 39 -41 7 72
1742G2j30L7M2j53L07k23J08j06J51j37j8J88j54j58K20J0j38L69m56J69J09k94
$$ 72 -58 -21 21 -132 175 -48 60 -46 105 -32 -50 138 -16 -174 46 56 -82 287 -169 0 109 -185
1764a85L67j91j67K55k65J10Q0q8O0k5N1Nn3J11N5j26O5J67k02J0l3j00L4L8P
$$ -185 182 -9 -176 79 -186 -76 4 -84 -24 -49 2 7 -46 65 120 -6 59 226 24 34 1 -99 -65 -27 -20
1789b0j67QK07k3r6l04M27J14l1k46J32j2j87J45M89l14K3k23N3l2q4m2O5K74
$$ -20 -187 -179 28 5 -91 -395 32 146 115 -131 1 -11 -198 -53 436 122 145 -78 -25 -57 -141 -183 -118 156
1813A56k40K66rm42J92M8O9j87M0j19M9O1j23K68p7l1K6J64j20Q9L9k89L89Pl13
$$ 156 -84 182 173 -269 -77 -29 40 -147 -107 -226 -177 -116 -239 29 -48 -79 -53 111 -9 80 119 -170 219 226 -87
1838h7J89j38K83l16J88N9R9j46l6j45j16L7o6J12K68k33j94K92j97J17K00j95
$$ -87 102 -36 247 -69 119 178 277 131 95 -50 -166 -129 -195 -83 185 -48 -242 50 -147 -30 170 -25
1860b5j93J54L3NL28l57r8O7J64P5j76J3L6L2L12m85K0r4J66o7J87r1LQ2k77K31
$$ -25 -218 -64 -31 -26 302 -55 -153 -86 78 153 -23 -10 26 58 370 -115 -95 -189 -23 -90 97 6 9 91 -186 45
1886D5J21k66J20M2L7pM6l02J70J5j61N5K25k44j26N16j24q4k66M32m06K80l47
$$ 45 166 -100 20 62 99 92 138 -164 6 21 -140 -85 140 -104 -230 286 162 78 -188 244 -162 118 -229
1909b29K55J28k07K23q2k04K09k72J56J42k17J76l7j19j16n6L41L41m28RK5Q3
$$ -229 26 154 -53 170 88 -116 93 -179 -23 119 -98 78 41 -78 -194 -250 91 432 4 13 38 121
1931A21k78J55o6K01j48j21L11j69m6j6K86j48r8J4j43O7Q9J85j56qk65L78J47
$$ 121 -157 -2 -68 133 -15 -136 175 6 -40 -56 230 82 -16 -2 -145 -78 11 196 40 32 -233 145 292
1954B92k72pj76L62j52J31j08k15K7m6N5L48k34O5q2n9n7J6L19k48pOO3j50K5
$$ 292 20 13 -163 199 47 178 70 -145 -118 -164 -109 239 5 70 -12 -71 -128 -112 207 -41 -48 -42 21 -129 -104
1979a04j49L88n5k36J54K1J9NK35k57j16O9L4P7J55j93K5J30Q0k65N9j80O9M8
$$ -104 -253 135 80 -156 -2 19 38 43 278 21 -95 -26 8 85 240 47 72 202 282 17 76 -104 -35 13
2003A3M6%j61j09J15j2j01K90j22Q5l29K03KN3K9L44j69p7N3n5j26o7M11J32l56
$$ 13 59 59 -102 -211 -96 -108 -209 81 -41 44 -285 -82 -80 -27 2 346 177 100 153 98 -28 -95 316 448 92
2028I2J26k18nJ58l39LJ53J47k73K00M3k18M5J12J55k1l79N3K61n9n7K01j45k27
$$ 92 218 0 -5 153 -186 -183 -30 117 -156 44 87 -131 -86 26 181 160 -219 -166 95 36 -21 180 35 -192
2052a92K08P5j53n2K4J29M0L2k30J20K39m83K08j6J27j70O6m0N0l14J99K56j76
$$ -192 16 91 -62 -114 -90 39 79 111 -119 1 240 -243 -35 -51 76 -94 -28 -68 -18 -332 -133 123 -53
2075e3R9o3K42j67r8M50m69J20Q8j8j38J29o5n0K89l08j43J13J24j13k39J98K14
$$ -53 46 -17 225 58 -40 410 -59 61 149 131 -7 122 57 7 296 -12 -155 -42 82 -31 -270 -72 142
2098A42k90Q1J37m66K86K36l3n3J17Q8l22OK22m60K67R7m74L62Q9J01o0k56O4
$$ 142 -148 -67 70 -396 -110 126 93 40 157 245 -77 -71 151 -309 -42 55 -419 -57 32 133 73 -183 -119
2121a19K32r1Q8j10j37K63q6j58L6Q6J32j8l53K84J59k00K18j88m7Q0J0k36N7
$$ -119 113 22 110 0 -137 126 40 -118 -82 4 136 118 -235 49 208 8 226 38 -9 71 81 -155 -98
2144i8J55k37K85Qo0Q4j41J83q9k11r8M56j45k62L8J35J60k74l8J06M6j82L03
$$ -98 57 -180 105 113 53 137 -4 179 90 -121 -219 237 92 -170 -132 3 163 -111 -149 -43 3 -179 124
2167A24k3j7r9O8J3L7j86J61j06n7J0J68O5l09K2K01K78m24J01p3PJ75l33K3K90
$$ 124 101 84 -15 53 66 103 -83 78 -28 -85 -75 93 158 -151 -129 72 350 -74 27 -46 -39 136 -197 -174 116
2192A16j33K2j59K09k13j36K29L6j99K74j06J8P0n8K99l00K14l58M02r9k06K92
$$ 116 -17 5 -154 55 -158 -294 -65 -29 -228 46 -60 -42 28 -30 269 -31 183 -175 227 128 -78 214
2214B14k30J06j96j29K20j0M6Q2k42K30l27L53l77L45j10j08L94k72o9J74O1r1
$$ 214 -16 90 -106 -235 -15 -25 21 103 -139 91 -236 117 -260 85 -25 -133 261 -11 -80 94 155 64
2236F4J36l62K16j6j13J96M6k50O6R4j3j75P8o1Qk4N8k3J28nj16P7K7k41Q9L0
$$ 64 200 -162 54 38 -75 121 167 -83 -17 77 64 -111 -33 -94 -86 -110 -52 -75 53 48 -68 9 36 -205 -116 -86
2262h6n7q7K91KM1l51J89L17m86J18K9J27M5k98K98K54l58q6J46P2j02j34j61
$$ -86 -143 -230 61 63 104 -247 -58 259 -227 -109 -80 47 92 -206 92 346 -12 -98 48 120 18 -116 -277
2285b77L48j90j50L37N8l81K29K3q4o7J85rj2k21L18k17k1J32Q7k17R5q5J33j83
$$ -277 71 -119 -269 68 126 -255 -26 -3 -87 -154 31 22 10 -211 107 -110 -131 1 88 -129 -34 -119 14 -169
2309a69J68P5k84L15j78N2j98K24Lj60L2j28K4K80R6q3j1j6j86j2L56j66j51K51
$$ -169 -1 74 -210 105 -73 -21 -219 5 8 -152 -120 -248 -224 56 152 69 58 42 -144 -156 200 34 -117 134
2333A34j50j10J49j99K41j08K13Mj02k22J01j32j20J62K13R2m64K83J04l2j57
$$ 134 -16 -126 23 -176 65 -43 170 174 72 -150 -49 -181 -301 -139 74 166 -298 -15 89 57 -100
2354a00K08o7j80K87Kj34K96l21j3k7K20jk10Q5k7l8m4J86j46j69K31m7J12j18
$$ -100 108 41 -139 148 150 16 312 -9 -22 -49 171 170 -40 45 18 -20 -64 122 -24 -193 38 -9 103 -15
2378a5j01K46m08j54L31K32q2j59P0J53O0j22j04L3j60Q5K14J36m7j19j14J10
$$ -15 -116 130 -278 -432 -101 131 49 -110 -40 113 173 51 -53 -20 -180 -95 119 255 208 89 -25 85
2400H5k09K58l22K60L5m43L81r8J03k35L07j97K47k19J06Ql3k48K35o1J7K93k95
$$ 85 -124 134 -188 72 107 -336 45 -53 50 -185 122 -75 172 -47 59 67 34 -214 21 -40 -23 270 -25
2423b5o8K66o8nJ91m10K32k2k11J38j41m4K02j17j4M01k01P1k81l7J50j5L2pJ49
$$ -25 -93 173 105 100 291 -119 113 91 -120 18 -123 -167 35 -82 -96 305 104 175 -106 -143 7 -8 24 17 166
2448A66q7O0j75J93k73qM9J73J02q3j20j05Om5O1K75j99J10K0m71O30l64J45l41
$$ 166 79 139 -36 157 -116 -124 -75 98 200 117 -3 -108 -102 -147 -86 189 -10 100 120 -351 279 -85 60 -281
2472b81M15n4o3J53l50L14j44k27N64k89j27K23KN5k10k00K31Q3l69K58K68k57
$$ -281 134 80 17 170 -180 134 -10 -237 327 38 -89 134 136 191 -19 -219 12 95 -274 -16 252 -5
2494eJ6k26O2M02j86j6j87J8q4R8R8k8J17j0k48K04j49K11k08J09Mk6J7J94j72
$$ -5 11 -215 -153 249 63 47 -140 -122 -206 -108 -10 -38 79 69 -179 25 -124 87 -121 -12 -8 -34 -17 177 5
2519Ek17K10K5L9%R2l25J08O4K51j71O3j50Oj60J0K17j26j5J98P6k27P5M4j38
$$ 5 -212 -2 23 62 62 154 -171 -63 1 252 81 144 -6 0 -160 -150 67 -59 -74 124 200 -27 48 92 -46
2544d6R6k22K83j82m2K53m1j95K68l25J45L3Mr3k23K76P8j27l9K58k52K30j08
$$ -46 50 -172 111 -71 -113 140 99 -96 172 -153 -8 25 29 -64 -287 -11 67 -60 -99 159 -93 137 29
2567B9J56k31l13M83P8l45K17K03k05K4O4q8j60J38j50K71k09K7K3K2j44Oj59
$$ 29 185 -46 -359 124 202 -143 74 277 72 96 160 72 -88 50 -100 171 -38 -11 12 34 -110 -104 -263
2590b63L15k35J94r3k05J54L5P9J60j05k51J95R3O9n0o7nK3j36K60j71K7K44L2
$$ -263 52 -183 11 -82 -287 -133 -98 -19 141 36 -215 -20 73 142 92 25 20 43 -93 167 -4 23 267 299
2614B99k69J75l05J56j63N6k2j02L66J08n26K96j06k51N30j65k4m9K0j44J81j04
$$ 299 30 205 -100 56 -107 -51 -73 -175 191 299 -227 69 -37 -288 242 77 53 4 24 -120 61 -43
2636d3n2M01l55j37M44l8p5q6q4mj2q8K71k12j8J35p6o5l9Q5K68k08q0j05L6R4
$$ -43 -95 306 -49 -186 258 220 145 59 -25 -29 -41 -129 142 -70 -88 47 -29 -94 -133 -48 220 12 -68 -173 -137 -43
2662d3R6j30J77J41m14K36J59j92m8R8j05M5k66L34%j35j09J05r9P5p2K17O4k06
$$ -43 53 -77 100 241 -173 63 222 30 -18 80 -25 20 -246 88 88 -47 -156 -51 -150 -75 -147 70 134 -72
2686g2K0p1J27j88K32p7j05N5N6K28k50o5j27J89K98l21O3M3J21L2k23K0M1j12
$$ -72 -52 -123 4 -184 48 -29 -134 -79 -23 205 -45 -110 -237 -48 250 -71 -8 35 156 188 -35 -15 26 -86
2710h6J30j26M1j14P5LJ74p4n3l06N57m88L23K38k46k66K96k80K40j22J83o3J00
$$ -86 44 -82 -41 -155 -80 -77 97 23 -30 -336 221 -267 56 294 48 -218 78 -202 38 -84 99 36 136
2733A36j25k08L37L2K4k97J36r6l5k69N56k22J8nNrj37K36R7k02nK45k53J71k
$$ 136 11 -197 140 172 196 -101 35 -61 -96 -365 191 -31 -13 -18 -13 -22 -159 77 174 -28 -33 212 -41 130 128
2758A28lj42k66L04k19L49k46J20k39K18J2J38O4j89M6r1J07l18K71l5k0k33N0
$$ 128 125 -17 -283 21 -198 151 -95 25 -214 4 16 154 218 29 75 -16 91 -227 44 9 -11 -244 -194
2781a94J0R4K33k3ol15L06n6O5J39m24J11Qm9K6J53j30P3K1j62J04jP5R1P9k69
$$ -194 -184 -90 143 120 114 -201 105 49 114 253 -171 -60 -52 -101 -75 78 -52 21 42 -120 -16 -17 58 149 228 -41
2807d1j73M74j19j3R7N6l21K83j30J2j39l66M17k8O9o0k64K87N3j39M9K58l15
$$ -41 -214 260 141 128 225 281 -40 243 113 125 -14 -380 37 9 78 18 -246 41 94 -45 4 262 -53
2830e3j22j22J37K67k99J96j08N2o5K6l0P7O0l11M27J8j76o4l2J6R7J71k99J1
$$ -53 -175 -297 -160 107 -192 4 -104 -52 -117 -91 -121 -44 16 -295 132 150 -26 -90 -122 -106 -9 162 -137 -126
2854a26L49j81r9KK7J07q9k6J00j57k1J04j07O9L7k4n0R2J52q1k41J68o4J72R
$$ -126 223 42 -57 -55 -28 79 -10 -36 64 -93 -114 -10 -117 -48 -11 -35 -85 7 159 78 -163 5 -59 113 122
2879A22n9j96L4P2J11j33J23j01J9J55j96L5R5k45J05J2R1j22Q2j55L63j93j84
$$ 122 63 -133 -99 -27 84 -49 74 -27 -8 147 -49 -14 81 -164 -59 -47 44 -78 4 -151 212 19 -165
2902a65J30J7L05l71J66j21R3MJ0k5k80J00J86Op2m3J25n4n4j06M49p3l16J21
$$ -165 -35 -18 287 -84 82 -39 54 58 68 43 -237 -137 49 55 -17 -60 65 11 -43 -149 300 227 -89 32
2926C2k29J81k45J80J11J4j10l4J37O5j68P6q4K99k70M9M30m74K99r5j09m2Nk57
$$ 32 -197 -16 -261 -81 30 44 -66 -100 37 102 -66 10 -74 225 -45 4 434 -40 259 164 55 13 18 -239
2950b39R7K90K1q1r6L07l75p6J86k23L50j85k0q5k9J42o5K85k45p5R8j46n7J61
$$ -239 -142 148 169 88 -8 299 -76 -152 34 -189 161 -24 -44 -129 -158 -16 -81 204 -41 -116 -18 -164 -221 -60
2974f0J10K2jj64Q8r2K81j55j3r0j44J32J01K9j03J76M2k89K50pk21k7K52j87
$$ -60 50 72 71 -93 -5 -97 184 29 16 -74 -218 -86 15 44 -59 117 159 -130 120 113 -108 -135 117 -70
2998g0J07Rr4m9J08o3J1J09M0j0K3j32j17l5K95k08L6O2J03j49K3QJJ61j73l8
$$ -70 37 46 -48 -97 11 -52 -41 68 108 98 121 -11 -128 -163 132 -76 -40 22 125 -24 -1 7 8 169 -4 -42
3024d2J47j90jK04k30q3K63J09k62K40j50j58J11J22Q2k10K21k22M3o0L70j33
$$ -42 105 -85 -86 118 -112 -195 68 177 -85 155 5 -153 -42 80 162 -48 173 -49 -6 -66 304 171
3046A71k78J60j11R9J06j12K6M7n2K3k32K31j23J65j07M7q8l66J86j32L08J01
$$ 171 -107 53 -58 41 147 35 61 108 56 79 -153 78 -45 120 13 60 -28 -394 -208 -340 -32 69
3068F9K0j52R0j45K0k7K78o2j60l2R7J92k32Q0k29K72R4k46K0lJ02j51n5J01q0
$$ 69 89 -63 27 -118 -98 -125 153 91 -69 -101 -4 188 -44 36 -193 79 173 -73 -53 -56 46 -105 -160 -59 -139
3093a39K45pr9J21K52n33J71j92L15p8m6J54l4j91K4M9j02P8r7J13j5K5j36J49
$$ -139 106 99 0 121 373 -160 11 -181 134 56 10 164 130 -61 -37 12 -90 -12 -109 4 -11 14 -122 27
3117B7j40j39L15j73K00p2M0%j67L00m45L64N9j97j78K16K0L3K01k03q9j8k31
$$ 27 -113 -252 63 -110 90 18 58 58 -109 191 -254 110 169 -28 -206 10 30 63 264 61 -28 -46 -277
3140b77L02J09j87M1m7n5K15j30k1J89j19p1L1K81l55OK30k75J34R4j52L21j56
$$ -277 25 134 -53 -12 -59 -114 101 -29 -50 139 20 -51 -20 261 -94 -88 142 -133 1 95 -57 264 108
3163A08j01J59j52l03J96J04N9k15J23K85j12j87o6L33l11l9q6K16r5r8J3J40
$$ 108 7 166 14 -289 -93 11 70 -145 -22 263 151 -36 -102 231 -80 -119 -205 11 -84 -182 -169 -29
3185b9J62K6r3o3K7M4k25L23j13j65J66j34J74k9p4J14l42J85j9Q2l50K96l6J96
$$ -29 133 159 66 3 30 74 -151 172 59 -106 60 -74 100 71 -3 111 -231 -46 -65 17 -333 -37 -73 123
3209A23k16jJ05k55J28J89L01o06O16l52K9k91J84R7M0j5j47R2J5m9Q8M7k24k2
$$ 123 -93 -94 11 -244 -116 73 374 -232 384 32 61 -230 -46 51 91 76 -71 21 36 -13 75 122 -102 -124
3233a24J14r3J36j30J25Q2j47j97R9K14m38J75L20j05j65L8K00p9J7j40K80m9
$$ -124 -10 -103 33 -97 28 110 -37 -234 -135 79 -359 -184 136 31 -134 -96 104 25 42 -98 182 133
3255A33k32N5M1j28K17m4j88K85j46j32M2K3K4J43k2j8K4j58q8K64M4k7l5q4J9
$$ 133 -99 -44 -3 -131 86 42 -146 139 -7 -139 -97 -74 -50 93 71 53 77 -81 -169 95 139 112 77 -7 12
3280A2k9L6J88k87J19J24l31K81K37l57p2Q3K70k48j06q9K40p6j47K15P2J9k59
$$ 12 -17 19 207 -80 39 163 -168 113 350 -7 -79 4 274 26 -80 -169 71 -5 -152 63 135 154 -105
3303a05J20J24j48O7J78k33j44K34l61J03K39M8j15J92m50M11j74o7J22j00K08
$$ -105 15 139 -9 58 236 3 -141 93 -268 -165 74 122 7 199 -251 160 -14 -81 41 -59 149
3324A49j96P3m41N22p5K3k20P9l3K52j74QJ12l06O9l2K61j52MN3R7j68Q8j2N4
$$ 149 -47 26 -415 107 32 55 -165 -86 -119 133 -41 -33 79 -227 -158 -190 71 -81 -77 -24 73 -95 -7 -19 35
3349C5j34R6J48M7r7k98M6K55l01L38l40K90l5k96J37J64n3N9j87J35K3j52J72
$$ 35 -99 -3 145 192 95 -203 -157 98 -203 135 -205 85 50 -246 -109 55 2 61 -126 9 32 -120 52
3372E2k18M5R5J34k06k5K79o4j14R9n1J13j96l8j50L25j61R8q2j03J04M5J98k22
$$ 52 -166 -121 -26 108 -98 -123 156 92 -22 77 26 139 -57 -95 -245 80 -81 17 -65 -168 -64 -19 179 -43
3396d3o9J45J0J21r4r6R5o6m1J3O6j4M5j2o2Q5J25k86mJ20k59M27k6j04J16l23
$$ -43 -112 33 43 164 70 -26 69 3 -38 -25 41 27 72 60 -2 83 208 -78 -82 38 -221 206 180 76 192 -131
3422a31K76k73K16k39J03k66J01P8Q0J50j61O7Q7p6q0J72m0k4J0L0k13Q8J78J58
$$ -131 145 -128 88 -151 -48 -314 -213 -135 -55 95 -66 1 88 12 -68 104 64 40 50 80 -133 -45 133 291
3446B91k76J21j06O1j75qK24j47OK53m29J67j9J7j38J87m2l4j13J98q3j62R1J87
$$ 291 15 136 30 91 -84 -92 132 -15 -9 244 -185 -18 -37 -20 -158 29 -13 -47 -160 38 -45 -207 -116 71
3470G1j90j08K41ko7J12p3J29j14l07J74L87m06K81K49j75l11m9m1K79J11j62
$$ 71 -119 -227 14 12 -55 57 -16 113 -1 -308 -134 253 -153 128 377 202 -109 -158 -199 80 191 29
3492B9MK24j95K6m1k02O2J16r9J16J46Q4j70k8m1n1j0j26K60k72J49O9j60J29
$$ 29 33 257 62 88 47 -155 -93 23 -76 40 186 270 100 72 31 -20 -30 -156 104 -168 -19 50 -110 19
3516A9j45K58k31J21J2j32J9J14nJ01l66L95p8l38K55j54K11j26J58M9J1j20K2
$$ 19 -126 132 -99 22 34 -98 -79 35 30 131 -235 160 82 -256 -1 -155 56 -70 88 137 148 28 50
3539E0k04J46k7Q1j55j32L60k72J42K48k42J17j67J81k07J69j43M5J0J00j07o1
$$ 50 -154 -8 -35 46 -109 -241 119 -153 -11 237 -5 112 -55 126 -81 88 -55 -10 0 100 -7 -68
3561f8J09Q1P2n43K08L04l32J4j5K15j32M9j16K4j51K47J47j85j1j40K28p4j18
$$ -68 41 122 194 -349 -141 163 -169 -155 -170 45 -87 -38 -154 -130 -281 -34 113 -72 -83 -223 5 -69 -187
3584a87K09n9J04k06p1K83k15K86Q1m93L70j76r8K39k1j00J12j36ROJ5J68k28
$$ -187 22 -37 67 -139 -210 73 -142 144 225 -268 102 -74 -172 67 46 -54 58 -78 -69 -63 -48 120 -108
3607a08q6K27p7p0J80j9oK6k15J19L27k84K01k49Q9q3j9M2l6j0l7n7J08J43m0
$$ -108 -194 33 -44 -114 66 47 41 67 -148 -29 298 14 215 -34 55 -28 -47 -5 -41 -51 -88 -145 -37 106 66
3632F6l41K72K72j29K0j18k30J30K38K09k90m55M66j04l6l5ll0L3k0N8J85m84
$$ 66 -275 -3 269 140 160 42 -188 -58 180 389 99 -356 110 6 -30 -65 -68 -98 -65 -85 -27 158 -326
3655c26J80J82nk6JP6k10M01j7l42J46QQ2r5J5l8oJ2m0k7j96K70m4O2j54k31M51
$$ -326 -146 36 31 5 6 82 -128 273 256 -86 60 68 150 55 70 32 26 38 -2 -29 -225 45 1 63 -91 -322 129
3682A29p1K18K5m17n1L28l36J13J71j40L3J22L4j74qN8j1p6o9J25J07j27J39q3
$$ 129 58 276 301 -116 -167 161 -175 -62 109 -31 2 124 158 -16 -24 34 23 -53 -122 3 110 -17 122 39
3706C9k15J80N4K77k99q0J57j65J25J38k27o7M7k0j00K09j14L9J53J22l18L3j80
$$ 39 -176 4 58 335 36 -44 113 -52 73 211 -16 -83 -36 -56 -156 53 -61 -22 131 253 -65 -32 -212
3729b12K61j79J50J61q5k52J21L1K39k45k20K73r8jJ52j79J92J46l42J61k01K1
$$ -212 49 -130 20 181 96 -156 -35 -4 235 -10 -230 43 -55 -56 96 -83 109 255 -87 74 -127 -106
3751a06J6L5J90j71JJ40J7N6j47j72R6N2k53J60j39L77j05j7K1N4k16J57l31M03
$$ -106 -90 -55 135 -36 -35 105 122 178 31 -141 -45 7 -246 -86 -225 152 47 30 51 105 -111 46 -285 118
3775A18K0L8l22M2O9j19k9L70j64N0j13n5J36N6k0L3j3k01j96K01J84j45p4J04
$$ 118 138 176 -146 -104 -35 -154 -183 187 23 73 -40 -95 41 97 77 110 97 -104 -300 -99 85 -60 -134 -30
3799c0J36L4k26J42Qn9N0K3j93K37j7o6j71K72Kk88L03J6n25K17O6J67n3K55j86
$$ -30 106 140 -86 56 64 5 55 78 -115 122 105 39 -132 140 142 -146 157 173 -352 -135 -69 98 45 300 114
3824A14k03J76r2K07Q4l83l9K34k76J76Kk14K72o3J05j1l8m9r8J81j9M9k08j08
$$ 114 -89 87 -5 202 286 -97 -136 98 -178 -2 0 -214 58 -5 100 89 51 2 -96 85 66 115 -93 -201
3848b01M11k00n8q5L03j16P4l15K64k75K19Kk42J23J00k35J39J21j39K80j22L
$$ -201 210 10 -48 -133 170 54 128 -187 77 -198 21 23 -219 -96 4 -231 -92 29 -110 170 48 51
3870E1M4J17l44J75L2j68k0K22l26J61J26J9m9kj47J64j70k59L64j01J5J89j75
$$ 51 95 212 -132 43 75 -93 -113 109 -217 -56 70 89 40 38 -109 55 -115 -374 -10 -111 -96 93 -82
3893h2K8J59j23m6J46j67K09j24J3L39k15j32k01J17J07R4m10K46j89K54o2J16
$$ -82 -54 105 -18 -64 82 -85 124 0 13 352 137 5 -196 -79 28 122 -288 -42 -231 23 -39 77
3915G7k47N0L05k23K84k38J01J17k64J12q4R3l10Q6J36K32j3k70j57K72N1k25
$$ 77 -170 -120 185 -38 246 8 109 226 -38 74 -10 83 -227 -141 -5 227 214 -56 -213 59 110 -115
3937a15K09p0o1J59o8J75j98j09L92m29L99j69j35J66k72J44O9K30n8m26K26j1
$$ -115 94 24 -37 122 54 229 31 -78 314 -115 284 115 -20 146 -126 18 87 317 259 -167 59 48
3959D8K4r7K23j90O6J20k34J01M0q8J16j30j95J77Q8N2j13K6n8K2K3L7K1k1j22
$$ 48 72 -25 198 8 74 194 -40 61 101 13 129 -1 -196 -19 69 121 8 34 -24 -2 21 58 79 58 -64
3984f4m3J50J08J3r8p0Oj4J08J4m0k12K05j01p4M7P4J79k71J66K4k61Q5J31J34
$$ -64 -107 43 151 164 66 -4 2 -12 96 110 70 -142 63 -38 -112 -65 9 188 -83 83 107 -154 -69 62 196
$$ [...]
8191I0
##END NTUPLES=NMR FID
##END=
