##TITLE=1H_SR_PH-Asp_X
 200.13MHz,D2O.
 8 sc
 
 20.2.2026
##JCAMPDX= 6.0         $$ Bruker NMR JCAMP-DX V2.0
##DATA TYPE= NMR FID
##DATA CLASS= NTUPLES
##ORIGIN= UXNMR, Bruker Analytische Messtechnik GmbH
##OWNER= pz
$$ XWIN-NMR		Version 3.5
$$ Fri Feb 20 14:10:56 2026 Russian Standard Time (UT+4h)  she@DPX200
##.OBSERVE FREQUENCY= 200.1313
##.OBSERVE NUCLEUS= ^1H
##.DELAY= (6, 6)
##.ACQUISITION MODE= SIMULTANEOUS
##.ACQUISITION SCHEME= undefined
##.AVERAGES= 8
##.DIGITISER RES= 18
##SPECTROMETER/DATA SYSTEM= spect
##.PULSE SEQUENCE= zg30
##.SOLVENT NAME= D2O
##.SHIFT REFERENCE= (INTERNAL, D2O, 0, 14.3821)
##AUDIT TRAIL= $$ (NUMBER, WHEN, WHO, WHERE, WHAT)
$$ ##TITLE= Audit trail, XWIN-NMR		Version 3.5
$$ ##JCAMPDX= 5.01
$$ ##ORIGIN= Bruker BioSpin GmbH
$$ ##OWNER= she
$$ F:/spectra/data/she/nmr/H-C/1/audita.txt
$$ ##AUDIT TRAIL=  $$ (NUMBER, WHEN, WHO, WHERE, WHAT)
(   1,<2026-02-20 14:09:31.43 +0400>,<she>,<DPX200>,
      <created by zg, POWCHK disabled, PULCHK disabled
       configuration hash MD5:
       00 E9 B6 7A A2 85 ED C7 34 08 36 98 17 FE 4E 26
       data hash MD5: 16K
       53 EE 33 C4 5F AC 4A A4 4C 6A A0 FA A3 07 04 68>)
$$ ##END=
$$ 
$$ hash MD5
$$ 46 01 E1 69 E0 0F 13 16 A4 65 98 79 35 B0 C1 6A
##$RELAX= 
##$RELAX= 
##$RELAX= 
##$RELAX= 
##$RELAX= 
##$RELAX= 
$$ Bruker specific parameters
$$ --------------------------
##$DU= <F:/spectra>
##$EXPNO= 1
##$NAME= <H-C>
##$PROCNO= 1
##$TYPE= <nmr>
##$USER= <she>
##$AMP= (0..31)
100 100 100 100 100 100 100 100 100 100 100 100 100 100 100 100 100 100 
100 100 100 100 100 100 100 100 100 100 100 100 100 100 
##$AQSEQ= 0
##$AQ_mod= 1
##$AUNM= <au_zg>
##$AUTOPOS= <>
##$BF1= 200.13
##$BF2= 200.13
##$BF3= 200.13
##$BF4= 200.13
##$BF5= 200.13
##$BF6= 200.13
##$BF7= 200.13
##$BF8= 200.13
##$BYTORDA= 1
##$CFDGTYP= 0
##$CFRGTYP= 5
##$CHEMSTR= <none>
##$CNST= (0..31)
1 1 145 1 1 1 1 1 1 1 1 1 1 1 1 1 1 1 1 1 1 1 1 1 1 1 1 1 1 1 1 1 
##$CPDPRG= <>
##$CPDPRG1= <>
##$CPDPRG2= <>
##$CPDPRG3= <>
##$CPDPRG4= <mlev>
##$CPDPRG5= <mlev>
##$CPDPRG6= <mlev>
##$CPDPRG7= <mlev>
##$CPDPRG8= <mlev>
##$CPDPRGB= <>
##$CPDPRGT= <>
##$D= (0..31)
0 0.7 0 0 0 0 0 0 0 0 0 0.03 0 0 0 0 0 0 0 0 0 0 0 0 0 0 0 0 0 0 0 0 
##$DATE= 1771582170
##$DBL= (0..7)
120 120 120 120 120 120 120 120 
##$DBP= (0..7)
150 150 150 150 150 150 150 150 
##$DBP07= 0
##$DBPNAM0= <>
##$DBPNAM1= <>
##$DBPNAM2= <>
##$DBPNAM3= <>
##$DBPNAM4= <>
##$DBPNAM5= <>
##$DBPNAM6= <>
##$DBPNAM7= <>
##$DBPOAL= (0..7)
0.5 0.5 0.5 0.5 0.5 0.5 0.5 0.5 
##$DBPOFFS= (0..7)
0 0 0 0 0 0 0 0 
##$DE= 6
##$DECBNUC= <off>
##$DECIM= 32
##$DECNUC= <off>
##$DECSTAT= 4
##$DIGMOD= 1
##$DIGTYP= 9
##$DL= (0..7)
0 120 120 120 120 120 120 120 
##$DP= (0..7)
150 150 150 150 150 150 150 150 
##$DP07= 0
##$DPNAME0= <>
##$DPNAME1= <>
##$DPNAME2= <>
##$DPNAME3= <>
##$DPNAME4= <>
##$DPNAME5= <>
##$DPNAME6= <>
##$DPNAME7= <>
##$DPOAL= (0..7)
0.5 0.5 0.5 0.5 0.5 0.5 0.5 0.5 
##$DPOFFS= (0..7)
0 0 0 0 0 0 0 0 
##$DQDMODE= 0
##$DR= 18
##$DS= 0
##$DSLIST= <SSSSSSSSSSSSSSS>
$$ [...]
##$SUBNAM0= <"">
##$SUBNAM1= <"">
##$SUBNAM2= <"">
##$SUBNAM3= <"">
##$SUBNAM4= <"">
##$SUBNAM5= <"">
##$SUBNAM6= <"">
##$SUBNAM7= <"">
##$SUBNAM8= <"">
##$SUBNAM9= <"">
##$SW= 18.0517328524113
##$SWIBOX= (0..15)
0 0 2 0 0 0 0 0 0 0 0 0 0 0 0 0 
##$SW_h= 3612.71676300578
##$TD= 16384
##$TD0= 1
##$TE= 0
##$TE2= 300
##$TE3= 300
##$TEG= 300
##$TL= (0..7)
0 120 120 120 120 120 120 120 
##$TP= (0..7)
150 150 150 150 150 150 150 150 
##$TP07= 0
##$TPNAME0= <>
##$TPNAME1= <>
##$TPNAME2= <>
##$TPNAME3= <>
##$TPNAME4= <>
##$TPNAME5= <>
##$TPNAME6= <>
##$TPNAME7= <>
##$TPOAL= (0..7)
0.5 0.5 0.5 0.5 0.5 0.5 0.5 0.5 
##$TPOFFS= (0..7)
0 0 0 0 0 0 0 0 
##$TUNHIN= 0
##$TUNHOUT= 0
##$TUNXOUT= 0
##$USERA1= <user>
##$USERA2= <user>
##$USERA3= <user>
##$USERA4= <user>
##$USERA5= <user>
##$V9= 5
##$VALIST= <valist>
##$VCLIST= <CCCCCCCCCCCCCCC>
##$VD= 0
##$VDLIST= <DDDDDDDDDDDDDDD>
##$VPLIST= <PPPPPPPPPPPPPPP>
##$VTLIST= <TTTTTTTTTTTTTTT>
##$WBST= 1024
##$WBSW= 4
##$XGAIN= (0..3)
0 0 0 0 
##$XL= 0
##$YL= 0
##$YMAX_a= 85271
##$YMIN_a= -98116
##$ZGOPTNS= <>
##$ZL1= 120
##$ZL2= 120
##$ZL3= 120
##$ZL4= 120
##$ABSF1= 10
##$ABSF2= 0
##$ABSG= 5
##$ABSL= 3
##$ALPHA= 0
##$AQORDER= 0
##$ASSFAC= 0
##$ASSFACI= 0
##$ASSFACX= 0
##$ASSWID= 0
##$AUNMP= <proc_1d>
##$AZFE= 0.1
##$AZFW= 0.1
##$BCFW= 1
##$BC_mod= 2
##$BYTORDP= 1
##$COROFFS= 0
##$CY= -3
##$DATMOD= 1
##$DC= 2
##$DFILT= <>
##$DTYPP= 0
##$F1P= 0
##$F2P= 0
##$FCOR= 0.5
##$FTSIZE= 0
##$FT_mod= 4
##$GAMMA= 1
##$GB= 0.15
##$INTBC= 1
##$INTSCL= 1
##$ISEN= 128
##$LB= 0.25
##$LEV0= 0
##$LPBIN= 0
##$MAXI= 10000
##$MC2= 0
##$MEAN= 0
##$ME_mod= 0
##$MI= 1.114404
##$NCOEF= 0
##$NC_proc= 0
##$NLEV= 6
##$NOISF1= 3.799351
##$NOISF2= 2.8
##$NSP= 1
##$NTH_PI= 0
##$NZP= 0
##$OFFSET= 14.38212
##$PC= 1
##$PHC0= -3706.38
##$PHC1= 12.59232
##$PH_mod= 1
##$PKNL= yes
##$PPARMOD= 0
##$PSCAL= 0
##$PSIGN= 0
##$REVERSE= no
##$SF= 200.129724274929
##$SI= 16384
##$SIGF1= 3
##$SIGF2= 2
##$SINO= 400
##$SIOLD= 16384
##$SREGLST= <1H.CDCl3>
##$SSB= 0
##$STSI= 0
##$STSR= 0
##$SW_p= 3205.1282051282
##$SYMM= 0
##$S_DEV= 0
##$TDeff= 0
##$TDoff= 0
##$TI= <>
##$TILT= no
##$TM1= 0
##$TM2= 0
##$TOPLEV= 0
##$USERP1= <user>
##$USERP2= <user>
##$USERP3= <user>
##$USERP4= <user>
##$USERP5= <user>
##$WDW= 1
##$XDIM= 8192
##$YMAX_p= 0
##$YMIN_p= 0
$$ End of Bruker specific parameters
$$ ---------------------------------
##NTUPLES= NMR FID
##VAR_NAME=  TIME,          FID/REAL,        FID/IMAG
##SYMBOL=    X,             R,               I
##VAR_TYPE=  INDEPENDENT,   DEPENDENT,       DEPENDENT
##VAR_FORM=  AFFN,          ASDF,            ASDF
##VAR_DIM=   8192,          8192,            8192
##UNITS=     SECONDS,       ARBITRARY UNITS, ARBITRARY UNITS
##FACTOR=    0.0002768,     1,               1
##FIRST=     0,             0,               0
##LAST=      2.2672688,     0,               0
##MIN=       0,             -98116,          0
##MAX=       2.2672688,     85271,           0
$$ Real data points
##PAGE= N=1
##DATA TABLE= (X++(R..R)), XYDATA
$$ [...]
$$ plain form
2414 2604 1251 28 -1223 -2410 -2936 -1680 238 1497 2203 2101 1721 357 -1425 -2737 -2536 -1750
2430 -1750 -266 937 2239 2397 1849 685 -761 -2380 -2826 -1734 -611 460 1707 2440 2282 1033
2446 1033 -806 -2154 -2351 -2162 -906 264 1708 2501 2593 1238 -532 -1494 -2173 -1973 -1444 -363 1172
2463 1172 2676 2242 1393 -220 -1416 -2246 -2542 -1734 -391 1358 2406 2359 1623 361 -929 -1965 -2492
2480 -2492 -2068 -571 1093 2081 2221 1510 533 -716 -2051 -2561 -1982 -843 639 1908 2286 2171 1211
2497 1211 -345 -1713 -2465 -1918 -878 390 1439 2175 2152 1444 -395 -1578 -2512 -1962 -1202 -71 1205
2514 1205 1983 2342 1336 -236 -1315 -1748 -1859 -1410 -325 858 1857 2163 1381 100 -1122 -1770 -1971
2531 -1971 -1556 -505 771 2125 2118 1700 526 -568 -1557 -2111 -1891 -678 424 1499 1800 1315 789 -393
$$ packed form
2414B604j353j223j251j187n26J256J918J259P06j02l80j364j782j312K01P86
2430a750J484J203J302J58n48j164j446j619m46J092J123J071J247P33j58j249
2446A033j839j348j97J89J256J170J444P93R2j355j770r62o79K00N29J081J535
2463A172J504m34q49j613j196q30k96Q08J343J749J048m7p36j262j290j036n27
2480b492M24J497J664R88J40p11r77j249j335n10N79J139J482J269L78j15r60
2497A211j556j368p52N47J040J268J049P36k3p08j839j183r34N50P60J131J276
2514A205P78L59j006j572j079m33j11M49J085J183R99L06p82j281j222o48k01
2531a971M15J051J276J354pm18j174j094r89n54K20J213J102J075L01m85n26j182
$$ plain form
2549 -393 -1220 -2158 -1794 -815 301 1324 1847 1739 1353 255 -1199 -1923 -1831 -1045 50 855 1620 1767 1326
2568 1326 198 -1212 -1831 -1831 -1183 -330 793 1567 2028 1725 388 -659 -1413 -1810 -1237 -479 265 1412
2586 1412 1938 1658 575 -612 -1346 -1689 -1873 -1117 149 1413 1852 1767 1027 -138 -1109 -1783 -1844 -900 165
2605 165 1035 1548 1620 675 -9 -955 -1763 -1684 -1440 -22 904 1503 1577 1435 446 -723 -1503 -1462 -1203 -193
2625 -193 646 1343 1675 1498 708 -586 -1575 -1687 -1275 -516 447 1164 1563 1690 616 -566 -1223 -1456 -1419
2644 -1419 -826 234 999 1769 1510 883 -247 -1206 -1383 -1491 -1045 168 965 1674 1285 813 186 -751 -1548
2663 -1548 -1481 -918 -83 651 1407 1469 798 91 -680 -1413 -1574 -1296 -353 578 1244 1235 1111 371 -397 -1212 -1374
2684 -1374 -1145 -528 598 1080 1299 1256 561 -212 -1027 -1468 -1411 -473 -70 692 1294 1164 713 19 -691 -899
$$ packed form
2549c93q27r38L64R79J116J023N23j08l86j098j454p24R2P86J095Q05P65J47m41
2568A326j128j410o19%O48Q53J123P74M61l03j337j047p54l97N73P58P44J147
2586A412N26k80j083j187p34l43j84P56J266J264M39q5p40j165r71o74o1R44J065
2605A65Q70N13P2r45o84r46q08P9K44J418R26N99P4j42r89j169p80M1K59J010
2625a93Q39O97L32j77p90j294r89j12M12P59R63P17L99J27j074j182o57k33L7
2644a419N93J060P65P70k59o27j130r59j77j08M46J213P97P09l89m72o27r37p97
2663a548O7N63Q35P34P56O2o71p07p71p33j61K78R43R31O66rj24p40p68q15j62
2684a374K29O17J126M82K19m3o95p73q15m41N7R38M03P62O02j30m51o94p10k08
$$ plain form
2704 -899 -1064 -689 -195 703 1097 1050 786 28 -570 -1149 -1155 -1105 -234 520 993 1356 985 337 -171 -807 -1159
2725 -1159 -1108 -657 244 955 1229 862 473 -259 -963 -1216 -1013 -616 110 665 1054 1135 774 72 -786 -1095
2745 -1095 -1176 -816 68 556 1288 1253 864 261 -460 -1174 -1298 -742 -147 549 716 1059 953 308 -384 -1078
2765 -1078 -1169 -754 -138 243 902 1080 921 356 -293 -758 -1173 -933 -523 -44 669 1154 1028 560 -129 -834
2785 -834 -1023 -871 -264 155 534 1140 1314 471 -254 -701 -763 -1181 -645 -168 560 893 967 536 389 -455 -731
2806 -731 -758 -643 -301 362 893 947 713 152 -264 -776 -933 -1117 -180 257 638 779 992 506 -121 -740 -755
2827 -755 -782 -326 207 503 907 964 624 74 -718 -794 -1025 -552 6 407 688 869 568 148 -288 -730 -746
2848 -746 -355 -166 295 789 954 600 57 -170 -638 -619 -994 -346 41 479 680 674 372 -11 -428 -657 -831
$$ packed form
2704h99j65L75M94Q98L94m7k64p58n98n79oN0Q71P54M73L63l71o48n08o36l52
2725a159N1M51R01P11K74l67l89p32p04k53K03L97P26N55L89Q1l61p02q58l09
2745a095q1L60Q84M88P32l5l89o03p21p14j24N56N95O96J67L43j06o45o92o94
2765a078r1M15O16L81O59J78j59n65o49m65m15K40M10M79P13M85j26m68o89p05
2785h34j89J52O07M19L79O06J74q43p25m47o2m18N36M77P28L33P4m31j47q44k76
2806g31k7J15L42O63N31N4k34n61m16n12j57j84R37M37L81J41K13m86o27o19j5
2827g55k7M56N33K96M04N7l40n50p92p6k31M73N58M01K81J81l01m20m36m42j6
2848g46L91J89M61M94J65l54n43k27m68J9l75O48L87M38K01ol02l83m17k29j74
$$ plain form
2869 -831 -660 23 728 815 642 363 118 -302 -842 -1040 -546 -28 135 598 783 476 211 -144 -519 -726
2889 -726 -601 -185 360 558 547 687 501 -62 -770 -738 -657 -550 147 348 581 593 348 31 -481 -888 -586
2910 -586 -473 -72 364 804 925 431 -71 -316 -524 -803 -701 -70 530 497 596 371 282 -212 -517 -757 -517
2931 -517 -377 247 588 805 534 229 -122 -516 -789 -567 -450 132 438 656 593 301 250 -413 -716 -555 -373
2952 -373 189 466 454 654 293 5 -605 -547 -430 -433 -276 240 678 555 275 214 -93 -403 -563 -419 -317 158
2974 158 478 799 543 242 -199 -574 -712 -589 -501 244 502 673 415 410 -79 -309 -720 -447 -369 86 599
2995 599 453 630 290 235 -143 -625 -821 -351 -62 24 446 472 690 431 -209 -411 -533 -410 -150 127 359
3016 359 655 419 522 -193 -461 -454 -418 -325 -88 495 697 480 309 -13 -338 -426 -551 -451 -60 499 672 522
$$ packed form
2869h31J71O83P05Q7j73k79k45m20n40j98M94N18J63M63J85l07k65l55l75k07
2889g26J25M16N45J98j1J40j86n63p08L2Q1J07O97K01K33J2k45l17n12m07L02
2910e86J13M01M36M40J21m94n02k45k08k79J02O31O00l3R9k25q9m94l05k40K40
2931e17J40O24L41K17k71l05l51l94k73K22J17N82L06K18o3k92n1o63l03J61J82
2952c73N62K77j2K00l61k88o10N8J17lJ57N16M38j23k80o1l07l10j60J44J02M75
2974A58L20L21k56l01m41l75j38J23Q8P45K58J71k58nm89k30m11K73P8M55N13
2995E99j46J77l40n5l78m82j96M70K89Q6M22K6K18k59o40k02j22J23K60K77K32
3016C59K96k36J03p15k68PL6R3K37N83K02k17j71l22l25q8j25J00L91N59J73j50
$$ plain form
3038 522 386 177 -283 -354 -767 -584 -249 374 343 331 394 186 48 -341 -593 -585 -346 96 355 505 481 177
3060 177 -135 -341 -609 -690 -502 -195 305 506 657 512 139 -534 -641 -625 -376 -153 139 451 827 540 176
3081 176 -106 -721 -592 -721 -374 193 404 608 725 426 146 -366 -670 -537 -296 79 463 499 364 357 119
3102 119 -282 -587 -694 -692 -121 496 455 334 406 45 -354 -486 -538 -421 -29 209 248 564 513 258 -82 -521
3124 -521 -397 -398 -331 48 362 635 275 488 -188 -498 -503 -576 -343 -104 473 624 706 363 7 -349 -749 -863
3146 -863 -428 -286 230 501 669 593 141 -229 -443 -649 -633 -153 -61 615 676 570 281 -239 -304 -679 -770 -230
3168 -230 104 615 653 643 340 94 -481 -548 -723 -623 -79 319 740 727 583 5 -511 -619 -531 -503 -295 231
3190 231 517 837 451 233 -155 -541 -754 -676 -243 257 597 656 731 5 3 -434 -794 -470 -319 103 617 721
$$ packed form
3038E22j36k09m60p1m13J83L35O23l1j2O3k08j38l89k52QK39M42K59J50k4l04
3060A77l12k06k68q1J88L07N00K01J51j45l73o73j07J6K49K23K92L12L76k87l64
3081A76k82o15J29j29L47N67K11K04J17k99k80n12l04J33K41L75L84L6j35pk38
3102A19m01l05j07KN71O17m1j21P2l61l99j32n2J17L92K38L9L16n1k55l40m39
3124e21J24jO7L79L14K73l60K13o76l10np3K33K39N77J51Q2l43l56l56m00j14
3146h63M35J42N16K71J68p6m52l70k14k06J6M80R2O76O1j06k89n20o5l75r1N40
3168b30L34N11L8j0l03k46n75o7j75J00N44L98M21j3j44n78n16j08Q8K8K08N26
3190B31K86L20l86k18l88l86k13P8M33N00L40N9P5p26km37l60L24J51M22N14J04
$$ plain form
3212 721 623 319 -193 -459 -613 -671 -526 129 420 617 761 453 -10 -362 -742 -698 -542 -126 512 513 695 502
3234 502 264 -343 -532 -679 -660 -135 289 503 583 820 327 -97 -631 -766 -627 -307 93 579 711 540 377
3255 377 -52 -576 -695 -661 -481 22 408 806 732 489 -7 -557 -548 -863 -650 111 478 869 694 559 23
3276 23 -461 -535 -591 -569 -247 359 602 670 733 361 -296 -751 -815 -519 -394 102 574 950 673 309 -55 -731
3298 -731 -781 -820 -591 186 623 901 711 388 -195 -308 -942 -981 -614 -66 320 651 721 571 32 -458 -782
3319 -782 -770 -551 -174 299 884 816 766 550 -329 -637 -662 -717 -189 239 466 908 587 226 -401 -717 -846 -686
3341 -686 -522 110 708 727 832 417 -138 -569 -937 -972 -508 63 658 828 848 665 77 -594 -915 -936 -506
3362 -506 -175 675 969 929 750 12 -361 -730 -939 -621 124 184 677 1032 610 76 -440 -736 -850 -851 -300
$$ packed form
3212G21r8l04n12k66j54n8J45O55K91J97J44l08m63l52l80M4J56M16O38JJ82j93
3234E02k38o07j89j47J9N25M24K14Q0K37m93m24n34j35J39L20M00M86J32j71j63
3255C77m29n24j19L4J80N03L86L98p4k43m96n50Rl15K13P61L67L91j75j35n36
3276B3m84p4n6K2L22O06K43O8O3l72o57m55o4K96J25M96M72L76k77l64l64o76
3298g31n0l9K29P77M37K78j90l23n83j13o34l9L67N48L86L31P0j50n39m90l24
3319g82J2K19L77M73N85o8n0k16q79l08k5n5N28M28K27M42l21l61o27l16j29J60
3341f86J64O32N98J9J05m15n55m31l68l5M64N71N95J70K0j83n88o71l21k1M30
3362e06L31Q50K94m0j79p38l73l69k09L18P45O0M93L55m22n34n16k96j14jN51
$$ plain form
3383 -300 253 763 1069 759 604 -399 -639 -955 -733 -436 112 504 961 1008 626 -28 -629 -962 -989 -546
3403 -546 77 474 923 1040 534 97 -403 -734 -937 -715 -186 425 737 921 781 148 -490 -973 -1178 -819
3423 -819 -316 312 859 1273 792 273 -270 -888 -1064 -943 -296 175 538 707 625 149 -266 -726 -1004 -900
3443 -900 -359 11 683 860 990 623 -105 -616 -762 -1157 -603 -71 635 937 817 657 243 -568 -794 -1048
3463 -1048 -543 -164 433 852 892 672 244 -210 -844 -709 -647 -164 358 967 894 785 272 -254 -644 -916 -973
3484 -973 -437 183 612 1099 941 438 -85 -815 -1010 -1080 -513 31 614 875 960 439 178 -577 -963 -967 -851
3505 -851 -198 427 1097 1138 739 25 -607 -931 -1139 -776 -96 355 1032 854 873 321 -273 -688 -1001 -641 -128
3526 -128 324 917 1308 934 531 -135 -812 -1035 -1144 -626 189 617 1199 1068 596 -18 -662 -857 -842 -627
$$ packed form
3383c00N53N10L06l10j55j003k40l16K22K97N48L92M57M7l82o54o01l33k7M43
3403e46O23L97M49J17n06m37n00l31k03K22N29O11L12J84j40o33o38m83k05L59
3423h19N03O28N47M14m81n19n43o18j76J21O47M71L63J69q2m76m15m60k78J04
3443i00N41L70O72J77J30l67p28n11j46l95N54N32P06L02j20j60m14q11k26k54
3463a048N05L79N97M19M0k20m28m54o34J35O2M83N22O09p3j09n13n26l90k72n7
3484i73N36O20M29M87j58n03n23p30j95p0N67N44N83K61Q5n21k61p55l86mJ16
3505h51O53O25O70M1l99p14o32l24k08L63O80M51O77j78J9n52n94m15l13L60N13
3526a28M52N93L91l74m03o66o77k23j09N18Q15M28N82j31m72o14o44j95J5K15
$$ plain form
3546 -627 252 987 1054 1141 632 61 -653 -1018 -1235 -867 -76 477 1053 1069 952 108 -498 -765 -1089 -804 -183
3567 -183 632 892 1104 791 168 -577 -1002 -1077 -859 -343 390 695 1030 819 490 -251 -795 -1044 -814 -725 311
3588 311 649 926 1054 469 -269 -856 -1071 -961 -577 -101 552 1038 979 687 157 -723 -1069 -1208 -836 -163
3608 -163 582 1014 1055 664 134 -528 -901 -964 -946 -90 267 932 1048 956 234 -364 -1003 -1402 -879 -592 257
3629 257 865 1115 868 457 -253 -866 -1002 -903 -417 302 842 1056 988 394 -228 -745 -1356 -912 -586 -25 600
3650 600 988 985 713 -52 -577 -1042 -1042 -731 -64 577 1021 948 741 310 -503 -1099 -1035 -947 -483 495 712 1155
3672 1155 907 604 -216 -1017 -1271 -883 -288 231 765 1233 1059 509 -255 -839 -1130 -1083 -604 220 643 780
3692 780 1250 593 7 -861 -1148 -1214 -649 23 653 988 1069 988 9 -575 -1103 -1210 -862 -234 399 1117 1209
$$ packed form
3546f27Q79P35O7Q7n09n71p14l65k17L68P91N53N76J6j17q44o06k67l24K85O21
3567a83Q15K60K12l13o23p45m25p5K18N16P33L05L35k11l29p41n44k49K30Q9J036
3588C11L38K77J28n85p38n87k15J10L84M76O53M86n9k92n30q80l46j39L72O73
3608a63P45M32M1l91n30o62l73o3J8Q56L57O65J16r2p22n98o39l99N23K87Q49
3629B57O08K50k47m11p10o13j36R9M86P19N40K14o8n94o22n17o11M44L26N61O25
3650F00L88lk72p65n25m65%L11O67O41M44p3k07m31q13n96O4Q8M64R78K17M43
3672A155k48l03q20q01k54L88N95N19N34M68j74n50p64n84k91M7M79Q24M23J37
3692G80M70o57n86q68k87o6N65O72O30L35Q1q1r79n84n28j07L48O28O33P18R2
$$ plain form
3713 1209 789 127 -516 -1319 -1250 -827 -375 390 998 1133 938 247 -267 -1054 -1117 -1169 -414 272 896 1445 1018
3734 1018 395 -421 -821 -1244 -1088 -546 83 802 1115 1055 694 -216 -735 -1254 -1005 -981 -90 617 1073 1140 766
3755 766 91 -765 -1010 -1260 -996 41 912 1135 1171 1000 384 -429 -841 -1169 -1016 -236 487 1054 1120 1088 235
3776 235 -316 -984 -1141 -1008 -306 255 980 1244 1056 529 -186 -765 -875 -1088 -586 250 860 1261 1052 727
3796 727 -1 -643 -1125 -1026 -607 224 835 1071 1226 788 32 -671 -1110 -1386 -615 -88 449 1081 1098 800 228
3817 228 -535 -1122 -1163 -761 -286 407 857 1226 834 297 -455 -959 -1205 -961 -417 124 776 1098 812 377
3837 377 -138 -755 -1246 -1081 -749 175 1025 1127 1264 646 -94 -866 -1160 -1113 -680 -54 834 1138 1208 888 -75
3858 -75 -623 -1101 -1117 -924 -152 494 1290 1289 720 174 -581 -1063 -999 -1028 -264 430 953 1156 1108 356 -275 -1003
$$ packed form
3713A209m20o62o43q03O9M23M52P65O08J35j95o91n14p87o3n2P55O86O24N49m27
3734A018o23q16m00m23J56N42O29P19L13o0l61r10n19n19K49K4Q91P07M56O7l74
3755G66o75q56k45k50K64J037Q71K23L6j71o16q13m12l28J53P80P23N67O6l2q53
3776B35n51o68j57J33P02N61P25K64j88n27p15n79j10k13N02Q36O10M01k09l25
3796G27p28o42m82R9M19Q31O11K36J55m38p56p03m39k76P71N27N37O32J7k98n72
3817B28p63n87m1M02M75O93M50L69l92n37p52n04k46K44N44N41O52L22k86m35
3837C77n15o17m91J65L32R24Q50J02J37o18p40p72k94M7M33O26Q88L04P0l20r63
3858g5n48m78j6J93P72O46P96jn69n46p55m82O4k9P64O94N23K03m8p52o31p28
$$ plain form
3880 -1003 -1210 -996 -346 247 863 1225 1050 610 -35 -878 -1162 -1195 -585 270 876 1201 1282 712 7 -728
3900 -728 -1240 -1119 -675 -23 556 1153 1049 883 -61 -781 -1250 -1126 -686 -166 458 980 1042 872 79 -483
3920 -483 -1180 -982 -903 -215 362 1060 1148 1080 478 -438 -892 -1284 -894 -381 436 797 1151 968 712 -273 -991
3941 -991 -1330 -993 -576 58 776 1293 1110 701 48 -570 -1142 -1176 -908 -123 652 1119 1168 751 96 -509 -1133
3962 -1133 -1402 -771 -156 520 1041 1173 854 102 -492 -1138 -1231 -979 -270 397 876 1267 813 401 -326 -936
3982 -936 -1230 -973 -214 552 698 1327 1168 483 -390 -818 -1042 -985 -526 17 806 1198 932 556 -63 -1076
4002 -1076 -1142 -1072 -808 -171 598 1115 1105 632 200 -683 -1077 -1199 -990 -72 716 949 1405 838 278 -613 -977
4023 -977 -1154 -925 -286 447 1007 1165 954 229 -395 -784 -1208 -1026 -159 310 931 1202 931 367 -138 -1032
$$ packed form
3880a003k07K14O50N93O16L62j75m40o45q43k84l3O10Q55O06L25Q1n70p05p35
3900g28n12J21M44O52N79N97j04j66r44p20m69J24M40N20O24N22O2j70p93n62
3920d83o97J98P9O88N77O98Q8o8o02r16m54l92L90N13Q17L61L54j83k56r85p18
3941i91l39L37M17O34P18N17j83m09o53o18n72l4K68P85P75M67M9m17o55o05o24
3962a133k69O31O15O76N21J32l19p52n94o46r3K52P09O67M79L91m54m12p27o10
3982i36k94K57P59P66J46O29j59o85q73m28k24N7M59N43P89L92k66l76o19j013
4002a076o6P0K64O37P69N17j0m73m32q83l94j22K09R18P88K33M56n67n60q91l64
4023i77j77K29O39P33N60J58k11p25o24l89m24J82Q67M69O21K71k71n64n05q94
$$ plain form
4043 -1032 -1270 -1032 -377 184 804 1023 906 584 6 -874 -1225 -1109 -697 -252 652 1055 1308 565 -7 -643
4063 -643 -1127 -1164 -887 -72 321 1029 1331 690 249 -517 -940 -1159 -1083 -252 368 852 1322 899 458 -228 -942
4084 -942 -1107 -841 -213 303 649 985 932 485 -410 -911 -1237 -1127 -517 159 849 1127 1222 695 -70 -714 -1113
4105 -1113 -975 -492 308 739 773 957 825 127 -576 -1063 -1109 -842 79 401 897 956 867 270 -441 -1070 -1255
4126 -1255 -866 -313 341 1081 1243 809 480 -343 -864 -1062 -1172 -466 341 822 1051 993 464 -294 -623 -1208
4146 -1208 -888 -701 -26 614 1067 1197 594 -273 -858 -1031 -856 -551 -141 588 1121 1099 462 8 -540 -875
4166 -875 -1001 -536 76 642 1023 1016 833 227 -632 -873 -1065 -779 -202 417 1095 1263 1072 209 -404 -948 -1081
4187 -1081 -835 -436 345 996 1078 904 287 -387 -819 -1180 -838 -299 105 808 1088 1062 720 -176 -834 -780 -1091
$$ packed form
4043a032k38K38O55N61O20K19j17l22n78q80l51J16M12M45R04M03K53p43n72o36
4063f43m84l7K77Q15L93P08L02o41m41p66m23k19P6Q31O20M84M70m23m41o86p14
4084i42j65K66O28N16L46L36n3m47q95n01l26J10O10O76O90K78R5n27p65o44l99
4105a113J38M83Q00M31L4J84j32o98p03m87m6K67R21L22M96N9q9n97p11o29j85
4126a255L89N53O54P40J62m34l29q23n21j98j10P06Q07M81K29n8n29p58l29n85
4146a208L20J87O75O40M53J30o03q67n85j73J75L05M10P29N33k2o37m54n48l35
4166h75j26M65O12N66L81pj83o06q59k41j92K86N77O19O78J68j91q63o13n44j33
4187a081K46L99P81O51Q2j74o17o74m32l61L42N39M04P03K80k6l42q96o58N4l11
$$ plain form
4208 -1091 -534 -106 639 1031 1101 816 99 -746 -1035 -1073 -769 -144 581 1068 1350 633 55 -561 -855 -843 -659
4229 -659 -328 738 842 1034 912 321 -327 -880 -982 -791 -230 284 936 1098 970 298 -154 -725 -1011 -897
4249 -897 -418 243 698 1139 1022 521 -137 -783 -1054 -1089 -589 305 527 1129 1164 764 -142 -704 -1034 -960 -746
4270 -746 -7 402 773 996 641 194 -470 -817 -1139 -828 -385 599 1034 1107 708 120 -258 -805 -1125 -1049 -393
4291 -393 234 883 1066 891 339 -105 -693 -923 -935 -505 4 749 1119 898 557 -150 -595 -918 -1106 -608
4311 -608 276 821 989 1153 717 223 -589 -930 -1058 -648 -32 641 944 1146 893 100 -232 -1060 -1231 -845
4331 -845 -64 117 762 1027 931 278 -378 -972 -1109 -808 -379 92 827 1088 732 476 -296 -714 -932 -1033
4351 -1033 -485 334 796 1157 841 490 -116 -610 -1075 -845 -529 49 927 965 888 591 -20 -571 -989 -889
$$ packed form
4208a091N57M28P45L92P0k85p17q45k89l8L04O25P25M87K82p17n78o16k94J2J84
4229f59L31J066J04J92j22n91o48n53j02J91N61N14O52J62j28o72m52n71k86J14
4249h97M79O61M55M41j17n01o58o46k71l5N00Q94K22O02L5m00r06n62l30P4K14
4270g46P39M09L71K23l55m47o64l47l22L11M43R84M35P3l99n88l78n47l20P6O56
4291c93O27O49J83j75n52m44n88k30j2M30N09P45L70k21l41p07m45l23j88M98
4311f08Q84N45J68J64m36m94q12l41j28M10O16O73L03K02k53p93l32q28j71L86
4331h45P81J81O45K65r6o53o56n94j37L01M29M71P35K61l56k56p72m18k18j01
4351a033N48Q19M62L61l16l51o06m94m65K30L16N78Q78L8p7k97o11n51m18J00
$$ plain form
4371 -889 -805 -72 664 918 911 555 -72 -427 -1076 -1035 -636 -263 365 809 1224 902 227 -422 -958 -921 -894 -242
4393 -242 440 1151 974 701 454 -228 -772 -1021 -945 -535 183 657 960 948 488 -241 -566 -990 -1080 -652 -52
4414 -52 449 953 916 584 164 -468 -1107 -1068 -765 -4 715 1031 986 911 107 -420 -974 -1054 -400 -153 317 983
4436 983 990 845 348 -416 -1013 -1146 -736 -235 529 731 1036 673 251 -293 -908 -1106 -902 -387 243 500 952
4457 952 716 597 -83 -634 -941 -1048 -569 -71 823 948 830 531 14 -510 -922 -958 -353 -49 528 1054
4477 1054 1046 626 -17 -559 -775 -1158 -619 -246 214 789 972 649 151 -343 -861 -973 -921 -236 176 884 815
4498 815 876 229 -116 -785 -1071 -951 -257 248 732 1150 884 529 -192 -815 -793 -942 -556 123 525 653 975
4519 975 436 -10 -604 -792 -956 -552 -74 541 744 934 537 246 -536 -896 -911 -662 -125 311 663 995
$$ packed form
4371h89Q4P33P36K54pl56o27l55o49M1L99L73O28M44M15l22o75o49n36L7K7O52
4393b42O82P11j77k73k47o82n44k49P6M10P18M74L03j2m60p29l25m24r0M28O00
4414e2N01N04l7l32m20o32o39L9L03P61P19L16m5p5q04n27n54q0O54K47M70O66
4436I83Pj45m97p64n97j33M10N01P64K02L05l63m22n44o15j98K04N15O30K57M52
4457I52k36j19o80n51l07j07M79M98Q94J25j18k99n17n24m12l6O05L04N77N26
4477A054qm20o43n42k16l83N39L73M60N75J83l23m98m94n18j12N2O85M12P08o9
4498H15O1o47l45o69k86J20O94N05M84M18k66l55p21o23K2j49L86O79M02J28L22
4519I75n39m46n94j88j64M04M78O15K03J90l97k91p82l60j5K49N37M36L52L32
$$ plain form
4539 995 732 291 -352 -815 -1079 -693 -197 94 794 1054 837 252 47 -775 -1091 -947 -486 199 693 847
4559 847 784 439 -261 -539 -951 -969 -424 70 566 836 937 441 -422 -569 -846 -841 -641 -69 494 806 937
4580 937 438 -62 -556 -893 -1054 -698 -162 300 804 1069 716 101 -399 -830 -955 -923 -147 319 604 878
4600 878 790 400 -290 -615 -860 -846 -392 178 482 1057 840 175 -87 -696 -1073 -830 -521 80 630 888 1076
4621 1076 396 -159 -534 -823 -852 -721 -227 696 781 1001 696 77 -425 -843 -946 -614 -32 445 883 889 580
4642 580 225 -467 -804 -812 -487 -110 331 768 986 537 337 -499 -651 -1070 -696 -85 153 653 809 863 324
4663 324 -180 -568 -1049 -799 -394 -7 629 670 643 448 -122 -651 -799 -832 -665 -170 514 904 828 519 94
4684 94 -526 -914 -793 -640 -163 398 910 1048 611 107 -309 -820 -983 -646 -37 484 549 921 795 311 -143
$$ packed form
4539I95k63m41o43m63k64L86M96K91P00K60k17n85k05q22l16J44M61O85M94J54
4559H47o3l45p00k78m12j8N45M94M96K70J01m96q63j47k77NK00N72N63L12J31
4580I37m99n00m94l37j61L56N36M62N04K65l53o15n00m31j25L2P76M66K85K74
4600H78q8l90o90l25k45J4M54N70L04N75k17o65k62o09l77K43L09O01N50K58J88
4621A076o80n55l75k89k9J31M94R23Q5K20l05o19n02m18j03L32N82M77M38Ol09
4642E80l55o92l37qL25L77M41M37K18m49k00q36j52m19L74O11K38N00J56N4n39
4663C24n04l88m81K50M05L87O36M1k7j95n70n29j48l3J67M95O84L90p6l09m25
4684I4o20l88J21J53M77N61N12J38m37n04m16n11j63L37O09N21O5L72j26m84m54
$$ plain form
4705 -143 -561 -846 -590 -230 227 578 789 821 212 -342 -698 -985 -778 -353 222 701 764 668 560 48 -556
4726 -556 -840 -547 -348 137 550 742 840 355 143 -495 -917 -672 -523 -72 650 1079 975 580 119 -256
4746 -256 -749 -960 -565 -224 327 534 814 672 176 -195 -778 -1112 -656 -253 50 483 854 635 219 -133
4766 -133 -988 -397 -766 -350 0 554 771 949 520 -91 -514 -849 -655 -346 -32 435 745 506 584 -36
4786 -36 -523 -826 -663 -675 -273 410 589 608 578 243 -315 -718 -836 -655 -134 85 723 812 721 221 -291 -474
4808 -474 -751 -767 -314 228 866 680 585 331 -274 -558 -1008 -622 -359 96 624 849 779 452 -42 -708 -670
4829 -670 -917 -309 -96 507 798 773 525 48 -514 -639 -744 -466 -35 281 559 578 530 209 -337 -789 -803
4850 -803 -467 -329 79 661 963 657 261 -214 -601 -657 -549 -293 307 691 681 628 190 -172 -595 -768 -739
$$ packed form
4705a43m18k85K56L60M57L51K11L2o09n54l56k87K07M25N75M79O3r6j08n12o04
4726e56k84K93J99M85M13J92R8m85k12o38m22K45J49M51P22M29j04l95m61l75
4746b56m93k11L95L41N51K07K80j42m96l71n83l34M56M03L03M33L71k19m16l52
4766a33q55N91l69M16L50N54K17J78m29o11m23l35J94L09L14M67L10k39P8o20
4786c6m87l03J63j2M02O83J79J9l0l35n58m03j18J81N21K19O38Q9r1n00n12j83
4808d74k77j6M53N42O38j86r5k54o05k84m50L86K63M55N28K25p0l27m94o66L8
4829f70k47O08K13O03K91k5k48m77n62j25j05K78M31L16K78J9m8l21n46m52j4
4850h03L36J38M08N82L02l06l96m75l87n6J08K56O00L84j0n3m38l62m23j73K9
$$ plain form
4871 -739 -267 105 462 943 565 387 -133 -441 -695 -698 -504 -143 515 688 714 388 10 -449 -637 -925 -476
4892 -476 -110 343 860 630 744 15 -327 -545 -926 -718 -209 428 645 695 550 268 -213 -530 -810 -740 -311
4913 -311 131 563 795 777 347 -280 -901 -614 -659 -271 185 432 790 583 303 -283 -428 -532 -532 -492 -142 379
4935 379 735 796 530 -202 -302 -564 -763 -502 79 216 614 738 382 -74 -433 -764 -848 -802 -190 253 648
4956 648 818 491 213 -314 -871 -876 -664 -134 129 590 712 674 326 -260 -635 -768 -846 -277 -52 377 616
4977 616 739 363 -51 -507 -777 -770 -532 207 347 724 679 380 142 -262 -531 -663 -710 -59 516 760 514
4998 514 386 79 -486 -649 -934 -716 -80 212 644 821 444 78 -411 -649 -798 -617 -194 15 725 727 455
5019 455 173 -457 -629 -521 -465 -193 32 493 738 510 563 -165 -590 -682 -576 -502 288 450 789 711 284 -31
$$ packed form
4871g39M72L72L57M81l78j78n20l08k54lJ94L61O58J73K6l26l78m59j88k88M49
4892d76L66M53N17k30J14p29l42k18l81K08N09O37K17N0j45k82m81l17k80P0M29
4913c11M42M32K32j8m30o27o21K87m5L88M56K47L58k07k80n86j45j04%M0L50N21
4935C79L56O1k66p32j00k62j99K61N81J37L98J24l56m56l59l31q4M6O12M43L95
4956F48J70l27k78n27n57nK12N30K63M61J22l8l48n86l75j33p8N69K25M29K39
4977F16J23l76m14m56k70PK38P39J40L77m5k99k38m04k69j32m7O51N75K44k46
4998E14j28l07n65j63k85K18O36K92M32J77l77l66m89k38j49J81M23K09P10Kk72
5019D55k82o30j72J08N6K72K25M61K45k28N3p28m25r2J06P4P90J62L39p8m27l15
$$ plain form
5041 -31 -524 -818 -704 -361 -16 451 754 681 337 40 -374 -621 -756 -596 -45 498 572 629 523 29 -333
5062 -333 -611 -785 -468 -316 271 605 773 640 128 -171 -583 -714 -625 -118 96 668 854 519 188 -183
5082 -183 -471 -607 -628 -268 142 384 540 568 231 -104 -512 -802 -595 -542 -54 489 756 818 413 -18 -393
5103 -393 -781 -652 -115 -40 483 592 765 646 -82 -343 -542 -520 -425 -24 315 747 695 255 193 -264 -747 -579
5125 -579 -758 -522 216 505 626 397 13 -148 -550 -832 -395 -496 56 449 880 592 673 -218 -459 -680
5145 -680 -734 -250 164 507 546 639 310 -59 -514 -566 -605 -625 -130 542 566 669 507 55 -311 -682 -591 -546 -44
5168 -44 10 521 586 592 170 -181 -452 -798 -521 -263 318 495 500 416 399 -221 -351 -524 -611 -186 124 450 803
5191 803 591 227 -161 -159 -651 -617 -524 109 423 562 554 269 57 -257 -358 -698 -364 -6 192 480 487 434 80
$$ packed form
5041c1m93k94J14L43L45M67L03p3l44k97m14k47j35J60N51N43P4N7j06m94l62
5062c33k78j74L17J52N87L34J68j33n12k99m12j31Q9N07K14N72J86l35l31l71
5082a83k88j36k1L60M10K42J56K8l37l35m08k90K07N3M88N43K67O2m05m31l75
5103c93l88J29N37P5N23J09J73j19p28k61j99K2R5M01L39M32n2m40o2m57m83J68
5125e79j79K36P38K89J21k29l84j61m02k82M37j01N52L93M31k88Q1q91k41k21
5145f80n4M84M14L43L9R3l29l69m55n2l9k0M95O72K4J03j62m52l66l71R1M5N02
5168d4N4N11O5Om22l51k71l46K77K58N81J77Nq4j7o20j30j73q7M25L10L26L53
5191H03k12l64l88Km92L4R3O33L14J39qk85k12l14j01l40L34L58J98K88Pn3l54
$$ plain form
5214 80 -422 -724 -749 -455 -106 459 462 721 600 66 -107 -515 -1026 -627 -286 139 630 812 476 319 -152
5235 -152 -450 -801 -647 -200 334 403 533 518 407 -20 -626 -763 -544 -318 94 454 803 553 304 -7 -598
5256 -598 -504 -778 -421 -117 386 381 763 482 141 -192 -612 -657 -532 136 186 501 559 507 370 -389 -644 -774
5278 -774 -517 -22 387 319 716 780 116 -64 -524 -655 -528 -96 319 306 686 438 309 141 -341 -599 -570
5299 -570 -407 -7 517 701 630 450 -3 -348 -710 -514 -193 -1 380 699 803 479 97 -318 -673 -712 -384
5320 -384 -54 200 596 796 386 2 -258 -575 -748 -342 -196 146 607 536 447 156 -259 -515 -557 -469 -323
5341 -323 -10 429 584 646 87 -200 -538 -536 -276 -288 -7 610 435 667 500 -10 -376 -537 -529 -379 49 347
5363 347 557 598 451 231 -413 -670 -771 -274 -123 319 605 567 449 270 -315 -483 -595 -282 -47 77 633
$$ packed form
5214H0n02l02k5K94L49N65LK59j21n34j73m08n11L99L41M25M91J82l36j57m71
5235a52k98l51J54M47N34O9J30j5j11m27o06j37K19K26M12L60L49k50k49l11n91
5256e98R4k74L57L04N03nL82k81l41l33m20m5J25O68N0L15N8n2j37p59k55j30
5278g74K57M95M09o8L97O4o64j80m60j31J27M32M15j3L80k48j29j68m82k58K9
5299e70J63M00N24J84p1j80m53l45l62J96L21J92L81L19J04l24l82m15l55l9L28
5320c84L30K54L96K00m10l84k60l17j73M06J46L42M61p1q9k91m15k56m2Q8J46
5341c23L13M39J55O2n59k87l38KK60j2K81O17j75K32j67n10l66j61QJ50M28K98
5363C47K10M1j47k20o44k57j01M97J51M42K86l8j18j79n85j68j12L13K35J24N56
$$ plain form
5384 633 643 791 210 -174 -480 -423 -384 -202 338 660 552 359 206 -113 -470 -612 -800 -353 120 414 606
5405 606 620 326 84 -340 -681 -533 -174 177 323 606 661 176 29 -346 -615 -674 -323 58 325 531 895
5426 895 283 196 -109 -705 -509 -433 -177 258 495 689 383 273 158 -338 -616 -484 -198 -23 550 624 540
5447 540 263 -181 -476 -784 -570 -240 7 346 717 555 353 -92 -481 -527 -592 -329 102 293 238 502 562
5468 562 -8 -145 -480 -528 -608 -262 350 482 654 404 212 -229 -473 -795 -547 -155 123 489 815 292 117
5489 117 -93 -330 -602 -305 31 305 509 445 527 -9 -240 -406 -628 -496 -372 -37 560 614 489 366 -16
5510 -16 -573 -605 -595 -387 -54 356 515 804 486 35 -314 -618 -399 -536 5 67 466 728 550 -143 -270
5531 -270 -529 -681 -333 -40 218 498 470 453 224 -316 -504 -478 -564 -177 -107 394 502 339 158 -69 -503 -562
$$ packed form
5384F33J0J48n81l84l06N7L9J82N40L22j08j93j53l19l57j42j88M47M73K94J92
5405F06J4k94k42m24l41J48L59L51J46K83N5m85j47l75k69n9L51L81K67K06L64
5426H95o12q7l05n96J96P6K56M35K37J94l06j10j15m96k78J32K86J75N73P4q4
5447E40k77m44k95l08K14L30K47L39L71j62k02m45l89m6o5K63M31J91n5K64O0
5468E62n70j37l35m8q0L46O12J32J72k50j92m41k44l22K48L92K78L66L26n23j75
5489A17k10k37k72K97L36K74K04o4Q2n36k31j66k22J32J24L35N97N4j25j23l82
5510a6n57l2J0K08L33M10J59K89l18m51l49l04K19j37N41O2L99K62j78o93j27
5531b70k59j52L48K93K58K80k8j7k29n40j88K6q6L87P0N01J08j63j81k27m34n9
$$ plain form
5553 -562 -341 -293 -47 393 610 639 285 -43 -312 -667 -544 -401 145 644 395 638 331 9 -459 -513 -540
5574 -540 -345 -13 291 435 430 403 62 -306 -431 -737 -370 42 58 511 483 471 46 -301 -570 -571 -589 -132 250
5597 250 466 607 577 99 71 -537 -378 -236 -307 -33 645 685 629 298 91 -382 -842 -605 -176 120 264 559
5619 559 534 238 105 -326 -462 -638 -348 -138 248 719 585 458 -5 -225 -636 -722 -354 26 224 446 632
5640 632 702 36 -312 -475 -664 -399 -77 208 396 436 526 165 -197 -508 -613 -540 -141 239 257 567 422 362
5662 362 79 -446 -406 -267 -197 156 370 468 624 261 -21 -338 -580 -689 -279 -72 234 433 374 384 33 -509
5684 -509 -670 -364 -346 74 477 594 699 258 24 -54 -301 -322 -309 -169 140 485 725 543 230 -235 -674
5705 -674 -659 -450 -218 116 601 489 500 236 -9 -510 -500 -386 -205 146 469 528 330 221 -51 -295 -392 -571
$$ packed form
5553e62K21M8K46M40K17K9l54l28k69l55J23J43N46M99k49K43l07l22m68n4k7
5574e40J95L32L04J44nk7l41l68j25l06L67M12J6M53k8j2m25l47k69jj8M57L82
5597B50K16J41l0m78k8o08J59J42p1K74O78M0n6l31k07m73m60K37M29K96J44K95
5619E59k5k96j33m31j36j76K90K10L86M71j34j27m63k20m11q6L68L80J98K22J86
5640F32P0o66l48j63j89K65L22K85J88M0R0l61l62l11j05P3L99L80J8L10j45o0
5662C62k83n25M0J39P0L53K14R8J56l63k82l17k42j09M10K07L06J99n9J0l51n42
5684e09j61L06J8M20M03J17J05m41k34p8k47k1J3J40L09L45K40j82l13m65m39
5705f74J5K09K32L34M85j12J1k64k45n01J0J14J81L51L23N9j98j09k72k44r7j79
$$ plain form
5727 -571 -390 94 248 390 538 436 -94 -301 -452 -562 -450 11 306 459 668 673 39 -151 -589 -822 -455
5748 -455 -91 356 380 567 522 230 -274 -530 -504 -452 -153 12 429 551 457 107 -203 -570 -440 -407 -308 95
5770 95 398 593 602 423 -12 -491 -642 -598 -605 99 193 701 643 186 63 -205 -409 -386 -262 -47 392 458 408 243
5794 243 -3 -304 -638 -444 -308 -208 278 536 626 386 51 -174 -413 -737 -404 5 86 433 515 613 89
5815 89 -200 -537 -505 -400 -141 174 282 563 358 -19 -131 -455 -602 -124 -212 71 473 325 679 299 -9
5836 -9 -404 -491 -555 -192 -202 160 747 538 390 213 -226 -763 -653 -343 -150 196 571 607 320 46 -202 -582
5858 -582 -732 -543 -149 114 418 507 369 124 -151 -464 -431 -321 -90 314 360 411 448 192 47 -230 -724 -408
5880 -408 -484 -87 286 528 402 213 -112 -210 -436 -573 -327 -9 268 464 534 483 365 -196 -551 -522 -547 -298
$$ packed form
5727e71J81M84J54J42J48j02n30k07j51j10J12M61K95J53K09No34j90m38k33L67
5748d55L64M47K4J87m5k92n04k56K6N2K99J65M17J22r4l50l10l67J30L3R9M03
5770I5L03J95Rj79m35m79j51M4pP04R4N08n8m57j23k68k04K3J24K15M39O6n0j65
5794B43k46l01l34J94J36J00M86K58R0k40l35k25k39l24L33M09Q1L47Q2R8n24
5815H9k89l37L2J05K59L15J08K81k05l77j12l24j47M78q8K83M02j48L54l80l08
5836il95q7o4L63j0L62N87k09j48j77m39n37J10L10J93L46L75L6k87k74k48l80
5858e82j50J89L94K63L04Q9j38k45k75l13L3J10K31M04M6N1L7k56j45k77m94L16
5880d08p6L97L73K42j26j89l25r8k26j37K46L18K77J96P0n1j18n61l55K9k5K49
$$ plain form
5902 -298 307 577 453 401 328 -341 -390 -381 -424 -247 188 555 277 438 269 3 -599 -644 -435 -212 14 347
5924 347 691 475 3 -169 -254 -543 -657 -313 20 353 415 446 409 230 -303 -635 -474 -277 -50 178 342
5945 342 585 560 48 -301 -569 -615 -465 -165 432 462 580 582 33 -187 -254 -632 -478 -184 102 491 668 456
5967 456 170 -97 -407 -557 -470 -219 106 353 470 378 148 -187 -428 -556 -348 -232 59 270 701 418 211
5988 211 -168 -456 -358 -451 -269 88 443 443 490 345 67 -357 -587 -428 -344 -26 296 610 448 326 -57 -375
6010 -375 -612 -446 -432 -177 108 526 672 508 87 -270 -439 -466 -393 -200 82 315 544 430 244 -69 -397
6031 -397 -436 -481 -471 79 542 517 777 241 -28 -120 -573 -738 -431 -30 86 257 284 490 -165 -567 -512 -442 -434
6054 -434 90 210 535 553 277 162 -326 -458 -604 -317 7 345 400 578 472 39 -313 -413 -459 -395 -193
$$ packed form
5902b98O05K70j24n2p3o69m9Rm3J77M35L67k78J61j69k66o02m5K09K23K26L33
5924C47L44k16m72j72q5k89j14L44L33L33O2L1l7j79n33l32J61J97K27K28J64
5945C42K43k5n12l49k68m6J50L00N97L0J18Kn49k20o7l78J54K94K86L89J77k12
5967D56k86k67l10j50Q7K51L25K47J17r2k30l35k41j28K08J16K91K11M31k83k07
5988B11l79k88R8r3J82L57L55%M7j45k78m24k30J59Q4L18L22L14j62j22l83l18
6010c75k37J66J4K55K85M18J46j64m21l57j69k7P3J93K82K33K29j14j86l13l28
6031c97l9m5J0N50M63k5K60n36k69r2m53j65L07M01J16J71K7K06o55m02N5P0Q
6054d34N24J20L25J8k76j15m88j32j46K87L24L38N5J78j06m33l52j00m6O4K02
$$ plain form
6075 -193 145 476 496 363 366 -126 -309 -438 -444 -254 204 368 333 481 312 -141 -377 -437 -445 -278 -117 290 461
6098 461 540 343 -153 -184 -354 -475 -519 -133 78 406 759 449 138 -285 -352 -542 -408 -85 155 443 567
6119 567 432 169 -166 -570 -489 -405 -306 175 651 696 484 320 -147 -402 -528 -351 -262 36 445 585 588 187
6141 187 -178 -157 -547 -539 -358 -129 122 571 640 54 4 -179 -367 -677 -313 -98 568 472 333 441 113 -243
6163 -243 -296 -504 -259 -112 54 524 676 287 250 -160 -374 -549 -439 -58 266 510 529 325 303 -51 -333
6184 -333 -427 -470 -245 -32 340 694 512 369 13 -315 -288 -588 -350 -226 403 554 680 256 -83 -263 -513
6205 -513 -481 -270 -10 58 355 523 391 58 -276 -589 -562 -559 -189 120 507 482 664 124 -195 -310 -602 -498
6227 -498 -284 334 230 335 395 259 -59 -336 -523 -382 -532 98 570 348 525 410 -48 -476 -322 -526
$$ packed form
6075a93L38L31K0j33Lm92j83j29oJ90M58J64l5J48j69m53k36o0qJ67J61M07J71
6098D61P9j97m96l1j70j21m4L86K11L28L53l10l11m23o7j90J34L23K40K88J24
6119E67j35k63l35m04Q1Q4R9M81M76M5k12j64m67k55j26J77Q9K98M09J40Lm01
6141A87l65K1l90QJ81K29K51M49O9n86n0j83j88l10L64K15O66r6j39J08l28l56
6163b43n3k08K45J47J66M70J52l89l7m10k14j75J10L81L24K44J9k04k2l54k82
6184c33r4m3K25K13L72L54j82j43l56l28K7l00K38J24O29J51J26m24l39j80k50
6205e13L2K11K60O8K97J68j32l33l34l13K7LL70L09L87k5J82n40l19j15k92J04
6227d98K14O18j04J05O0j36l18k77j87J41j50O30M72k22J77j15m58m28J54k04
$$ plain form
6247 -526 -145 -25 267 558 626 194 178 -398 -881 -406 -391 -177 59 398 722 614 170 -338 -277 -573 -380
6268 -380 -178 270 388 473 357 252 -37 -553 -494 -414 8 94 246 594 330 122 46 -400 -477 -456 -348 24
6290 24 525 527 600 284 -64 -243 -594 -513 -237 228 21 497 626 299 30 -402 -480 -442 -353 -191 69 508 714
6313 714 280 54 -122 -473 -760 -197 -133 236 456 388 283 132 -99 -360 -674 -218 -142 266 263 598 397 332
6335 332 -127 -387 -423 -623 -156 27 272 352 432 234 -107 -397 -521 -416 -419 -46 453 464 441 402 -49 -384 -606
6358 -606 -538 -454 114 265 367 369 289 -114 -71 -358 -259 -247 -143 103 367 387 510 135 -97 -361 -469 -593 -139
6381 -139 101 258 689 382 255 -234 -186 -620 -279 -12 192 413 666 425 372 32 -172 -429 -511 -337 188
6402 188 426 525 431 232 -29 -393 -651 -685 -230 -91 201 396 311 378 -99 -297 -359 -340 -411 -132 202 340 297
$$ packed form
6247e26L81J20K92K91O8m32j6n76m83M75J5K14K36L39L24j08m44n08O1k96J93
6268c80K02M48J18Q5j16j05k89n16N9Q0M22Q6J52L48k64k08p6m46p7K1J08L72
6290B4N01KP3l16l48j79l51Q1K76M65k07M76J29l27k69m32p8L8Q9J62K60M39K06
6313G14m34k26j76l51k87N63O4L69K20o8j05j51k31k61l14M56P6M08lL35k01o5
6335C32m59k60l6k00M67J83K45Q0Q0j98l41k90j24J05lL73M99J1k3l9m51l35k22
6358f06O8Q4N68J51J02Kq0m03M3k87R9J2J04K46K64K0J23l75k32k64j08j24M54
6381a39K40J57M31l07j27m89M8m34L41K67K04K21K53k41n3l40k04k57q2J74N25
6402A88K38R9r4j99k61l64k58l4M55J39K92J95q5O7m77j98o2J9p1K79L34J38m3
$$ plain form
6425 297 252 -2 -217 -277 -499 -595 -198 159 463 414 339 63 58 -434 -558 -469 -385 182 297 393 320 156 -215 -544
6449 -544 -540 -283 -280 95 168 445 497 377 -16 -166 -532 -356 -255 -178 207 370 323 355 75 -12 -396 -525 -397
6472 -397 77 77 370 401 384 18 -213 -564 -344 -548 -366 187 451 500 271 184 -58 -107 -517 -281 -260 136 537
6495 537 576 580 395 -69 -385 -472 -476 -277 121 222 330 334 269 170 -277 -384 -524 -205 26 230 655 510 269
6518 269 44 -210 -401 -627 -489 -153 150 642 526 401 239 -146 -414 -284 -458 -263 173 379 437 423 151
6539 151 1 -363 -529 -348 -467 22 183 362 210 360 -46 -346 -379 -432 -236 35 516 338 431 357 -127
6560 -127 -307 -643 -685 26 194 326 444 271 372 291 -331 -346 -374 -129 -397 193 362 596 217 140 -227 -284
6582 -284 -611 -483 -146 186 284 382 474 68 -245 -460 -440 -480 -187 72 234 377 264 227 43 -118 -483 -254
$$ packed form
6425B97m5k54k15o0k22r6L97L57L04m9p5k76nm92j24Q9Q4N67J15R6p3j64l71l29
6449e44MK57LL75P3K77N2j20l93j50l66J76J01P7L85J63m7L2k80q7l84j29J28
6472c97M74%K93L1j7l66k31l51K20k04J82N53K64M9k29q7k42m9m10K36K1L96M01
6495E37L9Mj85m64l16q7mJ99L98J01J08Mo5r9m47j07j40L19K31K04M25j45k41
6518B69k25k54j91k26J38L36L03M92j16j25j62l85k68J30j74J95M36K06N8j4k72
6539A51j50l64j66J81j19M89J61J79j52J50m06l00l3n3J96K71M81j78R3p4m84
6560a27j80l36m2P11J68J32J18j73J01q1o22j5k8K45k68N90J69K34l79p7l67n7
6582b84l27J28L37L32R8R8R2m06l13k15K0m0K93K59J62J43j13l7j84j61l65K29
$$ plain form
6604 -254 -210 -147 325 142 440 244 -32 -262 -432 -255 -290 -55 41 469 498 401 26 -110 -327 -571 -255 -74
6626 -74 268 510 411 261 121 -14 -328 -346 -488 -195 103 319 533 577 279 -199 -399 -271 -345 -168 -43 237
6648 237 417 254 177 -52 -508 -616 -236 -193 228 221 296 441 185 50 -72 -501 -433 -379 -50 340 352 421 127
6671 127 99 -329 -520 -413 -275 -74 205 352 485 304 90 -169 -578 -333 -415 -166 50 275 270 470 177
6692 177 -76 -310 -322 -454 -295 151 455 438 327 407 -78 -172 -365 -223 -153 115 358 321 650 175 1 -403
6714 -403 -431 -445 -165 116 220 332 258 286 -22 -433 -306 -536 -295 -121 232 524 198 419 31 -106 -337
6735 -337 -444 -473 -238 72 326 406 369 47 -157 -293 -344 -310 -31 126 262 328 421 -6 -42 -277 -449 -503 -126
6758 -126 51 304 328 495 245 -61 -100 -627 -364 -269 26 344 423 387 404 14 -303 -496 -185 -307 -140 195
$$ packed form
6604b54M4O3M72j83K98j96k76k30j70J77l5K35R6M28K9r7l75j36k17k44L16J81
6626g4L42K42r9j50j40j35l14j8j42K93K98K16K14M4k98m78k00J28p4J77J25K80
6648B37J80j63p7k29m56j08L80M3M21pP5J45k56j35j22m29O8N4L29L90J2O9k94
6671A27k8m28j91J07J38K01K79J47J33j81k14k59m09K45q2K49K16K25nK00k93
6692A77k53k34j2j32J59M46L04j7j11Q0m85r4j93J42P0K68K43l7L29m75j74m04
6714d03k8j4K80K81J04J12p4K8l08m11J27k30K41J74L53K92l26K21l88j37k31
6735c37j07k9K35L10K54Q0l7l22k04j36n1L4K79J57J36O6R3m27l6k35j72n4L77
6758a26J77K53K4J67k50l06l9n27K63R5K95L18P9l6J7l90l17j93L11j22J67L35
$$ plain form
6780 195 490 407 238 146 -261 -438 -577 -491 -179 69 241 449 370 205 -93 -378 -327 -270 -237 99 450 410 551
6803 551 431 -111 -337 -391 -335 -177 31 304 268 543 226 13 -63 -397 -326 -224 92 447 552 458 294 -160
6825 -160 -230 -377 -344 -200 -92 71 179 279 3 157 -101 -380 -307 -214 -151 177 334 538 275 69 -225 -180
6847 -180 -287 -316 -36 141 228 333 341 142 -22 -412 -486 -504 -269 -101 246 208 543 156 198 -170 -414 -336 -285
6870 -285 65 128 313 315 295 45 25 -392 -301 -119 98 256 385 516 416 87 -170 -289 -404 -283 21 54
6892 54 293 368 404 -9 -200 -337 -441 -308 -169 174 339 353 -5 109 -98 -183 -497 -342 -322 108 295 376
6914 376 320 246 129 -342 -265 -371 -214 79 218 487 346 221 207 -33 -492 -325 -289 -47 195 627 374 157
6936 157 105 -50 -390 -275 -170 -1 95 267 216 290 29 119 -247 -416 -603 -122 -41 185 516 241 101 -111
$$ packed form
6780A95K95q3j69r2m07j77j39Q6L12K48J72K08p9j65k98k85N1N7L3L36L51m0J41
6803E51j20n42k26n4N6J58K08K73l6K75l17k13p6l34P1J02L16L55J05r4j64m54
6825a60p0j47L3J44J08J63J08J00k76J54k58k79P3R3O3L28J57K04k63k06k94M5
6847a80j07k9K80J77Q7J05Qj99j64l90p4j8K35J68L47l8L35l87M2l68k44P8N1
6870b85L50O3J85Kk0k50k0m17R1J82K17J58J29J31j00l29k57j19j15J21L04L3
6892E4K39P5L6m13j91j37j04J33J39L43J65J4l58J14k07q5l14J55K0M30J87Q1
6914C76n6p4j17m71P7j06J57K93J39K69j41j25j4k40m59J67L6K42K42M32k53k17
6936A57n2j55l40J15J05J69R6J72n1P4k61R0l66j69j87M81Q1K26L31k75j40k12
$$ plain form
6958 -111 -336 -462 -272 -264 -17 205 343 390 240 -75 -302 -370 -326 -394 -44 236 523 336 305 140 -213 -134 -425
6981 -425 -281 29 122 102 402 126 -68 -434 -392 -347 -395 -160 42 -52 406 417 37 -141 -220 -381 -469 207 55
7004 55 -4 169 401 95 -218 -135 -102 -221 -249 89 207 379 243 267 -98 -268 -346 -270 -198 -69 179 525 203
7027 203 449 84 -340 -299 -421 -17 -176 53 387 217 29 32 -201 -479 -286 -362 -199 211 187 328 202 265
7049 265 -85 -394 -503 -196 38 89 271 255 115 86 113 -280 -434 -259 -225 6 328 217 165 225 52 -214
7071 -214 -237 -273 -114 0 52 411 210 218 -41 -196 -327 -200 -92 -55 141 367 422 228 -118 -133 -282 -403 -195
7094 -195 -75 103 370 312 269 113 22 -387 -245 -259 -142 185 145 287 340 172 60 -527 -422 -491 -144 205
7116 205 49 396 209 162 -35 -89 -333 -77 -312 143 286 238 355 321 67 -163 -262 -306 -54 7 -124 554
$$ packed form
6958a11k25j26J90QK47K22J38M7j50l15k27o8M4o8L50K80K87j87l1j65l53P9k91
6981d25J44L10R3k0L00k76j94l66M2M5m8K35K02r4M58J1l80j78p9j61q8O76j52
7004E5n9J73K32l06l13Q3L3j19k8L38J18J72j36K4l65j70p8P6P2J29K48L46l22
7027B03K46l65m24M1j22M04j59K29L34j70j88Lk33k78J93p6J63M10k4J41j26O3
7049B65l50l09j09L07K34N1J82j6j40k9K7l93j54J75L4K31L22j11n2O0j73k66
7071b14k3l6J59J14N2L59k01Qk59j55j31J27J08L7J96K26N5j94l46j5j49j21K08
7094a95J20J78K67n8m3j56r1m09J42j4J17L27m0J42N3j68j12n87J05o9L47L49
7116B05j56L47j87m7j97n4k44K56k35M55J43m8J17l4k54k30r9m4K52O1j31O78
$$ plain form
7138 554 393 197 235 -233 -338 -226 -268 -150 15 243 250 181 104 -27 -189 -263 -275 -226 9 243 171 286 -1
7161 -1 -3 -185 -288 -308 12 141 166 470 120 42 -105 -267 -322 -310 -16 155 239 267 305 41 -50 -96 -223 -199 -157
7186 -157 -106 226 272 293 136 33 -291 -240 -315 -376 -129 149 329 246 173 208 -37 -314 -288 -399 -91 184 224 548
7210 548 186 53 4 -371 -343 -555 -101 109 82 454 148 237 125 -314 -214 -257 -13 40 265 405 271 325
7232 325 207 -183 -362 -593 -147 42 -56 477 327 120 202 -31 -287 -397 -228 -218 35 191 158 232 88 -170
7254 -170 -402 -297 -397 -100 245 207 449 102 -18 93 -258 -276 -360 -137 51 265 558 399 238 56 -286
7275 -286 -522 -199 -203 -9 213 207 229 175 4 20 -23 -321 -264 -125 191 228 276 236 -53 -317 -312 -307 -178 -108 138 193
7301 193 210 247 164 -37 -238 -368 -286 112 169 153 187 403 115 -43 -232 -349 -283 -146 -104 253 326 5 112
$$ packed form
7138E54j61j96L8m68j05J12m2J18J65K28Po9p7j31j62p4j2M9K35K34p2J15k87
7161akj82j03k0L20J29K5L04l50p8j47j62n5J2K94J71Q4K8L8k64r1m6j27K4M2
7186a57N1L32M6K1j57j03l24N1p5o1K47K78J80q3p3L5k45k77K6j11L08K75M0L24
7210E48l62j33m9l75K8k12M54K10k7L72l06Q9j12m39J00m3K44N3K25J40j34N4
7232C25j18l90j79k31M46J89r8N33j50k07Q2k33k56j10J69J0K53J56l3P4j44k58
7254a70k32J05j00K97L45l8K42l47j20J11l51j8q4K23J88K14K93j59j61j82l42
7275b86k36L23mJ94K22oK2n4j71J6m3k98N7J39L16L7M8m0k89k64NNJ29P0K46N5
7301A93J7L7q3k01k01j30Q2L98N7j6L4K16k88j58j89j17O6J37M2L57P3l21J07
$$ plain form
7324 112 7 -207 -514 -194 -300 2 324 365 355 87 -153 -241 -426 -299 -129 -247 265 411 139 196 -137
7345 -137 -18 -84 -495 -137 -185 120 212 218 199 31 -238 -276 -384 -396 -59 138 185 455 347 182 13 -216 -304
7368 -304 -182 100 -42 85 279 85 22 -12 -54 -185 -239 -185 -98 88 140 595 287 -34 -266 -446 -435 -45 50
7391 50 39 378 319 82 -127 -128 -325 -352 -42 -8 232 256 404 8 121 -134 -216 -80 -350 -125 106 328 406
7414 406 45 256 -282 -186 -305 -175 -95 119 332 263 484 270 -51 -224 -267 -483 -102 -18 403 268 144 271
7436 271 -155 -240 -176 -372 -281 61 97 370 413 242 -54 -203 -220 -281 -98 203 111 55 206 215 146 -271 -192 -374
7460 -374 -194 -28 47 -25 161 157 110 -44 -64 -217 -204 35 37 291 139 311 43 -160 -86 -218 -254 -304 -30 -56
7484 -56 255 333 159 -69 -183 -221 -284 -281 66 104 129 232 155 32 -265 -215 -238 -213 -21 71 55 298 62 150 -134
$$ packed form
7324A12j05k14l07L20j06L02L22M1j0k68k40q8j85J27J70j18N12J46k72N7l33
7345a37J19o6m11L58m8L05R2Oj9j68k69l8j08j2L37J97M7K70j08j65j69k29q8
7368c04J22K82j42J27J94j94o3l4m2j31n4N4Q7J86N2M55l08l21k32j80J1L90R5
7391E0j1L39n9k37k09jj97k7L10L4K40K4J48l96J13k55q2J36k70K25K31K22P8
7414D06l61K11n38R6j19J30Q0K14K13o9K21k14l21j73m3k16L81Q4M21j35j24J27
7436B71m26q5O4j96R1L42L6K73M3j71k96j49j7o1J83L01r2n6J51Ro9m17P9j82
7460c74J80J66P5p2J86mm7j54k0j53J3K39KK54j52J72k68k03P4j32l6n0K74k6
7484e6L11P8j74k28j14l8o3LL47L8K5J03p7j23k97N0k3K5J92R2j6K43k36Q8k84
$$ plain form
7509 -134 -180 -259 24 -119 -3 47 171 258 143 -21 -197 -304 -181 -243 -62 157 253 224 199 -9 -159 -131 -195
7532 -195 -200 130 366 267 276 115 123 -173 -234 -153 -82 23 257 337 373 103 190 -10 -144 -255 -302 33 121 172 335
7557 335 140 27 -42 -117 -178 -115 -126 80 370 389 -20 322 66 -206 -226 -102 -35 -146 147 5 222 36 -177
7580 -177 -155 -270 -203 -133 -153 113 220 230 127 225 -338 -174 -414 -188 -127 171 176 241 153 -13 -80 -342 -270 -156
7604 -156 21 188 387 400 274 -33 -247 -208 -370 -108 -34 217 165 162 200 13 -70 -270 -290 -122 -27 173 95 250
7628 250 105 326 36 -193 -1 -300 -105 35 8 204 97 127 134 -16 -151 -217 -216 9 382 129 320 -190
7650 -190 -164 -264 -252 -280 -55 -113 280 316 340 15 -114 61 -202 -208 -129 46 28 320 257 -40 -74 20 -209 -373
7674 -373 -5 -52 257 225 239 138 222 -115 -169 -149 -259 -382 87 150 335 266 34 20 -218 -393 -357 -198 76
$$ packed form
7509a34m6p9K83j43J16N0J24Q7j15j64j76j07J23o2J81K19R6k9k5k08j50K8o4
7532a95nL30K36r9Rj61Qk96o1Q1P1J05K34Q0L6k70Q7k00j34j11m7L35Q8N1J63
7557C35j95j13o9p5o1O3j1K06K90J9m09L42k56k72k0J24O7j11K93j42K17j86k13
7580a77K2j15O7P0k0K66J07J0j03R8n63J64k40K26O1K98NO5q8j66o7k62P2J14
7604a56J77J67J99J3j26l07k14L9j62K62P4K51n2lL8j87q3k00k0J68R5K00p8J55
7628B50j45K21k90k29J92k99J95J40k7J96j07L0Pj50j35o6JK25L73k53J91n10
7650a90K6j00J2k8K25n8L93L6K4l25j29J75k63oP9J75j8K92o3k97l4R4k29j64
7674c73L68m7L09l2J4j01Q4l37n4K0j10j23M69O3J85o9k32j4k38j75L6J59K74
$$ plain form
7697 76 38 119 66 -51 57 -297 -196 -286 -87 24 -65 -25 224 48 140 -77 -249 -173 68 -111 261 -64 463
7720 463 143 -173 29 -414 -144 -238 207 45 337 243 196 5 106 -167 -228 -198 -227 22 107 280 160 15
7742 15 13 -211 -237 10 -8 84 245 494 91 140 49 -250 -162 -85 -329 -83 172 243 114 194 168 -152 -237 -327 -196
7767 -196 15 -6 371 -127 -36 -101 32 -215 -119 -240 -176 113 105 70 190 21 -246 -296 -382 -251 -62 -64 190 233
7791 233 17 83 65 46 -75 141 -175 60 190 395 126 -25 -193 0 -83 -229 -102 223 262 346 69 34
7813 34 62 87 -214 -348 -214 -9 104 38 52 129 156 25 -281 -177 71 45 96 142 192 39 124 -272 -126 -147
7837 -147 -101 -77 54 79 256 80 59 -99 1 8 -47 -159 -78 -7 -3 46 -74 -64 -172 -168 -108 -196 31 103 67 45 106
7864 106 -279 -324 -213 -190 -2 -321 155 72 152 262 -14 -136 -86 -152 -244 -38 -13 151 313 158 39 -172 -56
$$ packed form
7697G6l8Q1n3j17J08l54J01r0J99J11q9M0K49j76R2k17j72P6K41j79L72l25N27
7720D63l20l16K02m43K70r4M45j62K92r4m7j91J01k73o1L0k9K49Q5J73j20j45
7742A5kk24k6K47j8R2J61K49m03M9r1k99Q8P7k44K46K55P1j29Q0k6l20q5r0J31
7767a96K11k1L77m98R1o5J33k47R6j21O4K89ql5J20j69k67n0q6J31J89kK54M3
7791B33k16O6j8j9j21K16l16K35J30K05k69j51j68J93q3j46J27L25L9Q4k77l5
7813C4K8K5l01j34J34K05J13o6J4P7K7j31l06J04K48k6N1M6N0j53Q5l96J46k1
7837a47M6K4J31K5J77j76k1j58J00Pn5j12Q1P1MM9j20J0j08MO0q8K27P2l6k2O1
7864A06l85m5J11K3J88l19M76q3Q0J10k76j22N0o6r2K06K5J64J62j55j19k11J16
$$ plain form
7887 -56 -191 -10 13 -82 153 6 -20 -8 -26 -139 -142 -122 -196 22 55 168 98 76 46 -185 -17 -153 15 275 -175
7912 -175 133 261 9 -177 -17 -196 58 -205 10 -3 118 -93 148 -65 -172 -105 -140 -71 -212 -215 -39 36
7934 36 92 79 -114 -157 8 -114 -129 -93 131 261 144 205 -101 -95 -173 -251 33 -12 10 -62 113 73 -139 -183 -102 -296
7960 -296 -178 -100 55 554 70 165 245 81 -199 -299 -153 187 -77 197 103 38 152 -71 -46 -158 -285 -197
7982 -197 -27 111 -34 270 -111 -140 -21 -174 -220 -9 31 54 110 320 51 -130 -186 -251 -260 -120 -7 137 161
8005 161 166 122 123 -125 -30 -126 42 180 237 168 -49 -88 7 -34 -55 -163 -61 -127 -166 201 -103 198 -193 -268 -124
8030 -124 -7 -105 -151 78 196 46 1 5 -19 -211 -334 -147 -69 115 144 94 94 -74 -112 74 -51 -142 -53 -106 116
8055 116 188 129 115 -97 -188 -157 26 -65 -32 -47 83 -16 -177 -30 -190 -91 -330 -202 51 -106 167 23 31 -2
$$ packed form
7887e6j35J81K3r5K35j47k6J2j8j13lK0p4K18L3J13p0k2l0k31J68j36J68K60m50
7912a75L08J28k52j86J60j79K54k63K15j3J21k11K41k13j07O7l5O9j41lJ76P5
7934C6N6j3j93m3J65j22j5L6K24J30j17O1l06Op8p8K84m5K2p2J75m0k12m4Q1j94
7960b96J18P8J55M99m84R5Q0j64k80j00J46L40k64K74r4o5J14k23K5j12j27Q8
7982a97J70J38j45L04l81k9J19j53m6K11M0K3N6K10k69j81n6o5rJ40J13J44K4
8005A61Nm4Jk48R5r6J68J38N7o9k17l9R5m1k1j08J02o6l9L67l04L01l91p5J44
8030a24J17r8m6K29J18j50m5Mk4j92j23J87P8J84K9n0%j68l8J86j25r1Q9n3K22
8055A16P2n9j4k12r1L1J83r1L3j5J30r9j61J47j60R9k39J28K53j57K73j44Ql3
$$ plain form
8079 -2 -14 -141 -93 -79 -225 220 151 211 54 -157 -18 -167 -150 -85 27 -106 111 -71 -9 -10 -18 -1 -120 -229 -46
8104 -46 71 94 81 46 136 -67 -209 -56 -59 -236 -24 78 37 150 12 108 -97 -167 98 150 51 -1 167 70 40
8129 40 22 -89 -201 -157 -149 -22 187 47 89 48 -16 89 -207 -102 44 -89 -137 13 79 67 130 48 -92 -76 65
8154 65 -5 -46 306 -9 -4 -22 164 52 -253 -73 145 -58 66 -87 42 -100 -267 -50 -208 -205 -105 -172 -1
8177 -1 46 91 62 70 -94 -16 201 -119 -22 -7 17 52 11 -13
$$ packed form
8079bj2j27M8J4j46M45o9O0j57k11J39j49J7O5J12j33K17j82O2jqJ7j19j09J83
8104d6J17K3j3l5R0k03j42J53lj77K12J02m1J13j38R6k05p0K65N2r9n2J68r7l0
8129D0j8j11j12M4QJ27K09j40M2m1o4J05k96J05J46j33m8J50O6j2O3q2j40J6J41
8154F5p0m1L52l15Nj8J86j12l05J80K18k03J24j53J29j42j67K17j58LJ00o7J71
8177aM7M5k9Qj64P8K17l20R7J5K4L5m1k4
8191a3
$$ Imaginary data points
##PAGE= N=2
##DATA TABLE= (X++(I..I)), XYDATA
$$ plain form
0 0 0 0 0 0 0 0 0 0 0 0 0 0 0 0 3 -8 8 -8 8 -8 16 -16 16 -24 24 -32 33 -40 48 -56 60 -71 80 -89 100 -113
36 -113 128 -141 159 -178 197 -219 243 -269 298 -328 364 -400 440 -487 534 -590 652 -718 794
55 794 -878 975 -1086 1217 -1368 1552 -1776 2060 -2434 2942 -3681 4876 -7106 12750 -61258
70 -61258 -75687 36644 37272 26259 43522 79739 43450 -22064 -68178 -69656 -54051 -10449 34771
83 34771 54731 47876 52550 45473 -7327 -78892 -90073 -46393 -12080 -2691 28542 74059 77716
96 77716 26519 -22974 -41040 -44753 -50614 -39273 1126 51495 75839 59187 17813 -15912 -32164
109 -32164 -46660 -64555 -59523 -11215 49471 71748 48721 17948 2749 -10180 -36231 -61812
121 -61812 -55068 -5754 51279 67485 40990 16883 13911 -1649 -47390 -81037 -58329 -2303
$$ packed form
0@%%%%%%%%%%%%%%Lj1J6j6J6j6K4l2L2m0M8n6O5p3Q8j04J16j31J51j69J89k13
36a13K41k69L00l37L75m16M62n12N67o26O92p64Q40r27J021j124J242j370J512
55G94j672J853k061K303k585K920l328L836m494N376o623Q557j1982J9856p4008
70f1258j4429J12331O28j1013J7263L6217l6289o5514m6114j478J5605M3602M5220
83C4771J9960o855M674p077n2800p1565j1181M3680L4313R389L1233M5517L657
96G7716n1197m9493j8066l713n861J1341M0399N0369K4344j6652m1374l3725j6252
109c2164j4496j7895N032M8308O0686K2277k3027l0773j5199j2929k6051k5581
121f1812O744M9314N7033J6206k6495k4107k972j5560m5741l3647K2708N6026
$$ plain form
133 -2303 33075 36950 37365 41887 29845 -6429 -44390 -57741 -40942 -7714 20581 34973 42856
146 42856 47970 34136 -8246 -51557 -60311 -39057 -19108 -7385 16037 50219 61578 32561
158 32561 -10980 -34426 -35599 -32981 -30373 -12975 23792 57648 59905 29923 -6721 -26767 -35024
171 -35024 -45148 -49628 -26782 19064 54031 53004 28019 6199 -7151 -25725 -48444 -50720 -19123
184 -19123 25969 50419 46574 32849 20440 -106 -34388 -62714 -58125 -22744 14550 32983
196 32983 38376 41317 34199 5779 -34098 -56907 -47435 -17362 11052 28398 41692 51588 41784
209 41784 4724 -39587 -59072 -47792 -26684 -8351 13480 42530 58175 41103 2245 -30564
221 -30564 -43545 -41452 -31168 -10917 19009 49328 60345 41245 4353 -26612 -40519 -45819
$$ packed form
133b303L5378L875M15M522j2042l6274l7961j3351J6799L3228K8295J4392P883
146D2856N114j3834m2382m3311q754K1254J9949J1723K3422L4182J1359k9017
158C2561m3541k3446j173K618K608J7398L6767L3856K257k9982l6644k0046q257
171c5024j0124m480K2846M5846L4967j027k4985k1820j3350j8574k2719k276L1597
184a9123M5092K4450l845j3725j2409k0546l4282k8326M589L5381L7294J8433
196C2983N393K941p118k8420l9877k2809R472L0073K8414J7346J3294R896r804
209D1784l7060m4311j9485J1280K1108J8333K1831K9050J5645j7072l8858l2809
221c0564j2981K093J0284K0251K9926L0319J1017j9100l6892l0965j3907n300
$$ plain form
233 -45819 -44712 -25895 13229 47907 53725 33936 9385 -11490 -31633 -46980 -44865 -18976 18434
246 18434 46901 51942 37292 16649 -4872 -30902 -53735 -53512 -24547 12225 33535 39129 38020
259 38020 26668 176 -30677 -48153 -43705 -21437 8223 32253 42904 42188 32009 7027 -28286
272 -28286 -51510 -46668 -24293 -3986 13661 34712 47034 34412 3514 -23593 -37232 -38926
284 -38926 -29087 -7791 17932 38167 46579 38290 12732 -17957 -36532 -40111 -34870 -21601 4184
297 4184 32483 44267 33901 12921 -7968 -26306 -38618 -37288 -20046 6506 31510 44295
309 44295 39734 21646 -1069 -22440 -39050 -43786 -29959 -2601 22567 35507 36607 26423 5440
322 5440 -19365 -37375 -40456 -28300 -5081 20763 39239 42591 31796 12414 -12646 -36113 -45710
$$ packed form
233d5819J107J8817L9124L4678N818j9789k4551k0875k0143j5347K115K5889L7410
246A8434K8467N041j4650k0643k1521k6030k2833K23K8965L6772K1310N594j109
259C8020j1352k6492l0853j7476M448K2268K9660K4030J0651p16j0179k4982l5313
272b8286k3224M842K2375K0307J7647K1051J2322j2622l0898k7107j3639j694
284c8926R839K1296K5723K0235Q412q289k5558l0689j8575l579N241J3269K5785
297D184K8299J1784j0366k0980k0889j8338j2312J330J7242K6552K5004J2785
309D4295m561j8088k2715k1371j6610m736J3827K7358K5168J2940J100j0184k0983
322E440k4805j8010l081J2156K3219K5844J8476L352j0795j9382k5060k3467r597
$$ plain form
335 -45710 -35558 -12562 11159 29216 38680 35266 16006 -11379 -33369 -41253 -34531 -15704 9873
348 9873 32850 43658 39619 22280 -3727 -29913 -44831 -40068 -21524 1458 22413 38314 40953
361 40953 24814 -3811 -28453 -39603 -37713 -24379 -1550 25128 43765 44883 29239 3750
373 3750 -22592 -39371 -41536 -30026 -9215 16126 37412 43414 29207 3401 -19598 -33801 -39435
386 -39435 -33372 -11846 18651 41333 44772 31806 11468 -10733 -31346 -42949 -38136 -16528 11741
399 11741 32551 38354 30664 14037 -6915 -28715 -42210 -38254 -15957 12103 31596 37845 35342
412 35342 23602 562 -26621 -43360 -38540 -18274 3506 20275 31757 35951 25584 1038
424 1038 -26104 -39906 -35373 -19534 -771 17133 33924 41551 31881 5796 -21431 -34633 -32907
$$ packed form
335d5710J0152K2996K3721J8057R464l414j9260k7385k1990p884O722J8827K5577
348I873K2977J0808m039j7339k6007k6186j4918M763J8544K2982K0955J5901K639
361D0953j6139k8625k4642j1150J890J3334K2829K6678J8637J118j5644k5489
373C750k6342j6779k165J1510K0811K5341K1286O002j4207k5806k2999j4203n634
386c9435O063K1526L0497K2682L439j2966k0338k2201k0613j1603M813K1608K8269
399A1741K0810N803p690j6627k0952k1800j3495L956K2297K8060J9493O249k503
412C5342j1740k3040k7183j6739M820K0266K1780J6769J1482M194j0367k4546
424A038k7142j3802M533J5839J8763J7904J6791P627r670k6085k7227j3202J726
$$ plain form
437 -32907 -24192 -11439 8275 30715 40687 28761 4102 -16844 -27603 -31907 -30227 -16340 9287
450 9287 33697 41515 30778 11020 -6894 -21170 -32375 -35573 -22472 5425 29289 34904 25680
463 25680 13634 492 -17902 -36337 -39239 -21423 5693 25586 32526 30876 23192 8545 -14609
476 -14609 -36529 -40491 -22373 1650 16007 23719 31502 30701 10015 -19952 -36622 -33859 -22219
489 -22219 -8113 10006 28527 38318 33443 14147 -12670 -32959 -34136 -22845 -12576 -990 21589
502 21589 43226 37891 7342 -17633 -22854 -24979 -32111 -26068 1868 31686 40817 32015 15912
515 15912 -2893 -20320 -30417 -31579 -24926 -5219 23383 41048 32589 11653 -1674 -11867 -29064
528 -29064 -42003 -29707 1848 25127 30670 29607 26281 12285 -13934 -35373 -37237 -22700 -3781
$$ packed form
437c2907Q715J2753J9714K2440R972j1926k4659k0946j0759m304J680J3887K5627
450I287K4410P818j0737j9758j7914j4276j1205l198J3101K7897K3864N615r224
463B5680j2046j3142j8394j8435k902J7816K7116J9893O940j650p684j4647k3154
476a4609k1920l962J8118K4023J4357P712P783q01k0686k9967j6670K763J1640
489b2219J4106J8119J8521R791m875j9296k6817k0289j177J1291J0269J1586K2579
502B1589K1637n335l0549k4975n221k125p132O043K7936K9818R131q802j6103
515A5912j8805j7427j0097j162O653J9707K8602J7665q459k0936j3327j0193j7197
528b9064j2939J2296L1555K3279N543j063l326j3996k6219k1439j864J4537J8919
$$ plain form
541 -3781 12185 25100 32990 29679 11451 -14713 -34545 -36783 -23354 -6061 7800 20753 34626
554 34626 37750 19029 -13953 -34820 -30921 -18180 -11700 -4568 16642 40077 39264 12366 -15234
567 -15234 -25313 -25664 -26063 -20853 -3150 20832 36652 35752 18649 -4725 -20837 -25870 -26192 -22998
581 -22998 -7715 18168 36244 31880 14826 591 -10898 -26562 -36915 -26865 -1234 19415
593 19415 25599 26353 25020 14205 -8628 -30344 -35642 -23169 -3559 11459 20154 25630 27298 17618
607 17618 -5883 -31201 -38057 -23546 -3885 6503 13555 25873 35454 23577 -5788 -29443 -31475
620 -31475 -20315 -11240 -2782 12317 29995 34844 19970 -4735 -22780 -27996 -25099 -18409 -6548
633 -6548 12614 31432 34761 20326 -94 -14166 -22040 -27684 -25959 -9595 15308 30806 29066
$$ packed form
541c781J5966J2915P890l311j8228k6164j9832k238J3429J7293J3861J2953J3873
554C4626L124j8721l2982k0867L899J2741O480P132K1210K3435q13k6898k7600
567a5234j0079l51l99N210J7703K3982J5820r00j7103k3374j6112n033l22L194
581b2998J5283K5883J8076m364j7054j4235j1489j5664j0353J0050K5631K0649
593A9415O184P54j333j0815k2833k1716n298J2473J9610J5018Q695N476J668r680
607A7618k3501k5318o856J4511J9661J0388P052J2318R581j1877k9365k3655k032
620c1475J1160R075Q458J5099J7678M849j4874k4705j8045n216K897O690J1861
633f548J9162J8818L329j4435k0420j4072p874n644J725J6364K4903J5498j740
$$ plain form
646 29066 17792 6339 -6208 -22254 -33937 -29763 -8897 14027 26182 26662 21311 13879 -833
659 -833 -21323 -35307 -30122 -8760 11523 20531 22991 24658 19697 577 -24223 -35969 -27630 -10149
673 -10149 3968 14585 25013 30492 22416 765 -21621 -30658 -25420 -13864 -2357 11100 26183
686 26183 33095 22849 -242 -19453 -25917 -24239 -19894 -9322 9944 29081 33503 20869 2331
699 2331 -11895 -20999 -25463 -24667 -12105 9549 28236 31283 19656 5133 -6605 -17862 -28960
712 -28960 -29328 -13221 9777 24887 26807 21159 12305 -888 -17560 -30180 -28787 -13037 6919
725 6919 20071 23976 23001 17159 2600 -17781 -31253 -28276 -12963 2510 13207 21920 27671 21923
739 21923 3987 -16933 -27960 -25404 -15565 -3765 9109 22240 29238 23102 4977 -14536 -24276
$$ packed form
646B9066j1274j1453j2547j6046j1683M174K0866K2924J2155M80n351p432j4712
659h33k0490j3984N185K1362K0283R008K460J667m961j9120k4800j1746Q339J7481
673a0149J4117J0617J0428N479q076k1651k2386r037N238J1556J1507J3457J5083
686B6183O912j0246k3091j9211o464J678M345J0572J9266J9137M422j2634j8538
699B331j4226r104m464P96J2562K1654J8687L047j1627j4523j1738j1257j1098
712b8960l68J6107K2998J5110J920n648q854j3193j6672j2620J393J5750J9956
725F919J3152L905r75n842j4559k0381j3472K977J5313J5473J0697Q713N751n748
739B1923j7936k0920j1027K556R839J1800J2874J3131O998o136j8125j9513r740
$$ plain form
752 -24276 -24392 -18682 -9487 5747 22417 30434 23379 6176 -9656 -19127 -23716 -22963 -13604 4364
766 4364 22003 29015 22310 8903 -4438 -15808 -24970 -26274 -15899 3236 20056 26391 22117
779 22117 13060 1160 -13598 -25564 -27741 -16313 1604 16345 23214 23163 17063 4551 -12211
792 -12211 -25672 -27779 -17363 -1523 12073 20750 24381 20572 7684 -11090 -24745 -26147 -17551
805 -17551 -5418 7290 19324 26540 23018 8159 -9203 -21186 -24618 -20163 -9702 4541 18580
818 18580 26386 23608 10749 -5917 -18708 -23686 -21395 -13216 1093 17086 26836 23986 11580
831 11580 -2425 -14386 -22465 -24353 -16512 -369 15784 24361 23426 15022 1920 -11921 -22393
844 -22393 -24781 -17809 -3348 12540 22646 23644 16510 5090 -8524 -21063 -25916 -19511 -4954
$$ packed form
752b4276j16N710R195J5234J6670Q017p055j7203j5832r471m589P53R359J7968
766D364J7639P012o705j3407j3341j1370r162j304J0375J9135J6820O335m274
779B2117r057j1900j4758j1966k177J1428J7917J4741O869n1o100j2512j6762
792a2211j3461k107J0416J5840J3596Q677L631l809j2888j8774j3655j402Q596
805a7551J2133J2708J2034P216l522j4859j7362j1983l432M455J0461J4243J4039
818A8580P806k778j2859j6666j2791m978K291Q179J4309J5993R750k850j2406
831A1580j4005j1961q079j888P841J6143J6153Q577r35q404j3102j3841j0472
844b2393k388O972J4461J5888J0106R98p134j1420j3614j2539m853O405J4557
$$ plain form
857 -4954 9682 19793 23028 19575 8957 -6700 -20144 -24964 -20221 -8127 5868 17681 23358
870 23358 21051 11127 -3769 -17652 -24545 -21300 -10395 2955 15135 22770 22983 13498 -1888 -15591
884 -15591 -22911 -21843 -13474 -879 12766 22538 23687 15217 1286 -13084 -21594 -22144 -15713 -3854
898 -3854 10403 21424 24395 16745 3304 -10118 -19383 -22661 -18471 -6900 8263 20178 23705
911 23705 18067 6340 -6731 -17700 -22572 -20014 -8982 6231 18769 22995 18691 8882 -3549
924 -3549 -15367 -22929 -21987 -11068 4098 16322 21269 19523 11921 -30 -14046 -23045 -22191 -12148
938 -12148 1773 13246 20138 20675 14995 2509 -12274 -22258 -22221 -13466 -1363 9664 18245 22138
952 22138 17332 4288 -10857 -20157 -20972 -14961 -4944 6767 17968 22979 18578 5986 -8567
$$ packed form
857d954J4636J0111L235l453j0618j5657j3444m820M743J2094J3995J1813N677
870B3358k307r924j4896j3883o893L245J0905J3350J2180P635K13r485j5386j3703
884a5591p320J068Q369J2595J3645R772J149q470j3931j4370q510n50O431J1859
898c854J4257J1021K971p650j3441j3422r265l278M190J1571J5163J1915L527
911B3705n638j1727j3071j0969m872K558J1032J5213J2538M226m304r809j2431
924c549j1818p562R42J0919J5166J2224M947j746p602j1951j4016q999Q54J0043
938a2148J3921J1473O892N37n680j2486j4783r984L7Q755J2103J1027Q581L893
952B2138m806j3044j5145r300q15O011J0017J1711J1201N011m401j2592j4553
$$ plain form
965 -8567 -18055 -19907 -16655 -9093 3222 17059 23630 18628 6496 -5040 -13999 -19520 -19953 -11537
979 -11537 2962 15995 21848 18882 9807 -1684 -12139 -19230 -21097 -14330 410 14559 20439
992 20439 17692 11304 3184 -8591 -20444 -23134 -13906 271 10984 17112 19145 15945 5741 -8593
1006 -8593 -19556 -22036 -14989 -3212 7771 15361 19103 17584 8311 -6580 -18992 -20983 -14668 -5273
1020 -5273 3536 13100 21125 20384 8824 -6491 -15953 -18295 -16259 -10708 301 13879 21665 19262
1034 19262 9126 -3023 -12074 -17754 -18234 -12972 -1390 12995 21796 19817 9684 -716 -8382
1047 -8382 -15668 -20693 -16948 -2434 13131 19622 17094 11102 4372 -5679 -16655 -22154 -16778 -3116
1061 -3116 10422 17224 17527 14165 7231 -3696 -16489 -22203 -16804 -4457 6626 13438 17534 17114
$$ packed form
965h567r488j852L252P562J2315J3837O571n002j2132j1536q959n521m33Q416
979a1537J4499J3033N853k966r075j1491j0455p091j867O767J4740J4149N880
992B0439k747o388q120j1775j1853k690R228J4177J0713O128K033l200j0204j4334
1006h593j0963k480P047J1777J0983P590L742j519r273j4891j2412j991O315R395
1020e273Q809R564Q025p41j1560j5315r462k342K036N551J1009J3578P786k403
1034A9262j0136j2149r051n680m80N262J1582J4385Q801j979j0133j0400p666
1047h382p286n025L745J4514J5565O491k528n992o730j0051j0976n499N376J3662
1061c116J3538O802L03l362o934j0927j2793n714N399J2347J1083O812M096m20
$$ plain form
1075 17114 9664 -3610 -16214 -20398 -15837 -6590 2257 11245 18906 19848 10883 -3539 -14252 -17191
1089 -17191 -15126 -10926 -2487 9957 20114 20352 10350 -2641 -10853 -14863 -16384 -14098 -4933 8993
1103 8993 20311 20515 10803 31 -7269 -12497 -17624 -17143 -6657 8887 18562 17905 11307 4128 -3682
1118 -3682 -12650 -19345 -17268 -6535 6805 15663 17143 14015 7709 -1481 -12641 -19929 -17349 -6704
1132 -6704 4584 11263 15213 16450 11785 -710 -13714 -18996 -15281 -7582 -2 8380 16028 18751
1146 18751 12628 154 -11842 -17264 -14975 -9510 -3241 5481 15972 20806 13776 -6 -10003 -13734
1160 -13734 -14510 -13491 -6489 5760 17017 19292 12813 3352 -6174 -12288 -15500 -14972 -8482 4098
1174 4098 15935 18400 12328 4741 -1746 -9851 -17738 -17898 -8117 4635 12719 15647 14189 8991 288
$$ packed form
1075A7114p450j3274j2604m184M561R247Q847Q988P661R42q965j4422j0713k939
1089a7191K065M200Q439J2444J0157K38j0002j2991q212m010j521K286R165J3926
1103H993J1318K04r712j0772p300n228n127M81J0486J5544R675o57o598p179p810
1118c682q968o695K077J0733J3340Q858J480l128o306r190j1160p288K580J0645
1132f704J1288O679L950J237m665j2495j3004n282L715P699P580Q382P648K723
1146A8751o123j2474j1996n422K289N465O269Q722J0491M834p030j3782r997l731
1160a3734p76J019P002J2249J1257K275o479r461r526o114l212N28O490J2580
1174D098J1837K465o072p587o487q105p887j60R781J2752Q084K928j458n198q703
$$ plain form
1189 288 -9999 -17313 -17534 -9439 2204 10907 13969 14351 12020 3453 -9637 -18466 -16572 -8574 -760
1204 -760 6147 13404 17342 13545 3234 -8612 -15668 -16099 -10617 -3364 4169 12308 17952 15136 3878
1219 3878 -7704 -13462 -14120 -12463 -7420 2435 13279 18041 14465 4883 -4230 -10731 -14304 -14412 -9167
1234 -9167 1453 12693 17305 13710 6337 -1304 -8299 -14762 -16611 -10507 1241 11135 14966 13432
1248 13432 8840 2069 -6902 -15083 -17250 -10696 121 8581 12956 13916 11394 4292 -6376 -14924
1262 -14924 -16573 -10882 -1994 6147 11467 14515 13783 5991 -5698 -14513 -15338 -10958 -4509 2572 10685
1277 10685 16070 14445 6287 -4359 -11922 -14380 -12558 -6695 986 9560 16096 15284 7029 -2840 -9722
1292 -9722 -12677 -13518 -10028 -815 9828 15449 14122 8005 348 -7193 -13041 -14710 -10788 -2097 7749
$$ packed form
1189B88j0287p314k21Q095J1643Q703L062L82k331q567j3090q829J894P998P814
1204g60O907P257L938l797j0311j1846p056m31N482P253P533Q139N644k816j1258
1219C878j1582n758o58J657N043R855J0844M762l576r582r113o501l573j08N245
1234i167J0620J1240M612l595p373p641o995o463j849O104J1748R894L831j534
1248A3432m592o771q971q181k167O554J0817Q460M375R60k522p102j0668q548
1262a4924j649N691Q888Q141N320L048p32p792j1689q815q25M380O449P081Q113
1277A0685N385j625q158j0646p563k458J822N863P681Q574O536q12q255r869o882
1292i722k955q41L490R213J0643N621j327o117p657p541n848j669L922Q691R846
$$ plain form
1307 7749 14444 14044 9037 2626 -4914 -12250 -16072 -12138 -2436 6836 11950 13229 11479 5411 -4019
1322 -4019 -12034 -15355 -12294 -4333 4290 10389 13159 12440 7265 -2299 -11494 -15178 -12085 -5167 1679
1337 1679 8361 13505 14060 7966 -1619 -9862 -13612 -12112 -7479 -126 7254 13460 14486 8983 16
1352 16 -8232 -12471 -12716 -9244 -2701 6174 13426 14652 9329 1411 -5681 -10929 -13442 -10820 -3780 5432
1368 5432 12202 13599 10154 3586 -4091 -10350 -13492 -11972 -5346 4272 11307 12973 10681 5570 -1204
1383 -1204 -9235 -13939 -12492 -5622 2500 8790 12335 11837 7066 -424 -8422 -13497 -12759 -6922 1020
1398 1020 7648 11570 12440 9191 1368 -7502 -12782 -12445 -7697 -1495 5407 11168 13329 9873 2169
1413 2169 -6401 -11641 -12365 -9099 -3210 3787 10615 13658 10796 3538 -4732 -9935 -11990 -10396 -5319
$$ packed form
1307G749O695m00n007o411p540p336l822L934R702R272N114J279j750o068r430
1322d019q015l321L061P961Q623O099K770p19n175r564r195l684L093O918O846
1337A679O682N144N55o094r585q243l750J500M633P353P380O206J026n503q967
1352A6q248m239k45L472O543Q875P252J226n323p918p092n248k513K622P040R212
1368E432O770J397l445o568p677o259l142J520O626R618P035J666k292n111o774
1383a204q031m704J447O870Q122O290L545m98m771p490p998n075P38N837P942
1398A020O628L922Q70l249p823q870n280L37M748O202O902N761K161l456p704
1413B169q570n240p24L266N889O997O828L043k862p258q270n203k055J594N077
$$ plain form
1428 -5319 2774 9905 13513 11201 4508 -2720 -8595 -11907 -11805 -6853 1548 9259 12827 11085 6230
1443 6230 -257 -7125 -11679 -12497 -7800 433 7828 11704 11247 7225 1226 -5988 -12036 -12850 -8473 -979
1459 -979 6355 10618 11658 8930 3115 -4936 -11354 -12430 -8600 -2162 4363 9658 11727 10205 4142
1474 4142 -4095 -10696 -12299 -9475 -3912 2583 8353 12221 11079 5301 -2826 -8639 -11246 -9759 -5612
1489 -5612 764 7729 12047 11309 5749 -1560 -7657 -10696 -10466 -7247 -852 6705 12313 11345 6373 113
1505 113 -5201 -9453 -11475 -8586 -1281 6406 10579 10820 7490 2042 -4475 -9337 -11650 -9484 -2784
1520 -2784 5054 9794 10460 8199 4135 -2188 -9200 -12011 -9311 -3008 3162 7865 10485 9692 5309
1535 5309 -1879 -8573 -11446 -9661 -4525 1181 6597 10037 10907 6918 -704 -7551 -10503 -9332 -5793
$$ packed form
1428e319Q093P131L608k312o693p228n875l312J02M952Q401P711L568j742m855
1443F230o487o868m554q18M697Q233P395L876m57m022n999p214o048q14M377P494
1459i79P334M263J040k728n815q051o418j076L830O438O525N295K069j522o063
1474D142q237o601j603K824N563O495N770L868j142n778q127n813k607J487M147
1489e612O376O965M318p38n560p309o097l039K30L219O395P557N608r68m972o260
1505A13n314m252k022K889P305P687M173K41l330n448o517m862k313K166O700
1520b784P838M740O66k261m064o323p012k811K700O303O170M703K620p93m383
1535E309p188o694k873J785N136N706N416L440Q70l989p622o847k952J171L539
$$ plain form
1550 -5793 -835 5434 10388 11368 7126 -42 -6127 -9408 -9886 -7482 -2534 4247 10114 11490 7566
1565 7566 1605 -4180 -7955 -9994 -8993 -3620 4079 9744 10720 7877 2992 -2647 -7590 -11070 -9847
1580 -9847 -4429 2906 8313 10229 8456 4841 -759 -6788 -11069 -10008 -4554 2228 7039 9257 9335
1595 9335 6659 2 -6699 -11027 -10098 -5505 28 5261 8824 10012 7452 1363 -5955 -10167 -9346
1610 -9346 -5741 -1214 3701 8775 11077 8002 1313 -5264 -8742 -9622 -7856 -3128 3069 8385 10473
1625 10473 8033 2514 -3243 -7208 -8844 -8043 -4227 2166 8507 10418 7723 3424 -1487 -5899 -9806
1640 -9806 -9719 -5311 1366 7069 9167 8200 4772 215 -4918 -9114 -9722 -5626 727 6204 8524 8350
1656 8350 6277 1692 -4598 -9645 -9932 -6087 -720 4043 7187 8827 7384 2537 -3891 -8622 -9020
$$ packed form
1550e793M958O269M954R80m242p168o085l281m78K404M948O781N867J376l924
1565G566n961n785l775k039J001N373P699N665R76k843m885n639m943l480J223
1580i847N418P335N407J916j773l615n600o029m281J061N454O782M811K218P8
1595I335k676o657o701m328R29M593N533N233L563J188k560o089p318m212Q21
1610i346L605M527M915N074K302l075o689o577l478q80J766M728O197N316K088
1625A0473k440n519n757l965j636Q01L816O393O341J911k695m299m911m412l907
1640i806Q7M408O677N703K098r67l428m557n133m196o08M096O353N477K320j74
1656H350k073m585o290n047k87L845N367M763L144J640j443m847o428m731l98
$$ plain form
1671 -9020 -6285 -2048 2566 7101 9481 8246 3406 -3010 -7483 -8961 -7362 -3804 694 6193 9589
1686 9589 8567 3597 -1942 -5747 -7583 -8062 -5478 260 6342 9126 8357 4759 -326 -4851 -7729
1701 -7729 -8787 -6375 -1063 5203 8806 7923 4855 1404 -3076 -7798 -9560 -6515 -950 4242 7442
1716 7442 8445 6553 2508 -2769 -7469 -9541 -7636 -2405 3311 6349 7617 7559 4287 -2274 -7609
1731 -7609 -8963 -6530 -2984 1134 5937 8800 8271 3998 -1170 -6142 -8614 -7559 -3967 -85 4414
1746 4414 8176 9088 4910 -1277 -5269 -7173 -7398 -5701 -632 4890 8537 8233 5296 573 -4019 -7078
1762 -7078 -7772 -6271 -2192 3521 7948 8224 4995 1215 -2425 -6256 -8604 -7024 -1953 3528 6755
1777 6755 7841 6390 3092 -1800 -6043 -8238 -7229 -3390 1819 5845 7373 6486 3835 -696 -5629
$$ packed form
1671i020K735M237M614M535K380j235m840o416m473j478J599L558M498N499L396
1686I589j022m970n539l805j836m79K584N738O082K784p69l598n085m525k878
1701g729j058K412N312O266L603q83l068l451m480m722j762L045N565N192L200
1716G442J003j892m045n277m700k072J905N231N716L038J268n8l272o561n335
1731g609j354K433L546M118M803K863n29m273n168m972k472J055L592L882M499
1746D414L762R12m178o187l992j904k25J697N069N522L647l04k937m723m592l059
1762g078o94J501M079N713M427K76l229l780l640l831k348J580N071N481L227
1777F755J086j451l298m892m243k195J009L839N209M026J528q87k651m531m933
$$ plain form
1792 -5629 -8148 -6946 -3435 807 4730 7079 7683 4916 -151 -4992 -7378 -7207 -4549 -726 3462
1807 3462 6779 7585 5394 477 -4061 -6415 -6851 -4933 -2077 2738 6989 8133 5606 1198 -2948
1822 -2948 -5681 -7040 -6278 -2882 1978 6129 7554 6004 2246 -1703 -5049 -6997 -6836 -3457 1504
1837 1504 5906 7222 6185 3371 -1 -4199 -7098 -7138 -4185 612 4579 6398 6409 4314 362 -3962
1853 -3962 -6845 -7215 -4444 -329 3677 6121 6910 5347 1365 -3213 -6656 -7204 -4909 -1341 2343 5452
1869 5452 6906 5910 1812 -2941 -5888 -6680 -5121 -2744 1597 5456 7484 6003 2402 -1702 -4825
1884 -4825 -6466 -5944 -3295 475 4858 7110 6535 2998 -1238 -4275 -6075 -6476 -4066 158 4696 7021
1900 7021 6263 3534 501 -3372 -6256 -6968 -4697 -643 3361 5824 6209 4332 1007 -2854 -5816 -6771
$$ packed form
1792e629k519J202L511M242L923K349O04k767n067m841k386J71K658L823M188
1807C462L317Q06k191m917m538k354m36J918K856M815M251J144k527m408m146
1822b948k733j359P62L396M860M151J425j550l758l949l346j948J61L379M961
1837A504M402J316j037k814l372m198k899m0K953M797L967J819J1k095l952m324
1853c962k883l70K771M115M006K444P89j563l982m578l443n48K295L568L684L109
1869E452J454r96m098m753k947p92J559K377M341L859K028j481l601m104l123
1884d825j641N22K649L770M383K252n75l537m236l037j800m01K410M224M538K325
1900G021p58k729l033l873k884p12K271M054M004K463L85j877l325l861k962r55
$$ plain form
1916 -6771 -5091 -1263 2924 5743 6332 4898 2341 -1847 -5578 -6673 -5033 -1735 1620 4411 6110
1931 6110 6029 2736 -1854 -5143 -6036 -5317 -2657 500 4160 6464 6268 3234 -826 -4203 -5689 -5423
1947 -5423 -3223 -182 3289 6143 6140 3482 -294 -3398 -5241 -5680 -4409 -841 3363 5953 6097 3937
1963 3937 757 -2407 -4742 -6010 -4852 -1693 2320 5237 5420 4266 1774 -1464 -4863 -6243 -5170
1978 -5170 -1863 1800 4490 5606 4926 2526 -774 -4073 -5943 -5367 -2271 1107 3511 5127 5065 3490
1994 3490 -298 -4167 -5820 -5181 -3074 1 2919 5423 5940 3909 352 -2950 -5112 -5216 -3866 -1108
2010 -1108 2238 4778 5889 4195 856 -2573 -4656 -5268 -4266 -1841 1793 4957 5835 4342 1261
2025 1261 -1355 -3825 -5577 -4814 -2467 1446 4582 5304 4614 2256 -705 -3548 -5388 -5256 -2867 683
$$ packed form
1916f771J680L828M187K819N89j434k557m188l731j095J640L298L355K791J699
1931F110q1l293m590l289q93P19K660L157L660K304j96l034m060l377j486K66
1947e423K200L041L471K854lk658l776l104j843m39J271L568M204K590J44k160
1963C937l180l164k335j268J158L159M013K917J83j154k492l238l399j380J073
1978e170L307L663K690J116o80k400l300l299j870N76L096L378K404J616o2j575
1994C490l788l869j653O39K107L075K918K504N17k031l557l302k162j04J350K758
2010a108L346K540J111j694l339l429k083o12J002K425L634L164Q78j493l081
2025A261k616k470j752P63K347L913L136P22o90k358k961k843j840J32K389L550
$$ plain form
2041 683 3824 5152 4410 3087 351 -3051 -5415 -5236 -3000 152 2695 4512 5115 3611 703 -2886
2057 -2886 -5161 -5135 -3360 -582 2187 4364 5174 4249 1095 -2156 -4618 -4942 -3806 -1389 1382 4020
2073 4020 5355 4412 1538 -1791 -4091 -4884 -4397 -2118 1022 3687 5051 4654 2194 -1055 -3443 -4537
2089 -4537 -4205 -2766 302 3522 5024 4369 2217 -72 -2589 -4484 -4924 -3236 -12 2948 4434 4382
2105 4382 3039 877 -2320 -4206 -4756 -3520 -706 2331 4018 4420 3328 1158 -1611 -4041 -4969 -3582
2121 -3582 -1200 1467 3640 4492 4152 1804 -1341 -3931 -4569 -3583 -1749 745 3223 4615 4389 2132
2137 2132 -614 -3343 -4354 -3996 -2225 -53 2595 4407 4337 2273 -67 -2749 -4115 -4082 -3004 -501
2153 -501 2509 4052 4335 2703 372 -2119 -3712 -4430 -3455 -1178 2172 4110 4082 3117 1089 -1414 -3674
$$ packed form
2041F83L141J328p42j323k736l402k364J79K236L152K543J817O03j504k908l589
2057b886k275K6J775K778K769K177Q10r25l154l251k462l24J136K417K771K638
2073D020J335r43k874l329k300p93M87K279L140K665J364l97k460l249k388j094
2089d537L32J439L068L220J502o55k152k289k517j895m40J688L224K960J486n2
2105D382j343k162l197j886n50J236K814L037J687M02j092k170k769k430r28J387
2121c582K382K667K173Q52l40k348l145k590o38R86J834K494K478J392k26k257
2137B132k746k729j011L58J771K172K648J812p0k064k340k682j366L3J078K503
2153e01L010J543K83j632k331k491j593p18R75K277L350J938k8r65k028k503k260
$$ plain form
2170 -3674 -4365 -3475 -1183 1390 3452 4111 3342 1804 -853 -3376 -4296 -3711 -1717 891 2849 3866
2186 3866 3616 2163 -256 -3000 -4230 -3766 -1911 270 2444 3644 3921 2494 -31 -2482 -3750 -3834
2202 -3834 -2402 -477 1902 3889 4248 2987 364 -1966 -3560 -3462 -3089 -1219 1422 3377 4005 2858
2218 2858 777 -1612 -3029 -3551 -3222 -1512 908 2948 4108 3271 1343 -819 -2853 -3749 -3619 -1591
2234 -1591 690 2951 3580 3063 2073 -211 -2461 -3710 -3498 -2108 150 2311 3310 3351 2329 309 -2058
2251 -2058 -3784 -3857 -2172 -285 1847 2995 3378 2737 564 -1571 -3359 -3512 -2512 -880 1271 2957
2267 2957 3570 3044 1018 -1337 -3103 -3733 -2789 -1305 700 2594 3843 3179 1278 -885 -2591 -3201
2283 -3201 -2769 -1687 277 2753 3784 3201 1524 -169 -2094 -3372 -3196 -2154 -59 1943 3307 3468
$$ packed form
2170c674o91Q90K292K573K062O59p69j538k657k523r20N85J994K608J958J017
2186C866k50j453k419k744j230M64J855K181K174J200K77j427k525k451j268q4
2202c834J432J925K379J987L59j261k623k330j594R8L73J870K641J955O28j147
2218B858k081k389j417n22L29J710K420K040J160q37j928k162k034q96J30K028
2234a591K281K261O29n17r90k284k250j249K12J390K258K161R99M1j022k020k367
2251b058j726p3J685J887K132J148L83o41k173k135j788j53J000J632K151J686
2267B957O13n26k026k355j766o30R44J484K005J894J249o64j901k163j706o10
2283c201M32J082J964K476J031n83j677j693j925j278J76J042K095K002J364J61
$$ plain form
2299 3468 2028 -68 -1598 -3054 -3616 -2260 -195 1926 2846 3104 2433 656 -1414 -2869 -3553 -2236
2315 -2236 -441 993 2610 3095 2392 1152 -962 -2601 -3311 -2697 -1102 1090 2511 2831 2885 1647 -746
2332 -746 -2587 -3008 -2512 -1463 -57 1717 3191 2861 1521 -383 -1758 -2796 -3076 -1680 -70 1772
2348 1772 2923 3083 2107 56 -1651 -2657 -2856 -2104 -715 1332 2951 2969 1821 684 -679 -2349
2364 -2349 -3086 -2597 -654 1169 2373 2754 2523 1153 -527 -2215 -3040 -2621 -1322 820 1804 2657 2450
2381 2450 1698 -153 -1880 -3396 -2807 -1237 516 1534 2470 2843 1798 112 -1954 -2813 -2589 -1795 -351
2398 -351 1163 2433 2805 1898 360 -1396 -2528 -2710 -1797 -673 1364 2390 2624 2116 822 -1264 -2202
2415 -2202 -2536 -2045 -967 697 2245 2717 1763 737 -314 -1759 -2894 -2411 -1263 751 1942 2728
$$ packed form
2299C468j440k096j530j456n62J356K065K121R20K58o71j777k070j455o84J317
2315b236J795J434J617M85p03j240k114j639p10O14J595K192J421L20N4j238k393
2332g46j841m21M96J049J406J774J474l30j340j904j375j038k80J396J610J842
2348A772J151J60r76k051j707j006j99P52J389K047J619J8j148j137j363j670
2364b349p37M89J943J823J204L81k31j370j680j688q25M19J299K142R84Q53k07
2381B450p52j851j727j516N89J570J753J018R36L73j045j686k066q59K24P94J444
2398c51J514J270L72r07j538j756j132j82R13J124K037J026K34n08j294k086r38
2415b202l34M91J078J664J548M72r54j026j051j445j135M83J148K014J191P86
$$ plain form
2431 2728 2274 1040 -353 -1628 -2455 -2797 -1494 469 1897 2388 2006 1586 183 -1635 -2524 -2548 -1424
2448 -1424 220 1326 2064 2549 1828 446 -1130 -2582 -2408 -1481 -356 929 1870 2504 2153 807 -1118
2465 -1118 -1804 -2126 -1869 -735 511 1905 2505 2237 812 -713 -1658 -2109 -2150 -1131 130 1646 2252
2482 2252 2198 765 -387 -1318 -2191 -2128 -1512 -110 1552 2314 1996 1187 149 -858 -2053 -2396 -1748 -356
2500 -356 1293 1890 1856 1284 662 -855 -1928 -2510 -1633 -274 789 1846 2023 1896 1074 -630 -1930 -2173
2518 -2173 -1595 -578 69 1287 1986 2315 1070 -570 -1788 -1973 -1455 -962 126 1310 2117 2267 1380
2535 1380 29 -1204 -1788 -1782 -1344 -236 993 2074 1920 1189 109 -905 -1656 -2073 -1701 -466 1122
2552 1122 2014 2209 1484 249 -364 -1238 -2024 -1983 -613 820 1522 1684 1459 841 -325 -1611 -2374 -1775
$$ packed form
2431B728m54j234j393j275q27l42J303J963J428M91l82m20j403j818q89k4J124
2448a424J644J106P38M85p21j382j576j452J74R27J125J285R41O34l51j346j925
2465a118o86l22K57J134J246J394O00k68j425j525r45m51m1J019J261J516O06
2482B252n4j433j152r31q73O3O16J402J662P62l18q09j038j007j195l43O48J392
2500c56J649N97l4n72o22j517j073n82Q77J359J063J057J77j27q22j704j300k43
2518b173N78J017O47J218O99L29j245j640j218j85N18M93J088J184Q07J50q87
2535A380j351j233n84OM38J108J229J081j54p31j080j014p51m17L72J235J588
2552A122Q92J95p25j235o13q74p86M1J370J433P02J62k25o18j166j286p63N99
$$ plain form
2570 -1775 -686 368 1527 1896 1819 1023 -192 -1364 -2247 -1933 -964 172 944 1568 1853 1077 -332 -1243
2588 -1243 -1874 -1714 -918 -109 850 1568 1982 1272 196 -1093 -1523 -1699 -1543 -371 779 1703 1764 1093 127
2607 127 -650 -1236 -1547 -1434 -476 327 1340 1864 1126 658 5 -1224 -1760 -1636 -551 305 1011 1377 1350
2626 1350 686 -278 -972 -1507 -1466 -753 -60 1030 1474 1443 1121 252 -802 -1656 -1534 -880 -200 617 1399 1548
2646 1548 1235 208 -687 -1255 -1724 -1058 -425 210 1211 1448 1453 720 -500 -1155 -1279 -1503 -722 483 1135
2665 1135 1394 1276 546 -175 -952 -1272 -1300 -872 -179 1208 1565 1537 640 -64 -649 -1174 -1390 -860 -209 646
2685 646 1205 1444 921 255 -659 -1275 -1602 -1064 -437 531 1152 1427 1268 379 -408 -1023 -1252 -1150 -510 489
2705 489 1036 1131 1244 451 -469 -1112 -1170 -1318 -654 241 894 1220 1287 858 -213 -791 -1274 -1262 -543 -33 738
$$ packed form
2570a775J089J054J159L69p7p96j215j172q83L14R69J136P72O24K85p76j409r11
2588a243o31J60P96Q09R59P18M14p10j076j289m30j76J56J172J150R24O1o71r66
2607A27p77n86l11J13R58Q03J013N24p38m68o53j229n36J24J085Q56P06L66k7
2626A350o64r64o94n35M1P13O93J090M44l1l22q69j054q54J22O54O80Q17P82J49
2646A548l13j027q95n68m69O66O33O35J001K37Np33j220o55j24k24P81J205O52
2665A135K59j18p30p21p77l20k8M28O93J387L57k8q97p04n85n25k16N30O51Q55
2685F46N59K39n23o66r14o16l27N38O27R68O21K75j59q89p87o15k29J02O40R99
2705D89N47R5J13p93r20o43n8j48O64Q95O53L26O7m29j071n78m83J2P19N10P71
$$ plain form
2726 738 1217 1326 755 31 -697 -1098 -1284 -812 -250 697 1138 1122 908 192 -375 -932 -970 -817 -432 518 860
2747 860 1207 755 407 -374 -1095 -1252 -1004 -461 236 898 1162 876 541 -247 -796 -1132 -837 -520 34 725
2767 725 869 1032 764 -6 -377 -1089 -1235 -640 -40 548 1116 1114 658 169 -451 -700 -1084 -863 -381 366 972
2788 972 1003 930 489 -359 -925 -1143 -1057 -430 156 683 961 975 552 -50 -514 -826 -964 -498 212 556 732
2809 732 975 625 -224 -785 -774 -816 -686 -29 483 807 1048 595 217 -240 -777 -851 -427 -233 383 916 834
2830 834 602 378 -239 -797 -1019 -586 -55 264 636 784 865 447 -125 -614 -608 -1037 -407 258 530 700 716
2851 716 639 0 -697 -777 -833 -630 -230 472 960 834 373 63 -415 -623 -1103 -573 -271 193 734 1122 773
2872 773 -170 -463 -593 -423 -827 -584 227 992 552 549 348 -132 -603 -795 -800 -456 114 406 761 409 383 -158
$$ packed form
2726G38M79J09n71p24p28m01j86M72N62R47M41j6k14p16n67n57l8J53L85R50L42
2747H60L47m52l48p81p21j57K48N43O97O62K64k86l35p88n49l36K95L17N54O91
2767G25J44J63k68p70l71p12j46N95O00N88N68km56m89o20k49l84K21M82P47O06
2788I72L1p3m41q48n66k18Q6O27N86N27K78J4m23o02m64l12j38M66P10L44J76
2809G32K43l50q49n61J1m2J30O57N12L24K41m53l78m57n37p4M24J94O16N33q2
2830H34k32k24o17n58k22M33N31L19L72J48Q1m18n72m89Om29O30O65K72J70J6
2851G16p7o39o97q0n6K03M00P02M88j26m61l10m78k08m80N30L02M64N41L88l49
2872G73r43k93j30J70m04K43Q11P65m40lk01m80m71j92nL44N70K92L55l52k6n41
$$ plain form
2894 -158 -401 -700 -922 -472 97 503 598 725 513 138 -433 -525 -606 -315 -261 175 565 846 641 326 -236
2915 -236 -834 -642 -580 -245 185 368 531 579 352 -66 -105 -472 -243 -283 176 301 714 671 373 -33 -395 -436
2937 -436 -677 -462 -121 291 494 713 488 204 -202 -386 -477 -320 -178 217 537 606 498 386 -117 -319 -672
2958 -672 -686 -350 -96 375 525 740 336 84 -380 -739 -619 -324 24 250 731 658 560 20 -308 -440 -494
2979 -494 -362 -361 38 637 528 621 77 -296 -418 -621 -538 -314 100 456 482 642 8 -314 -241 -583 -576 -437 353
3002 353 376 530 718 79 247 -397 -559 -527 -269 141 447 453 433 561 76 -347 -415 -714 -315 -17 196 390
3024 390 369 438 296 -213 -492 -416 -318 -283 -3 500 500 489 275 -170 -532 -306 -527 -300 123 303 603 702 273
3047 273 175 -206 -566 -695 -372 -245 -72 558 557 481 224 94 -256 -717 -433 -471 220 181 479 398 101 -128
$$ packed form
2894a58k43k99k22M50N69M06R5J27k12l75n71r2q1K91N4M36L90K81k05l15n62
2915b36n98J92O2L35M30J83J63M8k27m18l9l67K29m0M59J25M13m3k98m06l62m1
2937d36k41K15L41M12K03K19k25k84m06j84r1J57J42L95L20O9j08j12n03k02l53
2958f72j4L36K54M71J50K15m04k52m64l59J20K95L48K26M81p3r8n40l28j32n4
2979d94J32JL99N99j09R3n44l73j22k03Q3K24M14L56K6J60o34l22P3l42PJ39P90
3002C53K3J54J88o39J68o44j62L2K58M10L06Ok0J28m85m23o8k99L99K98K13J94
3024C90k1O9j42n09k79P6R8L5K80N03%j1k14m45l62K26k21K27M23J80L00R9m29
3047B73r8l81l60j29L23J27J73O30jp6k57j30l50m61K84l8O91l9K98q1k97k29
$$ plain form
3069 -128 -483 -583 -807 -404 174 350 577 484 325 31 -347 -602 -662 -226 -9 309 298 588 429 45 -215
3090 -215 -540 -477 -490 -64 199 531 702 345 282 -10 -436 -541 -407 -264 -14 389 562 535 407 -165 -267
3111 -267 -444 -548 -105 35 324 646 758 556 -86 -322 -714 -651 -305 -33 480 409 665 525 185 -254 -578
3132 -578 -588 -372 15 190 532 753 619 263 -210 -699 -694 -548 -273 66 427 876 452 474 -150 -582 -632 -485
3154 -485 -238 69 423 893 644 403 244 -544 -732 -695 -491 -168 197 761 590 515 111 -367 -578 -422 -675
3175 -675 -73 367 521 658 457 302 -207 -526 -590 -424 -449 181 518 678 571 393 -20 -443 -711 -683 -216
3196 -216 197 599 555 521 456 146 -522 -588 -465 -401 -134 264 684 679 404 75 -456 -543 -726 -694 -88 -27 752
3219 752 762 380 177 -312 -543 -885 -496 -482 97 480 739 649 393 -123 -549 -460 -769 -487 95 532 912
$$ packed form
3069a28l55j00k24M03N78J76K27r3j59k94l78k55o0M36K17L18j1K90j59l84k60
3090b15l25O3j3M26K63L32J71l57o3k92m26j05J34J43K50M03J73k7j28n72j02
3111b67j77j04M43J40K89L22J12k02o42k36l92O3L46K72N13p1K56j40l40m39l24
3132e78j0K16L87J75L42K21j34l56m73m89NJ46K75L39L61M49m24K2o24m32n0J47
3154d85K47L07L54M70k49k41j59p88j88L7K04L23L65N64j71p5m04m78k11J56k53
3175f75O02M40J54J37k01j55n09l19o4J66k5O30L37J60j07j78m13m23k68K8M67
3196b16M13M02m4l4o5l10o68o6J23O4K67L98M20nk75l29n31q7j83L2O06O1P79
3219G52J0l82k03m89k31l42L89J4N79L83K59r0k56n16m26Q9l09K82N82M37L80
$$ plain form
3240 912 796 416 139 -341 -645 -551 -581 -38 315 806 756 556 204 -325 -805 -777 -691 -228 391 629 670 625
3262 625 299 -113 -627 -745 -586 -139 101 636 1045 879 99 -285 -401 -784 -601 -479 204 575 741 700
3282 700 157 -252 -445 -815 -563 -401 -77 185 832 744 551 107 -617 -731 -694 -597 -297 468 678 607 696 12
3304 12 -134 -746 -731 -658 -298 574 689 910 768 301 -224 -369 -978 -671 -243 186 719 846 705 415 -328
3325 -328 -637 -846 -756 -542 -148 393 854 758 566 -7 -650 -835 -676 -512 228 670 844 752 614 160 -433
3346 -433 -651 -914 -553 -202 554 765 925 602 191 -454 -825 -1050 -606 -358 353 670 1059 790 386 -102
3366 -102 -690 -915 -723 -391 24 467 937 793 345 -174 -627 -870 -742 -445 26 522 1147 924 819 207
3386 207 -502 -1028 -881 -547 -196 422 841 959 742 158 -526 -782 -803 -543 -493 375 787 1004 870 327 -241
$$ packed form
3240I12j16l80k77m80l04R4l0N43L53M91n0k00l52n29m80K8Q6M63O19K38M1m5
3262F25l26m12n14j18J59M47K40N35M09j66p80l84j16l83J83J22O83L71J66m1
3282G00n43m09j93l70K52J62L24K62O47q8j93m44p24j14L7R7L00P65K10p1Q9o84
3304A2j46o12J5P3L60Q72J15K21j42m67n25j45o09L07M28M29N33J27j41k90p43
3325c28l09k09R0K14L94N41M61r6j92n73o43j85J59J64P40M42J74r2j38m54n93
3346d33k18k63L61L51P56K11J60l23m11o45l71k25M44K48P11L17L89k69m04m88
3366a02n88k25J92L32M15M43M70j44m48n19m53k43J28K97M71M96O25k23j05o12
3386B07p09n26J47L34L51O18M19J18k17n84o84k56k1K60N0Q68M12K17j34n43n68
$$ plain form
3407 -241 -801 -965 -865 -247 137 672 1040 902 288 -172 -639 -847 -735 -417 -57 610 734 997 408 5
3427 5 -563 -852 -963 -582 -263 560 705 877 681 -32 -495 -905 -958 -733 -136 436 899 861 677 232 -384
3448 -384 -838 -835 -860 -227 163 812 857 810 295 -415 -830 -866 -920 -311 101 646 1113 910 528 -24 -847 -1174
3470 -1174 -742 -405 -185 688 1165 878 514 -142 -710 -1031 -1083 -496 103 633 957 1061 647 288 -656 -1057
3490 -1057 -708 -959 -435 476 857 1160 981 154 -255 -837 -922 -780 -441 196 757 1160 1102 595 -280 -688
3510 -688 -1020 -1092 -443 175 852 1143 862 590 -151 -741 -1121 -945 -638 83 572 874 1170 723 -32 -356
3530 -356 -965 -1118 -594 -125 438 1146 936 753 123 -187 -997 -1191 -925 -242 288 710 1090 713 130 -248
3550 -248 -819 -1093 -753 -407 263 837 1144 877 560 -356 -634 -1083 -1058 -451 93 586 1116 1125 698 -303 -506
$$ packed form
3407b41n60j64J00O18L84N35L68j38o14m60m67k08J12L18L60O67J24K63n89m03
3427En68k89j11L81L19Q23J45J72j96p13m63m10n3K25N97N72M63l8j84m45o16
3448c84m54Lk5O33L90O49M5m7n15p10m15l6n4O09M12N45M67k03l82n52q23l27
3470a174M32L37K20Q73M77k87l64o56n68l21n2N87N99N30L24J04m14l59r44m01
3490a057L49k51N24R11L81L03j79q27m09n82q5J42L39O37N61M03n8n07q75m08
3510f88l32p2O49O18O77K91k81k72p41n90l80J76L07P21M89L02K96m47p55l24
3530c56o09j53N24M69N63P08k10j83o30l10q10j94K66O83N30M22L80l77n83l78
3550b48n71k74L40L46O70N74L07k67l17r16k78m49K5O07N44M93N30Rm27j001k03
$$ plain form
3571 -506 -1092 -903 -566 257 741 969 1052 763 126 -414 -693 -1124 -655 -343 528 940 1112 798 21 -496
3591 -496 -990 -1205 -805 -361 397 1068 1113 822 185 -199 -1090 -1059 -781 -442 188 819 1052 970 204 -259 -950
3612 -950 -1089 -877 -532 -155 755 942 1150 525 -92 -672 -1033 -975 -625 -58 579 995 1080 867 124 -452 -1124
3633 -1124 -1025 -690 4 556 1009 1222 1002 160 -426 -1015 -1192 -971 -330 470 712 1087 826 264 -199 -888
3653 -888 -956 -884 -214 437 854 998 1124 653 -258 -591 -931 -755 -602 -1 712 1200 923 557 158 -816 -1037
3674 -1037 -1103 -645 195 758 1192 892 745 46 -657 -958 -942 -909 -388 494 816 1145 999 84 -395 -811 -1329
3695 -1329 -892 -332 525 915 1228 1167 593 -318 -936 -1047 -1132 -356 198 845 1279 978 338 -93 -819 -958
3715 -958 -956 -462 67 813 1245 1008 508 229 -627 -1078 -1149 -615 91 491 1098 1272 756 -61 -750 -1283 -1230
$$ packed form
3571e06n86J89L37Q23M84K28Q3k89o37n40k79m31M69L12Q71M12J72l14p77n17
3591d96m94k15M00M44P58O71M5k91o37l84q91L1K78L39O30O31K33q2p66m63o91
3612i50j39K12L45L77R10J87K08o25o17n80l61N8L50N67O37M16Q5k13p43n76o72
3633a124R9L35O94N52M53K13k20q42n86n89j77K21O41Q00K42L75k61n62m63o89
3653h88o8P2O70O51M17J44J26m71r11l33l40J76J53O01P13M88k77l66l99r74k21
3674a037o6M58Q40N63M34l00j47o99p03l01J6L3N21Q82L22L29j46r15m79m16n18
3695a329M37N60Q57L90L13o1n74r11o18j11q5P76N54O47M34l01o40m31p26j39
3715i58KM94N29P46M32k37n00k79q56m51p1N34P06M00O07J74n16q17o89n33N3
$$ plain form
3736 -1230 -728 -190 424 1112 1128 1083 273 -612 -845 -1407 -877 -296 288 909 1136 859 335 -133 -976 -1191
3756 -1191 -751 -612 286 888 1280 733 561 -315 -924 -1063 -970 -359 -12 634 968 1226 567 -4 -817 -1196
3776 -1196 -1226 -663 111 594 1208 1120 671 182 -588 -1178 -1148 -723 -70 580 984 1155 907 386 -769 -969
3796 -969 -1182 -867 -438 458 922 1180 1307 219 -373 -888 -1117 -941 -510 198 787 1206 1112 544 -405 -824
3816 -824 -1313 -1123 -638 176 893 1056 1347 564 18 -729 -1257 -1323 -761 69 503 1178 1233 872 -47 -781 -1102
3837 -1102 -1161 -645 -166 600 1102 1189 780 209 -314 -1192 -1280 -976 -581 330 849 1028 870 341 -484 -689 -1124
3858 -1124 -1032 -660 302 824 1278 883 539 -275 -814 -1052 -1094 -664 4 690 1084 915 665 56 -619 -1168
3878 -1168 -1152 -770 -95 797 968 1475 680 143 -749 -888 -1355 -820 -231 531 1230 952 877 111 -428 -1098
$$ packed form
3736a230N02N38O14O88J6m5q10q85k33n62N30N81N84O21K27k77n24m68q43k15
3756a191M40J39Q98O02L92n47j72q76o09j39R3O11L47O46L34K58o59n71q13l79
3776a196l0N63P74M83O14q8m49m89p70n90L0M25O53O50M04J71k48n21j155k00
3796i69k13L15M29Q96M64K58J27j088n92n15k29J76M31P08N89M19r4n68r49m19
3816h24m89J90M85Q14P17J63K91p83n46p47n28o6N62Q30M34O75N5l61r19p34l21
3837a102n9N16M79P66N02Q7m09n71n23q78q8L04L95R11N19J79j58n29q25k05m35
3858a124R2L72R62N22M54l95l44q14n39k38m2M30O68O86L94j69k50o09o75n49
3878a168J6L82O75Q92J71N07p95n37q92j39m67N35N89P62O99k78p5p66n39o70
$$ plain form
3898 -1098 -1273 -909 -223 351 957 1092 1046 418 -100 -1085 -1153 -1184 -536 318 687 1158 1125 547 -89 -801 -1274
3919 -1274 -1003 -630 -5 742 1211 1088 786 213 -822 -918 -1195 -924 15 476 1219 1039 861 128 -289 -1187
3939 -1187 -1175 -895 -20 561 935 1056 752 105 -500 -1113 -1047 -1099 -215 397 849 1144 981 266 -402 -795 -1274
3960 -1274 -872 -542 267 854 1170 1079 507 -388 -813 -1063 -1089 -568 136 800 1127 1178 721 -171 -687 -1228 -1034
3981 -1034 -679 137 668 1254 1356 776 142 -591 -970 -905 -780 -27 471 1143 1206 943 355 -379 -965 -1063 -699
4002 -699 -317 539 1178 1288 1124 237 -382 -805 -1212 -887 -457 262 845 1106 948 428 -47 -903 -1207 -892
4022 -892 -409 155 804 1168 965 537 -156 -685 -1157 -1077 -431 43 872 1028 1141 579 -85 -286 -892 -1223
4042 -1223 -623 -129 563 1149 1165 978 125 -485 -1018 -1043 -868 -224 609 1189 1287 996 367 -314 -992 -1313 -778
$$ packed form
3898a098j75L64O86N74O06J35m6o28n18r85o8l1O48Q54L69M71l3n78o36p12m73
3919a274K71L73O25P47M69j23l02n73j035r6k77K71R39M61P43j80j78p33m17q98
3939a187J2K80Q75N81L74J21l04o47o05o13O6n2Q84O12M52K95j63p15o68l93m79
3960a274M02L30Q09N87L16r1n72q95m25k50k6N21P04O64L27N1m57q92n16n41J94
3981a034L55Q16N31N86J02n80o34p33l79O5J25P53M98O72O3k63n88p34n86r8L64
4002f99L82Q56O39J10j64q87o19m23m07L25M30P19N83K61j58n20m75q56l04L15
4022h92M83N64O49L64k03m28o93n29m72Q0O46M74Q29J56J13n62o64k01o06l31
4042a223O00M94O92N86J6j87q53o10n33k5J75O44Q33N80R8k91o29o81o78l21N35
$$ plain form
4063 -778 -501 264 888 1103 1014 540 -200 -877 -984 -930 -362 127 868 909 1189 756 129 -756 -993 -904 -886 -39
4085 -39 736 1167 1175 712 105 -347 -862 -1056 -694 -155 215 1141 1108 812 393 -649 -1010 -1150 -645 -200 537
4106 537 755 1050 981 469 -437 -848 -1238 -896 -324 172 1003 967 1000 354 -460 -790 -945 -848 -550 195 752
4127 752 1245 956 514 41 -750 -1271 -1074 -767 272 586 1146 1009 552 -33 -555 -1205 -1094 -963 -134 643
4147 643 875 1151 756 335 -473 -982 -914 -868 -441 365 817 1061 775 141 -480 -917 -864 -944 -667 477 859
4168 859 1247 1088 510 7 -720 -1062 -919 -493 1 627 1041 1077 696 0 -629 -973 -967 -608 104 777 986
4189 986 1177 746 293 -385 -967 -1191 -812 -58 365 1061 1050 772 317 -307 -951 -1127 -874 -201 324 807
4209 807 1183 817 297 -376 -717 -965 -718 -587 294 681 1115 1091 453 -89 -747 -1130 -1058 -614 102 789 1062
$$ packed form
4063g78K77P65O24K15q9m74p40o77j07N4N68M89P41M1K80m33o27q85k37Q9J8Q47
4085c9P75M31Qm63o07m52n15j94L62N39L70R26l3k96m19j042l61j40N05M45P37
4106E37K18K95o9n12r06m11l90L42N72M96Q31l6L3o46q14l30j55R7K98P45N57
4127G52M93k89m42m73p91n21J97L07J039L14N60j37m57n85n22o50J11J31Q29P77
4147F43K32K76l95m21q08n09O8M6M27Q06M52K44k86o34o21m37N3q0K77J144L82
4168H59L88j59n78n03p27l42J43M26M94O26M14L6l81o96o29l44OL59P12O73K09
4189I86J91m31m53o78n82k24L79P54M23O96j1k78m55o24o44j76K53O73N25M83
4209H07L76l66n20o73l41k48K47J31Q81L87M34k4o38n42o58l83P2M44P16O87K73
$$ plain form
4230 1062 1200 572 31 -732 -1006 -1084 -572 137 794 1241 1129 766 -42 -579 -988 -1147 -734 -174 498 1041
4250 1041 1169 698 146 -502 -972 -1013 -849 -195 565 1025 1033 823 230 -167 -592 -1199 -829 -560 224 890 975
4271 975 955 329 -224 -770 -1115 -1032 -440 97 738 1169 990 636 41 -722 -967 -969 -617 187 668 856 1206
4292 1206 670 -4 -662 -983 -1198 -796 -271 497 921 1014 698 210 -601 -930 -910 -645 -254 221 1015 1056 954
4313 954 418 -230 -832 -1145 -798 -509 113 661 1176 873 288 -235 -717 -971 -763 -547 137 712 1017 937
4333 937 674 -175 -666 -1006 -1034 -712 52 435 1053 1050 847 113 -589 -981 -1069 -556 -171 534 882 921 713 107
4355 107 -405 -966 -1079 -859 -196 519 868 1134 834 350 -163 -792 -1074 -908 -274 119 653 1090 1011 285
4375 285 -197 -705 -1014 -766 -327 71 635 1038 711 591 -84 -840 -931 -891 -508 -1 526 788 1005 617 188
$$ packed form
4230A062J38o28n41p63k74p8N12P09O57M47j12l63q08n37m09j59M13N60O72N43
4250A041J28m71n52o48m70m1J64O54P60M60Qk10n93l97m25o07L70K69P84O66Q5
4271I75k0o26n53n46l45Q3N92N37O41M31j79l54n95p63k45kL52Q04M81J88L50
4292A206n36o74o58l21k15M02N25P68M24R3l16m88q11l29K0K65L91M75P94M1j02
4313I54n36o48o02l13L47K89O22N48N15l03n85n23m82k54K08K16O84N75L05q0
4333I37k63q49m91l40k8L22P64L83O18lk03p34p02l92q8N13L85P05L48L9k08o06
4355A07n12n61j13K20O63P15L49K66l00m84n13o29k82J66O34L93N34M37p9p26
4375B85m82n08l09K48M39L98N64M03l27j20o75p56r1M0L83N07N27K62K17l88m29
$$ plain form
4396 188 -644 -1025 -1011 -922 -137 518 698 1081 772 15 -433 -771 -966 -681 -127 277 981 1133 673 77 -295
4417 -295 -848 -987 -707 -463 295 907 1024 998 393 -33 -664 -1089 -952 -264 -2 583 1004 998 340 -341 -675
4438 -675 -1022 -890 -710 6 783 831 881 497 -296 -559 -873 -1174 -652 -304 279 833 1115 648 77 -392 -730
4459 -730 -1113 -709 -96 245 944 1268 801 190 -565 -866 -1281 -865 -509 279 607 796 878 398 -319 -625
4479 -625 -821 -845 -331 196 808 1038 846 390 -49 -542 -1023 -945 -580 103 587 839 1037 737 101 -390 -897
4500 -897 -874 -646 -87 508 647 795 621 49 -545 -903 -797 -558 -277 358 898 935 803 235 -391 -766 -1186
4521 -1186 -661 -406 236 659 1011 986 304 -219 -760 -956 -675 -499 121 514 1002 613 312 -112 -603 -916
4541 -916 -857 -359 -20 599 919 942 679 14 -460 -837 -902 -557 -144 320 971 954 724 83 -290 -1036 -925
$$ packed form
4396A88q32l81J4Q9P85O55J80L83l09p57m48l38j95K85N54M04P04J52m60n96l72
4417b95n53j39K80K44P58O12J17k6o05m26o31m25J37O88K62N85M21oo58o81l34
4438f75l47J32J80P16P77M8N0l84p93k63l14l01N22L48N83N54K82m67n71m69l38
4459g30l83M04O13L41O99L24m67o11p55l01m15M16L56P88L28J89Q2m80p17l06
4479f25j96k4N14N27O12K30j92m56m39m93m81P8L65O83M84K52J98l00o36m91n07
4500h97K3K28N59N95J39J48j74n72n94l58J06K39K81O35N40L7j32n68o26l75m20
4521a186N25K55O42M23L52k5o82n23n41j96K81J76O20L93M88l89l01m24m91l13
4541i16N9M98L39O19L20K3k63o65m74l77o5L45M13M64O51j7k30o41l73p46J11
$$ plain form
4562 -925 -896 -255 495 896 983 851 151 -217 -977 -1053 -830 -453 257 869 826 854 170 -253 -523 -699 -992 -277
4584 -277 265 672 781 750 401 -67 -423 -966 -1101 -491 -80 667 974 915 476 87 -625 -1081 -872 -462 277
4605 277 608 1154 1039 587 -12 -272 -996 -1173 -905 -30 269 734 969 755 221 -132 -728 -870 -651 -511
4625 -511 347 589 818 514 189 -237 -844 -822 -901 -315 97 627 816 821 530 -257 -473 -747 -842 -715 238 562
4647 562 845 1019 374 -26 -673 -620 -774 -700 -182 448 1005 970 524 158 -442 -855 -844 -796 -185 348 601 820
4669 820 560 213 -281 -926 -684 -741 -58 230 684 770 741 358 -313 -776 -865 -843 -310 431 667 894 729 302
4691 302 57 -623 -689 -708 -439 36 552 827 847 608 -19 -582 -762 -939 -516 71 504 837 893 652 9
4712 9 -334 -607 -904 -654 -201 546 819 964 574 85 -370 -642 -875 -595 -288 234 727 696 788 533 -166
$$ packed form
4562i25K9O41P50M01Q7j32p00l68p60p6K23L77P10O12m3K8o84m23k70j76k93P15
4584b77N42M07J09l1l49m68l56n43j35O10M11P47L07n9m39l89p12m56K09M10P39
4605B77L31N46j15m52n99k60p24j77K68Q75K99M65K35k14n34l53n96j42K19J40
4625e11Q58K42K29l04l25m26o07K2p9N86M12N30J89Nk91p87k16k74r5J27R53L24
4647E62K83J74o45m00o47N3j54P4N18O30N57l5m46l66o00m13J1M8O11N33K53K19
4669H20k60l47m94o45K42n7O83K88M54Q6k9l83o71m63q9K2N33P41K36K27j65m27
4691C02k45o80o6j9K69M75N16K75K0k39o27n63j80j77M23N87M33L33N6k41o43
4712Il43k73k97K50M53P47K73J45l90m89m55k72k33K80L07N22M93l1R2k55o99
$$ plain form
4733 -166 -580 -1047 -755 -182 208 710 849 777 329 -144 -584 -987 -764 -379 208 712 916 918 461 -21 -600
4754 -600 -824 -900 -600 4 448 583 881 544 233 -415 -865 -811 -215 -40 539 570 738 482 137 -404 -780
4775 -780 -805 -702 -209 89 765 878 692 382 -97 -598 -838 -550 -165 233 571 747 792 303 -243 -544 -839
4796 -839 -663 -384 193 541 886 956 441 171 -580 -692 -674 -421 15 654 853 839 606 151 -537 -687 -734
4817 -734 -593 -30 198 510 896 519 181 -364 -656 -728 -404 52 278 729 1082 540 184 -443 -623 -814
$$ packed form
4733a66m14m67K92N73L90N02J39p2m48m73m40m03K23L85N87N04K04Km57m82n79
4754f00k24p6L00O04M44J35K98l37l11o48m50N4N96J75N79L1J68k56l45n41l76
4775g80k5J03M93K98O76J13j86l10m79n01k40K88L85L98L38J76M5m89n46l01k95
4796h39J76K79N77L48L45P0n15k70p51j12J8K53M36O39J99j4k33m55o88j50m7
4817g34J41N63K28L12L86l77l38n45k92p2L24M56K26M51L53n42l56o27j80j91
$$ [...]
8191g8
##END NTUPLES=NMR FID
##END=
