##TITLE=1H_SR_Ala
 CDCl3, 8 sc, 
 27.04.2021
##JCAMPDX= 6.0         $$ Bruker NMR JCAMP-DX V2.0
##DATA TYPE= NMR FID
##DATA CLASS= NTUPLES
##ORIGIN= UXNMR, Bruker Analytische Messtechnik GmbH
##OWNER= root
$$ XWIN-NMR		Version 3.5
$$ Tue Apr 27 16:34:17 2021 Russian Standard Time (UT+4h)  she@DPX200
##.OBSERVE FREQUENCY= 200.131506
##.OBSERVE NUCLEUS= ^1H
##.DELAY= (6, 6)
##.ACQUISITION MODE= SIMULTANEOUS
##.ACQUISITION SCHEME= undefined
##.AVERAGES= 8
##.DIGITISER RES= 18
##SPECTROMETER/DATA SYSTEM= spect
##.PULSE SEQUENCE= zg30
##.SOLVENT NAME= CDCl3
##.SHIFT REFERENCE= (INTERNAL, CDCl3, 0, 15.7039)
##AUDIT TRAIL= $$ (NUMBER, WHEN, WHO, WHERE, WHAT)
$$ ##TITLE= Audit trail, XWIN-NMR		Version 3.5
$$ ##JCAMPDX= 5.01
$$ ##ORIGIN= Bruker BioSpin GmbH
$$ ##OWNER= she
$$ F:/spectra/data/she/nmr/H-F/1/audita.txt
$$ ##AUDIT TRAIL=  $$ (NUMBER, WHEN, WHO, WHERE, WHAT)
(   1,<2021-04-27 16:32:34.09 +0400>,<she>,<DPX200>,
      <created by zg, POWCHK disabled, PULCHK disabled
       configuration hash MD5:
       00 E9 B6 7A A2 85 ED C7 34 08 36 98 17 FE 4E 26
       data hash MD5: 16K
       0D 9A 7A C8 01 12 72 EC 5A D6 0E 2C D5 65 A6 49>)
$$ ##END=
$$ 
$$ hash MD5
$$ B0 C2 DE 87 F9 16 A9 B8 1C 3D 61 B1 A0 8C FF 6E
##$RELAX= 
##$RELAX= 
##$RELAX= 
##$RELAX= 
##$RELAX= 
##$RELAX= 
$$ Bruker specific parameters
$$ --------------------------
##$DU= <F:/spectra>
##$EXPNO= 1
##$NAME= <H-F>
##$PROCNO= 1
##$TYPE= <nmr>
##$USER= <she>
##$AMP= (0..31)
100 100 100 100 100 100 100 100 100 100 100 100 100 100 100 100 100 100 
100 100 100 100 100 100 100 100 100 100 100 100 100 100 
##$AQSEQ= 0
##$AQ_mod= 1
##$AUNM= <au_zg>
##$AUTOPOS= <>
##$BF1= 200.13
##$BF2= 200.13
##$BF3= 200.13
##$BF4= 200.13
##$BF5= 200.13
##$BF6= 200.13
##$BF7= 200.13
##$BF8= 200.13
##$BYTORDA= 1
##$CFDGTYP= 0
##$CFRGTYP= 5
##$CHEMSTR= <none>
##$CNST= (0..31)
1 1 145 1 1 1 1 1 1 1 1 1 1 1 1 1 1 1 1 1 1 1 1 1 1 1 1 1 1 1 1 1 
##$CPDPRG= <>
##$CPDPRG1= <>
##$CPDPRG2= <>
##$CPDPRG3= <>
##$CPDPRG4= <mlev>
##$CPDPRG5= <mlev>
##$CPDPRG6= <mlev>
##$CPDPRG7= <mlev>
##$CPDPRG8= <mlev>
##$CPDPRGB= <>
##$CPDPRGT= <>
##$D= (0..31)
0 1.2 0 0 0 0 0 0 0 0.06 0 0.03 0 0 0 0 0.0002 0 0 0 0 0 0 0 0 0 0 0 0 
0 0 0 
##$DATE= 1619526753
##$DBL= (0..7)
120 120 120 120 120 120 120 120 
##$DBP= (0..7)
150 150 150 150 150 150 150 150 
##$DBP07= 0
##$DBPNAM0= <>
##$DBPNAM1= <>
##$DBPNAM2= <>
##$DBPNAM3= <>
##$DBPNAM4= <>
##$DBPNAM5= <>
##$DBPNAM6= <>
##$DBPNAM7= <>
##$DBPOAL= (0..7)
0.5 0.5 0.5 0.5 0.5 0.5 0.5 0.5 
##$DBPOFFS= (0..7)
0 0 0 0 0 0 0 0 
##$DE= 6
##$DECBNUC= <off>
##$DECIM= 32
##$DECNUC= <off>
##$DECSTAT= 4
##$DIGMOD= 1
##$DIGTYP= 9
##$DL= (0..7)
0 120 120 120 120 120 120 120 
##$DP= (0..7)
150 150 150 150 150 150 150 150 
##$DP07= 0
##$DPNAME0= <>
##$DPNAME1= <>
##$DPNAME2= <>
##$DPNAME3= <>
##$DPNAME4= <>
##$DPNAME5= <>
##$DPNAME6= <>
##$DPNAME7= <>
##$DPOAL= (0..7)
0.5 0.5 0.5 0.5 0.5 0.5 0.5 0.5 
##$DPOFFS= (0..7)
0 0 0 0 0 0 0 0 
##$DQDMODE= 0
##$DR= 18
##$DS= 0
##$DSLIST= <SSSSSSSSSSSSSSS>
$$ [...]
##$SUBNAM2= <"">
##$SUBNAM3= <"">
##$SUBNAM4= <"">
##$SUBNAM5= <"">
##$SUBNAM6= <"">
##$SUBNAM7= <"">
##$SUBNAM8= <"">
##$SUBNAM9= <"">
##$SW= 16.9725357007746
##$SWIBOX= (0..15)
0 0 2 0 0 0 0 0 0 0 0 0 0 0 0 0 
##$SW_h= 3396.73913043478
##$TD= 16384
##$TD0= 1
##$TE= 0
##$TE2= 300
##$TE3= 300
##$TEG= 300
##$TL= (0..7)
0 120 120 120 120 120 120 120 
##$TP= (0..7)
150 150 150 150 150 150 150 150 
##$TP07= 0
##$TPNAME0= <>
##$TPNAME1= <>
##$TPNAME2= <>
##$TPNAME3= <>
##$TPNAME4= <>
##$TPNAME5= <>
##$TPNAME6= <>
##$TPNAME7= <>
##$TPOAL= (0..7)
0.5 0.5 0.5 0.5 0.5 0.5 0.5 0.5 
##$TPOFFS= (0..7)
0 0 0 0 0 0 0 0 
##$TUNHIN= 0
##$TUNHOUT= 0
##$TUNXOUT= 0
##$USERA1= <user>
##$USERA2= <user>
##$USERA3= <user>
##$USERA4= <user>
##$USERA5= <user>
##$V9= 5
##$VALIST= <valist>
##$VCLIST= <CCCCCCCCCCCCCCC>
##$VD= 0
##$VDLIST= <DDDDDDDDDDDDDDD>
##$VPLIST= <PPPPPPPPPPPPPPP>
##$VTLIST= <TTTTTTTTTTTTTTT>
##$WBST= 1024
##$WBSW= 4
##$XGAIN= (0..3)
0 0 0 0 
##$XL= 0
##$YL= 0
##$YMAX_a= 317274
##$YMIN_a= -421651
##$ZGOPTNS= <>
##$ZL1= 120
##$ZL2= 120
##$ZL3= 120
##$ZL4= 120
##$ABSF1= 10
##$ABSF2= 0
##$ABSG= 5
##$ABSL= 3
##$ALPHA= 0
##$AQORDER= 0
##$ASSFAC= 0
##$ASSFACI= 0
##$ASSFACX= 0
##$ASSWID= 0
##$AUNMP= <proc_1d>
##$AZFE= 0.1
##$AZFW= 0.1
##$BCFW= 1
##$BC_mod= 2
##$BYTORDP= 1
##$COROFFS= 0
##$CY= 11.3945322036743
##$DATMOD= 1
##$DC= 2
##$DFILT= <>
##$DTYPP= 0
##$F1P= 15.9154993809931
##$F2P= -4.1035820241983
##$FCOR= 0.5
##$FTSIZE= 0
##$FT_mod= 4
##$GAMMA= 1
##$GB= 0.15
##$INTBC= 1
##$INTSCL= 1
##$ISEN= 128
##$LB= 0.24
##$LEV0= 0
##$LPBIN= 0
##$MAXI= 10000
##$MC2= 0
##$MEAN= 0
##$ME_mod= 0
##$MI= 1.114404
##$NCOEF= 0
##$NC_proc= 0
##$NLEV= 6
##$NOISF1= 3.799351
##$NOISF2= 2.8
##$NSP= 1
##$NTH_PI= 0
##$NZP= 0
##$OFFSET= 15.70392
##$PC= 1
##$PHC0= -11116.91
##$PHC1= 8.001015
##$PH_mod= 1
##$PKNL= yes
##$PPARMOD= 0
##$PSCAL= 0
##$PSIGN= 0
##$REVERSE= no
##$SF= 200.130013532006
##$SI= 16384
##$SIGF1= 3
##$SIGF2= 2
##$SINO= 400
##$SIOLD= 16384
##$SREGLST= <1H.CDCl3>
##$SSB= 0
##$STSI= 0
##$STSR= 0
##$SW_p= 3612.71676300578
##$SYMM= 0
##$S_DEV= 0
##$TDeff= 0
##$TDoff= 0
##$TI= <>
##$TILT= no
##$TM1= 0
##$TM2= 0
##$TOPLEV= 0
##$USERP1= <user>
##$USERP2= <user>
##$USERP3= <user>
##$USERP4= <user>
##$USERP5= <user>
##$WDW= 1
##$XDIM= 8192
##$YMAX_p= 0
##$YMIN_p= 0
$$ End of Bruker specific parameters
$$ ---------------------------------
##NTUPLES= NMR FID
##VAR_NAME=  TIME,          FID/REAL,        FID/IMAG
##SYMBOL=    X,             R,               I
##VAR_TYPE=  INDEPENDENT,   DEPENDENT,       DEPENDENT
##VAR_FORM=  AFFN,          ASDF,            ASDF
##VAR_DIM=   8192,          8192,            8192
##UNITS=     SECONDS,       ARBITRARY UNITS, ARBITRARY UNITS
##FACTOR=    0.0002944,     1,               1
##FIRST=     0,             0,               0
##LAST=      2.4114304,     0,               0
##MIN=       0,             -421651,         0
##MAX=       2.4114304,     317274,          0
$$ Real data points
##PAGE= N=1
##DATA TABLE= (X++(R..R)), XYDATA
$$ [...]
2407h94K970j948l124M805j622K38R45m099K867K084l049K219k908l52M771l060
2423a57M7J59k226M458k18l600K236j978J532K415l987O46P08j114M262l024k324
2440b165L104j477J870J98m482K910Q51j100K398m055J1L789k446J545j225k668
2456b942M588l74j591J194l409K536K163l428J097q90m53M423k926j316J574k148
2472a902L389Q0l967K686o80R0L001m597M35K229j878L322k263k301L992j533
2488A03M91J077m528K848J849k708K063k425o77M405k679K30N20k639L885q2l234
2505a501K403k055J061L074m524J173R32j934L616j899k429K919j389J332Q51
2520A630m244K610Q63j826K728k899o41L788k448R32M9l319L835q8k186K403k533
$$ y = [-894, 2076, 128, -2996, 1809, 187, 425, 1370, -2729, 138, 2222, -827, 1392, -1516, -1868, 2903, -157, -110, 49, -2177, 2281, 2063, -1537, 699, -1279, 253, 2668, -1319, -673, 35, -1079, 3183, 159, -2165, 939, -538, 1332, 1530, -2952, -42, 809, -291, 2107, -1948, -1937, 1852, -594, 951, -274, -2942, 1646, 1272, -319, 875, -2534, 2, 2165, -1263, -166, -1056, -1509, 2914, -12, -1328, 246, -1902, 1487, 1567, -2400, 286, -394, -304, 2697, -1900, -1465, 764, -1114, 2208, -55, -2356, 1636, 103, 594, 1671, -2857, -9, 1840, -868, 1195, -1230, -1907, 2498, -181, 49, 569, -2070, 1815, 1733, -1501, 902, -1153, -92, 2982, -1542, -369, 563, -1371, 2245, 346, -2083, 836, -553, 779, 1630, -2614, -4, 859, -967, 1761, -1138, -1779, 2009, -439, 493, 542, -2777, 1058, 970, -1216, 1187, -1346]
2537a346O54L126l791J183L00k280L895j400k119K981k187J320J099l452K166
2552A49J16j393K854k388p18K881k655J685M30l154L149n22j169K146k550Q29
2568c10K177k525J049k33j941L329j223j027J712j879J182J221k516J475n13j002
2584a024K531j617l87J665j914J341L13k614K305n30p82J960j655j0J551j950
2600h17J056o7j542J907o67k71J240j545N09J098j793J197j26r22J662j305m25
2617h11J163r02N52M56j473R57J7m79J165r78LP18o60M75Q1r37R61k38l42J009
2637G37r18M0N05o13L20K47o21P94m87j56O44p11K60J77n24L38J84m87P28k90
2657A67j49M26n59K39l00n4N68l95Q8K30m51N1O88q67J88L46oj38J13m07j92M03
$$ y = [-1346, -692, 2434, -1357, -174, 126, -2154, 1741, 341, -1778, 1203, -984, 336, 1435, -2017, 149, 265, -1128, 1726, -662, -1380, 1501, -1154, 531, 961, -2193, 956, 434, -735, 1411, -1139, -310, 1867, -658, 391, 158, -1783, 1546, 323, -704, 1008, -871, 311, 1532, -984, 491, -22, -1024, 1507, -110, -497, 1168, -746, 595, 908, -1706, 599, 69, -713, 1247, -408, -418, 1133, -817, 239, 172, -1370, 537, -130, -401, 839, -706, -197, 901, -892, 305, 179, -743, 919, -386, -811, 352, -550, 2, 458, -1015, -58, -41, -520, 645, -333, -330, 388, -272, 203, 284, -653, 308, 70, -272, 737, -181, -141, 364, -249, 71, 318, -303, 491, 4, -152, 492, -219, 41, 218, -306, 32, 216, -271, 457, 167, 18, 444, -115, 124, -176, -230, 338, -57, 31, 261, -190, -139, 549, -318, -130, 216, 210, 72, 185, -222, -414, -11]
2679a1j04qJ37l0k94n0M22j85L32k39k63L08k09p1P5P7J10M5q6P0j68l91P03l08
2703a38R4K45n58K40L75m40K53j33m5K22m73M38J84m74O82k14k23M62n26O4L26
2724C61o03K88L43m94N94l91m12R27q32L90M65j143Q88K1r38J302r43k20J012
2743F15j097L07Q04j067Q15k43l49Q17r27j91J070j201Q10M9j206J555m11r30
2761g80J285j080J96J424k219J235K65j349J546m40j089J755j696P42J247k284
2777a242J438L0j104J632j255l63J841j759J193J89k087K290l64j124J694j887
2793h78M58J714j990J095L9j707K411q34j168K098k334R54J675k655J523L6j339
2810i02K533j985q84K610k180J260O21k877K359j10j288K411k590O4K544k397
$$ y = [-11, -115, -123, 14, -16, -310, -360, 62, -123, 209, -30, -293, 15, -194, -265, -190, -113, -3, 42, -44, 26, -142, -533, 170, -138, -44, 201, -357, -117, 258, -182, 71, -62, -107, 115, -358, 80, 264, -210, 472, 258, 35, 497, -29, 35, 361, -242, 46, 389, -105, 489, 98, -314, 613, -219, 171, 636, -507, 381, 402, -536, 766, -177, -397, 615, -482, -175, 629, -438, 377, 134, -215, 602, -325, -516, 554, -647, 163, 212, -994, 561, 150, -780, 505, -575, -379, 1045, -1174, 61, 326, -1023, 523, 83, -1006, 749, -947, -205, 1042, -1242, 196, 226, -878, 754, -501, -864, 977, -782, 411, 600, -1487, 803, 439, -685, 1009, -878, -420, 1294, -696, 399, 438, -1269, 1142, 308, -860, 1238, -1096, -142, 1533, -1122, 401, 437, -902, 1631, -354, -1238, 1372, -808, 452, 1073, -1804, 555, 445, -843, 1568, -1022, -958, 1586, -811]
2826h11J290k19k065K922r73j016J769k542J454J840l052J682m08j157K971j909
2842b24r74K034k276K136P67l304K132m40k30K260l129J08K551k250K130j209
2858H2k310L402j100n50J568k955J547J699j992J366j100j157L400j833o18Q75
2874C24k067K852N92k936J635j071N75K435l249K03J195j127K151j076k040K314
2890G10r70P97R05l423J731J175j345J560k090o99L120j460L09j06k128K761J40
2907I87j585R13j889J256K356k826N35m15o89L286j645j582J327j329K040N17
2923A257l033J759M1m67K354k783m31K128j067J327q14k376K992m51m54J189l095
2940a924J768J811k032R79j392q57L677j696o74N02j989K966L06k292J003j097
$$ y = [-811, 479, 260, -1805, 1117, 144, -872, 897, -1645, -191, 1649, -1403, 279, -129, -1286, 1685, -224, -1198, 836, -1440, 696, 1463, -1841, 291, -149, -379, 1881, -1248, -1140, 1411, -839, 1291, 82, -2228, 1174, 74, -476, 1092, -1863, -316, 1383, -609, 757, -343, -1500, 1900, 67, -551, 324, -1743, 1109, 1701, -1235, 400, -671, -96, 2339, -910, -707, 488, -639, 1512, 436, -1604, 710, -260, 537, 1442, -1981, -250, 925, -420, 1140, -950, -1649, 1471, 11, 320, 214, -1914, 847, 987, -598, 315, -1574, -318, 2038, -788, -253, -668, -1357, 1929, 284, -1298, 29, -1300, 740, 1257, -1776, -17, 24, -443, 1911, -872, -1303, 825, -242, 1085, 271, -2105, 887, 436, -18, 1171, -1924, -156, 1655, -377, 602, -790, -1647, 2030, 334, -340, 162, -1827, 1139, 1445, -847, 156, -941]
2956i41R47J892k681J38R19r30K543j774j719K222r37O88J101l330J617J045j373
2973e73J891j971p99L021j517J89P0k650L152p7j458J292j827N18K593k649O27
2990a68K47j700L333j363j657J821j556J565Q30l057J660J28q10K294k284l64
3006a081K050j679J212J07k416K565l33j046J953k617N83K326k518J363l52j256
3022a139K501j271q32J774k104J644J030k759J574k96q64K578k018p08J857j684
3038g17J464L24k340J741n75l24J686k098M59J418j726J224k18j727K438q71j027
3055h69J641j792J159O90k080J752p42o81J778j157j06Q51j375J118J85j603J547
3072C16n17l65J448j260l6J115j277J195l62j238J393n69m9P94j089N91M95j049
$$ y = [-941, 6, 1898, -783, -645, 274, -656, 1887, 113, -1606, 616, -321, 367, 1468, -1862, -245, 800, -573, 1318, -653, -1452, 1569, 52, 241, 311, -2339, 813, 736, -722, 570, -1257, -739, 1854, -795, -168, 79, -1621, 1712, 349, -1308, 513, -1043, 522, 1352, -1705, -45, 83, -727, 1567, -717, -1081, 969, -710, 502, 609, -1807, 758, 425, -621, 1332, -1285, -702, 1624, -894, 469, 117, -1139, 1362, 91, -741, 1033, -1071, 573, 1603, -1156, 418, 122, -742, 1836, -182, -890, 967, -717, 747, 1071, -1269, 472, -103, -427, 1259, -839, -380, 1038, -688, 536, 318, -1409, 1029, 158, -869, 772, -1020, 139, 829, -1251, 501, -241, -922, 856, -301, -407, 444, -931, 187, 372, -1231, 316, -201, -566, 882, -378, -414, 701, -576, 619, 257, -981, 412, -157, -206, 588, -501, 90, 585, -464]
3090d64P88j95m72J110p90j35M28q29P96K73j021R47n59j02P36p08J78L78o66
3109c07N18K52p07O94m51l09O62o69L29M43o24K87Q5p97O44k86K64L61o85K75
3129b1R4m19M34q5j72K39l0o0J88n50L93j1k95M07k54j4J41J2j24k8M5L42j82
3152E0m40N19k17k69L38j72k03L50J29J0j58J6J43j10J63k62j72O83l03P1J7j97
3174a4o8J58j84K50J46l98L62k00J08n1j72K3Q0P2J60j66k78L19k11J68R4l48
3196a50N18l06j87O37o43J43L4n37L77L19m13M41j01m99N42n93K11M20p75O91
3216A29j57m38J046q26k43R12p92J88N35r84P27r3m52J190j012j5P79j130R51
3235C15k17j111J383k44n83J074j243M29R96j245N16Kp85J734r56n32J145j297
$$ y = [-464, 324, 129, -343, 767, -23, -158, 270, -559, 237, 510, -511, 436, -123, -225, 511, -197, -19, 359, -307, 211, 463, -244, 450, -1, -310, 352, -317, 12, 455, -169, 118, 203, -594, 50, -236, 28, 389, -296, -21, 73, -346, 88, 3, -169, 70, 40, -20, 168, -382, 11, 0, -295, 112, -142, -156, -15, -3, -127, -155, -110, 232, 50, -390, 129, -88, -357, -19, -191, -394, -44, 85, 95, -63, -47, 96, -14, 149, -113, -285, 398, 95, 166, 183, -14, -82, 76, -108, 142, 288, -110, 252, 52, 160, 109, -63, -40, 40, 112, 272, 106, -172, 147, -64, 104, 198, -150, 368, 62, -125, 512, -131, 12, 46, -491, -114, 205, -208, 233, 132, -367, 175, -418, -207, 213, -562, 129, -28, -466, 580, -246, -489, 423, -369, -181, 354, -630, 97, 4, -448, 742, -270, -285, 494, -636, 315, 98, -1013, 370, 126, -457, 617, -626, -197, 799, -446, 70, 72, -713, 1021, 65, -467, 678, -619]
3253f19Q09N95j469J078K5p63J692j494p42J756j633J158M04j742J596m79o91
3270e19J392j623M25J441j828J175l03j456K223n70j276J645k104J445J034j858
3286g57J242m50j168K600j903l43J673j987J525K12k238J988l16p39J849k329
3302a141N49J604j548J301n67j818K408r08l95J455k307J351J306k079J487j240
3318e42o67K376j195m01Q21j814K308P5k062J488q61Q1K249k571k3J652j677J795
3336A032r15j732K403q14O7J192k743J465J074j432J178j291p06K965j834L4M31
3353C74k109K351N98k115J227j069L79K134k428O8P05j028K214j236j444J910
3369E31j098J526M68l062J541M19q54K099k287o41K278j159J055n05k260K390
$$ y = [-619, 190, 785, -684, 394, 419, -344, 1348, -146, -888, 868, -765, 393, 797, -945, 651, 172, -519, 873, -750, -325, 1116, -712, 463, 160, -1296, 927, 357, -919, 726, -1378, 67, 1101, -757, 485, 35, -1133, 1467, -436, -779, 894, -1093, 432, 644, -1594, 394, 78, -661, 1188, -1141, -592, 1012, -536, 765, 198, -1620, 788, -120, -515, 940, -1367, -16, 1290, -789, 698, -542, -1209, 1167, -28, -429, 392, -1422, 886, 961, -1101, 387, -474, -393, 1856, -715, -738, 914, -763, 1032, 117, -1615, 788, -26, 41, 1233, -1510, -45, 1029, -403, 775, -516, -1222, 1743, -91, -57, 374, -1735, 616, 1214, -901, 326, -743, -364, 1770, -658, -590, 115, -913, 1301, 65, -1379, 531, -567, 959, 1427, -1635, -94, 325, -529, 1570, -717, -1358, 920, -239, 816, 311, -1949, 441]
3385D41J22q39Q27j719O38J904j734L50j16r15K490j032q76R02j447J899O18k436
3403i23R87j81j15J961k335j13J409r67J753j154j882K245o56L82R03k751J089
3420c48J571j552J189j280r85K800j328k38O96k086K013N27j524J031j573O98
3436c89K065k408L07L93j288K651r15j747J560r62J207P10k654R81P99q68J908
3453A350j869o10K048j225P67K11k380K380R6j181J282j751M23J781j895P03J79
3470C09j610K426q10j024J245j740J606Q82k253J280j79p69K337k047k97J659
3486A015j513J085J48k115J837l71l96J381j817N47J353j696J053m13j251K034
3502H81o25n50J239j689R25Q30k029J319n57l38J679j200n01J169j452J297J3
$$ y = [441, 563, -276, 551, -1168, -530, 1374, -360, -10, -126, -1041, 1449, 417, -459, 443, -1004, 895, 1513, -923, 64, -117, -232, 1729, -606, -719, 690, -277, 1476, 322, -1560, 685, 29, 411, 1314, -1437, -348, 1223, -329, 860, -420, -1405, 1395, 67, -171, 525, -1561, 452, 979, -545, 486, -1087, -389, 1676, -732, -425, -32, -1320, 1331, 416, -1331, 229, -733, 474, 1184, -1470, -489, 310, -558, 1350, -519, -1129, 919, -306, 461, 672, -1708, 672, 768, -413, 869, -882, -459, 1322, -573, 130, 309, -1301, 1125, 315, -709, 536, -1204, 402, 1284, -969, 311, 132, -637, 1700, -347, -644, 1015, -498, 587, 735, -1380, 457, 86, -310, 1071, -746, -199, 1154, -542, 511, 98, -1153, 881, 256, -294, 945, -744, 181, 1011, -1018, 301, -256, -594, 1085, -115, -616, 553, -899, 398, 411]
3519D11j546J318l56k25J287j544J84R18j125J169m17r97J436l82o94J055j221
3536g29P05P00j265J012o67n27J633j032j87P84j294J321J26j408J411m89j04
3553a0O33j017K88O52j125P19J36o35R59p38m8O26q05L84M28q45P80k41n74Q43
3573D10n65K0L22l62J49M09o38J86j81j17P10p20K74M68p27O33l49k15M61m39
3593b71J68J38k31R1K87m59M75j66l45M50l08J08K51l09M6L34o06O39m01rK46
3614A28j96l6J26j77K61m8k24M26k57P7j79j6l7M78n59M13k23J01M4k27K53R6
3636B24M6k05J08l07N16l12Q3j64j00J71K75n69j23K44L24l4k02J02o9j15R9P6
3658F8j02m1R8l70L11J0l9J34m56O77k78q0L80n13L25N2o33O51l97k5L22n67K04
$$ y = [411, -1135, 183, -173, -398, 889, -655, -471, 447, -678, 491, 74, -923, 513, 131, -563, 492, -729, -24, 676, -589, 423, -244, -771, 862, -170, -357, 427, -867, 454, 580, -828, 583, 94, -10, 623, -394, -106, 546, -579, 140, 276, -359, 600, -138, -186, 440, -365, 19, 447, -398, 382, 141, -433, 410, -155, -135, 187, -175, -26, 383, -255, -69, -250, -367, 343, -377, -103, 365, -362, 271, -78, -293, 168, -271, -103, 35, -196, -105, 182, -277, 198, 32, -313, 137, -171, -63, 188, -121, -75, 259, -347, 292, -109, -118, 128, -68, -104, 22, -155, 106, 58, -166, 260, 3, 80, -99, -115, -152, 326, -233, 180, -43, 58, 102, -125, 128, 224, 270, 65, 173, -134, 382, 70, 153, -11, -111, 60, 335, -234, -357, -113, 211, 177, -25, 77, 8, -107, -8, 68, -34, -75, 23, -347, -36, -26, -65, 69, -387, 290, 12, -68, 312, -201, 124, 176, -457, 194, -203, -228, 94, -473, -269]
3681b69J30j13J1K76l91N14p5k98K46k27J99M50o50L15j61k18P36m64k80O29n39
3702a79J48O36q71O67l73m24Q75o39j67Q32p68M22Q5r17J270o02j98R60r82M16
3722A91M20j060O57J92q58J096p40n14J187j292R00N74j372R50n32n97J754j275
3740c19k29J090j440J076K04r64R20l16j82R36j226K14P87j179J072l80j277K177
3758I64j166l9Q78j630R03O55j294R26l88n03J899j729L12Q22j310J219K25j376
3776f32J041n11l73J555k017O70Q09j234J386m11j371J969j072J91R16k095J274
3793I5N65j217J427j269o45K306j390K11M26j611J877L1j712J676j299j62K125
3810A434k169M67P18j558K199r07j448J863j198P87P30k053J214M56j054J683
$$ y = [-269, -139, -252, -241, 35, -356, 158, 83, -215, 31, -196, 3, 453, -197, 118, -43, -261, 475, 11, -269, 360, -179, -31, 605, -266, 401, 28, -396, 479, -160, -327, 505, -263, 159, 244, -673, 597, -5, -203, 757, -225, 191, 611, -449, 208, 400, -458, 638, -102, -616, 571, -721, 179, 753, -619, 331, -201, -798, 956, -319, -548, 542, -898, 178, 382, -582, 338, 22, -160, 776, -450, -236, 551, -628, 444, 64, -1213, 964, -202, -241, 637, -993, -90, 565, -729, 197, -191, -694, 1205, -524, -212, 610, -700, 519, 744, -632, 409, -102, -475, 1080, -937, -267, 542, -692, 694, 283, -1088, 881, -191, 0, 916, -1179, 95, 660, -557, 870, -399, -1044, 1262, -128, 83, 509, -1102, 775, 806, -906, 770, -529, -691, 1434, -735, -268, 450, -1108, 1091, 184, -1264, 599, -599, 188, 918, -1135, 79, 535, -519, 1164]
3826A164j524p77J859j021O62R0k124K048J93j262J294j613L34J877j716N08K04
3843A96j433K336p94r37J233j570J124Q52j898J139j03o69K079j946l50J220r95
3860e16J420j88j964J850m55l21J308k118N33J385j389Q89m76j202K402j011k89
3877a42R39j935J529O72j917J234p32j44J906j739l60J016j391J929l70j821J601
3894B75o28N3J758k361O46Q25j014J112j050q20J768p42L77L55j964J626L55j138
3912e67J028j023J14J797j688M60L7j229K002n19j164J476j497J019J025k099
3928h28P29J76p77J923j416p91J557o93M45K95j994J994k86p51J199j331j04J522
3946H69j375P49p5j166J925q49p06J140j333Q22J074j803R37l14q14J944j309
$$ y = [1164, -360, -1137, 722, -299, 363, 453, -1671, 377, 570, -692, 602, -1011, -677, 1200, -516, -8, 196, -1237, 1099, 305, -632, 601, -969, 155, 1007, -891, 248, 145, -524, 1555, -391, -741, 479, -516, 904, 716, -1248, 602, 147, -174, 1134, -984, -451, 934, -455, 434, -42, -1244, 1158, 147, -142, 797, -1138, 391, 1063, -854, 380, -352, -496, 1410, -329, -689, 327, -1064, 865, 495, -1326, 275, -353, -300, 1458, -903, -257, 568, -446, 666, -384, -1204, 564, -178, 199, 554, -1410, 216, 571, -567, 461, -562, -448, 1349, -339, 121, 158, -1071, 931, 412, -752, 724, -773, 246, 1271, -828, -99, 77, -700, 1223, -193, -984, 573, -120, 325, 620, -1374, 620, 334, -417, 782, -549, -653, 869, -506, 243, 168, -998, 927, 78, -628, 512, -821, 1, 1075, -728, 209, -105, -919, 1025, -284]
3963b84KQ47j351J235J23j572J498o13k44J262j673L18J174j197J006k73j162
3980i04J505n13m03R26j541P96P68j122Q56o41m19J390p77n1P04j153R82K07r78
3999c68O98m40k53J292j453J62R60j036R84m49p51J303o03k55J036j526R81L22
4017F04j215R45l20m91J296q52j21O63r83N27K53n77M79m51J9Q21p90L38P3o92
4037d74P34j59p85R02j40m33M89l96K89J39m39L08lk39L63m00J34J42l85M68j33
4058a8k28n8K52j1K60l86Q4K33l84L67l4j80L46m13J73K64o81N88J41k50P3j6
4080A22q6N6j18M5J65m75K45J20q3k13M60j96O9l9j07J83k19L35k84M3J3Q3l43
4103b24M26k80K50k35l8K81k0j92K06k81l5K67j12m1k15K29n6K18n81M93k26R3
$$ y = [-284, -282, 565, -786, 449, 572, -1000, 498, -115, -359, 903, -770, -452, 722, -475, 531, 258, -904, 601, 88, -315, 611, -930, -134, 634, -488, 368, -273, -692, 698, -79, -130, 574, -579, 403, 610, -368, 330, -110, -363, 929, -524, -362, 598, -438, 546, 97, -654, 649, 46, -209, 827, -699, 282, 604, -611, 334, 14, -477, 819, -33, -154, 509, -474, 53, 306, -271, 208, -243, -224, 597, -193, 145, 218, -474, 260, 101, -684, 218, 78, -355, 134, -262, 27, 166, -273, 35, 32, -207, 156, -244, -110, 32, -353, 115, -18, -246, -304, -52, -63, 197, -189, -105, 128, -256, 111, 77, -103, 243, -170, 3, 267, -414, 174, 315, 65, 138, 122, 36, 92, -26, 19, 184, -291, -46, 74, -9, -222, 238, 42, 111, 72, -35, 148, -71, 264, -20, 23, 36, 119, -224, 202, -78, 172, -63, -101, 180, 160, -32, 174, -107, -142, 125, 13, -28, -243, -14, -70, 148, -433, 60, -166, -73]
4125g3N2l22N86l74j67O43m37k87M07j56K91n9k27J94M4k59M52m15N2J25l55M98
4147B13k88Q2K16m41K79J30k85M3J41l75N20l98k57M57j77L55K2o95O75l4l12
4168a29N98o87J84K09n09M77q7l65O38k07l27M14l30NL56m26L71j71k09N63o15
4189b47k7N63p19O29j25m45M42l01j16Q03p66n9M59n11M94j84l63Q51m22k33Q63
4210E86j022K36Q33r21O07n99j39P39n48j09P65r32Q03N8j002J026o36J1J053
4229H09j131k3Q36p80O44j95q39J159o88n7J023j410O67N57j095J195q85l45J177
4248F19r33L93L80j158J073K87j363J178p65j27J357j342L93K54r78J177J53j407
4266h09J322r79N12Q94j769J101j33n34J030j061m34J524j227N66M52j464J430
$$ y = [-73, -21, -343, 243, -131, -298, 345, -92, -379, 28, -128, 163, 104, -123, 71, 115, -144, 308, -107, -55, 70, -285, 213, -75, 7, 223, -218, 61, 191, -94, -51, 90, -285, 235, -163, -420, 37, -140, 215, 237, -458, 217, 183, -129, 469, -218, -34, 175, -334, 143, 56, -309, 329, 122, -205, 209, -121, -116, 240, -186, 185, 14, -195, 368, -247, -274, 289, -430, 199, 74, -371, 71, -230, -346, 457, -309, -368, 91, -420, 74, -110, -473, 378, -44, -277, 586, -436, -200, 633, -288, 319, -280, -419, 320, -228, -337, 428, -504, 299, 357, -645, 381, -255, -244, 809, -322, -345, 491, -289, 355, 160, -679, 480, -208, -265, 758, -652, 15, 572, -523, 672, -213, -558, 619, -314, 79, 459, -699, 374, 661, -702, 476, -289, -416, 941, -401, -8, 246, -732, 445, 598, -809, 513, -466, 46, 940, -829, 272, 139, -395, 635, -426, -860, 664, -563, 3, 455, -1009, 421]
4283D21Q2r04J057j513K78J636j555O49r2r63J656n83o68J035j391O82J216k041
4301i98Q97L0m10J503j231m75J499j369J099k4j773J498j03l94J347j973M95J006
4319F24r96J000m50j089J806q14k78J097j979J410M34j317J117q85k71K015j632
4336b08r1Q01j564J412K60j659J576j004N18J041j741R4Q61j037J279n68r52J790
4354H08j031J49Q61k063J562K51j111J061r99j93J795j342J36L92j377J841j84
4371E56j220J059j060O75J278k150O15P34j199J542n31j077J766j479O85N83j900
4388a123J096L21p75J519j552k63J615j329R09o3j198J463k7r55R82j261M39J156
4406I54j532Q04j17o49J365q47o30J090j050P54M94j586J253o9o53J242j211j02
$$ y = [421, 503, -401, 656, -857, -579, 1057, -498, 151, 59, -904, 752, 169, -499, 536, -855, -173, 1043, -998, -101, -71, -481, 1022, -209, -684, 815, -554, 545, 521, -1252, 246, 143, -251, 1096, -877, -382, 624, -372, 628, 178, -911, 895, 81, -197, 900, -1079, 331, 765, -552, 565, -320, -591, 1424, -208, -299, 502, -1062, 350, 610, -1049, 527, -477, 41, 1082, -659, -565, 296, -741, 538, -30, -982, 808, -223, -74, 787, -1276, 286, 537, -574, 487, -512, -705, 1090, -252, -116, 276, -1101, 740, 556, -664, 395, -665, 10, 1288, -862, -247, 487, -712, 830, 299, -778, 988, -491, 194, 777, -1123, -27, 294, -481, 1038, -514, -777, 838, -491, 418, 355, -843, 620, 593, -362, 620, -641, -202, 954, -578, 226, 109, -540, 825, -22, -652, 438, -612, 142, 636, -950, 303, 234, -419, 823, -388, -490]
4424d90J102j131Q63m4j180J175k28o23J068j203L93J004j082P05k08q60J417
4441F78q18j83L81j001J229L14j283J013l52m45J248j357J60Q29o65Q32k92j023
4459g35J336p03R9N25j008M80L56p60Q84n66m81J135n39j82Q10j322Q30M46r44
4478c39O39l97q4P26n94l95P04o87O76J44r05Q89n73J68N23j031M77Q6n88J054
4498D93n43k38M54k35O6n3l80O15k04l07P95m91j50K97k41j97L92l78M46j13j96
4519a68N44m84r1N05m80N1J29M6J05j93K9L43l51l1L11n90L19L12n69M67Pl05
4541i4N09m80K31K43m69K10Q2r8P3k29R2J61m13L62j37j37K76j10l22K51l0k3
4563e2r4r1K33r9P2M6j50K29J3k70J07J06o03N55Pk85L50k15j43N57l73K34o0
$$ y = [-490, 612, -519, 344, 300, -880, 295, 67, -556, 512, -691, -298, 706, -376, 329, 121, -739, 678, -140, -323, 58, -943, 286, 600, -683, 330, -22, -467, 781, -576, -416, 413, -252, 580, 288, -735, 601, -102, -3, 522, -486, -6, 350, -410, 474, -92, -573, 562, 23, -159, 651, -671, 159, 605, -339, 300, -97, -181, 545, -49, -444, 260, -427, 249, 393, -512, 377, -196, -28, 495, -536, -59, 27, -561, 493, -50, -288, 166, -69, -3, -56, -436, 179, -25, -332, 463, -28, -178, 119, -122, -319, 73, -305, 141, 28, -168, 376, -108, -199, 306, -174, -123, 6, 52, 157, -36, -7, 336, -15, -46, 265, -325, -6, 306, -263, 204, 211, -94, 415, -65, 166, 409, -60, 150, 232, 134, 207, -22, 70, 231, -182, 180, 43, -94, 182, 72, -250, 1, -29, -52, -146, -237, -4, -103, -31, 15, -135, 94, 107, -163, -56, 50, -553, 2, 9, -276, 74, -141, -284, 273, -100, 134, 74]
4586G4k32J18J31k16n3l8m9M32k00J38l2k08J99j73J24Jr3J80L6j21J15j3K1n8
4610H3k17M11j57l34J1K60J0Q9k43J40J67n41J36K28m0J76p7n0K94j65k43L33
4632B71k94O8L3j06J66l8l37J61J64n2Q8m17J69oOL15m25J29L57m49K43j85j67
4655c06N55l27n3L15o00L44K42l27L0J26m66Q78p23J02N50m09M49k88m77M52J41
4676B08k17K63l26P6K99m84M66j77m39P17n68K59N45r66K20M59o59O32n25P3L82
4697B38k92j8J39n36P92J59o83M66o85L74O93j005L02Q3k29P82l93p68Q31n71
4717c21N9J028j301L36K94n22R13n92l49Q33r12O49K35r24P78j39n13R30p24J03
4737a39R51j091K43N9q55J539p40n14O82o88O69L82j026N23J09l32J138j039l91
$$ y = [74, -158, -40, 91, -125, -178, -216, -265, 167, -33, 105, 73, -135, 64, -109, 15, 16, -77, 103, 139, 18, 133, 120, 141, 83, -134, 277, 120, -214, -203, 57, 67, 156, -87, 53, 220, -321, -185, 43, 3, 179, 102, 52, 346, 181, -62, 271, -23, 45, 78, -28, 138, 100, -237, -76, 88, 36, 124, -293, -124, -130, -124, 191, -234, -105, 252, -197, 46, -139, -306, 249, -78, -131, 184, -416, -72, 170, -157, -127, -1, -467, 411, -312, -210, 340, -69, 380, 92, -385, 67, 208, -9, 254, -72, 4, 303, -181, 285, 108, -331, 386, -182, 77, 622, -344, -124, 335, -324, 308, -217, -144, 238, -54, -72, 67, -469, 323, 482, -201, 265, -420, -46, 647, -358, -56, 27, -202, 580, 187, -581, 250, -321, -262, 766, -535, -199, 95, -427, 486, -106, -455, 378, -534, 115, 350, -574, 204, 65, -448, 482, -242, -139, 812, -279, -36, 23, -832, 707, -33, -547, 135, -553, 116, 498, -528, -5, 104, -228, 910, -129, -520]
4756e20P68p20O48N07j504Q58K84o34J114j433N03Q31j134P43k57r30J488k40
4774C72o59Q92j134Q60M69j236Q84m58k36J042p30m75Q60j119J058J3j087J182
4792D98p01N2R18j426M23M31o36R92m72j093J517l21o19R62j372P24N52q82O35
4811A82m94m65J729j089RL83q79Q46L09j106Q75p28J04J241j273K59L90p10Q02
4830C85k46p23J032k75n5P91j633Q54L56n56Q68j084k88J259p62K91K9j158J415
4849E00K8j050J042j131N48Q47j243M81k13k00J000m56n96Q86p74M14M78j044
4867d83L40K14o90J456r21o97J336q56M40k1r49J182j04m82O15j085N24P58j159
4886e82N99R2o36J253q26m54R20p27L89K79q33N97O1m93J041q20k82M86k66N27
$$ y = [-520, 248, -472, 176, 683, -821, 37, 321, -313, 801, -632, -129, 702, -432, 311, 54, -876, 612, 372, -287, 605, -529, 331, 800, -436, 448, -10, -246, 796, 66, -409, 451, -668, 390, 403, -684, 498, -203, -151, 767, -659, -236, 195, -441, 551, 79, -1014, 503, 182, -437, 525, -847, -123, 429, -453, 182, -312, -777, 952, -137, -128, 255, -624, 222, 531, -575, 300, -428, -324, 917, -356, -97, 293, -417, 385, 139, -584, 448, 173, 118, 909, -724, 130, 486, -70, 798, -286, -574, 685, -77, 214, 243, -915, 500, 528, -522, 520, -611, -63, 784, -459, 22, -191, -391, 609, 153, -443, 443, -331, 83, 561, -483, -143, 71, -619, 837, -84, -781, 555, -301, 139, 118, -831, 351, 247, -235, 380, -705, -181, 577, -582, 17, 109, -527, 726, -100, -554, 366, -361, 28, 307, -526, 71, 132, -361, 680, -140, -422, 64, -202, 325]
4906C25k7r40J004k69l20J075j152L69L49o77N30r3n18Q48m92l43N44p64O97K83
4926D29o30M94l37j29R56r23l8N06n58N04J81j073R20k17m13P63r37L83J96l70
4946b93L54o9l11M95j22j65O30p46M10J21n94L02n0k89M84k58M3J03n80O41Ll85
4968b76L45j55j32L05m62K32L47m19M69r3n32N13k36J74j17k43K01L24m33L15
4988A27j64l02N77m07J71K22l87K86mj30R3M0j84P9j76P1R1p3K82k73j36K63n9
5011Gq6K81m71M48j14n14N78p7j96Q2n6J66j8j06K62j67m95N05k12k35O10k67
5033g5J09k76l3J82J21k88K81k16K41p3j56J12K94k97m0o0J43J02k89J04R4m8
5055f8K82j73k21L27l82k6K72L2j74rj06L15j28K0J63k46N9L11m33M41k26r8J00
$$ y = [325, 298, -642, 362, 93, -227, 848, -304, 65, 414, -263, 267, 174, -344, 504, 12, -331, 213, -551, 146, 429, -201, 293, -44, -173, 783, -140, -178, 328, -230, 274, 455, -618, 302, 85, -328, 435, -502, -119, 77, -293, 61, -8, -319, 176, 54, -111, 519, -227, 183, 304, -290, 12, -38, -327, 157, -101, -58, 45, -535, 106, 109, -276, 69, -86, -218, 87, -375, -143, 204, -215, 254, 161, -371, 142, -94, 80, -37, -280, -79, 245, -188, 127, -37, -339, 238, -169, 2, 224, -163, 123, 119, -11, 82, 122, -62, 17, -159, -88, 3, -70, 212, -61, -197, 66, 7, -79, 202, -269, 179, 65, -449, 129, 52, -144, -62, -118, 48, 30, -76, 186, 19, -476, 29, -183, -418, 192, -75, 34, -242, -275, -93, 28, -260, 21, -195, 46, -27, -183, -71, 223, -74, -114, -174, -31, 71, -218, -114, -20, -68, 214, 41, -180, 147, -235, -261, 11, 43, -131, -140, -246, 69, -59, -39, 124, -122, -63, 248, -185, 256, 30, -68, 32]
5078C2j04o4K98j57N5j16j49K24J84j87J62l62M29l41n3L84j97p0J3M9k06R6p0
5101a50J73k27O6J18L9q7P9k3j19L53l66j04M02k77L96k69O7K10m76K08L40k59
5123I4L3l44K13J94m51R6L20j88K0K40n98O52k32J8K56q95O35J31n51O42l73r6
5145a84N61k97j92K9LJ76J02l11K38j10p0K51k80J24K00o89P64k18l77L97k60
5166a43R3K69p57N13J87k68N29l23m10M91l57J76J88p71M91J47p1M11o39o2N82
5187B76k33rLl94M53j57j30L54o57N69M39r35O62J47q99Q57o20J98L66l26m0L62
5209B86o90M60KJK27o10Q4L99n49Q64l33n40P71o6m36K00m44M36N90j185O19M2
5231A28o15J054m97m92Q09q21Q61K03j067L94L5J17M37j146N33L55p60N54k14
$$ y = [32, -72, -136, 162, 5, 60, -56, -205, 19, 203, 16, 178, -184, 245, -96, -149, 235, 38, -32, -19, 30, -176, -80, -150, 23, -204, -138, -20, 19, -68, 11, -12, -131, 222, -144, -248, 154, -123, 273, 4, 71, 281, -195, 13, 353, 94, 127, -217, -4, 190, -261, -165, 155, -33, -13, 227, -371, 281, 49, 67, 323, -572, 63, 194, -357, 285, -88, -184, 377, 80, -112, -83, -80, 96, 198, -113, 125, 15, -55, 196, -84, 40, 240, -449, 315, 97, -280, 117, -143, -50, 219, -538, -25, 162, -106, 423, 100, -310, 181, -176, 0, 188, -583, -92, 55, -16, 395, -244, -306, 276, 43, 34, 37, -357, 96, -61, -191, 163, -494, 75, 514, -421, 241, 388, -511, 346, -274, -76, 290, -36, -76, 286, -404, 56, 58, 59, 286, -324, -240, 159, -390, 474, 141, -399, 372, 306, -130, 70, -374, 62, 652, -533, 86, 128, -487, 567, 70, -422, 387, -434, 427, 630, -437, -43, -8, 109, 546, -600, -67, 288, -472, 82, -132]
5250a32l51P32j72j06L18q11N51N16j076P24l61m70J016n31J1L33n78N31j05n00
5270d61N63o05K56Q32j051N09L10q87P93j20p14P29m16K19N12j143P61J75o57
5289c95R18p19O3N98q07K84M15q36Q63m2m29L90m71k18J143r66K40J80q64J102
5309D49l40n20R04n47m9Q29j157N39J17o67J083o78m91O95m21L97J33q62Q63m3
5329B34l90O00r14M66K96n36L10L2o70J108p09q7O68o77L72L66q62N43J8m65Q37
5350E40n97m37Q61o22M10J45q24L55J98j7K05k62o7M22m87J84K48o57O43k65k17
5371b41N07p89L68M19n56L20j45k16R18o32P7L56r51R11l15j64K28j79mM89p83
5392c82O4N16n34N90m43j59N55l25n0L05o25N84o2j62L66l64l0N41o67M26m0l78
$$ y = [-132, -483, 249, 77, -29, 289, -522, 29, 545, -531, 193, -168, -638, 378, -153, -142, 191, -387, 144, 39, -461, 102, -503, -247, 585, -466, 43, 353, -534, 259, 139, -575, 154, -262, -43, 469, -674, 87, 262, -395, 523, -196, -133, 465, -342, -58, 357, -479, 384, 342, -87, 303, -168, -386, 757, -209, 31, 211, -653, 449, 109, -411, 493, -54, -103, 726, -431, 108, 225, -442, 641, -37, -528, 167, -254, 143, 276, -586, 277, 234, -156, 444, -470, -4, 292, -244, 66, 98, -572, 536, -173, -260, 408, -269, 103, 469, -393, 150, 168, -297, 540, -57, -494, 367, -255, 155, 300, -524, -169, 29, 12, 217, -45, -112, 310, -177, 7, 255, -402, 241, -24, -241, 266, -523, -155, 264, -292, 28, -117, -333, 585, -47, 30, 386, -565, 346, 31, -133, 95, -84, -88, 401, -382, -318, 198, -336, 254, -189, -348, 207, -118, -168, 137, -488, 96, 34, -128, 238, -126, -156, 385, -282, 144, 104, -274]
5414b74N25k26k64L98r1k06L93m78R7O2p7K88j60mK5k52M13k29l08K33K5J01L87
5437C78l62l51P28k39k40K52m40M58J19m17J26q2K14n5j28j68K50j77L26p1j82
5458f1J5M0O3J07k77K65j80r9J74Q6k74J82K2J20j4n5j44J5K3j26J09j7J0m2J10
5483E2L8l32L67j42j69J47K9p4K11k28K44j58N7j37j62L8K16l6K0o4J42K02l77
5506a16Q9J1j08K55j5j10N5j7k54K36n3j47L52K7qk04K2j16L08k29J86l77O7J00
5530d6m5P3J88p2M7j62J26j95L2j55K72k53K27m4j82J89N8n0m5J67q4qj77Q7K25
5555A73k53K78j81j39O4J20j49K33l40n3J92jP1j38M6l8k86N90o6k68j28J2J94
5578f7p8J31p9N3J68J20k30k11L93k99Q7J12j30R2j7j33K48k50q3K23J39r4o0
$$ y = [-274, 251, 25, -239, 159, 68, -138, 255, -223, -126, -64, -141, 147, -13, -17, 8, -244, 169, -60, -368, -135, -110, -9, 378, 16, -335, 393, 154, -86, 166, -274, 184, 303, -114, 12, -70, 144, 89, -39, -207, 43, -134, 192, 121, -61, -46, -6, 57, 164, -113, 152, -28, -127, 47, 133, -141, 41, 63, 183, 169, 114, -30, -15, 8, -118, -9, -26, -16, -58, 52, 90, -242, 125, -17, -186, -39, -10, -84, 127, -101, 143, -15, 42, -95, -257, -219, -3, -39, -19, -83, 59, 261, -116, -27, -16, -124, 131, 116, 6, 61, 44, -210, 26, -27, -174, 178, 205, 197, -7, 15, -101, 207, -22, 164, -213, -146, -46, -91, -18, 170, 98, 145, -17, 109, -86, -54, -209, 63, -190, 37, -7, -189, 0, 58, 8, -37, 130, 46, 38, -139, -52, 173, -80, 198, 17, -122, -58, 62, -87, 146, -194, -247, -55, -56, 15, -123, -77, -115, -401, 189, 123, -145, -273, -261, -67, -145, -14, -93, -40, 128, 248, 18, -193, 200, -99, -12, 100, -30, 62, 45, -88, 160, -90, -173, 50, 189, 95, 35]
5601C5k46K90K6j03l6lN5j33O0J34R0l60R9K01L4j49k34K85p5j31J29j30K74j98
5625h6k79L23J44k74R0j70J65K91l54J20Q3k62L0k1m1L85j86J87R0n95L92m3j47
5648a58Q2K58k03J34n8k95N03m79K62j56j69L28k63J89J98j73j31M94m83K76J77
5669C33j83j76j64J35J23k91K21J63j60L78l71L9K35m37p6N22n70N97l12p9K72
5690A99l3k17L94m28m9K93l80K87l4k64L09k77J08L94p54N26m4m84N63k74k30
5711c95P48n68l7M94o74P22J3n75M67j56k38M78n42N9K12k58M59l76M2N15m78
5732h8j7J07o40R28q5n51O80m54k25O27m20L84J00n55M38k08l08M34l15j53P38
5753D17o69M5M38l84N35l44n62Q58l95j06M19m60L51Q5k17M35o71l24Q08l13L10
$$ y = [35, -211, 79, 105, 2, -34, -37, 18, -115, -55, 79, 169, -191, -92, 109, 143, -6, -240, 45, -30, -161, -32, -162, 112, -86, -365, -42, 102, -172, -82, -252, -87, 204, -150, -30, 53, -209, -179, -200, -241, 144, -42, 145, 235, -360, 32, -11, -158, -76, 182, -21, 113, 55, -240, 263, -216, 46, -110, -279, 49, -214, -25, 173, 0, -131, 363, -120, 156, 333, 150, -26, -190, -55, 68, -223, -2, 161, 1, 379, 8, 47, 282, -155, -231, 291, -279, 318, 6, -73, 199, 166, -51, 343, -85, -134, 159, -221, 66, 32, -232, 77, -200, -92, 302, -452, 74, 30, -454, 109, -165, -395, 353, -215, -252, 242, -432, 290, 303, -272, 195, 39, -199, 279, -263, -204, 8, -250, 209, -167, -125, 390, -88, -105, 2, -638, 290, 205, -346, 334, -120, -345, 282, -138, 246, 346, -209, 229, 21, -287, 147, -168, -321, 417, -252, -207, 231, -153, 382, 38, -524, 334, -61, -167, 252, -208, 143, 228, 11, 446, -225, -549, 259, -54, 256]
5774B56r5m94O51l73j44J82k35J41M85n77K2Jj56O01j60l69L08l38K26Ll35M29
5796B9K91p62O99l09oL72o01N58L7o09M40j26j63M73o44P1N60l86L16j93m62P79
5818C64m42O0L84o08J98J15j79M77m16j85P77n21l13O42m47J56N11r12N60l2n33
5839c44P59n60K30k7l73O23l06l29N80k92p4J19k82Q1L95l21M23l83r0N69m55
5860e7j41L40m91N92j5n17K73q9k12O13n35J06K57k82L68r5l2k6k01K11%l94M17
5883I0j50q5N16l94r1J55RJ05j99k93L52R9j84J47k82L15J85m33K66Lj11J07k96
5906a69Q2L09m90M30J71n35K67k27k8K84Mj72J28k40L94r5l24M67l74j08J08q8
5928b06J90J86j22L5l17O3J98l8j73P3K41k61K39q0j64K7O5J52j29j60L42k55
$$ y = [256, 161, -333, 318, -55, -199, -17, -252, -111, 374, -203, -181, -180, -336, 265, 105, -264, 44, -294, -68, -65, -400, 29, 320, -442, 257, -52, -58, 314, -287, 271, 308, -301, 139, 13, -150, 323, -321, -250, 310, -76, 240, 47, -415, 364, -78, -18, 366, -242, -44, 71, -108, 369, -47, -232, 545, 24, -289, 353, -94, 62, 573, -339, 221, 189, -344, 415, -145, 85, 58, -315, 308, 2, -327, 253, -39, -113, 6, -276, -195, 200, -121, 302, -81, -171, 398, -57, -198, 142, -349, 243, 228, -289, -16, -105, -317, 296, -239, -133, 124, -158, 210, 115, 83, 57, -144, 67, 67, -327, 90, -60, -145, 371, -23, -114, 41, 50, 155, -44, -337, 15, 114, -70, 77, -205, 110, 295, -138, 128, 131, 20, 127, -169, -87, 222, -268, 162, 333, -202, 65, -162, -190, 94, 98, -74, 54, -186, 208, 113, -211, 256, -118, -226, -118, -206, -16, 170, 48, 83, -234, -171, 27, -11, -184, -111, 130, -131, 108, 28, -136, -109, -44, 108, -21, -181, 161, -94]
5950i4J03J88n57O00j02p8Kk38N2J14j49K38o7k01K49j81J95p0J1N3j5m31M93
5973A15k3k61K77m27L58O9l4j31m9K49j75n6L4J51l31L46J21j91j84K88j33J77
5995A90m72J33K29J35j34N7J3K4j49j96J90J50j56J58k19J32j01J23j80M9K50
6016B26r6k7k01K06k00m2M4j17K01p1N4j29JJ03J59rk10j95J24L00k67L00L4n5
6040A33J10k11J19p4J14l31L16k35j0P9L9j83L2L1R4J50k58L58k75O3J71l58M89
6063C63n44K4Q7R3J48p5j65L06j84o7Jm5j26L14P1j6l98J74K36q7k02K28j98N
6087e7m2k47J08K99o9m4n3j59K99j7J1k67O1K75K2l10L04k73K77p6Nk1J83l01
6111i2O8P6j30L57m11L64k80j01K75j75L7K83k42j35M22l71K45%l28O7n4R7J20
$$ y = [-94, 9, 197, -360, 240, 138, 60, 62, -176, -124, -10, -159, 79, 12, -189, 60, -121, 74, 4, 15, 68, 53, -378, 115, 92, -169, 108, -319, 39, 108, 74, -57, -106, 143, -32, -88, -54, 97, -234, 112, 233, 42, -142, 146, 13, 190, -282, -149, 80, 215, 81, 138, 151, 175, 26, -170, 20, 170, 14, 172, -47, 85, -16, 107, -73, -24, 226, 130, 103, -98, 108, -92, -134, -90, -207, -6, -77, -23, -152, -151, -48, 111, 102, -108, -303, -179, 121, -146, 154, 188, 133, 243, 32, 151, 77, 191, -140, 176, -59, -69, 10, 49, -134, -102, -71, 23, 173, -85, 273, -2, 61, 232, -126, 363, -181, -157, -70, 23, 171, 96, -69, 237, 53, -14, -13, -58, -184, 130, 201, 185, -213, -39, 197, 110, -92, 136, -62, -57, -99, -346, -238, 61, -8, -52, -105, -264, 35, 18, 29, -238, -177, 98, 120, -190, 114, -159, 118, 42, 47, 26, 209, -92, -24, 52, -78, 279, -132, 232, -48, -149, 126, -49, -12, 271, 29, -106, 316, -55, 190, 190, -138, -71, -125, -28, 92]
6134I2l21L53nl55K85m63L88K98l58LK37m38L06j66j23K65K64k48N9k28N8N52
6156D55n58Q3L0j53K18k09K01k53k17N75p2n28L38J53j49O7k05M8M18l69M17k67
6178B3k48K78j99K40J56n91L04O1k56L75O9l21L39Jk96K58m73O23l29n1K95m80
6200b22J37N57n91K37l00K6L57m4k90L58m48L65p6j25K82l93L08J84m93KK46l41
6222b64K62J04l42K26n1l46O83m94K81K81n84M38j27l12M79l29j53N29n54K95
6242B2L48n50L71N3l75M67l86k8L65k38L13k70l59K06j11J24K30k03k12L99m09
6263b43M24j64n08P89k37j80J84l29L53J62l30K08l3j90N58p27J47K79n85O23
6283B01J26m68K02j43J04K07n45L44L44n32M78k60j85M38l62j22L43m11K51L16
$$ y = [92, -229, 124, 119, -236, 49, -414, -26, 272, -86, -83, 154, -284, 22, -144, -267, -2, 262, 14, 73, -155, -97, 455, -103, -20, 10, -143, 75, -134, 67, -186, -403, 172, 100, -428, -90, 63, -86, -19, -224, -176, 242, -127, 290, 23, -225, 53, -146, 94, 250, -341, -37, 24, -232, 143, 212, -109, 230, 231, -65, 193, -280, 343, 14, -37, 258, -222, -85, 472, -119, 118, -182, -156, 201, 157, -133, 225, -223, 142, 66, -59, 223, -170, 138, 322, -171, -169, 77, -264, -2, 102, -240, -14, -65, -411, 272, -222, 59, 340, -244, 194, 67, -245, 234, -95, -248, 281, -273, 22, 370, -180, 191, 244, -131, 336, -50, -78, 287, 49, 362, 92, -267, -61, -172, -48, 182, -21, -233, 166, -243, 181, 17, -491, 298, 61, -119, 65, -264, 89, 251, -79, 129, 96, -94, 464, -263, -116, 163, -422, 201, 327, -141, 61, -82, 22, 229, -316, 28, 372, -160, 318, 58, -127, 311, -51, -173, 170, -241, 10, 326]
6303C26j80l5j28j13L86m05J7J58m56L02J04o1On3p7N09m54l7J92l58P43l06o9
6326A1J43j72o2K58m01K72K76m95L36j99j14M71m42K7J90m87M22k9j1L6j10J1
6348f9K00l75J93m0J94K09l49L1j36K19k05K43l52J96L58n89K60p0J7L60l09M
6370a0J25j34j22J12O2J46k88J34k31j1R7K15o7p0pK13l3l10j54N13m91J95R2
6393b4p8J48k43J74M9p7m1q6l1K00kk1J73k11m5O4o4J99j20K73l42O8o2J18q4
6418f5N8K65k12j58J89j52K43o7J8m2p1n6P4R9j0r6k57M12r8p0R8J8q6q9j33J96
6444Hj89j01O79n36M17k72l93N60n3l18K37j21K91j97k54J84J79k46L16k12k16
6465b37J38J52j44l0J8k2j36J75J46k65K65Q2k58R8j56J2oL71m24O6K98Q5l06
$$ y = [326, 146, 111, -17, -130, 256, -149, -132, 26, -430, -128, -24, -85, -79, -132, -209, 300, -154, -191, 1, -357, 386, 80, 11, 154, -18, -80, 178, -223, 49, 325, -170, 166, -33, -147, 324, -118, -91, 99, -388, 34, 5, -6, 30, -80, -69, 131, -244, -51, -91, 103, 312, -37, -6, -142, 77, -128, 115, -237, -41, 317, -272, -12, -82, -65, 295, -14, -10, 115, -19, -141, -29, 33, 179, -109, 25, -206, -217, -120, 95, 28, -42, -49, 164, 131, -179, -333, 180, -311, -116, -24, -102, 46, -197, -23, 26, -51, -92, -178, -209, -9, -11, -32, 141, -70, -115, -51, -115, 84, -36, 237, -105, -37, -99, 19, -65, -7, 258, 46, -112, 77, -75, 168, 101, 119, 77, 6, -50, 24, 123, 113, 17, -240, 172, 74, 4, 102, 120, 34, -55, -188, 8, -181, -282, 397, -139, 278, 6, -387, 173, 120, -198, 39, -82, 209, 12, -242, -58, 121, -125, 191, -21, -237, -99, 53, -91, -121, -103, -125, -261, -86, 60, -205, 60, 142, -116, -18, -174, -162, -168, 203, -221, -155, 143, 228, -78]
6488g8M01l71J24k12K17k48J41J28l35K28L2r0K09m5j91J62k06K63r8j76L42l31
6510a34l9J00J7K17j66Q1J68l35k54J45J68J54MN6j85J59j28K2l6M1Nj7n9K46
6534B30l89J33R9m2j07KJ30k70j62L48L8k19K37j69J01K79l34J87r0o7pJ52K9
6557A09j0L6m24N5K2L99l0k06j67K5N5K28p2l02N35m48K60J33j84J12m7L6j1j65
6581f1k8J56j13J49j73K5j8j2J72J42j07j36K2l18L95q7j46J75N9l2O5k38K72
6604A63ol82L21j81j6o6L88l39J49j4Q2q2l03K83j54K10J22l50K40j21j16N7M43
6627C28m35O2n3l3L03o89Q56m21mK03q7R0J21r5q5R4k80K02n7kj9j77K48Q7j07
6652E0K3j86l52O45l45L7L53j89j71K16l34L12J24k94L13k52l63O86k5k19J88
$$ y = [-78, 323, -48, 76, -136, 81, -167, -26, 102, -233, -5, 27, -63, 146, 101, -90, 72, -134, 129, 31, -145, 197, -134, -173, -73, -56, 161, -5, 76, 244, -91, -345, -200, -32, 122, 126, 182, -3, 156, 28, 50, 14, 55, 60, 43, -16, 230, -159, -26, 73, 31, -76, -74, 56, -214, -376, -28, 10, -209, 28, -141, -40, 239, -95, 92, 2, -65, -72, 80, 109, 99, 135, -289, -234, -212, 187, 157, -49, -216, -191, -136, 92, 20, -282, 253, -195, 65, 198, 14, 126, 79, 115, 104, -61, -89, 67, -46, 103, -70, -45, -63, -75, 97, 239, 132, -4, 18, -300, 95, 8, -138, 37, 96, 64, 129, -109, 163, 157, -225, 96, -85, -101, -167, 221, -118, 31, 17, 99, 17, -286, -3, -157, 53, 175, -175, 65, -56, -172, -115, 328, -107, -45, -98, -131, 172, -517, 339, -82, -86, 117, 30, 120, 241, 146, 61, 155, -125, 77, 20, 18, -1, -178, 70, 157, 50, 73, -113, -465, 180, -165, -128, 225, 36, -135, 81, -253, 59, 183, -111, 202, -50, -413, 273, 248, 29, 217]
6673B17o43N44l8j53K26j61k00O50l56k50K42m17L26J92l43K13k15N9L48j61r
6694G1%k88M87q42L92M01n43M78m5m93J62J81J14L54p39J79M67l92J07L3k53M
6716a65J67k23K31k44K91J04l89K77j6j6P2k58N8L39l49M80j81l22L53j8K3n4
6738A60m36K15R4j12L77r1k87N30j45j79K8l92M41j25l23L90k68o4M22m97N1L92
6760A81k81J28k6L3%m3k48M14n33J81J15p3L99l23k19M44k32J95M2k76J22J30
6782A30J1lP9k83N4j51P5K78l49K62j22m9O7k63NL93k27J65K61l62O4j8Q5J09
6806B11j41k37L19k25l5M1k17L03K7k03L44k18N6K21k91L69n14J95M9k90J09K77
6828A50q5j08L2r5L15l61K3K37l15J10jr1K00J52k77N6J15k44J1m1J59l6j51J52
$$ y = [217, -426, 118, 80, -73, 153, -8, -208, 442, 86, -164, 78, -339, -13, 179, -164, 49, -166, -107, 241, 80, 71, 71, -217, 270, -572, -180, 221, -322, 156, 111, -382, -220, -39, 75, 429, -310, -131, 336, -56, 51, 84, -169, -165, 2, -221, 10, -234, 57, 161, -228, 49, 33, 17, 89, -169, -111, 228, -121, 359, 178, -144, 209, 191, 214, 160, -276, -61, 33, -79, 298, 207, -80, 450, 305, 126, 154, -238, 203, 78, -245, 145, -123, -187, 235, -262, -211, 181, -100, 28, 2, 35, 35, -8, -256, 158, -375, -194, -79, -152, 247, -76, -295, 149, -83, 112, 154, -122, 0, 130, 141, 138, 217, -66, -12, -163, -88, 190, -159, 103, -19, -68, -1, -264, -259, 134, -93, 72, 333, -29, 35, 17, 102, 211, 70, -167, 152, -73, -108, -67, -284, 19, 46, -157, 187, -31, 25, 246, -45, 324, -190, 5, 54, -236, -127, 150, 65, -43, -11, -106, 209, -152, -129, 108, -207, -97, -98, -189, 11, 163, -114, -58, 57, -187, -176, -217, -58, -94, -245, -93]
6852i3J94o6N8k54p0L58j48q9L42m89K08n3j4K62j24k34J51PK90k96k01N39k84
6875fQ7j1j85J36K31l19J76j22m0kk6O2k3j4n2K50k05j8J49j4K23k25m5J29k31
6900i5n5j07J89rJ17l5ml09N91r2j70K21k92J24j71Q3J96k68k24L66Q5j66P1l9
6924GJ8j7MQ5n6k07J56l2K8n8j2J85j57L1kJ30J38j39k30l5L97k17j44K13nn6
6950B5P8l03KJ64K4L8m8m1Q1j13L47n6l43M82n12J58p0m2K70K25m33K34j95l5
6974f3K28r3j15K39k70K12K18o10L59k23R4j96P9Q1Rq3R5M5l6J81k91J35J1k27
6998b21J23L29k79j02J44M7k30K3M3K23k04L3k3n6L71j9l01K95l82K58jl19L07
7021E9j41K24q1o0k8M0J23l1j04m5k8Q2J19o5l51O12l05l9K36l45J0K40J12j92
$$ y = [-93, 101, 35, 93, -161, -231, 127, -21, -110, 232, -257, -49, -102, -116, 146, 22, -212, -61, -54, 236, -60, -261, 278, -6, 81, 70, -115, 21, 252, -67, 109, -13, -53, -55, -81, -19, -42, -56, -108, 142, -63, -81, 68, 54, 277, 52, 7, 136, -95, -150, -257, -68, -77, 40, 5, 1, -308, 283, 191, 21, 242, -50, 74, -97, -14, 182, -86, -310, 56, 141, -25, 46, 7, 25, 8, 12, 97, 41, -166, -10, -42, -14, -72, -84, 101, -56, -25, -27, 103, 241, 102, -128, -163, 234, 17, -127, 86, 81, 25, 103, -200, -198, -34, -10, 28, -20, -61, 20, -93, 254, 198, -145, 337, -175, -17, -87, -129, 141, 366, -67, 167, -28, -63, 165, 72, -43, 196, -74, 138, 356, -254, 105, -118, -24, -220, -141, -60, -51, -134, -39, 6, -30, 151, -140, -5, 6, -221, -98, 231, -48, -150, -6, 41, -189, -166, -123, 100, -104, -71, -94, -150, 221, 202, -99, 196, -186, 72, 71, -248, 59, -82, 142, 61, 1, -27, 13, 136, 105, 1, -44, -72, 10, 129, 64, -287, 325, 20, -19, 217, -128, -118, 122, 234, 42]
7045D2q9j70J55mQ8M1k35K30j85J3M9j14PK85j65j35L16k11J51j26r2J04q8l6
7069a69J30J08o5j03j05K04J49k08K88j9l61K88k33J33m4L0N6L19m23j06K44k52
7091a39J61J70j79j18L8O7J7m4J42k87O5J78k28J82o7j27K64N5p4j85JJ47J56
7114A95l27L22k17kJ5j4j57J84j78L02o4M0l8K2j64J93k64JL31j83J61o3m03L67
7138E9k90K41Q7k43k9J16q6J91k62j9L08j82L21pl93J04K49l56J69j34K4M83n75
7161b24J88Kk98M36k49J91J13k58J44j02p0M7J01j40K53k61l4K70l05K89ll25
7183b35J48K61j28P2j76Q3K19l23J77r6L1K2l02M33j84n9J93j63jl3Q6n5K98l23
7207e5k82N25m00L22j70m5J68q3n9R0k45M62nk73K47l67j20L51k6j85J12j23N
$$ y = [42, -47, -217, -62, -66, 22, 63, -172, 58, -127, -114, -65, -179, -172, 113, -52, -187, 129, -82, 69, -57, -149, -45, -133, -169, -39, 69, 4, -99, -204, 0, 149, -59, 229, 210, -151, 137, -96, 37, -7, 23, 79, 398, -25, -131, 113, -139, 22, 192, 13, -105, -67, 0, 17, -27, 115, -172, -107, 71, -157, 25, -42, -169, 95, 150, 76, -109, -108, 39, 195, -132, 190, -27, -29, -14, -28, -185, -1, -179, 123, 59, 99, 61, 83, -81, 112, -152, -151, 180, -3, 158, 95, -308, 59, -231, 10, 97, -146, -175, -59, -145, 46, -216, -235, 73, -109, 212, 205, -188, -84, 165, -191, -22, -156, -132, 351, -224, -36, -34, -332, 104, -145, 46, 159, -99, 45, -57, -127, -80, 21, -119, 134, -127, -161, 109, -196, 93, 90, -235, -87, 174, 46, 118, -58, 25, 244, -79, 98, 2, 33, 55, -247, 186, 2, -57, 136, -27, -28, -61, 25, -30, 268, -55, -337, 188, -212, 110, -60, -105, 63, -20, -79, 11, -234, 228, 223, -50, 197, -170, -290, 61, 35, -150, -38, -161, -156]
7230a56J75m2j9k00K38J00k19J31%J9k0J11l01K52k72J71K20l29QK13O6L8j38
7253D6r5K6J5K85k15k99J77J71k83K29j86R8K25k82L89j10k93J4K64j53j7p4l63
7276d31N51l81O28k43m91O89l27MO8r4J96j43l09K29J08j13K28l04K02j67Q8j57
7298a69L62n82K35K75r2j63pJ37j36K27o6R0j03J56j96o3K74j70Op6k33K06Q2
7321fN0J85j09n9R7p2L90l62j31l8q0R6J23k47N5K07l4J45k30q4K07j37Q9J34
7345A89l81N2L44k50Pk6j19N04l46O2q5j11p7M52l34J85j0nK6p3o3K19l48J04
7369h4L8l5J27n7Om2j66J46p9j0l3K57m4r2P1J3pj04J56j40K11m09K46R5n8j53
7395a47J36J0k0p2L4r9L16j68K2R7j70M0Q6K10o5m57R1K36m5j01R5oN5m7n8j40
$$ y = [-156, 19, -23, -42, -242, -4, 96, -123, 8, 8, 27, 7, 118, -183, 69, -203, -32, 188, -141, -133, 80, 146, 184, 46, -49, -23, -8, 277, 62, -237, -60, 111, -172, 57, -129, -31, 194, -88, 301, 191, -102, -88, 176, 23, 6, -68, -431, 120, -261, 367, 124, -367, 322, -5, -1, 67, -27, 169, 26, -283, -54, 54, -59, 169, -135, 67, -100, -12, -169, 193, -389, -154, 121, 29, -134, -141, -4, -140, 87, 21, 111, 8, 164, -32, -95, 179, 9, 15, -61, -294, -88, -6, 44, 229, 120, 61, 158, 86, 476, 114, -17, -55, -135, -39, 84, -163, -108, 99, 65, 210, -20, -104, 103, -34, 55, 189, -192, -140, 204, -46, -39, -65, -184, 320, -26, 36, -49, -160, -237, 215, -119, 66, 56, 51, 77, 4, -59, 160, -188, -84, -46, -81, 46, -11, -5, -47, -213, -67, -146, -156, -189, 68, 24, -68, 3, 16, 9, -95, 61, -79, 132, -277, -31, 64, 6, -147, -11, -1, -21, -93, -59, -158, 158, -10, 12, 109, -61, -21, 65, 275, 210, -247, -156, 80, 35, -66, 29, 23, 78, 31, -27, -167]
7421a67J67J20j73N6N6j24K78j62j47p9L35j57M2o3K27J24r0j91k73M04k60K41
7443A64l73kNK26J74Lj03j00j30J54Lj97N9K36j14p4q4J56j22j29M03k65Q3k0
7467d7N9l6R3j60o1L78r8j10J44k72N1N2J56j33J13k56K28l3o3M2m5J42k25R5
7491A4Rk66K94j19k1P2M8K6r5k78J27Q0J56L7o9n7J77p0k85J57j50K69j28J43
7515G1l4L02k01M9k3k77K89j78k32K75j86K79m16N02r4n33L28L38l04l2rO1Mj13
7539a34R8J3J59m50M26k19J18J66l29P5O0j93L33j76R7l47J16J31o0R0o5J20Q7
7562A16k40M8K54m21M84l2j16n4j49J23J21l3l18J71l7J01J16k25R6l4m9O2K02
7585A86l46J83k5R7K97n99J49m5m7L21k5j78o3j60K60Q6k29K95l11J60o0o5J44
$$ y = [-167, 0, 120, -53, 3, 59, -65, 213, 51, -96, -175, 160, 3, 45, -18, 209, 333, 243, 52, -221, 183, -77, 164, -209, -211, -206, 20, 194, 197, 94, -6, -136, 18, 21, -176, -117, 119, 5, -69, -153, 3, -119, -248, 155, -110, -27, -47, 12, -24, 69, -91, -152, 226, 128, 18, 162, -110, -59, -7, 149, 16, 129, -127, 101, 68, 5, 47, 2, 144, -81, 14, 23, -243, 51, -68, -89, -17, 31, 57, -38, -316, -189, -109, 47, 84, 15, -42, 135, 65, -220, -63, -213, 56, -72, 71, 37, 339, 138, 187, 164, -113, 176, -2, -234, 41, -145, 134, -282, 220, 126, -407, -79, 259, -45, -77, -86, -25, -21, -134, -36, -23, 136, -314, 112, -107, 11, 177, -152, -77, -17, -210, 123, -53, 44, -303, -187, -56, -116, -26, -91, 29, 116, -124, -76, 178, -243, 241, 209, 93, 39, -110, 13, 134, 101, -217, -46, -83, 18, 134, -91, 5, -29, -78, -16, 186, -160, 23, -2, 95, 392, -207, -58, -103, -150, 171, 146, -32, -95, -255, 5, 91, -138, 157, -154, 6, -54, -119, 25]
7608B5p4j5J78L9j05K60m06P5k5j21j13L66o6L1k7J79p0l06K18o3j31L44j40n4
7632aL9J09R5l8l77J57J28o5R5n9j20m3J05M9o7l24L49M9j21L9P6j54L4k64K72
7657c7K4Q0k2L5j41j23K45j37L06l08j5J28r0L4L19n55L60j10K42j93k97K60M2
7680D7j68O6m5k9J18j43N3r5L2M35m38L0J38P7N5O5mj22ln0r5P0P8J96l85J58
7706D1J58j79K11n4j10L8k42K9M25n39L58K4l56L40j06l33M53k86j61N45m17J97
7728C6k32j22L33on6J36k17L12l0k06K32J9j72J91j26j13o9j47J28L11n18O18
7750C02j81j36R5j82N1j4j83L04j17j23RJ85r0Q5K5J02J51n34L20q0j22L32k31
7773c2n4N27l50n7K58k54j74J65Q4r2kK8p5r3L07l85O4L74k25n9K12o9k46R3K79
$$ y = [25, -49, -64, 114, 153, 48, 308, -98, -23, -48, -169, -282, 84, 18, 49, 22, 201, 131, -175, 43, -20, -151, 193, 53, -1, 38, 147, 242, 204, -173, -16, 112, 47, 142, 83, -37, -80, 25, 74, 7, -317, 32, 81, -40, -1, 75, -79, -45, -309, -37, -13, 67, 45, 80, -61, -184, 61, -76, 230, -78, -93, 35, -55, -21, 298, -257, 103, -7, 235, 42, -255, 5, 47, -121, -55, -100, -129, -11, -154, -101, -196, -164, 271, -167, -137, 1, 78, 133, 198, 194, 72, 69, 19, -76, -6, 72, 268, -117, 41, 199, 20, 231, 177, 67, 105, -137, -108, 317, -222, 136, 160, -196, 144, 38, -295, 158, -128, -289, 256, -161, 36, -196, -318, 15, 9, -47, 89, -128, 184, 154, -52, 180, 199, 27, 218, 92, -21, -90, -237, -109, 202, -316, 302, 121, -15, 80, -102, -51, -65, -248, 56, -61, -184, -175, 10, -80, 5, 30, 132, 283, -251, 69, -11, -133, 199, -32, -86, 441, 91, 34, 292, 38, -136, 29, 113, 21, 19, 47, -28, -121, 186, -199, -135, 239, 14, -45, 167, 98, -148, -55, 224]
7798B24m51J58K06j51J2j55j46M5L74j04q1K58q8Q4J03j68k05K24l30K75k1m9
7820A4j02O1q9J09k87J06L99n48L63k50K08m4Kj85J90J06r7R2j03j02L87n7M7
7843B20m16J80J25o7j70K83k06j8J92j52J09P7l00J1L9K1m7j00K04k80N84m35
7865a46J48R3k85L42k34R0J84L0o21M35q7P1K47j35k79L7q1K84J48k70J8J02J21
7888B12j97r0K9M8k13L83j20j54J42Q6k77K88j06k68L89j80J54j23L0J14k18J0
7910f1J64M8k08J2O0J23k25N8j7m5K7M1O0k9r0k49N41l7k20oK6J39J31l92J16
7935c3O7l0K23k22J7N8j75J06p5j3j04O3p7L60j62m7J55k09pL49l27K11j20j13
7959a05K06m9nq5k4r2K71L7p3k35J0K28k38K29j00R3j00j72M3J50l30J20J72m2
$$ y = [224, -227, -69, 137, -14, -2, -157, -303, -258, 116, 12, -69, 189, 101, 185, 288, 120, -85, 139, -191, 84, 63, 14, -88, -27, -116, -7, -294, -188, 211, -337, 26, -224, -16, -60, -58, -243, -53, 53, -44, 48, -55, -157, 230, 173, 220, -196, -16, 109, 42, -128, 155, -51, -69, 123, -29, 80, 157, -143, -132, -93, -72, -119, -219, -15, -295, 289, -146, 2, 95, -190, 152, -82, 8, 192, 222, -399, 36, -51, 20, 267, 132, -147, -110, -191, 93, 241, -29, -11, 91, 212, 15, -75, -46, 2, -211, 172, 52, -102, 40, 126, -151, 137, 31, -237, 152, -28, 126, 3, 33, 147, -71, -61, 103, 151, -57, -45, 15, 138, -87, -29, -46, -91, -64, -23, 37, 8, -82, -331, 210, 173, -47, -53, -27, 112, 243, -149, -33, 34, 4, 227, 5, 22, 80, -95, 11, -64, -77, -181, -118, -195, 165, 3, -44, 111, -98, -105, 244, -83, 128, 8, -105, 101, 52, 47, -38, -62, -154, 117, 154, 81, -154, -144, 84, -154, 75, -25, 68, -32, -204, -161, -11, -341, -221, -49, -91]
7983i1LL11k92k5K16k79L06j24q1O5k08J80J57j54L25k75J95j98k87K28J68k32
8005i2K09j14O9K00l30J08l00L05P0o9n5Q0K0k22O8K35m72K88MM9k30R2J33j4
8029C2lj19p7J84k19J59j39K65k10J74j90oM54l45p6J3J23K17k78j56K96j09r1
8052a01K61k92J83q9o0m7j9K72n7j28J19j52K9J18j73N8j4J24j0O5rL8l02n0J93
8077d3j74K03P7n2J74j56k9KJ40k24O0m3R5J62m80N70k81m0O9j28M0J45j31P9
8101C5k5k61L72k29K26q3k57L15J36m45J15OJ9M21l86j37NK27j30K87m38L56k45
8124a16L69j5k63J49k3n1K62k40j82K28j77k29N71n25J33L08k87K6q0P7k6j74
8146b65J39K31J9Q3r0k54L04j50k6J60k19Q8J06k25L05j82q3M02j18k36Q1j92
$$ y = [-91, -88, 223, -69, -94, 122, -157, 149, 25, -56, 9, -199, -19, 138, -16, 309, 34, 229, 31, -256, -28, 140, -92, 117, 3, 72, 272, -58, 50, -250, 55, 125, 56, 1, 81, 101, -121, -53, 182, -290, -2, 2, 51, -179, -87, 46, 32, 29, -90, -167, 17, -202, -43, -182, 83, -127, 47, -143, -149, 305, -40, -116, -103, 20, 237, -41, -197, 99, -10, -101, 160, -132, 51, -38, -98, -145, -164, 108, 51, -77, 42, -110, -81, 37, -136, -78, -92, 32, 22, 87, 78, 116, -186, -236, -43, -217, -14, 63, 11, 185, 29, 0, 2, 142, -82, -22, -65, 30, 192, -288, 282, 1, -39, 30, -98, -58, 87, -44, 35, 10, -251, 121, -108, 118, 35, -222, 93, 229, -216, -101, -95, -76, 345, -41, -178, -173, 54, -76, 211, -227, 129, -116, 253, 238, -25, 124, 101, 50, 312, 72, -110, 118, -59, -288, 283, -242, -109, 199, -88, -62, -142, -65, -91, -265, -126, 105, 124, 207, 117, -137, 167, 17, -9, 151, -68, 20, 126, -99, 206, 24, -59, 343, 225, -11, 70, -122]
8168a22J55k94K46J92m19K58L2l40M00J12l82J87Q3j48J12l20J32L06k53J69%
8189A06n7n6
$$ y = [-122, 33, -261, -15, 177, -242, 16, 48, -292, 108, 220, -162, 25, 108, -40, 72, -248, -116, 190, -63, 106, 106, 49, -7]
8191g
$$ Imaginary data points
##PAGE= N=2
##DATA TABLE= (X++(I..I)), XYDATA
0@%%%%%%%%%Qj6J6j6K4l2M0n6P2q8J04j20J44j76K08k43K83l31L85m44N13n90
31c15O78p74Q78r95J121j259J417j591J778j984K208k451K721l016L335l685M066
48B132m483M942n442N990o598P274q026Q866r810J0882j2111J3536j5214J7222
62I160j9672K2740k6717L2105l9879N2250p6079K01759m29736K18941K28448m12639
74b39319N46147l51831k33868M52304k16939J10958M9020m62054M55706J374k42403
85a30905K97692l11974J17946L09248m88422K87251N2276m61270M14169j0532
95G5479j87718K29188l36112K43864K92573n13875K08944M9979k69334M60159
105B53147k39647k65355M00893k00172N7733J39044l78927K44477R1738k27375
$$ y = [0, 0, 0, 0, 0, 0, 0, 0, 0, 0, 8, -8, 8, -8, 16, -16, 24, -32, 40, -48, 56, -64, 80, -96, 112, -131, 152, -179, 206, -238, 275, -315, 363, -411, 467, -528, 593, -666, 751, -840, 938, -1046, 1162, -1289, 1432, -1584, 1751, -1934, 2132, -2351, 2591, -2851, 3139, -3459, 3815, -4211, 4655, -5155, 5727, -6384, 7152, -8062, 9160, -10512, 12228, -14489, 17616, -22263, 29987, -46092, 155667, -274069, -55128, 173320, -239319, 306828, -45003, -278871, 173433, -43506, 67452, 116472, -345582, 110124, 111498, -130905, 166787, -145187, -27241, 282007, -206415, 80836, 133112, -328158, 86011, 75479, -112239, 116949, -219163, 24701, 317274, -196601, 12343, 62322, -207012, 253147, 13500, -251855, 149038, -51134, 6599, 145643, -233284, 11193, 102931, -124444]
115a24444K42820j32896m9227J96234k21501J88073j861l73948L37003K7757k02514
126a14504K17119k09233M4540K86554k83329L4453P2439j71623K52492q0753j88510
137a40355K24306j14110J5009J19084k24146J24298L7452j56316K22728n9510
147D8440j36774J58890p7005M2798M3787k26768J26207P9440j14678J04969r7384
158d8078j1445J82391j31825j3848N6750j03827J14094l833j10412J17509n6043
169h567m1423J09697r1337M186L1692p4808J21341K515j03352P2998j0647K075
181A4370L5475j15749K0129P5372n3931K9414j1732k8557Q4476l8307l0536M6618
193B7042m8270J5965K9889l8761L5279j2207m8315N8018n405m4289K1852j6490
$$ y = [-124444, 118376, -14520, -63747, 132487, -89014, 99059, 97198, -276750, 60253, 88010, -114504, 102615, -106618, -62078, 224476, -58853, -24400, 48039, -123584, 128908, 48155, -140355, 83951, -30159, -15150, 103934, -120212, 4086, 41538, -114778, 107950, 48440, -88334, 70556, -6449, 36349, 80136, -146632, -20425, 59015, -55663, 49306, -48078, -59523, 122868, -8957, -22805, 33945, -69882, 44212, 40379, -70033, 47476, -8567, -49990, 59707, -31630, -27444, 4248, -70560, 50781, 53296, -50056, 22942, 12295, 14370, 49845, -65904, -45775, 29597, -24334, 5080, -6652, -35209, 49267, 10960, -19576, 27042, -21228, -5263, 24626, -14135, 21144, 8937, -39378, 18640, 13235, -31054, -9202, -25692]
205b5692L1983M1650n5355M367L1500j3339J322l2406j5622L9258j2747j0137
217a5218K5079j5243J5482O385l0418L1224q503l1361L5909k856o206J2052l7967
230b1641J5023K8030m7906O201J8552j2867M1410j5834k6300M7890j8276k6505
242a2223J5183j9965N767J0671j8778J8985Q316j0937O631j2953J6383M657l5183
255b3446L0099Q553k2227K3233k3884r429L4571l5985r535L4381j5269J2735J2019
268A5816k1464K7751n726k8789J5965r494l169Q483j4095J5327J0801j4187L089
281C08N65K045M557j5956J1330J3088j4595Q278p203r044J3949j7899r073K0708
295A058j032j246R606k83N644r66j5067J061J075n422R5j812O166P253o428n789
$$ y = [-25692, 6291, 47941, -7414, -3047, 28453, 15114, 16436, -15970, -31592, 7666, -5081, -15218, 9861, -5382, 10100, 16485, -13933, 17291, 8788, -22573, 13336, 10480, 4274, 16326, -21641, -6618, 21412, -26494, -20293, -1741, -14608, 26802, 10968, -15332, 32558, 14282, -12223, 2960, -17005, -11238, -567, -19345, -360, 7956, -2981, 3650, -9303, 7080, 11737, -23446, 6653, 15206, -7021, 16212, -7672, -17101, 17470, -18515, -28050, 6331, -8938, 3797, 15816, -5648, 22103, 16377, -12412, 3553, -5941, -9110, -627, -14722, 605, 11406, -2781, 308, 873, 2918, 7475, -8481, 2849, 15937, 1342, 9620, 2417, -6627, 7322, -10577, -19650, 1058, 26, -1220, 8386, 8103, 13747, 12781, -2286, -1225, -150, -5572, -5477, -7289, -1123, 6130, -298, -6087]
311f087Q695R54j0024N878L597k85P354p805m754N631o083r581j3N484O604m100
327d535M116J3541r201Q70K507j8171J1707J421j9935J6724M994j0302Q313m248
341b199n26O055j0446O865M500l778J2918j3760k193J7609k3974l057J2857j3844
355a2973J1927P571j2122J6000J288j0491P567j0777J082L961j3792J5285M47
368D973j4242J6524o535n296J3194j7070K526J9386j1454K041L466j0917J2017
381H613o481j4344Q872n623M671J1106j1534P501O310j1077R771k868j6504J0936
395f51j523j637J2855j7773r31J8295j1740Q75M66j3126K1087N383j5574J0618
409F624r475j208J8439k4945j700J1867j4828K3369J098k2070K1953q734j458
$$ y = [-6087, 2608, 3562, -6462, -584, 3013, 2728, 10082, 2277, -2477, 3154, -2929, -12510, -12523, -7039, -435, -4535, -419, 13122, 3921, 4791, 7298, -10873, 834, 2255, -17680, -956, 4038, -6264, 2049, -2199, -2725, 3330, -7116, -251, 4249, 471, 13389, -371, -2564, 15045, -8929, -11986, 871, -12973, -1046, 6525, -5597, 10403, 11691, 1200, 8767, -2010, -928, 3033, -10759, 4526, 4973, -9269, 7255, 720, -4576, 8618, -8452, -5926, 13460, 2006, 4047, 7513, -3404, 8613, 2132, -12212, -3340, -8963, -4292, 6814, -4720, 2781, 9091, -1986, 7785, 4917, -11587, -651, -2174, -3811, 9044, -8729, -9660, 8635, -3105, -2230, -1764, -14890, 6197, 11580, -3994, 6624, -2851, -4059, 14380, -10565, -12265, -398, -15226, 8143, 9241, -12829, 9124, 390, -1068]
422a068K3466l7567K225K5884k1556K2169r623l1979M4875j1635j5871K7256m0072
435b3496J7562L7696m0734J7388l118k6530M8629k5989k1300L1987l9004L2566
447E657K7306n8606L3748l318k1663N8459n1582j9138N3164m1014L1515R092o8785
460d5165N9049l480l0580N5881o6148M540P2492o4832K7831R789o7554P4611q198
473A8236m7129M6763n1186K5778N2568p3767L6211o398l8116R3693o1343l7907
485d2597P7373o7531M1260M1869j08700O2324J4869n1616P8767o4659k2715Q3023
497D1667o0115L8582O082r1151R7243j1296n7098P9239q0745O555R4402q7125
509b3760K6650J0358o3462R9894l5023n3467P1283o8254M1062N3796j11159O1392
$$ y = [-1068, 22398, -15169, -12944, 12940, -8616, 13553, 3930, -28049, 16826, 5191, -10680, 16576, -23496, -5934, 31762, -8972, 8416, 5298, -21232, 27397, 1408, -19892, 12095, -26909, 5657, 32963, -25643, 8105, 4787, -16876, 41583, -9999, -29137, 24027, -16987, 14528, 23620, -45165, 13884, 10404, -20176, 35705, -30443, -25903, 46589, -18243, 9588, 19377, -48177, 26434, 18236, -28893, 17870, -33316, -7538, 45030, -28737, 7474, 1076, -37040, 56653, -4690, -42597, 34776, -32755, 8505, 50374, -58326, 3998, 18867, -32749, 46018, -18641, -41356, 41667, -18448, 20134, 26216, -64935, 32308, 21012, -36086, 43153, -37592, -31037, 63365, -23760, 2890, 13248, -50214, 49680, 14657, -38810, 32473, -35781, 5281, 59077, -52082, 9310]
521I310L476o0256J12778p0226n4379J04376o0991K4435L3541r8922P0842M095
533A8079m4956P8218q8662k224R9491q5715L6200J1184q8684J09836j8967o7374
545d3574Q3924p3216J1059Q4563r2464K7382O563m8009J00129n9477m4237Q8051
557D0694p3797L6164N3430j10879N6623J5177m8932Q2577p1066k7520R3181o3292
569a7640K3635K1016q1664P5819m091m2249O7325p7904Q556Q7678q3142J9853
581b808J7423n8795P9368k2472m4222N9933n7628K7484N4581q7856L3817J2681
593A1506l8452P0267n0629k7936O8923n4145K5402L1587p9164M6708J3898l3780
605a5815M7636n1834l792O1933n3199J9348J1128n4730N7313l202l3464L7699
$$ y = [9310, 12786, -47470, 65308, -4918, -59297, 45079, -15912, 8523, 42064, -56858, 13984, 18079, -26877, 51341, -37321, -39545, 59946, -25769, 10431, 21615, -67069, 42767, 23800, -43574, 40350, -32866, -21807, 62756, -29708, -2326, 4237, -43772, 56357, -3120, -47357, 40694, -33103, 3061, 56491, -54388, 2235, 17412, -31520, 51057, -20009, -47529, 45652, -17640, 5995, 27011, -54653, 21166, 17075, -25174, 42151, -35753, -27197, 60481, -22661, -2808, 14615, -44180, 35188, 12716, -31506, 28427, -29201, -1717, 52864, -34992, -1175, 11506, -26946, 43321, -7308, -35244, 33679, -20466, 4936, 36523, -42641, 4067, 17965, -15815, 31821, -20013, -23805, 38128, -15071, 4277, 15405, -39325, 17988, 14786, -18678, 19021]
617A9021m1965J4953M6317n8148J6746J1906l3425M7837j8200k7737L5729k8194
629a5160J8058K2780n2172K4254J1469k2067L2974k6420j2732L5978k4948J1375
641C389Q983l8419L0768O650k1090K0706k1367J405K7659k4648O137M559k0750
654a6018K6809k548j8697J5658j1838O518J5332k3786O488N676r677J6969r301
667A585j1036J4779o364L574M921j6251P831O769p982P260o635l952J1213m053
681A659p28O43p333P443L354o852K081j942n22O865m094m012L503j388K473J255
697B405m909N16K253m51J043j223l046L630J045k475J693l028J67M487k921l85
713a199Q77k106L370N53m052K790r10q85M477m829M90L514m442L647q5m435M870
$$ y = [19021, -22944, -7991, 38326, -19822, -3076, 8830, -24595, 23242, 5042, -22695, 13034, -15160, 2898, 25678, -26494, -2240, 9229, -12838, 20136, -6284, -19016, 16962, -7986, 3389, 12372, -26047, 4721, 11371, -9719, 10987, -10380, -8975, 18684, -5964, 173, 4732, -16018, 10791, 8243, -10454, 5204, -6634, -116, 15216, -8570, -2082, 3594, -6083, 10886, 1585, -9451, 5328, -1036, 2538, 7459, -8792, -961, 5808, -2174, 5086, -1549, -5501, 5712, 1659, 931, 1574, -5759, 1684, 5038, -1814, 267, -1675, -2197, 4668, 574, -3438, 65, -1323, 1150, 2405, -2504, -1988, 265, -186, 857, -366, -3412, 218, 1263, -1212, 481, -2547, -2380, 2107, -814, -1199, -322, -2428, 942, 1495, -2557, 233, -677, -1562, 2915, -1914, -1424, 2090, -2352, 1295, 1210, -3225, 1645]
730A645j414j190L803m179P38L532m718L418k11m536O278k867j762M514l933J034
746A52K667l953K237K24k312L223k128p8K470l946K313J005m486L844k72k768
762a808L457j463r90J731n81o38M61q58N36q00L66J402k261Q77J236k421J350
779d04Q49j542J38J944j900m81K451k415k81J860j592L07J343p26J94K01k36Q19
797E29j416M41J442k998K644J16k804L883j544k007L752k347l03K746k972J578
813G40Q55k492L256k211j428L650l966J822K556m889L670O69l378L907k112k286
829a637L990k880N3K350l749L366J07l395L557k741m1L675m080J605R74k923L018
846A249m38l875L365j139m96K816l439O48K234j432J354j559j624K400L01j030
$$ y = [1645, 231, -959, 2844, -1335, -597, 2935, -1783, 1635, 1424, -3112, 3166, 299, -1463, 3051, -882, 152, 2819, -1134, 1103, 1327, -985, 2238, 110, 32, 2502, -1444, 869, 1874, -2612, 1232, 960, -1808, 1649, 186, -804, 927, 346, -292, 169, -689, -153, -953, -587, 815, -1446, -569, 667, -1754, -404, 445, -1097, -959, 985, -915, -1396, 1055, -1360, -1641, 219, -1373, -1066, 277, -449, -255, -54, -290, 529, -887, -446, 996, -2002, 642, 758, -2046, 1837, 293, -1714, 2038, -309, -612, 2134, -838, 740, 1595, -897, 2359, 148, -1280, 2370, -1596, 226, 2782, -2107, 1563, 2232, -1146, 2761, 649, -1637, 2353, -527, -474, 1876, -1873, 1493, 1600, -1795, 1762, -979, -1020, 2655, -1425, 180, 1154, -1769, 1249, 811, -3064, 301, -838, -1334, 1482, -1957, -1309, 925, -507, 847, -712, -2336, 64, 365, -665]
862f65L05j473L85K992j902j196P86j205K742J410l934N80K302j674K471j634
878B90m536M760M2k97K011n603L026M197m412K377k380l712Q885k725l601L983
894B305o203M900N664j0827M658l32l860J1950q129n106R176p171O401K681j5261
909i154J0049J604n751J1563j3154j032J4179j1592P239j215j5538J9859l064
922C993r845J3403j6084M070J7035j9691P446O85j3197K4491j0015j2397J7352
935G246j6265J1140J0912k7677J4978K145j2277K5010j8588j0318K4723j6707
947e678J0010M205k7281K5006o35j3246K2103k6202K231K7174k5816J1326J115
960D312k4004L4872q148j8482K3114k3727J0771K2106l4747J5927K10j6757L6703
$$ y = [-665, -360, -1833, -1448, 1544, -358, -1554, -768, -1973, 769, 2179, -1755, -1175, 1127, -547, 1924, 290, -4246, 514, 556, 259, 2270, -3333, -307, 3890, -522, 1855, -525, -4237, 4648, 1923, -1678, 2305, -3898, 1002, 6666, -4161, 497, 165, -3695, 8255, 126, -4980, 4196, -2975, 3426, 6107, -9154, 895, 2499, -3252, 8311, -4843, -5875, 8304, -3288, 3951, 2736, -12802, 7057, 3993, -5852, 7551, -8533, -4463, 12572, -7119, 327, 1012, -12185, 12306, 2291, -10106, 7246, -9019, 2121, 13033, -14644, 334, 2479, -9798, 15212, -3376, -13694, 11029, -5678, 4332, 8537, -18744, 6262, 5627, -7619, 14484, -11718, -9487, 17687, -8129, 3197, 4312, -19692, 15180, 7032, -11450, 11664, -12063, -1292, 20814, -13933, 1994, 2204, -14553, 22150]
973B2150k2817j5607L0425k4269J4338J4057m0018K4745M365j7085K9368k8781
985i129n472L2384k6011J4398J086l1847L7703n434j8623K6998l2231Q629L1784
998B4235l7014J3939K440k5156M1444j5577k0575K8442k6448J6180J9418m1794
1010b0466K1334L418j7533L5031k6612j2877L2065k4617J6461O002l7674L3090
1022G622m37j6812K7802l2623L531L1814l1447J5556j21k8810M0604q829k0831
1035a2981K4999k6313J2528K3744l6067J6032M07j6514L5712k1571j4383K5094
1047A0687k1092J6670Q802l5316K4757K77j3346K7729k7710m374K8482k2217J2980
1060F329k38k6558L0748m051j3906J9064k3527P078K1731k4915J1416l012j4818
$$ y = [22150, -667, -16274, 14151, -10118, 4220, 18277, -21741, 3004, 7369, -9716, 19652, -9129, -14601, 17783, -8228, 6170, 7256, -24591, 13112, 7678, -10945, 16053, -16178, -7549, 24235, -12779, 1160, 3600, -21556, 19888, 4311, -16264, 12178, -14270, 1910, 21328, -20466, 868, 4286, -13247, 21784, -4828, -17705, 14360, -10257, 6204, 12206, -25468, 7622, 7185, -9627, 18175, -14448, -10917, 20897, -10550, 5006, 4885, -23925, 16679, 7850, -12981, 12018, -14295, -1767, 21977, -14090, 1942, 2349, -14165, 21547, -24, -14407, 10687, -10405, 6265, 15067, -20249, 4508, 4785, -8561, 19168, -8542, -12916, 15566, -6651, 6329, 6091, -20467, 10281, 6230, -7676, 11388, -12139, -5061, 16670, -8245, 3171, 159, -14659]
1073a4659L0853j4623j2168J8382j8998J3551J1343k7169J4399j62q565K3164
1085A5348j9594p003J9525j4068J0530J432k0686J8596j635n832J2990j9349L999
1098e747J5700j4367Q437l959j1678K1091p222o975J0679j4974R206J0385j7195
1111f619P434j201n138J5890j0304n523R280p880Q109J614j2968Q687r23j349
1125h91Q392j2446J627Q218o982O537l452p439J0521k688k070M296q606M625N275
1140D917o875L445k368k484Q245m777j507K104m298N441Q71n742L300j154l3M364
1156C449n039n60K842j690K780j550l037K668J01M28j10k387J774M21%R71l232
1173b171J309K291k245J323m56k620L601l49j648J624j495J11K066j029j036Q34
$$ y = [-14659, 16194, 1571, -10597, 7785, -11213, 2338, 13681, -13488, 911, 749, -7816, 15348, -4246, -11249, 8276, -5792, 4738, 6170, -14516, 4080, 2445, -3387, 9603, -9746, -5747, 9953, -4414, 4023, 64, -11614, 9477, 2255, -4720, 5959, -9015, 191, 10576, -6619, 815, -386, -5524, 10366, 62, -5461, 3819, -4061, 4048, 5662, -7306, 1381, 458, -891, 7501, -4945, -3318, 4900, -2082, 4455, 1003, -6436, 4085, 1397, -673, 3623, -4983, -358, 4917, -1958, 1487, -881, -3365, 4880, 103, -1404, 700, -3598, 1843, 2714, -3028, 272, -882, -915, 3449, -1590, -2150, 692, -998, 1782, 232, -2805, -137, -36, 392, 282, -2105, -331, 90, 90, 1061, -2171, -862, 1429, -816, 507, 51, -2569, 1032, 683, -965, 659, -836, -725, 1341, 312, -724, 110]
1189A10N64m88K65M34j797P72J933k265O71Q56k467K470P62l142K338K6k066K571
1207A547j282j402K292q76m20N47m49m15Q98J28o43M3R68j384Q5J221k225R33
1225d34J568k633J445J108k605J879N57k387J814m5j813J924j16j587J378q5m77
1242e09K41n8l69M66N0k27K15L6J03n09Q16p57J9O95n92L61M96o65J83O36q68
1263b37L28O14q82M68N18j249P51K82q79O80j0m16O32l44J28K74n62O41o92l34
1283b89R22o45K6Q17j314Q67L73j307J119m48p03J217o48l52O77o24O37k43n61
1302d79O67o82L04O21j259P31K67r06J420j177l54R20p23M16L50j390J159M22
1320C07m18O83j670M33J306j183N73l81p40J940o28m57K24j100J633J64j177J248
$$ y = [110, 674, 186, 451, 885, -912, -140, 1793, -472, 199, 1055, -1412, 1058, 1820, -1322, 1016, 1042, -1024, 1547, 265, -1137, 1155, 279, -141, 406, -43, -458, 440, 568, -75, -32, 936, -448, -363, 858, -1367, -434, 1134, -1499, -54, 1054, -1551, 328, 885, -1502, 312, 267, -1546, 378, 262, -1325, 53, -32, -509, -268, -326, -695, -229, -179, -406, -191, -155, -52, -561, 255, -502, -483, 212, -380, -19, 477, -188, -5, 631, -237, 91, 705, -177, 291, 809, -440, 311, 593, -286, 394, 384, -32, 600, 256, 384, 658, 96, 737, 45, -289, 633, -12, 14, 831, -483, 384, 757, -550, 569, 121, -582, 635, -13, -365, 312, -312, 325, 82, -479, 188, -494, -190, 431, -828, -97, 170, -736, 684, -493, -847, 73, -650, -234, 116, -1274, -115, 307, -111, 572, -1098, -665, 641, -542, 31, -350, -1090, 850, 222, -235, -11, -1111, 522, 686, -491, 757]
1338G57j427R53J786k690O07r6o03K567j909j057K016j612K314Q1l449K206J49
1355E93o29K519l951K23L326k778K403j412l463M852r50o15J420m527L695K116
1371B822l941K300k901j083O754m545p17K116m471O289J85o591M740k376L78O137
1387E096q168Q51L594l801O234l624o179Q030k624R71L312r983O189L714n858
1402b246O184o748k862J1255n961l3J899q325J0120J413q313N969o159K062J0305
1417H560j1583J970K464o539J2203m840r001R759n404L663O331j4188N677M608
1431C680n922R420r526n105J3272o811L088J530j3628J2981K553q671P643j0332
1445e828J722J3756j2107K224P96q779J6092m393j0346R714q785O597R345j7537
$$ y = [757, -670, 283, 2069, -621, -14, -110, -713, 1854, -55, -1112, 904, -708, 1606, 1687, -1762, 444, 593, -36, 2483, -1468, -1245, 2081, -697, 1706, 294, -3169, 1683, 733, 118, 1538, -2989, 706, 2822, -1119, 1181, -1720, -2803, 3951, -594, -1311, 805, -3666, 2623, 2808, -3783, 957, -1419, -1041, 5096, -3072, -2221, 1373, -2428, 3806, 182, -5997, 2033, -591, 380, 3692, -6291, -102, 3612, -2246, 3938, -2810, -5672, 5583, -378, -411, 1488, -6837, 3283, 4696, -3617, 2352, -3807, -1745, 8560, -3023, -1053, 1411, -5128, 7075, 2235, -6766, 2993, -2411, 1252, 7583, -6605, -928, 3680, -2242, 7178, -2348, -7453, 5819, -992, 2096, 3626, -10002, 2979, 5532, -3139, 4504, -5828, -4106, 9650, -2457, -233, 563, -8216, 7876, 3483, -6863, 2851, -5934, 663, 10008, -7529]
1459g529N841L349o385J4122j0836p626J3398p383O287K045j6649J2683K186o352
1473b849J0396j4383O91J5225j1645N048j539j1895J7723k183r590Q557j1453
1486g897P116J1685j6090N327k98n854J7040j0750p789J1224q716R238L591j7771
1500i944J0672J161m441J2374j4989j594J3904r365P281k706j3346J6145j766
1513C386n865P848j3750O309J1641j2883N329k853p173J7226p572o596P786r745
1527f912J0060M688j5218P643j353k174J2965j3196k277R573p425Q715j530j3337
1541i778J2120j001k871P397j3240L915R546q586O045m455o981J4379m909l580
1555a999M546r811Q608N308j0494N032l632r77J1424r623j441N177o533R370j193
$$ y = [-7529, -1688, 1661, -4724, 9398, -1438, -9064, 4334, -3049, 3238, 5283, -11366, 1317, 3503, -2849, 7547, -6836, -6145, 9080, -2565, 2483, 944, -10951, 6772, 4589, -5001, 3556, -7897, -781, 10904, -5186, 141, -157, -6011, 11029, 279, -7510, 3714, -5002, 4236, 7827, -9944, 728, 1889, -2552, 9822, -5167, -6761, 7143, -2222, 5059, 2353, -10993, 5152, 3386, -2479, 5369, -8381, -2072, 9569, -3314, 2015, -838, -8011, 9215, 1643, -4953, 2833, -6912, 3148, 7836, -7382, 261, -1092, -3266, 9699, -3497, -5774, 3799, -3626, 5089, 3559, -9778, 2342, 1341, -1530, 5867, -7373, -3458, 6088, -2498, 3547, -908, -7889, 6490, 1581, -1999, 2547, -7264, 1344, 6652, -3842, 1190, -2442, -3419, 8005, -1618, -3059, 2118, -4415, 4955, 3762]
1570C762j0164Q434k518r9P041j1191K075O304n256N858m076n927R670k844m90
1585E79J931p812N718L451n338L635m748k97Q018o383O80J429n153P916p11o819
1601c904N540l655R47N733p555J026L270l340M901k754l717M507j506R68J006
1616A467n201L927P68j671K779m321J64M376l268J678nm444N982n35l213K936
1632A419l006Q51L276l838P49J170j927L194j028k273K183j137J282K02k561J935
1648D91j14n62J889k907M17J767j746J881m53k276L046q84o82J986k806K78K047
1665A372k006P99k32m80J565r84m21N56n49O96K5j045J017q67K68J250j809K59
1683e86J041j442R95nq36J030k75k21N65r41M74K19n67N86m63o4Q34k67m84O98
$$ y = [3762, -6402, 2032, -486, -585, 6456, -4735, -2660, 3644, -1612, 4246, 170, -5757, 3913, 1069, 579, 2510, -5302, 416, 3867, -1471, 2164, -2584, -2881, 5137, -1246, -566, 863, -4290, 3626, 2915, -3904, 1636, -2019, -1072, 4661, -2894, -1868, 1402, -1938, 2963, 209, -3508, 999, -507, 461, 1467, -3734, 193, 961, -710, 2069, -2252, -2088, 2288, -980, 698, 693, -3751, 2231, 1696, -1517, 1419, -1587, -736, 2540, -1298, -549, 621, -1306, 1888, 860, -1413, 770, -367, 915, 1117, -1444, 491, 377, -185, 1704, -1203, -786, 981, -765, 1116, 663, -1613, 1433, 549, -133, 1853, -953, -675, 1372, -634, 165, -67, -547, 1018, 34, -387, 169, -380, 316, 341, -704, 313, -554, -286, 964, -845, -586, 455, -987, 8, 3, -833, 197, -78, -299, 266, -675, -201, 18, -549, 37, -426, -490, 344, 77, -407, 291]
1703B91q38N71R2m61M58r1k5K13k31n9O7l62L85K60k49N04k16j22K70o87L71J87
1725C28n83M66K74m46J23J20M7j85k2k0OJ2M05n98P7L01o70M55K40m56oK28j93
1748i7P6K26k09L31m28l9j71l30P48m00J5N98o01L0N40o45J29K75k20L6Q9j35
1770a82J92o38Q81k90q01J094r36k5J605j302j82J144j077L78O47q19N99m27J94
1789E5O04j124P99r4r85J835j032r87J967r59j02R98j748P72Q14j028J091j176
1807c00l31J744j592J040K04k396K669l7j830J921j939M00J974k124Q11j38j338
1824a262L213k003j226K252k390J869J342l862K255Q2j483L408l207n24L033k394
1840h97J778k28l570L849m92j414K720l955J122L351l462J629q85k172M964k144
$$ y = [291, -547, 24, 116, -345, 113, 22, -3, 210, -21, -80, -13, -375, 10, 270, 21, 525, 309, 187, 457, -230, 141, 328, -255, 211, 485, 39, 162, 282, 329, 144, 122, 102, 108, 120, 525, -73, 4, 305, -365, 90, 330, -126, -132, 96, -97, -21, 205, -4, 327, -101, -140, -311, -641, 107, -293, -278, 320, -281, -251, 289, -356, -227, 48, -172, -136, -47, -182, 10, -628, 253, -37, -838, 256, -680, -705, 900, -402, -584, 560, -517, -139, 508, -311, 288, -139, 55, 659, -465, 334, 240, -745, 1090, 58, -929, 1038, 79, -23, 975, -773, -1, 813, -215, 876, -300, -631, 1113, -479, 561, 765, -1631, 1038, 1001, -829, 1092, -847, -447, 1527, -597, 214, 76, -1262, 1951, -52, -1278, 974, -1416, 453, 1795, -2067, 188, 270, -1213, 2195, -1012, -1536, 1497, -897, 881, 653, -2917, 932, 440, -974, 1746, -2209, -1087, 2264, -1198, 431, -454, -2626, 2338, 194]
1856A94j671K582l726L081K503n410K805q68j049N014m423q14L066l060M128p48
1872A604n260M987j040n31L440n908J096M324m011L448k102l889O779k334p39
1887a36J828n816N357K225n297L187k703q52O670n086j007K697m269O044j51o340
1903c649M391j988J434M416p667J174L465l353N501l737n054P190k102M62J673
1918B156p399N100L055m487L838n106q04Q222m771k10N76n312Q288l72n536L416
1934F54l581K637N685p915J306J313k346P400m564m566N598k734K948J941q709
1949d933M580J761k226N252o952q76P394m111J886j146o174Q321j57l526K563
1964A656n609K944O282o557J579j214k354Q539m302l754L798m036N287J723p867
$$ y = [194, -1477, 1105, -2621, 460, 2963, -2447, 358, -510, -1559, 3455, -968, -1782, 1284, -1776, 2352, 1604, -3656, 1331, 291, -240, 3200, -2708, -1612, 2712, -1299, 2149, 47, -3842, 2937, 603, -136, 1692, -4124, 1233, 3458, -1839, 1348, -1355, -2207, 4463, -623, -1630, 1067, -3202, 2842, 2691, -3649, 742, -1246, 188, 4604, -3063, -1889, 1576, -1777, 3724, -13, -5067, 2123, 21, 483, 2156, -5243, -143, 2912, -1575, 2263, -2843, -3647, 4575, -196, -406, 170, -5142, 3146, 2774, -2762, 654, -2927, -290, 5395, -2520, -1214, 99, -2247, 5153, 589, -3977, 1621, -1113, 1835, 3776, -4933, -353, 1408, -818, 4434, -2518, -3394, 4000, -111, 1775, 629, -5545, 2776, 2619, -907, 1656, -3953, -1009, 5273, -1284, 295, -919, -3273, 5266, 964, -2790, 1008, -3028, 2259, 3982, -3885]
1979c885L506j24j28N787p512o68N079l388M437k341o395P167j168m18K915p439
1995d575L259N074n001K795l188k428Q471l868j503J955n398O241J802o602L436
2010D70k256L68O697o859n04L096l129N647j713n918N321j594R66L204p517K884
2026h37K873l011M181m399k355O563l042P83R92o022N787J382m739L518m092Q52
2042a566N781n103M70Q32l315O047j790l883L448k785K192K931o019K504Q11k197
2058a642M904m182k018M908l212K286O88n727M823L80k564L440m547N80M490l803
2074a196J229L34l407N018j170k321K640l081J978K699m411J950k37j859M406
2089B572k838j654L148k311K047R29m433L420m61j129K901l529M26K674k640J853
$$ y = [-3885, -379, -503, -631, 5156, -2356, -3024, 2055, -1333, 3104, 763, -5632, 1535, 367, -51, 2864, -4575, -1316, 3758, -1243, 1552, -1636, -4064, 4407, 539, -964, 991, -4407, 1834, 3636, -2966, 470, -1786, -1418, 5279, -1580, -2084, 1012, -2117, 3530, 1817, -4101, 1220, -374, 592, 3796, -3721, -837, 2036, -975, 3206, -1193, -3548, 3015, -27, 756, 1748, -4274, 1513, 2895, -1844, 1674, -2418, -1566, 4215, -888, -418, 414, -2901, 3146, 1356, -2527, 921, -1864, 328, 3259, -2760, -256, 555, -1642, 3262, -920, -2938, 1970, -1242, 1044, 1732, -3995, 828, 1208, -1356, 2084, -2463, -1883, 2607, -1196, 33, 367, -3040, 1978, 808, -1513, 1127, -1954, 24, 2723, -1688, 262, 25, -1834, 2572, -266, -1920, 1228, -1083, 964, 1893, -2540, 880, 419, -710, 2191, -1338, -912, 1762, -878, 975]
2105I75j48k491L053p74j225J983k706J519J797l226J892n50j199K673j627p06
2121g60J831k157J736L39k160J619o69m68K006k212L67J095j343J330k18j700
2137a364J895o00o73J331j301N31Q22j040P49n58q94J587p33l02Q88j069J152
2154D21K96j163R24l98o63J012r19J9O25o69P72k0p90J022k28m19P58p55L25K22
2174C72o64O53l21l25P66o40j03M43k75L60k0r1J83o2m2Oo67K97L23j30n1J88
2196B00j81K34p2j43K41j43l7j68L13M4l69J25k32k37M48J19p18N65K47q31O75
2217H0K6m57N19j15m12L30K40k49k12Q8L19m02L14k9k56N63l18j1K40n01kN91
2239C46q65O58l85o5P89l51k39O92q31J3R57j096M88K63n58O84m72j39K71j27
$$ y = [975, 827, -1664, 1389, 615, -610, 1373, -1333, 186, 1983, -1243, 649, 99, -1100, 1573, -54, -760, 1071, -1086, 650, 989, -1171, 448, -221, -689, 1317, -895, -528, 567, -776, 554, 336, -1364, 531, -69, -742, 589, -712, -181, 641, -399, 350, -208, -1102, 485, -248, -550, 338, -731, 421, 717, -446, 478, 80, -583, 429, -490, -471, 154, -515, 257, 237, -553, 469, 241, -178, 580, -175, 150, 372, -292, 361, 40, -285, 481, -159, -262, 181, -94, 266, 246, 155, 338, 276, 234, 240, -427, -130, 193, 63, 12, 200, 19, 253, 181, 38, 279, 136, 99, -69, 244, 288, -81, 44, -188, -425, 23, 142, -576, -11, 236, -595, 80, 106, -351, 168, 53, -359, -29, 211, -38, -250, -162, 157, -245, 69, 40, -216, 347, 29, 18, 258, -243, -245, 346, -519, 139, -246, -311, 478, 127, -112, 580, -251, -238, 719, -377, 111, 374, -184, 500, 28, -111, 160, 33]
2259C3J75o4m91J249r84q4J118j385L54J268j917P53M23j146J718p91o65Q97j003
2278e42P10K01j376J256R9o59J423j534l68J792j789P67M25j670J945o89p32J789
2296A048k114N34J664k487J712l56j462K801j471n55J943k230J190J199k849J885
2312D52l11j264L080k663m31K184k153J713M22k877K644k88q50K188k952N51K044
2329A489k456J663l15k386L889j406j221K201l269J911K072l472J919p67j233
2344a381L977k830r94K300k758K757M04l879L191r06k11K880l875J25K463k552
2360a289K474o50l272M045j435o8J886m268K380K065l199K387j896j408M770k640
2376a18o58J580l467L677P15l537K545j853N24L710m528J42K046k542M029j760
$$ y = [33, 208, 144, -347, 902, -82, -166, 952, -433, -79, 1189, -728, 25, 448, -698, 1020, 229, -436, 461, -542, 168, 369, -1007, 249, 348, -311, 1112, -422, -790, 1002, -787, -20, 405, -1265, 680, -9, -741, 1048, -1066, -532, 1132, -1355, 357, 1, -1461, 1340, -131, -686, 1257, -973, 217, 1416, -1433, 452, 141, -1123, 1957, -706, -1137, 1047, -1106, 607, 1029, -1848, 796, 508, -342, 1846, -1106, -555, 1489, -967, 696, 381, -2005, 1884, 478, -743, 1458, -1811, 100, 2172, -1300, 619, -148, -1381, 2596, -234, -1228, 1072, -1686, 1071, 1475, -2404, 787, -119, -330, 2550, -1325, -1200, 1263, -1289, 1185, 535, -2737, 1308, -127, -195, 1691, -2577, -197, 1868, -1331, 1056, -840, -2248, 2522, -118, -776, 804, -2663, 1014, 1729, -1808, 737, -1116, -592, 3118, -1410, -1268, 778, -1764, 2265, 505]
2392E05l263L748j382P81J781m620J904J987k005K689l216j084M559k618O14K96
2408F76l680M042Q45k777K231k860R62L743l922P97j72j983M654j897k659K654
2424F54j948K402J439m932K065O51q12L040l786r77L428j489J732r32m041M002
2440D96K48r67J840m056J710L056k831J527j984j619M971j808j329J129k868L591
2456A106J342m120J555j089M35L716l988k43J721j495L340j578l347L242r44R38
2472E91J712m614J919K105k226K499k762j675M213j593M01L15l611L662P52k469
2488g81K176l024N38M203l776N68K01k203M310j305k721K319j993K159J632m514
2504b211J917N17j099L390l087j813L777k160J740R7l954L406Q7j381K288l569
$$ y = [505, -2758, 990, -392, 389, 2170, -2450, -546, 1441, -564, 2125, -1091, -2175, 2384, -234, 380, 676, -3004, 1038, 1883, -894, 1337, -1523, -561, 3182, -740, 57, -115, -2098, 2556, 659, -2000, 654, -1294, 1108, 2547, -2385, -320, 331, -481, 2559, -1227, -2204, 1224, -265, 1467, 535, -3506, 496, 744, -223, 1617, -2439, -729, 2327, -504, 1023, -961, -2580, 2391, 583, -746, 383, -2485, 1106, 2448, -1672, -117, -1206, -771, 2945, -1043, -1286, 435, -1060, 2280, 702, -2645, 597, -347, 591, 2303, -2311, -392, 1713, -513, 1986, -776, -2451, 1762, 169, 570, 885, -2726, 936, 1688, -781, 1395, -1629, -1091, 3112, -664, -96, 105, -2098, 2212, 907, -1814, 505, -1488, 671, 2303, -2211, -294, 223, -876, 2514, -573, -2386, 1391, -769, 971, 1068, -2886, 520, 607, -774, 1514, -2055]
2520b055P59L285k879J513o79k542M500j766j447K273k901J826K057l577K130
2535D97n12j373L971k936o29J949k288K377K92l473K578j24r58K798l406J69K572
2552A504k232J863n54k487L433j331p10J724k655J695J382k515J491o64j204K981
2568A721k095l63J737k313K074M18k859K468q43q81K491k669P00J283j974K222
2584A117o18j893K457j253l84J575k331J068J161j776J273n66q32K058j664n4
2600f62J188j577J351K86j329J155o76o15J692j228p8Q62j282J483j10j469J551
2617E42n63l64P67j166M14O29p89J105n35n87J395j092K00Q42j129O50K72j301
2635g10R93q4n71Q91p63P5M76l06M81j68o13N35k72p1O85q11k2L32q7j90K29k97
$$ y = [-2055, -1296, 1989, -890, 623, -56, -2598, 1902, 136, -1311, 962, -1939, -113, 1944, -1633, 497, -15, -1388, 2583, -353, -982, 967, -1321, 1056, 1348, -2125, 453, 329, -629, 2169, -1237, -1068, 1504, -728, 1135, 581, -1906, 1527, 196, -514, 1210, -1445, 250, 1632, -883, 608, -56, -1260, 1721, -374, -737, 1000, -1313, 761, 1179, -1680, 788, -55, -936, 1555, -1114, -414, 869, -1105, 1117, 499, -1394, 1063, -190, -574, 1001, -1330, -262, 899, -877, 396, -170, -1002, 1056, -608, -662, 526, -1051, 300, 586, -743, 412, -264, -879, 813, -415, -493, 369, -913, 570, 460, -1009, 542, -21, -385, 382, -784, -370, 259, -530, 575, 40, -547, 848, -244, -44, 798, -331, 319, 591, -710, 283, 199, -372, 519, -244, -169, 307, 1, 482, 314, -299, 236, -36, -107, 578, -233, -255, 77, -10, -200, 29, -268]
2657b68N87m50n7J93n29N90k13k06L82j85l07N48m39L10J60k52K07k11r3K89o1
2678ej34n4R1Rj97K27L88m00j97M93l34m1K32l25K38J32J01j93j11M35m14j19
2700a78M11j22k48N75l97k20M71l22O0J46n05N16M4k45M24n16J06L39o28M72%
2721A83n50P19l84j88N93q70N27K50o48P69k93n06J059q95J94M43q03M27L18r75
2741f30R48j26p20J122j127K33P16r41N72m6n12J085p03j61O24j038Q22K91j333
2760i24J315m63n43J597j429o5J479j834J441oj838J557l08m81J653j789J51J488
2778A001j584J187n7j629K166r94m91J336j712J024R00j919J466n47j071K573
2794A649j675m82J594k117J570Q61k746J800l74q91K348k392L23J657k051J646
$$ y = [-268, 319, -131, -188, 5, -524, 66, -147, -353, 29, -156, -463, 85, -354, -44, 116, -136, 71, -140, -233, 56, -5, -139, -193, -102, -93, -290, -63, 325, -75, -272, 221, -113, -154, 78, -247, -9, 123, 224, 31, -80, 355, -59, -178, 233, 111, -137, 438, 41, -179, 292, -30, 30, 176, -329, 187, 231, -14, 410, -106, 0, 339, -289, 183, 183, -367, 352, -32, -220, 373, -497, 30, 280, -368, 401, 108, -398, 661, -234, -40, 403, -400, 27, 345, -630, 318, 192, -528, 594, -533, -300, 416, -525, 47, 1, -511, 574, -129, -290, 334, -704, 118, 409, -924, 391, -72, -615, 982, -447, -512, 967, -867, 574, 568, -1270, 287, -21, -502, 1151, -638, -487, 1001, -583, 604, 547, -1082, 1084, 90, -401, 935, -777, 247, 1147, -772, 694, 147, -924, 1649, -26, -508, 1086, -1031, 539, 1400, -1346, 454, 80, -811, 1537, -855, -532, 1125, -926, 720]
2810G20l15k085K622p82m91J886l087J177J804k477J532n89j793L565j981m18
2826g12J422k198J767R12k617J813p59m89K714k721P7J651k107K439n68k547L002
2843A079j187J41J822l406J108J799j956J641j564j211L179j435K40L59k623K624
2859F10P73k284K132j767n45L411k615j71Q67k162L286o60k667K361j203Q87J827
2876B080l712R70J043r34K312k233j390K849j421J129J70l318K590R80j336J119
2892H98k584O79K755j890L77n25j591L179q13j154P36j636J836J501l025J035
2908b22m96n4K833k398j073J687j100K130m26k756K175k19l7J672l261Q23J812
2925A090j441J650j707j556L151o43m15M87k673K594J066k230J028j509N28K648
$$ y = [720, 405, -1680, 942, 160, -331, 1555, -1532, -355, 1449, -1028, 504, -85, -1878, 1687, -294, -712, 710, -1488, 279, 1191, -1426, 387, -372, -861, 1853, -868, -791, 860, -1247, 1192, 624, -1923, 1079, -108, 33, 1855, -1551, -443, 1356, -600, 1041, -523, -1734, 1445, 10, 250, 609, -2014, 610, 1383, -901, 1231, -536, -1081, 2330, -285, -456, 411, -1751, 1535, 875, -1792, 569, -634, 253, 2080, -1632, -662, 381, -553, 1759, -474, -1864, 985, -436, 693, 863, -2455, 135, 1115, -221, 898, -1686, -1007, 1748, -142, 235, -290, -1881, 1298, 485, -669, 67, -1569, 267, 1768, -1257, -222, -718, -772, 2061, -337, -1410, 277, -823, 1307, 881, -1875, 300, 81, 44, 1716, -1545, -722, 1090, -351, 1299, -408, -1964, 1187, 544, 129, 616, -2057, 537, 1603, -627, 401, -1108, -580, 2068]
2941B068k532R3N08j555K926n46k213J637j236J187J684l435J144L24m98K233
2957A789k097j472K706j444J158J43k730K222L70r41J686k688J38K582j730P10
2973D02o52j695L688j365j276J596k187J604J535k843R50j68p28L116k331p76
2989a130J783j745J917K17k933K270p2n36J879k896M86K282k117J533p97j959
3005a818L331j165q05J612k692J804J391k485J692j141q79L160k457j85J396k104
3021a345J975M77k316J665p97q2K262k971N46J521j964K022n83k194K622p36m51
3038c49J395k309J239J005k054J650q90r92K354j211n5P94j709J499N79j993J608
3055E61r20k39J652j625J88P42j427J637j49j494J638q93O6J205j860R09O22j201
$$ y = [2068, -464, -371, 137, -1418, 1508, 962, -1251, 386, -850, 337, 2021, -1414, -270, 54, -444, 1789, -308, -1780, 926, -518, 640, 783, -1947, 275, 645, -296, 1390, -1298, -1160, 1422, -308, 402, -250, -1945, 1743, 378, -898, 698, -1489, 115, 1650, -1193, -243, -411, -1139, 1977, -354, -1130, 653, -1092, 825, 1042, -1891, 379, 307, -229, 1650, -1246, -760, 1522, -595, 938, 141, -1818, 1513, 348, -457, 1155, -1537, 267, 1658, -827, 865, -276, -1155, 2005, -452, -637, 759, -1345, 630, 1107, -1209, 456, -341, -423, 1839, -1132, -586, 935, -1029, 993, 410, -1784, 838, 102, -349, 1046, -1263, -24, 981, -1073, 577, -313, -1305, 1049, -162, -217, 577, -1132, 367, 946, -1047, 561, -359, -598, 1054, -571, -383, 359, -1068, 569, 420, -1074, 564, -329, -263, 942, -918, -9, 613, -588]
3073e88J211n38p62J641j014j47O80j244J133K61j175J090o28l14J142j154N75
3090A69K96q40P88j99o21R08n16kP10j030M48M90r40O78k71o50J056n52k13N61
3110B70n63K41N44p12M26l97k4M65l61J9K07n32L34J21l01M23n10K4N86o46R9
3131b87M78m82L37l3l37N37l45Q0L12l16J2L7m4L55n22J97L43k62M01m29qrK34
3154B49k75L92n06J75L73m93J83J45l77J53J27j11L30l68k3J8r9K97j95Q6K0J00
3176B01j06N6k54N1O0j9N4K7m63L19o3J6L74m43J98l7k83N24l33r2M86n54M78
3199A97k33o02O70k79q7M70n32L51q7n19P89k19m07Q77p34m9P41q33O05K96q15
3220d00O17k26N0O31j087M70M15q88P48M9r70J375r29P2N65q49N16L95j045P42
$$ y = [-588, 623, 85, -677, 964, -50, -197, 483, -761, 372, 633, -542, 548, -80, -394, 748, -406, 169, 465, -375, 413, 214, -407, 501, -15, -17, 693, -337, 111, 601, -339, 339, 68, -582, 474, -78, -291, 270, -293, -52, 492, -220, 206, -191, -215, 250, -111, -92, 115, -417, -83, 38, -263, 160, -350, -326, 260, -386, -287, 191, -291, 46, 13, -324, 213, -132, -52, 260, -56, -44, -7, -51, 304, -218, -21, 322, 60, 461, 32, 24, 15, 249, -26, 366, -140, 35, 408, -85, 98, 243, -134, 19, 146, 35, 365, -3, -26, -8, -107, 190, -5, 81, 101, 201, 95, 151, -103, -52, 8, -11, 43, 70, -393, -74, -137, -121, 253, -190, 8, -29, -312, 212, -121, -213, 273, -281, 197, -36, -638, 32, -247, -334, 136, -396, -45, -132, -651, 138, -81, -488, 389, -345, -394, 347, -486, 119, 415, -400, 217, -9, 41, 672, -415, 55, 470, -418, 330, 379, -591, 784, -145, -73, 492, -357, 159, 554, -491, 251]
3240B51l93l55J162r29q1Q34j218R90j9j292J276k49n52J747j732J91J316j715
3258g68J351l98j224J775p71k89J000j622Q80R87j833J225l62q29J733j110l50
3275f05J119j604J443L00j653J349n26k57J992k604O99J152j728J587l11j544
3291a191J724r39j7J396k135J184Q82j344J394r82j328K546j357K2J076k218J902
3308F15M76j991J832j194m40K470k144j1J136j883K375p75j632J963j247N11J505
3325A566k633R94P62j303J852j376j109K380j183K35K48k191K365J52j548J620
3341H31j870K11K418k128M57J29j862K855n45j610J717j659R59J626k461N18O06
3358A92j053K488j731j248J939j004J053L4k149J757k51o1J344k335PJ974j317
$$ y = [251, -142, -497, 665, -264, -345, 489, -729, 261, 242, -1050, 226, -23, -575, 1172, -560, -369, 947, -768, 583, 185, -1039, 736, -35, -324, 676, -946, -66, 921, -912, 313, -49, -878, 855, -255, -605, 514, -1090, 353, 653, -1000, 349, -177, -434, 1558, -1046, -347, 805, -923, 664, 353, -1191, 533, -406, -423, 973, -1162, 22, 904, -440, 954, -28, -1356, 1190, -167, -145, 931, -1287, 615, 1091, -900, 932, -262, -702, 1768, -376, -387, 749, -1134, 1241, 466, -1166, 797, -450, 61, 1566, -1067, -73, 689, -614, 1238, -138, -1247, 1133, -50, 185, 433, -1758, 607, 759, -789, 831, -1039, -828, 1590, -538, -81, 48, -1814, 1041, 496, -1114, 603, -1056, -97, 1529, -932, -414, 192, -861, 1627, -104, -1352, 587, -417, 636, 670, -1479, 278, 27, -34, 1310, -1025, -1018, 956, -361]
3375c61R48m48j590K707n39j066J121k022J521J312k115P31p33q3K461j844p28
3392g28J056j239J854J41k303J412n62N57J388l044P79J453j169J760j719j096
3408a460K334r06M05L38k646J888J012j386J216j622l24K637j445j36N6j384K723
3425A300p16j600J247j218J248J392k734N93O69j241K571j571j357J814j189J437
3441F45Q3k306J529M48n43J502k450L71K056j804R63n00j663K629m67p86J027
3458G34j802J265J249k092J158o23n81K325j696m34J057j555J829L55k408J468
3474B49j63j53J782k242n8J368j403J320l27j819K376p27k47Q54j993J137Q37
3491G91j381J033o15n74J790j472N6Q54j732J490N55j935J453p85J90J423j994
$$ y = [-361, 587, 139, -1451, 1256, 717, -349, 772, -1250, 271, 1583, -532, 199, -534, -617, 1844, 0, -728, 328, -911, 943, 1084, -1219, 193, -369, 188, 1576, -1468, -689, 764, -405, 1355, -364, -1460, 874, -32, 373, 711, -1935, -47, 965, -421, 795, -827, -1151, 1486, 41, -95, -39, -1423, 1300, 584, -1016, 231, -987, 261, 1653, -1081, -488, 181, -1060, 1511, -60, -1417, 397, -792, 645, 728, -1578, -49, 399, -144, 1358, -1092, -721, 1335, -469, 494, -6, -1669, 960, 493, -293, 734, -1068, 197, 1446, -646, 512, -111, -692, 1633, -63, -497, 560, -995, 834, 1189, -1219, 249, 86, -67, 1715, -527, -585, 783, -620, 700, 373, -1446, 930, 203, -44, 810, -1183, -46, 791, -590, 443, -172, -746, 1044, -428, -372, 482, -1250, 240, 795, -1140, 313, -472, -282, 1141, -853]
3508h53M50Q08j458J580k06j477J694p12jJ078j831Q46P33j309J321r76m00J579
3526H66q33k79Q34j179P67O78j742J282m48l69J466j389J81O97j196J394l59q34
3544d63J009p68L6R60j295N55N15j028J153o57r01J502o46j58O42j328J011K15
3562C54r05J056p69q9P86p98N5N38p04Q05k24m69O83n02M2M70n10L39J19p48N74
3583A03j07l70N83m26Q4M39p06M14o4k3L68j81k98O91p59L73rm07M70n9l53M90
3605B53j46l00N15l41J93m8k66K15J02l44N1J46J17k38k38P54l58O7j05J09j89
3626e1R5m4N2K40o43L88m5l2J86J1k75L10k57P9L2j17j32J22R2P4n29J00P04o00
3650b40L9J14j19M42l61p0K36k16O3Q5k26N05m45j21N36m48L66j71j85K30J30
$$ y = [-853, -403, 405, -1053, 527, 321, -1156, 538, -174, -175, 903, -928, -82, 651, -658, 663, -313, -713, 866, 33, -246, 588, -591, 176, 854, -888, 394, -54, -423, 1043, -346, -165, 532, -664, 730, 371, -463, 546, -222, -186, 774, -521, 34, 549, -479, 674, 17, -884, 618, -28, -186, 456, -872, 139, 354, -551, 505, -264, -353, 433, -365, -310, 228, -476, 329, 105, -364, 319, -183, -141, 329, -181, 158, 277, -471, 103, -4, -374, 209, -217, -133, 306, -400, 14, -50, -73, 295, 114, -184, 507, -252, 121, 112, -295, 175, 116, -237, 253, 107, -193, 322, -19, 174, 126, -140, 75, 177, -167, -116, 30, 147, -91, -329, 425, 67, 134, 29, 138, -51, 44, 0, 52, 292, -351, 37, -8, -40, 146, 157, -118, 192, -65, 14, 46, -71, -203, -81, 11, 85, -444, -344, 360, -240, -201, -87, -206, 236, -125, -195, 41, -175, -112, -27, -253, 252, -193, -314, 222, -226, 140, -31, -216, 14, 144]
3671A44j38J74j38O0J21m74N19j57k82M19k36L2N3k64L60J53m24K09Q4k29N52
3692E38n84k36Q40p91M75J0o21P88m69k87P75p77K55O68o95N13m07l13N86l06
3712c8k27Q37j124O34M90j097R20m32m88J224r07jN36r87Q74k4p58J020n58l26
3732d32J113j242L73M44r15Q95k4r05J143o84J28R52j766R91K87j223J354o74
3750a85o46J604r04L51M80j511J329p9j084J384q45k74J386j567Q21L15j260J578
3768H93o24j009J512j114M45J109k353J324M90j527J803j083p40J717j211N19
3784A51O07j944J639J21j274J545j319J00J645j654L79L40j412K132o70j305J365
3801D46j229Q57J234k288Q91K80r51J996j716n45J884j371Q48L40k103J525K11
$$ y = [144, 6, 180, 42, 102, 223, -251, 268, 111, -171, 248, 12, 44, 97, -167, 193, 346, -78, 131, 215, -14, 538, -46, -282, 558, -233, 242, 252, -369, 419, -50, -337, 438, -339, -84, 584, -111, 402, -5, -318, 268, -38, -265, 572, -552, 82, 572, -525, 395, -37, -525, 699, -208, -209, 327, -660, 214, 190, -568, 452, -106, -432, 681, -561, -188, 256, -659, 236, 212, -693, 450, -234, -106, 846, -920, 71, 358, -865, 489, -185, -831, 773, -131, 220, 700, -811, 518, 439, -645, 739, -106, -380, 1006, -561, 260, 575, -685, 893, 269, -740, 772, -342, 103, 1212, -1141, 183, 673, -854, 949, -134, -874, 843, -368, 151, 758, -1186, 453, 574, -700, 845, -474, -374, 1271, -383, -4, 336, -1076, 1056, 386, -919, 446, -783, 74, 1308, -980, -89, 191, -760, 1236, -480, -1025, 859, -512, 336, 676, -1427, 98, 309]
3818C09o91J411j761K30J196j031J006m06j326J938k14j239J115j603J286J040
3834A260k008J196m69o44K005j307o88J233j222J275O9j811J419m29L9J384k171
3851h69K82J124r85J389p61j499J948p74M9Q33k075J197J043j375J071j176n36
3868a114K389j358m52P09j702K400k07j603J363j055K49J659k303O85P61j309
3884h88K028j178j082J573r30P14N28j882J311K10p88J464j526n00J967j106M26
3901C41j32j665K379j03j377J302j368L80J361j623N98N6q24J967j283o24J269
3918F54j358J247O32j921R14k69k94J638j681k33J390j055Q51l00j642K094n56
3935A11l81J285k138R10J134j681J282p48o41J786r77k77R26j717J306N30j760
$$ y = [309, -382, 1029, -732, -502, 694, -337, 669, 263, -1063, 875, 661, -578, 537, -1066, 220, 1260, -748, 448, -21, -665, 1340, 33, -655, 578, -644, 631, 700, -1111, 308, -121, -82, 1302, -869, -587, 537, -448, 941, 180, -1319, 629, -145, -96, 737, -1338, -141, 902, -473, 598, -578, -1114, 1275, -83, -535, 174, -1528, 872, 665, -938, 425, -630, -381, 1278, -1025, -340, 421, -888, 1140, -38, -1120, 453, -477, 237, 765, -1117, 194, 404, -384, 1080, -446, -946, 1021, -85, 341, 209, -1456, 923, 820, -557, 745, -623, -243, 1118, -505, 93, 149, -675, 1292, 9, -615, 654, -704, 543, 1175, -746, 168, -101, -395, 1243, -438, -671, 719, -336, 515, 215, -1427, 667, 111, -270, 1015, -1123, -213, 921, -760, 522, -226, -867, 919, -58, -335, 591, -1126, 180, 710, -1050]
3952a050J512p52j50J534j686J7J257j277J100k7j540J457n26l8Q39j580O74P78
3970E42q72R49p57q28J884j165J11N23j385J406J50j190R74n30k72J346j251q
3988c73P85j184J564m86j177J401q58L50Q92j673Q20M68j122J213p21m24J017
4005D92p99J08Q38j397P44M42p54M65k57l18R41j111Q26qq20J104p9p86R21n30
4025B2l63P76r53N86P3p53J122m93m60Q51o77J71N24r19L94L96p20R42o97k38
4045d16R93o58L40j53l81M62l03L2L07k57o7L75k19n2N16q24P70l15m73P06m61
4066g8J41L84m25J19jk40L16j05j49L73n81K2M97j21p1J21j66P2k47J83Q1k92
4088a67J08J80j23J31l19J15K53m34J53Q1j47Q9K40l58L46k01N6L6L2M7k08j24
$$ y = [-1050, 462, -290, -440, 1094, -592, -575, 682, -595, 505, 478, -1062, 395, -131, -169, 670, -910, -236, 542, -330, 619, -138, -966, 918, -247, -136, 387, -998, 408, 558, -632, 342, -188, -460, 886, -365, -373, 412, -772, 792, 306, -871, 530, -328, 22, 914, -759, 61, 529, -593, 620, -101, -525, 492, -307, -199, 639, -758, -14, 428, -326, 139, -118, -436, 505, -606, 220, 212, -608, 496, 417, -369, 552, 22, -341, 435, -518, 68, 141, -612, 510, 17, -443, 408, -269, -98, 426, -493, -99, 297, -423, 519, -178, -416, 577, -81, 259, 106, -275, 187, -116, -84, 223, -34, -101, 274, 55, 3, 519, -305, 465, 150, -323, 383, -78, 63, 447, 22, 141, 140, -100, 216, 111, -38, 335, -246, -224, 273, 152, 81, 202, 36, 108, -139, 44, 125, -167, -59, 121, -2, 129, -190, -75, 178, -256, -103, -22, -169, -80, 160, -198, 148, -53, 3, 39, 71, 118, -90, -214]
4110b14J42J31k64L23l92J02Q4j29K57K6rL6j06k6K09j03J11k32K08J82l50l33
4132c47O05j24K5j25r4K54J5m64L76k17J03p3PQ1J40k05J59l3k35L35mj07L66
4155D38o21K93k1k58N68l85J55L6n69N46j3n11N65k65k72O70o66K83K54n16K60
4176b9J66o51N92j32j70N87o09OL36o52Q61m99l46J055p74K43L01q51O32J0m43
4197c67P18n86k85J028p52K25L20q43R85L8r99R10o59J24O83q32L09J93p31J087
4217E66m13p64J066p87N85N67j407K70P03q49J339r84l42J154j048K37M47j191
4235h51J263p1q34R94j004Q7J128j106K41M02j001J281p1q65R21r43K84R54j445
4254f36O98j28o29J465r54l32J426j315N85M81j794J183K66q16J557j614m4J328
$$ y = [-214, -72, 59, -205, 118, -274, -172, -88, -217, 40, 66, 57, 93, -13, -39, 170, 67, 178, -54, 154, 336, -14, -347, 258, 134, 159, 34, -60, 194, 209, -255, 121, -96, 7, -66, -59, 22, 162, -43, 116, 83, -152, 183, 179, 72, 438, -183, 110, 89, -169, 399, 14, 169, 205, -364, 182, 169, -342, 223, -42, -314, 356, -310, -27, 227, -289, -29, 137, -514, 78, -54, -224, 363, -246, -240, 96, -556, 305, -194, -540, 515, -259, -16, 285, -566, 66, 76, -367, 351, -235, -520, 508, -244, -19, 301, -542, 443, 481, -518, 392, -267, -143, 540, -292, 17, 210, -521, 566, 153, -611, 455, -332, 253, 820, -587, -317, 386, -463, 876, -108, -450, 704, -344, -107, 340, -851, 412, 341, -493, 501, -503, -416, 712, -394, -153, 249, -752, 529, 458, -407, 514, -429, -145, 809, -636, 62, -66, -695, 770, -184, -516, 910, -405, 180, 661, -1133, 50, 316, -500, 1057, -557, -601, 727]
4272G27j213R88k57j141J406l84o04J311j619O61J172j800P33j27l64J741j274
4289d4m71J092j291J232K04j636J205j92n41J763j907r4J177q63J140m34j405
4306a065J817n77l19R41j785J025O89j272J155j002m66J816j157n5P97j478J411
4323D75P9j444J015n79Q2J452j576K41R98j549J400n07j198J563o87J49Q83k081
4341a284J319L23o93Q95j077o10K037j162K25M78j787J851K5j173J228j223J15
4358e13J680j665M87L22j091J864r72r99J283r65O70J208k101J135k46p73J658
4375I82j324k62J657j577R89R0j615J566k09o65J202j585L89J267j495J025n50
4392a15r03J965q24m03R64j448R68N14j263O20j07l50J270j452j03J357j331J173
$$ y = [727, -486, 502, 245, -896, 510, 126, -478, 833, -786, -125, 1047, -753, -20, -147, -511, 1230, -44, -515, 577, -714, 518, 722, -914, 291, 99, -442, 1321, -586, -680, 497, -366, 774, 340, -1065, 752, 175, -144, 797, -988, 37, 726, -546, 609, -393, -859, 957, -200, -255, 542, -936, 475, 554, -890, 125, -454, -372, 1080, -496, -255, 743, -806, 594, 87, -1111, 452, -235, -86, 797, -1284, 35, 358, -335, 560, -517, -1127, 910, -252, -27, 451, -1336, 515, 540, -633, 595, -628, -513, 1167, -498, -11, 311, -780, 1084, 112, -887, 396, -569, 101, 1309, -792, 343, 97, -676, 982, -342, -604, 1053, -524, 465, 555, -1060, 506, 297, -368, 834, -751, -362, 905, -590, 435, -115, -1018, 947, 123, -280, 684, -764, 204, 718, -545, 75, -32, -382, 888, -564, -667, 690, -641, 532]
4410E32Jj530J133Ll44P73j213M2J440j176Q41n45p77J729j167n2J033j605P91
4429i1P40r74P78p55o1J248j121j50R75j065J079j54j030J069n48r6P80j030K80
4448a26N73r89J160o07q20J465o95j53N55j078Q13J87m97N78o56j15J228j116
4466b93K57J93n31N88o8n19N23m97J23P25j143O01L48j094J132l72k96Q54j136
4485f05O84L03j176N74L90l16M77m46p2Q64r39P9M55p09O88l70r5P44p17k30Q16
4506C99r00N72K8j77L01k43M3L51n87M53l0p65O27k2j5K34k07j38N42o29L9M31
4528C07m47K79N6l15L73l09J2L57l94J16J23k12K02j43j50L11k79K7J28l28K10
4549g6o4M9J15Mj07J91j20p1n1m9L34j14n18M09j30J7K80k93K31k09j15M77k92
$$ y = [532, 533, -997, 136, 139, -205, 568, -645, -603, 837, -339, 502, -43, -820, 909, -258, -310, 723, -882, -91, 649, -325, 453, -302, -363, 885, -236, -386, 589, -476, 603, 449, -581, 488, -60, -156, 624, -406, -126, 447, -542, 618, 11, -809, 656, -39, -192, 363, -715, 98, 285, -212, 366, -290, -405, 823, -293, -36, 157, -374, 214, 146, -373, 150, -347, -224, 501, -642, -41, 307, -787, 345, -27, -323, 531, -605, 79, 382, -794, -220, 170, -146, 331, -115, -187, 677, -262, -183, 272, -437, 251, -119, -214, 530, -187, -417, 399, -501, 71, 99, -78, 223, -20, 23, 374, -213, 240, 210, -555, 72, 50, 35, 269, 62, -76, 466, -163, -124, 307, -140, 139, 195, -120, 253, -56, -44, 313, -81, 35, 158, -54, 148, 5, -145, 166, -113, -86, 42, -286, -76, -140, -91, 24, 28, -79, 112, -8, -79, -130, -179, 155, 41, -477, -68, -198, -181, 99, -194, 37, -172, -287, 190, -102]
4572a02K6M66l92l7J20m36N82j87q1M04m75PJ85k53K79P0k43K43k86p8K68L3N
4595A18K84p17L40J69m31O49m81j6J14q8J12O3r3m3K10l56K60n0l38M46j73J61
4617A40N9j6l17K12k63J79m1L02l07M9k19K24J8rj17M6lj5K63m51n9L64J3l12
4641b60M02l29J71K68m70L32j65l5J15k50M3K57m53L32K55m96L78j79O1L87m13
4662d9j66M59n39P53o41kP16m02m14N95m88J44K72n14N22j21m22N42m33J34L69
4683C15q52Q38p7m85N92k13j98P52p30K9O1o96J012j06p47R87n85o2O49j042P59
4704B01j11n79Q85n08l03Q39r18N33J85p48O92K4n04P04j139L64Q35q89M83k76
4724b30l81Q90l52k54Q29r53M61O40r64N29j59r21J820j189q1Q76q76O55Q5j258
$$ y = [-102, -76, 390, -2, -39, 81, -355, 227, 40, -41, 363, -112, -105, 80, -173, 106, 176, -67, 176, -110, -188, 80, 113, 118, 402, -315, 25, 194, -237, 412, -69, -85, 29, -59, 53, 116, 23, -20, 190, -166, 94, 44, -294, 152, -21, 140, 199, 183, -134, 78, -185, -6, -47, 255, -52, -3, -222, 2, 20, 11, -106, -60, -63, -78, 185, -266, -325, 39, 52, -260, 142, -187, -16, 252, -218, 114, -51, -86, 29, -221, -178, 79, -374, -42, 213, -283, 95, -84, -23, 364, -49, -215, 244, -295, 458, -183, -185, 531, 129, -285, 310, -178, -34, 238, -276, 246, 125, -297, 245, -188, -54, 315, -537, 301, 224, -261, 331, 118, -80, 672, -58, -29, 32, -664, 348, 242, -505, 482, -103, -165, 484, -558, 201, 90, -489, 396, -112, -415, 424, -494, 39, 224, -524, 168, 192, -312, 392, -747, -383, 452, -437, 46, -230, -611, 279, -73, -327, 502, -451, 10, 650, -314, 215, 56, -865, 955, -234, -315, 561, -315, 340, 425, -833]
4744h33J221k67l48Q50r73K67O73r96R45m34n83R04m52J12L96j287R83N03r66
4763b85N35n32k73J430q80j97O18j081Q87M00j037Q43l48m67J395j498N11K25
4781B46p61Q90j01j094J207m39m4Q77j360O33M60j077J370q65o18J228o17JN86
4800E22j480J024M47r38P85p41n7J612j422J55K54j021J585m08p77R00o45K49
4818D4N99j241L76M40n86J341j127k73R21o26K51O95j651J112r0n35J049j261
4836e62K49J015r02J82L05p99J125m38o36P12p06Q89K83j135M36j68l34J352j389
4855e21P9R17j022Q24K91j325Q88m0l04Q70j145J1J006r53Q23m00j026J530m87
4874A6k0N21j034N25M21r86P46n10n4J262j028k99Q19r42Q86Q5p69M80k24J3O90
$$ y = [-833, 388, 121, -227, 623, -350, -83, 590, -406, 539, 105, -478, 426, -26, 86, 482, -805, 178, 681, -285, 250, -282, -555, 875, -5, -202, 416, -665, 222, 622, -415, 428, 80, -387, 1008, -490, 21, 246, -515, 375, 274, -820, 387, -52, -96, 781, -579, 54, 514, -563, 807, -58, -676, 552, -65, -64, 522, -958, 66, 513, -425, 360, -381, -438, 1174, -248, -93, 161, -860, 725, 317, -460, 440, -205, 44, 643, -598, -222, 218, -368, 973, -154, -427, 494, -132, 119, 814, -837, 275, 185, -350, 699, -562, -313, 702, -200, -18, 287, -512, 613, 175, -461, 251, -455, 434, 717, -418, 18, -150, -484, 868, -521, -442, 475, -547, 277, 568, -757, 131, 91, -213, 657, -488, -477, 529, -424, 399, -1, -1027, 503, 16, -4, 517, -517, 8, 429, -557, 189, -321, -375, 887, -141, -440, 379, -563, 323, 408, -361, 119, -105, -92, 598]
4895E98p46J72O38q67P70n71m45O28l48J44M70r60O34L13n71P19n78m70Q19n46
4915a97k2N48q29N89J70o46O74l20j37O34p57J97L73p73R67m29n55P05p67M60
4935a15M64q30M64K30n29N75m77k25N68J8k37K58n98M75J19o86O83m81K57M81
4955D14o62J19K38l84O19j8o49M69k74j36N62m43J67n6q2L22m02J18K64k98KL81
4977B71n05M30j10j63L66q6r0ml5j13L34l82M33k12k43L09l84O5N74p58L69J42
$$ y = [598, -148, 24, 662, -205, 565, -6, -451, 177, -171, -27, 443, -517, 117, 430, -141, 578, 0, -470, 349, -197, -219, 329, -500, 89, 259, -387, 287, -33, -170, 464, -293, -96, 277, -496, 471, 42, -513, 192, -575, -115, 349, -481, -17, 213, -316, 259, -218, -443, 125, 143, -94, 164, -434, 41, 160, -526, 157, -324, -67, 414, -248, -129, 109, -275, 344, 326, -323, 146, -128, -264, 298, -145, 22, -34, -116, 206, -196, -78, 186, -112, -110, 271, -234, 196, 86, -77, 289, 203, 113, 109, 74, -39, 295, -87, 346, 134, -109, 200, -184, -119, 455, -303, 66, 208]
$$ [...]
8191a77
##END NTUPLES=NMR FID
##END=
