##TITLE=1H_SR_8
 CDCl3, 8 sc, 
 3.2.2020
##JCAMPDX= 6.0         $$ Bruker NMR JCAMP-DX V2.0
##DATA TYPE= NMR FID
##DATA CLASS= NTUPLES
##ORIGIN= UXNMR, Bruker Analytische Messtechnik GmbH
##OWNER= root
$$ XWIN-NMR		Version 3.5
$$ Mon Feb  3 14:09:12 2020 Russian Standard Time (UT+4h)  she@DPX200
##.OBSERVE FREQUENCY= 200.1315
##.OBSERVE NUCLEUS= ^1H
##.DELAY= (6, 6)
##.ACQUISITION MODE= SIMULTANEOUS
##.ACQUISITION SCHEME= undefined
##.AVERAGES= 8
##.DIGITISER RES= 18
##SPECTROMETER/DATA SYSTEM= spect
##.PULSE SEQUENCE= zg30
##.SOLVENT NAME= CDCl3
##.SHIFT REFERENCE= (INTERNAL, CDCl3, 0, 15.7039)
##AUDIT TRAIL= $$ (NUMBER, WHEN, WHO, WHERE, WHAT)
$$ ##TITLE= Audit trail, XWIN-NMR		Version 3.5
$$ ##JCAMPDX= 5.01
$$ ##ORIGIN= Bruker BioSpin GmbH
$$ ##OWNER= she
$$ F:/spectra/data/she/nmr/H-F/1/audita.txt
$$ ##AUDIT TRAIL=  $$ (NUMBER, WHEN, WHO, WHERE, WHAT)
(   1,<2020-02-03 14:07:59.68 +0400>,<she>,<DPX200>,
      <created by zg, POWCHK disabled, PULCHK disabled
       configuration hash MD5:
       00 E9 B6 7A A2 85 ED C7 34 08 36 98 17 FE 4E 26
       data hash MD5: 16K
       88 62 A8 6E B2 07 5E 8A 46 61 F4 13 E4 0B F2 06>)
$$ ##END=
$$ 
$$ hash MD5
$$ 8B 5B 89 FD BF 02 74 11 C0 5C 28 CD E4 A3 87 05
##$RELAX= 
##$RELAX= 
##$RELAX= 
##$RELAX= 
##$RELAX= 
##$RELAX= 
$$ Bruker specific parameters
$$ --------------------------
##$DU= <F:/spectra>
##$EXPNO= 1
##$NAME= <H-F>
##$PROCNO= 1
##$TYPE= <nmr>
##$USER= <she>
##$AMP= (0..31)
100 100 100 100 100 100 100 100 100 100 100 100 100 100 100 100 100 100 
100 100 100 100 100 100 100 100 100 100 100 100 100 100 
##$AQSEQ= 0
##$AQ_mod= 1
##$AUNM= <au_zg>
##$AUTOPOS= <>
##$BF1= 200.13
##$BF2= 200.13
##$BF3= 200.13
##$BF4= 200.13
##$BF5= 200.13
##$BF6= 200.13
##$BF7= 200.13
##$BF8= 200.13
##$BYTORDA= 1
##$CFDGTYP= 0
##$CFRGTYP= 5
##$CHEMSTR= <none>
##$CNST= (0..31)
1 1 145 1 1 1 1 1 1 1 1 1 1 1 1 1 1 1 1 1 1 1 1 1 1 1 1 1 1 1 1 1 
##$CPDPRG= <>
##$CPDPRG1= <>
##$CPDPRG2= <>
##$CPDPRG3= <>
##$CPDPRG4= <mlev>
##$CPDPRG5= <mlev>
##$CPDPRG6= <mlev>
##$CPDPRG7= <mlev>
##$CPDPRG8= <mlev>
##$CPDPRGB= <>
##$CPDPRGT= <>
##$D= (0..31)
0 1.2 0 0 0 0 0 0 0 0.06 0 0.03 0 0 0 0 0.0002 0 0 0 0 0 0 0 0 0 0 0 0 
0 0 0 
##$DATE= 1580724479
##$DBL= (0..7)
120 120 120 120 120 120 120 120 
##$DBP= (0..7)
150 150 150 150 150 150 150 150 
##$DBP07= 0
##$DBPNAM0= <>
##$DBPNAM1= <>
##$DBPNAM2= <>
##$DBPNAM3= <>
##$DBPNAM4= <>
##$DBPNAM5= <>
##$DBPNAM6= <>
##$DBPNAM7= <>
##$DBPOAL= (0..7)
0.5 0.5 0.5 0.5 0.5 0.5 0.5 0.5 
##$DBPOFFS= (0..7)
0 0 0 0 0 0 0 0 
##$DE= 6
##$DECBNUC= <off>
##$DECIM= 24
##$DECNUC= <off>
##$DECSTAT= 4
##$DIGMOD= 1
##$DIGTYP= 9
##$DL= (0..7)
0 120 120 120 120 120 120 120 
##$DP= (0..7)
150 150 150 150 150 150 150 150 
##$DP07= 0
##$DPNAME0= <>
##$DPNAME1= <>
##$DPNAME2= <>
##$DPNAME3= <>
##$DPNAME4= <>
##$DPNAME5= <>
##$DPNAME6= <>
##$DPNAME7= <>
##$DPOAL= (0..7)
0.5 0.5 0.5 0.5 0.5 0.5 0.5 0.5 
##$DPOFFS= (0..7)
0 0 0 0 0 0 0 0 
##$DQDMODE= 0
##$DR= 18
##$DS= 0
##$DSLIST= <SSSSSSSSSSSSSSS>
##$DSPFIRM= 0
$$ [...]
##$SUBNAM2= <"">
##$SUBNAM3= <"">
##$SUBNAM4= <"">
##$SUBNAM5= <"">
##$SUBNAM6= <"">
##$SUBNAM7= <"">
##$SUBNAM8= <"">
##$SUBNAM9= <"">
##$SW= 24.9337058887773
##$SWIBOX= (0..15)
0 0 2 0 0 0 0 0 0 0 0 0 0 0 0 0 
##$SW_h= 4990.01996007984
##$TD= 16384
##$TD0= 1
##$TE= 0
##$TE2= 300
##$TE3= 300
##$TEG= 300
##$TL= (0..7)
0 120 120 120 120 120 120 120 
##$TP= (0..7)
150 150 150 150 150 150 150 150 
##$TP07= 0
##$TPNAME0= <>
##$TPNAME1= <>
##$TPNAME2= <>
##$TPNAME3= <>
##$TPNAME4= <>
##$TPNAME5= <>
##$TPNAME6= <>
##$TPNAME7= <>
##$TPOAL= (0..7)
0.5 0.5 0.5 0.5 0.5 0.5 0.5 0.5 
##$TPOFFS= (0..7)
0 0 0 0 0 0 0 0 
##$TUNHIN= 0
##$TUNHOUT= 0
##$TUNXOUT= 0
##$USERA1= <user>
##$USERA2= <user>
##$USERA3= <user>
##$USERA4= <user>
##$USERA5= <user>
##$V9= 5
##$VALIST= <valist>
##$VCLIST= <CCCCCCCCCCCCCCC>
##$VD= 0
##$VDLIST= <DDDDDDDDDDDDDDD>
##$VPLIST= <PPPPPPPPPPPPPPP>
##$VTLIST= <TTTTTTTTTTTTTTT>
##$WBST= 1024
##$WBSW= 4
##$XGAIN= (0..3)
0 0 0 0 
##$XL= 0
##$YL= 0
##$YMAX_a= 450181
##$YMIN_a= -201897
##$ZGOPTNS= <>
##$ZL1= 120
##$ZL2= 120
##$ZL3= 120
##$ZL4= 120
##$ABSF1= 10
##$ABSF2= 0
##$ABSG= 5
##$ABSL= 3
##$ALPHA= 0
##$AQORDER= 0
##$ASSFAC= 0
##$ASSFACI= 0
##$ASSFACX= 0
##$ASSWID= 0
##$AUNMP= <proc_1d>
##$AZFE= 0.1
##$AZFW= 0.1
##$BCFW= 1
##$BC_mod= 2
##$BYTORDP= 1
##$COROFFS= 0
##$CY= 11.3945322036743
##$DATMOD= 1
##$DC= 2
##$DFILT= <>
##$DTYPP= 0
##$F1P= 16.9975609425685
##$F2P= -3.02152046262296
##$FCOR= 0.5
##$FTSIZE= 0
##$FT_mod= 4
##$GAMMA= 1
##$GB= 0.15
##$INTBC= 1
##$INTSCL= 1
##$ISEN= 128
##$LB= 0.24
##$LEV0= 0
##$LPBIN= 0
##$MAXI= 10000
##$MC2= 0
##$MEAN= 0
##$ME_mod= 0
##$MI= 1.114404
##$NCOEF= 0
##$NC_proc= 0
##$NLEV= 6
##$NOISF1= 3.799351
##$NOISF2= 2.8
##$NSP= 1
##$NTH_PI= 0
##$NZP= 0
##$OFFSET= 15.70392
##$PC= 1
##$PHC0= -9784.726
##$PHC1= 10.00081
##$PH_mod= 1
##$PKNL= yes
##$PPARMOD= 0
##$PSCAL= 0
##$PSIGN= 0
##$REVERSE= no
##$SF= 200.130013532006
##$SI= 16384
##$SIGF1= 3
##$SIGF2= 2
##$SINO= 400
##$SIOLD= 16384
##$SREGLST= <1H.CDCl3>
##$SSB= 0
##$STSI= 0
##$STSR= 0
##$SW_p= 3612.71676300578
##$SYMM= 0
##$S_DEV= 0
##$TDeff= 0
##$TDoff= 0
##$TI= <>
##$TILT= no
##$TM1= 0
##$TM2= 0
##$TOPLEV= 0
##$USERP1= <user>
##$USERP2= <user>
##$USERP3= <user>
##$USERP4= <user>
##$USERP5= <user>
##$WDW= 1
##$XDIM= 8192
##$YMAX_p= 0
##$YMIN_p= 0
$$ End of Bruker specific parameters
$$ ---------------------------------
##NTUPLES= NMR FID
##VAR_NAME=  TIME,          FID/REAL,        FID/IMAG
##SYMBOL=    X,             R,               I
##VAR_TYPE=  INDEPENDENT,   DEPENDENT,       DEPENDENT
##VAR_FORM=  AFFN,          ASDF,            ASDF
##VAR_DIM=   8192,          8192,            8192
##UNITS=     SECONDS,       ARBITRARY UNITS, ARBITRARY UNITS
##FACTOR=    0.0002004,     1,               1
##FIRST=     0,             0,               0
##LAST=      1.6414764,     0,               0
##MIN=       0,             -201897,         0
##MAX=       1.6414764,     450181,          0
$$ Real data points
##PAGE= N=1
##DATA TABLE= (X++(R..R)), XYDATA
0 0 0 0 0 0 0 8 0 8 -8 13 -16 16 -24 30 -32 40 -48 61 -72 81 -97 115 -133 152 -176 205 -232 262 -299 341
30 341 -381 429 -479 540 -603 670 -747 829 -922 1020 -1130 1253 -1385 1535 -1700 1885
46 1885 -2093 2328 -2598 2909 -3276 3711 -4241 4900 -5746 6884 -8497 10978 -15322 25111
60 25111 -93627 131854 234248 -175243 -179416 94064 80746 -201897 -153982 80101 73136
71 73136 -94182 -37642 66129 -41809 -152367 22973 186648 41410 -146281 -45474
81 -45474 79902 -23842 -94469 87377 200236 50230 -67312 21845 60674 -44846 -65616
92 -65616 58879 119519 55726 -2671 9123 51948 93110 94701 46414 11752 35801 58267
104 58267 30973 15699 73189 138328 123995 62522 29608 18421 15502 64607 130363 102621
116 102621 31928 69608 139460 64873 -38315 42659 170914 106380 -19492 25245 122872
127 122872 77111 11012 88158 167316 83452 -24222 16474 91836 50125 6962 93203 163173
139 163173 79383 -4868 42782 73748 3504 -705 103804 114724 7387 -4810 95198
150 95198 104436 11682 -2581 71368 74958 -10365 -40947 27667 80444 55630 34234 61502
162 61502 54683 -11662 -33612 16595 32650 -2116 10185 59658 45367 -10405 -8242 35256
174 35256 36380 -3905 -23136 -6549 5486 -9452 -12871 29349 61775 22619 -28578 -20990 -7286
187 -7286 -40375 -47663 10049 41813 5527 -20620 -4219 -3755 -30849 -33764 -6834 -541 -28180
200 -28180 -40017 -13385 4211 -16318 -22259 11130 10891 -47943 -72151 -28320 -6390 -29884 -21672
213 -21672 17020 8648 -34133 -43766 -28803 -32940 -42594 -30665 -12868 -12703 -26199 -26786 -10618 -8296
227 -8296 -30585 -43234 -33433 -34940 -48894 -37315 -9472 -4828 -14381 -16036 -22459 -37948 -45077 -42162
241 -42162 -37701 -24228 -15268 -24825 -28479 -12617 -13630 -35024 -35199 -20610 -32668 -51831 -39450
254 -39450 -16815 -15610 -19486 -10710 -6070 -22107 -46425 -50342 -31998 -23644 -31714 -21773 5214 -2046
268 -2046 -34917 -32098 -10525 -26535 -49275 -26533 -2181 -20784 -33249 -8187 6601 -14221
280 -14221 -29032 -18022 -11951 -28394 -38255 -19908 2932 -1056 -13861 -1495 9540 -14227 -34919
293 -34919 -17443 -4343 -19922 -19037 8650 16089 -977 -1789 8030 -464 -16656 -17297 -6802 1869
307 1869 4637 7151 16772 24335 12456 -2727 598 5484 -3439 -3605 14063 21538 16656 21056 27021
322 27021 20566 13111 12116 8173 6618 12762 15450 19920 33635 38787 28153 24139 27543 15881
336 15881 3461 12042 24448 24344 30083 41707 40684 32447 28139 22129 15986 18149 20927 22251
350 22251 31959 40144 34991 31741 37067 30266 16186 18614 25815 19931 19258 31610 35618 30335 32278
365 32278 32538 23250 17656 16912 12875 13178 22992 27149 26026 30315 29736 18236 11176 10927 5575 4140
381 4140 14690 20659 17687 19535 21813 12229 3995 3651 -780 -3931 3279 8140 5502 8853 13942
396 13942 7186 -1983 -3585 -7530 -13555 -10043 -5517 -6098 -2405 4291 1121 -4914 -6322 -12812 -20457
411 -20457 -20247 -18327 -20306 -14228 -2946 -2661 -7674 -8302 -14316 -26745 -30292 -26418 -25594 -21023 -10417
426 -10417 -8020 -11526 -13069 -17227 -25667 -27619 -25262 -28170 -27193 -18855 -17299 -18819 -12733 -11106 -18990
441 -18990 -22970 -22041 -27868 -32210 -24820 -18095 -16995 -11753 -8936 -14685 -18455 -18349 -24323 -28036 -21230
456 -21230 -15878 -16667 -10846 -4811 -9915 -14404 -11564 -15589 -24109 -19901 -10657 -9354 -7560 -2931 -3379
471 -3379 -5999 -7862 -13173 -16431 -9430 -4081 -7590 -5597 2826 1171 -3456 823 1075 -8087 -8817 -1905
487 -1905 -4062 -7544 798 10657 11153 7496 3589 -215 -1736 -4954 -8675 -1034 11450 11474 7534 13109
503 13109 14169 1153 -3736 3908 2714 -2335 3753 12407 10897 9549 13663 13024 6572 2645 2154
518 2154 3920 4189 1377 5386 17722 19299 7151 4982 13855 9063 -3317 -417 7254 5903 7289
533 7289 15383 14530 7677 9504 11724 3510 -3050 63 6222 10494 12448 9938 10926 13719 8118 -936
549 -936 551 5659 3955 6415 13172 10739 6189 9873 9563 2275 3938 9988 3869 -1170 8483 14128
565 14128 5901 4891 14617 14347 4192 -678 803 2321 4342 8335 13427 15019 10157 6434 10059
580 10059 4797 -8829 -3976 17265 15422 -2630 4060 23667 14582 -4438 2940 14606 2196
593 2196 -7984 5084 15217 6001 1324 14550 21022 4567 -9584 1382 12924 -100 -9112
606 -9112 10361 22321 1637 -7489 14698 18367 -8630 -12485 11360 9752 -13700 -9493 15640
619 15640 16804 413 -1120 7192 -846 -15241 -11343 4738 5681 -4435 894 12788 453 -19623
633 -19623 -10780 7804 -1954 -16575 -5795 2775 -9564 -13266 436 2101 -7835 -8678 -7162 -14361
647 -14361 -19379 -13272 -6108 -4051 -3217 -5766 -11218 -15407 -16609 -14939 -14123 -14873 -11646 -5758 -8977 -18694
663 -18694 -14678 -4669 -12055 -23575 -15328 -10213 -23376 -23689 -2597 -38 -19007 -18408 -4544 -13890
677 -13890 -32836 -23031 -2144 -5626 -19907 -15094 -2425 -10715 -26093 -17259 1829 -6151 -27604
690 -27604 -19813 -528 -9648 -23138 -3760 13516 -6471 -24993 -11754 -5364 -20494 -17923 7125
703 7125 12712 -5551 -12188 -1613 -971 -13868 -14623 2294 10826 -3065 -12155 966 10622 635
717 635 -3410 8519 8912 -5950 -9099 1218 5661 6288 11914 15483 11223 4753 184 -72 7157
732 7157 9774 6021 9490 18617 12516 2100 10998 23633 14551 657 4859 13825 9256 4001
746 4001 14088 28927 26139 9043 2709 11887 11839 1420 9340 28285 22851 5091 9934 21838
760 21838 11569 2747 18401 26088 7813 -3200 9764 19041 12126 10149 21038 24613 10095
773 10095 -4741 -178 11872 11865 7850 15294 20766 9875 584 4393 6937 4168 7403 11632 5602
788 5602 792 4922 6810 5163 8570 9106 1527 -1945 262 -2364 -2861 7188 12655 3753 -3747
803 -3747 -682 -72 -5473 -6624 1413 7557 1384 -8747 -5962 3600 176 -7912 -1000 5108 -8521
818 -8521 -17048 -3847 3601 -5376 -2980 9011 726 -18630 -16002 -1836 -3831 -9501 -564 8445
832 8445 -719 -14510 -12603 -1686 -2018 -10364 -6303 2486 -4298 -15996 -7129 5072 -2278 -9275
846 -9275 598 965 -16398 -18288 -1347 2763 -5867 -2442 6094 191 -12202 -12648 -5370 -2324 -4887
861 -4887 -5437 -691 900 -4724 -5953 568 985 -6714 -7621 -4055 -7222 -8657 -229 4923 971 -810
877 -810 -1042 -6941 -9852 -4756 -3593 -4349 861 2515 -4984 -6520 1012 1545 -5511 -5574 -503 -4105 -10471
894 -10471 -8752 456 5336 1573 -3367 -1215 -2302 -12247 -14007 -1154 3614 -5497 -3409 6877
908 6877 -850 -15344 -8339 4200 -2931 -12004 -4448 2730 -4714 -9591 -2298 4022 -779 -8101 -6244
923 -6244 -1958 -6833 -12382 -3616 6654 969 -8162 -1865 2436 -7875 -11413 -1291 1051 -6620
937 -6620 -4517 2961 821 -3956 -1533 493 -2352 -5045 -5682 -4164 412 3234 1752 1657 2582 -739
953 -739 -3846 -1961 -891 -474 3241 4300 1613 2031 4056 1663 1259 6011 4124 -2225 562 7175
969 7175 4217 1386 8942 12380 5527 1406 4492 3956 961 2954 9157 12078 9344 6610 8141
984 8141 10417 5149 1 5818 11928 6749 3714 11815 14323 6252 6230 12354 8731 1607 5397 11127
1000 11127 8334 6136 9601 12367 11566 8268 5538 6783 7734 4158 3409 8458 10384 6875 8353
1015 8353 12730 7810 992 3910 6107 1436 1936 7164 8110 6183 6984 5479 1414 703 1140 140
1031 140 1452 3231 1863 2350 4950 2506 -1640 -350 479 -2575 -3125 -1102 -2129 -3376 408 1344
1047 1344 -2851 -2934 -1219 -4633 -7798 -6211 -5505 -5580 -2289 -290 -3538 -4681 -4918 -7576 -9455 -7984
1063 -7984 -7316 -7673 -3990 -2545 -6169 -6867 -4967 -8006 -10689 -8036 -6890 -9343 -7072 -3718 -6045 -7545
1079 -7545 -5273 -5712 -8816 -7883 -7097 -9059 -7587 -5085 -5825 -5802 -2730 -3842 -6825 -5527 -5664 -9174 -8523
1096 -8523 -3502 -2862 -3830 -742 -795 -4679 -5214 -4726 -6653 -6223 -1432 -522 -1515 244 786 -1922 -1858 -1086
1114 -1086 -3579 -3622 627 656 -1568 1259 3793 1279 627 2435 372 -1791 674 1164 -458 1798
1130 1798 5226 4033 3610 4634 2592 -333 697 522 -553 3282 7257 5156 3812 6181 4302
1145 4302 -725 12 2351 1642 2525 5230 4759 3473 5093 4179 1560 2044 2647 857 1303 3039 2096
1162 2096 2335 5916 5169 946 1288 3641 22 -2848 629 2421 1250 2974 4331 2141 1620 1605
1178 1605 -2006 -2783 -183 542 -270 2027 3744 1278 339 722 -1961 -4078 -557 711 -1518 -179
1194 -179 2141 1156 -565 203 -1652 -2537 312 -429 -3517 -1804 1849 111 -1485 1455 2020 -1734
1210 -1734 -2094 -1230 -3212 -2524 764 1514 1399 2726 1855 -1622 -1672 -1583 -2834 -784 3160 1784 -409
1227 -409 3444 3963 -1214 -1852 1887 1481 -1075 -138 1551 1851 3588 3029 702 2035 2854 53 -1662
1244 -1662 2060 2572 672 3518 5742 2084 712 3962 3515 -447 -275 1949 2013 1785 3086 3868 5029
1261 5029 4439 34 -1966 1472 1362 -2188 1233 7192 4966 -484 1066 2584 -986 -2039 1021
1276 1021 1920 647 342 338 487 1001 118 180 2355 -44 -6037 -4500 1718 -443 -4230 1045 5169
1293 5169 -615 -6195 -3941 -2770 -4459 -3722 -1552 -250 -1462 -2994 -3578 -1742 -2401 -6346 -5646 -1612
1309 -1612 -4333 -8045 -3278 1413 -2334 -5767 -2541 -3048 -8261 -8676 -3436 -2147 -3492 -3981 -4175 -3378
1325 -3378 -3471 -5973 -5686 -1939 -2736 -7989 -6868 -2605 -3399 -3879 99 759 -4450 -6580 -5343 -5082 -4996
1342 -4996 -1250 599 1013 507 -2520 -5644 -3492 -196 -2562 -2423 2141 1126 -3089 -2176 1989 1782
1358 1782 170 1012 781 -816 -2226 -1528 1635 5643 4760 1644 3106 3837 -1615 -2789 4218 6248
1374 6248 1230 2123 7262 5139 754 3608 7329 4683 987 1580 4363 4533 3580 5046 9496 9042
1390 9042 2057 -214 4328 4768 891 5072 11141 6826 932 4428 7338 3173 1721 6427 7024
1405 7024 1930 786 2993 5125 6198 5608 5787 5874 2258 -2391 -1088 3940 4269 3366 6861 6953 1079
1422 1079 -1541 892 1403 482 2628 2326 546 778 1401 -268 879 3883 981 -3128 -1834 -556
1438 -556 -3685 -2006 3226 3180 -1223 -2725 -1631 -2509 -3722 -3195 -948 911 -1710 -4945 -2576 1165
1454 1165 -2314 -5039 -240 83 -7953 -8691 -225 1109 -3895 -1873 2244 -2345 -8605 -6810 -2382
1469 -2382 -1713 -2938 -1647 602 -1559 -5836 -5920 -415 -213 -4976 -3966 650 -2877 -7615 -2494 2802
1485 2802 74 -3147 -39 -1377 -5923 -5115 -1281 -149 246 1610 298 -1578 -2466 -3306 -2436 -117
1501 -117 435 -544 71 928 -854 -515 1591 867 -1261 -642 -883 -2664 29 3441 1405 459 2961
1518 2961 1434 -3512 -1981 2460 843 -1062 1609 3424 281 -963 1804 2763 944 -1130 -854
1533 -854 180 -599 -1904 1607 6008 2842 -2234 -253 1749 -4047 -5627 1900 4693 -391 -725 3122
1549 3122 434 -4269 -2485 1609 155 -2197 -1208 379 -261 -2103 -891 2385 1407 -3122 -4191 -960
1565 -960 -2228 -5302 -1204 3790 893 -2925 -623 -432 -4272 -4147 -753 -1106 -2586 -1336 -492 -1047
1581 -1047 -829 -845 -1577 -2043 -2235 -3490 -2624 23 191 -263 974 10 -2790 -2236 -645 -1858 -1600 753
1599 753 206 -1594 384 1575 -662 -228 2287 450 -2614 -888 822 321 1088 3530 3226 1524
1615 1524 743 229 -431 742 1450 2329 4243 4504 1409 1426 3514 1732 -28 2829 4548 1760 1381
1632 1381 4247 4328 2613 3705 4737 2772 1797 2580 2444 2961 4389 4073 4123 4904 3903 1714 2614 3739
1650 3739 1742 1797 3981 4526 2827 4225 5398 3202 1543 2258 1526 779 2896 3234 2578 3801 3935
1667 3935 1400 526 1837 792 -385 1680 2382 601 625 2218 582 -132 736 402 -992 -1071 -1124 -1595
1685 -1595 -432 785 -367 -683 704 -1493 -4288 -2729 -1855 -3412 -2486 355 -693 -2605 -1688 -1751
1701 -1751 -4294 -4778 -3065 -3323 -3573 -2196 -2010 -2944 -2540 -3032 -4223 -3832 -3248 -4847 -4514 -2260 -3080 -4108
1719 -4108 -2672 -2119 -3904 -4169 -2369 -3928 -5868 -3638 -2600 -3806 -2523 -431 -1962 -3416 -2558 -3222
1735 -3222 -4593 -3405 -2176 -2159 -1120 -174 -1455 -1912 -1729 -2077 -3551 -1261 -710 -1833 -925 852 -376
1752 -376 -1592 428 316 -1933 -791 942 -659 -1480 1125 1591 779 1279 1562 291 252 250 -357 648
1770 648 2448 1988 1819 3486 2787 222 532 2044 477 -180 2933 3604 1774 2768 3801 1686 127
1787 127 1646 1808 1126 2001 2521 1904 2515 2894 1461 1649 2265 1224 92 1638 1408 30 1923 3352
1805 3352 1980 859 2294 1411 -1035 -415 925 198 550 2797 2490 709 841 66 -1417 -1118 -10
1822 -10 -329 -173 1491 717 -66 564 -27 -1813 -1171 -136 -1609 -1646 318 202 -1167 -42 581 -1394
1840 -1394 -1609 -27 -1534 -2625 -912 -82 -965 -683 747 13 -1014 -663 -1596 -2498 -1119 -470 -600
1857 -600 974 1307 -402 -1040 -141 -1175 -2366 -255 888 -610 85 1731 673 -820 544 763
1873 763 -534 -13 834 196 355 1635 1408 887 2175 1462 80 375 926 79 405 2464 2397 1217
1891 1217 2542 2655 528 369 1452 876 449 2522 2855 1832 2839 2790 549 155 1809 1120 741
1908 741 2341 3068 1641 1141 2333 1038 1163 1485 1086 499 950 996 231 1420 2401 738 388 2019
1926 2019 312 -2109 -740 1225 -401 -561 1889 1295 -816 -1110 -481 -1573 -2026 -897 -552 -219 180
1943 180 -969 -1515 -389 -1315 -3188 -1798 -780 -2903 -2981 -242 -635 -2274 -1600 -570 -2452 -3804 -2440
1960 -2440 -2222 -2930 -2116 -1979 -2382 -1837 -1795 -2943 -2691 -1944 -3395 -4103 -2457 -1878 -2980 -1577 -454 -1943
1978 -1943 -3279 -2846 -3358 -3778 -2246 -912 -1596 -1009 -997 -2494 -3139 -1330 -1041 -2705 -1384 -230 -1755
1995 -1755 -2521 -623 227 -212 -68 -403 -1275 -1091 -1640 -1685 722 2150 738 5 1423 722 -1650 -376
2013 -376 2168 980 -659 1488 2941 1505 711 2537 2319 921 246 640 1663 2665 1546 2168
2029 2168 4244 2920 -376 435 3136 1938 144 3076 4439 1316 90 2744 3540 1918 2089 2585
2045 2585 1820 737 445 1166 3416 4151 2132 1909 3071 711 -1894 594 3140 2295 1300 2665 2327
2062 2327 -149 -370 861 950 1286 788 -286 70 1041 20 -235 2019 1766 -1662 -1739 76 -719 -1817
2080 -1817 208 1917 148 -1234 -1372 -921 -906 -1383 -1725 -491 138 -2118 -2867 299 1091 -2047 -2237
2097 -2237 28 -1527 -4396 -2802 765 -69 -1400 -625 -522 -2003 -3596 -2880 -764 16 -902 -1722 -509
2114 -509 -152 -2830 -2639 892 1107 -2527 -2204 -100 -1484 -2859 -255 2013 878 -540 -959 -1212 -1656
2131 -1656 -1505 -814 1473 2678 -36 -1547 455 680 -1193 -793 2227 1540 -1089 -281 1689 1413 625
2148 625 1458 1875 982 -242 -962 829 2820 1974 336 2403 2657 -621 -1134 2225 2628 125 568
2165 568 3045 1504 -188 1061 2919 2155 835 58 658 1051 -138 -27 2965 3826 789 -582 1218
2182 1218 607 -1940 -183 3096 2026 -588 376 898 -476 -1102 371 725 779 -781 -1359 -637 463
2199 463 -390 -106 1365 986 -2628 -2589 -563 -960 -2249 -473 1553 -536 -1979 -1560 -1427 -1663 -1299 -2020
2217 -2020 -1354 -877 -1481 -2723 -353 320 -1900 -2784 -1364 -1584 -3843 -2429 -149 92 -1752 -1693 -863
2234 -863 -1776 -2561 -2302 -1260 87 -1165 -2605 -1007 553 -1816 -2420 722 858 -2678 -3160 -292 -367
2251 -367 -1710 24 2185 906 -1375 -1519 -806 -565 -647 -629 1312 2277 -198 -1292 1122 1800 -765
2268 -765 -389 2545 1498 -1232 207 2432 1729 751 1722 1970 1005 319 149 1073 2383 1728 1136 2350
2286 2350 3005 754 404 2418 2218 311 1062 2701 2236 1391 2034 2709 1808 1294 419 754 2072 2071 1011
2305 1011 2263 3380 1583 -387 1124 2233 26 280 2202 2342 195 388 1279 1398 889 346 805
2322 805 936 146 -1300 -5 1688 604 -607 976 1721 -1513 -2521 -81 431 -1377 -786 764
2338 764 511 -1353 -1308 -863 -1096 -1211 -1986 -1376 -23 -954 -2316 -1010 127 -1752 -2595 -1183 -416 -2539
2356 -2539 -2273 -751 -1024 -1520 -1053 -742 -1278 -1209 -1594 -2200 -1337 -1079 -2193 -1559 -82 -521 -1940 -1413 -699
2375 -699 -2145 -2212 -1010 -485 -985 -182 -303 -957 -801 -1109 -1788 -514 109 -682 -920 724 530 -961 -399
2394 -399 919 -54 -924 -15 484 -358 -322 924 714 890 924 548 293 484 -178 -258 1035 1844 593 1193
2414 1193 2128 911 -379 880 1313 -154 477 1808 1689 859 1315 1337 490 559 890 627 1205 1466 1165
2433 1165 606 1495 1102 205 1089 1570 104 223 709 725 300 1076 1332 290 607 730 -216 -801 113
2452 113 -113 -434 404 905 -10 -242 327 -966 -1167 -172 -193 -592 -55 148 -490 -507 -231 -1165 -1072 -694 -754
2473 -754 -1540 -754 123 -966 -1349 -179 -644 -1515 -938 -963 -1795 -1605 -370 -720 -795 -100 -254 -1304 -607
2492 -607 -1142 -1911 -1444 -358 -774 -684 22 107 -1230 -970 -430 -1251 -1178 252 238 -594 25 415 -708 -234
2512 -234 478 -159 -702 561 475 13 476 1196 307 586 1276 575 200 558 745 55 1138 1726 1299 1487
2532 1487 1958 1023 238 1321 1267 374 1329 2433 1407 1277 1957 1478 229 1218 1794 1266 1246 1909 1967
2551 1967 1405 1515 1596 884 1700 1117 725 1026 1836 813 817 2162 2087 636 1141 1465 158 -364 975
2570 975 1034 345 1204 1538 586 42 388 -190 -315 85 262 -51 506 459 -482 -726 -51 -1206 -1149 -168 -348
2591 -348 -1231 -705 -50 -884 -1465 -491 -1139 -1500 -1235 -1182 -2153 -1464 -711 -1355 -1594 -814 -909 -2034 -1887 -1631
2611 -1631 -1693 -1713 -1220 -990 -887 -1170 -1371 -2178 -1682 -1895 -2574 -1663 -488 -1316 -2008 -768 -892 -2061 -1787
2630 -1787 -601 -1234 -1666 -1085 -416 -1340 -1306 -583 -458 -576 -478 -1192 -1191 -211 -940 -1378 276 731 -656 -571
2650 -571 790 -142 -1370 -263 674 -72 137 1006 813 656 807 310 342 787 776 55 1082 1851 710
2669 710 445 1525 1304 282 714 1479 1158 326 1115 1303 1312 1371 1344 846 1776 1460 407 843 1572 1071
2689 1071 280 1839 2374 742 86 1495 869 -389 758 1729 1403 1037 450 519 649 473 -404 407
2707 407 1514 464 -427 863 1751 -249 -765 1018 601 -862 -563 485 222 -878 85 175 66 -238
2725 -238 -676 -1032 -297 -839 -1263 -170 115 -1123 -1203 284 -182 -1554 -1439 -298 -1190 -1469 -720 -343 -852
2744 -852 -242 -659 -1031 -903 -898 -1658 -1211 -85 -418 -1633 -570 -242 -1414 -1109 -145 -463 -1238 -1136 -944
2763 -944 -611 -404 -530 -13 305 68 -1531 -960 395 -175 -854 233 1508 -238 -976 305 515 -423
2781 -423 -313 976 967 18 216 634 800 1258 103 455 1300 753 -514 704 1763 936 -203 1630
2799 1630 1763 168 341 1370 1303 374 446 1237 979 1028 1066 915 1092 808 -137 616 1486 823 456 1558
2819 1558 2036 194 -458 830 454 178 740 1156 781 449 221 71 398 354 117 47 826 -277 -996
2838 -996 52 877 -252 -647 487 83 -1299 -1339 -90 -210 -390 -487 -321 -566 -307 -1204 -1140 -386 -669
2857 -669 -1777 -640 178 -1157 -2067 -351 79 -1812 -1905 -587 -1090 -1151 -1062 -635 -467 -672 -1181 -1335 -669
2876 -669 -835 -1777 -1194 456 -924 -2010 -637 525 -1057 -1512 -218 -133 -1624 -1431 -501 -499 12 -79 -216
2895 -216 199 -673 -1103 -943 301 125 -648 224 1221 -151 -1173 653 811 -226 132 638 874 -172
2913 -172 409 648 1445 1523 615 142 1317 1064 -104 461 1911 1438 155 1575 1980 615 254 725
2931 725 1217 1175 663 1285 1413 1718 978 314 1481 1479 -146 186 1740 1912 294 1030 2083 723 61
2950 61 970 1275 832 496 766 856 745 186 182 667 1503 118 -637 1209 363 -930 -403 1322 532 -652
2970 -652 308 467 -642 -1093 -63 -11 -128 -39 -531 -221 -233 -930 -1581 -72 -127 -1615 -1480 103 -310 -1721
2990 -1721 -875 -114 -1111 -1411 -994 -931 -1058 -969 -1143 -1036 -348 -992 -1738 -960 -413 -1581 -2069 -649 -162 -1554
3010 -1554 -1128 5 -802 -1630 -1032 -880 -1187 -1089 -989 -566 -58 -225 -919 -911 32 -846 -1262 -203 194 -458
3030 -458 -843 73 -300 -738 -355 391 -201 -69 2 -260 -38 791 20 174 765 452 -290 341 786 -103
3050 -103 -173 1112 999 443 621 839 214 392 1057 706 614 1094 1175 388 1150 802 237 453 1047 611 322
3071 322 1034 1314 260 668 1375 466 499 1190 917 337 791 417 9 700 1204 367 63 1054 471 -392
3091 -392 423 867 98 -14 904 98 -319 48 289 -638 -157 301 -237 -181 309 -268 -992 -335 -228 -1000
3111 -1000 -434 48 -1028 -868 215 -131 -919 -344 109 -993 -1028 -236 -839 -1303 -471 -350 -884 -438 -321
3130 -321 -908 -908 -495 -1113 -1015 -418 -151 -915 -668 105 -551 -1020 -376 -723 -1101 -136 132 -715 -369 270 -295
3151 -295 -814 200 286 -523 -128 216 -227 20 401 285 330 267 387 19 -59 476 183 410 930 838 67
3172 67 1075 830 -45 5 853 251 237 1430 1397 441 949 930 340 694 1259 671 496 1279 1038 879 935
3193 935 1070 710 700 1188 865 247 1003 760 131 913 1210 607 548 677 519 172 480 847 376 129 959
3214 959 416 -134 816 183 -211 -100 489 -104 72 520 308 -358 27 54 -413 -303 -85 -490 -600 235
3234 235 -386 -1037 -210 -313 -939 -691 -365 -969 -1460 -436 -629 -1001 -553 -373 -680 -1182 -679 -1002 -1366 -603
3254 -603 -439 -1416 -662 -536 -1230 -1220 -745 -855 -1338 -608 -336 -1025 -989 -533 -890 -1234 -719 -518 -1003 -540 -256
3275 -256 -932 -377 -319 -487 -843 125 -159 -938 -442 110 -487 -789 286 200 -504 31 62 -148 -208 446 -9
3296 -9 -45 679 448 255 399 535 95 225 961 682 173 907 779 442 307 1098 669 502 1010 556 451
3317 451 874 1056 500 722 1642 519 558 1112 884 136 689 1305 775 473 1175 754 331 855 848 374 410
3338 410 1000 412 768 1148 410 -75 497 674 -202 328 904 439 -431 388 390 -429 361 159 -102 -288 12
3359 12 -158 -305 111 -164 -424 121 49 -753 -675 -227 -501 -757 -81 -71 -728 -507 -101 -892 -616 -702 -446 -862
3381 -862 -125 -364 -920 -601 -316 -722 -1131 -447 -367 -1226 -857 -190 -598 -952 -488 -484 -912 -269 -793 -696 -358
3402 -358 -516 -890 -504 225 -461 -818 179 -202 -772 -361 132 -40 -523 60 208 -376 -76 3 -28 67 29
3423 29 -156 76 785 233 -37 467 396 -319 153 910 552 -49 524 1024 446 340 783 765 246 509 502 293
3445 293 859 756 511 930 906 486 176 907 887 123 361 1149 602 172 1109 537 436 420 619 550 722
3466 722 976 332 560 562 220 -229 724 611 73 42 735 264 -430 298 363 -5 110 34 -212 -58 -273 -574
3488 -574 -381 165 5 -415 -54 9 -796 -906 -13 -471 -663 -467 131 -662 -1263 -253 -637 -606 -962 -896 -898
3509 -898 -538 -545 -815 -655 -258 -975 -1017 -390 -408 -1125 -647 54 -1004 -1027 -473 -188 -775 -454 -653 -856 -590
3530 -590 -722 -750 -368 54 -535 -770 -248 -159 -899 -621 495 60 -634 208 422 -119 -376 25 350 401 192
3551 192 83 5 577 407 -248 545 891 262 -198 802 786 -102 447 1073 587 483 861 521 319 803
3571 803 536 571 1125 472 87 724 975 510 12 974 1238 375 133 1205 880 698 606 533 679 591 434
3592 434 686 981 531 25 290 631 570 -254 212 1156 -114 -470 412 707 -84 -52 358 404 -46 -48 -221
3613 -221 -82 80 -116 -192 331 301 -418 -334 198 -301 -680 -313 -2 -810 -584 -87 -495 -485 -662 -316 -448
3634 -448 -186 -788 -994 -279 -490 -771 -880 -275 -291 -701 -205 -286 -873 -1069 -280 -286 -657 -624 -68 -536 -606 -514
3656 -514 -998 -483 -163 -483 -561 -141 -157 -802 -139 155 -298 -310 -283 -112 -675 1 9 -368 -115 109 -106 -125
3678 -125 339 114 72 529 334 -94 340 609 27 -85 639 693 246 496 410 631 395 620 194 95 953
3699 953 986 437 729 1123 619 504 681 329 311 455 854 407 593 865 362 424 844 620 132 901 909 96
3721 96 430 475 241 -89 783 610 102 117 488 -45 -129 365 119 -47 320 335 -61 -83 213 -292 -242 133
3743 133 81 -45 -262 33 -412 -169 -222 -402 -602 -249 -217 -279 -478 -123 -416 -419 -163 -277 -976 -631 -512 -829
3765 -829 -591 -328 -707 -564 -469 -510 -905 -870 -472 -981 -811 -528 -481 -728 -274 -551 -809 -414 -396 -557 -729 -199
3787 -199 -352 -796 -389 -156 -631 -161 1 -148 -294 72 139 -278 39 110 -220 105 269 -202 -137 419 137
3808 137 -296 364 539 204 61 373 315 224 745 312 463 275 567 212 238 638 585 563 782 767 393 523
3830 523 757 566 611 709 544 171 690 750 531 250 761 564 535 668 763 513 689 784 240 210 810 261
3852 261 274 434 683 -315 31 591 -92 215 321 394 75 236 405 -275 -333 30 -167 -516 -25 -140 -306
3873 -306 94 -90 -781 -628 82 -522 -479 -319 -376 -594 -205 -202 -458 -359 -425 -437 -977 -373 -638 -899 -527 -174
3895 -174 -576 -599 -390 -515 -1192 -588 -258 -853 -489 -39 -509 -1023 -277 -352 -520 -216 -87 -807 -566 -265 -536
3916 -536 -667 -364 -369 -565 -226 -16 -589 -636 3 -89 -249 148 142 -196 -57 248 -369 -260 6 401 164 62
3938 62 417 -78 -144 308 -69 131 409 583 -86 406 693 201 367 830 124 299 306 803 287 368 622 299
3960 299 293 891 742 274 669 457 52 180 419 560 455 770 637 184 219 575 281 543 577 523 8 266
3982 266 334 229 246 756 -148 56 631 147 -40 325 422 -229 198 189 90 -264 158 186 -459 -38 146 -227
4004 -227 -179 155 -206 -500 -322 -373 -464 -138 90 -310 -522 -132 -224 -673 -555 -365 -455 -541 -142 -330 -767 -415
4026 -415 -369 -958 -656 -88 -329 -655 -474 -431 -349 -83 -425 -708 -376 -192 -303 -658 -212 -486 -383 134 -58
4047 -58 -133 -181 67 -644 -673 -42 222 -326 -55 230 -464 17 112 -108 -189 233 15 185 203 290 -195 -245 526
4070 526 211 229 78 474 39 -100 947 143 76 481 628 346 585 562 338 233 707 567 190 640 651
4091 651 381 467 718 317 556 669 653 236 578 479 299 252 641 25 102 623 373 23 436 847 -253
4112 -253 157 243 261 66 155 118 -43 42 149 -159 355 322 -98 24 126 129 -153 127 427 -33 -571 -117 -60
4135 -60 -345 -370 -29 -628 -162 -20 -414 -566 -490 -312 -495 -297 -261 -690 -554 -368 -669 -391 -404 -163 -401 -239
4157 -239 -213 -628 -660 -408 -460 -873 35 -223 -327 -255 4 -559 -902 -378 -153 -406 -471 -88 -301 -557 -113 -140
4179 -140 -712 9 -87 -89 76 220 -364 66 232 -353 -49 218 257 12 65 521 -145 -120 494 251 55 80
4201 80 169 211 363 526 334 283 676 239 358 408 494 151 364 709 722 95 515 437 196 223 367 647 256
4224 256 339 200 112 580 631 -5 449 662 266 231 331 348 164 272 695 244 0 469 378 196 74 24
4246 24 -550 44 404 -69 29 406 -132 -399 -71 265 -341 -310 127 -153 -607 9 -293 -508 -314 14 -468
4267 -468 -298 -68 -296 -519 -175 -323 -226 -204 -190 -478 -682 -272 -285 -448 -133 -127 -598 -607 -375 -626 -625 -80 -328
4290 -328 -548 -2 -315 -601 -333 -68 -614 -365 -455 -184 -405 -121 -192 -576 -175 268 -193 -516 77 -130 -388
4311 -388 -46 109 -107 -111 238 15 -180 225 418 -104 62 155 148 155 447 350 213 233 545 33 -138 867 380
4334 380 55 623 249 212 53 644 533 282 792 431 193 557 642 468 497 464 570 466 661 724 -107 295
4356 295 473 82 224 600 146 162 254 542 39 326 373 -135 3 169 292 -297 231 195 46 6 564 -216
4378 -216 192 -141 -83 -147 -231 120 -84 165 47 -306 -307 -118 -30 -241 -28 -187 -629 -390 -33 -373 -423 -207
4400 -207 -231 -502 -632 70 -644 -319 -276 -338 -636 -405 -233 -429 -394 -283 -200 -452 -272 -64 -499 -513 -308 -385
4422 -385 -368 -255 -341 -444 -152 -232 -673 -318 162 -269 -239 -49 -192 -480 -272 -16 -242 -333 150 -331 -94 381
4444 381 -145 -271 110 266 -146 -47 355 226 -117 578 401 -62 62 331 58 225 503 475 33 740 172
4465 172 177 582 537 86 344 566 698 299 258 947 355 549 624 446 291 508 377 52 156 495 204 388
4487 388 392 288 -175 411 366 331 209 247 394 -144 312 572 6 354 159 169 376 271 -104 -72 286 372 -9
4510 -9 -18 221 -232 -157 188 -176 -445 6 -63 -375 -67 -488 -186 -441 221 3 -464 -160 -159 -486 -377 -87 -304
4533 -304 -390 -69 -314 -306 -306 -214 -525 -390 -331 -612 -375 -386 -624 -549 -355 -11 -355 -367 -171 -142 -612 -242 -215 -524
4557 -524 -381 -198 -246 -290 83 -421 -13 -130 190 -356 -72 283 -17 -131 25 -68 -40 386 502 -90 -105 212
4579 212 277 9 130 271 12 167 565 -165 132 574 160 -63 369 634 293 275 690 1 279 476 151
4600 151 335 575 421 140 61 648 451 379 487 683 557 128 559 242 181 420 221 -175 221 352 -159
4621 -159 501 351 118 16 134 232 148 119 131 70 -159 80 -47 -453 -123 -62 -208 -138 440 -316 -383 -105 22
4644 22 -226 -58 -286 -541 -82 -24 -421 -90 37 -304 -571 -277 -183 -353 -633 -330 -337 -503 247 -378 -562 -309
4666 -309 -191 -781 -779 -167 -541 -675 -51 -63 -306 -266 -141 -264 -505 -39 -278 -472 -25 -24 -349 -176 -64 -271
4688 -271 -69 42 -137 -311 -129 1 -339 -193 182 -142 205 -144 276 -366 -10 174 50 109 78 199 57
4709 57 425 340 213 -35 327 301 -126 224 412 22 207 446 127 226 726 532 160 360 435 209 310 579
4731 579 173 322 511 252 152 536 216 381 287 639 262 43 401 205 53 344 370 117 381 260 275
4752 275 76 475 404 -75 261 296 103 82 291 427 -11 196 87 -320 -79 230 -98 -217 355 -186 -384
4773 -384 -71 -9 -377 -253 -280 -111 -387 -443 -64 -893 -243 105 -673 -320 -268 -318 -383 -572 -341 -387 31 -550
4795 -550 -163 -713 -163 -40 -383 -144 -150 -453 -316 135 9 -559 19 -134 -262 -161 21 -433 -126 72 -3
4816 -3 -481 -158 10 -43 27 99 -304 -31 -89 -282 -93 55 146 231 16 72 203 283 299 286 47 240 450 310
4840 310 -3 165 297 36 432 379 160 342 813 -27 167 558 161 -58 315 395 290 229 383 227 468
4861 468 519 377 302 62 401 -69 235 273 177 -110 387 429 39 180 196 122 286 230 64 396 113 267 -442
4884 -442 77 171 -245 -168 501 262 -78 -37 -94 -302 -92 -3 86 -19 226 -99 -396 -59 -309 -485 -285 -173
4906 -173 -139 -324 127 -113 -604 -395 50 -183 -357 -267 -294 -475 -159 -129 -416 -281 21 -195 -185 -168 -210 -453
4928 -453 -271 401 -435 -346 -183 -119 -423 -321 -215 -486 -256 -23 -571 -91 227 -231 -241 -100 -185 -150 -405 177
4950 177 -279 -18 -3 93 -214 88 203 -45 133 178 -244 108 315 248 98 225 304 -14 186 497 -1 128
4972 128 623 616 337 405 571 119 323 309 291 246 341 310 257 237 483 395 223 357 164 207 225 -103 223 172 251
4997 251 272 183 383 56 206 379 425 329 -12 538 293 261 165 219 186 -96 116 56 -288 109 -183 87 67
5020 67 161 -247 11 132 -84 -63 -206 -259 -198 -280 102 -186 -139 96 -309 -380 -283 -355 -474 -182 -84 -727 -93 -295
5044 -295 -326 -257 -243 -365 -660 -468 -220 -202 -502 -540 -322 -353 -245 5 -503 -292 -237 -236 -435 -591 88 -210 -163
5067 -163 -121 -30 -489 -91 -200 -497 109 -25 -61 -165 220 -47 15 266 301 -326 73 19 -192 -111 114 255
5089 255 -34 337 -182 215 61 506 167 213 323 135 104 469 462 131 204 302 429 271 219 331 628 343
5111 343 257 330 184 541 347 375 320 515 -143 306 577 319 269 550 365 247 505 371 91 236 130 -49
5133 -49 518 161 106 40 202 405 13 43 201 -326 -3 250 -149 -31 -148 75 -47 -14 125 -110 -91 -83 -48
5156 -48 -496 -161 -332 -422 -71 -142 -422 -214 -72 -151 -525 16 -306 -463 -318 -170 -528 -98 -293 -193 -303
5177 -303 -167 -77 -292 -241 -47 -193 -320 -127 -52 -474 -167 -210 -44 -241 -90 -113 -443 -169 -217 -278 -36 -30 -173
5200 -173 -131 -194 -90 108 33 108 -5 -75 271 202 -124 343 226 -211 90 93 126 -120 419 403 5 292 330 -29
5224 -29 -150 509 184 42 456 182 107 -82 182 284 152 299 268 392 52 315 79 377 193 312 368
5245 368 163 105 144 267 314 62 144 325 -85 -153 225 147 109 429 323 65 -83 367 290 51 -30 -230 129
5268 129 -34 99 -90 -171 219 53 -108 -274 -62 -265 -222 22 -109 -42 12 -241 -402 -306 -362 -82 -283 -88
5290 -88 -179 -152 -215 -365 -405 -310 -262 -196 -282 -87 -265 -271 -103 -194 -66 -533 -50 -367 -148 -444 -147 -544 -97 -139
5314 -139 -479 -202 -363 -295 -134 147 -197 -235 -231 -8 -54 -442 62 -91 -405 96 -79 -179 -184 45 -44 98 591
5337 591 -105 -396 100 160 204 265 173 90 114 461 60 242 203 459 -104 190 217 7 14 314 424 -69 -59 457
5361 457 213 490 279 219 246 183 420 213 177 503 400 -81 470 294 171 270 425 10 169 472 147 116
5383 116 276 152 87 389 193 441 123 -258 77 34 13 118 -180 169 189 -156 -44 158 252 -251 -131 115
5405 115 -297 -121 -71 80 -437 261 216 -109 -296 -188 -292 -439 98 -97 -354 -139 65 -163 -240 23 -147
5426 -147 -224 -246 -232 -155 -95 -149 -323 -399 -225 -255 -516 -390 -237 -745 -152 -313 -346 -359 -27 -14 -317 -184 -112 -117 -216
5451 -216 -33 -523 90 -219 -49 -54 -116 -61 -253 -51 96 -250 -20 117 190 -31 88 292 -174 -120 219 146
5473 146 -22 191 -104 159 -49 362 280 -176 94 211 178 65 557 220 26 385 106 -41 258 313 432
5494 432 247 359 39 369 212 11 64 116 192 114 446 327 235 169 107 280 -4 245 167 331 -97 171 470
5517 470 246 320 54 45 452 397 -5 -147 -60 231 2 139 -17 -229 131 -49 202 -28 -110 -91 -374 -475
5539 -475 -221 -482 -111 16 -330 -366 -317 -199 -501 -325 -118 -649 -379 -116 -74 -467 -111 -129 -422 -284 136
5560 136 -345 -250 -118 -106 -328 -242 -140 -620 -218 -24 -232 -382 -138 -367 -228 -237 -283 169 -48 106 49 -388
5582 -388 327 -177 -116 -301 -31 -105 132 248 -125 -123 138 79 173 -116 184 20 -123 254 437 -42 -103 148
5604 148 132 74 377 67 -176 316 -77 24 475 456 -27 -97 342 341 224 269 154 190 262 115 -1 147 355
5627 355 459 87 222 252 258 236 277 287 379 509 221 153 -52 214 365 237 -74 -6 -15 88 59 117 273 19
5651 19 24 -67 376 -72 -283 -125 141 153 -15 206 137 -361 -16 45 -275 -191 -195 -40 -138 -198 -363 -371 -4 63 -541
5676 -541 -401 -219 -78 -35 27 -171 -490 -212 -158 -401 -245 -35 -427 -338 -106 -505 -271 -247 99 -423 -284 -97
5698 -97 -184 -160 -345 -230 -114 -295 -169 -257 -311 29 -162 -330 300 95 -519 -140 47 119 -139 -30 76 -131
5720 -131 109 115 222 -59 163 172 -106 133 335 176 198 44 -2 -48 546 -239 -26 552 373 284 61 205 40
5743 40 195 117 254 340 362 381 135 -12 295 252 128 535 167 90 89 287 1 171 387 136 381 206 326
5766 326 70 -88 161 19 0 261 -65 21 186 210 -253 -33 289 39 -326 168 -243 -138 120 -38 -9
5787 -9 -221 307 -188 65 -8 -87 -185 -104 -77 69 -51 -3 -26 -296 55 -199 -239 -153 -190 -9 -78 -136 -194 -513 -205
5812 -205 37 -47 -212 -117 -453 -401 -179 -289 -327 -130 -31 -329 -1 100 -340 -136 44 44 227 -86 -53 -54 -13 -343
5836 -343 -168 -102 111 -22 4 -115 -30 -82 -224 380 28 12 51 126 37 39 85 133 -17 143 96 -22 174 352
5860 352 66 94 149 227 168 221 185 -6 217 275 141 223 50 301 170 214 265 -18 287 170 -78 262 261 129
5884 129 -16 273 224 315 170 224 232 -23 235 422 105 106 32 170 -73 265 108 9 19 212 51 -333 -16
5907 -16 -201 -348 244 204 -146 -223 48 -164 -53 260 35 -22 95 137 -92 -132 -148 -208 -453 -52 -450 4 -206
5930 -206 -196 -355 -286 58 32 1 -275 -78 -233 -54 202 -372 -365 -241 -33 -14 -429 -282 -98 -86 -64 -141 -40
5953 -40 38 -201 -123 -45 98 -86 49 93 -278 -232 -57 15 -202 -9 40 -148 -43 -28 -122 78 -367 -49 -37 127
5977 127 -57 -344 72 145 153 -168 -255 132 142 68 224 -87 23 350 242 27 368 542 54 189 341 174
5999 174 37 375 149 252 309 297 223 292 569 141 -34 328 36 173 145 590 197 -69 137 64 -7 343
6021 343 485 -120 -13 491 101 10 -148 228 187 94 497 -30 81 101 69 -362 71 -76 -104 93 -2 -108
6043 -108 225 17 134 -26 -194 -164 -331 -68 41 -65 -172 -134 156 -236 139 -214 -115 -314 -23 -251 -494
6064 -494 -298 -195 -86 1 -293 -340 -220 -273 -231 -365 -291 -272 -383 -341 -111 -14 -187 -215 -275 -61 -424 -159 -244 -305
6088 -305 -86 -377 -135 16 -189 -225 -33 -184 -195 -62 -9 -180 -263 73 83 64 -75 148 63 22 312 99 21
6111 21 185 259 -145 52 372 445 80 8 80 -90 -65 248 193 115 454 90 310 354 314 322 271 183 79 -76 119
6136 119 279 101 378 83 192 127 293 472 129 376 303 3 40 339 43 167 184 97 151 325 424 23
6158 23 -163 19 -363 -132 44 -113 128 119 99 -36 -175 145 -39 -84 -291 40 -246 111 -24 -65 158 -439
6180 -439 -406 -49 -95 -376 -330 -45 73 -410 -399 -244 -329 -198 -410 -66 -451 12 37 -263 -57 -355 -87 -257
6202 -257 37 -313 -245 -200 -250 130 -261 -116 -124 -14 -91 -251 -121 -155 71 75 -156 161 -54 -90 -248 -49 -219
6225 -219 -87 131 -86 -158 -5 224 -257 87 -4 175 189 214 -69 -141 132 234 267 -33 374 -39 142 460
6247 460 295 16 -13 98 -56 88 20 327 71 309 240 234 379 373 233 256 383 -56 7 399 381 75 180
6270 180 -148 397 268 -40 178 -90 161 210 89 -31 212 43 -16 187 469 378 10 145 -6 136 -205
6291 -205 -104 76 9 197 93 -336 -284 -90 -114 128 -43 -8 112 -101 -636 -334 -91 -141 -130 -116 -29 -129 -416
6314 -416 -176 -182 -228 -311 -289 -293 -250 12 -373 -189 -222 -364 -122 -172 2 -279 -220 3 -27 -382 -227 71 -102 -187
6338 -187 -176 -100 -73 -349 -272 -205 5 -117 -147 -303 -54 -271 -28 27 4 41 -22 191 -338 197 147 -138 2 254
6362 254 -27 -119 432 -142 -134 -310 204 38 -53 343 32 -108 447 319 44 96 288 379 266 564 84 221
6384 221 215 74 -7 238 11 126 48 265 339 185 339 326 5 98 276 256 -64 128 110 -254 113 355 81
6407 81 308 385 93 90 -12 -29 -7 159 33 0 246 204 306 -2 71 -83 -36 -4 39 32 -46 263 85 -81 114
6432 114 61 -239 -221 -90 -360 3 72 -64 -233 -137 -4 -252 6 -121 -105 -103 -3 -264 -76 -309 34 -163
6454 -163 107 73 143 -320 39 -1 -215 -197 -103 38 -285 -261 -80 -328 -140 46 -174 10 -127 -92 -23 -122 82
6477 82 -294 -32 -23 -139 52 147 102 -214 44 -18 -172 -378 170 -8 -42 128 287 47 156 -22 156 39
6499 39 212 366 96 224 340 -3 -112 576 94 159 -56 13 330 291 279 256 196 249 391 134 255 508 157
6522 157 226 303 -115 41 156 45 203 102 315 93 21 160 147 65 178 134 117 -67 480 33 229 -43
6544 -43 123 249 150 -34 -31 -58 60 -275 -138 58 -146 -90 61 -134 -2 33 -161 -133 -236 -137 -152 -331 66
6567 66 22 -432 -105 -293 -11 -274 -202 -46 -241 -388 -298 -327 -174 -220 -103 -206 -254 -54 -316 -368 -101 -247 -85
6590 -85 -137 -305 -135 -39 -198 -54 -261 66 -241 -292 -27 -155 -316 96 -95 -481 -11 108 -165 -153 -223 123
6612 123 -5 -68 183 214 276 -267 173 100 62 49 -68 -89 32 -99 169 -17 -81 79 129 217 84 370 253
6635 253 104 144 180 220 -6 -52 154 5 397 329 506 100 290 156 -6 255 287 282 185 376 271 209 139 278
6659 278 19 138 -51 -25 50 68 176 69 48 -104 -96 -57 263 240 -86 58 -9 11 -111 78 -249 -199 270 -42
6683 -42 -263 -91 -236 -237 -342 254 -250 9 -66 126 -492 -256 60 -224 -192 -178 -170 -497 -155 -280 -423 -203 -74
6706 -74 54 -139 -13 -35 -411 80 -22 -51 -217 42 -190 -216 -402 -51 -84 -164 -18 -426 -410 -77 80 -120
6728 -120 47 -268 -223 -363 110 -205 -121 13 -183 115 146 109 115 -162 -154 -52 79 -78 93 -102 -121 396 289
6751 289 205 -14 -92 -52 -92 256 125 260 241 -74 -35 604 45 226 248 436 97 55 503 52 68 177 101
6774 101 103 407 594 -98 273 88 46 -171 237 318 127 -40 224 -118 86 191 69 -96 246 192 165 316
6796 316 354 -140 -241 164 -257 71 164 -248 -210 -128 -159 94 93 -60 -253 -316 24 88 -49 -53 -213 -88 -254 -127
6820 -127 -30 -370 24 -227 80 -243 -184 -185 -179 -240 158 -285 -371 -299 1 -173 -271 -61 -101 47 -336 -337 -378 66 -64
6845 -64 -3 81 -161 -197 -254 -172 15 -127 253 -11 -152 23 -249 -407 81 151 -80 -106 98 36 332 5 -1 -221
6869 -221 -111 171 -72 -62 123 173 -129 -13 73 -49 101 93 185 28 49 177 107 -9 379 205 79 404 87
6892 87 232 362 336 147 251 341 -26 71 105 152 31 335 247 162 0 230 160 -17 317 168 227 154 166 170 264
6917 264 214 115 55 -157 523 -128 -62 130 112 -56 383 -104 -204 228 151 -87 14 -72 20 -241 -76 258 -331
6940 -331 -64 15 -243 -240 305 29 58 -106 -18 -137 -23 -30 46 -159 150 14 154 -137 -323 -296 -273 -273 -107 -166
6964 -166 -18 33 80 -164 9 -409 -209 -360 -211 -143 -59 8 -147 -312 -159 -50 -177 -273 -170 -89 -127 -131 -16
6987 -16 -167 -324 -250 -438 20 -197 19 30 121 98 -44 177 83 -101 90 51 -19 133 103 180 -284 89 289
7010 289 29 129 5 68 281 134 -14 333 144 120 -3 293 271 -29 219 286 115 383 261 146 204 3
7032 3 -32 2 -54 -14 279 181 136 84 63 104 121 385 81 2 436 32 -38 232 37 -90 254 17 -65 94 12
7057 12 66 -184 190 185 -198 2 -149 -294 -27 36 -413 -1 -92 -164 -29 48 -241 -123 -42 -195 -245 -99 -159 -320
7081 -320 -50 -121 -123 -230 -94 -307 -337 -276 248 -183 -421 -274 -83 25 -172 -89 26 -394 -170 -164 -157 41 -98
7104 -98 -340 -266 -108 -166 -90 28 -143 -220 -192 137 7 -266 272 44 114 -232 -191 -265 -85 -100 -91 117 247 59
7128 59 0 -151 -14 76 208 100 187 361 116 221 77 -137 -13 278 -174 122 123 145 -163 117 -59 143
7150 143 49 -34 144 -95 226 221 345 -130 213 164 265 93 406 159 433 17 90 83 166 94 87 -11 161 109 31
7175 31 140 122 13 169 374 77 123 8 197 128 -405 18 -281 -22 33 19 -56 44 51 -4 -74 -172 172 -518
7199 -518 -32 -253 -24 -2 32 -90 -70 -180 105 -77 -152 -162 -190 -289 -231 -23 -345 55 -149 24 -524 -95 -243
7222 -243 -295 -184 68 -58 -363 -76 81 -137 -229 -9 -200 89 -75 -317 -277 -223 -98 -56 -39 89 -188 -36
7244 -36 -298 -489 -26 229 -116 -284 172 83 -40 -121 141 -229 -26 -69 141 146 -170 147 49 11 94 5 201
7267 201 -29 -6 -56 199 210 210 55 229 226 114 -11 -142 10 -162 210 288 85 106 94 191 304 376 270 -26
7291 -26 176 148 -240 348 227 -179 14 354 256 278 216 295 97 -158 178 -74 -208 158 -14 -83 25 -114
7313 -114 -180 228 12 232 46 162 139 -298 104 43 -60 -224 -89 -53 10 196 -105 -252 71 205 -50 192
7335 192 119 -46 -351 -21 -109 -39 -363 -92 -97 -59 -22 -271 -324 283 -24 -187 17 -127 128 217 -68 -92 -167 118
7359 118 -79 -218 -98 -4 -271 -270 -170 -108 -167 39 -14 -47 10 228 -152 112 143 -32 -104 98 297 135 123 -10
7383 -10 -170 -67 -84 198 -121 109 274 64 138 263 -175 123 89 119 47 17 -247 216 133 131 112 170 166 189 404
7408 404 271 330 102 403 -112 342 254 40 428 260 460 13 1 227 260 252 206 217 182 147 222 197 228 184 -72
7433 -72 28 120 -105 332 -47 -157 57 122 -80 -164 -18 108 -39 66 44 -125 176 248 0 93 -281 -163
7455 -163 -131 -39 278 -138 43 99 -22 -26 -173 219 8 -32 -33 -46 33 -255 -237 -334 -143 26 -224 15 -476 -370
7479 -370 -397 -154 -333 -257 114 -236 -66 -231 -4 -271 -107 124 -265 -4 -18 -113 -191 -168 -338 -262 -104 -244
7501 -244 351 -25 98 206 52 -120 61 39 -26 260 225 366 205 55 -282 29 142 90 57 195 194 -6
7523 -6 216 309 361 84 51 234 72 328 225 41 4 218 163 345 305 153 34 277 151 50 356 233 110
7546 110 45 8 60 -168 60 -263 473 55 400 176 11 268 223 179 -11 236 308 -121 -157 -62 -93 148 -64
7569 -64 -70 -36 1 50 315 36 -198 -89 -45 -111 -100 30 247 -362 -69 -47 -65 -185 -264 -54 -90 -133 -30 262 -439
7594 -439 -170 19 -187 -47 -98 -192 -72 -83 -186 -276 -317 -41 -33 -290 -58 -127 -102 14 6 -164 -176 -176 172 -73 1
7619 1 -239 -153 -297 -209 93 -269 -29 -152 -294 -68 -75 -174 -67 175 -226 184 85 0 -30 217 -85 74 -31
7642 -31 50 -36 104 120 194 105 -96 210 2 287 154 -32 257 -197 155 -254 192 26 -16 315 324 -87 68
7665 68 114 175 266 102 115 97 480 99 32 152 220 316 287 73 58 170 93 -124 287 221 -148 115 -21 -5 -29
7690 -29 243 -22 53 238 56 -35 247 -40 -74 24 170 -363 -47 300 19 -37 -96 54 -334 60 -95 -139 100
7713 100 23 -282 -219 -188 -87 -85 140 -245 -268 20 -99 -128 -182 -377 -308 -482 0 -40 -178 5 -92 -318 -41 -56
7737 -56 -36 -144 -67 7 -203 -119 -124 -352 -47 -199 -15 -136 -275 -9 -424 -375 128 -248 -204 71 -168 109 27
7760 27 -148 126 -108 -156 139 -56 46 130 -268 226 46 13 -88 68 244 173 -300 166 330 6 338 -12
7782 -12 282 36 -144 50 277 91 181 -48 145 171 -192 110 0 -72 13 126 119 7 162 271 -11 290
7804 290 152 40 -75 147 178 105 254 187 -136 110 177 -149 120 47 164 -34 -32 -330 -92 -323 -64 -253
7826 -253 -4 103 -163 -127 346 -332 -167 -36 144 -132 -160 -26 50 -127 -8 -289 -481 106 -100 -21 -187
7847 -187 -283 -68 -242 10 84 -355 -81 -223 -279 -79 -209 -21 -166 37 141 -114 -169 -214 -269 -324 -241 -129 -54
7870 -54 -86 103 -265 230 -138 -320 -93 -3 39 -173 -76 106 55 38 -43 -191 -279 -89 187 -224 44 -41 -193
7893 -193 -318 94 35 112 132 169 164 -78 232 223 315 142 0 -215 19 162 255 313 294 325 54 107 326 362 169
7918 169 54 267 98 302 123 -41 -149 460 60 -146 406 258 -24 240 317 61 66 136 38 -39 89 220
7940 220 -89 -139 286 315 -2 70 78 -22 -106 125 60 58 -39 -12 -23 21 -87 -171 -134 234 -62 -84 -37 -163 63 -117
7966 -117 46 -27 -157 124 -146 -291 94 19 -262 -58 16 -263 -190 -434 70 -265 -329 -298 -49 -123 -16 -201
7988 -201 -192 24 -58 -116 -137 -127 -176 -83 -30 -183 -262 -144 -39 -106 -5 60 -214 -26 -147 -99 -88 -93 -128 -153 238 -43
8014 -43 -94 -106 3 -194 -112 28 -113 118 -217 122 -45 -200 28 192 -6 230 -105 -107 125 288 212 286 135
8037 135 -65 -286 370 226 194 119 190 368 -54 656 -226 65 284 244 0 255 -98 229 -40 88 111 -127
8059 -127 155 76 101 118 151 -123 89 30 350 -125 171 201 25 359 -113 -298 11 -58 -226 -89 -164 -108 -74
8082 -74 -90 -14 42 87 -66 -9 -245 -134 179 -33 -205 -84 -154 -167 -338 -183 13 -175 -109 -70 -250 -3 -253
8105 -253 -242 -202 -97 -54 -81 -132 -205 -47 -203 93 -177 -67 121 -170 -99 -11 -205 21 -113 175 -81 87 -145
8128 -145 149 -360 141 150 -311 -225 273 90 -172 78 -55 125 -222 163 177 68 113 171 132 35 -36 76 192
8151 192 106 9 -144 196 -159 -216 -62 -144 -39 158 229 104 104 153 -38 102 270 238 -4 18 487 360 194
8174 194 382 174 255 271 289 16 -28 209 -44 124 469 174 35 236 -82 -83 115
8191A15
$$ Imaginary data points
##PAGE= N=2
##DATA TABLE= (X++(I..I)), XYDATA
0 0 0 0 0 -8 8 -1 8 -8 16 -16 24 -29 35 -40 51 -64 75 -88 104 -123 147 -168 195 -227 260 -296 336 -383 436
29 436 -489 551 -620 694 -777 868 -965 1074 -1192 1323 -1465 1623 -1795 1990 -2201 2441
45 2441 -2708 3010 -3354 3752 -4214 4761 -5419 6230 -7261 8614 -10483 13242 -17731 26296
59 26296 -48485 223060 450181 -77553 -112346 164582 171671 -125638 -64825 198105 201582
70 201582 4126 50854 179114 106513 -4716 138488 255282 78257 -119401 2673
80 2673 167062 89031 9350 169243 259496 85670 -45962 64159 134863 38547 11667
91 11667 129918 166015 66569 2587 41488 96180 115068 90515 36777 9013 40606 68078
103 68078 45228 30361 75836 114037 70679 -2987 -18475 9366 33311 70315 105572 60429
115 60429 -18525 3245 66693 8891 -75225 7713 126802 51891 -80133 -29689 80495
126 80495 35370 -48438 7716 70935 -18773 -116735 -52462 46563 15499 -37677 24511 72662
138 72662 -25600 -115511 -56409 2771 -49769 -60503 30743 38434 -70279 -84176 18077 25544
150 25544 -75537 -91889 -12730 -6685 -85059 -97303 -13111 35344 -9496 -52163 -35741 -36716
162 -36716 -88467 -96265 -33251 -8494 -47337 -48132 -7294 -23805 -78851 -70846 -21329 -23119 -66175
175 -66175 -77150 -48619 -29543 -40178 -43599 -14582 531 -45690 -93830 -72029 -35706 -49548
187 -49548 -52061 -1772 17652 -34270 -69121 -47005 -34959 -54058 -51837 -21281 -15445 -41072 -48408
200 -48408 -20174 -4088 -27609 -41966 -18334 -19109 -66658 -75516 -17363 13061 -14814 -20360 7827
213 7827 -5987 -51934 -54629 -25234 -19272 -26346 -13677 2773 -2655 -17939 -18780 -5763 -6076 -27124
227 -27124 -36119 -19110 -10621 -18421 -6910 17320 13776 -7477 -14326 -15694 -24237 -22618 -8919 944
241 944 9253 13077 1381 -6117 5436 5513 -13826 -13795 5142 786 -13303 2507 26680 22346 8485
256 8485 9701 10039 -5151 -19088 -10739 15300 27022 17447 18965 34829 23320 -10381 -7064 20568
270 20568 12813 -6305 16371 42822 23972 6424 28027 40080 15113 -1542 13171 23880
282 23880 12285 8281 28630 48029 37700 18561 23903 32987 12919 -3188 18814 38732 26063
295 26063 22232 45556 47963 23408 16717 27694 22561 9480 15532 31567 39524 37659 34701 36243
309 36243 35935 22555 8214 14588 26583 22197 21912 37572 41882 29744 25857 29037 20517 11752
323 11752 13858 15682 16968 24489 28850 28281 32745 31242 14337 6353 10532 5670 -1590 11376 26718
338 26718 23935 20376 23922 17216 2544 -2503 -3251 -4719 1045 7689 8704 12833 15865 5720 -3752
353 -3752 -1102 -6071 -17192 -13067 -1489 -4284 -6972 2394 3673 -7217 -11283 -10904 -19065 -23867 -19208
368 -19208 -17521 -15689 -7089 -4940 -11815 -13759 -16357 -27694 -33137 -27183 -25036 -24194 -14047 -9300 -17109
383 -17109 -21059 -21049 -29402 -36475 -31937 -28986 -28425 -20498 -15290 -20124 -22046 -19486 -26655 -35876 -33847 -30788
399 -30788 -31238 -25293 -18080 -18500 -18120 -15375 -20657 -28905 -29691 -29644 -32567 -27302 -19153 -17739 -12910 -5385
415 -5385 -9162 -19441 -22252 -24498 -30948 -28249 -16497 -10736 -7120 -235 -1224 -10059 -13777 -15265 -19556
430 -19556 -17362 -9885 -8278 -5923 1832 3718 -629 747 1608 -6723 -10048 -5289 -4742 -5601 3980 12051
446 12051 10646 9742 9883 2750 -1644 999 794 344 9087 16118 13263 14352 17149 10679 3783 7037
462 7037 7319 3002 9100 20549 20683 17065 18006 15755 9998 8608 7320 7320 15137 21249 16386 15043
478 15043 21210 18733 11018 13061 14716 7048 7050 16177 16928 12781 18805 25533 20096 11209 6753 4818
494 4818 6232 7711 8696 15791 25373 21696 11764 12193 12427 753 -2262 8386 11711 6450 11420
509 11420 19374 14850 8573 10024 8438 1503 -669 2055 5790 6967 6347 9119 16604 14349 49
524 49 -3823 5619 3520 -6930 -2152 9389 8770 5900 10388 7807 -1591 -838 1855 -3555 -7128 -279
540 -279 7507 8904 6953 2771 731 1880 -2459 -8844 -4372 3715 3510 2797 6424 3436 -3313 -1317
556 -1317 497 -5666 -5105 2681 -530 -5944 2933 8447 -687 -4759 3483 2415 -8786 -11681 -4994
571 -4994 -606 1235 3626 5001 2359 -3892 -7998 -5218 -6090 -13862 -7441 10976 8422 -11520 -8588
586 -8588 9529 553 -20090 -12556 2864 -6812 -16927 -2809 7443 -3318 -10767 -1135 2443
599 2443 -13751 -24770 -11196 2559 -7653 -17268 -1071 9112 -11359 -23075 -2808 2728 -22721
612 -22721 -26426 -467 1514 -21797 -17811 7445 4896 -17594 -20646 -10112 -13941 -24047 -16780
625 -16780 301 243 -13208 -12205 -2287 -12520 -29466 -18321 1926 -6778 -22890 -12526 -634
638 -634 -11853 -17695 -4689 -2432 -14762 -16715 -11054 -14333 -16180 -6965 416 -1260 -4579 -8836 -13683
653 -13683 -14650 -11534 -7424 -4581 -4344 -2740 791 -2088 -10476 -7020 3331 -2288 -13048 -4871 4951
668 4951 -4366 -6273 12215 13810 -6985 -9064 7085 2373 -13157 -1141 20580 15103 -2529
681 -2529 1249 14024 7358 -5957 3575 21220 12894 -6766 1372 23336 16263 301 15221
694 15221 29643 8595 -10673 6522 19901 8139 8938 30331 31181 7818 -303 12853 16886
707 16886 6355 7287 23076 27910 12604 3801 17383 26864 14468 7354 17434 18708 4805
720 4805 3840 17807 23350 19114 19580 19021 11502 5068 4854 8369 15191 17682 12634 12763 18621 12383
736 12383 2067 8942 19729 9426 -4771 1455 13850 10473 4355 11683 21052 12102 -6227
749 -6227 -10050 2483 7070 -1306 3754 17859 10304 -9959 -6406 8158 384 -9981 2155 10059
763 10059 -7744 -17756 -1368 9289 72 -5751 1240 1187 -13577 -22767 -12478 2212 1934 -5390
777 -5390 -2843 -15 -11094 -20143 -12319 -5340 -8510 -7514 -3954 -9180 -14263 -8907 -5277 -8497 -8167
792 -8167 -8096 -14568 -16467 -10708 -9412 -9568 -2096 252 -10812 -18557 -13162 -9300 -12553 -12103 -4057 -727
808 -727 -8144 -16897 -12603 -2113 -4461 -13483 -8782 -1885 -12016 -18687 -4390 5226 -5554 -8479
822 -8479 938 -5643 -22065 -15657 2895 2427 -6700 -1180 5152 -5032 -16855 -11438 1951 2042 -6935
837 -6935 -4665 4068 -1542 -11875 -3305 9387 1240 -9111 -1603 1329 -11853 -11458 7164 11722
851 11722 -899 -1895 5277 -745 -11845 -8847 2002 5207 1249 -343 2858 3531 -1387 -3327 2400
866 2400 2486 -4771 -5291 813 675 -1091 5744 8947 1869 -2998 -2241 -5073 -5717 896 4336 2151 3689
883 3689 4826 -2086 -4107 3377 4232 -3565 -3717 2043 307 -4446 -463 8084 9500 2434 -4304 -2399
899 -2399 -1137 -6322 -5552 7467 11787 535 -1428 7477 1453 -11448 -3529 10814 4168 -6368
913 -6368 1322 9674 2162 -3326 4135 9661 3026 -4097 -892 4815 2559 -1346 5977 14414 6841
928 6841 -3609 1926 7727 -455 -3001 7822 11461 2637 3272 10696 8155 1890 3798 6668 4097
943 4097 2347 4047 6625 10170 11342 7875 5412 6240 4062 1899 5317 8132 7842 9544 10207 6523
959 6523 5474 7670 6181 4651 8014 7080 2159 4183 11712 8645 3662 9166 11745 3202 -1529
974 -1529 3015 5332 2933 5173 10173 10115 5355 1626 2203 4203 996 -2956 2792 9185 3910 -1152
990 -1152 5359 7126 -1866 -3744 2731 614 -6244 -2032 4428 1432 -2378 59 1699 -920 -5093
1005 -5093 -6638 -4742 -2635 -4864 -5440 -1143 292 -4322 -5042 -2319 -6497 -12975 -8642 -4094 -7435
1020 -7435 -7269 -2285 -2242 -6447 -7716 -7778 -11201 -11295 -8461 -7732 -7336 -5157 -6147 -7320 -6105 -7752 -11646
1037 -11646 -10082 -7421 -9667 -10271 -6482 -6466 -8308 -5514 -4663 -8794 -10306 -7337 -9181 -11095 -7438 -4893
1053 -4893 -5369 -3472 -2243 -6127 -8572 -7287 -7660 -8309 -5373 -2809 -3354 -939 -481 -3903 -5689 -2874
1069 -2874 -3613 -5863 -2868 -123 -2096 -738 2353 459 -2254 -340 -202 -2549 -1274 1078 326 1198
1085 1198 4037 3342 2302 4203 3332 -144 420 2559 936 2089 7227 7598 5042 5357 5381 1697 1011
1102 1011 3739 3336 3884 8116 8917 5443 5471 6134 3193 2835 4469 3770 3365 7302 7910 4580 5774
1119 5774 7846 4818 2446 4322 3734 1442 4015 5765 4055 5525 7606 5280 2833 3178 2068
1134 2068 -695 1279 3214 2891 4915 7649 4147 491 1987 954 -3279 -1508 2785 2432 1832 3736
1150 3736 3044 -285 359 330 -2182 -2204 177 -1069 -836 1261 794 -389 1575 983 -3683 -3493 -667
1167 -667 -2612 -4647 -598 2088 343 -105 630 -1980 -3313 -2721 -4093 -4423 -409 1143 -561 373
1183 373 1590 -1682 -3522 -2069 -3183 -4318 -514 1691 -381 -911 1339 21 -2124 -1170 -1245 -2133
1199 -2133 142 608 -2051 -653 3138 1682 -1005 863 1522 -1961 -2464 -133 -369 74 2967 3908
1215 3908 1590 1225 647 -2340 -1673 289 -60 1406 4928 2988 -556 2105 2650 -1870 -2645 1787
1231 1787 2282 -976 590 2680 2475 1962 1367 -810 -888 811 -1630 -2031 1379 2497 -223 1063 2961
1248 2961 -731 -3169 -56 325 -3709 -3080 557 572 -728 436 436 -169 -1241 -5065 -6084 -1841 -626
1265 -626 -2993 -894 4170 115 -6175 -4654 -1930 -4616 -5461 -1618 -365 -2561 -3103 -2929 -2469 -2405 -3444
1282 -3444 -3946 -2406 -3874 -8304 -5527 1191 -638 -5391 -1669 1936 -4495 -10079 -5664 -1788 -3228
1297 -3228 -3170 -315 -314 -2086 -3481 -3773 -2258 -2127 -4750 -4278 66 -915 -4248 -140 4233 -279 -4694
1314 -4694 -1441 -25 -4122 -3227 2638 3386 1034 -76 549 996 692 -374 -145 3504 2761 -1465 -63
1331 -63 4967 4565 2719 4538 4782 -360 -1952 1906 3578 3938 6648 7688 5740 3849 1233 176
1347 176 3432 6810 4687 3773 7342 6725 2048 3039 7397 6767 3887 3734 4549 3189 3043 4764 7146
1364 7146 9027 6443 2476 3076 4264 897 501 6903 8986 3213 2302 6604 4600 -585 2070 6134
1380 6134 3056 -1077 630 4088 3958 2416 2915 4730 2868 -3544 -4721 1405 3363 -959 909
1395 909 6101 1277 -5180 -2208 2366 -1614 -3777 554 1182 -3957 -4805 -919 634 216 -1466 -2737
1411 -2737 -3489 -5617 -7766 -5129 565 566 -2624 -1404 -1723 -7105 -9226 -4287 -2326 -3529 -2614 -2288 -4359
1428 -4359 -4707 -3528 -4407 -3778 -1800 -4288 -8048 -5995 -3090 -4355 -3583 331 -587 -5946 -6860 -4808
1444 -4808 -4378 -4945 -3679 -1325 -726 -2893 -5882 -3199 564 -2315 -5393 -1559 -138 -6375 -6458 2345
1460 2345 4090 -2632 -2407 1570 -2486 -7349 -3821 2380 2544 -83 110 1700 -565 -3992 -2311 2858
1476 2858 3002 -1490 -1504 3318 942 -3553 1239 6943 2792 -2185 568 1378 -2226 -598 4190 4850
1492 4850 3161 2478 1693 -674 -801 -256 1255 3330 3418 1271 1520 2480 1112 781 2349 1655 -602
1509 -602 301 1498 528 1989 4559 2517 -371 1504 521 -3230 -1419 4033 2481 -1195 1235 3310
1525 3310 -230 -1803 632 1746 -578 -2024 -1172 332 4 -958 1610 4394 637 -4819 -2745 452
1541 452 -2604 -4021 3303 5317 -1153 -3091 1136 -797 -5295 -2430 2410 573 -2341 -1432 488
1556 488 572 -1087 -309 2061 947 -3345 -4023 340 796 -1812 1075 5382 1363 -3479 -1164 688
1572 688 -2152 -1814 2248 2460 428 1099 2099 1135 898 1292 163 -18 762 382 1622 3930 3565 2002
1590 2002 2406 1836 -303 351 2376 2296 2253 3793 3516 1241 2752 3970 1727 1358 3636 2535 -267
1607 -267 1828 4477 3440 3006 4794 3939 1158 600 1140 1215 2571 4048 4002 4440 3357 590 320 2486
1625 2486 1676 -354 1932 3941 1199 -5 2825 2964 133 233 1629 -168 -1547 426 566 505
1641 505 1408 934 41 172 -700 -2431 -1768 -113 -1639 -2209 216 148 -1649 -1328 -415 -2825 -4273 -2731
1659 -2731 -2952 -2970 -1163 -942 -2357 -2191 -2565 -4646 -5246 -3151 -3317 -4444 -2514 -1384 -3711 -4006 -2628
1676 -2628 -3318 -4823 -3844 -3440 -4901 -4588 -3645 -3724 -2991 -1981 -3271 -3968 -3334 -4699 -6224 -4041 -2084
1693 -2084 -2743 -3140 -473 -1271 -4227 -3643 -2335 -4233 -4125 -1692 -1466 -1921 -681 -667 -1866 -1964 -1693 -2562
1711 -2562 -2135 -865 -1395 -1273 786 633 -892 412 1067 -716 -1163 549 202 -1094 1131 2682 1368
1728 1368 1603 2956 1725 -295 540 1096 471 1778 3576 3238 3028 3558 1976 1217 2129 1716 1205 3012
1746 3012 4374 2905 3315 4228 2821 1097 3033 3669 1341 1813 4061 3077 2055 3651 4318 2521
1762 2521 2195 2870 1554 1237 2056 2046 2413 3842 3596 1934 2660 1921 -580 -140 1981 1477 722 2976
1780 2976 3540 831 605 1850 -37 -1755 51 1201 256 667 1327 686 347 589 -507 -1144 -79
1797 -79 -597 -1685 -175 249 -1033 -170 1270 -819 -2286 -886 -1250 -2957 -2324 153 -374 -665 876
1814 876 317 -2287 -2250 -2002 -2664 -2060 -284 -468 -491 318 -494 -1970 -1180 -1247 -2388 -1583 -334 -801 -1120
1833 -1120 380 691 -1327 -466 382 -1437 -1630 60 -368 -1708 318 1525 288 145 843 12 -1274
1850 -1274 -646 -314 -770 1056 1894 1027 1718 1640 -142 -952 399 -201 -391 1320 2924 1167 673 2336
1868 2336 1049 -577 808 2011 209 493 1455 1347 765 1965 1695 733 1216 997 -366 -20 1456
1885 1456 672 922 2036 1614 -55 644 620 -1134 -1451 366 573 -337 1404 1504 -214 -500 -78 -1714
1903 -1714 -2019 -426 -336 -1082 129 521 -1296 -1942 -837 -1690 -2141 -1184 -1344 -2109 -1160 -1125 -2139 -1661 -405
1922 -405 -2277 -3037 -1859 -2565 -4074 -2562 -282 -1565 -2192 -496 -1223 -3933 -3764 -2221 -2692 -2763 -1502
1939 -1502 -1202 -1281 -1367 -2481 -2691 -1688 -2157 -3604 -2082 -516 -1793 -2567 -170 -117 -2771 -2169 -763 -1793
1957 -1793 -2762 -942 -284 -758 -777 -106 -667 -179 -122 -978 -986 25 -859 -1144 1095 1906 1067 1016 2039 137
1977 137 -1208 -264 833 804 2017 3264 1922 1724 1889 288 80 2396 2837 1277 1566 3260 1903
1994 1903 737 2563 3878 2390 1969 1870 1430 1784 2038 2656 3619 4871 2972 1104 2632 2061 213
2011 213 1567 4374 2920 956 2502 4032 2222 1077 2343 2739 520 -5 1156 2621 2904 1909
2027 1909 1675 2488 1144 -1668 -689 2448 1621 -636 1130 2394 -533 -1776 1426 1520 -405 -876 -206
2044 -206 -555 -1405 -1054 182 1563 1115 -1462 -2345 -920 -1936 -3607 -1136 1800 41 -2078 -1018
2060 -1018 -997 -2964 -2632 -1403 -914 -1189 -1895 -2372 -1823 -1016 -1468 -1965 -393 -664 -3943 -4004 -1003 -941 -2648
2079 -2648 -539 826 -1240 -3355 -2271 -1650 -1595 -1686 -1560 -690 -202 -1385 -2507 61 1212 -1841 -2572
2096 -2572 148 -499 -3004 -923 2600 1766 -1081 -313 405 -1090 -2005 -547 1731 2043 316 -698
2112 -698 787 884 -954 -638 2841 2585 -939 -962 1894 1078 -438 2054 3672 1972 -559 -388 220
2129 220 726 1261 1809 3135 3325 545 -887 1110 1994 271 429 3152 2318 -803 486 2469 1934
2146 1934 342 1007 1458 492 -754 -544 1703 2869 1620 -277 745 1070 -1480 -1932 1783 2146 -1105
2163 -1105 -827 1350 72 -1700 -382 1671 200 -1536 -1918 -972 -399 -811 -620 1515 1529 -1972 -3884
2180 -3884 -1707 -670 -2505 -1420 1801 555 -2958 -2021 -761 -2090 -2629 -901 -292 -1383 -2230 -2761
2196 -2761 -1764 -339 -934 -1182 -259 -916 -3814 -3413 -278 -188 -1659 -36 1100 -1504 -2848 -1626 -967
2213 -967 -1147 -668 -597 -488 30 -319 -1263 -209 1108 -787 -2556 204 627 -1216 -446 2519 1684 -605
2231 -605 -155 591 6 -359 297 1237 2037 946 -507 1104 2413 658 -425 2220 2746 -781 -890
2248 -890 2411 2765 911 2100 3614 1762 -454 260 1495 2203 1818 1947 3162 2927 639 -481 1927
2265 1927 2883 437 579 3052 2820 -352 763 3477 2431 576 1416 1707 679 -49 656 1766 2078
2282 2078 1576 124 1220 1564 -447 -1162 1042 1311 -603 -338 1549 866 -453 -36 305 -448 -1081
2299 -1081 -1331 -1046 -18 151 -961 -552 583 -1128 -3070 -1358 115 -1413 -2048 -85 -134 -2385 -2143
2316 -2143 -543 -857 -1876 -2013 -2005 -1948 -1883 -2897 -1748 -24 -899 -2655 -1691 -520 -2778 -3615 -1055 150
2334 150 -2017 -1798 -90 -1075 -2504 -2206 -1257 -1322 -1837 -1147 -1008 -177 -813 -2019 -1131 206 -927 -2380
2352 -2380 -437 412 -1366 -1330 751 230 -673 -163 615 -375 -446 -157 -447 174 803 181 405 1575 1273
2371 1273 -824 -99 1013 -26 -70 1527 2180 968 1192 1319 595 388 625 504 1410 2290 1424 960
2389 960 1805 2023 143 484 2229 1477 -78 1309 2189 841 891 2009 1949 1155 1322 1059 522 813 786
2408 786 700 1786 1919 598 655 1465 339 -1164 157 1308 33 371 1633 863 -334 161 47 -775
2426 -775 -210 42 -527 -339 251 -234 -639 45 80 -1073 -776 -233 -983 -1168 -64 -360 -1177 -341 20 -1388
2446 -1388 -1173 -788 -1819 -2125 -34 -291 -786 -419 -84 -1235 -1699 -1122 -1346 -1779 -773 -180 -615 -508
2464 -508 -195 -1047 -1422 -365 -930 -1275 -505 174 -817 -374 450 -207 -1081 234 47 -1108 -523 353 -640
2483 -640 -183 1021 667 -5 448 506 -575 -401 643 175 454 1642 1392 848 1071 1377 49 130 1320
2502 1320 598 777 1843 1527 1028 1177 1634 801 340 1583 846 636 1601 1633 886 1272 2325 1070 707
2521 707 1458 879 399 840 1458 871 936 1884 1012 570 989 537 -129 631 1118 177 916 1417 741 -390
2541 -390 384 237 -839 -143 557 293 -412 475 -55 -820 -234 -234 -948 -692 -402 -902 -681 -449 -835 -1353
2561 -1353 -514 -483 -1956 -1696 -1161 -1590 -2056 -883 -309 -1495 -1056 -810 -1579 -2075 -1855 -1610 -2303 -1445 -1201
2580 -1201 -1523 -1426 -1321 -1992 -2161 -1497 -1728 -2352 -1303 -778 -1870 -1464 -989 -1422 -1700 -945 -1270 -1714 -1071
2599 -1071 -909 -1262 -1168 59 -671 -1135 -44 -511 -1364 -1300 19 -585 -736 496 436 117 116 -120 -702 -227
2619 -227 -38 -127 307 1602 893 -211 799 1195 -100 -97 1460 1454 200 1177 1669 926 818 1539 1052 1060
2639 1060 1176 711 937 1749 1535 947 2125 2458 950 713 2039 1232 154 1370 2189 1442 1350 2287
2657 2287 1752 1281 992 1011 1044 1056 1459 996 1332 1952 800 194 1149 1095 -187 503 1099 575 303 877
2677 877 824 370 43 160 112 -36 128 -781 -647 855 345 -758 251 782 -1095 -1733 -336 -354 -1283
2696 -1283 -591 531 -18 -933 -997 -944 -951 -807 -1432 -1003 -235 -934 -2091 -738 52 -1327 -2057 -722 -365
2715 -365 -1832 -1566 -203 -599 -1127 -699 -485 -604 -1302 -1272 -1135 -641 -588 -1369 -345 378 -759 -1083 -166
2734 -166 36 -1594 -1131 199 93 -660 -31 601 -75 -110 -395 -666 -118 387 -2 -271 1286 394 -571
2753 -571 490 1092 113 -23 902 775 -69 225 823 704 1191 1147 819 689 990 -380 -55 1328 1724
2772 1724 101 1125 2121 558 -339 1092 1557 422 795 1552 1242 618 350 567 972 623 290 243
2790 243 1054 954 -324 764 1712 854 -738 908 1308 -671 -446 862 786 -495 -22 560 447 -112
2808 -112 89 -301 394 -318 -1333 -695 526 -250 -839 -58 408 -1435 -1702 -309 -293 -1242 -495 82 -805
2827 -805 -1339 -1072 -1254 -1063 -780 -657 -1188 -564 -1034 -1559 -903 37 -951 -1762 -696 -821 -1936 -1576 -150
2846 -150 -302 -700 -599 -527 -841 -1112 -1312 -1357 -59 -152 -984 -537 475 -259 -1431 -37 495 -941 -1239
2865 -1239 253 565 -404 -32 724 253 309 70 21 207 715 -468 43 1320 743 -474 583 1679
2883 1679 419 -445 1552 1316 -177 233 1505 1764 1130 1190 1107 857 531 75 738 2313 1908 443
2901 443 1170 2200 607 -95 1695 2134 561 598 1649 1365 641 1000 1030 1593 1271 546 -37 917 1015
2920 1015 110 375 1936 890 -333 614 1048 -231 -189 282 550 181 -114 291 628 343 49 -405 -65
2939 -65 289 -1027 -784 945 322 -1377 -528 402 -910 -1832 -618 -143 -920 -1039 -676 -763 -793 -1214 -1141 -698
2959 -698 -275 -1445 -2013 -791 -378 -2035 -1447 131 -873 -1987 -1221 -595 -1494 -1747 -846 -540 -772 -875
2977 -875 -1200 -1427 -679 -1688 -1584 -720 -117 -1217 -1097 40 -542 -1659 -803 300 -716 -1118 -449 -189
2995 -189 -981 -182 -322 -16 -109 -242 -887 -277 693 -542 -832 572 969 -38 -30 1118 632 -451 310
3014 310 636 45 735 1025 764 1064 791 129 531 1343 728 251 1227 1809 495 201 1250 1136 260
3033 260 1037 1252 836 631 1233 972 659 1168 1098 716 1272 820 71 632 1259 726 317 1341 1520 146
3053 146 493 1026 272 212 762 628 209 843 294 58 121 632 -421 -161 551 50 -630 205 530 -330
3073 -330 -434 179 -310 -392 -83 -126 -696 -522 -378 -775 -129 196 -626 -1163 -388 -758 -1254 -792 248 -516
3093 -516 -870 -41 -391 -1560 -830 -577 -1177 -528 -185 -302 -853 -515 -739 -921 -612 -268 -756 -574 -38 -790
3113 -790 -874 -82 -124 -870 -203 370 -522 -461 -183 -330 -599 -23 380 -243 291 254 -105 -294 70 -164 79
3134 79 486 969 217 190 805 227 -56 641 482 367 665 961 574 287 1007 686 44 1013 1168 643 732
3155 732 1095 688 642 1303 1213 597 1018 752 195 651 1150 560 556 1315 774 60 765 605 33 79 844 552
3177 552 256 1136 950 -4 99 923 -139 -177 438 310 -264 285 458 -443 -147 130 -390 -233 -45 -491
3197 -491 -852 -167 114 -560 -724 -58 -525 -1127 -546 -526 -995 -1035 -87 -877 -448 -430 -740 -1326 -1090 -879 -1330
3218 -1330 -1095 -487 -875 -809 -548 -854 -1356 -1055 -649 -1333 -1050 -397 -965 -1221 -605 -596 -1065 -666 -675 -1345 -885
3239 -885 -451 -580 -1179 -353 77 -491 -667 -33 -398 -661 -240 -206 -285 214 169 -349 -119 418 -630 -392 422
3260 422 177 -381 215 837 161 -80 725 567 -64 854 760 309 462 1168 452 366 936 998 480 809 902
3281 902 218 1050 1465 797 649 1469 1280 444 749 860 749 553 1155 1259 774 1189 887 374 672 1109
3301 1109 328 527 1202 1089 184 1107 1153 401 391 602 610 274 559 408 137 364 206 182 254 732 68 -450
3323 -450 298 181 -554 -226 665 74 -405 162 -430 -504 -502 -388 -659 -387 112 -787 -651 -196 -368 -842 -559
3344 -559 -488 -1076 -845 -272 -757 -1368 -378 -269 -965 -1006 -391 -783 -995 -828 -820 -820 -482 -492 -1045 -630 -563 -1337 -1171
3367 -1171 -279 -344 -879 -42 -3 -571 -834 -459 -682 -855 -609 -275 -595 -72 134 -616 -206 159 -229 -1119
3387 -1119 78 364 -581 -186 677 41 -261 399 479 150 324 356 371 241 651 67 462 991 571 57
3407 57 777 1011 447 564 856 901 236 615 899 364 158 919 656 850 908 690 679 633 842 284 771 753
3429 753 149 93 1286 718 11 539 1079 199 -46 550 453 26 435 380 24 460 231 -59 -5 308 -128
3450 -128 -355 -16 297 -731 -421 307 -29 -773 -389 -89 -442 -488 -71 -298 -204 -67 -498 -783 -347 -729
3470 -729 -998 -265 14 -1059 -1203 -413 -505 -1156 -874 -167 -772 -925 -880 -668 -738 -663 -796 -723 -572 -763 -1119
3491 -1119 -695 -165 -925 -918 -12 155 -924 -689 -35 -326 -683 -212 187 -487 -408 -357 41 148 -354 -362 -3
3512 -3 518 -174 -653 266 176 -329 60 405 167 -125 628 746 435 -73 454 315 586 333 506 847 1159
3533 1159 264 163 344 745 278 28 1415 1274 274 356 844 661 491 659 773 701 872 713 498 1005
3553 1005 807 207 761 1186 320 -238 791 804 182 241 1041 564 184 34 290 138 32 104 18 557 345
3574 345 -189 -31 336 -148 -489 66 425 -267 -523 561 214 -609 -313 90 -276 -332 -505 -253 -372 -518
3594 -518 -556 -608 79 -353 -970 -383 186 -875 -1122 -456 -325 -709 -631 -341 -352 -837 -811 -650 -534 -314 -765
3615 -765 -671 -208 -93 -918 -721 -153 -706 -813 -366 -74 -705 -1025 -90 -198 -495 -207 -278 -35 -112 15 -690
3636 -690 47 134 -396 -155 556 86 -729 -127 275 -135 -207 337 577 -247 98 256 -20 394 212 30 585
3657 585 885 441 228 795 668 -183 710 1193 642 466 769 785 312 656 687 691 552 505 514 189 531 691
3679 691 346 648 742 235 420 826 428 313 591 759 647 441 686 183 464 262 105 139 708 662 237
3700 237 447 447 -22 -60 143 116 -12 -254 -68 -379 -358 112 6 -313 107 -88 -384 -293 -139 -326 -420 -268
3722 -268 -342 -803 -79 -199 -566 -590 -236 -842 -660 -284 -637 -977 -522 -270 -595 -889 -604 -701 -789 -422 -257
3743 -257 -574 -280 -206 -811 -674 -138 -318 -632 -520 -404 -808 -308 23 -570 -390 -30 -435 -513 -335 -22 -452
3764 -452 -4 160 -49 -194 109 -15 -489 62 221 -308 63 503 478 31 303 328 -103 398 454 398 394 562
3786 562 425 178 423 566 77 251 677 464 372 723 502 257 546 823 567 706 851 441 279 842
3806 842 452 201 983 915 379 446 645 497 251 493 675 368 489 887 390 85 539 195 354 615 177
3827 177 -45 120 271 215 -275 333 142 -180 -40 -35 -433 -352 78 64 -236 -140 -271 -434 -245 -3 -387 -424
3849 -424 -17 -328 -375 -542 -226 -693 -629 -261 -727 -703 -425 -408 -788 -615 -349 -651 -581 -335 -489 -931 -502 -254
3871 -254 -984 -646 -386 -727 -574 -304 -423 -811 -529 -443 -718 -576 -10 -280 -525 -103 -346 -230 -386 -118
3891 -118 -94 -127 110 -110 -302 -63 3 -364 -112 78 -313 -250 410 390 36 316 100 120 559 603 59 258
3913 258 249 291 230 595 917 451 268 763 582 86 941 974 147 758 900 455 373 630 436 201 694 936
3935 936 311 804 815 179 145 648 485 445 346 567 436 486 492 375 258 734 530 -116 295 364 -259 177 821
3958 821 25 236 104 366 -165 26 -23 -156 -245 -49 106 -224 -39 7 -373 -350 -30 -583 -427 -213 -60
3979 -60 -405 -85 -359 -613 -585 -355 -653 -772 -411 -335 -611 -314 -120 -557 -616 -214 -239 -943 -583 -511 -894 -391
4001 -391 -234 -394 -774 -580 -638 -631 -244 -427 -725 -405 -181 -488 -426 31 -411 -719 -100 -95 -262 -217 340 -351
4023 -351 -200 2 129 -120 -310 94 -1 -232 216 233 -28 297 388 9 303 319 50 22 837 496 126 517
4045 517 563 188 20 668 450 64 738 799 361 500 672 462 270 588 391 14 652 512 313 243 602
4066 602 417 240 625 649 451 223 287 114 157 475 695 -129 200 267 -96 287 132 132 39 411 122 246
4088 246 216 324 -267 -307 18 2 -86 189 255 -464 -262 60 -447 -530 -100 -509 -698 88 -353 -474 -19 -163
4110 -163 -331 -741 -186 -385 -608 -429 -267 -538 -461 -175 -344 -780 -145 -657 -1048 -339 -323 -499 -317 -91 -563
4131 -563 -560 -350 -340 -650 -466 134 -525 -224 -172 -330 -441 -307 -158 -523 -316 -140 -276 -489 -171 36 -167
4152 -167 -135 194 -504 -186 -62 -16 184 307 91 -77 242 148 -250 233 388 270 132 500 504 -148 274 472
4174 472 158 132 549 524 376 470 619 419 449 641 223 342 640 282 58 751 884 167 379 695 22
4195 22 140 840 592 120 128 547 83 339 453 265 602 693 264 -155 284 385 4 -61 444 346 -201 331
4217 331 430 -518 -171 162 161 -461 101 -71 -164 -220 -39 -223 -101 89 -393 -585 -99 -318 -294 -480 72 -557
4239 -557 -577 -398 -373 -307 -338 -328 -655 -472 -89 -695 -537 10 -415 -715 -192 -112 -655 -298 -359 -246 -567 -500 -294
4262 -294 -624 -324 -149 -312 -418 -46 -449 -384 114 15 -577 -226 -23 -399 -376 -140 165 -301 -32 290 -130
4283 -130 -212 71 72 -133 446 -1 -159 137 171 45 201 603 266 28 262 15 207 172 830 432 85 582
4305 582 391 52 583 602 -5 306 615 73 221 665 563 -207 532 485 96 298 529 596 371 529 482
4326 482 -103 183 331 295 402 526 189 359 189 329 -189 82 495 151 240 338 160 -179 -138 123 -74
4347 -74 82 -17 -185 -328 41 85 -318 -138 65 -337 18 -33 -306 -558 -202 -176 -331 -296 -348 -113 -876 -314
4369 -314 -551 -603 -269 -187 -412 -666 -163 -488 -833 -476 -395 -588 -532 -177 -539 -397 -355 -305 -496 -572 -404 -658
4391 -658 -230 -359 -588 -492 168 -160 -603 -290 -275 -514 -410 35 -360 -404 4 79 -335 90 265 -177 -400
4412 -400 134 -120 51 323 196 39 106 70 -37 -182 355 28 57 320 390 -15 159 667 151 288 435
4433 435 196 349 158 368 422 626 711 321 340 599 796 113 -2 667 369 478 651 679 49 302 671
4454 671 141 172 591 191 503 261 136 -217 269 370 240 182 612 172 236 253 104 155 260 361 -127 1
4476 1 -97 201 -52 -142 265 -58 47 72 -83 -305 32 -6 -293 -401 -4 -269 -286 120 -372 -438 -361 -408 -601
4499 -601 -230 -51 -409 -495 -323 -352 -576 32 -502 -490 -305 -499 -405 -532 -150 -178 -582 -317 -68 -517 -340 -66
4521 -66 -411 -334 -40 -320 -276 -324 157 -515 -438 -149 -403 -249 -35 89 110 -212 68 -109 -300 -87 -216 65
4543 65 438 340 -84 -131 103 184 -133 556 264 110 333 473 41 160 375 293 28 382 274 322 273 508
4565 508 351 251 503 382 2 309 260 80 456 463 265 127 464 489 102 387 288 96 129 559 217 153
4587 153 115 288 132 -51 322 228 105 25 88 -180 -123 268 -92 -61 190 -274 -395 15 65 -339 -68 313
4609 313 -48 -163 -6 -272 -462 -116 -419 -279 -135 58 -273 -262 -146 -199 -475 -140 -124 -455 -603 -488 -444
4630 -444 -740 -101 -290 -593 -543 -504 -384 -572 -144 -342 -444 -399 -282 -332 -154 -176 -399 -149 -351 -220 -307 -314 -55
4653 -55 -439 -229 -92 -210 -169 -80 -185 -208 74 176 -401 -47 322 120 -84 87 235 -64 39 381 117
4674 117 110 227 130 3 284 388 -149 -15 542 341 213 586 318 214 365 150 129 434 341 321 167 647
4696 647 430 143 434 403 80 146 322 67 190 561 420 237 431 359 305 90 507 369 276 596 298 -156
4718 -156 137 399 344 -32 220 249 -238 307 438 125 122 336 -87 -309 345 -257 -70 -94 -176 -46 -201 215
4740 215 -199 -280 -265 -290 -307 -296 -204 -88 -346 -27 54 -224 -440 -341 -482 -391 -127 -456 -227 -272 -250 -316 -167 -360
4764 -360 -696 -618 -219 -70 -514 67 -282 -536 -431 -223 -527 -546 -210 -263 -307 -157 26 -321 -374 -26 -151 -236
4786 -236 157 178 90 -36 106 -153 86 158 382 -123 -151 -64 -149 73 245 89 88 231 31 -34 397 319 134
4809 134 426 320 96 138 450 295 -117 371 -122 206 -75 461 445 161 399 107 353 335 369 53 254
4830 254 224 369 43 239 179 244 196 588 187 5 431 232 14 343 301 -60 -61 518 64 -87 474 142
4852 142 -91 192 -156 184 -145 -304 -13 68 4 -14 146 140 -38 -373 -87 303 39 -304 50 28 -175 -616
4874 -616 14 -314 -199 -58 79 -188 -170 -274 -505 -490 -405 -321 -370 -208 -214 -415 -589 -215 -269 -534 33 -252 -296
4897 -296 -321 -187 -314 -284 -37 -264 -256 -91 -139 -252 -83 225 -281 -138 306 -175 -83 -357 -339 -11 -102 -82 -52
4920 -52 -121 80 22 -210 120 123 -108 208 331 124 -54 194 15 -33 309 344 53 244 359 145 -45 473
4942 473 525 64 196 103 306 144 550 361 127 443 527 183 482 265 272 221 592 357 144 83 363 537
4964 537 351 260 143 -103 201 470 -31 305 207 160 -137 301 33 -18 287 111 143 120 4 74 59 95 -297
4987 -297 -21 163 -143 -245 -93 87 -366 -126 0 -266 -262 -114 -115 -305 -225 -46 -410 -401 -168 -398 -421 -94 -246
5010 -246 -94 -66 -63 -278 -424 -315 -160 -558 -467 -141 -459 -436 -98 -133 -516 -263 -350 -356 -155 -170 -282 -302 -145 -64
5034 -64 -147 -284 -144 -239 -365 7 -105 -66 -139 -315 -269 79 -46 -121 -109 98 199 92 9 104 -135 79 183
5057 183 -8 99 390 59 290 287 282 131 103 388 394 167 212 346 411 292 110 192 106 185 245 230 420 424 124
5082 124 327 395 141 174 444 312 377 339 179 150 267 201 354 -105 331 171 187 132 20 122 405 388 -11
5105 -11 -19 122 166 -133 51 193 120 44 83 -254 -234 52 33 -112 -85 138 -292 -140 254 -65 -187 -200 -303 -492
5129 -492 74 -268 -402 -282 -76 -159 -657 -364 -279 -360 -276 -277 -278 -366 -189 -280 -624 -460 -153 -283 -216 285 -174 -144
5153 -144 -370 -205 -129 -481 -25 -387 -453 -114 -196 -357 -292 -40 -426 163 -40 48 -270 -339 104 -133 -114 188
5175 188 132 -49 290 112 -105 -31 179 -248 77 276 -20 54 19 47 124 36 193 87 -111 352 358 309 283 243
5199 243 33 214 307 431 232 623 319 287 232 354 116 229 240 172 517 346 394 -10 86 74 153 230 74
5222 74 168 96 421 359 215 118 315 -90 173 353 164 17 -109 219 -447 -99 101 6 -166 56 -225 -211
5244 -211 221 196 3 -49 31 -207 -155 -233 -61 21 19 -143 -228 -369 -2 -167 -215 -238 -230 -228 130 -387 -282 -115 -119 -91
5270 -91 -486 -390 92 -465 -195 25 -184 -124 -154 -8 -79 28 -127 -281 -550 -98 -38 -244 -263 -274 -137 -38 -123
5293 -123 -208 79 -99 -45 -124 -239 -63 -98 -13 231 179 -198 -8 -104 -121 268 -73 122 -94 363 118 146 -61
5316 -61 -75 296 -89 142 22 101 301 -116 155 278 201 61 267 387 -43 129 351 344 260 409 314 297 354
5339 354 401 198 128 546 332 -95 191 339 90 341 232 422 176 7 194 130 164 137 107 189 293 229 88
5362 88 -5 369 54 20 281 199 110 228 302 -66 -50 49 -7 114 145 78 -279 -131 20 -563 109 -191 -293 -230
5386 -230 -164 -374 -476 -191 -375 -381 -308 -43 -370 -461 -282 -362 -286 -460 -298 -448 -594 -189 -458 -744 -268 -76
5408 -76 -187 -195 -268 -504 -170 -73 -303 -405 -265 229 -366 -355 -154 -55 -345 -40 -277 -280 90 24 -17 -104 28 -44
5432 -44 37 194 101 -68 -90 156 62 166 103 75 262 297 205 -170 252 557 146 -12 393 59 83 117 189 430
5456 430 175 375 396 405 401 363 -121 148 489 68 185 345 37 94 342 310 -115 -34 91 234 157 258 103
5479 103 1 126 204 -69 76 423 -227 -17 166 16 -23 303 311 -7 -34 59 -179 -74 77 -107 -248 165
5501 165 5 -352 -134 -60 -170 -371 -127 110 -210 -243 33 -219 -341 84 -71 -387 -117 -230 -477 -471 -151
5522 -151 -235 -458 -172 -347 -611 -233 -14 -145 -423 -314 -36 -127 -258 -97 -197 -359 202 -477 -248 -43 -378
5543 -378 -434 65 -77 -302 -181 -4 -130 -218 -33 263 -54 73 -17 -140 119 7 -9 -75 207 93 -350 184
5565 184 249 40 262 240 191 -96 -144 173 135 346 104 207 142 150 607 56 397 79 84 38 353 44 217 483
5589 483 32 4 313 206 201 -21 265 380 291 329 222 -78 250 518 170 -44 399 23 105 77 287 -27
5611 -27 136 484 171 -77 305 255 -152 -36 259 144 -31 273 -208 131 105 41 -111 266 -48 -289 -184
5632 -184 -161 -99 -139 -145 6 -237 -181 13 -217 -331 -153 -123 -379 -137 -262 -349 -191 -57 -296 -124 -209 -259 -471
5655 -471 -290 -192 -511 -172 -365 -228 -149 -307 -433 -361 39 -92 5 -151 171 -248 -327 30 -428 25 -397 -106
5677 -106 -55 -50 -194 -192 13 -248 180 -47 -49 18 -87 57 78 -109 9 150 76 50 40 119 261 167 -38 219 -256
5702 -256 81 186 52 116 352 83 57 364 131 68 303 125 248 0 229 410 -50 109 502 -16 354
5723 354 178 161 -126 195 318 358 338 464 72 -87 403 150 211 195 484 193 -98 252 229 -111 67 120
5745 120 -341 -15 390 171 105 136 -117 -51 201 115 -288 -302 -64 -70 -329 -58 63 -271 -162 -114 -168 -565 -68
5768 -68 -32 -201 -163 -156 -386 -388 -369 -387 -432 -370 -294 -363 -65 -143 -269 -16 -283 -210 -322 -206 -155 -395 -176 -352 -413 -331
5794 -331 -148 -114 -170 -146 -283 -177 -239 253 -180 -10 -221 6 -74 -147 -51 -191 -117 289 71 156 128 170 -140 -105
5818 -105 343 194 147 53 210 337 10 327 -249 84 443 276 160 129 138 67 359 365 6 193 -3 -100 -77
5841 -77 358 209 285 360 244 171 224 549 181 270 428 173 253 432 264 69 12 271 -43 55 190 166 -358
5864 -358 265 113 -101 -18 43 -160 178 166 6 -34 -124 -244 -117 179 100 523 130 -229 -60 -53 190 48 -36
5887 -36 -187 -38 35 -468 -136 -284 -453 -147 12 -244 -389 80 -251 -247 -168 -17 -402 -193 -274 -503 -176 -155
5909 -155 6 -295 -13 5 56 -269 -495 -207 -83 -4 -57 -298 -431 47 -39 -383 -236 -73 -290 -176 -5 55
5931 55 -196 -329 75 -49 -71 20 -183 -426 -97 -231 -50 153 167 -134 -126 433 -141 -215 274 437 -99 314
5953 314 -5 -288 -110 370 148 112 79 219 -85 170 114 149 77 207 66 124 265 58 185 260 354 118 245
5976 245 600 114 -24 279 339 57 238 277 112 107 429 27 316 325 320 215 159 330 2 63 -2 126 -14 -118
6000 -118 197 -208 244 118 158 175 31 216 104 170 143 -100 -163 106 18 -375 -91 200 9 -42 -119 -279 -163
6023 -163 -359 -88 -69 112 100 -126 -236 -58 -183 -401 106 233 -432 -320 -209 -448 -365 -299 -271 -405 -127 51
6045 51 -170 -259 -243 -341 52 -70 -227 -444 -55 -102 -202 -338 122 -256 105 42 -98 231 12 179 -129 27
6067 27 111 -130 -116 23 31 -40 -103 182 100 -32 179 107 82 384 379 36 175 -65 -284 417 444 -72 156 339
6091 339 391 -28 321 214 -23 289 331 66 187 460 215 174 194 285 -50 376 20 98 117 25 29 285 287 464
6115 464 178 -40 -8 -189 101 7 262 -85 228 183 -100 208 242 48 -61 32 128 -269 29 190 116 -154
6137 -154 13 -28 -8 -178 420 6 -16 313 -177 -222 80 -122 -82 9 70 -254 -222 -523 -113 -108 -22 -283 -304 -215
6161 -215 -272 -454 -303 -167 -152 -129 -277 -321 -267 10 81 11 -344 -227 -291 -24 -159 43 84 -473 -21 -6 -324
6184 -324 12 23 -190 -184 -3 -116 -266 -32 -250 171 27 57 -156 173 339 178 51 -172 -42 16 -23 -256
6206 -256 -32 42 -152 241 -19 188 -83 171 260 357 356 121 305 -48 77 175 499 144 22 148 304 352
6228 352 15 222 239 13 105 288 20 50 180 233 171 155 193 282 323 357 -30 313 430 53 335 14 28 -67
6252 -67 341 268 0 21 88 -198 -119 -163 -33 1 -16 23 -77 9 121 -186 -234 -29 22 -98 -258 19 5 -10 -234
6277 -234 -124 -89 -381 -60 -111 -307 104 -327 -301 -229 -111 -127 -122 149 -309 -261 -26 -44 -177 -157 -57 -287 -326 -197
6301 -197 -254 94 -102 -173 -382 33 11 -589 -5 141 -249 -4 -209 55 10 85 -205 -215 -122 164 -390 -87
6323 -87 76 -265 -157 121 -195 -36 34 79 -113 40 129 349 85 100 203 354 254 -50 170 424 242 -65
6345 -65 -37 307 399 167 178 548 166 -238 195 515 128 179 334 178 -24 173 324 249 224 495 124 56 377
6368 377 69 73 102 235 -259 260 551 116 51 186 37 -134 -89 175 -70 104 18 -141 125 331 76 -51
6390 -51 -212 -80 -170 -305 -22 160 -207 83 -364 -97 -2 51 -96 -313 -65 -354 -244 -244 -256 -141 -89 61 -170
6413 -170 -396 -438 -33 -249 -13 145 -310 -169 -210 -315 -513 -265 -415 -125 -105 -80 -161 -94 -82 -322 -247 -22 -129
6436 -129 -426 -15 -121 -185 -300 32 239 -82 -81 -34 -171 69 -52 -120 102 119 -16 -57 -11 -111 -201 -183 138
6459 138 -45 -106 163 424 137 56 20 85 407 203 190 300 313 43 -46 217 293 296 64 158 121 265 92 205
6483 205 -118 62 455 296 367 232 219 223 -54 143 -127 284 317 294 111 326 -12 -72 10 278 398 36 119
6506 119 23 -80 285 130 44 -117 -106 28 -251 76 52 -224 43 102 -24 -131 -96 -311 -90 -188 66 -364
6528 -364 -44 188 -21 -13 12 -402 -481 -194 146 70 -83 16 -219 -229 -310 -81 -291 -149 -60 -384 -463 -193 -65
6551 -65 -116 192 -377 -169 -319 -126 -136 -182 -203 2 -90 146 -162 11 -481 -105 61 -281 -293 -33 -96 -146 -57
6574 -57 190 199 -86 -303 -85 74 168 -46 -66 24 -13 -84 206 61 -60 145 83 -229 92 246 116 -43 78
6597 78 131 77 209 432 93 189 361 62 190 17 85 175 68 418 282 -72 155 119 259 53 272 215 -17
6620 -17 95 302 48 175 248 90 227 151 189 190 234 152 126 -61 252 -33 81 -15 -261 80 -137 -12 -16 208
6644 208 -46 -171 -178 -94 -258 291 63 -335 20 227 -142 5 -473 33 -233 -342 -184 -174 -434 -118 11
6665 11 -306 -138 -296 -106 -178 -139 -172 -190 -149 91 -309 -641 -69 -249 -63 -327 -195 -200 -320 -178 -143 -278 -85
6688 -85 -125 -147 -36 -245 -161 -68 -358 70 -98 -11 -198 -52 6 -181 -391 -340 282 45 -21 237 6 -102 256
6711 256 183 36 -103 405 145 277 277 52 188 -23 216 226 108 183 -4 57 276 98 154 -61 25 3 78
6734 78 231 337 269 398 276 74 125 377 147 95 222 94 325 181 268 -55 246 448 481 66 381 411
6756 411 -60 -36 292 250 4 -19 57 71 138 396 -166 55 323 -331 189 170 41 -113 327 214 -206 -126 -10
6779 -10 93 249 110 -229 -280 -73 -152 5 70 426 48 -231 -17 -89 18 -460 -71 -405 -300 -266 18 -130
6801 -130 -230 -335 30 -431 -6 -178 -476 -314 -358 -240 -405 -207 -319 -209 -181 -48 -278 42 -138 -208 -208 -254
6823 -254 13 62 -93 -7 -107 -32 -18 -222 149 -284 208 7 258 -93 -82 -23 371 64 228 183 209 44 -64
6846 -64 148 41 75 324 30 -367 168 109 280 93 161 138 -5 113 419 187 213 207 47 175 241 162 286
6869 286 112 81 -52 278 57 141 347 168 296 80 295 120 63 19 -193 43 233 93 143 118 226 -7
6891 -7 -88 -100 63 25 -168 77 33 157 68 83 137 213 -193 271 -59 56 116 -266 -166 -223 -167 -200 -158 -59 87
6916 87 -92 -203 -351 -123 -111 -56 -241 -41 -150 125 -155 -111 -223 4 -17 -240 -103 -246 -281 -337 163 -140
6938 -140 -349 59 -323 -243 -446 -135 -89 -271 106 -227 -137 -76 -205 256 -241 -65 -101 -71 28 -115 -255 3
6960 3 184 -203 -17 -17 17 99 -154 -54 -44 -88 72 38 -152 -31 -1 26 432 64 78 -222 70 -135 324 80
6984 80 462 88 157 -134 203 143 -85 172 211 136 187 47 364 166 104 68 241 -10 -144 194 109 131 -5
7007 -5 119 210 324 251 550 -171 234 138 17 100 232 252 449 183 -156 1 -8 210 59 -1 -119 69 -331
7030 -331 -130 86 177 -41 101 -73 -267 -29 -126 -235 -333 -250 -457 -362 -125 -226 -356 89 7 -324 -285 4
7052 4 49 -88 -227 55 -243 -324 -96 -481 158 77 -328 -236 -11 -79 -206 -192 96 -242 -424 35 -47 -341 -245
7075 -245 -27 -133 -312 136 76 -288 -126 -310 6 -156 169 132 7 82 41 -184 56 -83 200 54 -61
7096 -61 -161 260 162 16 -148 124 205 65 240 145 290 -27 -13 46 8 161 -144 -116 165 -136 -20 144 52
7119 52 282 219 304 89 -115 168 145 229 341 319 198 -2 -73 46 123 280 74 -106 59 100 -172 -64 259
7142 259 -4 -102 294 51 90 19 -220 10 45 55 -22 -81 -72 -64 79 -240 13 -98 -87 -316 -35 69 81 39 -292
7167 -292 -162 121 -301 -130 -200 -223 -29 -265 -133 -234 -290 -177 -81 -194 -35 -82 -106 -123 -187 147 -364 -112 -165
7190 -165 -22 17 -66 39 -244 -197 -48 -111 -220 -218 -77 -348 -78 -128 -145 -113 -13 -337 -112 37 79 -173 -200 5
7214 5 -126 -90 160 -267 -307 125 182 -55 -89 266 -99 65 220 127 28 -52 161 -1 -66 260 88 15 239 244
7238 244 -20 299 180 10 391 306 320 39 -29 263 51 200 138 86 86 23 211 77 295 24 127 29 380
7261 380 288 -197 -33 117 66 -60 358 179 -34 -188 51 63 82 -14 -38 11 85 -45 -86 -154 -169 10 -170 -20
7285 -20 206 -100 -236 -127 -194 -112 40 -395 -155 42 -69 -112 -66 -100 -293 -24 -8 -180 -68 -103 227 -145 -83
7308 -83 -489 -226 -251 -324 -184 -62 -116 -175 -157 -123 81 -253 -180 77 -235 -234 30 107 87 -94 -131 20 -238 -10
7332 -10 -226 -327 106 -297 -85 -158 -10 -32 -63 -83 -133 -65 -35 -117 -327 34 106 -66 -170 254 -158 -90 266 77
7356 77 -82 90 23 -199 175 30 324 204 111 340 97 345 282 137 128 245 167 67 -40 493 249 593
7378 593 86 287 282 69 270 -95 44 763 83 242 78 194 191 273 358 4 -15 61 36 165 515 128 48
7401 48 12 179 -2 22 141 -90 -117 152 111 -255 -3 164 -110 -438 -165 -234 -157 -60 41 61 -223 168 4
7424 4 -148 130 -195 -589 183 -20 -223 -126 -325 -213 -89 -237 186 82 -171 -178 -322 -29 -232 -501 -100 -5
7446 -5 -360 -70 -209 -85 -236 -37 -48 -188 -211 164 49 -283 -160 -95 -146 -106 -106 1 -169 225 -107 -35 -17 -157
7470 -157 -259 -47 -124 -41 98 95 30 9 34 88 147 244 152 -45 261 -89 -40 24 -92 175 120 93 36 203 244 255
7496 255 223 -135 169 348 112 212 327 132 -186 31 -77 156 -58 23 43 143 149 330 246 29 49 -167
7518 -167 58 229 196 -76 69 64 112 47 197 219 -41 207 72 18 238 297 193 -91 -96 333 17 195 92
7541 92 -213 201 -175 13 -26 -210 -175 -117 -36 -7 40 -268 -79 -5 -288 -38 -322 33 -302 -152 140 -298 -423
7564 -423 -195 -307 -372 -249 -34 -57 -157 -489 -182 -63 -181 -479 -445 16 20 153 37 -9 -58 -157 -176 -135 -277
7587 -277 34 -11 -139 -259 34 304 -155 156 -191 57 236 -125 -334 -114 9 111 221 207 223 -404 451
7608 451 -121 300 264 185 76 121 -13 49 -44 304 141 68 177 141 88 262 445 45 27 237 73 165 193 14
7632 14 113 -223 354 403 206 -5 -213 -90 52 218 140 429 305 301 2 128 190 98 -228 -32 12 173 200
7655 200 133 -42 -28 44 -115 139 245 -228 61 -36 127 -237 -260 139 -128 -111 -79 23 37 36 -24 -10 -41 -250
7679 -250 -174 -57 -318 -24 17 -248 110 -66 -29 -91 -254 -39 -106 -79 -150 5 -228 85 -83 220 -164 8
7701 8 24 -165 -197 -90 -87 -526 -280 -60 -273 -308 -230 -35 -274 -211 72 -126 -167 167 -89 471 -43 136 66 -154
7725 -154 -248 -32 -87 33 45 -20 -71 -51 -44 -120 -73 -106 -9 200 -32 -66 -8 250 123 72 153 440 27 194 8
7750 8 28 308 -106 228 20 218 181 -51 286 -90 309 285 114 152 89 77 108 -137 -148 47 118 -146 65 331
7774 331 -10 124 73 215 236 97 -53 -298 -196 88 -343 -262 -18 -30 -56 -102 -37 232 -161 107 -30 -100 46
7797 46 72 -153 -169 107 184 200 -43 -202 -34 -388 -69 7 -271 -77 -36 -108 4 -82 -30 -350 -27 -5 -82 -2
7821 -2 -457 -111 85 -423 6 -3 -142 -78 -235 -59 -182 -84 97 40 -50 108 100 -194 301 18 -13 32 -21 -157
7845 -157 -480 37 189 -38 -40 -63 -231 -53 182 -63 -227 26 -151 -264 -328 169 13 105 -106 196 -125 -85
7867 -85 -87 -114 90 59 343 -78 136 518 -24 85 472 118 -38 215 121 -1 245 -125 93 247 -6 247
7889 247 226 200 -84 184 486 87 79 179 450 84 238 247 209 109 296 -125 153 241 -141 67 182 11 25
7912 25 3 -4 -11 272 -72 47 -17 -135 239 37 285 78 266 -298 18 -313 102 -11 -301 -281 -98 132 -557
7935 -557 40 221 -127 -33 -137 -277 19 66 -195 -225 -126 -1 -34 -294 114 -180 -72 -18 -314 5 -191 -265
7957 -265 -53 160 -78 -314 -88 16 -185 -50 116 -264 -258 -192 86 -53 -225 -163 -43 102 -163 -59 152
7978 152 28 -217 -23 24 149 -63 -80 103 -309 -108 40 176 -151 123 -134 -65 94 21 -58 -8 179 225
8000 225 246 34 -3 -43 462 179 217 124 198 48 -38 149 80 13 93 505 -260 1 -58 9 142 -80 319 300
8024 300 192 333 -9 162 -92 43 131 303 -17 180 193 52 -87 -303 169 10 22 178 103 -129 -195 -100
8046 -100 7 10 -101 99 57 205 149 -231 -374 -9 200 -453 -37 -75 -138 317 171 -69 -398 -101 -303 -325
8068 -325 -170 -235 -81 -260 -204 -72 -278 -46 -315 -84 -421 -107 -162 -213 129 -233 -141 -70 -52 112 68 -33 -88
8091 -88 -116 -123 -118 -120 -187 288 -41 -387 -142 -106 -139 212 -42 -78 -14 -183 29 -125 146 1 64 -10 25 -11 -82 422
8117 422 81 458 -244 -208 -2 300 84 271 235 41 -33 -28 219 345 -240 61 62 178 -186 231 331 183
8139 183 92 -43 248 -130 3 144 59 246 326 135 274 170 403 82 212 234 -181 -9 248 125 101 62
8161 62 360 178 115 -10 -25 74 26 -7 157 -32 187 42 -147 130 151 -87 118 -332 57 228 -209 -85
8183 -85 -126 214 -260 -122 -26 176 -85 -114
8191a14
##END NTUPLES=NMR FID
##END=
