##TITLE=1H_SR_62
 CDCl3, 8 sc, 
 1.02.2021
##JCAMPDX= 6.0         $$ Bruker NMR JCAMP-DX V2.0
##DATA TYPE= NMR FID
##DATA CLASS= NTUPLES
##ORIGIN= UXNMR, Bruker Analytische Messtechnik GmbH
##OWNER= root
$$ XWIN-NMR		Version 3.5
$$ Mon Feb  1 12:18:16 2021 Russian Standard Time (UT+4h)  she@DPX200
##.OBSERVE FREQUENCY= 200.1315066352
##.OBSERVE NUCLEUS= ^1H
##.DELAY= (6, 6)
##.ACQUISITION MODE= SIMULTANEOUS
##.ACQUISITION SCHEME= undefined
##.AVERAGES= 8
##.DIGITISER RES= 18
##SPECTROMETER/DATA SYSTEM= spect
##.PULSE SEQUENCE= zg30
##.SOLVENT NAME= CDCl3
##.SHIFT REFERENCE= (INTERNAL, CDCl3, 0, 15.7039)
##AUDIT TRAIL= $$ (NUMBER, WHEN, WHO, WHERE, WHAT)
$$ ##TITLE= Audit trail, XWIN-NMR		Version 3.5
$$ ##JCAMPDX= 5.01
$$ ##ORIGIN= Bruker BioSpin GmbH
$$ ##OWNER= she
$$ F:/spectra/data/she/nmr/H-F/1/audita.txt
$$ ##AUDIT TRAIL=  $$ (NUMBER, WHEN, WHO, WHERE, WHAT)
(   1,<2021-02-01 12:17:24.07 +0400>,<she>,<DPX200>,
      <created by zg, POWCHK disabled, PULCHK disabled
       configuration hash MD5:
       00 E9 B6 7A A2 85 ED C7 34 08 36 98 17 FE 4E 26
       data hash MD5: 16K
       A7 59 6F 1E E5 B5 95 38 24 9D 62 40 A1 C4 68 D7>)
$$ ##END=
$$ 
$$ hash MD5
$$ 0B CE DB 20 A3 A2 2D 05 E4 80 34 3C A3 70 DC D5
##$RELAX= 
##$RELAX= 
##$RELAX= 
##$RELAX= 
##$RELAX= 
##$RELAX= 
$$ Bruker specific parameters
$$ --------------------------
##$DU= <F:/spectra>
##$EXPNO= 1
##$NAME= <H-F>
##$PROCNO= 1
##$TYPE= <nmr>
##$USER= <she>
##$AMP= (0..31)
100 100 100 100 100 100 100 100 100 100 100 100 100 100 100 100 100 100 
100 100 100 100 100 100 100 100 100 100 100 100 100 100 
##$AQSEQ= 0
##$AQ_mod= 1
##$AUNM= <au_zg>
##$AUTOPOS= <>
##$BF1= 200.13
##$BF2= 200.13
##$BF3= 200.13
##$BF4= 200.13
##$BF5= 200.13
##$BF6= 200.13
##$BF7= 200.13
##$BF8= 200.13
##$BYTORDA= 1
##$CFDGTYP= 0
##$CFRGTYP= 5
##$CHEMSTR= <none>
##$CNST= (0..31)
1 1 145 1 1 1 1 1 1 1 1 1 1 1 1 1 1 1 1 1 1 1 1 1 1 1 1 1 1 1 1 1 
##$CPDPRG= <>
##$CPDPRG1= <>
##$CPDPRG2= <>
##$CPDPRG3= <>
##$CPDPRG4= <mlev>
##$CPDPRG5= <mlev>
##$CPDPRG6= <mlev>
##$CPDPRG7= <mlev>
##$CPDPRG8= <mlev>
##$CPDPRGB= <>
##$CPDPRGT= <>
##$D= (0..31)
0 1.2 0 0 0 0 0 0 0 0.06 0 0.03 0 0 0 0 0.0002 0 0 0 0 0 0 0 0 0 0 0 0 
0 0 0 
##$DATE= 1612167443
##$DBL= (0..7)
120 120 120 120 120 120 120 120 
##$DBP= (0..7)
150 150 150 150 150 150 150 150 
##$DBP07= 0
##$DBPNAM0= <>
##$DBPNAM1= <>
##$DBPNAM2= <>
##$DBPNAM3= <>
##$DBPNAM4= <>
##$DBPNAM5= <>
##$DBPNAM6= <>
##$DBPNAM7= <>
##$DBPOAL= (0..7)
0.5 0.5 0.5 0.5 0.5 0.5 0.5 0.5 
##$DBPOFFS= (0..7)
0 0 0 0 0 0 0 0 
##$DE= 6
##$DECBNUC= <off>
##$DECIM= 32
##$DECNUC= <off>
##$DECSTAT= 4
##$DIGMOD= 1
##$DIGTYP= 9
##$DL= (0..7)
0 120 120 120 120 120 120 120 
##$DP= (0..7)
150 150 150 150 150 150 150 150 
##$DP07= 0
##$DPNAME0= <>
##$DPNAME1= <>
##$DPNAME2= <>
##$DPNAME3= <>
##$DPNAME4= <>
##$DPNAME5= <>
##$DPNAME6= <>
##$DPNAME7= <>
##$DPOAL= (0..7)
0.5 0.5 0.5 0.5 0.5 0.5 0.5 0.5 
##$DPOFFS= (0..7)
0 0 0 0 0 0 0 0 
##$DQDMODE= 0
##$DR= 18
##$DS= 0
##$DSLIST= <SSSSSSSSSSSSSSS>
$$ [...]
##$SUBNAM2= <"">
##$SUBNAM3= <"">
##$SUBNAM4= <"">
##$SUBNAM5= <"">
##$SUBNAM6= <"">
##$SUBNAM7= <"">
##$SUBNAM8= <"">
##$SUBNAM9= <"">
##$SW= 16.9725356469052
##$SWIBOX= (0..15)
0 0 2 0 0 0 0 0 0 0 0 0 0 0 0 0 
##$SW_h= 3396.73913043478
##$TD= 16384
##$TD0= 1
##$TE= 0
##$TE2= 300
##$TE3= 300
##$TEG= 300
##$TL= (0..7)
0 120 120 120 120 120 120 120 
##$TP= (0..7)
150 150 150 150 150 150 150 150 
##$TP07= 0
##$TPNAME0= <>
##$TPNAME1= <>
##$TPNAME2= <>
##$TPNAME3= <>
##$TPNAME4= <>
##$TPNAME5= <>
##$TPNAME6= <>
##$TPNAME7= <>
##$TPOAL= (0..7)
0.5 0.5 0.5 0.5 0.5 0.5 0.5 0.5 
##$TPOFFS= (0..7)
0 0 0 0 0 0 0 0 
##$TUNHIN= 0
##$TUNHOUT= 0
##$TUNXOUT= 0
##$USERA1= <user>
##$USERA2= <user>
##$USERA3= <user>
##$USERA4= <user>
##$USERA5= <user>
##$V9= 5
##$VALIST= <valist>
##$VCLIST= <CCCCCCCCCCCCCCC>
##$VD= 0
##$VDLIST= <DDDDDDDDDDDDDDD>
##$VPLIST= <PPPPPPPPPPPPPPP>
##$VTLIST= <TTTTTTTTTTTTTTT>
##$WBST= 1024
##$WBSW= 4
##$XGAIN= (0..3)
0 0 0 0 
##$XL= 0
##$YL= 0
##$YMAX_a= 37218
##$YMIN_a= -40584
##$ZGOPTNS= <>
##$ZL1= 120
##$ZL2= 120
##$ZL3= 120
##$ZL4= 120
##$ABSF1= 10
##$ABSF2= 0
##$ABSG= 5
##$ABSL= 3
##$ALPHA= 0
##$AQORDER= 0
##$ASSFAC= 0
##$ASSFACI= 0
##$ASSFACX= 0
##$ASSWID= 0
##$AUNMP= <proc_1d>
##$AZFE= 0.1
##$AZFW= 0.1
##$BCFW= 1
##$BC_mod= 2
##$BYTORDP= 1
##$COROFFS= 0
##$CY= 11.3945322036743
##$DATMOD= 1
##$DC= 2
##$DFILT= <>
##$DTYPP= 0
##$F1P= 15.9154993809931
##$F2P= -4.1035820241983
##$FCOR= 0.5
##$FTSIZE= 0
##$FT_mod= 4
##$GAMMA= 1
##$GB= 0.15
##$INTBC= 1
##$INTSCL= 1
##$ISEN= 128
##$LB= 0.24
##$LEV0= 0
##$LPBIN= 0
##$MAXI= 10000
##$MC2= 0
##$MEAN= 0
##$ME_mod= 0
##$MI= 1.114404
##$NCOEF= 0
##$NC_proc= 0
##$NLEV= 6
##$NOISF1= 3.799351
##$NOISF2= 2.8
##$NSP= 1
##$NTH_PI= 0
##$NZP= 0
##$OFFSET= 15.70392
##$PC= 1
##$PHC0= -10772.67
##$PHC1= 27.20095
##$PH_mod= 1
##$PKNL= yes
##$PPARMOD= 0
##$PSCAL= 0
##$PSIGN= 0
##$REVERSE= no
##$SF= 200.130013532006
##$SI= 16384
##$SIGF1= 3
##$SIGF2= 2
##$SINO= 400
##$SIOLD= 16384
##$SREGLST= <1H.CDCl3>
##$SSB= 0
##$STSI= 0
##$STSR= 0
##$SW_p= 3612.71676300578
##$SYMM= 0
##$S_DEV= 0
##$TDeff= 0
##$TDoff= 0
##$TI= <>
##$TILT= no
##$TM1= 0
##$TM2= 0
##$TOPLEV= 0
##$USERP1= <user>
##$USERP2= <user>
##$USERP3= <user>
##$USERP4= <user>
##$USERP5= <user>
##$WDW= 1
##$XDIM= 8192
##$YMAX_p= 0
##$YMIN_p= 0
$$ End of Bruker specific parameters
$$ ---------------------------------
##NTUPLES= NMR FID
##VAR_NAME=  TIME,          FID/REAL,        FID/IMAG
##SYMBOL=    X,             R,               I
##VAR_TYPE=  INDEPENDENT,   DEPENDENT,       DEPENDENT
##VAR_FORM=  AFFN,          ASDF,            ASDF
##VAR_DIM=   8192,          8192,            8192
##UNITS=     SECONDS,       ARBITRARY UNITS, ARBITRARY UNITS
##FACTOR=    0.0002944,     1,               1
##FIRST=     0,             0,               0
##LAST=      2.4114304,     0,               0
##MIN=       0,             -40584,          0
##MAX=       2.4114304,     37218,           0
$$ Real data points
##PAGE= N=1
##DATA TABLE= (X++(R..R)), XYDATA
$$ [...]
2127H4oo79N47j11K94j22j01L05k82J94o83K3N74Ql45J46R7M6j0n24L54J40m27
2150d78K17N50j05k94J52K38J19P9n37m16R05n37M19k02q14R90k36o44O21k38
2170b11N91N12q51j8n7N06o04J38k9k35Q80p91N16j020P10lj05J116r37N32o44
2191dL72l9l23M42L47o63L00q33N10K21l02l30K59k89N93N67j596Q26l36K2j10
2212c66M36j71L18j60q40M72Q6k55M81R5k0j2n6O31j277J351p11lj58M06p89j07
2234f49o2M28M08kj42n7m55N04K16p7K72j017P09K98k78P3K01n00L67p69J026
2255D94n36k75R29p88M57j70L1L43r04J19N41N93l81L56n88m56L68M3J3r5Q49
2276I43q40p95Q22l54oL34j19K97O3l34k32J76j09M31M28o03J56j191Q93n40O63
$$ plain form
2127 84 78 -601 -54 -165 129 7 -94 211 -71 123 -560 -537 37 45 -300 -154 -57 -11 -21 -545 -191 -51 -478
2150 -478 -261 289 184 -110 42 280 399 478 -59 -475 430 -107 312 110 -704 286 50 -594 27 -211
2170 -211 380 892 41 23 -34 472 -132 6 -23 -258 622 -169 347 -673 37 34 -71 1045 108 640 -4
2191 -4 368 329 6 448 795 132 432 -401 109 330 28 -302 -43 -332 261 828 -768 58 -278 -256 -366
2212 -366 70 -101 217 57 -783 -311 -225 -480 1 96 76 64 8 639 -638 713 2 -1 -159 247 -542 -649
2234 -649 -711 -283 125 123 -19 -76 -531 -27 189 112 384 -633 76 374 96 169 370 -130 237 -532 494
2255 494 -42 -317 612 -176 281 111 142 485 -419 -300 241 834 453 809 221 -235 133 176 189 94 943
2276 943 103 -692 130 -224 -230 104 -15 282 345 11 -221 -45 -154 277 705 102 258 -933 -40 -580 83
2297H3j81K92J24L26r18O69r99P80l79l19P29o01j29N57N6N10p86Q26q30J19K1
2318e0K4j3k5L26M29k85l80r8M12q13L98N27j37k05J30l75p2N25l78K53k66M56
2340C83q52P0O96n37K56Q2m87N00M8p8J3j64J33k07J58j40J11J51l57M1J51rr7
2363a35J90PM37k48l05o1J67j39K36p2m29M40n8j24k57M87o25L95L02j69j70J3
2385a18K98m99P46n16l38N05L14j98j76J98M78j717J162M08p06L02o2Nq15J043
2405C14n80M16J65l8q68N62j90P5N44j60r49N68R29q04j09L29K1J85k8J64o80
2426a34J65o62P21K46k98N6o32Q65j051J078p45P4R24o27P46n92j63m31R7j87
2446e50J298j259n1N96L23j97m12N50m15M15J98p3k45n31J02k52J262m62k23r9
$$ plain form
2297 83 -98 194 318 644 -274 395 -604 176 -203 -522 207 -394 -523 34 90 600 -186 640 -190 -71 -50
2318 -50 -26 -39 -64 262 691 406 26 -72 340 -473 -75 452 315 110 240 -135 -207 318 -60 193 -73 383
2340 383 -469 -399 297 -240 16 98 -389 111 159 81 94 -70 63 -144 14 -126 -15 136 -221 -180 -29 -38 -135
2363 -135 55 62 499 251 -54 -115 52 -87 149 77 -352 88 30 -94 -351 136 -489 -94 208 39 -131 -118
2385 -118 180 -319 427 -89 -427 78 392 194 18 216 694 -1023 139 547 -159 143 81 86 -729 314
2405 314 -266 150 315 277 -591 -29 -219 -144 400 240 -709 -141 788 -16 -125 204 225 410 382 546 -134
2426 -134 31 -631 90 336 38 94 -538 327 -724 354 -391 -317 607 -20 726 134 -29 -460 -363 -550
2446 -550 748 -511 -562 34 357 160 -252 298 -117 298 496 423 178 -353 -251 -503 759 297 74 -25
2466b5r31J197j420J892k44q34K90O67m9j27m73L31J14J02n73M25q01N35M74m22
2486A28L40p47J40R6L96l77J81l2n0j34J49K6j1O0l17M22j58l53P8J09j83L06
2508F9k45K81m70L30J13l50K61J35j92K38J31lr95Q00K01l32N0l60J32Q3K2N9
2530d2L03j54k86O75k15j12m18j23K37q7M63r40M33L56l0K7J2j09l44L33M58m09
2552B8j18j3J30j04j84N63j28J48l32pK97NO1k73L03l31L43m71K86k06M2J19n3
2575A05o3J17j1k67J99l0j04J94KP4l06K63l8k09mk49R7J24J26l14J11N0J76j38
2599i5mL24Q0m69o9L31k45R9K1O3p3P9k06l80O78j84l56M16J81k82K46p5K57n40
2623b03J18N6P9J65L81o34M11n24J37J65j46L6j01Q2j75K48J03j31j97P4k57n7
$$ plain form
2466 -25 -956 241 -1179 713 469 -365 -75 592 543 416 -57 274 388 490 -83 342 -459 76 550 128
2486 128 468 -279 -139 -43 353 -24 157 125 75 -59 90 116 105 165 -152 270 112 -241 -163 -54 -237 69
2508 69 -176 105 -365 -35 78 -272 -11 124 -68 170 301 298 -697 103 304 -28 22 -338 -206 -123 -101 -42
2530 -42 261 107 -179 496 281 169 -249 -372 -135 -222 241 -699 -266 90 60 87 99 -10 -354 -21 437 28
2552 28 -90 -103 27 -77 -261 302 174 322 -10 -17 280 285 346 73 376 45 388 -83 203 -3 39 158 105
2575 105 42 159 148 -119 80 50 -54 140 142 216 -90 173 135 -74 -78 -327 -230 -106 20 -294 -183 -133 43 -95
2599 -95 -99 225 305 -164 -233 98 -147 -48 -27 36 -37 42 -164 -544 134 -50 -406 10 191 -91 155 80 337 -203
2623 -203 -85 -29 50 215 596 -38 373 -151 -14 151 5 41 -60 22 -153 95 198 67 -130 -56 -313 -370
2645c70O32J95l54J46j23R1l65N14l09j99J08Q7K83L12j185R19j88k17L63o54
2665c14O18k06q26O66K00k16O5J3J80k86L99m76L43o97M41l9K57m12q1M31n2L60
2687C68l00j43L7j88O5P5j62j7l3N8L15Mr4J17J17M44m11K1k60L7j29j85O53o03
2711b14M48L04n08m7k85P66m81N95J0k52l27K55K8l44K25k67L79M87l18K33p65
2732g8N28k19m45k8N73n67N09m85K42Q6m32J42l85Q19j71n39N63l43M28M9L10
2753E57r17O10j40m22k67L22L34k20M7J67j09J36n27P44K73j038O20k16K97o21
2773c70N53n2K46n68N48l81L33l60m37M62j00L57R2l19M96l15j91k68L80q56Q29
2794G9L17n52M86o81O20k82N39K85o33o09J023j006O70K34l98l0L47l50j52n92
$$ plain form
2645 -370 262 457 103 249 126 217 -148 366 57 -142 -34 53 336 648 -537 382 194 -23 340 -314
2665 -314 304 98 -728 -62 138 -78 -13 0 180 -106 293 -183 160 -537 -96 -135 122 -290 -371 60 8 368
2687 368 68 -75 -38 -226 -161 -86 -248 -265 -298 -240 75 79 -15 102 219 663 252 273 13 50 -79 -264 389 -214
2711 -214 234 538 30 -17 -302 464 -17 578 588 336 9 264 292 -52 173 -94 285 772 454 687 -78
2732 -78 450 231 -214 -242 331 -236 273 -212 30 116 -316 -174 -559 260 89 -450 113 -230 198 247 557
2753 557 -360 250 110 -312 -579 -257 77 -143 -96 71 -38 98 -429 315 588 -450 170 -46 251 -370
2773 -370 183 131 377 -191 357 -24 309 -51 -488 -26 -126 231 323 4 500 185 -6 -274 106 -750 79
2794 79 396 -156 330 -351 269 -13 526 811 178 -431 592 -414 256 490 92 62 409 59 -93 -685
2814f85M92L40J08M41r42j15K35j39m31N56j83j68M38Q8L38k79p26O34J75k81
2834a04r7J21r9J17J5L50m09K29L98m88r7M89m12P7L8m61N29l75M2O78o91J11
2856c9M68j38K40j06m49J81lk18M03l83K3j68K91Jk91M68l4p3n99N37j09J79k66
2879h5j49L36m78j56P88n61L92r9oN4p28R72l42k68j51M54p12Q34j1K7o65R51
2901C97k03N29m12m62l60o7M25p2K97M4j2K04p04M38j97j25J411j266m8N36n52
2922a99M58k60P1k98O74k86j125J364o00p56J108k04Q05m53j119R39M2j17O52
2941F96o00J66j46K28r53N03qo94J387m06L01m52p73J135j91l88J31M45m49n03
2961e71N92O72q04p8p2o4K86K26J35k21J104k061J170J5L46j194J144p09k58L03
$$ plain form
2814 -685 -193 147 255 696 -246 -361 -126 -265 -696 -140 -323 -491 -53 35 373 94 -632 2 177 -104
2834 -104 -201 -80 -179 -62 -47 303 -106 123 521 33 -64 425 13 90 128 -333 196 -179 -137 541 -150 -39
2856 -39 429 291 531 425 -24 157 154 -64 339 -44 -21 -189 102 103 -188 280 246 173 -426 111 2 181 -85
2879 -85 -234 102 -376 -532 256 -305 87 -12 -18 36 -692 280 -62 -330 -481 -27 -739 95 84 111 -554 397
2901 397 194 723 311 -151 -511 -578 -153 -225 72 116 104 308 -396 42 -155 -280 1131 -135 -183 353 -199
2922 -199 259 -1 70 -228 446 160 -965 399 -201 -957 151 -53 752 299 -820 119 161 44 696
2941 696 96 262 116 344 -609 -106 -114 -808 579 173 474 22 -751 384 193 -195 -64 381 -68 -571
2961 -571 21 693 -111 -189 -261 -325 -39 187 322 101 1205 -856 314 329 675 -519 625 -84 -342 -39
2981c9l31M55R57j185L50l95J194j618R04p17Q39n03O31m95j06K2O56m81P54m89
3001D03J90K32p29j34m63P40j022J070l11N32l33n24J7O64k13k26j19m27J93P40
3021B80m93k40R4k01J91N01k93N60n78R07j65J62m61m14k22M33O09m92q19M68
3041a73M07L8l48Q75q42l83k8J02N55o03O70K20n65L26j056O79K28j75l70R02
3061D59r65R08J36j076K48N32N9l01j78j80j50N32J68j61o17P79k11n36P03j91
3081d2j1k41P12n45J81q6j39j57M08M7k65L21j06j96M70l39K18j35j52K76J70
3102C89j35j14K63p47M46J09l67k06O62j32k36J71m37K19J5o3l75P08k90J06k78
3123b92K83n9K88n03M27m82N83n02N31j50k14m9n72P31r9J80N9J13n66M41J2n81
$$ plain form
2981 -39 -370 85 1042 -143 207 -188 1006 -612 292 -425 414 -89 542 47 -59 -37 619 138 892 403
3001 403 593 825 96 -38 -501 239 -783 287 -24 508 175 -349 -332 332 119 -107 -226 -653 -460 280
3021 280 -213 -453 -359 -560 -369 132 -161 399 -179 728 563 725 264 -150 -372 61 670 178 -641 -173
3041 -173 234 272 -76 799 -43 -426 -454 -352 203 -400 270 490 -75 251 -805 -126 102 -73 -443 459
3061 459 -506 402 538 -538 -290 242 301 0 -178 -358 -508 24 192 31 -586 193 -18 -554 149 -42
3081 -42 -53 -294 418 -127 54 -32 -171 -328 80 127 -138 183 77 -119 351 12 230 95 -57 219 389
3102 389 254 140 403 -344 102 211 -156 -362 300 168 -68 103 -334 -115 -100 -163 -538 170 -120 -14 -292
3123 -292 -9 -68 220 -283 144 -338 245 -257 274 124 -90 -139 -711 20 -79 101 160 273 -293 148 160 -421
3145d21P70o84k7L50K61k39L3K90l50k6J76l88L85j0o93N84l8K95p11Q62K22q07
3167a66J55N6L70n33K85j57K42l01N5j48m25J94K10M12k65Kk52m4N62l41m0K27
3189I8o6P7l89Q7P6K43l09J49M86n24L39J34k96K08o76J57j88K75j26l41R15J16
3211D45m66j46K52k08k16O54k69N3J69n9k64J93N1K43m18L34l98M03l75M44j51
3232B71l57K50k31N30m90n08N14m33P52l32L36m13L31o06k36N45M13p0k74L90
3252C82l96j30M12j26l75R8m31N59q5R81j137Q04k62p10j51R73q89O07J9j0k97
3273a64L2K71m2J21l0l81J37J51m15P98o51j69K07J30j81K43Pr9Q8M2N89l19m03
3296c8N85m35M8r8N2q7m05L65J69j60L91r7m98K21j64N23J73l62K33n32k71Q88
$$ plain form
3145 -421 349 -335 -362 -12 249 10 43 333 -17 -43 133 -255 130 120 -573 11 -27 268 -443 419 641 -166
3167 -166 -11 45 415 -118 167 10 252 -49 6 -142 -567 -373 -163 249 -16 -14 -266 -310 252 -89 -129 98
3189 98 32 109 -280 -193 -117 126 -183 -34 452 -72 267 401 105 313 -363 -206 -394 -119 -245 -586 329 445
3211 445 -21 -167 85 -123 -339 315 46 99 268 209 -55 138 189 432 14 348 -50 353 -22 422 271
3232 271 -86 164 -67 463 -27 -535 -21 -454 298 -34 302 -111 220 -386 -622 -77 336 266 -8 382
3252 382 -14 -144 268 142 -233 -135 -566 -7 -92 889 -248 556 294 -416 -567 406 -483 124 143 133 -164
3273 -164 -132 139 97 218 188 -193 -56 95 -320 478 -173 -342 -135 -5 -186 57 64 -35 53 95 684 365 -38
3296 -38 547 112 160 62 114 27 -378 -13 156 -4 387 290 -208 13 -151 372 545 183 416 -116 -387 501
3318E01o40M77j20J95O4n08l87O76k93l35O50k88K38j22r3L00n53L53l94j55Q79
3339D45l63o30M72K70l6M85l31l36j12K20o68K6P45ol7o05K31J74p0M16l68L80
3361C02m67K98j80N09K19l07K3l73k50l06M13L77m47m5N7N54n95k43M61K01j46
3382E5k31J34J18l54L98l76M58J47p49L51p54O70M28l25PL28kk14l45j59K95J8
3404a02K00j1k34J46r1M35l41m51P08l20K05J16l4l22m34J020r36N81o33L48O
3425a44J05q2P39j031P19l47o13O95K42j86k36K79J0l7K37l19l11L75L10k74k7
3446A04N1k02l5j54L21k7M6j80L31l06J71r6P7j48j43L96k44M2K24m13M84k02
3468I7l4j30J16j31O4m9P2j8J59j22J7j3O2k2Qj96L03k00kjj09K36j75K5P7j76
$$ plain form
3318 501 -139 338 218 413 477 -31 -418 258 -35 -370 280 -8 230 108 15 315 -238 115 -279 -434 445
3339 445 82 -548 -76 194 158 643 312 -24 -136 84 -584 -558 187 181 144 -461 -230 -56 -126 290 -78 302
3361 302 -165 133 -47 462 681 374 397 24 -226 -532 -119 258 -189 -234 -177 377 -218 -461 0 201 55
3382 55 -176 -42 76 -278 120 -256 202 349 -400 -49 -803 -133 295 -30 -23 305 303 89 -256 -415 -120 -102
3404 -102 98 87 -147 -1 -92 343 2 -449 259 -61 144 260 226 -96 -530 490 -446 135 -498 -150 -144
3425 -144 -39 -121 618 -413 306 -41 -654 41 283 97 -139 140 150 113 350 31 -280 95 405 131 104
3446 104 155 -47 -82 -236 85 58 104 -76 255 -51 120 24 101 -47 -190 206 -38 4 228 -185 299 97
3468 97 63 -67 49 -82 -18 -67 5 -13 146 24 41 28 90 68 76 -120 183 -17 -19 -20 -129 107 -68 -43 34 -142
3494a42J16j16J10K08k54K26K7j63M4j58K42k45LJ74L9o7k18J8K16O8k64RN1K47
3518A71n38L33J68R1l04PK72R4j77j82O4K1k6j80K64j74J11j61J51p2q4J81j42
3541a12M21n12K2R3K30o4k12n4J46m5J24j0k24M19j50J76l04N6m8J25R6P4m53
3564b06K61L4m6j38J98k15K31L8j46p4j01J95k0j01qJ65J32j98j33J49o6K3%O0
3588C4J19j79Q2K79n08K10M5M5k6k46j1J37j06M8j3J98M6j04Q1j23j21r6L20j27
3612a6m1K51k16K7J18M4j88n6K35M8l62J58N4j19N8J9R5p9n4J40j72j50Q8L19
3636B01j01l42M14j63L4j68J17L47k11j54K37p9L3J9l25m3j17L01K20j01l80J08
3658a53pJ23m7J2J51k15L56k58o41M43N85l1L19o91M09k71k49j02K52J45J48m66
$$ plain form
3494 -142 -26 -142 -32 176 -78 148 175 12 56 -102 140 -105 -102 72 111 44 -174 -156 60 128 -136 -127 -76 171
3518 171 -367 -34 134 225 -79 -72 200 294 117 -65 -1 20 -6 -186 78 -96 15 -146 5 -67 -151 30 -112
3541 -112 309 -203 -181 -88 142 78 -134 -188 -42 -87 37 27 -197 222 72 248 -56 0 -48 77 173 247 -206
3564 -206 55 89 43 -95 103 -112 119 157 11 -63 -164 31 11 -90 -98 67 199 1 -132 17 -49 -26 -26 34
3588 34 153 -26 56 335 -173 37 82 127 101 -145 -156 -19 -125 -77 -90 108 154 50 131 8 -113 -209 111 -16
3612 -16 -57 194 -22 5 123 167 -21 -77 158 206 -156 2 56 -63 -5 14 109 30 -24 116 -56 -206 -118 201
3636 201 100 -242 172 9 43 -125 -8 339 128 -26 211 132 165 184 -141 -184 -301 0 220 119 -261 -153
3658 -153 -160 -37 -84 -72 79 -136 220 -38 -679 -236 349 318 637 -54 355 84 -165 -267 -15 130 278 -188
3680a88M52n04k05L44M85K31m42o81K92j3K90Rl30O47n21K46l40j16O36j08o63
3701d79O33j54m95N54J36K3J10N9K4n4k44N66m24j95j65l5M95n16J5l81N52J02
3723A27j88K49P5p43N97m10N41n67L87p55N81l22M66R9K9m32M82l66O47k03l66
3744g2L93m76M43m90k1J33j73N59l33k61O62l80M02M5l20k05k02O00l9J40j45
3765B60k32m67O52m83O36n46M90j58l50N21n88K58o2K50l70K15j54J40M5J21J38
3786C16m50M55l4m16L7K09m4Pm67R3L85K66l78R7j18K40j69j57k28N54l6l18K37
3809H1k35N4J82m0n8Q7p2M14j97qj48K6l23M71m60L69k78R4k64K62J69n3K22p96
3833e01L55J19J53l19J10R8L23m42M5N1rJ38L5j94j75N1q9R1J44k29J42l23P06
$$ plain form
3680 -188 264 -240 -445 -101 384 615 173 -508 -216 -229 61 70 -260 387 -134 112 -228 -344 292 184 -479
3701 -479 154 0 -495 59 195 218 328 387 411 357 113 679 255 60 -105 -140 355 -161 -146 -527 25 127
3723 127 -61 188 263 -480 117 -293 248 -319 68 -687 -106 -428 38 137 166 -266 216 -150 497 294 -72
3744 -72 321 -155 288 -202 -223 -90 -263 296 -37 -298 364 -16 386 431 111 -94 -296 304 265 405 260
3765 260 28 -439 213 -270 366 -180 310 152 -198 323 -265 -7 -69 181 -189 26 -128 12 57 178 316
3786 316 -134 321 287 -129 -92 117 73 80 -387 -294 91 357 -21 76 -42 198 29 -128 -356 198 162 -156 81
3809 81 -154 -100 82 42 -16 71 -1 413 216 208 60 86 -237 234 -226 143 -135 -41 -305 -43 126 73 295 -501
3833 -501 -146 -27 126 -193 -83 15 338 -104 -59 -8 -17 121 156 -38 -213 -162 -251 -160 -16 -245 -103 -426 280
3856B80j60k72L81k00R8l85K16J27j32q5J77J0o8P6N6P8k38J75o5m3J91j79P2
3879A10m14N48j24J21r9l18L33n7j41M8j30R9O3L0J3p2j28N8l5QR2k01L48r6o6
3904a0k6J6O4k59J78J03K08l19L9Q0j61P0j09L35k42j27J51l08L90j36nJ98q6
3927D4r5O5j18m58N92k60J18rJ67k31J65K9p9J20P0o6k34K46r2R8p2j32L26k38
3951d4oJ95k02P6j92j43O14l89J38k35K33Pk73M28J00j50M5p9m12O4J68j53J42
3974f8k48M69J9n26O07m91K18j49J43j27R4n9K66Jo7j26R9J5J07m54P8K94p1l51
3998c27M17l5j17L17k38K77l20j03K60j24K4j3L43m08J07j73R5j64L73k38j1J25
4020F7KQ8O2m23J42K55o9M9k46P0j0J55l99L75l9j61J35J15j02k00qJ49m7o8L0
$$ plain form
3856 280 120 -152 229 29 127 -258 -42 85 -47 -132 45 55 -13 63 119 197 -41 134 69 26 217 38 110
3879 110 -304 244 120 241 142 -176 157 100 -41 7 -123 -24 39 69 82 10 -118 -60 -95 -87 5 -196 152 56 -10
3904 -10 -36 -20 44 -215 -37 66 274 -45 -6 74 -87 -17 -126 209 -33 -160 -9 -317 73 -63 -68 130 44
3927 44 -51 14 -104 -562 30 -230 -112 -121 46 -185 -20 9 -70 50 120 54 -180 66 -26 72 0 -132 194 -44
3951 -44 -50 145 -57 19 -173 -316 298 -91 47 -188 45 52 -221 207 307 157 202 123 -289 -225 -57 -210 -68
3974 -68 -316 153 172 -354 253 -238 -20 -169 -26 -153 -59 -118 148 149 82 -44 55 70 177 -277 -199 95 24 -327
3998 -327 90 55 -62 255 17 294 -26 -129 131 7 31 18 361 -47 60 -113 -18 -182 191 -47 -58 67
4020 67 69 157 219 -204 -62 193 124 173 -73 -3 -13 142 -257 118 79 -82 53 168 66 -134 -142 7 -40 -108 -78
4045g8J13P8J51j36j17k9l2J5q8J90q6J72r8J8j53J96k15lN0J62m4k01J6J56j84
4070a47R7K32j65R6K7l42L48j59j4J22j94L64o17L43L76l03J0j91k7K94Q9P3k89
4093B3L6K8k04l2L13j96n1q1L1L63j36m25M80l17L07Rj71P1K8j50J22j18M0o1
4117i1J92k20K63j60k9J75l55K91rm43O33k13Q8j9j00jJ03k60J33j59L27j64r2
4140a10J93j21J9P9o9J34k04J19K32l54K62j73P5j33N9r1N6R0J94k35J53K1k19
4163b3k94M90k94j7l8K10R7r6j09pR8j64K08K36k15l00J90k5O4l23J69j16J88
4186g1K30k73J29J06q6j04J62J7j3j95J03k72J91NM7L47l89j3j79J07o3LK77j8
4210D8M0l14K54M2j05N84o24K97j97Nj32K94m04M10M41j118l7K60L73j10Q9p0
$$ plain form
4045 -78 35 113 264 128 11 -18 -50 -35 -123 67 -19 153 55 73 -80 116 -99 -102 -52 110 66 -135 -119 37 -147
4070 -147 -50 182 17 113 140 -202 146 -13 -27 95 -99 265 -352 -9 367 64 74 -117 -144 150 239 312 23
4093 23 59 87 -117 -149 164 -32 -83 -164 -133 230 94 -331 149 -168 139 148 -23 48 76 -74 48 -70 -30 -91
4117 -91 101 -119 144 -16 -45 130 -225 66 57 -386 247 34 122 103 3 2 105 -155 -22 -181 146 -18 -110
4140 -110 83 -38 -19 60 -9 125 -79 40 272 -82 180 7 82 -51 8 -83 -27 63 257 22 175 196 -23
4163 -23 -317 173 -121 -138 -176 34 131 35 -74 -81 17 -147 61 297 82 -218 -28 -53 11 -312 -143 -259 -71
4186 -71 159 -114 15 121 35 -69 93 110 97 -98 5 -267 -76 -71 -24 323 -66 -79 -258 -151 -214 -211 66 48
4210 48 88 -226 28 70 -35 549 -75 222 25 30 -102 192 -212 198 639 -479 -516 -256 117 7 96 26
4232B6KL00N02m73n69k89J35J46N75l64L80n56M36k02K47n13K24P0K06m70J51
4253c6l78L7L91O7p10N23O37p14O06n27k13K48k61M50n8j008J157J79l7m60K08
4274A01m19R89o55j70j90J63J10L6J39N98j101P68j92J93m27J96l58J7J15J64
4294G7K21J05q51J164j140K53M88k59k41J5L64n52J63j82Q01n98N6%J62j50K06
4315A02jm1k32K89p5j03j02j54L12J02j16J17j90J15JJ16j22R9%j67n5M5R8k69
4339b31L93k8k73K86n3j62j43J31J95p4j64K0R3J13p6p2m3Q0r9K21r6nJ3n0l19
4364c43M23j26K39J07k90j19j37M4K41j44J8J42j14k2j0J99k58NK37k06K18K6
4386A30j09Q5p7k53N90l70j29L98r4j95K25j83O2p8k27R6J70L6J61k70m0L44k27
$$ plain form
4232 26 28 328 830 357 -212 -501 -366 -220 355 -9 371 -185 251 49 296 -217 7 77 283 -187 -36
4253 -36 -414 -377 14 81 -629 -106 531 -183 423 -104 -317 -69 -330 120 62 -946 211 390 353 -107 101
4274 101 -318 671 16 -154 -344 -181 -71 -35 104 702 -399 369 177 370 -57 139 -219 -202 -87 77
4294 77 298 403 -448 716 -424 -171 317 58 -183 -168 196 -356 -193 -375 426 -172 -116 -116 46 -104 102
4315 102 101 60 -172 117 42 -61 -163 -317 -5 97 -19 98 -92 23 24 140 18 117 117 -50 -105 -60 38 -231
4339 -231 162 134 -139 147 94 -68 -211 -80 115 41 -123 -103 -10 103 27 -45 -88 -8 -107 114 18 13 26 -24 -343
4364 -343 80 -46 193 300 10 -109 -246 -202 39 -105 -87 55 -59 -81 -91 108 -150 -145 92 -114 104 130
4386 130 21 106 29 -224 366 -4 -133 265 171 -24 201 18 80 2 -225 -129 41 77 238 -32 -72 272 45
4409D5kJ3j76J77J35Q2j73k64l0Q2J82l38PJ4K43r2p1P9nQ8j89PNJ58M5j28J76
4436G0ml12J52Q4M0L5O8J00m73N75m23J04k48M10l87M60l62m2L7L50j67l04K43
4459Fl75J32l2O20k53m14k2K12M95m01k51L37N4k16J6M42p36O30o29L02k0m31
4481e34O78J02k64n28r3j54M80n36M84o3J085o04k24m72R17R9n01K72k05O1j27
4502a27m22M95M82p02l2K16L67K21j086Q14n18L01o07P59q1Q7P6L1R7R6n39l90
4524d62k24R57l98L70J96n22O2k82N52m89K79n07l8O30k42M13l67p78J88K17j
4545d46M71k37L15K14j86k87M97q40P24L47r57M17j02k23J03m68M24K41o1N41
4565D87k07J43m4o07L90m15k01M47N91l31r19R16l92O31q79J55j0K4N78o23J88
$$ plain form
4409 45 43 56 -120 57 192 274 101 -163 -193 -111 71 -267 -260 -246 -3 -95 -166 -87 -92 -4 -193 -186 -181 -23 22 -106 70
4436 70 66 -246 -94 -10 30 65 133 233 -240 335 -88 16 -232 178 -209 251 -111 -153 -116 234 67 -237 6
4459 6 -369 -237 -269 351 98 -316 -338 -126 369 -32 -283 54 108 -108 -92 350 -386 244 -385 -83 -103 -534
4481 -534 144 246 -18 -546 -639 -793 -313 -849 -365 -428 657 53 -171 -643 274 373 -128 144 -61 0 -127
4502 -127 -549 -54 428 -274 -306 -90 277 498 -588 226 -292 9 -598 161 80 167 243 274 371 467 -72 -462
4524 -462 -686 271 -127 243 439 -83 -21 -303 249 -240 39 -468 -506 124 -118 295 -72 -850 -662 -445 -446
4545 -446 25 -212 103 317 131 -156 341 -499 225 572 -385 32 -70 -293 -190 -658 -234 7 -54 487
4565 487 280 423 379 -228 162 -253 -454 -7 584 253 -666 250 -142 489 -390 -235 -245 -221 357 -266 -78
4586g8j25r0K18K75n67M25J50o23P04Q7j01n84J75L4N55m34p1K59l4l8m15O68
4608C90n46J34j47J13K2J71l42J20m2j38K37K54J15j45l6J04j79p5j3K64k13K4
4630G2m0O7j47N8p7j93K88J24P1k09rJ42j66J6K01k33K37Oj94R1k05R1KM0jM4
4656G6k26K14j82L05j65j94J17J57k86M36j86m2k06K13m4q3j69R9lJ32L2j30l0
4679a65K56J25l69J87J68k08n6P2J9j35k87J53J17J90k46N7J56j55K19k01l7K3
4701a17J55k38j03o7K85O4k7j42R7j67M18K95o31J2J60M70o99K75k19N47j37p9
4723A52lj78J21m6j64J88k89Q0M24p6k06k9L14n80j8J04K90J24k43J20L4j86k0
4746h7J03O8O6K89j99o84K50R7K82q0J61m56K42m1J46j38P5j26l42K14J37j02
$$ plain form
4586 -78 -203 -293 -75 200 -367 58 208 -415 289 376 275 -309 -134 -100 455 21 -50 209 175 137 -278 390
4608 390 -156 -22 -169 -56 -34 137 -205 -85 -127 -265 -28 226 341 196 160 264 85 10 -3 261 48 72
4630 72 32 99 -48 10 -67 -260 28 152 223 14 5 147 -19 -3 198 -35 202 208 14 105 -100 -9 -7 33 32 76
4656 76 -150 64 -118 187 22 -172 -55 102 -184 252 66 24 -182 31 -13 -96 -265 -166 -169 -37 -5 -135 -165
4679 -165 91 216 -153 34 202 -6 -62 10 29 -106 -393 -240 -123 67 -179 -122 34 -121 98 -103 -140 -117
4701 -117 38 -200 -303 -370 -85 -21 -48 -190 -93 -260 158 453 -178 -166 -6 464 -235 40 -179 368 231 152
4723 152 149 -29 92 46 -118 70 -219 -139 285 209 3 -26 288 -292 -310 -206 84 208 -35 85 119 -67 -87
4746 -87 16 84 150 439 240 -444 -194 -97 185 105 266 -190 52 11 157 19 94 -32 -374 -160 -23 -125
4768a25K21K9j40l0J44n8J0m4j62J39j23J55p6J65N3j01K9N6k83K26j47l39N59
4791A58l27K40J3q5N5k47L79m54L89J8j74mk81O33l43p0J00n20N66m32J90N27
4813C31n86J64K97k25k18j05M1M08K9j11l41L71l56N14k96J08L00n64n2L64N03
4834E76p33O62r22o0O07r6Q5K7Q2l67L00j91j23K36k85J04k48J53J34l52L43R6
4856B8L78l23l23M8n6l33N57K95j13M8m98K40L13n11N62l84j31L7R0L12n2m88
4878c04O97n33j45L12J74n33K52J28o88O10k97J82M66k62j59M03Mj78l22j19L69
4899E7j74Q5n7L56qk88j35j49j20Q05j25k61J52p29N19rN20p84N75k99k94M38
4921G5k19M42p9n1p52Q16m79p0J47l5Q2J6k10N40j2m40N11J85j2o30J80p20L2
$$ plain form
4768 -125 96 125 -15 -45 99 41 51 7 -155 -16 -139 16 -60 105 158 57 86 142 -141 85 -62 -401 158
4791 158 -169 71 84 -1 54 -193 186 -268 121 139 -35 -39 -320 313 -30 -100 0 -520 46 -386 -196 331
4813 331 -255 -91 206 -19 -237 -342 -301 107 136 25 -316 55 -301 213 -83 25 325 -239 -291 73 576
4834 576 -157 505 -417 -477 130 34 119 146 228 -139 161 -30 -153 83 -202 -98 -346 -193 -59 -411 -68 28
4856 28 406 83 -240 -192 -248 -581 -24 271 158 206 -292 -52 261 -250 312 -72 -203 -166 -76 236 184 -304
4878 -304 393 -140 -285 27 201 -332 -80 48 -640 -30 -327 -145 321 59 -100 303 307 129 -193 -312 57
4899 57 -117 -32 -89 267 259 -29 -164 -313 -433 372 247 -14 138 -591 -72 -81 439 -345 230 -69 -363 75
4921 75 -144 298 219 168 -584 232 -247 -317 -170 -205 -123 -107 -317 223 211 -229 282 467 455 -175 5 -715 -683
4944f83R96o08m9r7o61Q74K14rp06R53q1m59P91j103R85o64N20k76N31J85j285
4965f32L49n94J364l77o98R0q3P87l61K17m99K48M38o81K60J46k06k28M92L64
4985C96k49q6M68q32N23k07j50Q47j455K37Q26r17J21N56r7J88q30P27J65o18
5005c87K53N52m60Q7p9p97J056j012L21K81j4Q29q50L74j24R9N9R7R0m68K3m80
5027e50P21l57k6K51k69L56N8j62L90o74Q44j5m41N8n36L02J03R7K48m61j92Q6
5049a69J24m51M60M92j88o50N26j76J12n45R64r82O65l64J42j84Q19o27l55K6
5069c61N69j93p29O39J60o6M6K88m88L32l66K2K76L72k46R4L18n20l05m3lL30
5091A26k25J73j45K51J13J39n51p3k32L66k00J89J63r2K35n49J96J41Q4Q2l39
$$ plain form
4944 -683 313 -295 -344 -441 -1102 -228 -14 -23 -729 224 143 -316 475 -628 357 -307 213 -63 468 653 -632
4965 -632 -283 -877 487 110 -588 -498 -581 206 -155 62 -437 -189 249 -432 -172 -26 -232 -460 32 396
4985 396 147 61 529 -303 220 13 -137 710 -745 -508 318 -599 -478 78 -19 169 -661 66 231 -387
5005 -387 -134 418 -42 45 -34 -831 225 -787 -466 -185 -199 630 -220 154 30 129 188 285 375 -93 -70 -550
5027 -550 171 -186 -212 39 -230 126 184 22 412 -262 582 567 126 184 -352 -50 53 150 398 -63 -255 -169
5049 -169 -45 -496 -36 456 268 -382 144 -32 80 -465 499 -483 182 -182 -40 -224 595 -32 -387 -361
5069 -361 208 15 -714 -75 85 19 65 353 -135 197 -169 -147 129 501 255 349 667 147 -158 -201 -204 126
5091 126 -99 74 -71 180 293 432 -119 -192 -424 -58 -258 -69 94 2 237 -312 -116 25 109 191 -148
5112a48j11L85l14K24P2q1k0j49K21J36o43M35j23j79l12N65l51N35j17j15p22
5133h12R98n6k25M8j83K05K49k83k58l36K85j55P10n71J504o33j105N00O13n05
5153a0o49J856q34K68m87L15j000J131r44N58k90J114j102j715J846o77O84L46
5171D10n76Q39K81p97p25M85j80j05q9O23n39N90j029O61j29N32m31j69K58Q4
5191fM88p24J476j040J47R59j766J144j283P55l13R2N65q48Q98j394O27Q71l94
5210B54o04M52L91m47N75q71m53R44M46j0k96n00k37O64o15N82L31n4n10J28R
5231A79n4m63K87l27M8J176j601J079n61J06p44J164O48j53o73l14P1n37j93J157
5251B95j10K98p7J41j063M79k44l24O24l06K57M58q14M23L07m04N32p97L04l22
$$ plain form
5112 -148 -259 126 -188 36 108 27 7 -142 79 215 -428 7 -116 -295 -607 -42 -393 142 25 -90 -812
5133 -812 186 130 -95 -47 -230 -25 224 -59 -317 -653 -368 -523 187 -384 1120 487 -618 -118 495 -10
5153 -10 -659 1197 363 631 144 459 -541 590 -354 204 -86 1028 -74 -1789 57 -620 64 410
5171 410 -166 673 954 157 -568 -83 -263 -368 -457 166 -373 217 -812 -151 -280 252 -179 -348 -90 -6
5191 -6 482 -242 1234 194 341 1300 -466 678 -605 150 -163 -71 494 -354 544 -850 -223 648 254
5210 254 -350 102 493 46 621 -250 -703 241 687 677 381 -119 -356 308 -307 275 606 552 42 170 179
5231 179 125 -338 -51 -378 -330 846 -755 324 -237 -131 -875 289 937 784 111 -203 -132 -669 -862 295
5251 295 185 483 406 547 -516 -37 -281 -605 19 -287 -30 428 -386 37 344 -60 472 -325 -21 -343
5271c43O36j0j42Q6j18j81K6l44N5J85m83L57P1M13L19n78K05J13m14O4K22k22
5293h3k4J10p6lM5J07k82M1J65Q6J25p10N99r2J10R9j29J7j03J32j36K17l54m8
5317a87J24K11J29j07j44J33o7j38j29J60J65l76L36r3J2P4l1J08k16o1J16J28
5339A47l02J2K19L1j30j17m8J77LmJ87l50J06k7L13j80J9j09J58j62O1q8K13m9
5363H0k19J39j2R0R9j35%nP4q7J01o2J84l73K37Op8k6k04J99j32l2M60n4o7j55
5389B8m5K2n0J37J15k18k71M23l76J62J14r3O1j40R8J50l14K8J81J0J50p8Rl74
5413b71K32K08k82Jk8J44J86j92P4K7l7j36oj86M06j48j22J47N8R8q0J82o8j54
5437E3k9L9K08k83M4J46q4J09j11Pj60R2j84K75k28j45K91q9r1J5J47J7n0M2j62
$$ plain form
5271 -343 293 283 141 227 109 -72 -46 -390 -335 -150 -633 -276 -205 208 527 -51 154 267 -147 -83 139 -83
5293 -83 -107 3 -73 -76 -31 76 -206 -165 0 86 211 -499 100 8 118 217 88 105 2 134 -2 215 -139 -187
5317 -187 -63 148 277 170 26 159 92 -46 -175 -15 150 -226 110 17 29 103 72 180 -36 -97 19 147
5339 147 -155 -143 76 107 -23 -140 -188 -11 -8 -12 175 -175 -69 -96 217 37 56 -53 105 -57 4 -84 129 80
5363 80 -139 0 -12 78 177 42 42 37 111 24 125 63 247 -126 111 117 39 13 -191 8 -124 -156 304 250 183 28
5389 28 -17 5 -45 92 207 -11 -282 141 -235 -73 41 -52 9 -131 -33 117 -197 -169 12 22 172 94 103 -271
5413 -271 -39 169 -113 -112 -140 4 190 -2 72 99 62 -74 -80 -266 140 -8 -130 17 75 173 93 275 207 53
5437 53 24 63 271 -12 32 178 94 203 92 99 -61 31 -153 122 -106 -251 40 -49 -140 -125 22 39 -11 31 -131
5462a31J86OJ00k40J2R6q1M9j9j30o0M12j59l4k4K62ol65O2J04r2L00n61L23J04
5487A14j6m7j69J66K50l07L9L0q3J79k77M01k97R8J56j66j38k4P5N4J10r5N7k79
5511a69J88OR9l51L23j34j00L28j44j79K85k60K77k88K23k8ol33L46j82J35L1
5533F7j59q7J81j41K93k02j46L79J0j74j27K32j56K6j14K98r2l01Q8Jm7K18m5
5556BK6j10Q5p7r7O4Q8J43m1K17l44j47J31J42n1J19j94m3J95q4K39k08m2k51
5580b38L75l37K7J42J6l4o3Q9J17jk84K58j41K06k63j8K49j8m6m7j57J58k60M22
5604A52r3O8j80P5J29k07Mn5J23Q0k32L20k04l0J93r0j39J92j04N9k51RL99n18
5628c00K05L4J76l4j8M8N8q2M0N0n0r0j70K15j94k9J52j26J5R6k20J71J72k71
$$ plain form
5462 -131 55 61 161 -79 -67 29 -52 -3 -22 -152 -212 200 41 7 -17 245 239 -126 -64 40 -52 248 -313 10 114
5487 114 98 51 -118 48 298 -9 30 60 -23 156 -121 280 -17 81 237 71 -67 -91 -16 38 148 53 110 -169
5511 -169 19 25 124 -227 96 -38 -138 190 46 -133 152 -108 169 -119 104 76 70 -263 83 -99 36 67
5533 67 -92 -179 2 -139 154 -48 -194 185 195 21 -106 126 -30 -4 -118 180 88 -213 -125 -124 -171 47 2
5556 2 28 -82 3 -74 -171 -107 -19 124 83 300 -44 -191 -60 82 31 150 -44 -87 108 24 263 55 13 -238
5580 -238 137 -200 -173 -31 -15 -49 -112 -23 94 93 -191 67 -74 132 -131 -149 100 82 36 -11 -168 -10 -270 152
5604 152 59 127 -53 22 151 -56 -52 -107 16 96 -136 184 -20 -50 143 53 -86 106 2 61 -190 -181 218 -300
5628 -300 -95 -61 115 81 63 111 169 87 127 177 127 37 -133 82 -112 -141 11 -115 -100 -4 -224 -53 119 -152
5652a52mJ1j9K95m30O13q9m67L66K68o74L86J33j7L46p76J20J85n59L81K53M7
5674B17K75l14k07P1k48J79K9K01m96J43K86J32j76k13j2k06j44R81K20o19k92
5695a93l23N17R89q32o83N66n40M84K84M72p03p51R31q55J387k85j046O2L19M72
5715B72M62o08j58P61j167l74Q25l64O15L25r7o2q48m9M55N1J90n13j43L10P37
5736F20n67n30K56K11k12K23N23m77K85J50j453j95J375n9K2j35l9N32k58k66
5756FQ0p90R83K19J30q55J93K85l39j10L32m95J01J47j78O33l14l32k08N15l95
5777c92L87k79K95l08N27m69J31k03J90J71N7k40N76j81m83K52j79k7N08J1l76
5798c2o0m4J68Q3p0P9j35n6J86p3j23Mk07M37j68K13m01M79n8j49j55K8j95L90
$$ plain form
5652 -152 -156 -145 -164 131 -299 314 225 -242 124 392 -282 104 237 220 566 -210 -90 95 -464 -83 170 217
5674 217 492 178 -29 42 -206 -27 2 203 -293 -150 136 268 92 -121 -133 -339 -483 498 718 99 -193
5695 -193 -516 1 990 158 -525 41 -499 -15 269 741 38 -713 218 -637 750 465 -581 -519 -200 272
5715 272 734 126 -32 729 -438 -812 13 -351 264 589 492 430 -418 -467 -12 39 229 -284 -427 -117 620
5736 620 53 -477 -221 -10 -222 1 524 47 332 482 -971 -1166 209 150 172 37 -2 530 272 6
5756 6 86 -704 279 498 628 -227 -34 251 -88 -198 134 -361 -260 -113 -291 342 28 -304 -512 3 -392
5777 -392 -5 -284 11 -297 230 -239 -108 -311 -121 50 107 -133 443 262 -221 31 -148 -175 333 344 -32
5798 -32 -92 -136 32 115 45 124 -11 -67 119 46 -77 -73 -280 157 -11 202 -199 280 222 73 -82 -54 -249 141
5822A41j62K49l43J19k32L36k04O7J3J77l08J97n22L71Q0M7k42L39m5m5J25P8
5844B36j93l7K8q4m8L50l25L8l12J80K50j16K46k57M37j03o96L54J17r9K7J72
5866A65j93j09K07J4j12l9K77l88M3J50j02L72l07r3O4K3J36J2n1j67L3L44l12
5889c3k12K45l1o1J61j69o7J06j84M2K1L01j29M2q3r2N2K07p7J7pnJK14n71L06
5915fP3M4j67j08L27j64j94j1K35q5L34r9Q1k53kj79N4J98j2J69l7k00r6N13o81
5940b66K12L27k91K82k75m08L79j05k76J39L87j12J73J54o34P49k96k22j12L1
5960a64L7q9K66k73M01m35Q8K80Jn5q2n4J02j72j91P11J40n71K31J94P3m28Q4
5983I4k4p96J014p6n22R67o35nl62k12k5K0J62J010p70J27J03J49L24o49K9J3
$$ plain form
5822 141 -21 228 -115 4 -228 108 -96 -29 -16 161 -147 50 -472 -101 -21 26 -216 123 78 33 158 236
5844 236 43 6 34 -50 -98 252 -73 -35 -347 -167 83 -33 213 -44 393 290 -406 -52 65 -34 -7 165
5866 165 -28 -137 70 84 -28 -67 210 -178 -135 15 -87 285 -22 -115 -51 -28 108 120 69 -98 -65 279 -33
5889 -33 -245 0 -31 -92 69 -100 -167 -61 -245 -203 -182 119 -10 32 -51 -143 -91 116 39 56 49 44 45 259 -312 -6
5915 -6 67 111 -56 -164 163 -1 -195 -206 29 -56 278 179 260 7 5 -174 -120 78 66 235 198 -2 -98 415 -266
5940 -266 -54 273 -18 264 -11 -419 -40 -145 -421 -282 105 -7 166 320 -314 435 139 -83 -195 -164
5960 -164 -127 -216 50 -223 178 -257 -169 111 112 57 -25 -79 23 -149 -340 371 511 -60 171 365 438 10 94
5983 94 70 -726 288 212 -310 657 22 17 -345 -557 -582 -562 -400 610 -160 -33 70 219 543 -106 -77 -64
6005f4K20k86N44n40L47o07J34k72J40J59O19n96M56m45j25P55j48o23N45K42
6025D55p63L56K30N21o63k31j38M22j71J86P4j63J41J08l61j37J30j62n1K82m06
6046c41J51r2K44J58l0k17j45K44J88j06J58O4k63J45j27r8K1Q0O4j22o9J12j62
6069a43J94M7k07LL52r9R1n8K5l50J55N7j25JJ65j42L4j57n7k19M36k0l1j08m4
6094b00J33j02L8P5J54j65k08K71O0k25J19J41K8k79N8N8J89Pl96J11J12L22l80
6117g9J13j39r7J79K02p5PK8L3j60O8l16K04J80k46J54j68O8Mj16J99K63m55J48
6141a%j12J63j81j49L45k91K13K09k43J68o4k93K62L7Q7k0j31n4J19M6k93J26
6164e7N4o3L5l3J93k10j70R5J42Q1Jj39j8kJ04k8J76j27j02l7O0j44M11m4l43
$$ plain form
6005 -64 156 -130 414 -126 221 -386 -252 -524 -384 -225 394 -202 254 -191 -316 439 291 -332 213 455
6025 455 -308 48 278 799 136 -95 -233 189 18 204 278 115 256 364 3 -134 -4 -166 -217 65 -341
6046 -341 -190 -282 -38 120 90 -127 -272 -28 160 54 212 276 13 158 31 -67 -46 34 98 -24 -93 19 -143
6069 -143 51 98 -109 -106 246 147 238 180 205 -145 10 67 -58 -57 108 -34 0 -157 -214 -433 3 -17 -48 -156 -200
6094 -200 -67 -169 -131 -56 98 -67 -275 -4 56 -169 -50 91 119 -160 -102 -44 145 152 -244 -133 -21 301 -79
6117 -79 34 -105 -202 -23 179 104 111 139 172 12 80 -236 -32 148 -98 56 -112 -44 -40 -156 43 306 -149 -1
6141 -1 -1 -113 50 -131 -280 65 -226 -13 196 -47 121 57 -236 26 63 150 130 -1 -55 64 110 -183 -57
6164 -57 -3 -66 -31 -64 129 -81 -251 -156 -14 67 68 -71 -89 -91 13 -15 161 34 -68 -105 -45 -189 222 178 -165
6189a65L67J03m67K09k0L16n57L54k03J18J77n89M59j44m8J28n7J42l4j74K89
6210B04l36O5L66l78J69l0J4j21m2J21qj42q1K66o9K4k9J6p0O2K60l60J42n2J70
6235A61l06M17n28L81j8k38J98l20M10k66J6J00k01P9K71k51l0J28k5J0j70q8
6257b70J36L47l79K91n38M13j5p2l4J35q4k67N76l20l56O08M84j008M82l46M07
6278A90N1L17k31m30K39j71J69k37J11k83M92j36n27N88n86O91j39k27M4k80L92
6299C7Q8j53J1K38l72K04k08Q2M12k26m17R57m66k4l21O68l64j2J42j61k6j74
6321h5N2r2K9M55l67k26L14M3k77J68L5j34M27k97m8K27j35j7K53l49l10O84p10
6344c60J01J22O22o28O97n67K94k48j12P03o46N2J94p1j67N0k27O03j89q33R56
$$ plain form
6189 -165 202 305 -162 47 27 343 -214 140 -63 55 232 -357 102 -42 -90 38 -19 123 89 -85 204
6210 204 -132 -67 299 -79 90 60 74 -47 -89 32 24 -118 -199 67 -2 22 -7 9 -61 1 261 -99 43 -9 161
6235 161 -145 272 -256 125 107 -131 67 -253 157 -109 -93 7 -194 -115 156 -95 -125 3 -22 -12 -182 -270
6257 -270 -134 213 -166 125 -413 0 -15 -87 -121 14 -70 -337 239 -81 -437 171 655 -353 129 -217 190
6278 190 241 558 327 -103 136 -35 134 -103 8 -275 217 81 -446 142 -444 247 108 -119 -75 -355 37
6299 37 125 -28 -17 221 -151 53 -155 -73 339 113 -304 653 187 163 -158 510 146 134 276 115 89 -85
6321 -85 -33 -125 -96 359 -8 -234 80 123 -154 14 49 -85 342 45 -3 224 89 72 325 -24 -334 350 -360
6344 -360 -259 -137 485 -143 554 -13 281 33 -79 624 -22 30 224 153 -14 36 -191 412 223 -610 346
6365C46k98k23j5k33J24P79j58p63J11Q1N46J11j089N35l79L00j80N15r5J68O
6386A89J47k54L2J53k78l98j16M51N58r7k32k58M80l58k09K07P82j242l5N2j21
6407e47M44l44N81o99P44l66L87p54M71L98M51j10o78N57j07l41l65j79K53J74
6427c0K76J16l6L9k19q3k61M17P6R2j52M9m17Q68j046Q71o1l13O06j294j98k18
6449i18J632p43k79j77K57J74m06N53K59o06j7K86o39R78l78j0M19l51P03m57
6469B80o77J92M76n48J77j05J48R2kp93M96k48P58j81P04n08l4m0j30k56k62R58
6491D97q68P14k07J27n96N27l99O58m61p8N28j52o39r0J005m83n24K38O46k06
6511B37O30n78J35N36n92K33k78n15O39Q6l68r1K7l03L69m15n18J237n58j46N65
$$ plain form
6365 346 48 -175 -190 -423 -299 480 322 -441 -330 -249 297 408 -681 -146 -525 -225 -405 110 15 183 189
6386 189 336 82 114 267 -11 -409 -525 -74 484 387 155 -103 377 19 -190 17 799 -443 -478 -426 -547
6407 -547 -103 -447 134 -565 179 -187 200 -554 -83 315 766 656 -22 535 428 87 -278 -457 -204 -30
6427 -30 246 362 326 365 146 63 -198 219 295 387 235 284 -133 735 -311 560 499 186 792 -502 -700 -918
6449 -918 714 -29 -308 -485 -228 -54 -460 93 352 -254 -271 15 -624 354 -24 -34 385 34 737 280
6469 280 -397 -205 271 -277 -100 -205 -57 35 33 -760 -264 -512 246 65 769 261 227 187 57 -199 -461 497
6491 497 -371 343 136 263 -333 194 -205 453 -8 -86 442 290 -349 -439 566 83 -441 -203 443 237
6511 237 867 289 424 960 368 601 323 -192 447 533 165 74 101 -202 167 -248 -766 471 -87 -233 332
6532C32r6l96K12o0L36K18j15k89N84j250K21K25J0j40K85m65N18m47Q90n08J44
6553B09L73L27q90J56J62k69M33o29O21j30P4o5p99J1M14J61O5p9l01k95L56K9
6575f6K89r1l53O38o31P79l9n90L35L15J8p57L00L1j93p64R39J14N82r13J65l51
6597b43M40j59L77l60j31R83j093M06L20p4o13N12J50j098M43O1J46p5j67K18
6617D3nn49P01k39j94J49o36P75j68L07M4j65O64p70K15n41Q70r84N79k0m80J204
6639H00p06Qp07J092r73q7J217l94q30R70l45m42J061r83Q27l46q5m03O77l17
6659C4J35J20l37L10k54j77N79r54M60J01l19J5O30k51K84p08N76p90O99K8j20
6680F1J83j25m29Q34k53o74K59l16K44O63k82J15m20PN21j044O88o3r7K41k57
$$ plain form
6532 332 236 -160 52 -8 328 546 431 142 726 -524 -303 -78 -68 -208 77 -388 130 -317 573 65 209
6553 209 582 909 19 175 337 68 501 -128 493 363 437 372 -427 -416 -2 159 224 145 -156 -451 -95 -66
6575 -66 223 132 -221 417 -214 565 526 -64 271 586 604 -153 147 178 -15 -779 160 274 856 -57 108 -243
6597 -243 197 38 415 55 -76 907 -186 220 540 466 -147 365 515 -583 -140 -79 67 -8 -175 43
6617 43 38 -511 190 -49 -243 -94 -730 45 -123 184 228 63 727 -43 172 -369 501 -483 96 76 -404 800
6639 800 94 102 -605 487 -486 -573 644 250 -580 390 45 -397 664 -319 508 162 77 -326 351 34
6659 34 169 289 -48 262 8 -169 410 -544 -84 17 -302 -287 343 92 376 -332 244 -546 153 181 61
6680 61 244 119 -310 524 271 -403 -144 -460 -216 447 165 280 -140 -133 388 -656 32 -31 -128 113 -144
6701a44j26j1O79q8m55J1K82k9j74j1k99K51J16Nj00K20l59L54j95R8j45j28M24
6724A76J32j5k61J93k78r8l08R78K7n17L4j22j13K57l7j67J91m96L63LJ16k48
6746a90J00K16l01J13N19k76k21j83L7k05M06L9j73L70n89M15N0k6M2J98k98k04
6768a61L26j53J94k33JK45k26j60M4P8K47l80j08M62j26l27O22m28K43L00m70
6789a0K46m92J26k98Q19o67K33M25P3l16m61K91k19O17j88j08J44j33j72J93J87
6810B90k80j71m0M7J88k54O8M31m95K1J98j86L16N4l27M31k19J57o03Q9K43p73
6832h15Q57J40J26o10K14R4P5M5J57k83N70o48L96L3p13L5M05l38O48p69L98k62
6854b45j6q1N62m39P61k52N24m81l51J64L30k6r70N00O6j36r5R6J9J63k15L89
$$ plain form
6701 -144 -270 -281 398 310 -145 -134 148 119 -55 -66 -365 -114 2 7 -93 127 -232 122 -73 25 -120 -248 176
6724 176 308 293 32 225 -53 -151 -459 519 546 29 63 -59 -172 85 48 -119 72 -424 -61 -58 58 -190
6746 -190 -90 126 -175 -62 457 181 -40 -223 -186 -391 15 54 -119 251 -338 77 127 101 143 341 43 -161
6768 -161 165 12 206 -27 -26 219 -7 -167 -123 -45 202 -178 -286 176 50 -277 345 -83 160 460 -10
6789 -10 236 -256 -130 -428 391 -276 -43 382 455 139 -322 -31 -250 367 179 71 215 82 -90 103 290
6810 290 10 -161 -201 -154 34 -220 -152 279 -216 -195 3 -183 133 187 -140 291 72 229 -374 -285 -42 -815
6832 -815 42 182 308 -302 -88 6 81 126 283 0 570 -78 318 351 -362 -327 78 -260 388 -381 17 -245
6854 -245 -261 -342 220 -219 542 290 814 333 -18 146 476 450 -520 -20 46 -90 -185 -89 -70 93 -122 267
6876B67k31K95l41P29q95J8K79K5K03l30L12m8m26L92j86lj50q2P96j28n58K77
6898B15n11K23N5j62K68j85jL14K90m35k15O7K10j69K17k77J45K4KJ04l06J68
6920D1J30k10L4j21K62k13J40l06N4K32p1l7J50L8j64L3J16m6j64K25k28j07K51
6943C9l68L34R8n8l04K93j35N8j30J87l21P04m48J99l12L0K28m5K2l97O29l58
6965e5L29n10M20k4m56K34l0Q2M6J92k53j0lk36N88j25j46M4k40j57L93m25K98
6988d4j3J82r1j70N5k98L0O08k60k7j37R2m7L37l13L66K41j038L90J56q7j06L15
7011A41k91j98N48k91K17j00k36M79k20R2r4l57N49l31k40P52l67l07N6K77j13
7032c4j52R9J6k68k25N39k9J48j93M58l39n9M57m08n0M4J88l39K79J50j12k79
$$ plain form
6876 267 36 331 -10 719 -176 -158 121 146 349 19 331 283 -143 249 63 60 -90 -172 624 496 -62 215
6898 215 -296 -73 -18 -180 88 -97 -98 216 506 71 -144 -77 133 -36 181 -96 49 73 75 179 -127 41
6920 41 171 -39 -5 -126 136 -77 63 -243 -189 43 -28 -65 85 123 -41 -8 108 62 -102 123 -105 -212 39
6943 39 -329 5 103 45 -259 34 -101 -43 -173 14 -307 397 -51 148 -164 -134 94 49 71 -326 303 -55
6965 -55 274 -236 184 160 -296 -62 -92 -10 36 228 -25 -35 -38 -274 314 189 43 87 -153 -310 83 -342 -44
6988 -44 -57 125 34 -136 -81 -379 -349 259 -1 -28 -165 -73 -120 217 -96 270 511 -527 -137 19 -68 -174 141
7011 141 -150 -348 200 -91 126 26 -210 269 49 141 47 -310 239 -92 -332 420 53 -254 -198 79 -34
7032 -34 -186 -87 -71 -339 -564 -25 -54 94 -99 359 20 -39 418 10 -40 4 192 -147 132 282 170 -109
7054a09j93K04j75P24m39j34o0L34K18n66J60k58J29K53m5R0k97K93n3l00P6L42
7076A94l27L31j79R2K4j3l36K53k87K29MJ53k23K38n7J8K42k82M44l06l33k81
7098d02L96K69n47L28l13k15M42k02m1N30k86j72P1K67M9M3m60L82n7l39M65j07
7120A01m00J06M51j85j58p3Nl7J26oo7O7J00R6j02j58K03p1k3J62j03k75L44J80
7144B83j19j53l15K66K03j64J08k58N56l72m2j53J78J19n03O75l25k5J9J01j86
7165a07K39m5j10Pl3J3j33L17Mm7J49l79L52n21O95m58M39L7l81K95o90K94M83
7188D20m86N0n73O53L60j94m53q5M40l40k35L45L42m48N03l41m17P02k64J38m21
7209c04L05j70P57n30K6j51O22q41L90l41R34n07P1m93k9n8p1k4K30R49m75o83
$$ plain form
7054 -109 -302 -98 -273 451 12 -122 -182 152 370 -196 -36 -294 -165 88 43 133 -164 129 76 -224 -148 194
7076 194 -133 198 19 111 135 122 -214 39 -248 -19 -15 138 -85 153 96 114 356 74 518 212 -121 -402
7098 -402 -6 263 -284 44 -269 -484 -42 -244 -285 245 -41 -213 -142 125 174 217 -243 139 82 -257 208 101
7120 101 -299 -193 258 73 -85 -158 -153 -190 -64 -70 -137 -70 30 126 24 -134 69 -2 -25 137 34 -241 103 283
7144 283 164 11 -304 -38 165 1 109 -149 407 35 -7 -160 18 137 -366 309 -16 -41 -22 79 -107
7165 -107 132 87 -23 -16 -49 -36 -169 148 152 105 254 -125 227 -294 401 -57 382 419 38 333 -357 -63 420
7188 420 -66 -16 -589 64 424 230 -223 -308 132 -208 -443 -98 244 -204 299 -42 -459 243 -21 117 -304
7209 -304 1 -169 588 58 84 -67 555 -286 104 -237 697 190 261 -232 -261 -319 -390 -414 -184 765 290 -393
7231c93M53l72J07J000k571J422K72j100P20J077p16k11p74Q28j13M94N59j329
7249f47J088p04O81m81M87m07l16N71P4m08l16p7L94j11L94q4k79K20o6L4j63
7270a16P8J3P0k4o3Q0j08J40l23L07R0l8J45l89nL10j69J04j12ll14L77p0L1J07
7295A18l14J73q8J11QJ23k60R1L8m4j83L31om8j31L26l41PkK35j18r5J78j25K3
7320GQ3n0p2J11J11k75J43r5j61M25k06J70k71k7Q3N0Lq0K34j01k78l9N81j56
7344A90l87K77J00p9j43O0K3J09k56n0m6Q0P9K69k87J03K98l50j00J05J92k17
7366c0J91k56J3j07K57j05R9j55j25K29L1o8K51j47k93J14NO3r9P2O2M4M1K8K9
7391A44j29P2n3R5j09L5K10k72J42rj23j41L7Q7J96l87Q8J36K39k93l84P55q2
$$ plain form
7231 -393 60 -312 -205 795 -1776 -354 -82 -1182 -462 615 -101 -312 -1086 -258 -371 123 682 -647
7249 -647 441 -263 418 -63 424 17 -299 272 346 -62 -378 -455 -61 -172 222 138 -141 79 13 47 -116
7270 -116 -38 -25 45 21 -42 38 -70 70 -253 54 144 106 251 -138 -143 167 -2 102 -10 -13 -327 50 -20 11 118
7295 118 -196 -23 -111 0 8 131 -129 -38 0 -44 -227 104 98 50 -81 245 -96 -89 -91 144 26 -69 109 -16 7
7320 7 90 40 -32 79 190 -85 58 -37 -198 227 21 191 -80 -107 -24 26 29 -51 183 82 -196 -235 346 190
7344 190 -197 80 180 101 -42 18 41 150 -106 -156 -202 -122 -43 226 -61 42 340 -10 -110 -5 187 -30
7366 -30 161 -95 -82 -189 68 -37 62 -93 -218 11 42 -26 225 78 -215 -101 -96 -33 -132 -60 2 46 87 115 144
7391 144 15 87 34 129 20 55 265 -7 135 126 3 -138 -101 -14 182 -205 -117 19 258 -35 -419 336 254
7414B54p3M8j02l19l4j1L80Q5j68K82m28j29O1k23N98l17j55K44l2J85k89r6J76
7437f3L31m67M21k96L01j0k41o9j24R36n13l86J39P7N33k57j39k00K65K54k49
7458B43n76Q62l91k28O47o47M99k62k13j47M84l05L47o76j21M12M38p79L02P01
7478E90k03k15M4m20L12k32N33j41j95J08J49k95O57n61K53j19N16j18J12j190
7498d15K57L58J12l14M06p85m66L28Q50j62l1J72q66J270l80J3r6Q76j510M6L45
7519HK54j77R8j3j96o4O46n18m8L36n77M22M3J9j70j36j41M91n98K62P37l88k15
7542G5k80K40n4j80M74k35r2j85M55j7j42Q3j87l13O74l26K37m06O95n38j09j62
7564b93R76q47J34k32k1O30m25K30K66J98n40K31J38j93o56P16m38j09l21P06
$$ plain form
7414 254 181 229 127 -192 -226 -237 143 228 60 342 -86 -215 -154 -377 221 -96 -251 -7 -39 146 -143 -239 -63
7437 -63 268 -199 222 -74 227 217 -24 -93 -217 719 206 -180 -41 36 569 312 173 -27 238 492 243
7458 243 -333 529 138 -90 557 -90 409 147 -66 -213 271 -34 313 -363 -484 -72 366 -413 -111 590
7478 590 387 172 216 -204 108 -124 409 268 73 181 330 35 692 131 384 265 781 663 775 -415
7498 -415 -158 200 312 -2 404 -381 -847 -519 331 169 138 310 -556 714 334 347 251 1127 -383 -337 8
7519 8 262 85 183 170 -26 -90 556 38 -10 326 -251 171 214 233 63 -73 -214 277 -321 -59 678 290 75
7542 75 -205 35 -19 -199 275 40 -52 -237 218 201 59 142 -45 -358 316 -10 227 -179 516 -22 -131 -293
7564 -293 683 -164 -30 -262 -283 347 -78 152 418 616 76 307 445 252 -404 312 -126 -235 -556 150
7584A50o71L28j17L82M29K19q50l57O64K4k65K27l51M06O04k38j156M17N83k17
7604B11m16n8j40M35J09J38q2l01L88m44m9N4J47n4m1K99J11k03o39O65l27L60
7626A63l70J60N09n01j81O79r03N21j2K09j16Q1J71j94k39J73m03N36k75L12l41
7647b1j75K85q8j15k3L9L20l29J90J91n36J21N7K18l84J05J31j15K19M1j44K19
7669B06oj18k89L50k71j0J12J85q6j21Q8R5l32K82l14J04J85j15K11j96PJ94k94
7692a33K31j0j41O5j33o6J2nJ36K11k25J30n6M2K6l27J27K6K68j87j31o2K84N9
7716A41j56Lq3L11m8m23K1K24J80k43N1K2L3j03l7j3M3P0r0qo9J41o2K99k07Q9
7742H6K5j49J33po7K47o1l53K07r6K06k14J18j03J0N6L1j9l0n9J85l55J59M7l69
$$ plain form
7584 150 -521 -193 -310 72 501 720 -130 -487 177 201 -64 163 -188 218 822 584 -572 -155 428 211
7604 211 -205 -263 -403 32 141 279 197 -104 284 -160 -209 -155 -8 -62 -103 196 307 104 -535 130 -197 163
7626 163 -207 -47 462 -39 -220 459 -444 77 65 274 158 239 410 216 -23 150 -253 283 8 320 -21
7647 -21 -196 89 1 -114 -137 -98 222 -107 83 274 -262 -141 -84 134 -250 -145 -14 -129 90 131 -13 206
7669 206 200 82 -207 143 -128 -138 -26 159 73 -48 40 135 -197 85 -229 -125 60 -55 156 -40 -33 161 -133
7692 -133 98 88 -53 12 -121 -187 -175 -180 -44 167 -58 72 16 58 84 -243 -116 -90 178 -9 -140 -202 82 141
7716 141 -15 -12 -95 216 168 -255 -234 -10 170 -73 -22 0 33 -70 -107 -120 -77 -7 -97 -105 -174 -33 -95 204 -3 86
7742 86 111 -38 95 88 21 268 207 -146 61 -35 171 -43 75 -28 -18 38 69 50 20 -39 146 -209 -50 -3 -372
7767c72L28J53j78j24J04K03qQ2j18J35k45j48K87k26N5Pj1J35QO9k38JK82j85
7791dM8N4l88M11j90J51j8j0J63r7j26j87K17l43J78J54o8k21Q4o6Q9j96J39K82
7815E6q1j58J96j24Q2k56J8P10o3k00K91p15N3O78n89M8L43o68P1N14k72K37n89
7838d18M7J94L14l09M21n96M94q5m15J11J87k97K53J52N27j141M64K51k74l74
7858d94J153j27p55L83l20K54o47J164j013J146r33J48j78Q45j599M70M02Q5l05
7877c21M19o57K17K22j91O30l29n2q4K40j47O9KL89j12l73L25l93j45J95J86k48
7899a58J88m5j13K12Q6l49L12k33K64l71K04k36K26K01k97L1P7J48j81J50j48
7920c2k69LkJ43J72j17J75j08J4j04K22k29L80n98L19L07k02j30K29N7r2j31p6
$$ plain form
7767 -372 -44 109 -69 -193 -89 114 106 188 70 205 -40 -188 99 -127 -72 -65 -76 59 67 136 -102 -101 181 -4
7791 -4 44 98 -290 121 -69 82 64 54 217 120 -6 -193 24 -319 -141 13 -55 -276 -192 -258 -169 -365 -226 56
7815 56 -25 -183 13 -111 -29 -285 -267 443 380 180 471 -244 -191 487 -102 -54 289 -379 -308 206 -66 171 -418
7838 -418 -371 -177 137 -172 249 -347 147 62 -353 -242 -55 -352 -99 53 580 -561 -97 154 -120 -494
7858 -494 659 532 -223 160 -160 94 -553 611 -402 744 -189 -41 -219 626 -973 -503 -101 -16 -321
7877 -321 98 -559 -342 -120 -311 319 -10 -62 -146 94 -53 16 18 407 295 -78 247 -146 -291 -96 90 -158
7899 -158 30 -15 -128 84 170 -179 133 -100 164 -207 -3 -239 -13 188 -109 -78 -1 147 -34 116 -32
7920 -32 -301 -298 -300 -157 15 -102 73 -35 -21 -125 97 -132 248 -350 -31 276 74 -56 173 230 138 7 -69
7943f9J88m2r8l2J54j02R0j65J08q8R9K0p7R7k40J49r6J69j66l5K25k9K18k95
7967a7J60o9nP1P6j22j26j8L3jKr1m8K44OpJ43r2k31k7K00L1k84K33l1m7J05l69
7995b81L25j39O2K05l08M1j69L54j14k10R4o3K77j51o2J38j13J00m6J89j82pN
8018e5K16l52L3j0k3P8p3K48k42K66j50M3J55j25J64k26Q7l04K87J01J33m43P8
8041a14K32j1j24l89L74J27J67j90k8N9j08j36L33k05K39l58K27j29j31K57o3
8062B9k10J59K17N1k79m6J76o1Q1j01M1p7j02j60L75j14l63O40j95n1j13K2J54
8085G3j20m1o0J48j81J81j13J26N1J03k28P5j38J17J55k23N2j40K52Kj7o9K6j55
8109a24L39j32j57K61l35J36Q9l53K08K07k86l7L82o1Ml0j42N9j30QJ07K2J71
$$ plain form
7943 -69 119 77 -21 -53 101 -1 89 -76 32 -56 43 63 -14 83 -157 -8 -104 65 -101 -136 89 60 278 -17
7967 -17 143 74 69 140 216 94 -32 -50 -17 -18 -16 -107 -155 89 95 88 231 139 -92 -119 81 112 -172 61 30 -17 88 -281
7995 -281 44 -95 -33 172 -136 -95 -264 90 -24 -234 -140 -203 74 -77 -139 -1 -114 -14 -60 129 -53 -60 -55
8018 -55 161 -191 -158 -168 -191 -113 -186 62 -180 86 -64 -21 134 9 173 -53 34 -270 17 118 251 -192 -114
8041 -114 118 107 -17 -406 -32 95 262 72 44 103 -5 -141 192 -13 226 -132 95 -34 -165 92 29
8062 29 -181 -22 195 246 -33 -79 97 36 117 16 57 -20 -122 -282 93 -21 -384 256 61 10 -103 -81 73
8085 73 -47 -88 -148 0 -181 0 -113 13 64 167 -61 14 -124 -7 148 -75 -23 -163 89 91 74 5 31 -124
8109 -124 215 83 -74 187 -148 -12 77 -276 -68 139 -147 -184 198 137 141 111 -31 28 -102 -94 13 35 206
8132B06k68J55K0Rl63Q7J64j21k2K39k39m5J71l75L90j78M37m52J52M36k26n68
8154c91N39k74j42M37k16J28J26l41K98r9q7N6j72n54O96J97K44m44r2r8N18j35
8176A94l18jL47J12l03J97j96K02l56K15J76l63J28N8l0
$$ plain form
8132 206 -62 93 113 122 -241 -154 10 -111 -133 106 -133 -178 -7 -382 8 -170 267 -185 -33 403 177 -391
8154 -391 148 -126 -268 169 -47 81 207 -134 164 65 -22 34 -138 -692 4 201 445 1 -91 -189 329 194
8176 194 -124 -125 222 334 31 228 32 234 -122 93 269 -94 34 92 62
8191F2
$$ Imaginary data points
##PAGE= N=2
##DATA TABLE= (X++(I..I)), XYDATA
0@%%%%%%%%%%%%%%%%%JrJ6j6J6j6J8k6L2l3M0m8N5o3P2q1R0j04J19j33J48j66
39h8J87k08K31k57K85l16L49l84M23m66N13n69O28o90P62q40R25j025J139j268
59f69J418j594J807k068K396k821L401m243N600q288K6195n1934K9361L8657o6336
74b9118M1267L689l3397L2997m700l3225L4871m58k9763K3884M850k6162K0273
87E008p406p624K2995k4743M003K3721l6543J5251J8443l2615K0073P449k8803
100b0791K3834K496k9935K5557J2168l5569J8249J6903l4622K0984J0212l0232
112b0746K7305k045k5941K9203o507j4679J8886o278l643N250o107N239K638o820
126d245M353M061q605K276P900r402M207O153j2745J0574O63j5141J5782N04j1121
$$ plain form
0 0 0 0 0 0 0 0 0 0 0 0 0 0 0 0 0 0 0 1 -8 8 -8 8 -8 10 -16 16 -17 23 -25 30 -33 39 -42 48 -56 63 -70 78 -88
39 -88 99 -109 122 -135 150 -166 183 -201 222 -244 269 -300 328 -362 400 -440 485 -540 599 -669
59 -669 749 -845 962 -1106 1290 -1531 1870 -2373 3227 -5061 21134 -30800 -1439 37218 -29118
74 -29118 12149 15838 -17559 15438 10738 -22487 12384 11926 -17837 6047 10897 -15265 5008
87 5008 -2398 -10022 12973 -11770 -7767 15954 -20589 -5338 13105 -19510 563 8012 -20791
100 -20791 3043 5539 -24396 1161 13329 -22240 -3991 12912 -21710 -726 9486 -20746
112 -20746 6559 4514 -21427 7776 1269 -13410 5476 -802 -4445 805 -5302 -63 2575 -4245
126 -4245 108 4169 -4436 -2160 5740 -3662 545 6698 -6047 4527 5190 -9951 5831 6335 -4786
141d786Q463Q60p504L398J859j637l16L657m495p83M920m331p78N597j896l342
157a114J031K477m233O29N959o137N21M389p089M518K290o690N764j091l966L513
173G71k219J364J409n020N244J609p959M881M413q591N432M153j1632P314M420
188E589j4626J2650M664j6194J1751K705j4694J2540J338j1613J0092o5j0025
201e888J0572j198q168J0827k690p572R584o006k787J0710r032M90Q884j2187
215d461N377O567j3894Q764M781j4992J0257L463j5967J2957L015j5426J4480
228D921R2j6662J5552K10j4052J5267k840j2618J4136l790r315J4327n859o702
242g333J1424p067l674J1199q721n40R425j0251J689P819j0815N411O141j1912
$$ plain form
141 -4786 3677 4537 -2967 431 2290 653 337 3994 -501 -1284 3636 -695 -1473 4124 2228 -1114
157 -1114 -83 2394 -1839 -1210 4749 -1388 -867 3522 -3567 951 3241 -3449 2315 1224 -2742 771
173 771 -1448 -84 1325 -3695 1549 3158 -4801 80 4493 -4098 1334 5487 -6145 1169 5589
188 5589 -9037 3613 8277 -7917 3834 6539 -8155 4385 5723 -5890 4202 4137 -5888
201 -5888 4684 3486 -4682 6145 3455 -4117 5467 -539 -3326 7384 -1648 -1158 7726 -4461
215 -4461 916 7483 -6411 2353 7134 -7858 2399 5862 -10105 2852 5867 -9559 4921
228 4921 5013 -11649 3903 4113 -9939 5328 2488 -10130 4006 216 -9099 5228 -631 -7333
242 -7333 4091 -2976 -6650 4549 -4172 -4712 4713 -5538 -3849 3970 -6845 -1434 4707 -7205
256g205P080L237j1088R098K597j1105J0167J77j0289J0743r99q840J0224j753
270B044p495J0487l782n718R788m546l422Q251n776j518O878n239m92N689n458
285c09L5M816n967J394M671n727K960K782o403L665J754n233M103R34n362L426
301A539O85m713L719N41l332L232k64k881K060k82j591J681n87j400J236M5j440
318a752J515o2q91M12n9j358J193K26j175J546o81r95K059j189r47K456q47j761
336b310K838j162k239L910q27k320L003r43k253L558r91k148M341j842k411M003
352B207j611k238M064k084j786M444l010r18L924k983j11K928l121M49K904l680
368f22J345K036l811J775J280l694K845N42l753L714n08l594M155o87l532M338
$$ plain form
256 -7205 -125 3112 -7976 1122 3719 -7386 2781 2958 -7331 3412 2413 -6427 3797 2044
270 2044 -5451 5036 1254 -4464 5324 778 -2644 5607 -169 -1687 5191 -48 -540 5149 -309
285 -309 -274 4542 -1425 -31 4640 -1087 1873 4655 -1748 1917 3671 -1562 2541 3475 -1887 1539
301 1539 2224 -2489 1230 1771 -1561 1671 1407 -1474 586 304 -1287 394 -193 -1593 -357 -312 -1752
318 -1752 -237 -299 -1190 -778 -837 -2195 -1002 -776 -1951 -405 -1086 -2081 -22 -1211 -2158 298 -549 -2310
336 -2310 528 -634 -2873 1037 210 -2110 893 -50 -2303 1255 264 -1884 2457 615 -1796 2207
352 2207 596 -1642 2422 338 -1448 2996 -14 -932 2992 9 -102 2826 -295 154 3058 -622
368 -622 723 2759 -1052 723 2003 -1691 1154 1696 -2057 1657 1149 -2445 1710 1023 -2509 1829
384A829j372k975M000j980k275M888k651k390N206l784j172M574l087j091M314
399B034l638o41M054l866L04L205l358J142K265l904J619K040l359J990J324l283
415b072K545L87k471K745l71k336K705j84k213L229j262j608L158j908j185K939
431B098j531r19K818j831j205L306k712m50L116k584j17K584k878K86K093k844
447g70Q50J895k709R89R87k190J161Q84j795Q09O49j984R94O32j695J388l8j549
465a492J260K02j521J201Oj313J600m81j284J424l1r60J548o53j424J897o91r62
483a674J416j04m85J032o54l15J738p66q32J593j118M72P81j319L10R85j197N0
501h7P39o25O60Q61j716N73J236j557P72M56j151R70m16p94J322j93p49K26N98
$$ plain form
384 1829 457 -2518 1482 -498 -2773 2115 -536 -2926 2280 -1504 -2676 1898 -1189 -2280 2034
399 2034 -1604 -2245 1809 -2057 -1753 1452 -1906 -764 1501 -2403 -784 1256 -2103 -113 1211 -2072
415 -2072 473 860 -1611 1134 763 -1573 1132 948 -1265 1964 702 -906 2252 344 -841 2098
431 2098 567 -352 2466 635 -570 2736 24 -426 2690 106 -11 2573 -305 -19 2074 -770
447 -770 80 1975 -734 255 1242 -948 213 1097 -698 111 760 -1224 -230 402 -1293 95 57 -1492
465 -1492 -232 -30 -1551 -350 -344 -1657 -57 -538 -1822 -398 -429 -1389 159 -494 -1918 -21 -712 -1674
483 -1674 -258 -362 -847 185 -469 -784 954 188 -644 949 -169 303 1084 -235 75 1060 -137 -87
501 -87 652 27 687 1548 -168 405 1641 84 856 1312 161 1131 715 -79 1243 1050 301 527 1125
520A125j350J112k12q25J378p46n02Q44o85o32R26l15n46Q57m89q00O29j62k1
539d14K25l53q19J376r60k53J698j292n00J457j179O1N52q23L29R29r52L52N63
558cq19L10J89o96L35P48q76Q35m6o63J131o08P0O1L1j44P11J22p98Q28j24J41
580G35M42o93K19J71P5o94J138o03n47P73n12l21R94p84J14O27j137O20m18L78
600E77l67O9o0k02K06n37J48J21l6J12J76l47j41N60q10o0pO47p83l57L0R50n39
623f50j47K66J75r9k20K82n33L33J57l16N04Q3l21N25j96j04P36n81l96M92Nk59
645b64J24L80K1K21j03J54N1o12P29L01l97k55M70m97j29r5N57L43k73m37K13
666E02R1l38k22O16p8k58j67M08k66k52N38o70K45j29o2L68j97n0l4j07k24O1
$$ plain form
520 1125 -225 887 675 -150 1228 482 -20 824 139 -493 433 118 -428 429 -60 -860 -231 -393 -414
539 -414 -189 -542 -1361 15 -945 -1198 500 -792 -1292 165 -1014 -953 -401 -1224 -895 34 -918 -566 -3
558 -3 -822 -512 -323 -1019 -684 64 -812 23 -23 -686 445 -163 -93 -32 -1 -145 566 688 -110 718 594 735
580 735 1177 484 703 874 949 255 1393 790 243 1016 504 183 1177 393 507 1134 -3 617 199 577
600 577 210 279 219 17 223 -314 -166 -45 -81 31 207 -140 -281 279 -531 -591 -598 49 -734 -1091 -1061 -111 -650
623 -650 -797 -531 -356 -455 -675 -393 -926 -593 -436 -752 -248 -165 -486 39 -157 -261 475 -106 -502 -10 -5 -264
645 -264 -140 240 261 482 379 533 584 -28 701 1002 605 350 820 323 194 99 656 999 726 289 502
666 502 593 255 33 649 571 313 146 554 288 36 574 -96 149 20 -42 326 129 79 45 -62 -286 -225
688b25N11n01m63L91N0l23M43o03M77r2o00L02K18L94J08p96J84J86r9K19N37
709C18o71Q5r4KL66r2l14M36M54l34l7J9l26j76J047k21j75K65k81L92n90k7N10
732E56J89k54K98k73m32M60M80r39P70k85n98P21k89M4R4p0j30J48K47o96K76
753C17j22j42J51l62O7Nl06L0N89o75l04N62n92L74N51q08L66j62l43J3O28o36
775g99L85J24o62M76K03m18O17j52n61L06K78l77Q35k44n38R02o18k1N65l24j61
796a84L51j43q4M59j64l40O59n05n2Q46o26L47J96o15K91M05o82K09M90n32K84
817F10L23n65K43J54p57N94q6n16O34j93m28L40P6p91N58N3n71O76l76m01N96
838A73k67n87M19k12K5Q7k56JL94l06j68M28l50NJ61k20k6O01l52MM53l59j71
$$ plain form
688 -225 286 -215 -678 -287 -237 -560 -117 -720 -243 -335 -935 -633 -415 -21 87 -709 -525 -339 -438 -219 318
709 318 -353 -268 -362 -360 6 -86 -400 36 490 156 119 138 -188 -364 683 462 287 552 271 663 73 46 556
732 556 745 491 789 516 84 544 1024 85 855 570 -28 693 404 448 542 472 342 490 737 41 317
753 317 195 53 204 -158 -91 -86 -392 -362 227 -448 -752 -190 -782 -408 143 -665 -299 -461 -804 -791 -163 -799
775 -799 -414 -290 -952 -476 -273 -691 -74 -226 -787 -481 -203 -580 255 11 -527 375 -243 -264 301 -23 -184
796 -184 167 24 -60 399 235 -105 554 49 -3 843 217 564 760 145 436 841 159 368 858 326 610
817 610 933 368 611 765 8 602 516 0 634 441 13 353 429 -362 196 249 -322 354 -22 -423 173
838 173 -94 -681 -262 -474 -449 -362 -618 -617 -223 -529 -697 -269 -619 -614 -453 -673 -699 -98 -450 -446 7 -352 -523
861e23P47n73K8O07p42L03N17p11K00J92l74N22M4k86M56J31o36N65N6l98K54
882C79J70l12L07m7n22N70P9l78N38l94l87O95k30o75Q66k23n62O02m73m9N44
903D98l03m29Q60p48o4N48q74K59M13o25K25L28p39L23L90n76J75M35q05L95L16
924Bo12L83J26q25O67J65o72Q53k35l93O45j92m21P55l89j34N15m02l01P25l66
945a06j54Q39o80M2O86o61o9P37n41J16M97o95K24O00r00M68J94m79K60J77n23
966C2M31N5m40N38q4p00O89r9n98O50j88m70O51l26o04P24j61m94O41m12l24N91
988A02l03k02N34n32j65O24n80J80L15l76l75O19l30j50P18n74k79P54k57m88
1008g65N92m68L05M52o39J09N23m79L33J82n00M94J86m20K83J22o04P36l66Q7
$$ plain form
861 -523 224 -349 -321 286 -456 -153 364 -347 -147 45 -329 193 237 -49 407 538 -98 467 523 125 379
882 379 549 237 544 497 -25 545 624 246 784 390 3 698 468 -207 659 436 -126 476 3 -46 498
903 498 195 -234 626 -122 -186 362 -512 -253 160 -465 -240 88 -651 -328 62 -514 -339 96 -709 -314 2
924 2 -610 -227 -101 -926 -259 -94 -766 87 -148 -541 104 -88 -509 246 -143 -277 238 -164 -465 260 -106
945 -106 -260 579 -101 -59 627 -34 -103 634 93 209 706 11 235 835 -65 403 597 118 378 555 32
966 32 463 518 78 616 532 -168 521 422 -176 474 286 -184 467 141 -463 261 100 -394 247 -165 -489 102
988 102 -201 -403 131 -401 -566 58 -522 -342 -27 -403 -778 -159 -489 -639 79 -495 -774 -20 -277 -765
1008 -765 -173 -641 -336 116 -523 -414 109 -370 -37 145 -355 139 325 -95 188 310 -294 442 76 163
1028A63J53J7j87M78l10k52O02k26l74M31j00j2J70j70m14P76k60n29M54r7l94
1049h1O12m41k16N57l75k11N83p80L27M02p66K09M31m88J54o2k75L14l9r2K11
1070b6N8n40K16K50o40M70J34n78L65pj72J60J6m00N86j4m53Q44l39p22R31l40
1092b01j63O39n98J17N47m18J12K86k67n9M56n10O4N49p12J69P80p03K51L35o99
1113b5N90j44l10K74Q8o11M73K65o87N46r0o56M20K07n30K69L45o09L85k38k63
1134c01M19k95j02M17m51l2O31q19J05M48m01J15K13n74L22K62n51L02J79m60
1154e73K24M98l97J51p2j96K69k28L9R3J50k32M47j18l74N12l4j12k7n2N8L62
1176C88Mj98K57o12K75L04l95J00N24o06J46K23Q4k06J17k99j9J65j72J14J40
$$ plain form
1028 163 316 333 146 624 314 62 664 438 64 495 395 383 553 383 -31 745 485 -44 410 313 -81
1049 -81 531 90 -126 431 56 -155 428 -352 -25 377 -389 -180 251 -237 -83 -145 -420 -106 -145 -237 -26
1070 -26 32 -508 -292 -42 -682 -212 -78 -656 -291 -298 -470 -310 -294 -694 -108 -122 -575 269 -70 -792 139 -201
1092 -201 -364 275 -323 -206 341 -77 35 321 54 -5 451 -59 5 554 -158 11 791 88 339 674 -25
1113 -25 565 421 111 385 473 -138 335 600 -87 459 369 -287 133 340 -190 79 424 -185 200 -38 -301
1134 -301 118 -177 -279 138 -313 -345 286 -533 -428 20 -381 -266 -53 -627 -305 -43 -594 -292 -113 -573
1154 -573 -349 149 -248 -97 -169 -365 -96 -324 -285 -192 -42 -274 173 55 -319 193 159 47 20 -32 26 388
1176 388 392 194 451 -161 114 418 23 123 647 41 187 410 494 288 405 106 87 252 80 194 334
1197C34k12j64K04j13j64L89k57p2K66m43M0O4J09j41Q2k89L41P0n17K55l1N7
1219a92j03l4k64K82J88n59L75N4m76M81P3n6J26j71j92L56P5j97L63j76p4K54
1241A33n35q2O32k56k91L89r2L34Kj31j6K30j00NJ23j20j08R9m9K66m6j72K22
1264D37R9p57N72J8k65L50k17R9j31J85m66N46m63j40L03M3j98J9J2r0o6R0j29
1287a49L27m19J49J30q7j83K74k93L7Q3j51K6K6r7L6K24k13J48J46m87L28J6l22
1310d51K75K39k56J78K3m60J30K81j34K56j30j28K96K4k53L08p3k9Rk7j14L19
1332B83O0n2O7j45J05Q0k33p4K57l12J20J01q7J53mo7K74m15N4K03q9j70J49k14
1356D4j9j45K92k88J47j33P5J41l18j38K07N7k08J11j35l5K29J17l05J12k90J01
$$ plain form
1197 334 122 -42 162 49 -115 274 17 -55 211 -232 -192 -128 -19 -160 -78 -367 -26 44 -473 -218 -249 -192
1219 -192 -295 -329 -593 -311 -123 -682 -307 -253 -729 -248 -175 -231 -105 -276 -468 -112 -37 -234 129 -47 -121 133
1241 133 -402 -484 148 -108 -399 -10 -102 232 234 103 87 317 217 222 345 225 117 216 167 433 387 215 437
1264 437 536 -221 351 369 104 454 237 336 205 390 -76 470 7 -133 170 213 15 34 46 -44 -110 -20 -149
1287 -149 178 -241 -92 38 -49 -232 42 -251 -214 -131 -282 -256 -230 -327 -291 -67 -280 -132 14 -473 -145 -129 -451
1310 -451 -176 63 -193 -15 8 -452 -322 -41 -175 81 -49 -177 119 143 -110 198 125 96 105 78 -36 283
1332 283 343 291 358 213 318 398 165 91 348 36 156 257 170 323 319 252 526 111 165 368 279 109 258 44
1356 44 25 -120 172 -116 31 -102 -27 114 -204 -342 -135 -78 -286 -175 -310 -345 -116 1 -304 -192 -482 -381
1378c81K73j95k50M36J48j68N2m00J97L59p6j07q3j2J83j0j08r0J19L50j46J77
1400B68l08J75j47M38j04j20j19L25k05Mj02O1K71l98L68o2Oj01k63L18K12l75
1422A42M9RL7o9m2j4j59J96p0p7Q3r2j14J92j58J8o5K7j8L7o8J47m70K74j7J07
1448a15k42J72K7l7J06l03N6K94k58P8N3O6o4J80k16N4k9k3J82j1R1k46O5J81
1472F1R6p6j84K57m5j28N2K2J30l6J05j57L52l43L5K04j77N5k8K61k85K69n21
1495h1M61j62k89L88j49Nm1j28kK7R3l7j38O6q1k7K19l26N0R6j52L2k82L64j19
1520b13M6mN6K42m55p1K81j61R8r0m9J74o4j03L24n7p8j77M24l11N3M1o6J6K22
1545G8r7lL00k05J37o2j94K14m4O3l8O4J73k19J28L2j51J4J92m5j14l9J67J44
$$ plain form
1378 -381 -108 -303 -553 -117 31 -137 -85 -485 -288 71 -5 -112 -195 -207 -24 -34 -142 -232 -113 237 91 268
1400 268 -40 135 -12 426 322 202 83 408 203 207 105 166 437 39 407 345 351 250 -13 305 517 142
1422 142 191 200 237 168 126 112 -47 149 79 2 85 -7 -121 71 -87 -69 -134 -107 -125 -88 -156 -9 -479 -205 -222 -115
1448 -115 -357 -185 -158 -195 -89 -392 -336 -42 -300 -222 -169 -103 -167 13 -203 -149 -178 -201 -19 -30 61 -185 -120 61
1472 61 157 81 -103 154 109 -19 33 55 185 149 254 97 449 106 141 345 168 223 195 456 171 440 -81
1495 -81 380 218 -71 317 168 173 132 4 2 29 122 85 -53 13 -68 -95 124 -202 -152 -56 -208 -176 -458 -94 -213
1520 -213 -167 -171 -115 127 -328 -399 -118 -279 -181 -271 -320 -146 -210 -313 11 -46 -124 -301 123 -188 -135 -94 -160 -144 78
1545 78 -19 -22 278 73 210 148 -46 168 124 187 149 213 386 167 295 327 176 190 382 337 223 184 351 495
1569D95j87k36k5J51j36K53j92R2p1m2j35J11moj16j19K0oJ02k30L53l96K48O1
1593a5k36J20k15J21Q0j99K5J29J9M7k0R8j70J25L3r5O0j41J05j8P3j80J58j46
1617b42K53l6n7J15j22O4l9R4m9J01R2q2J16m0l2j8J76j01Lo4r1K68l3o9n4j5
1643A38j74J36j3N8p0j03K59J04l17M4J64j85j40J83j73L2J55Ll75L06j7j94P9
1666a00l1n3K6P7J91l25J20m0kn7N3k49J11K71j75o7J40M6j31j4J13J05j59j08
1690b58R8J09r4p8L52P0k19j95L80k89K78R4k15j97M41k93k3J31k6M3r7J09J48
1713B69p3q8N7j4n0N7n1L2p4J96k07K25l03L70j01j71o0J09k34J37j67J28k51
1736b64L60j30j30K87j88K25l28N2q5lo8P5j11J39J62m95K07J07R4j46O1l3R9
$$ plain form
1569 495 308 72 47 198 62 315 123 215 144 102 -33 78 74 68 -48 -167 -147 -153 -51 -281 72 -324 -76 -15
1593 -15 -251 -131 -346 -225 -145 -344 -319 -190 -171 -124 -144 -46 -216 -91 -58 -153 -93 -234 -129 -147 -74 -254 -96 -242
1617 -242 11 -25 -82 33 -89 -25 -64 30 -19 82 174 92 208 168 136 118 294 193 196 132 41 309 276 207 153 138
1643 138 -36 100 87 145 75 -28 231 335 18 62 226 41 -99 84 -89 -57 98 101 -274 32 15 -179 -100
1666 -100 -131 -184 -158 -81 110 -215 -95 -135 -137 -194 -141 -390 -279 -8 -183 -250 -110 -64 -195 -209 -96 9 -150 -258
1690 -258 -160 -51 -145 -223 129 199 -20 -215 165 -124 154 248 33 -164 277 -16 -39 92 66 109 12 121 269
1713 269 196 108 165 151 101 158 107 139 65 261 54 279 -24 346 245 74 14 123 -111 26 -141 -13 -264
1736 -264 96 -34 -164 123 -65 160 -168 -116 -201 -204 -272 -197 -308 -169 -7 -502 -295 -188 -94 -240 -179 -212 -113
1759a13j23J72q9k9K55m38L78l31J82K47l38M71k57l13N84j68J21m47K52K3J27
1780A66j99J64J5l16K89j29J92k57L20l1k4k46K4K4K23o5J08j41N3j6m8n6K40
1803B90k80j84M0r1K44J12r0k07R1J53j57R3m8l9K3j5j53J88l4j16P2L3QL2L4
1828ak25N4R0j50K38l7k30L80p6j10J35k67n6K20K3j45K81l29J62K3J9P8mJ65
1852B38j58O6q9J3k65K42J38q7J94r3K08m10K14P2k03J87j33J2k51L59j78K1l1
1875F6K4oj65R4j94J81j07J93j38l8K11l48P6K38n7j6j45r8%K81k9l99K42L02
1899A68l57J95r2j63R9J01m0o2j07OJ64l10L34j26Q0k6K72l89J56O4J14o1j5L1
1923C6P3M1M3r7j30LO2J88j37J03L4K9n3j95J02K21l73M42l29K1j6j58K85M2r6
$$ plain form
1759 -113 -236 -64 -153 -182 73 -365 13 -318 -136 111 -227 244 -13 -326 258 90 211 -236 16 39 166
1780 166 -33 131 146 -170 119 -10 182 -75 245 214 190 -56 -32 -8 215 150 258 117 170 154 106 50 290
1803 290 10 -174 -134 -225 19 131 41 -166 -75 78 -79 14 -34 -73 -50 -65 -218 -30 -64 -180 -108 -75 -67 -35 -1
1828 -1 -226 -172 -82 -232 6 -31 -261 119 43 -67 68 -199 -255 -35 -12 -157 124 -205 -43 -20 -1 77 73 238
1852 238 80 146 57 70 -195 47 185 98 292 199 407 -3 211 283 80 267 134 146 -105 254 76 97 66
1875 66 90 84 -81 13 -181 0 -107 86 -52 -90 121 -227 -151 87 30 14 -131 -229 -229 52 23 -376 -134 168
1899 168 -189 6 -86 -249 -150 -49 -89 -151 -258 -252 -88 -398 -64 -190 -110 -136 136 -253 -97 -33 81 20 5 36
1923 36 109 150 193 96 -34 -31 31 219 82 185 219 248 195 0 102 323 -50 392 63 84 68 -90 195 237 141
1948A41j0k54J49j29N00q7k08J46k59Q9j87pj1J70m3K99j87k43J28k25L5k61M08
1971d6l20j19J91J91m3J59J2j50Lp2n8N32n95O0M0M97l81K96r8m02M24k84K17
1994E4j67J68J09o60R24m49j02K3J14K68m06K93J51m04O23o1j94K06l49J91k22
2015A10J83J21j32j11j7K70n12O49l85n01L71k77qN15l56J77L6l0J91j29k76p5
2037a86J82K90J53q55P95j93l72J04r7o9O6L59o80J14L98m78K85k60K88k35J91
2058b00J75N5l11p8N8J10M24p58P94l87J87k23J85j98m12R40j248R33j68J13M24
2079D15j38n08M79J55k30L53o62p6J91k33L04K3K62k23J66J63l99j85Q42r05m94
2100g00J263p15K36j00o3j08N6N65m58p7M70j16jn85N81m54k05L00J03K16k37
$$ plain form
1948 141 131 -123 26 -103 397 310 102 248 -11 78 -109 -116 -127 43 0 299 112 -131 -3 -228 -193 -454 -46
1971 -46 -366 -485 -294 -103 -146 13 25 -125 -122 -194 -252 280 -315 -255 -215 282 -99 197 99 -303 121 -163 54
1994 54 -113 55 164 -496 428 -21 -123 -100 14 282 -124 169 320 -84 539 478 284 490 141 332 110
2015 110 293 414 282 171 154 424 -88 561 176 -325 46 -231 -239 276 -80 97 133 103 294 165 -111 -186
2037 -186 -4 286 439 -416 379 186 -186 -82 -179 -248 -182 177 -503 -389 9 -469 -184 -444 -156 -391 -200
2058 -200 -25 30 -281 -359 -301 -191 233 -525 269 -118 69 -154 31 -167 -579 361 -887 46 -122 -9 415
2079 415 277 -231 248 403 173 526 -136 -212 -21 -254 50 73 335 112 278 441 42 -143 699 -206 -700
2100 -700 563 -152 84 -16 -79 -187 -131 434 -24 -101 369 253 252 -333 248 -206 -411 -111 -8 208 -29
2121b9r9M75l51m42N99k90k44L9J98l18K14k07L53k12M83j43j52K79m27N50p81
2142e05L63N05M51o59o49l25J398p69L60l67L63j32l37Q56Mk18M6j09l27P60j001
2163b92P76q4k06l91K6M91l16k70N03n05N5M25j79J37m99J72k17J000p07J84L95
2184D98n93q9L50l10p6j48O50j033O52o92L04M0L61j41N7J09J66q09L23N70l48
2205a59k1R0L02m30j29M16l12M89p15j54N49kK8J37p15L23L08n81P89k14N48J51
2227F98n42k19o6l36Q03k74J36k26j66k15Q03o3k77o35P46J28l05Q0j52p4K69
2248A13m88J83L48R9o84M23n46N11N88n75o9k10N89l48J84K39q65M24J13o17J278
2269F90m01j028O92l65j25L40o23J034l11O7n27j1M19j1J50k7o29L45K83L9K68
$$ plain form
2121 -29 -128 347 -4 -446 153 -137 -381 -342 -144 -462 -248 -455 -102 -314 169 26 -126 153 -274 276 -505
2142 -505 -142 363 814 155 -494 -819 579 -190 170 -197 166 34 -303 553 557 339 385 276 -51 709 -292
2163 -292 484 400 194 -197 -171 320 4 -266 237 -268 -213 212 33 170 -329 -157 -374 626 -81 103 498
2184 498 -95 -184 166 -144 -220 -368 282 -751 -99 -791 -487 -447 -86 -227 -170 -61 105 -704 -381 189 -159
2205 -159 -180 -90 212 -218 -347 69 -243 246 -469 -623 -74 -76 -48 89 -626 -303 5 -576 213 -1 547 698
2227 698 156 -63 -129 -465 338 64 200 -26 -192 -407 396 333 56 -579 167 295 -10 70 -82 -156 113
2248 113 -375 -192 156 255 -429 -6 -552 -41 547 -28 -97 -307 282 -66 118 357 -508 -84 29 -588 690
2269 690 289 -739 -47 -412 -537 -197 -820 214 -97 -30 -557 -568 -149 -160 -10 -37 -666 -321 -38 1 269
2290B69j75N7m19J208r20k70l99L91p5k52J219j180O49l33O78l25k57j38L32M17
2310D77j85m26L95r21J061k37P6k51n2j52L17K64K74q11L73M1k69K86p7k42J78
2331A19p0L7J4k78J53J55r1Q1k77J4O2j4K25j09K15m42J86o5j85L83k3J09m00
2354b01K08N6mL8k44j08K51J6j4j91q0K10P7K30l33N7j87L14Q3j07k94K21J27
2377A25Q7j20p5L19o2j10q1M94o97L5K33j58R1O36n74O74j109Q92l18j67o17R77
2399D75j53l79p32N27J51pK94L95p18N46l00j206J461n0p40O19Q0j282J278n89
2419c30J74m99M94q6K42J89Nj22k09j96L43n28N90J56K20j54j067P49J243j899
2439f85J60M54N83N6j061Q48l86p22O90K78K13r22M73L1J56J2n57N92J2m27N8
$$ plain form
2290 269 94 151 -268 940 20 -250 -649 -258 -333 -585 634 -546 103 -230 448 123 -134 -272 60 477
2310 477 292 -134 261 -660 401 164 240 -11 -63 -215 102 366 640 -171 202 243 -26 260 183 -59 119
2331 119 49 86 100 -178 -25 130 39 120 -157 -143 -81 -95 130 21 236 -206 -20 -85 -270 113 90 199 -201
2354 -201 7 63 59 97 -147 -255 -4 12 -2 -193 -273 -63 14 244 -89 -32 -219 95 178 71 -223 -2 125
2377 125 212 92 17 336 274 164 83 577 -120 -85 148 -10 81 717 143 817 -292 600 282 115 -502 475
2399 475 322 -57 -789 -262 -111 -118 176 571 -147 399 99 -1107 354 304 -436 183 263 -1019 259 -330
2419 -330 -156 -655 -161 -247 -5 184 189 67 -142 -338 5 -523 67 223 443 289 -778 -29 1214 -685
2439 -685 -525 -71 512 568 -493 355 -31 -753 -63 215 428 -494 -21 10 166 178 -379 213 225 -202 -144
2460a44N35k02l46M32L94j247R28r06J563k074N23N93k23J70k53K60M7l2J5r9
2480f6K94l01l76N99l98Q5K07j53r2j06K83j14m8Q6k71j45Q56l05o1j06J14J07
2502H9M3M5o99N23L05k59j55J41k32K4K03p81L55M61k2J47j95K09m15K99pn3K6
2525E2k06L59J84l53R0l12N52k0o12L78k92L52j06j6L9k07L29l86J80j9J4j86
2547a86L93P1p65M92p3R3j22K63j85j62L63m56N38j84M5q9k24L86k20r2J54k35
2569a95M1O4R2kj62j25J97j9k46K54M4n8K26j24O5L2j10j18k45N73l13n5K59j47
2593g2J40k01L82m51K04ql52N37m07N64l60QN2J92J32n47n4J97k25K79m4K10m8
2616A28k08Q7l0K16o73K23J99L7J73l99O1p7K31k6L6k8L05j86m08J92j66K80j60
$$ plain form
2460 -144 391 189 -157 275 669 -578 350 -556 1007 -1067 -544 49 -174 -4 -257 3 50 18 33 -66
2480 -66 228 -73 -449 150 -248 -163 44 -109 -201 -307 -24 -138 -186 -100 -371 -516 340 35 -26 -132 -18 89
2502 89 132 177 -522 1 306 47 -108 33 -199 -175 28 -753 -398 63 41 188 -7 202 -213 86 79 26 52
2525 52 -154 205 389 36 126 -186 366 346 -266 112 -180 172 66 50 89 -118 211 -175 5 -14 0 -186
2547 -186 207 278 -487 5 -68 25 -97 166 -19 -181 182 -274 264 80 125 36 -188 198 -22 -114 40 -195
2569 -195 -154 -90 2 0 -162 -287 -90 -109 -355 -101 -57 -115 111 -13 52 84 -26 -144 -389 184 -129 -184 75 -72
2593 -72 68 -133 249 -202 2 -6 -358 179 -228 336 -24 -16 36 228 360 -187 -241 -44 -269 10 -34 176 128
2616 128 -80 7 -23 193 -480 -257 -58 -21 152 -247 -186 -263 -32 -58 -22 -50 255 69 -339 -147 -313 -33 -193
2639a93j29Q0K73j59j60K74M9Q7N71r66K55n6oJ33k31lM81m65j55M30p32Q39j64
2662E3J23j64p05N63K07j04J49m90J65K95n06N14k88k8O01m28j6J65l31N97r38
2683e66N57m31N72P7m23L20j77O2p1j31K03K74M54q82L48j33J40m99K38K59l14
2704a23M76o26o1N44l68N8r5L04k54J094r10n2m36O58L6k35O00q92J020q70l5
2725a67k40L19P9N1o25M71nP9l22r0J99k34J96P88r05J33Q38l50l31qo7J69l39
2748c61J09L38m21O60J82l26o89P31J59J7p21M21l64P03m87m01Q61k12k98N88
2768D89k66p17O30j27j02m46L43M44m36m9L67k72p1M39m4j34j78N1m61N14o95
2789g21M2L83O69k10p37J99j03R80K11j234Q98j008K72Q14j065Q6J57L02n60J135
$$ plain form
2639 -193 -322 -242 31 -128 -288 -14 35 122 693 -273 -18 -74 -80 53 -178 -181 300 -165 -320 110 -622 217 53
2662 53 176 12 -693 -130 77 -27 122 -368 -203 92 -414 100 -188 -216 385 -43 -59 106 -225 372 -566
2683 -566 -9 -440 132 209 -214 106 -71 -9 -80 -211 -8 266 720 -162 186 53 193 -306 -68 191 -123
2704 -123 353 -273 -334 210 -158 -100 -195 109 -145 949 39 -13 -449 209 245 10 610 -282 738 -132 -167
2725 -167 -407 -88 -9 42 -583 -112 -117 -38 -360 -450 -251 -485 -289 499 -406 -273 565 215 -116 -124 -191 -22 -361
2748 -361 -252 86 -335 325 507 181 -508 223 382 399 -322 99 -265 438 -49 -450 411 199 -99 489
2768 489 223 -494 136 9 -93 -539 -196 248 -188 -237 130 -142 -213 226 182 48 -130 -79 -540 -26 -721
2789 -721 -679 -296 373 163 -574 -375 -478 502 713 -521 377 -631 -359 455 -610 -524 -367 -65 -625 510
2809E10k26o41O41j55J72o70q09J155N00j46q92M78L32l5R5L78o25o58J71M51
2829B6j21K56J04k59R0k09K88n2L0Kj50pL01r4p8j39l83L30J68j15L03k50P9k5
2853I5k68M71n16L66k0j7Q6n14M37o27MJ77j96N52l42qM11R3j43J5l27K67k98
2876c02M0K47n94L20j39K52L42l32J7K39j55N59l16J04O4l88j50R27m35N8m29
2897g1J94K55r6l81J12R1k54N36m01L0l1J52j80O22n21n91P62r7N91o92l87J32
2919b25L64l68J19K81N23n14n6o38L72K76M0p53O83jo99Q46J09j055J134j64n46
2940b72k49K44L75N47P3j013P06n12k82L40j34J021p51M5J71L05k01n25L25m62
2960b49n17Q69O90r38K88J86L1r86Q56M7J55l34M55r08L58N46o84R7m37M19m74
$$ plain form
2809 510 284 -357 284 129 301 -369 -1178 -23 477 331 -561 -83 249 214 309 687 62 -596 -425 26
2829 26 -95 161 265 6 96 -113 175 123 153 155 5 -2 299 205 127 -12 -395 -65 103 -12 291 41 120 95
2853 95 -173 298 -218 148 128 111 197 -317 120 -507 -503 -326 -522 30 -312 -320 91 184 41 56 -271 -4 -302
2876 -302 -262 -15 -609 -289 -428 -176 166 -166 -149 90 -65 494 178 282 346 -42 -192 735 300 358 -71
2897 -71 123 378 282 -99 13 104 -150 386 -15 15 -16 136 -44 578 57 -534 228 131 722 30 -357 -225
2919 -225 139 -229 -110 171 694 180 124 -514 -142 134 174 -579 104 103 -596 250 359 -696 438 274 -272
2940 -272 -521 -277 98 645 718 -295 411 -101 -383 -43 -177 844 93 138 309 614 413 -112 213 -249
2960 -249 -766 103 793 -145 143 329 360 -626 230 277 432 98 553 -355 3 549 -135 -38 -475 -56 -530
2981e30J079n54L53j76L84p50N47K66p43K98k48j42L64n30M87O10l78n50K84P62
3001H33j172N19M4j80r7R6K65R0j306J130P54j068P5J51N19k5m17p0J334j782
3021c07N34N94j653J366k30k57M16m91M13J54q59K40K5M1j46l42P92m13N09k01
3041A85r38N79J162l44J83r20P5J81o64Q87l81P4k12P81n95j22l55O35n72R76
3061F15j59j335L82Q58n36N07j195J000k47n73L47R59j02o20P02n53j76J51j17
3080i2R6O5r22Q54k25K27l01R7J48J62k19P39q75j26O8K13J19l80K76q8L70l10
3102a04L43O0rJ56m51j71R1l37N00K27k06J89k87j00k80J16O43o6o98M56K10n16
3124b34P11m90j00P4p5j22L15k43L56j83o39N72J43N9p1n29P99j40L90r08L41
$$ plain form
2981 -530 549 -5 348 172 556 -194 353 619 -124 174 -74 -216 148 -382 105 715 337 -213 71 833
3001 833 -339 180 224 44 -53 43 308 398 -908 222 976 -92 -17 134 653 628 211 141 1475 -307
3021 -307 227 821 -832 534 304 47 463 -28 385 539 -320 -80 -55 -14 -160 -502 290 -123 386 185
3041 185 -753 -174 988 644 827 -93 -18 163 -501 386 5 79 -133 648 53 -69 -424 211 -361 615
3061 615 456 -879 -497 361 -175 332 -863 137 -110 -683 -336 623 521 -99 603 50 -126 25 -92
3080 -92 4 69 -853 1 -224 3 -298 -201 -53 109 -110 629 -246 -372 -304 -91 28 -352 -76 -164 206 -104
3102 -104 239 299 290 446 -5 -176 -85 -422 78 305 99 288 1 -99 -379 -263 380 314 -384 72 282 -234
3124 -234 477 -13 -113 -39 -114 -236 79 -164 192 9 -630 -58 85 144 73 -456 343 203 593 -315 26
3145B6L83l09k50L01M1j5n49K70N0q3K0l10J54L11K5m59K61k0J63K98l79m4o1
3168a76o3m33J165q08L95K84k67j23%N94k90k1o88M83n18L82J46j76J68Q6k42
3189a02N94l84k65M85k08J75j40L01n75K59Lm18K75m9j54L13p99N15K37K51o6
3210B48l42J18J75k35K24N74m31p78O1N91J33K3k05K85m68L91l85k78L14N43l18
3231B40J86j19k48n44J6M64J64m97j89L54o8R05j081R28n18N1K17k80k71L40k95
3252b45L60l64L98n99O64o17J06O38l67j6q9M96kk42J00o78K42J96J64k22J20
3273D3K4m8K15r1J32j98j39J67p75P98n4n05L94k67j02N20q6o8k97K92l72K28
3295a89r3P25M30p93j30j62J40j83J41J10K93l34j61k54O44n03J40J81K55m1j35
$$ plain form
3145 26 409 100 -150 151 192 177 -372 -102 -52 -135 -115 -425 -271 40 65 -394 -133 -153 10 308 -71 -115 -176
3168 -176 -239 -672 493 -315 80 364 97 -26 -26 568 278 257 -431 52 -466 -84 62 -114 54 140 -102
3189 -102 492 108 -157 328 120 295 155 456 -119 140 143 -275 0 -49 -203 110 -689 -174 63 314 248
3210 248 -94 24 199 -36 188 762 331 -447 -386 205 338 361 156 441 -27 364 -21 -299 15 558 240
3231 240 426 307 59 -485 -469 -5 159 -338 -527 -173 -241 664 -417 511 -7 44 261 -19 -290 50 -245
3252 -245 115 -249 149 -450 214 -403 -297 341 -26 -42 -131 365 363 121 221 -457 -215 -19 145 -77 43
3273 43 67 19 234 143 275 77 -62 105 -670 128 74 -431 -37 -304 -406 114 28 -40 -337 -45 -417 -189
3295 -189 -282 443 873 80 -50 -212 -72 -255 -114 -4 289 -45 -206 -460 184 -319 -179 2 257 216 81
3316H1L95j008K46K86k52O47n10k75N97j13K58K43r4n55O44o17n00Q98n38j11
3336b78R40p60J80JK49k77j66r3q5K06l80J98N81p46L01l95P31q72O01M36o50
3357b78O95l04k8O7j88N5N72r08M15J54r6k88j90N81n13N40n76J97J38lP1n5N76
3380F34m38j89m35K86k94M90l50K61L97k54Qm35J23m09K93k69N25k95M3J33J94
3401A9k4K16J56l80l46O87m27O5L68l94l30N8Q81p00K26n34O80n1l16P27o8p01
3423a88N75n44q4Q79o94j98L10MK52j13o22N98J5k64J55p3L8j5k43R5m79M85L75
3446B64k33n2N0J9k30L24k9j32j36J96j8k39K59K5j89J48O0j07P9K22n85K41L8
3469b5j5qK77n49L73k33J90M4j36r7K45N4j28O3O2j50K39q5r1k14K64J5j56J07
$$ plain form
3316 81 476 -532 -286 0 -252 395 -115 -390 207 94 352 595 501 -54 590 -27 -527 371 -167 -278
3336 -278 662 -98 82 83 332 55 -111 -204 -289 -83 -463 -265 316 -430 -129 -524 207 -665 -64 372 -278
3357 -278 417 113 85 152 -36 19 591 -317 98 252 156 -132 -322 259 -254 286 -290 -93 45 42 113 58 634
3380 634 196 7 -428 -142 -436 54 -296 -35 362 108 116 -319 -196 -605 -312 -581 -56 -351 -308 -175 19
3401 19 -5 211 367 -13 -359 328 -99 -34 334 -60 -390 -332 549 -151 75 -459 221 170 -146 581 513 -188
3423 -188 387 -157 -241 638 -56 -254 56 60 312 199 -423 175 190 -74 81 8 46 31 -212 -117 -596 -111 264
3446 264 31 -21 29 48 -182 142 113 -19 -155 41 23 -216 43 68 -121 27 87 -20 59 281 -304 -63 -25
3469 -25 -40 -48 229 -320 53 -180 10 54 -82 -179 66 120 -8 55 117 -33 206 121 30 -184 80 95 -61 46
3493D6k56L02k19M4pPJ29k38J83P2j08N4k05L97k91O1K9nK21k40o2J40J48o1j31
3518A0q1J43r7J32n5j88K28r2j64Q2K15l6J00j54n8k60L53K6O0J35j28k43J96
3541A24p8p1lR8K5k86m1K01P6o8J07j66K03n2MQ3k9j25j62o6K56j98K52k00N3
3566f3P0J25r2l4P6l1j29J39r0J35L3j47J1r1J27L0M4j28l7R4Q6k39N5Q4J64l42
3592a50J01j30j0J64L9kk39L87k88J15j96K39J72p1r7J95Qm4k68L10nn61L11j78
3616a98K21k07O4P6P7j83L57l31J51k9j82M08l76K88j48L6M5J14j70j94O0Q1j36
3639a76L20k20KK91l91L77j7l66J90J38k25M3J9K87m65J15J2L66p8l6l73K39m57
3662d05O33k27K40m20K7L76p27O24k53j62M01r6n04O58m82J17q3M81l92L08p2
$$ plain form
3493 46 -210 92 -127 -83 -90 -83 46 -192 -9 63 -45 9 -196 201 -90 -29 0 -5 216 -24 -86 54 202 141 10
3518 10 -71 72 -25 107 52 -136 92 0 -164 -82 133 97 197 43 -15 -275 78 104 164 299 171 -72 124
3541 124 46 -25 -28 70 95 -191 -232 -31 45 -23 84 -82 121 69 73 156 127 2 -160 -226 30 -168 84 -116 -63
3566 -63 7 132 40 6 82 51 -78 61 -29 106 139 -8 3 -88 39 69 113 -15 -52 42 128 -111 -56 28 192 -150
3592 -150 -49 -179 -189 -25 14 12 -227 160 -128 -13 -209 30 202 131 34 229 237 193 -75 235 230 -331 -20 -198
3616 -198 23 -184 -120 -44 33 -150 207 -124 27 -2 -184 224 -152 136 -12 24 69 183 13 -181 -121 -40 -176
3639 -176 144 -76 -74 217 -174 203 186 -180 10 148 -77 -34 -15 272 -193 -78 -66 300 222 186 -187 52 -405
3662 -405 228 1 241 -179 -152 224 -503 121 -132 -294 107 11 -493 165 -317 -200 -283 198 -194 114 42
3683D2k59n6Q39o76p29Q10K57j92k58J59M3O52l99l93K57K70j27n77L07j93L51
3704A28o63K86j27K50k69J34K93l05O81m36l1l26K71m79P17Qk36k48J39L33M2
3725A62m77P63o86R5O90o07J97j78K98l92J69j06L0K23l85r1O18J8m60j74L45
3746E2Q2j22m21M21k22M50k54L7m37J95m9L5K24L74l87r9J95J73q4l33K0M43j86
3769A07J89l00L72o05L59j31p0R0K39j51n71L06j26P68r24M24K74L7l06j9j54
3790a92j56K89L7M01m26J19j07O7l4k50j03L61J07J41j8l9j88O0j89J33l5R7P1
3813A46M9l2m2l20J0M3J99p8Q0J78l82K05J27J94n32J44j77M04j75J00k29J09
3835B1j83J35j05n3K33m4Pk96J43L56l7j45k36J57M6r7o4K41j88J56o9n9J93p7
$$ plain form
3683 42 -217 -273 566 -110 -839 -29 228 36 -222 -63 -20 632 233 -160 97 367 240 -337 -30 -223 128
3704 128 -535 -249 -376 -126 -395 -261 32 -273 408 -28 -59 -385 -114 -593 124 132 -104 -352 -213 120 162
3725 162 -315 448 -238 -143 547 -60 137 -41 257 -135 34 -72 -42 181 -204 -295 323 341 -119 -293 52
3746 52 134 12 -409 12 -210 240 -14 23 -414 -219 -268 -233 -9 365 -22 -121 74 247 163 -170 -150 293 107
3769 107 296 -4 368 -237 122 -9 -79 11 250 99 -472 -166 -292 476 -448 -24 250 287 -19 -38 -192
3790 -192 -348 -59 -22 379 -47 72 -35 32 -2 -252 -355 6 113 254 236 197 9 69 -120 13 -22 75 146
3813 146 195 163 121 -199 -189 -146 53 -25 55 233 -149 56 183 377 -155 -11 -188 216 41 141 -88 21
3835 21 -162 -27 -132 -185 48 4 11 -285 -142 214 177 32 -204 -47 -1 -98 -162 79 -109 47 -22 -81 112 35
3859C5j66J3J30O8j12j78K87l15M09l07N9Q1o0O4J14p4n0k28J25j96L15L25k43
3882I6j98J86j96L23j07p8K04oj43J15k6N2j74j92K68j0j09L3k13l01N21l6M8
3905E7l51K53j02K02l00K65lj96M05p5k20K07m52K83K62n39M21k81N2P1m17L77
3927h1J09p6L43l06k02Q5J08K10m85N60j38L3k63l01L14J48k05O3Rj49J89p7o8
3950a80m0J33L97q27M90J58m16L70k4M4j39Kn8J10K34j08j5k87K84l35R3j54K48
3973b0J8k99M39k45j56K78k21K62L8l57N59J1n4k15J17j56K38l63R7l3J79O0K94
3996D71n54J71L70l62N6l04K08L3k32J49N8J56j71j21L82l42k07K91K34l04O7
4017D9j91K21n9J67l02L8L2P6j16J37k6j34O8N8kJ33l27J26k2J24K3K3J37l15
$$ plain form
3859 35 -131 -118 12 80 -32 -210 77 -238 171 -136 -77 4 -56 8 122 48 -2 -230 -105 -301 14 339 96
3882 96 -102 84 -112 211 104 26 230 224 81 196 170 222 48 -144 124 114 5 38 -175 -476 45 9 57
3905 57 -294 -41 -143 59 -241 24 21 -175 230 155 -65 142 -310 -27 235 -304 117 -164 -112 -41 -458 -81
3927 -81 28 -48 295 -11 -213 -128 -20 190 -295 265 127 160 -103 -404 -90 58 -147 -84 -75 -224 -35 -112 -180
3950 -180 -220 -87 310 -517 -27 131 -285 85 61 105 -34 -32 -90 20 254 146 131 -156 128 -207 -114 -268 -20
3973 -20 -2 -301 138 -107 -263 15 -206 56 94 -263 296 307 253 38 155 -1 237 -126 -29 -62 117 177 471
3996 471 -83 88 458 96 152 -152 56 89 -143 6 64 220 49 -72 310 -32 -239 52 286 -18 49
4017 49 -142 79 20 187 -115 -77 -45 31 -85 52 26 -108 -40 18 16 149 -178 -52 -74 50 73 96 233 -82
4041h2P3J04R7j98j72J50Q1K64l01K43o5k12K9k7P2J94l76q7K08j58J0J13Q8q1
4065c3km8j03K74r7J74l50K69j08p1K54m05K39k38K14J73k22L47j23Q5m04J03
4087g2M16m99K10K27l41K33o9J01l73M22m6l55j22L8M28m60J31Q5l06K63m2J21
4109a0n9J07j90L74j64LR8lk20j2J75k25K19l1l12M24j84O6j30J60j04n2M10l27
4133A3j52J01K67k46J37jl05K00J01J04l32J12k0k71K64M0n8m9K8L5J4j18m0J06
4157g0J43j88L66l27j34M10l11J30P0k23K39p3O4J16k15m97N96j22K04j88J71
4178A61k8j8J40k00O5j46L18j20l4l23K91k04K20k93J40J51l05K21p0N9j83J52
4200fR1r0P6J02m9J20j31l19K4M02l32K5k5J75J3k10O25k06n83L92k65L22k84
$$ plain form
4041 -82 -9 95 192 -6 -178 -28 53 317 16 259 194 -18 11 -16 56 250 -126 -213 -5 -163 -153 -40 48 -33
4065 -33 -35 -83 -186 88 -9 165 -185 84 -24 -95 159 -246 -7 -245 -31 142 -80 267 144 229 -175 -72
4087 -72 344 -155 55 282 -59 174 105 206 -167 255 209 -146 -268 -230 198 -262 -131 -46 -352 -89 -131 -10
4109 -10 -69 38 -152 222 58 61 159 156 -64 -76 99 -126 93 62 -250 174 -10 56 -74 86 -18 -70 340 13
4133 13 -139 -38 229 -17 120 119 -186 14 115 219 -113 -1 -21 -292 -28 12 -46 -95 -67 -32 -18 -136 -176 -70
4157 -70 73 -115 251 -76 -210 200 -111 19 89 -134 105 32 96 212 -3 -500 96 -26 178 -10 161
4178 161 133 115 255 55 120 -26 292 172 138 -185 106 -98 122 -171 -31 120 -185 36 -34 25 -158 -6
4200 -6 85 -5 71 173 124 244 113 -206 -182 220 -112 -87 -112 63 76 -134 491 285 -298 94 -171 151 -133
4223a33K83K43m63J78j41L27p2n69K06J87q8K14L1M2l99K23k36J54m25J07J88
4244a43K33m73O92j30M85j59o60k24Q39n26J72m8J0m06J59o14J114K28l94p70
4264f15K67M68k97r5j62M64j69k57p60J337l45O19n48K43J06n87Q44m94O86o39
4284F6kJ66L55j32n1k32M91m59j86k03L73m25K80j59l99j73J73O30m25J19n4j52
4306c99N33j005P56O74l83j22k57J90k23L28J08j38Nn3L99k82k94K19j12j65J59
4327f2NM4j3j08J06K0k15K47p5k4jq2K04Lk19K00J15oj19r3J30k87J33Q7K9j95
4353a76K3J87n2L1j50Q4J5l54M81j94j02N6J55J07j66O0m9J75p7M4j60K13k09
4376e8K50k74K10k51j16K70j54j9m0K18K8Q9k41J09K6J2k33K19K5J5j6k41J17
$$ plain form
4223 -133 150 393 -70 108 -33 294 222 -347 -141 46 -42 172 203 245 -154 69 -167 -13 -438 -331 -143
4244 -143 90 -383 309 179 664 505 -155 -379 460 -66 106 58 68 -338 -179 -793 321 549 155 -615
4264 -615 -348 120 -177 -272 -434 30 -139 -396 -1156 181 -164 455 -93 150 256 -331 513 19 705 66
4284 66 64 230 585 453 402 170 661 202 16 -187 186 -239 41 -118 -517 -690 -517 113 -312 -193 -247 -399
4306 -399 134 -871 -115 559 176 54 -203 -13 -236 92 200 62 67 14 413 131 -163 56 -56 -221 -62
4327 -62 -57 -13 -26 -134 -28 -8 -223 24 -51 -75 -76 -158 46 49 -170 30 145 139 20 -73 57 -230 -97 -10 19 -176
4353 -176 -153 34 -18 13 -137 -53 -38 -392 89 -105 -207 -151 4 111 -55 5 -44 131 54 98 -62 151 -58
4376 -58 192 -82 128 -123 -239 31 -123 -142 -182 36 64 153 -88 21 47 59 -174 45 70 85 69 -172 -55
4399e5L29l62Q0J49r3k20K18r6J62n0j1R4mk19mR2J51l00J25n2Q6j35L8J0J64
4424I7k20J93J42l25K9N2K5R1j39rJ37l77O26k31Q1l79j8J39K76m24K30J46j9
4447A23k55K42M6k5j81l46M69L94l42k43m2K40j24l43O15R9k53K58r07R44n36
4468a67J24J37o89k8J005m02m80N28J50K96l29K2P2l09N43j58j35l70L22O23j182
4489d27Q86m98l4o9j56l3r3P13l16J21m86R65m64NK58l49l76O03k12m64j33Q57
4511B98Q09q36m27R10l25n61N8K51j87j47J61J21k42o12J339o76l16L39q0M0M45
4532C62k99m06N5P44p70M10N84j037P19K14J58j095R26p7o00k37M31M7j44m4k59
4553c18M77K40N0o6r7q14R70m98J94l29R18n84O02p37k32J84L74p07P23k95k16
$$ plain form
4399 -55 274 -88 -8 141 48 -172 46 -50 112 62 51 145 141 -78 -82 10 161 -139 -14 -66 20 -115 -77 -67 97
4424 97 -123 70 212 -113 -84 -32 -7 84 -55 -64 73 -304 322 91 172 -207 -225 -86 190 -234 -4 142 123
4447 123 -132 110 156 131 -50 -396 73 467 125 -118 -160 80 -44 -387 228 327 74 332 -575 369 -167
4468 -167 -43 94 -595 -623 382 -20 -500 28 178 474 145 167 239 -70 473 315 180 -190 132 755 -427
4489 -427 459 -39 -73 -142 -298 -331 -424 289 -27 94 -392 573 109 114 372 23 -353 250 38 -426 -559 298
4511 298 1107 271 -156 754 429 -132 -74 177 -10 -157 4 125 -117 -729 610 -66 -382 -43 -123 -83 362
4532 362 63 -343 -288 456 -314 96 680 -357 362 576 734 -361 565 488 -112 -349 82 129 -15 -59 -318
4553 -318 159 399 449 383 286 -528 442 -56 138 -191 727 143 745 8 -224 -40 334 -373 350 55 -161
4574a61L06K1p10O00L58K96j161O04n29j43J6j84J498p90M6M62m63m64K53K97
4594A52j14p0l10J017p78k8M83j64l87n6J09n93J214l79j26j09j03J88K59k44
4614c9m6n5L6o3L53l79J86N3L27m09l36N92J33m67M1P9J71P5k00K34l43m6J19
4637A6j32J49k55J30J8r4J63M3kj7n0l3k5L25j62j51K40j67r4K05j58L11l87R4
4661c3J75Nj07j3k90k7K63J21R0m91Rk6L84l2O5k2j97L51k54J35l53O3J52J96
4685A64O4q7n5j15R5J59m65n7M85l5k76J36J8k26L18k73N02m86Q6j28j99O37p97
4708e35R45l83p4k4n2L33j66J35K0j6J3o14L12J00K36l42M2K8Q5k41L48l42K26
4731C4m12P56l43j22P2M4K14j71O5p36Q54k52K68O9l17j25J46J6m12K40q9l23
$$ plain form
4574 -161 145 166 -544 56 414 710 -451 153 -376 -519 -503 -687 811 21 67 529 66 -398 -145 152
4594 152 38 -32 -342 675 -103 -131 352 188 -199 -255 -146 -739 475 96 -30 -139 -242 -54 205 -39
4614 -39 -85 -140 -104 -167 186 -193 -7 46 373 -36 -372 220 353 -114 -73 6 177 252 52 286 -57 -103 16
4637 16 -116 33 -222 -92 -74 -168 -5 38 36 19 -31 -64 -89 236 74 -77 163 -4 -98 107 -51 260 -127 -33
4661 -33 142 147 40 27 -263 -290 -27 94 184 -307 -298 -324 60 28 93 71 -126 225 -29 106 -247 -184 -32 164
4685 164 228 141 86 -29 66 225 -240 -297 188 153 -123 13 31 -195 123 -150 352 -134 -48 -176 -375 262 -535
4708 -535 410 27 -47 -71 -123 210 44 179 199 183 196 -418 -106 -6 230 -112 -70 -42 43 -198 150 -192 34
4731 34 -378 378 35 -87 -15 29 243 72 137 -599 255 3 271 340 23 -102 44 60 -352 -112 -201 -524
4753e24M49k6K38m84K50Oj68L46j92L45k95Q2l78J04K08N9m3K30k58K4R9J9K10
4776C01l80p0J30NK69l37L41l12Q7K45m06M96l45P5J27k37n9m8L4K02j54K82k98
4799e2j18J27K47J61n14o6K46J3L39m01M4l86N93j82p2j93N9r2K02J13L79J56
4821F03o70M14o96O29l98J13M51n50m0Qj54K42kJ56j35K15K97n16L02k07j13P1
4843B0K33p0m0k42J02M3J4k96j91N64l0k8q5J60ml78P01m12k45K98j11k76k7N53
4867B53p48N58L57j48P9P4q22N51l80K31l14R24n87j4J21l62J90r8l9n6O86m97
4889d1J62J02l96J09K06l40Q6l24J053m40p8m16L94j00M48l23o23N16J10J03L70
4910E78p52L7j084J340k95J52P5M90j130L06k56N78K38j41J22j94o7j38J68o08
$$ plain form
4753 -524 -75 -101 137 -347 -97 -91 -259 87 -105 240 -55 27 -351 -247 -39 20 -23 207 -51 -27 72 91 301
4776 301 -79 -149 -19 -14 255 -82 259 -53 34 279 -127 369 24 99 226 -11 -70 -118 -84 118 -36 246 -52
4799 -52 -170 -43 204 365 -149 -215 31 44 383 -18 26 -360 233 51 -21 -214 -155 -247 -45 68 447 603
4821 603 -67 347 -349 280 -118 -5 446 -104 -144 -136 -290 -48 -50 106 -29 186 483 -33 269 62 -51 20
4843 20 253 183 143 -99 3 46 60 -236 -427 137 107 79 -6 154 150 -228 473 61 -184 114 3 -273 -300 253
4867 253 -495 63 420 272 351 425 -397 154 -226 5 -309 615 28 14 135 -227 -37 -135 -174 -230 456 -41
4889 -41 121 223 -173 -64 142 -198 -112 -436 617 177 99 -317 77 -23 425 102 -521 -5 105 208 578
4910 578 -174 -137 -1221 119 -176 -24 51 541 -589 -283 -539 39 277 136 258 64 -3 -141 27 -581
4930e81O93Rp5o59N07j19q17J010J93K16K43l99n01M46p09L61K08j77O49L7j012
4951d77r8L61J1O22j10j79l42l61N73K68n61M00j94K49p53R95q35P06K45n53K71
4972B38n67O86k18j10n78J044q07o8M78l23L76J89l57K43j45L20k18k56k2M62
4992C67K64m45M08n48J0M14J33j086O60Q0p16P52m66O61k92k90n57N41K69q74
5012g15O90N93m25J59l93M86R0l30K36m00O8M2j27l96R72j036L51K54l72M74l72
5033a51L45k10k2Qm53N54l34Q67q27M4K12j7J34l3J08k42J91l1J3j90K95l32Q40
5056G69m98m80j58qj09L72J75j7j29M0J49J96m9k87k47N31m90J21J23l59N57k51
5078d9k55J85M24l92K45j3k76MK98k91P03n28k2L38m19k42J38K09N8L0m49P05
$$ plain form
4930 -581 112 121 46 -613 -106 -225 -1042 -32 161 377 620 221 -280 166 -543 -182 26 -151 498 535 -477
4951 -477 -575 -214 -203 419 309 130 -212 -573 0 268 -293 107 -87 162 -591 404 -431 275 520 -33 238
4972 238 -329 357 139 29 -549 495 -312 -380 98 -225 151 340 -17 226 81 401 183 -73 -95 367
4992 367 631 186 594 46 56 470 603 -483 177 257 -459 293 -173 488 196 -94 -651 -110 159 -715
5012 -715 -25 568 143 302 -91 395 485 155 391 -9 59 101 -26 -422 550 -486 -135 119 -253 221 -151
5033 -151 194 -16 -38 -30 -483 71 -263 604 -223 -179 33 16 150 117 225 -17 174 143 156 -34 261 -71 769
5056 769 271 -209 -367 -375 -484 -112 63 46 -83 -43 106 302 253 -34 -281 250 -240 -119 4 -355 202 -49
5078 -49 -304 -119 305 -87 158 145 -131 -127 171 -120 583 55 33 371 -48 -290 -152 57 115 145 -304 401
5100D01n55K77M36o11M89l71q6k62pN95n88K75J92LQK05j52l3j12k5q4j48N06
5123C53m53m8j36Q62l96n72L17l27Q74j29j045P59J97l35M06j50K95l68m41K19
5143a18J80J57j10n15P34p84P02m34l34N12j03K18M3m82K32l52J81j01L2L58p38
5164g22P40o44P7qJ188j5j293M17P14J78m08j164jM88l40R67L46m12k50J089j507
5185e60k12J039o95O41k00k84J081l34q80R7R5J80j33O16l17j264Q54K71R5P8
5205A68R48j427l87L74L3L17o0j8J26j094O51N78k43j8n1k29R39l74P3J38j056
5226f12R47m52n86O04p4r8P76j087J040m73n11R83L57j251l4J069j257J379m90
5245B30K74k67q52Q98q47O08n71Q87j457K058j301M4N58p52Q8P59Q2m40N22n94
$$ plain form
5100 401 -154 123 559 -52 437 66 -20 -282 -289 306 -282 -7 185 188 196 401 249 216 104 79 -5 -153 353
5123 353 -100 -148 -284 578 182 -390 -73 -400 474 345 -700 59 256 -79 327 177 472 104 -337 -118
5143 -118 62 219 109 -406 328 -456 246 -188 -522 -10 -113 105 148 -334 -102 -454 -273 -374 -342 16 -722
5164 -722 18 -626 -549 -557 631 616 -677 -260 454 632 224 -940 -941 -453 -793 174 520 108 -142 947 -560
5185 -560 -772 267 -428 213 13 -271 810 476 -404 -307 -212 -32 -165 451 134 -1130 -276 -5 90 168
5205 168 1116 -311 -698 -324 -291 26 -34 -52 74 -1020 -369 209 -34 -52 -103 -332 607 233 306 444 -612
5226 -612 335 -117 -703 -99 -173 -271 505 -582 458 -15 -526 457 814 -437 -471 598 -659 720 230
5245 230 504 237 -615 283 -564 44 -527 360 -1097 961 -340 -296 262 -490 -402 357 439 -1 521 -73
5265g3k97J066q56l05J064q71N98o19P67m87K33j47j04k87R28o73O3M06o23O20
5285D03n24L52j13l50K42L2j5j89K0J19K04o5k42L83l68M06m91K25K02l20j00
5306a89L30q1Q8j57k29K36j8k6l12N20R8j15q2J28%k61r0L87k55k8K36k67RO2
5330a6o3o0J73l0Q9k03O5j66K62j29P8J16k0O0%k21J64P1j89K5J77j25r9On8p4
5356a67J72L3K24k54P3l18N11k09k02L1J03J26k50J35J16j59P0o3l3j87R8K75
5378A25l07L28k33n4j6L93k35k50O4L56n0K1k19K39k21L9P1j80k3J68n3J70l58
5401b25J72J41l0J8l8j59M3J81K53j58k56M4J13k05J84K06l47J59k66J95J57j93
5423a1l01M66j63j3Rm5k9M38k21p3l1J31l73K04oj62K35o1n5J47j40J58k53J24
$$ plain form
5265 -73 -370 696 -160 -465 599 -272 326 -293 474 -13 220 73 -31 -318 610 -63 0 406 -217 403
5285 403 -121 231 118 -232 10 42 27 -162 -142 -23 181 116 -126 257 -111 295 -196 29 231 -89 -189
5306 -189 141 60 148 -9 -238 -2 -20 -46 -358 162 260 145 63 191 191 -70 -160 227 -28 -56 180 -87 -78 -16
5330 -16 -79 -139 34 4 93 -110 -45 -211 51 -78 0 116 96 156 156 -65 99 170 -19 6 183 58 -41 -35 -93 -167
5356 -167 5 38 262 8 81 -237 274 65 -137 -106 -3 123 -127 8 124 -35 35 -28 -61 -248 -150 125
5378 125 -182 146 -87 -141 -157 236 1 -249 -185 171 121 142 -77 162 -59 -20 51 -129 -152 16 -37 133 -225
5401 -225 -53 88 58 76 38 -121 -78 103 356 198 -58 -14 99 -106 78 284 -63 96 -170 25 182 -11
5423 -11 -312 154 -9 -22 -13 -58 -87 351 130 57 26 157 -216 -12 -18 -180 55 -6 -61 86 -54 104 -149 -25
5447b5K02k79K03j00N1q9J09k4j90L10j61J34m1L8n3kj37OK85n8j85K4K24n08
5471b66K39J33p1j35o8K57j47K24q2J19j58j2j51J23l2l6L9L97j54k06J2j54j2
5494a41j37L81p3k2P5l3o5R4n4j05L71j94K8k19K4J90j89P8j02K47j47q6p4J03
5518e0p9J38o7p6K07p1R5J23l47K10j98J43j28K42k23K17k72P3j38J65pq2k29
5541c54L51J08j41P3k99L10j50M9r8K69j13P3N7j14j4r5l9J96k68K71k07K5J5
5564i5J22k59N03l95K86J85l80K74m00J64M4k10L39j39k46J03Q1J96k55K03j30
5585iQ0j32L2K15o4j30j3K4N2K38o19M34m9o0pJ37p5l5l3k32J45q9L13m21J83
5610a15J69j94J64J0k35m7K89lk7k1j57K13n5k14K36j05O5n3j73J65J36k84P7
$$ plain form
5447 -25 177 -102 101 1 52 -37 72 48 -142 168 7 141 100 138 85 83 -54 -48 237 179 -6 18 242 -266
5471 -266 -27 106 35 -100 -168 89 -58 166 84 203 45 33 -118 5 -27 -63 -24 373 219 13 25 -129 -141
5494 -141 -278 103 30 8 83 50 -15 79 25 -80 291 97 125 -94 -70 120 -69 9 -93 154 7 -79 -153 -50
5518 -50 -129 9 -58 -134 73 2 97 220 -127 83 -115 28 -100 142 -81 136 -136 -63 -201 -36 -43 -125 -354
5541 -354 -3 105 -36 37 -262 48 -102 -53 -151 118 5 78 135 21 7 -88 -127 69 -199 72 -135 -110 -95
5564 -95 27 -232 271 -124 162 347 -33 241 -159 5 49 -161 178 39 -207 -104 -23 173 -82 121 -9
5585 -9 71 -61 -29 186 122 -8 -21 3 55 293 -326 108 59 -1 -8 129 54 19 -14 -246 -101 -190 123 -298 -115
5610 -115 54 -140 24 34 -201 -248 41 38 11 -10 -167 46 -9 -223 13 -92 -27 -80 -253 -88 48 -236 -159
5633a59j10K91j66K62L7j21M2j67J80M0q6k71K41j16J46J11j21J63k01J27p5k94
5655b47q0K20K47J0J66k08j55l80L06L25K7l9k62k44Q1L65m25r7K83J33j1l00
5677b85J58M94o54M9p0N41N5o75M33o2K20q73O61l9l01J49J38k27N31R1m29m12
5699e07J370j5p05R63j313k86R51j182n7Q55q08M93N50j126J123m14K14k20k54
5718c68M87j74J398k055O04k0m14M85O29r77L04L0M13o65Q04q62R05j027O54K61
5738D12m42N10J51l95j86oO27K47j175M61k13L28P10j254J85K5k32J14L34l00
5758i9O65n96l61P82m64O88r12K91l02O4J10j36N70n11K31MJ40R1q4J02m08lK18
5781H0j82k59L16J85j3l71L23O6n42J11N02m12L63k35K25k76J82K00m32K22j8
$$ plain form
5633 -159 -269 22 -144 118 155 34 76 -91 89 129 43 -228 13 -103 43 154 33 196 -5 122 47 -247
5655 -247 -327 -107 140 150 316 108 -47 -427 -121 204 231 192 -70 -314 -233 132 -293 -390 -107 26 15 -285
5677 -285 -127 367 -287 -238 -308 233 288 -387 46 -16 204 -669 -8 -47 -348 -199 -61 -288 243 334 -95 -507
5699 -507 863 848 143 1106 -207 -493 458 -724 -781 74 -734 -241 309 -817 306 -108 106 -114 -368
5718 -368 119 -55 1343 -712 -108 -128 -542 -57 572 -405 -101 -71 342 -323 481 -381 524 -503 151 412
5738 412 -30 480 631 236 50 44 671 918 -257 204 -9 319 1029 -225 -40 -15 -247 -133 201 -99
5758 -99 566 -30 -391 391 -73 615 -297 -6 -308 -244 -134 -270 300 -211 20 24 164 255 171 273 -135 -138 80
5781 80 -102 -361 -45 140 127 -244 79 145 -397 -286 216 -196 167 -68 157 -119 63 263 -169 53 35
5802C5p9j13K74l33K70k09K10k92M20k45J59j26M1R0k54K38K73l69J28j97n9K51
5824A13J1j16j22L59L26m04j74N4j62K85K4l30j70L07j09n1l14K01O04o51J89
5845a30j25P82m98j01K48j74J9n3L5J87l35M3K73l54L55k81J26k9K3J72k38L70
5867C15m27r9L00J94l43k7J18J4L7k0j37J88J59j70j60M2M7j23P8K96l16r9Q7
5890d6k5K63l58L03j40m0J96NjN6j58l56J49K11k1n8j6M05k63o4L39m20M2l7J16
5915H2m0j46M2J65l23K83k65N34l43m95N00Q7j22j30N58m09P0k33L79J7l46J72
5937C7M8m9j2m25N29K14l26J05O0n27M87l9l55M51J43m88L23n41K20L48J31j95
5959A39m9q5N0j00l4K40J10j86l9n7n6J77n58L98L18j02j84R0J22j60r8N28k8
$$ plain form
5802 35 -44 -157 117 -216 54 -155 55 -237 183 -62 97 -29 12 102 -152 86 359 -10 118 -79 -138 113
5824 113 124 8 -114 245 571 167 -7 47 -115 170 194 -136 -306 1 -108 -159 -473 -272 332 -319 -130
5845 -130 -255 527 29 -72 176 2 21 -32 3 190 -145 -102 171 -183 172 -109 17 -12 11 183 -55 315
5867 315 -112 -211 89 283 -60 -87 31 45 82 62 -75 113 272 102 -58 -16 31 -92 -14 282 -34 -133 -46
5890 -46 -71 192 -166 137 -3 -43 153 158 157 213 55 -301 -152 59 38 -20 -36 369 106 42 381 -39 3 -34 82
5915 82 42 -104 -62 103 -220 63 -202 332 -11 -506 -6 81 -41 -171 387 -22 48 -185 194 211 -135 37
5937 37 85 36 24 -401 128 342 16 121 181 -346 141 102 -253 198 341 -147 176 -365 -145 203 334 139
5959 139 90 5 55 -45 -79 161 271 85 46 -11 -67 110 -448 -50 268 166 -18 72 194 34 -64 464 436
5982D36n00N06l12j90M11l9k82L61o27m09R47k63M29p56O58p22k22Q56l82k78
6002c78Q6M55k99N05q2k31K07j87j74L60j96o16M54j24k64M9M57m6N20o18N49
6023D27k97l13J98j92j6j73J95Q3K51p9K66n5l34o3M15m51J34J80m1K13l00j60
6045a12N4J74n0K3q0K14r6l68J24J34k86L81l56L72l22K49k01j10r1O40k61k5
6067Gr0O8m4J72L3j39o4J49k62m3J64L02m46L61k63lL7J73k31RK30j47j4J49l57
6092b49N2n7M04j06j24J64p7o6P9k05n7M51J7l66M00k52L23J8l5l56K80k59K27
6115B06j69P8r8r2oJ32M9j45N9J2K08l26K6k54K37j08M53m57J75K0Q2R5l61K57
$$ plain form
5982 436 -64 442 130 -60 351 312 30 391 -236 -645 302 39 468 -288 370 -352 -574 282 -100 -378
6002 -378 -292 163 -136 369 287 56 263 76 -98 262 66 -550 -96 -220 -484 -435 22 -24 496 -122 427
6023 427 130 -183 15 -177 -193 -366 -171 -88 163 84 350 295 -39 -102 313 -138 -4 176 135 348 48 -112
6045 -112 -58 116 66 89 9 223 127 -241 -117 17 -269 112 -244 128 -194 55 -146 -256 -347 293 32 7
6067 7 -83 -15 -59 113 146 7 -57 92 -170 -213 -49 253 -193 168 -95 -98 -61 112 -119 -110 120 -27 -41 108 -249
6092 -249 -197 -254 150 44 -80 84 7 -59 20 -185 -242 209 226 -140 260 8 331 349 314 -42 238 -21 206
6115 206 37 115 17 -75 -81 51 100 -45 14 26 234 -92 -66 -320 -83 -191 262 -195 -20 0 82 177 -184 73
$$ [...]
8191C31
##END NTUPLES=NMR FID
##END=
