##TITLE=1H_SR_32_2ex
 CDCl3, 8 sc, 
 1.02.2021
##JCAMPDX= 6.0         $$ Bruker NMR JCAMP-DX V2.0
##DATA TYPE= NMR FID
##DATA CLASS= NTUPLES
##ORIGIN= UXNMR, Bruker Analytische Messtechnik GmbH
##OWNER= root
$$ XWIN-NMR		Version 3.5
$$ Mon Feb  1 12:29:38 2021 Russian Standard Time (UT+4h)  she@DPX200
##.OBSERVE FREQUENCY= 200.1315066352
##.OBSERVE NUCLEUS= ^1H
##.DELAY= (6, 6)
##.ACQUISITION MODE= SIMULTANEOUS
##.ACQUISITION SCHEME= undefined
##.AVERAGES= 8
##.DIGITISER RES= 18
##SPECTROMETER/DATA SYSTEM= spect
##.PULSE SEQUENCE= zg30
##.SOLVENT NAME= CDCl3
##.SHIFT REFERENCE= (INTERNAL, CDCl3, 0, 15.7039)
##AUDIT TRAIL= $$ (NUMBER, WHEN, WHO, WHERE, WHAT)
$$ ##TITLE= Audit trail, XWIN-NMR		Version 3.5
$$ ##JCAMPDX= 5.01
$$ ##ORIGIN= Bruker BioSpin GmbH
$$ ##OWNER= she
$$ F:/spectra/data/she/nmr/H-F/1/audita.txt
$$ ##AUDIT TRAIL=  $$ (NUMBER, WHEN, WHO, WHERE, WHAT)
(   1,<2021-02-01 12:28:24.64 +0400>,<she>,<DPX200>,
      <created by zg, POWCHK disabled, PULCHK disabled
       configuration hash MD5:
       00 E9 B6 7A A2 85 ED C7 34 08 36 98 17 FE 4E 26
       data hash MD5: 16K
       5A E0 BC B9 75 D5 06 3D D8 3E AD 7A A1 CD 2A DE>)
$$ ##END=
$$ 
$$ hash MD5
$$ FF E3 03 A9 D6 1D 83 05 56 5C 2F 97 A3 DB 4F 29
##$RELAX= 
##$RELAX= 
##$RELAX= 
##$RELAX= 
##$RELAX= 
##$RELAX= 
$$ Bruker specific parameters
$$ --------------------------
##$DU= <F:/spectra>
##$EXPNO= 1
##$NAME= <H-F>
##$PROCNO= 1
##$TYPE= <nmr>
##$USER= <she>
##$AMP= (0..31)
100 100 100 100 100 100 100 100 100 100 100 100 100 100 100 100 100 100 
100 100 100 100 100 100 100 100 100 100 100 100 100 100 
##$AQSEQ= 0
##$AQ_mod= 1
##$AUNM= <au_zg>
##$AUTOPOS= <>
##$BF1= 200.13
##$BF2= 200.13
##$BF3= 200.13
##$BF4= 200.13
##$BF5= 200.13
##$BF6= 200.13
##$BF7= 200.13
##$BF8= 200.13
##$BYTORDA= 1
##$CFDGTYP= 0
##$CFRGTYP= 5
##$CHEMSTR= <none>
##$CNST= (0..31)
1 1 145 1 1 1 1 1 1 1 1 1 1 1 1 1 1 1 1 1 1 1 1 1 1 1 1 1 1 1 1 1 
##$CPDPRG= <>
##$CPDPRG1= <>
##$CPDPRG2= <>
##$CPDPRG3= <>
##$CPDPRG4= <mlev>
##$CPDPRG5= <mlev>
##$CPDPRG6= <mlev>
##$CPDPRG7= <mlev>
##$CPDPRG8= <mlev>
##$CPDPRGB= <>
##$CPDPRGT= <>
##$D= (0..31)
0 1.2 0 0 0 0 0 0 0 0.06 0 0.03 0 0 0 0 0.0002 0 0 0 0 0 0 0 0 0 0 0 0 
0 0 0 
##$DATE= 1612168104
##$DBL= (0..7)
120 120 120 120 120 120 120 120 
##$DBP= (0..7)
150 150 150 150 150 150 150 150 
##$DBP07= 0
##$DBPNAM0= <>
##$DBPNAM1= <>
##$DBPNAM2= <>
##$DBPNAM3= <>
##$DBPNAM4= <>
##$DBPNAM5= <>
##$DBPNAM6= <>
##$DBPNAM7= <>
##$DBPOAL= (0..7)
0.5 0.5 0.5 0.5 0.5 0.5 0.5 0.5 
##$DBPOFFS= (0..7)
0 0 0 0 0 0 0 0 
##$DE= 6
##$DECBNUC= <off>
##$DECIM= 32
##$DECNUC= <off>
##$DECSTAT= 4
##$DIGMOD= 1
##$DIGTYP= 9
##$DL= (0..7)
0 120 120 120 120 120 120 120 
##$DP= (0..7)
150 150 150 150 150 150 150 150 
##$DP07= 0
##$DPNAME0= <>
##$DPNAME1= <>
##$DPNAME2= <>
##$DPNAME3= <>
##$DPNAME4= <>
##$DPNAME5= <>
##$DPNAME6= <>
##$DPNAME7= <>
##$DPOAL= (0..7)
0.5 0.5 0.5 0.5 0.5 0.5 0.5 0.5 
##$DPOFFS= (0..7)
0 0 0 0 0 0 0 0 
##$DQDMODE= 0
##$DR= 18
##$DS= 0
##$DSLIST= <SSSSSSSSSSSSSSS>
$$ [...]
##$SUBNAM2= <"">
##$SUBNAM3= <"">
##$SUBNAM4= <"">
##$SUBNAM5= <"">
##$SUBNAM6= <"">
##$SUBNAM7= <"">
##$SUBNAM8= <"">
##$SUBNAM9= <"">
##$SW= 16.9725356469052
##$SWIBOX= (0..15)
0 0 2 0 0 0 0 0 0 0 0 0 0 0 0 0 
##$SW_h= 3396.73913043478
##$TD= 16384
##$TD0= 1
##$TE= 0
##$TE2= 300
##$TE3= 300
##$TEG= 300
##$TL= (0..7)
0 120 120 120 120 120 120 120 
##$TP= (0..7)
150 150 150 150 150 150 150 150 
##$TP07= 0
##$TPNAME0= <>
##$TPNAME1= <>
##$TPNAME2= <>
##$TPNAME3= <>
##$TPNAME4= <>
##$TPNAME5= <>
##$TPNAME6= <>
##$TPNAME7= <>
##$TPOAL= (0..7)
0.5 0.5 0.5 0.5 0.5 0.5 0.5 0.5 
##$TPOFFS= (0..7)
0 0 0 0 0 0 0 0 
##$TUNHIN= 0
##$TUNHOUT= 0
##$TUNXOUT= 0
##$USERA1= <user>
##$USERA2= <user>
##$USERA3= <user>
##$USERA4= <user>
##$USERA5= <user>
##$V9= 5
##$VALIST= <valist>
##$VCLIST= <CCCCCCCCCCCCCCC>
##$VD= 0
##$VDLIST= <DDDDDDDDDDDDDDD>
##$VPLIST= <PPPPPPPPPPPPPPP>
##$VTLIST= <TTTTTTTTTTTTTTT>
##$WBST= 1024
##$WBSW= 4
##$XGAIN= (0..3)
0 0 0 0 
##$XL= 0
##$YL= 0
##$YMAX_a= 64725
##$YMIN_a= -76327
##$ZGOPTNS= <>
##$ZL1= 120
##$ZL2= 120
##$ZL3= 120
##$ZL4= 120
##$ABSF1= 10
##$ABSF2= 0
##$ABSG= 5
##$ABSL= 3
##$ALPHA= 0
##$AQORDER= 0
##$ASSFAC= 0
##$ASSFACI= 0
##$ASSFACX= 0
##$ASSWID= 0
##$AUNMP= <proc_1d>
##$AZFE= 0.1
##$AZFW= 0.1
##$BCFW= 1
##$BC_mod= 2
##$BYTORDP= 1
##$COROFFS= 0
##$CY= 11.3945322036743
##$DATMOD= 1
##$DC= 2
##$DFILT= <>
##$DTYPP= 0
##$F1P= 15.9154993809931
##$F2P= -4.1035820241983
##$FCOR= 0.5
##$FTSIZE= 0
##$FT_mod= 4
##$GAMMA= 1
##$GB= 0.15
##$INTBC= 1
##$INTSCL= 1
##$ISEN= 128
##$LB= 0.24
##$LEV0= 0
##$LPBIN= 0
##$MAXI= 10000
##$MC2= 0
##$MEAN= 0
##$ME_mod= 0
##$MI= 1.114404
##$NCOEF= 0
##$NC_proc= 0
##$NLEV= 6
##$NOISF1= 3.799351
##$NOISF2= 2.8
##$NSP= 1
##$NTH_PI= 0
##$NZP= 0
##$OFFSET= 15.70392
##$PC= 1
##$PHC0= -10757.55
##$PHC1= 8.000954
##$PH_mod= 1
##$PKNL= yes
##$PPARMOD= 0
##$PSCAL= 0
##$PSIGN= 0
##$REVERSE= no
##$SF= 200.130013532006
##$SI= 16384
##$SIGF1= 3
##$SIGF2= 2
##$SINO= 400
##$SIOLD= 16384
##$SREGLST= <1H.CDCl3>
##$SSB= 0
##$STSI= 0
##$STSR= 0
##$SW_p= 3612.71676300578
##$SYMM= 0
##$S_DEV= 0
##$TDeff= 0
##$TDoff= 0
##$TI= <>
##$TILT= no
##$TM1= 0
##$TM2= 0
##$TOPLEV= 0
##$USERP1= <user>
##$USERP2= <user>
##$USERP3= <user>
##$USERP4= <user>
##$USERP5= <user>
##$WDW= 1
##$XDIM= 8192
##$YMAX_p= 0
##$YMIN_p= 0
$$ End of Bruker specific parameters
$$ ---------------------------------
##NTUPLES= NMR FID
##VAR_NAME=  TIME,          FID/REAL,        FID/IMAG
##SYMBOL=    X,             R,               I
##VAR_TYPE=  INDEPENDENT,   DEPENDENT,       DEPENDENT
##VAR_FORM=  AFFN,          ASDF,            ASDF
##VAR_DIM=   8192,          8192,            8192
##UNITS=     SECONDS,       ARBITRARY UNITS, ARBITRARY UNITS
##FACTOR=    0.0002944,     1,               1
##FIRST=     0,             0,               0
##LAST=      2.4114304,     0,               0
##MIN=       0,             -76327,          0
##MAX=       2.4114304,     64725,           0
$$ Real data points
##PAGE= N=1
##DATA TABLE= (X++(R..R)), XYDATA
0 0 0 0 0 0 0 0 0 0 0 0 0 0 0 0 0 8 -8 8 -8 8 -15 16 -16 23 -24 27 -32 39 -41 48 -56 64 -72 81 -91 103 -115
37 -115 129 -144 160 -179 197 -220 243 -267 297 -328 360 -396 436 -480 529 -584 644 -712 789
56 789 -877 980 -1098 1239 -1411 1623 -1893 2249 -2742 3472 -4660 6895 -12515 54778 64725
71 64725 -76327 14922 11538 -25547 20684 -1838 -17938 -9552 -1322 57914 5949 -22349 25287
84 25287 -8058 10879 24225 -39685 3473 287 -13923 57752 -19371 -55039 50073 6016
96 6016 -21136 25598 -14326 -10621 22556 21490 3978 -45924 -1575 29147 -36962 295 7653
109 7653 -41519 30487 28859 -19240 9760 -19079 -2979 30475 -31911 -17298 8087 -19187
121 -19187 15775 8227 -20499 -6554 -7904 21416 5770 -34516 18333 8000 -16437 33623
133 33623 -11745 -36052 17047 -2158 -5568 1963 -18873 14307 16603 1868 16024 -13597 -5468
146 -5468 20802 -8020 -1791 -4788 -13193 24030 3876 -9932 13381 -12627 3702 25220 -12353
159 -12353 -574 9108 -1086 18138 -2586 -12199 4382 -10147 5696 7024 -17469 7856 10088
172 10088 1634 16330 -8014 -8031 9705 -8342 -184 -2352 -16341 8160 3161 -4709 6367 -11951
186 -11951 -2187 11279 -8767 -706 980 -7502 8339 -688 -8360 -2468 -11902 -108 1905 -11271
200 -11271 3413 2754 -737 11747 -2626 -5568 2122 -7751 376 -604 -11664 3854 3670 -2035
214 -2035 6882 -1451 -1845 4389 213 4267 -701 -1180 9708 -72 -1310 4783 -7159 -1724 5190
229 5190 -2368 3230 5345 3828 9546 2916 684 2706 -4110 -938 193 -3661 1249 1625 2763
244 2763 4917 -1157 1191 2575 -3155 1871 1823 -2782 1919 980 -2410 -2009 -4237 -3762 -3113 -2811 810
261 810 649 643 3984 705 -1462 -1558 -4964 -4741 -4259 -4999 -1829 -1072 -440 1354 -392 -653 -554 -1716 -658
280 -658 -390 -412 841 -100 -691 -1325 -2865 -2517 -1794 -1183 1184 2844 3744 4294 3628 2216 651 -853
298 -853 -1912 -1615 -842 654 1699 2636 3261 2863 2512 1871 1482 1387 1599 2203 2119 1418 1314 -3 -879 -1348
318 -1348 -1136 -1030 784 2131 2464 3296 2863 1480 -338 -1702 -2637 -3708 -2909 -1123 -1671 -447 1583
335 1583 -460 -890 320 -1923 -1621 -838 -986 -668 -1156 -1212 -1558 -3487 -2579 -1998 -3267 -931 -339 433
353 433 2586 207 945 779 -3279 -1460 -938 -4301 -887 396 -395 2317 1442 1186 1257 -69 2609
370 2609 461 -1302 3478 798 227 3204 -1706 -326 2133 -1228 2402 1258 95 6135 2732
385 2732 1356 3525 -1940 727 1491 -3279 690 -994 -313 5469 -114 45 2806 -2364 2903 921
401 921 -4667 1465 -863 -975 4075 -4781 -2817 1268 -3863 1649 -1295 -5105 4397 -66 -744 3073
417 3073 -6414 -2537 1523 -4316 -904 -4858 -2952 5792 -3097 132 2918 -8513 2911 5277 -7839
432 -7839 62 -444 -1855 5428 -3349 -1837 969 -4761 6314 2205 -7026 4106 1931 3621 5465
447 5465 -6711 2045 2153 -5427 9063 -1971 -10488 11298 5198 -2434 5097 -2424 1159 3403
461 3403 938 4095 -8151 -1236 13220 -4094 -2082 3357 -7087 5798 4203 -5410 4076 -5099
475 -5099 1177 13782 -9034 -6559 5767 -4692 1203 926 -5317 -1450 -2348 9514 3209 -16546
489 -16546 4724 5359 -10483 7458 -2500 -12767 7044 1658 -682 -1307 -11334 5418 5168 -7089
503 -7089 3405 -4175 -3959 8693 -990 -1190 -6131 -6320 13300 -2736 -10969 10301 -5350 -2213
517 -2213 16148 -5468 -7193 4548 2229 6225 -4294 -4886 6315 -3624 6444 6577 -13165 2194
531 2194 7056 -610 6677 -7056 -2082 12219 -3509 2344 4144 -12894 5405 9612 -6180 -825
545 -825 -2649 3445 7333 -4685 2782 -3634 -8579 13974 -109 -11687 4583 -3538 2060 6847
559 6847 -9791 -1357 146 -3247 8793 -4921 -9524 5843 -897 1906 143 -11047 2350 880
573 880 -1932 5395 -10778 -3319 11437 -4093 -207 632 -9361 6345 2688 -4713 1606 -6982 2350
588 2350 8742 -6236 132 -534 -3832 9020 -399 -4893 4547 -3368 4944 5982 -8941 2295
602 2295 1977 -1542 7326 -3472 -3563 6472 -719 4413 2135 -7517 4325 2280 -1167 3998 -5469
617 -5469 -210 7406 -2935 1113 -1935 -5588 6650 1212 -3261 1264 -4459 2714 5023 -5636
631 -5636 172 -1367 -3845 5640 -1686 -5253 3216 -1801 2779 1077 -5869 1438 -1079 -2051 3298
646 3298 -5170 -3154 3176 -2609 1194 -372 -5683 3069 -311 -1157 1907 -4729 -553 4627 -2843
661 -2843 -780 -240 -2487 3315 -544 -1539 1818 -2541 2385 3459 -3879 1393 297 -953 3424 -558
677 -558 -268 2417 -618 2975 1689 -2394 3058 914 -170 2915 -1277 431 2155 -922 1846 -329
693 -329 -1646 2711 -82 25 1446 -1567 1123 1153 -1192 802 -657 -1565 1340 -1090 -1015 474 -2016
710 -2016 298 -49 -2029 -135 -1004 -1024 371 -1552 -981 -211 -1502 -78 -963 -1576 51 -745 -663 576
728 576 -1172 -418 114 -857 -78 -616 -675 407 -347 33 495 -415 321 661 -164 366 197 343 948 81
748 81 685 713 340 528 1100 149 846 1068 886 938 676 1212 809 603 930 479 130 618 467 170 509
769 509 412 323 428 200 380 -8 75 -246 -153 -24 -186 -478 -285 -356 -740 -589 -379 -387 -727 -713 -647 -607 -815 -597
793 -597 -684 -724 -533 -626 -590 -819 -665 -317 -242 -652 -217 -457 -422 -50 -324 -721 -66 -240 -266 -421 -258 272 -263
816 -263 197 583 -144 506 806 71 724 544 150 783 416 644 917 141 927 945 439 916 426 566 1142
837 1142 196 428 1249 12 1020 710 -242 743 -25 160 781 -1149 17 1130 -639 262 -53 -1091
855 -1091 554 -862 -388 175 -1739 363 624 -1922 230 -529 -1271 530 -967 -527 -607 -1893 1338
872 1338 -355 -2710 1206 -824 -1347 1161 -1362 -740 184 -726 1376 -1233 -1972 2074 -871 -481 1981
889 1981 -2039 16 1222 -85 1465 -1895 -420 3476 -1474 158 2406 -2232 1146 2629 -830
904 -830 511 -818 1461 3016 -2324 1289 1768 -2610 3095 1876 -2982 950 392 1443 1590 -3006
920 -3006 1648 1181 -1916 3975 -769 -3801 2640 498 22 -37 -3005 1808 337 -2057 3178 -3526
936 -3526 -2825 4522 -1442 -1959 -271 -2552 2021 -474 -1870 1462 -4097 54 4662 -4304 -1821 1194
952 1194 -1913 2421 -873 -2470 993 -2490 2563 3090 -5942 478 2733 -1518 2278 -1482 -2228 2554
968 2554 -876 2531 381 -5378 4129 2646 -2509 2640 -2015 -667 4451 -697 1002 -845 -2693
983 -2693 6266 885 -3185 2918 -1920 719 4855 -3210 90 135 -459 5358 -2273 -3251 3402 -1761
999 -1761 1727 2481 -5055 641 1465 -123 2622 -4553 -1961 4168 -2158 1003 -180 -5571 2677 1388
1015 1388 -2346 718 -4615 104 3855 -3274 40 -1321 -3258 4567 -667 -3426 838 -2837 2208
1030 2208 2898 -4858 562 -243 -1048 4535 -2562 -3025 2713 -948 2672 1185 -4885 2456 1186 -237
1046 -237 2841 -3376 -387 3932 -1158 1979 -375 -3198 4555 1018 -1103 1928 -2790 1057 3640
1061 3640 -2250 1215 -555 -1262 5041 -790 -1929 1658 -1774 2600 2466 -3345 1097 -305 58 3478
1077 3478 -3252 -1669 2247 -1653 1915 -76 -3398 1857 -167 -677 1335 -4425 -301 2282 -2716
1092 -2716 983 -989 -2520 2532 -87 -1302 224 -3178 1105 1854 -2834 817 -803 -839 2413 -1802
1108 -1802 -1539 1427 -1357 1651 954 -2410 1045 -22 -206 2591 -2492 -411 1640 -815 2028 -354
1124 -354 -1291 1695 48 195 1400 -1848 936 1762 -382 1104 -332 -529 2584 -248 -111 574 -1484
1141 -1484 1582 1447 -1258 759 -358 -24 2021 -729 -569 123 -1217 807 -455 -1376 596 -184
1157 -184 -446 355 -1683 -667 540 -1446 305 -1017 -1169 731 -932 -816 9 -1409 -266 48 -1490
1174 -1490 -182 -620 -572 740 -505 -1022 291 -461 121 251 -980 130 -45 85 931 -743 232 926
1192 926 -366 684 83 -426 662 471 470 675 -85 378 847 377 223 474 423 180 158 518 319 671
1212 671 768 744 847 652 85 -363 480 219 -270 285 -107 968 817 -392 -291 392 93 -211 -259 -22
1232 -22 -198 -578 7 -799 -887 -590 -549 -160 33 -988 -696 -499 -229 -450 -565 -473 -234 -883 -268 253 -597
1253 -597 -214 105 -281 -97 -30 -26 -537 125 66 247 -227 202 1006 682 31 344 -198 332 249 548 877 496
1275 496 302 185 158 -214 724 445 621 319 677 814 271 427 498 706 823 97 404 -73 367 548 -154
1296 -154 -301 229 475 922 -370 201 492 -580 -136 532 -484 -172 598 -769 -1017 -39 -649 -53 -505
1315 -505 -538 166 -923 -234 219 -587 -500 -103 -776 -444 -433 -181 -29 -1258 161 124 -1606 185 735 -908
1335 -908 -278 -370 46 184 -206 621 160 -127 1442 545 -583 652 -47 379 379 -359 291 178 -308 1954
1355 1954 -115 -886 1756 359 5 611 -748 151 566 452 858 -1162 5 2108 -1175 110 1159
1372 1159 -1565 928 1530 -830 418 -1062 -7 1448 -1134 150 35 -1162 1211 -12 -585 44
1388 44 -1351 1168 441 -2800 723 -241 -1663 1777 -809 -2215 332 -496 320 -415 -1799 1035 -380
1405 -380 -600 1168 -1759 -720 1908 -1220 443 -527 -1855 2281 -184 -1071 1553 -1505 97 2582
1421 2582 -1218 -227 467 -274 2176 -618 -302 1265 -1324 2021 1441 -2669 1271 1178 -250 2493 -1213
1438 -1213 -935 2160 -779 1149 313 -2504 1514 907 -244 1043 -1990 474 2010 -1510 948 -1021
1454 -1021 -2138 2768 -466 -1707 1061 -1960 799 1620 -2451 120 -520 -892 2578 -1481 -1648 1021
1470 1021 -1445 1373 -96 -3123 845 -502 -596 2022 -2550 -852 1996 -1272 616 -575 -2424
1485 -2424 2280 -33 -683 1054 -2495 613 2156 -1600 659 -875 -1101 3234 -235 -486 1205 -1640
1501 -1640 1905 1616 -2273 823 2 400 2946 -1577 -443 1777 -1084 2238 507 -2574 1482 402
1517 402 286 1583 -2185 153 1535 -1157 1551 -954 -1977 2638 -120 -507 910 -2515 1148 1501
1533 1501 -1887 459 -1257 -1041 2608 -1195 -1027 318 -1561 1548 -62 -2099 632 -1007 -374 1907
1549 1907 -2582 -988 1106 -1503 1282 -374 -1983 1170 -421 77 1012 -2474 241 1118 -951 862
1565 862 -872 -957 2002 -99 -55 652 -1610 1571 1219 -1425 1040 -485 39 2284 -785 -125 723
1582 723 -417 1755 289 -1169 1201 -306 257 1586 -1377 103 832 -369 1349 -317 -886 1267
1598 1267 -262 442 593 -1108 196 289 -598 476 -551 -737 1052 -642 -273 -5 -1350 673 240
1615 240 -1251 259 -751 -272 529 -939 -136 -276 -747 630 -790 -999 623 -438 2 475 -1040
1632 -1040 -294 -41 -519 482 -633 -364 492 -139 443 311 -710 685 139 -243 666 -141 48 770
1650 770 27 270 481 -355 586 157 49 677 160 503 602 -137 302 351 -132 553 235 57 491 218 522
1671 522 241 -330 249 115 -183 300 -327 -50 348 -361 -11 -67 -509 -330 -311 -526 -129 -346 -153 -185 -429
1692 -429 -177 -109 -424 -523 -545 -294 -216 -432 -122 168 -168 -389 -174 -113 -93 -54 -200 24 106 124 -78 -196 -100
1715 -100 -1 -176 58 308 281 232 292 414 220 195 311 400 414 380 387 180 253 349 457 149 385 19 100 443
1739 443 238 435 325 175 154 -78 67 27 -43 -270 265 171 -47 190 -46 -263 36 72 -128 0 -98 -55
1761 -55 -142 -178 98 -32 -140 -466 -76 -595 -336 -240 -287 -388 -388 82 -299 -367 32 -314 -450 146 28 -400 33
1784 33 -8 -219 -342 229 283 -271 517 321 -172 339 165 -115 309 -78 515 885 -154 415 602 -185 149
1805 149 416 323 316 49 551 343 -292 922 315 -393 671 -60 -509 617 97 32 414 -66 136 -25
1825 -25 -407 505 -293 -349 533 -124 309 -87 -726 209 -546 -492 599 -937 -428 632 -509 -271 -110 -1040
1845 -1040 112 -235 -380 45 -1295 466 151 -1455 166 -398 -912 828 -686 -682 481 -943 1057
1862 1057 580 -1252 349 -66 -572 1327 -360 -190 865 -78 692 70 -1208 1425 105 103 912 -497
1880 -497 102 1233 -629 1053 -164 -536 1224 -90 -147 269 -261 653 690 -664 884 -573 -43 1150
1898 1150 -591 -428 225 -925 1140 706 -1661 242 -271 -611 1111 -1364 -715 693 -689 236 -686
1915 -686 -1272 781 -552 -552 289 -1795 38 653 -879 510 -1195 -276 1454 -649 -929 -115 -1685
1932 -1685 1137 504 -1620 -192 -1431 -143 1550 -944 -280 917 -894 1847 -246 -1294 917
1947 917 -373 48 1667 -1282 145 1235 -105 1064 -400 -1018 2174 -22 -98 947 -1477 605
1963 605 984 -353 1324 -696 88 2216 -528 332 335 -1369 1363 363 -1089 907 -28 11 1231
1980 1231 -1750 60 264 -1040 1595 -968 -828 614 -605 396 769 -1962 212 297 -977 483
1996 483 -782 -1195 1194 -750 -425 262 -1071 601 417 -1025 278 -1292 -485 1332 -1021 4
2012 4 76 -833 1447 175 -1440 629 -661 186 1437 -1094 -31 -8 -488 1104 -113 -502 1333 -370
2030 -370 -22 593 -1162 1289 974 168 514 -209 -791 1215 -48 58 65 -691 999 -198 -533 604
2048 604 81 51 865 -919 608 304 -140 1035 -223 -860 376 -656 173 195 -1266 -485 420 433 303
2067 303 -632 -1024 1388 -677 116 -166 -1975 254 -433 -282 571 -1131 -190 469 -343 -420 -382 -152 638
2086 638 193 -838 258 -459 245 183 -472 660 364 -353 296 933 526 1010 314 647 617 457 502 -381
2106 -381 -145 339 651 223 1765 54 781 34 -744 754 702 -15 374 516 -29 725 -428 153 54
2125 54 -774 513 475 -721 -167 16 -125 999 -348 -43 -561 -546 367 -372 -177 -188 -574 112 285 -59
2145 -59 -102 -495 -619 629 -448 374 341 -659 305 299 -47 68 -537 365 231 -239 -371 -74 228 28 -560
2166 -560 136 629 41 -94 790 382 -470 710 210 374 365 201 291 251 428 140 -316 -473 305 147 365
2187 365 122 -586 -417 481 -77 253 486 -368 -523 92 -126 -334 313 335 -185 -473 -80 441 55 -50
2207 -50 -951 -86 -635 -425 -226 -438 -568 415 -389 -158 -546 -10 -122 -255 -339 -361 -433 -276 -70 -371 -277 -144
2229 -144 -277 -126 -210 -92 246 -564 -231 -399 -136 244 -39 -28 -184 -49 371 74 373 425 -98 -155 -60 239
2251 239 388 85 265 -37 9 246 532 193 75 144 15 206 1 -268 463 102 207 185 46 -276 -61
2272 -61 -76 158 228 -198 179 115 376 385 -369 141 605 -253 -83 -45 -364 186 -297 -144 297 -414 143 183 -404
2295 -404 -97 -311 -68 230 -1239 -583 -16 229 112 -690 -545 331 155 -58 409 321 281 82 -1042 -621
2315 -621 -229 -1243 500 -111 43 851 -377 356 710 -584 792 234 129 65 -416 194 907 -232
2333 -232 937 667 -357 24 -99 26 611 -675 507 571 -301 638 -19 -388 820 -214 200 200 -785
2352 -785 151 188 -328 336 -86 -107 994 93 206 506 -550 135 205 -787 387 -491 -343 1011 -474
2371 -474 -463 252 -265 561 -172 -834 619 -418 -312 715 -1163 -53 65 -469 476 -364 -554 873
2389 873 -180 221 258 -751 427 589 -274 578 -139 178 1154 -491 -113 225 -612 770 479 -340 499
2408 499 187 243 952 -363 275 546 -374 1370 -328 -538 907 -232 351 234 -701 279 599 -230 450
2427 450 -661 -514 1245 -76 -47 -398 -950 818 -211 -459 421 -865 -329 1121 -893 18 -423 -699
2445 -699 1041 -140 -542 -115 -811 242 257 -997 112 301 -700 700 -335 -204 493 -190 404 -122
2463 -122 -399 481 308 -129 643 -141 268 836 -489 322 651 -840 837 520 74 623 -491 75 768
2482 768 -672 479 347 -419 1153 -275 -201 291 -32 198 721 -895 661 -770 300 477 -1823
2499 -1823 66 625 246 325 537 -531 251 -636 -410 581 -1017 -592 411 -399 -360 -174 -507 584 -501
2518 -501 -271 364 -725 69 350 -287 -324 -122 -300 531 -211 -236 238 -375 316 173 -420 305 250 -167 364
2539 364 -450 -36 527 -277 400 129 -461 513 352 -27 507 -172 353 654 -65 265 -155 -271 552 76
2559 76 -8 489 -91 347 303 -237 275 -56 -241 378 -226 185 300 -360 91 -99 -170 195 -343 131 255
2580 255 -369 -161 44 -411 9 -28 -556 -66 -462 9 -173 -346 -73 12 -301 -30 -181 -353 290 -295 -124
2601 -124 -116 -303 -294 -261 -103 166 -347 -108 267 -157 40 337 -117 338 -34 -17 178 -27 161 374 -38 82
2623 82 107 58 319 -35 -69 252 135 146 201 -85 219 154 219 44 -41 -70 272 34 281 272 -112 81 -106 227
2647 227 199 38 201 157 -201 -45 39 8 -62 -152 14 37 -323 -19 -326 -378 -6 -45 -27 -100 -109 -361 -209 -187 -250
2672 -250 -365 -22 -196 117 -46 -384 -234 -77 -158 -132 -42 25 -422 494 460 -94 21 -362 222 -41 -178 823
2694 823 119 190 -37 74 -102 217 486 12 305 350 27 326 229 377 301 688 437 -692 726 752 -153
2715 -153 581 152 -342 256 -403 156 221 -168 340 -114 -56 -252 229 -163 238 46 -309 -81 184 3 -477
2736 -477 87 -273 471 -266 -436 -93 -106 -75 38 25 -296 69 -329 32 -202 -52 356 -186 -310 30 -7
2757 -7 251 215 252 -189 -172 -165 -246 30 228 -425 218 -170 249 16 102 154 -29 -370 110 376 36 922 267
2780 267 2 522 207 171 397 -130 437 -160 214 255 14 156 -213 159 157 387 362 408 -58 -383 518 -181
2802 -181 -149 -557 60 456 37 -572 155 -290 316 577 -438 152 -87 -295 -110 -639 -424 231 -204 72
2822 72 89 -146 372 194 -206 206 -48 192 181 -149 123 -93 -26 501 75 134 -326 -211 -122 242 -402 502
2844 502 394 -101 589 -379 222 1106 -164 704 482 -1219 431 760 -105 1155 -471 264 628 -467
2862 -467 483 -84 -747 -232 437 -559 798 -306 -258 771 -287 152 -247 -159 98 -285 -287 1122 -829
2881 -829 205 258 -784 787 -394 -475 561 -431 -463 -196 226 384 495 -689 105 -105 -484 288 217
2900 217 -100 538 -818 406 -380 -818 568 126 76 241 -257 799 476 -647 -343 -95 52 1014 -329
2919 -329 -343 766 31 118 242 -566 314 -89 252 1066 449 -38 694 -235 465 -38 -555 692 359 243
2939 243 610 -795 -202 523 144 122 416 -188 598 -46 -688 678 -330 282 621 -126 828 498 -590
2958 -590 1281 -488 -539 -77 -199 933 -188 -734 -65 -183 216 -91 -1132 -88 -359 -688 217 334
2976 334 668 715 -716 -94 1155 -259 222 439 -423 303 -313 -846 620 -368 276 349 59 -74 832
2995 832 -441 -351 48 397 625 -315 -506 420 -70 924 421 -170 539 -91 -142 371 311 370 82 -365 464
3016 464 20 133 420 -292 -230 231 -366 461 143 -639 834 -417 314 -63 -250 318 496 -593 -92
3035 -92 -174 -197 410 130 55 242 -323 204 -238 -479 408 -344 -633 -90 -374 -273 162 -238 -74 -384 -374 -76
3057 -76 -364 -244 540 -152 -203 77 -236 307 -18 -237 66 290 -110 59 32 229 48 -32 163 25 -30 37
3079 37 136 49 749 8 -39 370 -320 505 575 184 443 -87 -385 57 186 250 -192 -391 106 304 -278 314
3101 314 -447 -35 108 -716 -123 81 298 -36 37 -235 237 14 -198 -217 -366 -215 274 154 -272 -249 10
3122 10 417 75 203 527 -121 -287 531 -126 -152 325 -84 334 195 376 183 75 -234 62 177 263 312
3143 312 447 -119 -200 226 398 107 319 -321 312 93 -271 -102 609 -25 497 -88 -165 353 -45 -514 -118
3164 -118 -35 -225 364 5 152 -207 -87 183 -132 33 337 319 -474 360 478 -223 199 264 -175 -50 143
3185 143 -345 -321 369 124 -315 541 754 -730 -138 -218 -274 261 -514 -76 56 -195 -611 14 175 481 550
3206 550 9 97 105 -183 221 423 296 -222 442 527 -67 271 -135 199 294 -9 373 -25 -234 311 -85 368
3228 368 599 -346 131 558 6 157 -277 196 412 107 307 635 -203 70 205 -353 20 72 344 13
3248 13 -37 -245 4 88 242 -572 -356 63 -409 -149 209 -300 -158 288 77 -185 200 -335 -3 -224 -64
3269 -64 195 -392 23 54 -198 -172 0 -483 240 -370 -83 -189 160 -145 -173 -9 -32 -237 -573 191 75 230
3291 230 191 -719 13 -75 -201 209 -247 -251 391 -128 285 397 -385 91 390 -311 -52 410 902 567 -935
3312 -935 0 402 -6 344 609 -491 869 228 -343 357 -82 888 360 260 -71 522 610 87 -119 -453
3332 -453 880 -602 268 277 105 806 4 -197 1050 714 -1157 677 535 904 230 -109 -133 -213 -111 1141
3352 1141 -211 -585 52 -534 349 571 96 218 -241 619 253 -29 627 -3 230 1 266 526 431 273
3372 273 -372 1242 -592 -114 -345 -114 560 -203 350 218 -153 517 72 377 -216 313 -419 231 64
3391 64 -247 141 -232 410 -280 -1197 310 212 608 376 -515 87 207 -433 755 313 -691 408 -148
3410 -148 196 389 -805 2 29 -485 238 149 12 689 -254 323 195 -831 -471 18 -367 117 169 336
3430 336 -170 -474 82 -446 60 818 29 455 991 -110 69 -108 -1 -475 916 -623 -230 417 406
3449 406 883 542 768 739 -55 677 530 403 -474 -322 -340 322 -147 293 419 -154 125 412 -342 61 -121
3470 -121 -158 269 -925 255 518 -345 5 44 -169 591 -362 45 408 -215 -42 -163 -750 -12 -315 12
3490 12 -16 -192 355 215 -862 162 -7 -596 577 -547 38 25 -206 100 82 -391 250 65 -167 -287
3510 -287 -11 -129 -64 -88 -252 189 -121 -11 -3 458 152 -58 -115 -91 80 113 -7 176 251 -49 154 257 -109
3533 -109 183 154 -165 122 -75 -74 151 21 -105 326 -169 16 184 -263 -57 -181 -193 -44 -165 -101 231 -313
3555 -313 -68 35 -152 70 48 -83 -186 -283 -425 63 -138 8 -30 -228 -139 -25 -30 32 65 -235 129 -202 -135
3578 -135 -156 -155 206 112 38 26 125 -69 240 116 145 22 -134 -134 19 -117 260 -133 -37 157 -52 148 103 -102
3602 -102 206 192 267 363 -108 204 -40 162 231 172 55 303 158 67 9 -95 120 206 161 -231 -142 -150 -44 -139
3626 -139 -137 226 95 107 -276 -235 -5 -10 -90 -117 -126 -128 -103 82 -291 -224 -32 73 96 -238 -20 -155 -230 -123 -200 55
3652 55 -5 -67 -18 -13 199 -17 -33 61 -242 -120 283 -207 -83 46 -19 168 -31 -111 141 -1 -89 -136 47 -7
3676 -7 307 -34 -56 155 84 39 126 68 -150 82 3 12 -294 -31 13 -56 -59 -51 -106 90 6 -42 250 -15 -17 -30 10 -150
3704 -150 78 65 -142 -25 203 94 -1 2 -119 -200 12 52 -52 -136 -34 40 -106 -175 -52 -415 -48 -82 110
3727 110 88 -9 -242 53 216 85 232 -259 -100 -179 -89 183 9 -146 46 -179 -27 55 -246 88 -28 -79
3749 -79 349 37 -74 222 43 259 22 -275 267 -146 186 353 229 -391 514 169 229 -360 272 266 -51
3770 -51 482 31 -827 242 443 534 386 635 572 169 65 165 -238 6 401 -409 -1019 -285 -625 309 577
3791 577 -507 -458 128 -204 329 152 -286 -313 -582 98 -309 -75 -153 155 -414 211 -98 -237 -185 35 -403
3812 -403 80 -412 -52 -22 16 481 -178 116 442 -73 297 273 24 256 331 -190 311 -30 -111 204 -151 147
3834 147 169 26 306 -23 5 220 147 258 274 -276 65 226 -52 287 -59 -161 232 14 -56 -43 -455 297
3856 297 173 -298 381 -480 -281 263 -324 -83 -124 -329 -15 77 -154 209 -286 -11 69 -362 -30 -150 -252
3877 -252 250 -182 -149 401 19 -3 23 -191 70 155 4 390 -23 -32 175 -300 10 -89 -116 289 178 -240 201
3900 201 -168 -129 80 -223 116 133 -91 68 73 -105 190 -203 118 142 -148 174 158 -124 521 100 -336 152
3922 152 -22 249 83 -330 16 303 -202 45 23 -171 305 -113 -345 -25 -202 170 19 88 170 -294 -301 188
3944 188 -97 -215 -35 -33 108 -174 -128 -10 -133 9 139 -42 159 27 23 76 -119 -32 53 -116 -137 98 -175
3967 -175 155 39 156 277 -3 3 -6 -201 -35 26 -189 59 -79 -41 70 46 1 9 -21 90 3 -218 356 33
3991 33 159 311 -124 21 39 5 52 234 -3 114 -71 26 37 59 -44 -18 -11 -108 -20 25 103 18 -11 -140 -226 77
4017 77 2 -280 -96 -218 54 -153 -55 -191 194 -109 -82 -53 -59 185 68 -68 -128 52 77 104 -2 193 214 55
4041 55 0 -105 55 104 141 99 -20 81 14 96 -3 47 -3 5 227 -22 94 -146 115 147 -39 51 25 69 55 309
4067 309 251 -62 10 -14 -152 -9 -10 -18 201 16 -124 -48 -90 -159 3 -100 19 153 -35 80 8 -171 -162 67
4091 67 -29 -85 133 -82 -57 -31 -411 -112 58 -120 -127 -131 92 -6 -179 -199 121 105 -5 -75 236 -19 106 146 8
4116 8 121 152 222 -20 -148 -17 229 140 76 114 -156 117 136 31 69 -8 -2 234 -169 121 105 48 216 260 -176
4141 -176 -29 19 203 -105 30 218 35 -236 21 -141 -178 76 157 -38 80 -57 -41 -83 59 70 18 -14 -30
4164 -30 -53 -50 -138 187 96 30 -10 -99 -45 -283 -98 13 233 268 -20 -14 27 -26 -38 -11 -201 180 79 168 148 209 -203
4191 -203 -168 -36 22 -53 -148 127 91 317 147 42 25 321 63 48 90 78 121 -83 20 298 91 -80 172
4214 172 -52 -18 -131 -96 136 -13 75 267 -135 20 -18 -126 16 125 -168 -91 210 -52 61 -105 332 132
4236 132 -324 -46 88 -162 76 -386 -118 -45 -274 119 -109 -108 5 -242 -244 -71 -262 -53 39 34 -24 292 -153
4259 -153 -40 70 -154 262 -33 -152 -189 119 -90 181 -102 515 68 142 72 -79 14 -138 -50 -65 94 -288
4281 -288 347 55 56 233 -320 166 49 166 157 134 68 380 7 349 -61 29 168 -34 -203 -66 238 -82
4303 -82 196 174 234 -27 -189 -85 12 -304 -190 -230 -165 -26 -167 -44 -50 41 6 51 -296 354 37 -155 -216 -349
4327 -349 103 -70 15 -219 -184 -73 -36 -62 203 98 129 388 297 185 231 -395 -144 285 -54 -7 118 13 251
4350 251 -115 135 93 24 -71 137 -242 82 55 4 216 83 -233 174 -82 197 -132 -36 209 174 41 -159
4372 -159 -300 43 128 144 -302 139 145 -279 -103 -35 -55 -262 101 -342 -242 -44 206 -38 96 -163 -130 55
4394 55 -121 -97 -59 -16 -10 -198 -19 -58 -215 -162 159 -66 162 105 -160 -102 8 -93 59 116 83 141 -69 -18 278
4419 278 -283 229 -148 -120 341 -130 108 25 -109 188 -102 -73 231 174 22 61 24 -27 63 76 33 -181 189
4442 189 309 -121 -119 122 -224 5 -81 -174 59 6 -61 118 -31 -77 76 -21 -140 -1 -231 18 23 -229 264
4465 264 -230 -204 -188 -327 -202 -119 -100 72 -50 -68 -40 -141 1 169 -84 111 -62 20 161 3 143 70 22
4488 22 -3 -56 -35 129 41 219 -167 -210 -190 -29 -201 -18 243 84 294 250 54 48 -126 -11 -6 243 245 234 -62
4513 -62 242 19 129 -10 221 143 -4 116 -1 -128 -37 494 -261 -237 -220 20 -46 -74 -176 233 50 143 16
4536 16 -36 140 -35 -99 -45 257 -237 91 -304 227 -223 -205 -159 -140 -157 -145 -230 -149 119 -114 -23 -17 -105 -40 175
4561 175 20 -23 106 219 84 -257 91 132 0 -185 -215 534 -17 304 76 82 310 198 153 20 -109 -181
4583 -181 -275 275 63 -309 -116 174 162 117 -80 125 -107 72 3 -19 102 -151 244 158 78 17 408 -217 292
4606 292 -45 93 -100 -350 9 23 -180 -26 -88 -189 -200 212 92 55 -59 86 -89 -70 465 -279 155 123
4628 123 147 48 -58 303 0 -65 -197 -20 -86 -109 -156 122 -176 314 136 -79 207 -24 304 -91 238 142
4650 142 546 123 278 160 64 -63 -613 13 144 191 -65 63 4 -40 -88 141 -281 59 58 -123 233 265 71
4673 71 -420 -115 -207 -668 -23 166 -103 218 22 -392 -609 -38 287 163 -591 -249 -413 304 96 216 430
4694 430 334 -677 -590 -242 -18 -550 1 -503 706 114 -637 -201 728 -528 -432 238 -392 -172 108 -42
4714 -42 481 366 -38 555 363 -98 -216 -567 -55 1034 514 555 -74 -597 275 109 154 48 130 496 262
4735 262 -163 82 3 -231 243 242 -4 -309 -444 292 -148 -458 149 11 -1 -284 21 61 185 -47 -6 -245
4757 -245 -395 403 286 -58 -175 -128 -82 30 -265 77 -50 -201 -148 -257 426 131 39 -119 76 -187 -110 -97
4779 -97 -62 135 -176 -231 32 -130 -187 61 23 235 -317 -383 149 -174 140 182 124 108 -107 -152 111 75 -9 -93
4803 -93 -361 -194 289 15 171 120 73 -114 17 -185 40 -98 189 199 5 66 -37 -59 271 141 -183 -2
4825 -2 -139 5 -68 -64 -15 33 10 259 -370 -129 -127 -492 -172 256 -136 4 -18 -80 -174 -191 -19 122 -57 -236 -248
4850 -248 -5 165 -67 8 -113 -412 -256 85 -56 -158 152 -31 105 -20 -73 -21 5 -170 -183 193 10 84
4872 84 211 378 -62 112 -120 74 -131 396 -70 -185 346 220 169 526 133 128 -222 -32 -88 -23 92 -92
4894 -92 -39 284 -70 56 29 -352 245 117 -77 -211 377 73 64 -333 96 -236 92 43 151 23 596 -171
4916 -171 -34 293 -561 46 126 -30 -352 30 -7 -331 -157 -296 -85 133 167 -64 -109 -21 -235 147 -291 -96
4938 -96 -76 -212 -303 256 112 279 23 103 90 394 11 304 -215 -403 216 -48 109 212 -71 188 -152 -92
4960 -92 55 363 234 469 105 -616 212 -296 -94 -685 -104 -114 -254 -282 -292 67 -148 -383 88 112 291 97
4982 97 -141 -188 -152 -176 558 -8 -219 39 4 103 -183 432 102 -135 -184 -253 50 99 22 -385 -56 -152 37 410
5006 410 44 -200 -156 -72 12 176 175 -69 181 -81 67 321 -54 219 394 -29 104 128 122 -233 -127 -57 68
5029 68 421 -74 274 -243 2 -98 95 38 155 381 522 411 -253 -197 65 106 352 465 -94 309 -163
5050 -163 -91 108 -56 -5 96 -521 -481 281 232 322 106 -291 -17 -31 -404 241 -661 -134 69 37 502 513 669
5073 669 -200 360 -260 -350 714 -4 670 469 475 -269 -626 -63 152 28 416 149 535 -37 554 71 82
5094 82 196 -187 986 583 367 273 502 -484 658 10 460 616 1008 369 272 396 79 -178 374 158
5114 158 -71 275 -140 -360 349 79 50 384 274 -208 -430 -44 -64 -106 -166 -436 282 596 315 124 36 151
5136 151 350 105 -84 -248 -393 290 -599 100 -325 -327 -957 490 168 173 -318 -335 638 280 -290 -130 233
5157 233 274 -156 -176 -55 -29 610 -280 146 -219 -24 463 -120 602 682 593 87 -229 -115 -64 -91 -679 -796
5179 -796 136 -156 -194 -116 -9 -43 744 -462 67 381 523 -220 332 -25 -110 -70 763 237 267 395 -600 107
5201 107 -424 -341 -463 276 -390 -88 -221 344 -129 595 544 143 -298 346 -142 -849 68 96 -132 493 216
5222 216 343 262 -327 -499 140 248 -70 334 602 283 219 -188 -20 -24 -61 -276 155 72 557 -40 121 -135
5244 -135 -112 233 -371 68 186 281 330 87 535 -61 -87 65 112 366 351 -6 248 546 -489 215 26 288
5266 288 -135 234 -144 -780 -274 57 32 -29 47 -149 -545 86 -232 -401 -409 16 265 -89 -103 98 30 123 -65
5289 -65 17 55 219 302 195 111 -205 57 -61 44 -56 -47 180 -54 122 140 -229 -146 -6 -76 106 -31 86
5312 86 115 -74 30 96 -33 -15 99 -168 43 30 65 81 -158 16 159 -31 174 92 218 182 106 107 -153 38
5336 38 -16 113 -11 -23 274 -136 271 -57 -26 231 -231 -125 -74 43 46 43 196 98 -192 58 -223 -71 67
5359 67 62 76 201 -192 -57 111 -135 -226 -29 -260 -130 -117 37 -146 -271 -115 127 -60 -61 -32 -30 73 118 29
5383 29 -14 81 -50 -12 15 126 -49 76 46 28 -116 -62 41 -93 348 52 -18 39 -109 53 -12 -104 33 -73
5407 -73 83 354 -113 85 -45 -143 -234 9 241 -17 81 -13 -58 -47 20 -65 58 145 -88 -41 121 -76 32 151
5431 151 42 102 -264 17 79 -70 -41 -97 101 -200 -117 -8 -23 -16 -44 -79 -260 148 -152 33 -17 -7 -52 31 73
5456 73 25 -24 86 105 28 -47 -253 -242 138 -206 -198 43 0 -34 238 -10 20 19 229 -34 14 -161 250 -17 73
5481 73 46 120 256 -84 185 -63 107 236 78 -44 25 -16 -65 143 227 83 69 -118 95 232 -168 -167 -25
5504 -25 -200 -35 -172 82 56 159 83 -68 55 -17 -249 -20 74 -194 113 -46 -97 -318 -133 256 263 -372 -95
5527 -95 -249 -190 -104 -402 -118 36 -77 -344 -423 25 177 75 125 212 -260 319 34 474 479 59 222 -285 -220
5550 -220 622 -295 103 -82 157 -52 -402 181 425 230 -508 273 -161 451 -1051 126 39 556 24 -459
5570 -459 82 -569 56 195 -454 455 -489 -299 -187 -571 67 -307 22 -186 833 -105 435 -124 -201 19
5590 19 159 153 385 274 -326 103 125 306 117 28 -96 -26 234 -110 276 15 -54 -2 132 153 -241 -88 -182
5613 -182 -5 -61 38 -51 179 -151 -89 40 111 291 32 83 -172 85 -53 76 -126 -95 202 -57 -42 -4 -4 0
5637 0 42 122 105 169 207 170 -18 -140 128 104 -230 -119 -23 23 30 150 63 -81 13 57 10 -45 65 -250 218 -24
5663 -24 -33 -27 -211 84 -115 28 112 120 -81 181 -122 56 -167 -185 -234 -18 -32 79 4 -202 -152 -297 -108 100
5687 100 138 -221 45 34 -139 -81 64 26 -128 127 5 -22 107 -199 -214 -69 -14 13 -89 2 49 75 -86 -137
5711 -137 113 -133 -23 147 98 102 42 -86 -158 -37 -87 35 47 -96 -182 227 -4 -140 -199 -40 -275 -192 51
5734 51 -7 23 -101 238 182 -113 416 160 -350 -121 -284 -134 -376 -521 242 125 -128 -120 18 -52 5 -400 94
5757 94 -877 106 -232 -73 556 333 6 254 -239 -407 618 -705 -413 -361 103 342 -74 319 -94 -167
5777 -167 -760 -298 189 -381 158 480 525 -19 -101 237 -269 448 419 12 32 -428 -50 -7 275 -23 -122 432
5799 432 15 349 106 115 -37 -40 119 54 -87 162 -79 29 3 -61 -237 -31 60 -69 -193 -24 40 -59 -63 -233
5823 -233 52 -42 -297 -132 -8 161 -117 -157 64 -13 100 -208 -208 17 -145 23 53 107 -12 -93 62 -134 -135
5846 -135 -70 75 -152 103 -71 -161 -47 14 -3 194 -28 57 -75 -172 362 -12 30 81 -12 -49 35 -146 336 -112
5870 -112 -53 19 142 48 333 -187 -196 142 -216 -251 -130 53 97 130 210 50 101 26 -272 -177 112 96 -43 -113 -164
5895 -164 -17 -90 -128 -25 -37 28 63 116 118 22 131 155 61 196 304 -276 375 467 -103 7 -183 193 -131 263
5919 263 -121 52 25 -155 -199 8 63 216 111 75 109 -116 190 -279 105 31 -29 20 -147 -207 -85 -270 -132
5942 -132 234 -248 -115 -66 29 112 -93 86 -33 -352 376 -98 -23 210 -110 -44 -97 -72 -41 63 -109 -193 -181
5965 -181 165 -48 -94 -279 149 -31 255 32 -71 223 -4 66 -40 6 -70 31 26 1 177 105 85 -8 328
5988 328 -170 -141 -179 29 -21 95 16 -229 215 -90 -61 -61 205 -144 -17 -128 -78 -48 208 186 -26 -26 -197 76
6012 76 100 108 207 -61 -121 87 -157 -295 109 126 -9 -165 49 90 46 -52 -198 86 98 -11 25 164 75 149 10
6037 10 -167 -184 131 38 -93 53 -50 -337 209 -187 -39 -109 166 -8 -7 218 -69 97 -190 420 -122 33
6059 33 -316 336 297 135 210 138 -207 -142 -48 728 159 -289 183 -112 -82 26 334 -95 -35 178 524 101 139
6082 139 260 123 -141 -251 -218 -141 517 -410 98 -98 457 282 -56 -126 324 20 461 -93 -15 322 552
6103 552 -64 81 -93 -215 316 609 372 -5 122 -84 355 -81 -548 -129 248 5 227 218 -288 -233 -359
6124 -359 -340 -416 14 -232 -121 -31 149 76 59 -215 -284 417 188 364 -53 484 -215 268 -84 577 280 437
6146 437 -229 370 -389 16 -145 -105 267 -203 126 497 257 465 129 -469 253 -142 148 227 129 -188 498
6167 498 437 664 -63 -27 743 -377 -93 -109 -166 819 -371 64 -508 -661 192 -403 333 250 -202 -189 -1292
6188 -1292 738 -498 73 -395 286 100 750 840 34 -334 145 -23 190 280 -586 -16 157 -151 614 121
6208 121 -7 349 -92 37 714 -233 59 391 391 27 680 383 136 -128 657 -384 270 908 642 634 -304
6229 -304 194 -971 -137 342 704 -368 -721 -151 -15 209 132 -43 -176 -150 424 5 -301 -390 -141 323
6249 323 359 172 -199 84 676 -383 -193 534 -11 -191 101 497 -361 313 320 365 138 -315 -239 -39 199
6270 199 -53 -208 88 395 -448 98 -129 699 -15 71 -371 570 -40 159 285 474 170 85 246 -304 -110
6291 -110 91 -203 -145 97 42 196 302 442 334 -143 87 557 -220 -16 299 47 498 -47 -237 217 -361
6312 -361 30 -393 -296 -713 -243 -39 368 221 937 -503 -95 1311 280 415 81 -250 148 54 293 -367
6332 -367 -228 -783 -793 -531 -23 666 703 531 417 297 -312 126 -85 -87 200 -636 -772 -1 -258 614 279
6353 279 -165 -145 -305 147 51 -399 43 -350 -7 -464 6 -122 131 -13 -582 62 -143 -49 -49 -211 -201 207
6375 207 -247 485 71 306 128 -212 129 403 -504 249 192 -16 217 37 208 441 -246 -242 -171 163 236 -183
6397 -183 150 66 236 91 -145 82 193 -519 146 -17 -94 -65 -151 164 -273 185 -145 218 186 445 143 166
6419 166 -299 -188 -241 -181 238 -205 -173 105 214 44 74 18 240 -16 -206 -5 225 -160 218 238 185 62
6441 62 -2 -9 87 -177 7 6 -63 -122 -227 411 -288 -519 -72 -218 -64 633 -79 -170 -47 141 -154 10 322
6464 322 -243 15 275 288 363 -109 120 115 -54 505 -35 58 115 -143 159 -241 -56 377 -203 57 -131 205
6486 205 477 323 313 39 50 95 -69 -155 147 520 -278 403 22 -621 -113 310 237 409 -112 -411 419 -90
6508 -90 -206 -1129 -301 33 -449 -833 159 351 211 -366 691 -40 -210 220 22 271 -95 -221 62 89
6528 89 -16 -556 -333 -298 -266 -435 1000 935 -333 -219 -416 1076 -26 180 543 -313 -416 -316 -305 -203
6548 -203 -719 -174 7 92 -575 -358 -962 -245 223 109 202 -323 -682 102 -591 -7 219 -45 -317 -70 315
6569 315 -37 3 236 -249 -95 -765 571 209 -24 250 -387 107 -317 -622 -35 -684 -217 -843 738 808
6589 808 889 -503 -407 -308 339 264 618 101 -330 -361 -94 -46 104 -477 44 161 181 -80 565 3 -103 -372
6611 -372 -350 15 194 -100 243 106 -49 203 -157 568 -71 16 257 1063 -32 -148 -4 -282 -405 -634
6631 -634 -650 412 142 -407 -290 -12 -763 342 69 -299 313 57 426 -322 386 -167 -122 -101 -476 -563 278
6652 278 -754 451 317 -67 -209 570 -94 -260 -131 840 -96 -290 259 448 262 -239 21 46 -111 -689
6672 -689 -372 -977 -272 -404 -250 334 -186 -229 434 -181 25 42 200 -352 132 43 737 -779 -224 278 65
6693 65 -47 182 1135 -430 -135 -299 160 -506 374 609 -1032 440 -1 -45 165 -386 465 -188 -284 642
6713 642 -70 189 304 -338 -92 -389 46 -406 -165 247 -50 -303 120 300 -360 193 100 -209 -60 163
6733 163 23 100 -91 232 -21 -100 413 -362 -259 395 407 -819 -249 -82 -331 340 581 152 -188 -233 868
6754 868 -338 -285 863 690 -519 -547 -323 -383 227 -326 -73 -385 321 196 99 -411 171 305 -276 368
6774 368 -65 112 495 425 292 64 175 -14 -5 151 161 298 -237 214 469 101 -27 -74 84 261 72 174
6796 174 -721 166 -510 -86 -438 -804 -342 336 138 19 -50 -232 589 358 -80 304 723 -322 478 138
6816 138 -537 496 354 -231 395 283 468 -245 -87 305 -440 -339 -35 132 -34 124 297 77 -600 -194
6836 -194 231 -329 -679 559 350 -200 -784 365 -44 595 253 158 67 278 229 356 636 43 93 -165 -150
6857 -150 -138 313 26 178 -988 -347 -206 -372 215 -234 138 -212 -220 -190 156 439 -72 -4 136 -168 150
6878 150 -803 -556 178 270 -153 -173 -42 8 368 -672 4 -105 -407 -149 -809 404 -655 -369 -224 -373
6898 -373 -330 103 67 -27 -756 49 177 -332 172 155 286 331 -100 -93 34 314 504 -389 -331 -132 -25 118 -36
6921 -36 329 -149 -24 127 -362 -148 -290 287 -146 383 0 -117 209 -318 376 -114 -50 97 -226 94 487
6942 487 340 740 -276 -122 410 -10 -611 -373 28 43 -256 205 454 -445 46 -784 37 49 246 -459
6962 -459 -521 38 432 -300 -52 49 -366 764 -380 -682 388 75 266 -178 295 258 551 388 558 467
6982 467 625 713 -416 -127 -69 69 -52 -333 -1139 42 106 -171 854 686 1032 1359 -113 292 -267 -225
7002 -225 1048 1167 240 271 381 859 299 35 -136 271 627 774 560 -97 -582 378 528 -232 -260 372
7022 372 932 167 -182 305 64 -482 134 223 -106 125 183 550 883 -203 -183 120 481 576 1 237 1164
7043 1164 226 1071 -632 -382 -498 613 161 -549 130 -615 691 560 381 -647 342 642 -205 291
7061 291 159 495 -248 -36 -58 67 505 205 515 -282 51 48 187 -317 848 -225 -44 561 -259 -568
7081 -568 -175 194 -271 225 -304 -403 -664 2 48 91 341 114 441 -61 -158 40 89 -616 -267 -608 780
7102 780 293 -134 356 266 -107 -209 -15 68 -262 257 -12 -2 369 259 81 155 -211 -267 137 5 -150 126
7124 126 -334 60 -69 -60 205 229 116 92 194 -338 -89 94 479 150 -229 -203 -286 -9 37 218 99 -312
7146 -312 262 -23 90 38 -129 236 589 202 -174 -21 -54 -77 -458 172 -137 -63 -18 20 251 75 -8 304
7168 304 27 -25 -125 -21 102 68 -74 338 46 261 -115 -37 33 265 11 213 24 240 -17 -48 70 113
7190 113 80 -223 60 158 153 -31 70 -132 -60 65 -263 191 47 -203 -155 333 152 21 30 57 -69 209 -199
7213 -199 -127 -147 109 100 -79 68 273 -127 273 -100 90 66 118 -354 217 108 -78 90 -16 -311 118 51
7235 51 -322 -446 703 7 -28 -100 -48 -417 696 -445 -225 408 -24 -160 -327 -468 161 -131 -191 -618 1133
7256 1133 -455 -254 -891 -388 -134 632 159 -270 896 -800 -758 -68 -249 407 -30 -44 764 -207 166
7275 166 -791 828 -279 -404 959 -492 -1006 248 708 -75 532 -860 -172 -102 -535 582 -114 41
7293 41 -194 441 -273 71 -201 644 421 -96 374 -38 646 -614 -397 653 82 543 -178 -461 -169 378
7313 378 140 -380 8 -202 -118 574 540 -105 465 -48 -405 -85 473 368 -703 -746 172 372 305 465 258
7334 258 -333 -58 679 -141 539 466 -86 -297 -90 186 197 44 -227 -136 -184 51 -73 -238 157 -147 72
7355 72 -120 -543 369 785 101 412 31 676 -151 228 194 458 -194 -434 477 378 368 -246 -234 -581 189 479
7377 479 -94 -22 -46 183 434 -222 -56 226 1 369 377 -202 143 654 176 153 316 -155 81 293 6 -333
7399 -333 266 -252 514 217 -78 443 -582 -406 -14 -55 926 491 -62 22 63 458 218 -433 227 -421 -296
7420 -296 -238 -461 -36 -311 335 -292 356 -159 148 -122 366 369 235 264 502 742 356 633 -273 -200 -393 -618
7442 -618 768 345 136 -139 404 424 252 493 -386 -567 -601 710 285 211 -24 -897 -705 -66 179 613
7462 613 509 -301 514 51 357 -12 -202 -147 148 -404 -416 743 -135 753 -293 201 123 -72 313 -499
7482 -499 244 220 -150 30 -111 -94 331 343 154 -65 239 -109 28 494 -283 185 -352 175 100 11 311 144
7504 144 196 -10 44 213 19 -66 2 -166 -164 6 51 10 -202 -335 433 -529 305 415 -112 -18 214 532 0
7527 0 -77 -39 -177 251 106 435 -49 116 -222 -112 144 -152 125 -166 160 -30 174 336 31 -153 -65 19
7549 19 72 -79 1 158 -79 206 118 52 -62 -200 -65 -86 -176 21 225 1 95 6 -171 -72 -28 70 -184 14
7573 14 -164 -76 56 -54 -40 -250 -73 -85 -221 14 39 60 -3 -95 -32 -35 40 82 -19 -79 20 -186 -34 -16 7 1
7599 1 -230 -160 -98 -108 -55 -179 -284 -130 374 110 112 10 12 57 -36 12 -87 -41 -20 -18 12 137 -84 -91 172 23 -1
7626 -1 145 88 -116 100 -132 240 39 -91 -60 -45 44 249 277 -265 138 193 184 -101 204 131 -126 167 19 129
7650 129 482 398 -126 -122 -52 223 -281 41 -1060 357 438 408 974 -326 255 79 -227 -365 -129 -564 104
7671 104 139 -592 271 737 380 370 -505 -386 274 72 196 28 590 -201 96 167 340 82 -468 233 -58
7692 -58 -69 184 65 -178 34 131 182 184 -193 -315 250 214 78 -8 -164 153 -86 179 -118 50 99 200 437
7715 437 60 -56 342 24 595 134 -2 235 383 -78 14 94 86 -174 359 -18 -361 -79 357 -139 4
7736 4 125 390 84 302 280 -300 -505 -115 -165 78 357 125 89 616 54 -595 -318 352 125 -78 -258 -238
7758 -238 109 -27 -46 329 -124 303 -116 140 -255 332 -273 -445 -229 517 437 400 411 -140 322 112 232
7779 232 -32 315 -148 -211 -16 -76 -94 199 -167 -323 62 -48 -138 -169 -120 -325 122 174 -77 125 -157 -60 -97
7802 -97 192 -183 -48 -98 -63 -236 151 28 -161 -21 8 36 74 -57 -53 76 185 -108 6 -163 -99 -6 -8 -136
7826 -136 -41 32 -132 -65 11 127 60 -190 182 102 -151 -255 -21 262 -231 131 30 0 -101 134 -200 127
7848 127 -111 90 -66 -112 -81 280 -71 -46 -75 77 16 -182 447 163 144 -17 -54 231 237 -248 145 115 -137
7871 -137 -30 -49 39 -70 -74 25 54 -16 181 88 -21 226 -179 32 124 -19 -99 -63 73 -276 -104 60 -127 41
7895 41 26 -63 -112 -339 139 -27 81 103 56 6 -141 -59 44 -29 -78 -182 -169 -62 225 166 -44 77 -162 232
7919 232 -19 -39 -127 103 -16 -26 -20 168 -163 -133 121 -58 114 -67 127 -70 -127 -113 -123 54 54 -16 141 84
7943 84 -19 43 -91 -251 12 15 -22 -150 -4 -22 -46 -66 29 -158 142 -134 -48 -41 -231 158 -40 24 128 103 123
7968 123 104 0 -6 204 -33 -174 248 -58 -165 -14 85 42 -93 136 48 223 117 55 178 -57 -70 74 65
7991 65 232 79 101 227 -112 223 -184 203 -160 -50 3 71 -107 -11 1 74 218 49 -72 499 82 3 -240
8014 -240 -139 12 -121 -327 -364 -100 -161 55 176 284 165 -212 -187 -206 57 103 -387 82 85 -134 -310 -909
8036 -909 -472 -165 -44 -439 -85 -390 -99 -681 -476 165 234 583 293 134 127 -301 -107 361 -159 367 523
8057 523 1076 227 182 837 -353 24 841 -183 -385 -88 -116 -214 187 348 -418 10 -455 129 -328 -193
8077 -193 51 454 -44 79 13 -200 40 -187 -341 402 132 141 264 -207 144 31 200 -14 17 -202 115
8098 115 -77 -31 -83 -46 301 -398 -318 46 134 66 18 -240 -109 4 -258 71 -6 -29 591 -232 -648 -152 97
8121 97 87 63 377 -225 113 574 -41 -533 -413 -68 -66 -286 310 -690 -127 224 99 465 -132 338 246 -396
8143 -396 342 33 235 435 130 152 16 -54 -142 -36 -214 71 -144 -17 -217 -176 -168 35 -390 219 128 -410
8165 -410 -7 61 235 -535 -213 208 128 6 187 312 -145 304 -20 423 317 166 320 249 -107 -1 17
8186 17 71 -141 -88 223 -531
8191e31
$$ Imaginary data points
##PAGE= N=2
##DATA TABLE= (X++(I..I)), XYDATA
0 0 0 0 0 0 0 0 0 0 0 0 0 0 0 0 0 8 -8 8 -8 8 -16 16 -16 24 -24 32 -33 40 -48 56 -64 72 -80 90 -104 115 -130
37 -130 146 -163 182 -203 227 -251 278 -308 341 -375 413 -457 504 -553 610 -672 742 -819 906
56 906 -1004 1115 -1246 1395 -1576 1793 -2062 2407 -2864 3506 -4483 6153 -9853 40109 -36935
71 -36935 -19606 42350 -36720 23477 15107 -30024 -10619 2743 34873 4901 -56911 10389
83 10389 8743 -6169 26537 -25320 -6261 34155 -14693 28511 -6155 -74147 28593 20891
95 20891 -50728 11549 -1340 -19342 27462 17312 -4214 -31615 -8153 41931 -23446 -23124 21410
108 21410 -33397 7119 36263 -37034 -10059 1211 -8740 35703 -11220 -22669 30561 -352
120 -352 5938 13933 -28916 -10243 1494 8141 9738 -30650 11154 33168 -14732 22208 9811
133 9811 -35986 22119 17283 -15524 5464 -10800 4703 20278 -10416 3055 -4958 -10579 26157
146 26157 3316 -6548 10092 -5555 17340 9873 -24349 2624 -6745 -11698 20683 -10798 -12542
159 -12542 17336 991 9525 2719 -18034 4485 -2042 -4971 6636 -18695 -3711 12180 -9277
172 -9277 2670 -6041 -15007 12177 -221 -4564 6678 -10164 4982 8430 -13516 -2069 -9666
185 -9666 -10917 10922 -5743 -5167 9232 -1957 8413 7145 -8774 779 -3179 -1611 7085 -8997
199 -8997 -658 7832 -3248 7213 1357 -7651 7381 2266 2884 9314 -3836 4786 9656 -4936
213 -4936 586 -1610 -7026 3479 1511 2733 4799 998 10615 4727 -4219 4554 -3856 -5510 5392
228 5392 -3264 -3108 3300 -1270 2801 302 -4499 1397 -1528 -550 3987 -1540 48 987 -3306 -2273
244 -2273 -6861 -6991 -1172 -4869 -774 3791 -1118 2222 3328 -2636 -2360 -3787 -4962 -2761 -3514 -1095
260 -1095 -239 -1404 1327 -62 -2187 483 -358 264 2613 1330 2395 1652 -798 -857 -2349 -3203 -1047
277 -1047 -325 1883 4353 4311 4964 4179 2401 1195 -634 -1228 -376 -241 1051 2117 1929 2336 1823 951
295 951 1081 1138 1672 2416 2518 2209 1683 -4 -1262 -2340 -2560 -2520 -1368 183 1471 2397 2566 1715 500
314 500 -1259 -2758 -3185 -3284 -3258 -2121 -1035 -1288 -866 -852 -1659 -1842 -1172 -500 -854 -422 860 -736 -1780
333 -1780 -1324 -3156 -4459 -1967 -1841 -1372 1398 1664 2373 2137 1173 767 -1319 -1425 -368 -1556 -338
350 -338 990 598 2456 1566 486 2748 -6 1287 3867 222 1667 3854 410 845 410 -1321
366 -1321 11 -707 1642 2256 143 4757 4161 174 3000 -680 -2542 1501 -2265 -1341 871 -2569
382 -2569 2439 1762 -2681 1276 -1350 -1162 2673 -2486 -698 518 -2866 2079 -2113 -6000 12 -3549
398 -3549 -1628 2026 -4590 1034 2734 -1930 2903 -3053 -5749 1898 -3298 -1993 206 -5618 2757
413 2757 3189 -3200 2912 -2530 -2673 5617 -1159 -753 532 -2281 6117 -455 -4356 4034 -4982 197
429 197 9481 -4890 -66 6791 65 5793 450 -4142 3414 -2377 2489 4722 -7331 2392 6460
444 6460 286 4413 -4156 -1248 7337 -4351 4136 3120 -11771 7284 7968 -8813 545 -1283
458 -1283 -2621 4423 -805 1049 -3761 -4011 12000 -2267 -10085 3723 -5787 -646 5564 -9260
472 -9260 -447 571 -3349 10724 -5971 -12065 8139 -907 -3223 2716 -6183 -1526 409 3186
486 3186 3602 -15045 -218 13164 -9163 2283 5516 -11476 6992 8266 -5849 -793 -6517
499 -6517 2947 10008 -7334 648 3095 -3898 9833 2364 -4718 95 -3225 11443 3992 -13721
513 -13721 8092 3675 -7243 13391 -1833 -12707 8232 4630 2624 -440 -5908 7105 1150
526 1150 -534 6437 -11817 -3642 11207 -3492 742 -3630 -6332 12049 -1334 -6176 6076 -10794
540 -10794 920 12469 -8405 -5683 549 -712 5306 -6075 -4632 1653 -8095 9525 5000 -15225
554 -15225 3493 2913 -3212 6514 -8392 -6036 6440 -3560 3656 -1299 -11217 6932 5207 -2329
568 -2329 2460 -7310 1767 6532 -3289 3327 -4643 -5844 12291 -929 -6351 4906 -4973 4632
582 4632 8972 -4879 1157 235 1023 10408 -4785 -4039 4459 -2326 6604 2978 -8063 5089 1815
597 1815 1190 6380 -8279 -1866 6831 -3499 4086 -1170 -7410 6456 898 -1689 1926 -7389 989
612 989 5557 -4075 1391 -2789 -3528 7165 -2749 -4295 1210 -5763 3920 3221 -6681 855 -1643 -926
628 -926 5260 -6002 -3180 1784 -3265 3723 480 -7078 2049 493 -528 2365 -5259 -421 3296
643 3296 -1633 3335 -1626 -4240 5056 382 -1078 1939 -4032 2938 3276 -1614 2316 -428 -979 5657
659 5657 -938 -1511 1892 -1366 3581 1501 -2043 3104 -250 1262 4752 -2651 -214 3461 -867
674 -867 2553 1252 -2158 2298 -601 460 1106 -3307 549 2219 -2134 1638 -1234 -1751 2059 -1333
690 -1333 -1033 -486 -3017 690 429 -2242 886 -1737 -1273 1643 -1943 -1322 -713 -1554 677 -678 -1925
707 -1925 726 -1416 -935 438 -2095 -458 425 -1037 1063 -129 -992 680 -176 61 503 -1052 909
724 909 950 -538 1265 284 59 1330 231 311 960 110 1241 658 279 1223 420 443 1345 325 742
743 742 1113 290 951 690 343 865 -70 200 546 -16 21 335 -63 -212 -120 -182 -196 -392 -211 -396 -763 -58
765 -58 -501 -621 -632 -605 -808 -887 -738 -779 -727 -748 -419 -827 -756 -504 -743 -641 -590 -716 -648 -518 -468 -357 -284 -395
789 -395 -143 -356 -177 86 147 -2 136 26 92 137 351 304 133 408 573 386 651 697 656 730 630 519 667
812 667 451 859 699 407 912 365 422 1133 293 515 911 169 539 496 157 392 -116 124 326 -531 136
833 136 247 -616 231 -314 -565 397 -602 -642 -312 -1001 -234 -576 -1260 -28 -1208 -1038 353 -1358 -890
852 -890 21 -1536 36 -422 -1048 203 -1435 -289 1002 -2093 -566 208 -1115 721 98 -931 430
869 430 -865 959 1206 -2094 1116 1242 -1306 1845 259 -954 1394 265 1266 526 -1586 2550
885 2550 1287 -911 2261 -217 -661 2772 384 283 -231 -653 3317 -128 -1793 2821 -1409 -145
901 -145 3351 -1464 -728 333 185 2371 -2080 -1132 2606 -2703 845 2184 -4116 -272 1477 -697
917 -697 704 -2740 -875 2064 -2905 1211 361 -5199 1743 1726 -2351 -69 -2302 545 1930 -3028
933 -3028 1088 -1060 -3882 4471 250 -3875 1124 -845 1149 1368 -2984 1295 -885 -1093 5483 -2271
949 -2271 -3595 3764 -415 1028 1190 -2880 1837 544 735 4079 -4338 -656 5695 -1526 744 625
965 625 -2562 3847 841 -7 1750 -4150 2590 5212 -3956 660 623 -2420 4127 -251 -2001 470
981 470 -2399 3789 2094 -5959 1478 554 -1749 3914 -3287 -3075 1736 -1213 2614 -1187 -5620 2972
997 2972 456 -1653 2564 -4685 -1507 3476 -1519 679 -2618 -3800 4576 -944 -2337 1631 -4338
1012 -4338 1431 3845 -3525 -51 -1183 -1104 4925 -2354 -2194 1695 -2532 3439 1872 -4669 1469 394
1028 394 362 4026 -4005 -1077 3568 -1020 3501 -313 -4117 3896 825 347 2241 -4220 1308 3871
1044 3871 -1711 2051 -1547 -1977 5168 -553 -1083 1069 -3439 2976 2759 -3533 969 -1187 -669 4248
1060 4248 -2663 -1360 1218 -1982 3390 88 -4788 1266 -600 -504 2407 -3796 -921 1470 -1717
1075 -1717 2195 -2091 -3737 3347 -850 -800 1066 -4016 1209 1868 -1800 789 -2095 -1565 3595 -1207
1091 -1207 -830 1350 -2641 2096 1442 -1981 950 -823 678 3034 -2542 -32 1989 -1164 2798
1106 2798 177 -2082 2066 599 1069 1990 -2181 1190 2067 -508 1921 -1180 -1693 2963 222 162
1122 162 1566 -1991 1363 1385 -1112 1332 -890 -792 2609 -625 -546 409 -1952 1719 40 -1174 913
1139 913 -1294 -234 1796 -2166 -168 250 -1474 1201 -1294 -1948 1146 -443 255 454 -2734 -270
1155 -270 -11 -1286 415 -1411 -1200 1126 -662 -174 -177 -1268 570 26 -780 675 -629 -164 1773
1172 1773 -791 -38 430 -294 1154 252 -493 900 296 604 1475 53 629 765 645 1227 163 132
1190 132 1283 -177 705 425 -413 1037 273 541 492 440 423 773 -74 -132 101 -359 226 -343 -534 1
1210 1 -634 -5 457 -386 -128 52 -195 -534 -455 -817 -326 -563 -747 -301 -431 -147 -98 -131 301 -396 -881 -189
1232 -189 -609 -448 2 7 -54 34 -859 -336 -102 -13 288 15 139 -317 165 387 -194 291 -180 -157 403 484
1254 484 -23 680 469 -55 610 249 217 611 526 706 400 43 189 315 679 507 160 473 206 588 470
1275 470 186 300 362 -419 -252 325 309 -398 -711 208 234 -122 -140 -558 -176 -191 -260 -45 -559 -183 -327 635
1297 635 114 -367 -792 -929 53 -920 -614 201 -487 -522 135 -866 -685 190 151 -664 128 25 -284 -96
1317 -96 -193 477 83 -150 512 -173 -6 -53 -3 657 -126 120 919 -581 489 1606 -495 307 1000 207
1337 207 451 369 303 532 -336 910 993 -638 1122 550 -152 1165 143 -96 433 -447 803 283 -1497
1356 -1497 338 199 -764 294 -245 -82 564 15 510 -1106 -795 1736 -1188 -961 1164 -1757 -827
1373 -827 1119 -1514 -556 53 -395 1273 -1127 -771 804 -502 545 151 -2066 207 -144 213 684
1390 684 -2118 -103 2081 -1818 826 760 -2335 1192 1093 -782 156 -1050 840 1234 -917 1414 -249
1407 -249 -1013 2781 138 -635 1026 -1072 1968 1357 -1825 1456 304 -918 2845 -619 -1177 1529
1423 1529 9 1246 25 -1248 1481 -496 468 1866 -2973 -28 2135 -1359 1330 -531 -2141
1438 -2141 2259 -112 -683 779 -2417 507 1535 -1829 -42 -1280 -815 1877 -1654 -905 414 -2293
1454 -2293 1958 704 -3143 976 -765 -676 2189 -2271 -1141 1141 -1009 1812 -526 -2494 1708
1469 1708 -25 110 1123 -2523 710 1945 -1217 1622 -1020 -1684 2728 -125 3 1052 -1897 2107
1485 2107 2134 -1649 1061 -1062 -47 2862 -1345 -852 957 -1135 2764 804 -2264 1642 -527 336
1501 336 2415 -2207 -381 1516 -499 1603 -1142 -2163 2224 -180 187 1256 -2686 756 1519 -1030
1517 -1030 792 -1697 -1282 1816 -1255 -322 105 -2585 1773 674 -2084 490 -1141 -196 2005 -1989
1533 -1989 -544 268 -1488 1822 -351 -2526 889 -725 501 1294 -2199 514 867 -386 2086 -1265
1549 -1265 -1619 2344 -486 409 1006 -1683 1505 1347 -561 1353 -1103 -32 2284 -947 198 549
1565 549 -1111 1966 604 -1041 751 -1037 585 2043 -1666 368 843 -625 1841 -383 -1271 923
1581 923 -650 599 806 -1797 751 651 -669 1204 -1352 -959 1320 -921 81 -27 -1828 893
1597 893 30 -1070 291 -1358 -438 1142 -1083 -8 -192 -1182 1031 -682 -1246 329 -972 -2 490
1614 490 -1507 -36 64 -507 1053 -428 -642 915 -349 385 413 -889 916 260 -397 792 -508
1631 -508 62 1193 -95 533 599 -131 1064 388 -42 697 -230 321 774 -110 529 391 -222 925 293
1650 293 -141 593 -231 40 593 -356 114 277 -403 538 -478 -102 113 -310 211 66 -427 -152 -24 -393
1670 -393 169 -668 -460 -120 -492 -50 -257 -510 123 -62 -510 -306 -643 -181 -117 -437 -201 -181 -343 146 -178
1691 -178 -61 145 -129 80 -161 -234 231 117 -96 236 113 132 151 -65 339 220 217 291 339 205 427 258
1713 258 163 386 254 269 219 256 323 40 201 277 498 257 288 32 177 470 -2 221 -5 -105 -239 -243 -208
1736 -208 66 -129 100 -3 -192 -317 -212 -242 -4 -229 -155 -265 -256 -190 -368 -337 40 -535 -485 -59 -238 -194 -114
1759 -114 -92 -301 -79 -189 -112 -86 -110 158 -134 23 168 87 -10 -350 473 253 -426 381 480 -24 189 517
1781 517 -3 328 314 547 71 175 520 23 16 582 -158 116 647 47 536 346 10 623 319 -178 449
1802 449 -117 -78 394 11 -274 108 19 271 -429 46 137 -964 159 412 -962 178 60 -294 148 -560
1822 -560 -317 -115 -446 -10 -272 -993 296 -518 -287 -150 -1063 188 4 -576 456 -256 -891 878 -278
1841 -278 -760 690 -366 -122 398 -560 244 -197 17 830 -502 269 535 -175 874 257 -406 747
1859 747 321 139 1110 -539 -74 951 -303 878 207 -560 622 249 1016 262 -816 864 808 -835
1877 -835 965 -253 -243 1166 -639 -228 324 -1067 938 214 -1075 559 -102 -229 871 -1209 -436
1894 -436 20 -614 1142 -535 -1347 974 -456 101 638 -1628 -133 490 -741 414 -952 -931 969
1911 969 -316 -182 158 -1229 830 510 -959 1083 -649 115 1314 -976 -384 801 -1087 1381
1927 1381 -396 -1011 961 -110 374 1242 -1623 757 923 -880 1317 54 -654 1768 -381 435
1943 435 1350 -1712 995 711 -330 1196 -334 -387 1552 -636 661 273 -1176 2042 49 -1029
1959 -1029 927 -897 -376 1284 -624 -59 791 -424 1246 -223 -1202 532 -609 448 588 -2421
1975 -2421 139 33 -735 1411 -1070 -1047 1363 -428 252 301 -1496 384 385 -758 790 -1178 -577 1527
1993 1527 -312 678 146 -1469 1062 714 -792 811 -605 886 1449 -998 522 330 -418 1757
2009 1757 -131 -523 1134 -77 443 673 -1147 831 121 45 1695 -715 -440 1100 -435 902 557
2026 557 -1248 1203 338 -394 306 -837 -547 897 -658 -24 -372 -850 1468 259 -349 28 -993
2043 -993 141 302 -978 -52 -62 -376 682 162 -513 -15 -373 153 284 -1666 165 -341 -189 168 -518
2062 -518 -366 750 -325 -496 340 -473 590 -745 88 244 -714 71 852 -712 1012 -184 -37 806
2080 806 -736 158 236 104 325 452 -974 4 -676 33 1182 714 -494 1360 827 355 73 -82 1020
2099 1020 449 -334 844 -60 -367 422 226 120 -407 -95 -160 354 -58 201 -201 -91 459 -164 -228 -580
2119 -580 -421 44 -151 -334 70 -613 260 -262 -541 -675 -357 -370 -27 -205 -72 -269 -564 309 -243 -125
2139 -125 717 -265 -326 291 -276 -307 311 -177 -371 -150 33 238 443 225 264 427 -779 707 -634 378
2159 378 585 171 572 185 -115 -56 -603 -207 -101 334 -212 -318 674 -131 219 -570 625 -497 -570 366
2179 366 193 -162 -455 -58 -220 -902 -560 692 309 -11 -431 -322 194 -175 -439 -530 -27 -512 -253 -210
2199 -210 -313 -2 14 -317 -611 -458 -103 20 -214 -243 172 395 -369 -390 -475 -226 -40 -400 -87 -488 -340
2220 -340 202 82 448 -117 298 -126 124 485 17 126 535 321 27 -349 423 181 5 182 -308 -28
2240 -28 343 -67 187 2 274 -107 -89 -102 530 213 15 386 345 25 193 139 -153 194 -101 92 -391 -180
2262 -180 314 -307 -116 43 -300 29 -433 -244 64 -499 -533 -139 -240 127 -443 -100 -116 -437 -42 -90 -507
2283 -507 -110 136 -345 237 -128 -153 223 -268 104 5 -1006 217 306 -112 125 207 -139 784 418 -425 746
2304 746 -604 489 1022 -749 663 553 104 243 382 600 240 -360 841 345 -383 136 -107 318
2322 318 613 85 -266 -450 -797 724 -252 -1039 641 -38 -39 180 -910 428 -26 106 572 7 -1037
2341 -1037 907 -349 -132 38 -568 328 -129 -893 -203 -790 -138 710 -661 -395 89 -861 646 -441
2359 -441 -530 153 -724 527 840 -481 411 -152 -326 646 -444 -580 913 -110 233 326 -790 414
2377 414 240 -268 326 -478 -189 762 -199 487 377 -654 820 498 -421 827 -380 -42 861 -615
2395 -615 339 298 -510 1244 -109 -424 718 -171 652 467 -977 205 114 -406 702 -992 -521 781
2413 781 -337 92 57 -1521 318 -248 -534 203 -1159 -384 669 -635 -393 -280 -748 597 -274 -532
2431 -532 192 -695 -19 369 -747 92 -418 -417 870 234 -442 602 -618 409 992 -978 380 219
2449 219 -742 975 -419 -453 374 -464 285 327 -953 486 496 270 622 -848 188 1104 -160 476 -169
2468 -169 -25 1062 -45 59 528 -213 441 672 -948 561 -248 10 1008 -638 -545 457 -1246 692
2486 692 -574 -1694 466 204 494 -72 -447 -1084 -748 -175 55 -617 -221 -13 139 -313 344 -1180 -121
2505 -121 705 -1308 -78 -572 -880 658 -105 -101 195 -404 314 52 -658 469 -303 -36 561 -355 -298 309
2525 309 -165 576 147 -443 460 22 167 537 -216 327 613 -117 466 2 -28 394 -107 25 277 -424
2545 -424 515 484 -221 250 -247 -76 534 -182 -157 293 -111 578 190 -220 137 -200 -69 166 -607 -121 302
2566 302 -127 18 -243 -273 -47 -447 -255 -98 -364 -24 138 -280 -104 -358 -94 299 -347 30 -29 -334 137
2587 137 -87 -362 86 -221 12 182 -232 193 206 -193 119 195 46 387 -17 -52 225 -90 56 314 108
2608 108 379 253 29 290 25 283 189 -144 204 211 156 407 0 8 406 141 221 317 -129 188 -157 -175 163
2631 163 -7 51 39 -161 -278 -232 10 -217 -274 -301 -19 -215 97 -29 -172 -93 -181 -223 -181 -187 -312 48 -127 -139
2655 -139 139 -123 -62 69 -104 -108 31 -38 -132 33 -178 -238 -328 11 -80 34 -71 261 67 137 -31 99 143
2678 143 46 -43 -289 200 207 201 161 -367 298 42 -177 116 497 -65 -36 -190 -232 -201 -78 171 -293 146 -282
2701 -282 -607 299 116 289 197 -378 184 21 388 -91 26 -495 -756 -293 -402 73 60 -191 107 -310 88
2722 88 -920 -428 -190 -383 -19 82 241 -734 -472 547 -451 24 173 204 -462 34 -147 76 -114 87
2742 87 114 19 -191 430 -674 -102 506 43 20 -835 760 301 124 -97 285 0 429 38 180 229 -353
2763 -353 519 348 -376 137 257 -561 324 60 -700 76 174 -16 -509 49 -299 371 -112 299 -59 -32 112
2784 112 25 400 -334 -434 135 -242 -46 -114 -306 84 192 -1204 -112 -65 -440 272 322 -374 -116 -303 257
2805 257 -88 -366 -48 158 -558 540 -253 -141 -275 -328 54 246 -586 579 171 -989 740 -179 -74
2824 -74 668 60 295 477 38 159 59 -135 416 -131 267 788 -53 363 204 -328 401 -147 -447 535
2844 535 21 616 -208 -429 568 560 -201 243 -364 -179 465 -257 295 103 -368 574 -97 52 -51 -592 -181
2865 -181 250 -468 -80 -399 -573 161 -634 341 260 -814 62 -313 -1432 392 -309 -16 -15 -829 112 589
2885 589 -305 653 545 -604 368 -68 -140 700 -588 3 178 -309 504 -282 -6 508 -333 722 341
2904 341 -220 513 792 -298 -84 -287 -321 626 -509 -169 382 -55 986 82 -1100 624 -530 311
2922 311 110 -746 78 14 -474 -60 -442 -585 255 -619 -77 402 -877 -120 438 72 79 -520 -572 518 -781
2943 -781 -321 -2 -292 296 262 -685 -230 -526 -67 522 -279 -887 -128 -605 317 -128 -684 -389 -882 -189
2963 -189 248 -1419 114 8 59 544 -421 169 558 -729 -76 353 249 1307 163 210 489 -631 -216
2982 -216 392 -1013 -387 663 -417 1003 -125 27 578 497 126 296 -803 113 -97 28 657 157
3000 157 -664 101 152 -151 235 -759 35 -132 -520 352 128 -795 119 -314 -176 -745 -798 290 426 -16
3020 -16 -276 -42 -435 148 -927 -514 377 -457 -17 -75 -533 -347 -638 -568 436 -776 196 -210 -790 367
3040 367 -34 -100 18 -190 315 -189 -372 -263 414 76 318 114 -453 620 60 339 12 114 416 -63
3060 -63 -114 252 170 248 386 -207 411 143 -58 340 -171 -163 50 267 154 272 215 -23 548 186 -161 -626
3082 -626 -99 81 -196 131 -309 -171 -201 -181 -74 151 -159 -308 71 -97 112 0 114 -256 -232 115 -155
3103 -155 6 -226 63 -700 -31 -354 -461 232 -214 -12 -196 -27 162 1 -390 -92 -74 7 261 -275 215
3124 215 -82 -168 378 115 16 -81 309 372 180 689 315 375 -276 7 351 150 221 157 394 226 244 -82 159
3147 159 -600 292 211 416 -38 -457 -199 -92 119 30 384 -194 -153 488 -657 -457 156 -344 171 -382 28
3168 28 -511 -88 -525 -225 182 390 -1040 31 -47 -307 -205 226 65 377 -41 176 822 -975 -251 -390
3188 -390 -175 709 -270 -578 308 -395 -372 -63 14 -472 -222 411 555 -194 -426 -540 -529 -453 762 -7 320
3209 320 -149 -78 -148 -219 -113 -143 -157 -118 -71 29 173 164 -21 -219 -429 -55 -190 -429 370 460 153 301 5
3232 5 -276 56 336 -29 95 -196 -22 133 -155 166 -337 -54 -65 -165 -325 -70 -784 221 -104 19 42
3253 42 -624 -45 -426 -486 -103 126 -107 77 78 -345 -202 -412 187 8 -298 114 -258 -316 4 605 -48 -191
3275 -191 -219 219 -35 -195 2 75 104 321 70 -177 303 -323 216 103 108 200 -101 -618 53 15 110 266 -351
3298 -351 43 634 -3 -398 -525 150 -577 -485 142 264 -636 -327 -104 -172 368 -400 392 493 -941 330
3318 330 613 -570 208 -404 292 -18 -257 50 529 139 -288 -4 -529 435 -317 25 -8 -733 301 -28
3338 -28 165 248 -108 -216 229 -272 -153 -365 -328 685 400 957 -160 224 336 781 -1068 -53 383 -289
3358 -289 504 462 -508 90 -316 38 363 -368 -79 -296 -380 -170 -773 -48 250 51 294 408 -220 174 28
3379 28 -33 317 -448 470 -265 -945 93 398 -80 -306 133 -45 471 -32 6 434 -796 -13 356 -800
3399 -800 -188 -368 -114 -96 -301 -381 67 -232 -250 -79 -70 360 -411 -85 495 -458 84 245 11 311 163 -603
3421 -603 -81 -248 138 238 -663 162 2 -230 259 331 -737 -190 66 156 -265 -377 442 136 -476 931
3441 931 -253 413 175 -269 -342 291 224 -110 559 -161 120 510 700 494 -554 497 -125 -321 637 -473
3461 -473 -218 -121 -1072 -452 83 -390 -130 349 -38 591 190 -459 -112 57 220 -495 -708 -181 -1086 -1209
3481 -1209 507 -423 -760 -181 -4 -436 487 -18 139 -432 -181 267 -311 -69 477 -442 162 -47 8 321
3501 321 238 -131 -103 -380 127 140 -1 93 -33 -163 420 31 46 193 174 259 17 -295 198 401 -13 333
3523 333 -331 24 106 -16 -97 86 -73 402 -185 46 289 -271 -231 -8 241 265 329 -29 -88 73 34 -129
3545 -129 -385 -57 37 -277 80 202 -90 161 -70 78 -189 139 7 -43 -199 -26 -253 -159 73 -269 91
3566 91 -17 -200 108 23 -249 23 -300 36 292 109 194 123 -38 269 225 17 110 209 -180 -43 -43 139 303
3589 303 77 425 43 24 263 -18 135 -68 94 105 125 59 105 -90 254 -16 -136 150 -6 -66 -136 15
3611 15 39 -35 -76 -68 -28 -91 61 -21 34 -141 -2 -202 -175 -63 -134 40 -124 -83 39 -13 -77 -176 -171 -140 -48 32 63
3638 63 -179 -121 45 -191 -52 -299 151 211 -56 217 44 -103 -2 -85 163 208 -173 85 138 78 173 131 190
3661 190 127 134 73 101 169 27 146 133 86 191 57 156 197 12 146 -28 -94 -151 -152 -275 16 5 21 137 -86
3686 -86 56 -59 139 -60 -245 -81 -219 -99 -146 134 -117 -159 -42 -57 24 36 330 -156 -124 165 -172 -205 -14
3709 -14 -94 198 -49 65 -27 -3 13 -93 -39 56 -20 94 326 -74 23 85 -8 172 -81 92 185 -75 -148 209
3733 209 49 185 112 122 152 120 -86 196 -27 -21 199 73 207 -170 -78 80 45 -72 83 76 -143 163 -273
3756 -273 358 20 215 137 146 -251 270 -200 -123 235 -334 -685 -1039 124 -148 -297 -79 -200 -750 -556 403
3777 403 -806 -303 -412 -270 -246 -61 48 -381 -783 -301 -728 154 683 -403 -121 -49 277 373 566 -402
3797 -402 -155 142 187 169 -351 173 338 -262 -147 58 -596 159 -13 -54 -4 -284 -62 429 -306 -130 245
3818 245 -104 240 417 -79 282 46 -19 40 -10 -54 -237 -112 -114 88 -332 185 -270 -59 70 -388 485 -42
3840 -42 -101 115 -237 -15 119 -44 126 157 -343 124 -138 -158 20 -236 -190 73 -234 -37 -121 -475 -44 -144
3862 -144 -2 245 -28 -206 173 -245 -56 65 -94 298 -304 -131 -1 -157 -220 150 -178 65 91 66 356
3883 356 -88 153 251 -165 82 164 -65 289 -92 27 295 -59 323 259 -146 242 6 -274 175 28 -65
3904 -65 281 -328 161 -15 -109 46 -54 -130 120 -175 -314 239 -357 -144 -210 -27 -187 -118 -209 108 -43 145
3926 145 -71 -234 -253 -41 -55 148 0 -81 104 -10 213 -62 -355 139 2 -60 188 -166 34 158 -175
3947 -175 224 164 -129 193 52 123 9 -136 -138 -58 163 51 189 -192 150 122 -157 262 8 65 98 -33 53
3970 53 -37 -83 145 -3 -26 209 -36 78 90 -111 138 105 -100 -92 -120 -141 294 64 -13 100 -93 -16 -35 120
3994 120 -36 -30 145 -102 30 50 -183 -25 -128 87 -240 63 -270 -112 97 -23 59 -4 -96 -8 299 -7
4016 -7 167 232 139 -37 26 138 149 -83 -63 338 28 262 -33 69 237 -6 147 95 4 84 -83 -113 -35 213
4040 213 127 203 -137 65 209 162 237 -170 -109 84 -71 203 26 -199 -31 24 -22 -165 110 -68 -47 7 -134
4063 -134 131 173 139 205 18 -27 -438 -261 -99 169 -271 -80 -89 -55 19 -180 84 -173 -56 246 134 -39 -172
4086 -172 61 -121 204 -3 253 169 -146 -259 -231 28 -55 107 310 101 -24 22 75 -150 90 -180 151 275
4108 275 67 186 210 311 131 71 216 233 69 172 56 -31 69 175 151 -116 261 -150 112 -230 79 -254
4130 -254 257 -104 79 29 38 -79 -83 -200 -78 80 -141 51 9 -208 -3 -238 -180 151 -317 9 -44 132 -232
4153 -232 -96 87 -283 -77 188 58 149 106 61 -295 28 -116 -109 -147 -53 229 46 71 109 -137 -198 68 53 -142
4177 -142 211 145 138 195 -127 85 -15 45 98 -262 128 78 277 221 96 -78 225 184 8 94 58 147 130 76 75
4202 75 125 -17 114 84 -80 -83 -62 -252 -67 -282 280 -4 -155 11 20 72 -77 -272 55 162 -228 71 65 -139
4226 -139 148 74 37 -17 75 158 177 -272 178 149 -29 -1 -76 121 -204 -123 26 0 -13 -8 -108 262 -12 -170 81
4251 81 112 82 82 34 -1 65 230 92 212 50 383 91 11 145 -14 98 148 -14 32 60 -34 439 37 -74
4275 -74 225 92 -64 -247 -265 -29 -135 -85 293 52 -21 423 -168 131 268 -98 -47 -58 -168 175 -55 76
4297 76 -99 -377 -219 29 -198 64 22 -290 199 -339 208 66 -178 -3 20 -117 75 -296 -251 -127 -127 64
4319 64 52 -130 148 -54 -227 43 13 -86 176 -205 60 -204 62 -102 -130 80 129 35 -204 -136 223 170 312
4342 312 -164 -64 -235 44 384 -195 186 233 -150 241 -307 52 103 -165 242 -164 -266 -66 187 8 -242
4363 -242 -127 -67 181 -454 80 236 -393 -101 102 -90 0 -106 -273 196 -199 333 48 -135 20 -331 -1
4384 -1 23 -78 96 -70 -454 166 52 -343 36 -94 -31 123 -38 -147 65 127 204 98 -204 132 128 46 83
4407 83 -60 29 270 -82 201 96 -23 134 -201 -6 93 -95 62 188 -30 324 82 186 -75 -14 -300
4428 -300 -79 75 38 -194 214 234 -76 249 -27 -112 37 44 -105 0 3 -31 54 -5 19 -265 -284 71 -190 -66
4452 -66 148 104 -80 62 -200 -16 -150 -279 -97 51 -71 78 36 80 -103 -255 7 -40 -277 121 199 -17
4474 -17 55 208 99 -33 111 -44 84 193 221 126 26 -9 132 57 83 75 24 322 -40 280 81 -17 76 -94
4498 -94 139 29 204 354 -105 247 63 47 -89 95 -227 120 93 -99 82 270 150 -236 -7 114 -310
4519 -310 -38 -20 21 -219 -75 -193 121 -246 -158 -104 -196 -152 -116 140 -248 156 -169 124 -50 162 -47 86
4541 86 -135 135 -110 86 251 -184 -22 468 119 -153 51 285 131 185 175 -44 -1 -196 -46 321 -213
4562 -213 22 -59 251 459 -199 118 15 -178 176 49 -92 -125 161 43 -158 208 55 -203 -174 38 -271
4583 -271 -61 -102 -171 -24 -36 20 250 81 -7 79 136 -224 -191 10 99 -397 -4 -216 82 246 -58 -176 -106
4606 -106 -144 189 -106 -168 -166 209 -112 -121 -136 27 138 39 115 169 513 80 58 190 -151 -284 -17 68 506 -354
4630 -354 145 -199 -116 362 50 186 -9 208 -78 9 -4 307 -133 76 344 174 -300 527 288 -40 310
4651 310 -227 -66 36 -153 -357 -352 18 80 -49 -164 -256 561 143 -74 290 -70 -296 394 -72 -682 -271
4672 -271 126 -443 171 282 -431 78 163 300 778 88 -481 -311 290 -365 239 -55 233 365 -14 222
4692 222 -81 262 -78 372 188 -379 -513 -377 -455 -426 -60 -279 -22 -170 530 -517 -225 -420 73 2 96
4713 96 639 -131 773 -581 844 325 -331 42 38 288 545 19 197 -494 -150 85 -242 81 459 228
4733 228 160 -663 -221 399 -282 308 352 -244 -425 17 -231 194 -131 -266 148 -126 -201 293 -195 335 -402
4754 -402 -166 -125 -291 401 -277 -276 -235 -67 381 -123 -55 -16 141 -47 -96 449 60 82 45 -84 -87 -38 -338 -40
4778 -40 -23 -98 -82 -129 328 -98 143 -13 -69 -30 10 169 258 -3 -246 210 -47 -50 307 -210 170 12 -133 -77
4802 -77 -87 -217 98 -101 -52 -139 252 247 -301 -185 -26 -186 -116 329 -232 -68 204 -20 220 125 -53 105 111
4825 111 87 -71 -132 -101 -20 -58 175 -99 -291 -213 91 -166 31 -66 51 48 -76 57 -129 39 -195 -124 -86 216
4849 216 -217 -120 174 -201 174 13 622 194 -95 75 -182 -1 82 -119 -193 -20 174 -74 -99 136 -280
4870 -280 302 -108 359 98 -85 446 -14 -155 -236 -306 58 -343 93 323 -384 13 -117 35 -189 37 -464
4891 -464 -74 219 274 93 -50 84 -10 -88 -92 -26 -131 59 -504 -269 189 -352 -284 -225 98 -104 -200 -186 -60
4914 -60 -38 8 217 -316 -183 -248 237 -232 243 104 158 -406 9 -272 -89 402 579 514 139 37 -375 -368 206
4937 206 134 236 209 341 -93 224 -159 180 -139 176 326 125 180 505 -310 224 93 -131 -436 214 285
4958 285 40 89 -22 -133 -533 212 -49 -71 -40 225 131 326 343 -43 67 -249 101 126 -375 178 -78 12
4980 12 379 186 -128 -385 -206 309 47 -228 -49 0 73 173 334 278 -198 264 -38 107 -73 40 -225
5001 -225 -113 -34 25 336 267 231 279 -77 -63 85 -198 14 94 206 -67 107 -269 64 189 15 -23 30 -70
5024 -70 -68 -7 -280 -152 -250 -123 -264 148 -390 196 74 -75 -49 157 449 -206 301 634 130 -442 -357 -389 -321
5047 -321 -33 14 -527 -220 -520 -182 -198 -182 142 -21 -359 -86 171 -449 -359 -163 294 187 148 -18 -326 -568
5069 -568 -66 -296 239 -88 -141 241 -289 196 -54 475 -264 -374 15 -26 -238 169 441 -241 -41 -416 141
5090 141 -362 -523 83 303 36 551 -154 393 520 -31 -43 -873 321 268 314 374 -619 351 -594 -711 71
5111 71 -393 -70 -490 -439 -261 503 -334 -714 -453 -147 296 288 -263 -120 76 -165 -518 420 -142 -419 -226
5132 -226 45 -722 -115 -242 -71 156 -944 809 -166 -373 989 375 473 -386 674 -525 -244 -543 285
5151 285 -157 228 -83 138 -445 -683 -133 -18 21 -214 118 -270 -218 142 619 131 -256 130 -188 -429 518
5172 518 -103 300 -583 540 -959 -480 820 -217 79 -132 -69 -297 -486 14 -214 -818 141 180 58
5191 58 385 -628 -552 -453 -533 9 420 321 -480 -49 -364 785 -398 -108 -957 352 -95 127 -514 -342
5211 -342 -491 18 -823 327 904 140 8 4 121 62 -163 -331 387 -75 -498 169 -120 -528 686 254
5231 254 -556 -70 -145 18 60 -37 183 450 -63 -43 -158 49 438 -233 -505 136 241 -41 120 20 407
5252 407 246 -164 408 466 294 405 18 -81 107 -325 335 170 -67 113 -509 -581 55 365 320 -209 -172 -94
5274 -94 -280 -210 252 -41 184 587 85 5 -277 -175 511 -52 -167 -83 -110 -241 156 -10 64 -50 -128 -110 -33
5297 -33 -21 62 -25 -52 196 27 146 -19 66 -3 303 333 -25 -52 196 66 -148 299 262 -66 42 -25 21 13 -82
5322 -82 110 4 -72 64 -157 26 239 -168 -15 -167 78 131 33 31 321 -17 107 300 -76 -301 -64 -93
5344 -93 23 -183 111 -110 -82 -81 22 -61 -123 -29 -146 51 -173 -258 87 42 86 -84 95 328 -69 -112 -12 -4
5368 -4 -181 -6 -96 106 13 173 148 -219 7 245 164 216 55 -85 188 77 8 136 -24 -27 244 -55 79
5391 79 174 -107 74 90 -4 -159 -69 -56 121 -97 -47 139 -240 51 17 -90 -82 -58 -94 -47 61 59 -152 -96 -65 54
5417 54 -104 -21 -88 20 -73 -24 34 147 -58 125 -256 -173 61 -67 -55 130 -294 -97 19 -221 -109 1 -71
5440 -71 -212 51 -231 56 20 -208 -93 -184 -45 139 159 -25 118 24 -84 80 108 80 137 23 -21 45 -88
5463 -88 -43 -82 -5 -103 165 -70 185 -87 71 47 -101 168 57 61 156 150 110 -31 -162 -10 236 66 174 31
5487 31 -132 56 -42 -242 -181 141 231 17 -7 -162 121 -55 -137 122 -167 -82 160 -41 -84 -178 -95 -11 -56 44
5511 44 170 -23 -64 106 -158 25 -162 -82 55 -92 33 20 -373 100 -41 367 -58 -44 255 390 301 -40
5533 -40 -123 -94 -10 -579 36 205 55 470 87 192 265 116 156 526 179 531 -352 300 -237 299 -467 -173
5555 -173 494 269 277 -32 -467 367 211 174 936 106 -945 297 235 419 486 -408 -127 1 384 541 -280
5576 -280 438 208 -643 578 176 146 376 183 -299 257 155 98 61 302 -110 88 -497 -302 -12 -7 139
5597 139 395 232 14 157 -146 -76 -75 127 19 103 -188 45 -216 -91 -119 -142 91 227 254 -14 221 -73
5619 -73 -15 98 80 66 -156 287 159 161 -132 -36 -76 84 21 33 -232 19 163 -222 -133 201 60 124 -255 -212
5643 -212 315 5 -181 38 -189 116 126 -158 -315 -71 172 -96 46 222 258 -153 -85 95 19 -215 -12
5664 -12 -45 130 187 103 -12 -14 115 41 10 72 -134 0 -7 233 -111 -320 83 42 82 -74 -7 262 -105 65 95
5689 95 -100 188 44 356 -169 -170 -248 343 27 35 47 111 55 116 67 27 -132 170 28 -11 146 54 36 -153 182
5714 182 -21 -17 -136 59 213 82 -134 -236 -172 143 33 32 -46 -60 26 -90 -203 170 282 -44 125 -106 222
5737 222 -57 257 306 -272 304 -518 288 125 73 -591 -7 313 37 345 -131 561 -134 150 232 -121 -104
5758 -104 268 -47 -305 490 -109 434 391 -38 -564 163 -414 45 -325 -89 16 -110 -336 -279 -73 260 -132
5779 -132 -73 -305 123 -350 -164 -649 31 -346 -119 -487 -125 -612 -144 -187 -183 155 209 406 384 -198 -153 -109 -29
5802 -29 12 201 -211 -34 92 19 20 83 -275 -45 -125 19 194 -191 177 10 -219 -71 -168 -222 -115 -60 178
5825 178 115 -25 -83 -33 163 56 -34 -4 -118 -158 -128 -103 -34 -103 34 -176 -22 -27 167 -47 39 -125 -285 -245 288
5850 288 -92 18 156 195 -173 307 -58 229 -72 55 265 -17 13 9 -17 220 -76 -46 163 -129 139 -220
5872 -220 24 33 29 -44 77 -65 215 -113 29 -16 6 -16 -25 -220 -58 -6 57 -28 -40 3 39 -126 104 -118 -125 145
5898 145 66 252 -163 -109 259 -75 27 152 122 -23 -261 -152 71 26 -297 131 -464 -216 142 58 66 -209
5920 -209 217 -221 95 253 154 250 106 -164 70 111 -276 -238 -322 320 152 160 -11 155 248 174 -63 -115 -14
5943 -14 99 -1 -228 38 -169 -39 -207 -80 -271 -375 -206 100 -252 359 -115 -25 -282 176 118 121 139 8
5965 8 -69 -150 251 94 -57 -162 11 -6 296 84 94 -64 -45 -84 209 375 204 252 -31 -4 171 -136 45
5988 45 -11 -35 -73 98 -62 56 58 63 95 -185 148 4 -115 -7 33 27 148 28 216 161 -190 -133 -45 -103 233
6013 233 -270 -98 48 -38 110 24 -111 320 -163 -3 -46 -15 -85 123 270 -78 -66 29 -48 113 37 -64 -28
6036 -28 -338 -199 -12 103 -28 -37 -152 251 -95 167 238 -118 74 275 16 -14 229 71 -120 -96 -368 19
6058 19 191 160 -15 -72 -26 261 147 -137 -537 14 323 52 66 89 -22 -88 149 -106 136 -73 72 -12 -297
6081 -297 -404 -207 528 8 1 202 71 -107 352 162 -258 105 -493 288 -277 -86 -231 449 172 379 519
6102 519 105 548 811 -3 -174 -272 -73 -13 266 -672 136 -638 -126 2 387 -159 136 8 -50 277 -471
6123 -471 -500 213 -365 -463 181 406 -266 -230 -28 -332 -118 -19 129 -558 -62 -322 332 -140 -50 286 176 476
6145 476 100 -88 -91 -213 388 -319 -29 -160 283 -135 23 -87 -269 389 105 -757 173 615 -432 58
6165 58 -672 82 -520 -381 -170 144 159 446 -227 -576 -353 -261 79 40 774 194 200 -13 322 412 526 -481
6187 -481 416 -693 565 808 -107 463 58 -829 -718 -373 -319 59 324 520 -118 -22 -734 -183 745 296
6207 296 -623 -313 979 -551 -421 82 237 492 15 647 -67 -9 -451 478 443 -462 -328 353 132 92
6227 92 294 179 -169 -140 -375 -418 -84 -128 359 -594 56 -477 -551 -232 488 -136 133 -185 393 -409 -1 285
6249 285 -22 854 162 -128 96 14 -246 -7 -730 -217 -574 -408 506 132 220 371 321 -391 -137 -472 460
6270 460 531 466 207 -386 -563 -605 -603 -76 -585 299 -359 456 -17 22 238 517 455 372 -368 -582 -327 -299 119
6293 119 -185 556 319 875 157 -312 -363 -386 277 -53 286 192 -332 -681 612 537 476 217 -726 73 278
6314 278 -74 81 -94 -72 210 404 -317 -580 76 -100 -448 491 614 -837 -887 -390 120 350 515 -158
6334 -158 215 871 203 -97 131 303 356 411 224 368 60 -161 384 -333 538 -280 19 151 47 0 -106
6355 -106 237 710 163 315 75 257 -55 -48 50 118 684 -552 139 -105 -295 241 145 448 203 392 148
6376 148 -208 -582 -389 250 320 105 76 -62 -193 463 -87 163 -170 -149 210 -6 -46 318 304 184 82 -28
6398 -28 -232 102 -97 110 29 23 -87 285 -168 -31 144 -335 -250 94 394 -202 -144 -237 -519 131 -92 200
6420 200 -133 138 223 228 23 -146 -48 -46 -15 18 -16 114 5 -317 37 -12 304 -233 68 -408 -493 -433 -342 282
6444 282 22 -76 -71 -110 -98 406 264 208 519 -273 59 341 37 -144 -267 339 -93 30 -418 -50 257 232
6466 232 12 176 -68 661 308 -352 -414 -401 -135 0 6 150 -319 105 191 -362 -158 342 21 -340 298 90
6488 90 -95 -540 -781 98 529 22 194 188 567 1022 18 238 58 381 481 -213 378 329 -239 313 325
6509 325 189 57 365 441 -14 -470 -822 5 346 -196 -293 -691 277 -550 -746 425 790 289 -168 -165 736
6530 736 108 -130 217 -156 -90 -854 136 9 19 259 -185 -123 363 -641 -195 391 684 354 392 103 53
6551 53 -218 -450 196 269 431 -565 -86 40 126 215 197 -485 -77 -34 -139 -515 543 -323 -170 273 -69 -131
6573 -131 -326 -143 -296 57 -144 -69 -318 60 656 -222 -13 22 -23 333 545 -487 -34 -378 -312 211 -282
6594 -282 -194 -84 431 -204 395 536 319 143 157 -223 -237 -123 485 303 -238 137 686 -120 169 353 378
6615 378 385 -306 -486 901 237 566 114 -266 -588 154 -496 351 269 -375 -1039 358 507 164 -419 34
6635 34 446 1069 98 -71 465 -200 -703 216 109 -172 290 -641 -47 46 264 -6 335 -51 402 186 163
6656 163 -352 -413 563 -135 542 132 -252 340 -491 -77 -637 687 -225 461 260 -949 59 78 73 -217
6676 -217 -237 -164 333 46 -296 -335 242 -408 66 39 -211 -58 -881 -131 359 -74 -41 -47 -377 185 272 46 593
6699 593 94 -408 748 -255 269 -1 457 374 -97 -155 383 136 522 270 533 64 -406 343 -122 -350
6719 -350 520 144 -71 385 262 -574 -64 115 74 115 363 -51 703 -179 920 195 181 39 -163 343 297
6740 297 -660 -269 -40 857 177 -490 -333 -449 -356 -396 21 -641 76 570 140 419 -187 -360 -846 299
6760 299 817 -696 616 -52 -143 -50 -264 39 -357 -57 511 309 160 654 -198 -86 -145 121 958 -463
6780 -463 -60 737 559 146 100 401 156 -319 -350 -96 222 6 -244 -282 -106 269 275 -206 376 211 477 -34
6802 -34 -388 7 383 273 -294 -429 588 615 90 -154 -159 -129 -388 262 -51 -122 -95 63 -492 -56 122 -182
6824 -182 -33 -206 -114 432 515 -676 -324 -365 -237 311 -633 -220 -22 96 163 -102 -13 56 -359 77 -50 421
6846 421 368 -607 380 -196 140 135 -535 544 108 128 -315 -560 -174 -300 -34 -120 -13 -59 -60 69 43 221 151
6869 151 -266 22 92 213 75 -183 -6 132 100 98 -98 10 -6 323 325 696 -20 156 129 110 -92 -487 -236
6892 -236 -5 436 883 315 -230 -294 254 138 268 257 447 19 136 155 -289 2 -132 -220 -377 -455 -57 134
6914 134 -459 29 266 -2 156 53 -177 2 -137 101 473 416 -181 -386 -666 -136 268 -198 -486 -216
6934 -216 -162 -288 -139 -65 116 -352 -26 -48 168 412 -314 261 200 -36 503 -202 -29 234 97 -105 754
6955 754 -219 -89 -328 -539 -423 -475 27 -608 -309 -3 -107 -116 164 373 34 90 -728 159 410 666 -217
6976 -217 462 596 169 -570 858 -612 -434 854 -683 -133 -407 487 441 -313 256 -1217 196 -849
6994 -849 -260 -682 205 239 542 365 -788 -1025 -610 -325 431 727 -167 377 -678 -406 439 190 483 197
7014 197 -629 207 -260 -244 231 107 -885 420 308 -230 -187 -83 69 251 291 36 -327 -98 652 700 195
7035 195 696 308 -354 -390 340 237 -198 -961 72 -499 -205 947 19 -357 20 439 -341 -831 175
7054 175 590 379 449 331 -1003 -252 -336 -439 289 86 -313 -79 261 20 -374 -385 -146 167 -208 333 -491
7075 -491 -273 76 -316 -362 -300 -491 207 -629 -108 -476 197 54 187 -186 362 248 93 248 73 511 7
7096 7 -340 -321 -78 -26 32 -362 -360 233 343 -367 -83 239 53 222 -238 145 -38 24 -4 255 213 249 423 209
7120 209 121 247 -5 -177 -181 -59 -471 209 -302 -361 -165 -154 74 294 178 62 54 -317 -67 300 113 353
7142 353 -573 132 352 -214 186 220 -24 -93 -206 -80 81 -514 -5 207 -90 130 586 -109 -147 -188 77
7163 77 86 -6 -149 -51 261 179 157 -131 197 -51 -171 -370 48 -110 -18 87 181 -91 -29 229 169 -26 77 76
7187 76 72 -13 -64 22 -105 -637 57 -88 -90 15 -233 212 211 40 53 116 -14 162 -63 -34 -289 166 -160 -73 -34
7212 -34 -9 -327 -55 -111 142 69 330 43 -209 350 114 -146 -3 -216 81 61 -269 309 87 108 484 -250
7234 -250 -269 -656 -733 331 -195 -16 85 -885 388 -323 -947 70 -531 470 559 718 828 374 515 -319
7254 -319 140 259 -131 341 -182 -138 -545 -807 -152 159 947 -513 227 -1224 -211 211 972 -338 -894
7273 -894 -581 -159 -111 -189 89 -285 -305 -836 18 -172 480 149 174 -14 -325 106 -65 169 -212 -463 -277
7294 -277 -402 197 777 -47 -1031 -229 -286 471 -1024 -768 211 273 -542 -215 249 -94 -201 201 -341 -47
7314 -47 133 -124 589 382 -54 -427 -320 216 -183 57 -308 225 98 -583 -126 -15 308 68 -525 -171
7334 -171 239 755 -146 299 -378 40 357 -671 21 168 -17 -798 -19 -120 -634 -571 -750 106 -198 -394
7354 -394 573 19 458 44 -437 -318 -225 -27 -30 65 -556 238 -332 86 -19 -280 32 642 -281 -869 -405
7375 -405 287 323 -722 -244 -101 219 185 395 -185 11 580 127 -524 -134 -117 -529 1262 488 -113 -78 -372
7396 -372 227 477 237 -424 25 81 -120 -175 -61 -949 598 336 62 -322 -235 506 -6 -853 -412 410 387
7417 387 -596 114 -706 84 -363 98 -425 120 750 -113 -170 -307 -1037 -563 474 -67 544 -373 -179 14
7437 14 -258 -437 87 -291 186 337 -253 -498 127 525 305 214 -178 -535 -365 -108 -375 145 391 609 -589
7458 -589 296 754 -670 -400 -591 642 184 538 -17 85 -83 -241 -282 650 79 65 112 143 512 -107 -175
7479 -175 -142 -35 -79 600 -361 94 112 -54 388 -468 -86 27 346 -32 428 429 -398 341 -150 -119 -110 656 393
7502 393 -25 82 -228 -336 -42 -191 -203 163 -194 -126 -229 197 81 -218 -6 -57 -144 281 358 -153 62 -124
7524 -124 -216 121 -369 46 -192 -577 -255 207 93 319 202 -302 132 -163 133 -62 180 86 -7 20 180
7545 180 -51 -100 -83 -162 19 77 4 61 -38 14 167 -56 -1 -136 -148 -83 98 -119 47 -83 -21 -225 270 -164
7569 -164 19 107 55 56 -114 82 114 -55 -115 78 55 -226 -59 -194 -423 -140 16 58 187 -2 50 -175 133
7592 133 140 -10 84 49 -6 41 -44 -145 -97 27 -84 -53 -41 40 -6 86 275 224 -156 -156 3 80 -8 159 178 -240
7618 -240 -18 5 -80 264 139 -18 137 -4 -208 -103 -140 16 24 -229 -12 50 -72 101 -42 161 124 15
7640 15 -75 54 -64 26 -177 -307 30 -281 58 -320 49 -80 259 -152 -91 359 144 135 -299 -61 -8 123
7662 123 -272 -194 -493 -134 351 -43 272 -580 9 539 -735 252 458 162 -34 1143 694 -240 -479 -313
7682 -313 387 421 82 -289 -20 128 349 284 379 264 -160 -59 38 -432 70 130 -121 105 -70 -91 53 -270
7704 -270 267 -166 -44 -67 23 -110 -326 49 -251 162 -161 584 -224 -593 -96 -168 -146 4 186 -126 -349
7725 -349 553 175 44 130 -218 60 155 435 -160 146 118 -241 113 -86 696 -287 647 446 320 -215 -578
7746 -578 -26 19 -259 706 150 -241 117 -534 278 -283 -217 246 -187 -422 98 -121 -218 -56 -233 199 -341
7767 -341 -363 162 -417 -91 47 205 -24 149 -233 79 -178 452 1 226 260 -334 -83 -361 -46 37 -96
7788 -96 294 122 -161 -155 50 -207 -177 -124 89 33 -42 81 -262 163 -36 123 122 111 -207 -173 72 -87 113 -46
7812 -46 -129 -99 66 177 -88 42 49 -99 -50 -25 -58 -16 -2 -52 133 -152 63 86 -75 82 -84 -84 -48 -151 -80
7837 -80 -238 -228 -67 6 16 183 -42 -185 -59 200 82 223 24 111 -129 66 -24 117 -284 118 139 -201
7859 -201 193 23 -42 129 75 0 -72 -187 -172 67 147 -60 80 85 158 30 -142 -131 -112 -180 150 -58 121 -65
7883 -65 -167 114 146 175 103 -93 87 -143 252 211 83 18 169 34 38 240 -303 -140 50 41 81 56 317 57
7907 57 98 97 -50 22 -135 88 49 117 28 -132 -229 -101 -62 -71 22 19 -12 157 -194 61 115 85 86 -64 -62 12 -23 -173
7935 -173 -22 -48 39 -145 -30 2 30 -7 -159 126 157 14 30 4 39 310 9 224 -24 190 -126 -124 23 -123
7959 -123 -6 58 176 -32 -91 92 -43 27 -26 232 -123 48 7 -172 99 -66 -49 -149 101 -58 62 127
7981 127 -260 -141 -82 -141 185 -166 17 -103 -26 39 153 299 -220 18 66 -217 -142 -102 -168 -88 89 -127 -46
8004 -46 -24 -158 -114 -397 -65 -94 145 63 -39 -223 227 396 207 111 224 75 249 58 28 -48 -11 -33 -282
8027 -282 561 448 136 53 167 -340 295 111 -307 156 188 105 -77 -713 53 -397 357 -389 -196 202 162
8048 162 -214 433 448 -430 -79 -186 46 -279 -90 625 -4 196 152 -19 364 -39 -412 -278 284 -371 -362
8069 -362 -374 347 -515 68 477 -101 -239 -6 236 -100 23 306 270 -166 -71 138 -341 73 -86 152 33
8090 33 501 -355 77 -30 -85 -87 -33 -14 -102 -15 -67 220 286 182 71 -115 2 352 -172 -327 41 -38 204 235
8114 235 -175 -192 96 318 -162 270 -116 -627 141 383 -140 390 66 11 -407 -141 56 198 15 -85 -216
8135 -216 425 155 134 439 89 388 501 316 381 -169 71 -66 370 -114 375 239 -43 87 22 144 14
8156 14 -59 274 82 -84 99 290 89 55 -340 -118 -483 11 -107 -197 -12 146 -246 -136 -153 6 -187 -84
8178 -84 -74 -310 -347 77 -63 157 -290 -150 0 35 -507 -66 -76
8191g6
##END NTUPLES=NMR FID
##END=
