##TITLE=1H_SR_13
 CDCl3, 8 sc, 
 2.3.2020
##JCAMPDX= 6.0         $$ Bruker NMR JCAMP-DX V2.0
##DATA TYPE= NMR FID
##DATA CLASS= NTUPLES
##ORIGIN= UXNMR, Bruker Analytische Messtechnik GmbH
##OWNER= root
$$ XWIN-NMR		Version 3.5
$$ Mon Mar  2 14:02:06 2020 Russian Standard Time (UT+4h)  she@DPX200
##.OBSERVE FREQUENCY= 200.1315
##.OBSERVE NUCLEUS= ^1H
##.DELAY= (6, 6)
##.ACQUISITION MODE= SIMULTANEOUS
##.ACQUISITION SCHEME= undefined
##.AVERAGES= 8
##.DIGITISER RES= 18
##SPECTROMETER/DATA SYSTEM= spect
##.PULSE SEQUENCE= zg30
##.SOLVENT NAME= CDCl3
##.SHIFT REFERENCE= (INTERNAL, CDCl3, 0, 15.7039)
##AUDIT TRAIL= $$ (NUMBER, WHEN, WHO, WHERE, WHAT)
$$ ##TITLE= Audit trail, XWIN-NMR		Version 3.5
$$ ##JCAMPDX= 5.01
$$ ##ORIGIN= Bruker BioSpin GmbH
$$ ##OWNER= she
$$ F:/spectra/data/she/nmr/H-F/1/audita.txt
$$ ##AUDIT TRAIL=  $$ (NUMBER, WHEN, WHO, WHERE, WHAT)
(   1,<2020-03-02 14:01:02.10 +0400>,<she>,<DPX200>,
      <created by zg, POWCHK disabled, PULCHK disabled
       configuration hash MD5:
       00 E9 B6 7A A2 85 ED C7 34 08 36 98 17 FE 4E 26
       data hash MD5: 16K
       A2 B3 D0 10 59 31 AC 44 1C 75 2A 91 48 EA 47 6E>)
$$ ##END=
$$ 
$$ hash MD5
$$ B2 47 BD 68 8D 27 29 CB C2 F0 C3 94 BD 4F 89 CC
##$RELAX= 
##$RELAX= 
##$RELAX= 
##$RELAX= 
##$RELAX= 
##$RELAX= 
$$ Bruker specific parameters
$$ --------------------------
##$DU= <F:/spectra>
##$EXPNO= 1
##$NAME= <H-F>
##$PROCNO= 1
##$TYPE= <nmr>
##$USER= <she>
##$AMP= (0..31)
100 100 100 100 100 100 100 100 100 100 100 100 100 100 100 100 100 100 
100 100 100 100 100 100 100 100 100 100 100 100 100 100 
##$AQSEQ= 0
##$AQ_mod= 1
##$AUNM= <au_zg>
##$AUTOPOS= <>
##$BF1= 200.13
##$BF2= 200.13
##$BF3= 200.13
##$BF4= 200.13
##$BF5= 200.13
##$BF6= 200.13
##$BF7= 200.13
##$BF8= 200.13
##$BYTORDA= 1
##$CFDGTYP= 0
##$CFRGTYP= 5
##$CHEMSTR= <none>
##$CNST= (0..31)
1 1 145 1 1 1 1 1 1 1 1 1 1 1 1 1 1 1 1 1 1 1 1 1 1 1 1 1 1 1 1 1 
##$CPDPRG= <>
##$CPDPRG1= <>
##$CPDPRG2= <>
##$CPDPRG3= <>
##$CPDPRG4= <mlev>
##$CPDPRG5= <mlev>
##$CPDPRG6= <mlev>
##$CPDPRG7= <mlev>
##$CPDPRG8= <mlev>
##$CPDPRGB= <>
##$CPDPRGT= <>
##$D= (0..31)
0 1.2 0 0 0 0 0 0 0 0.06 0 0.03 0 0 0 0 0.0002 0 0 0 0 0 0 0 0 0 0 0 0 
0 0 0 
##$DATE= 1583143261
##$DBL= (0..7)
120 120 120 120 120 120 120 120 
##$DBP= (0..7)
150 150 150 150 150 150 150 150 
##$DBP07= 0
##$DBPNAM0= <>
##$DBPNAM1= <>
##$DBPNAM2= <>
##$DBPNAM3= <>
##$DBPNAM4= <>
##$DBPNAM5= <>
##$DBPNAM6= <>
##$DBPNAM7= <>
##$DBPOAL= (0..7)
0.5 0.5 0.5 0.5 0.5 0.5 0.5 0.5 
##$DBPOFFS= (0..7)
0 0 0 0 0 0 0 0 
##$DE= 6
##$DECBNUC= <off>
##$DECIM= 24
##$DECNUC= <off>
##$DECSTAT= 4
##$DIGMOD= 1
##$DIGTYP= 9
##$DL= (0..7)
0 120 120 120 120 120 120 120 
##$DP= (0..7)
150 150 150 150 150 150 150 150 
##$DP07= 0
##$DPNAME0= <>
##$DPNAME1= <>
##$DPNAME2= <>
##$DPNAME3= <>
##$DPNAME4= <>
##$DPNAME5= <>
##$DPNAME6= <>
##$DPNAME7= <>
##$DPOAL= (0..7)
0.5 0.5 0.5 0.5 0.5 0.5 0.5 0.5 
##$DPOFFS= (0..7)
0 0 0 0 0 0 0 0 
##$DQDMODE= 0
##$DR= 18
##$DS= 0
##$DSLIST= <SSSSSSSSSSSSSSS>
##$DSPFIRM= 0
$$ [...]
##$SUBNAM2= <"">
##$SUBNAM3= <"">
##$SUBNAM4= <"">
##$SUBNAM5= <"">
##$SUBNAM6= <"">
##$SUBNAM7= <"">
##$SUBNAM8= <"">
##$SUBNAM9= <"">
##$SW= 24.9337058887773
##$SWIBOX= (0..15)
0 0 2 0 0 0 0 0 0 0 0 0 0 0 0 0 
##$SW_h= 4990.01996007984
##$TD= 16384
##$TD0= 1
##$TE= 0
##$TE2= 300
##$TE3= 300
##$TEG= 300
##$TL= (0..7)
0 120 120 120 120 120 120 120 
##$TP= (0..7)
150 150 150 150 150 150 150 150 
##$TP07= 0
##$TPNAME0= <>
##$TPNAME1= <>
##$TPNAME2= <>
##$TPNAME3= <>
##$TPNAME4= <>
##$TPNAME5= <>
##$TPNAME6= <>
##$TPNAME7= <>
##$TPOAL= (0..7)
0.5 0.5 0.5 0.5 0.5 0.5 0.5 0.5 
##$TPOFFS= (0..7)
0 0 0 0 0 0 0 0 
##$TUNHIN= 0
##$TUNHOUT= 0
##$TUNXOUT= 0
##$USERA1= <user>
##$USERA2= <user>
##$USERA3= <user>
##$USERA4= <user>
##$USERA5= <user>
##$V9= 5
##$VALIST= <valist>
##$VCLIST= <CCCCCCCCCCCCCCC>
##$VD= 0
##$VDLIST= <DDDDDDDDDDDDDDD>
##$VPLIST= <PPPPPPPPPPPPPPP>
##$VTLIST= <TTTTTTTTTTTTTTT>
##$WBST= 1024
##$WBSW= 4
##$XGAIN= (0..3)
0 0 0 0 
##$XL= 0
##$YL= 0
##$YMAX_a= 275296
##$YMIN_a= -116729
##$ZGOPTNS= <>
##$ZL1= 120
##$ZL2= 120
##$ZL3= 120
##$ZL4= 120
##$ABSF1= 10
##$ABSF2= 0
##$ABSG= 5
##$ABSL= 3
##$ALPHA= 0
##$AQORDER= 0
##$ASSFAC= 0
##$ASSFACI= 0
##$ASSFACX= 0
##$ASSWID= 0
##$AUNMP= <proc_1d>
##$AZFE= 0.1
##$AZFW= 0.1
##$BCFW= 1
##$BC_mod= 2
##$BYTORDP= 1
##$COROFFS= 0
##$CY= 11.3945322036743
##$DATMOD= 1
##$DC= 2
##$DFILT= <>
##$DTYPP= 0
##$F1P= 16.9975609425685
##$F2P= -3.02152046262296
##$FCOR= 0.5
##$FTSIZE= 0
##$FT_mod= 4
##$GAMMA= 1
##$GB= 0.15
##$INTBC= 1
##$INTSCL= 1
##$ISEN= 128
##$LB= 0.24
##$LEV0= 0
##$LPBIN= 0
##$MAXI= 10000
##$MC2= 0
##$MEAN= 0
##$ME_mod= 0
##$MI= 1.114404
##$NCOEF= 0
##$NC_proc= 0
##$NLEV= 6
##$NOISF1= 3.799351
##$NOISF2= 2.8
##$NSP= 1
##$NTH_PI= 0
##$NZP= 0
##$OFFSET= 15.70392
##$PC= 1
##$PHC0= -9783.963
##$PHC1= 11.60082
##$PH_mod= 1
##$PKNL= yes
##$PPARMOD= 0
##$PSCAL= 0
##$PSIGN= 0
##$REVERSE= no
##$SF= 200.130013532006
##$SI= 16384
##$SIGF1= 3
##$SIGF2= 2
##$SINO= 400
##$SIOLD= 16384
##$SREGLST= <1H.CDCl3>
##$SSB= 0
##$STSI= 0
##$STSR= 0
##$SW_p= 3612.71676300578
##$SYMM= 0
##$S_DEV= 0
##$TDeff= 0
##$TDoff= 0
##$TI= <>
##$TILT= no
##$TM1= 0
##$TM2= 0
##$TOPLEV= 0
##$USERP1= <user>
##$USERP2= <user>
##$USERP3= <user>
##$USERP4= <user>
##$USERP5= <user>
##$WDW= 1
##$XDIM= 8192
##$YMAX_p= 0
##$YMIN_p= 0
$$ End of Bruker specific parameters
$$ ---------------------------------
##NTUPLES= NMR FID
##VAR_NAME=  TIME,          FID/REAL,        FID/IMAG
##SYMBOL=    X,             R,               I
##VAR_TYPE=  INDEPENDENT,   DEPENDENT,       DEPENDENT
##VAR_FORM=  AFFN,          ASDF,            ASDF
##VAR_DIM=   8192,          8192,            8192
##UNITS=     SECONDS,       ARBITRARY UNITS, ARBITRARY UNITS
##FACTOR=    0.0002004,     1,               1
##FIRST=     0,             0,               0
##LAST=      1.6414764,     0,               0
##MIN=       0,             -116729,         0
##MAX=       1.6414764,     275296,          0
$$ Real data points
##PAGE= N=1
##DATA TABLE= (X++(R..R)), XYDATA
$$ [...]
$$ plain form
1992 -746 -933 -944 -724 -767 -456 -859 -594 -725 -1199 -1234 -1086 -878 -732 -790 -480 -483 -428 -482 -1102 -637 -1024 -705 -440
2015 -440 -494 -192 -337 -385 -168 -83 -498 -546 -685 -599 -498 -53 87 -19 -190 -126 -15 -416 10 -30 127 135 191
2038 191 476 221 309 203 203 -72 -152 -83 -6 480 537 705 760 396 253 270 544 344 285 648 615 788 923 727
2062 727 575 242 168 139 373 343 648 785 525 861 645 630 445 631 511 217 585 860 720 787 1067 623
2084 623 352 514 116 403 561 953 798 745 578 677 527 304 185 18 340 410 599 599 652 751 396 322 272
2107 272 82 -21 229 318 324 515 700 291 403 -23 -63 83 27 183 221 460 471 233 333 -284 -265 47 -262
2130 -262 -146 84 -96 53 121 145 -135 -159 -101 -364 -313 -119 -54 46 54 -97 -195 26 -273 -520 -281 -345 -275 -275
2154 -275 113 -45 -414 -137 -371 -530 -373 -634 -554 -263 -313 -165 -177 -310 -643 -637 -342 -330 -528 -232 -526 -166
$$ packed form
1992g46j87j1K20m3L11m03K65j31m74l5J48K08J46n8L10lN5n4o20M65l87L19K65
2015d40n4L02j45m8K17Q5m15m8j39Q6J01M45J40j06j71O4J11m01M26m0J57QN6
2038A91K85k55Q8j06%k75q0O9P7M86N7J68N5l64j43J7K74k00n9L63l3J73J35j96
2062G27j52l33p4k9K34l0L05J37k60L36k16j5j85J86j20k94L68K75j40O7K80m44
2084F23k71J62l98K87J58L92j55n3j67R9j50k23j19j67L22P0J89%N3R9l55p4n0
2107B72j90j03K50Q9OJ91J85m09J12m26m0J46n6J56L8K39J1k38J00o17J9L12l09
2130b62J16K30j80J49O8K4k80k4N8k63N1J94O5J00Qj51r8K21k99k47K39o4P0%
2154b75L88j58l69K77k34j59J57k61Q0K91n0J48j2j33l33OK95J2j98K96k94L60
$$ plain form
2176 -166 -164 -329 -446 -761 -409 -589 -572 -561 -538 -140 -391 116 -99 -351 -401 -547 -460 -533 -693 -538 -270 -590 -447
2199 -447 -33 -14 -355 -242 -468 -493 -510 -210 -182 72 -394 -52 -565 -680 -97 -310 -532 -264 -336 -225 103 -44
2221 -44 -119 -319 -412 -244 -271 -396 -90 -29 158 -349 -42 -284 -79 -51 -218 -106 74 221 164 212 163 146 289
2244 289 -240 259 154 102 429 293 180 329 407 82 63 39 193 343 409 534 361 446 485 623 233 320 263
2267 263 313 451 614 278 523 519 760 630 164 271 511 300 470 576 545 459 408 600 301 232 410 275
2289 275 275 340 730 407 359 276 107 489 98 235 40 60 367 426 276 333 489 141 126 223 20 183 211 65
2313 65 353 293 277 328 -19 227 -2 -115 121 -31 193 148 150 283 18 17 -355 -78 -113 -148 -413 -136 106 26
2337 26 -128 -378 -129 -178 -560 -160 -222 0 -443 4 83 -232 -249 -232 -340 -627 -185 -116 -85 -11 -231 -548 -399
$$ packed form
2176a66Kj65j17l15L52j80J7J1K3L98k51N07k15k52n0j46Q7p3j60J55K68l20J43
2199d47M14J9l41J13k26k5j7L00K8K54m66L42n13j15N83k13k22K68p2J11L28j47
2221d4p5k00r3J68k7j25L06O1J87n07L07k42K05K8j67J12J80J47n7M8m9j7J43
2244B89n29M99j05n2L27j36j13J49P8l25j9k4J54J50O6J25j73Q5L9J38l90Q7n7
2267B63N0J38J63l36K45mK41j30m66J07K40k11J70J06l1q6n1J92k99o9J78j35
2289B75%O5L90l23m8q3j69L82l91J37j95K0L07N9j50N7J56l48j5R7k03J63K8j46
2313F5K88o0j6N1l47K46k29j13K36j52K24m5KJ33k65jl72K77l5l5k65K77K42q0
2337B6j54k50K49m9l82M00o2K22m43M47P9l15j7J7j08k87M42O9L1P4k20l17J49
$$ plain form
2360 -399 -322 -561 -288 95 -313 -501 -494 -458 -69 -216 -228 -400 -322 -466 -371 -633 -359 -326 -226 63 270 -96 -664
2383 -664 -211 -202 -200 -404 -139 -149 -251 -40 -270 -110 -360 -18 -150 -193 -110 -219 108 18 -98 -179 -202 -42 -391
2406 -391 -144 -45 180 295 -94 -63 18 36 -54 -119 -23 536 -36 31 287 313 -47 103 -234 -140 103 189 -12 274
2430 274 301 230 178 212 128 41 -28 177 116 270 272 543 408 378 65 447 13 -79 234 321 132 -157 259 433
2454 433 -21 -163 194 207 70 -134 323 120 -96 145 255 380 -116 69 122 185 177 196 125 223 66 104 164
2477 164 309 -241 101 -281 7 114 93 -86 182 321 -106 -219 -179 266 -5 283 -216 194 138 -59 63
2498 63 130 -8 -51 50 63 -87 128 285 238 -30 70 -108 -209 -28 9 -140 -100 -80 -73 174 -31 13 -106 -217
2522 -217 -207 -45 -10 194 203 75 -10 -53 -218 -300 -251 -124 93 -243 228 106 -82 206 -270 -274 -337 -249 -318 189
$$ packed form
2360c99P7k39K73L83m08j88PL6L89j47j2j72P8j44R5k62K74L3J00K89K07l66n68
2383f64M53RKk04K65j0j02K11k30J60k50L42j32m3Q3j09L27r0j16q1k3J60l49
2406c91K47R9K25J15l89L1Q1J8r0o5R6N59n72O7K56K6l60J50l37R4K43Q6k01K86
2430B74K7p1n2L4q4q7o9K05o1J54KK71j35l0l13L82m34r2L13Q7j89k89M16J74
2454D33m54j42L57J3j37k04M57k03k16K41J10J25m96J85N3O3qJ9p1R8j57L8O0
2477A64J45n50L42l82K88J07k1j79K68J39m27j13M0M45k71K88m99M10n6j97J22
2498F3O7j38m3J01J3j50K15J57m7k68J00j78j01J81L7j49M0K0PK47k05M4j19j11
2522b17J0J62L5K04Rj28q5m3j65q2M9J27K17l36M71j22j88K88m76mo3Q8o9N07
$$ plain form
2546 189 60 -60 214 -193 12 -216 41 -200 -18 -122 -106 -91 -39 -255 106 -77 -85 -103 356 -42 -88 -159 -478
2569 -478 -46 -236 171 151 -126 -225 181 -121 -223 85 -38 -135 5 -215 -99 -273 -399 -21 -216 -285 113
2590 113 -255 71 -151 -346 -223 230 -84 -366 60 -67 143 161 210 -70 -90 -48 -200 -443 -175 -215 107 -143
2612 -143 12 272 -111 -21 -180 44 233 -155 148 -244 -124 -3 -64 -31 -220 -193 -30 84 -92 -11 30 125
2634 125 178 -192 -261 -30 57 12 130 16 63 -15 318 -362 -25 -38 -87 22 -243 370 -23 322 57 369 -144
2657 -144 149 129 -34 -197 119 7 87 36 417 -124 347 2 -1 -80 185 -165 -255 108 134 -94 77 373 35
2680 35 252 -5 -45 248 -119 55 71 225 -145 87 100 7 324 296 -61 -144 53 533 53 344 338 429 -52
2703 -52 -25 110 -1 106 286 135 103 176 42 224 -191 398 69 169 2 131 43 -117 -29 -37 -276 211 278
$$ packed form
2546A89j29j20K74m07K05k28K57k41J82j04J6J5N2k16L61j83qj8M59l98m6p1l19
2569d78M32j90M07k0k77r9M06l02j02L08j23r7J40k20J16j74j26L78j95o9L98
2590A13l68L26k22j95J23M53l14k82M26j27K10J8M9k80k0M2j52k43K68m0L22k50
2612a43J55K60l83R0j59K24J89l88L03l92J20J21o1L3j89K7J63J14j76Q1M1R5
2634A25N3l70o9K31Q7m5J18j14M7p8L33o80L37j3m9J09k65O13l93L45k65L12n13
2657a44K93k0j63j63L16j12Q0n1L81n41M71l45lp9K65l50r0L63K6k28J71K96l38
2680C5K17k57m0K93l67J74J6J54l70K32J3r3L17k8l57q3J97M80m80K91oR1m81
2703e2K7J35j11J07J80j51l2P3j34J82m15N89l29J00j67J29q8j60Q8qk39M87O7
$$ plain form
2726 278 23 -2 170 103 67 -109 -155 -300 -353 -288 165 7 -80 -160 -285 -70 38 -202 -7 2 10 128 77 -94
2750 -94 -106 86 155 123 -150 80 -198 39 -240 -303 20 -204 -14 -35 -87 -296 106 -361 -50 -60 -13 -148 -170
2773 -170 83 199 81 0 -125 -180 -2 39 -26 196 -47 -255 -249 -120 189 -177 -106 -237 28 109 2 -294 -145
2796 -145 168 -173 31 194 -86 -122 -157 85 -20 -228 -152 95 -348 -119 -50 -273 103 56 90 84 -13 -97 107
2819 107 -87 -126 -10 -82 -101 -326 -108 -283 2 -119 -51 -237 -100 -70 -361 -237 -127 -329 -59 68 46 -218
2841 -218 70 -125 -173 -161 -40 259 186 -265 91 -25 -105 208 141 -106 135 180 -50 96 165 44 186 -19
2863 -19 105 -62 -242 80 -99 -2 -268 -126 -17 -344 83 216 374 78 307 -48 49 -54 -153 -3 -134
2884 -134 187 75 26 -190 215 -129 -74 -133 -154 -123 40 203 363 47 123 349 29 -32 -65 117 -92 301 112
$$ packed form
2726B78k55k5J72o7l6j76m6j45n3O5M53j58q7q0j25K15J08k40J95RQJ18n1j71
2750i4j2J92O9l2k73K30k78K37k79o3L23k24J90k1n2k09M02m67L11j0M7j35k2
2773a70K53J16j18q1j25n5J78M1o5K22k43k08OJ29L09l66P1j31K65Q1j07k96J49
2796a45L13l41K04J63k80l6l5K42j05k08P6K47m43K29O9k23L76m7L4or7q4K04
2819A07j94l9J16p2j9k25K18j75K85j21O8j86J37L0k91J24J10k02K70J27k2k64
2841b18K88j95m8J2J21K99p3m51L56j16q0L13o7k47K41M5k30J46O9j21J42k05
2863a9J24j67j80L22j79R7k66J42J09l27M27J33J58k96K29l55R7j03r9J50j31
2884a34L21j12m9k16M05l44N5n9k1L1J63J63J60l16P6K26l20o1l3J82k09L93j89
$$ plain form
2907 112 66 254 -84 85 91 -102 18 76 34 -59 180 177 192 7 105 205 -96 38 54 241 110 -46 137 -208
2931 -208 166 -127 313 34 185 -39 268 69 8 101 -170 266 20 267 399 -102 145 -28 24 -48 28 130
2953 130 142 -25 125 66 -100 116 -276 67 107 83 -233 30 -197 -86 -43 -26 -145 0 29 73 -61 56 287
2976 287 -383 -138 16 -102 -121 -107 31 -14 -233 112 365 160 13 94 -15 -168 -380 45 -120 -294 0
2997 0 -83 88 -315 -168 -271 -226 -58 -303 34 18 -49 -47 -187 -55 -96 -304 -313 -435 60 -127 -115 -39 -238 169
3021 169 -306 -348 -475 -145 43 -173 158 -52 -163 -31 -171 -242 19 -119 111 -72 163 -119 -308 -86 76
3042 76 -56 -192 39 120 64 -32 25 194 19 -174 -94 -161 -61 12 88 -270 58 45 -169 44 160 -60 -110 361
3066 361 -188 173 -110 44 329 256 122 106 23 278 228 89 -2 -224 213 151 44 115 84 112 -134 87 190
$$ packed form
2907A12m6J88l38J69Oj93J20N8m2r3K39lJ5j85R8J00l01J34J6J87j31j56J83l45
2931b08L74k93M40k79J51k24L07j99o1R3k71M36k46K47J32n01K47j73N2p2P6J02
2953A30J2j67J50n9j66K16l92L43M0k4l16K63k27J11M3J7j19J45K9M4j34J17K31
2976B87o70K45J54j18j9J4J38m5k19L45K53k05j47Q1j09j53k12M25j65j74K94
2997@q3J71m03J47j03M5J68k45L37j6o7Kj40J32m1k08rj22M95j87J2P6j99M07
3021A69m75m2j27L30J88k16L31k10j11J32j40p1K61j38K30j83K35k82j89K22J62
3042G6j32j36K31Q1n6r6N7J69j75j93Q0o7J00P3P6l58L28j3k14K13J16k20n0M71
3066C61n49L61k83J54K85p3j34j6q3K55n0j39r1k22M37o2j07P1l1K8k46K21J03
$$ plain form
3089 190 80 117 188 342 91 137 135 419 235 -81 126 146 67 204 -159 123 -19 388 193 -120 88 -203
3111 -203 419 -202 490 -35 269 252 57 142 249 186 -9 50 -54 394 -320 -65 46 58 -21 168 -172 228
3133 228 -99 -15 -26 210 -126 -56 65 -111 -181 -164 36 -67 199 -34 -297 -42 -244 -177 -151 306 -111 -104 22
3156 22 51 222 -231 67 113 84 -256 -191 187 -276 -147 62 -223 62 57 59 -277 -375 -193 70 -81 -99 179 -60
3180 -60 -144 -93 147 -221 -145 -62 -198 36 -195 -450 169 -109 31 154 -63 -539 -193 149 -20 26 -92 163
3202 163 154 -80 -206 13 -179 -89 -145 -280 59 89 116 12 -107 -305 40 -101 93 -180 -127 -54 12 -68 -111 -373
3226 -373 -189 -168 162 -278 72 191 -18 -41 -298 -87 -103 38 65 -7 82 59 -110 -156 -166 59 -206 -223 52
3249 52 -52 89 -225 53 -481 18 -11 -224 -19 107 64 -141 -155 -56 86 -139 299 102 -91 10 265 290
$$ packed form
3089A90j10L7P1J54k51M6kK84j84l16K07K0p9J37l63K82j42M07j95l13K08k91
3111b03O22o21O92n25L04j7j95Q5J07o3j95N9j04M48p14K55J11J2p9J89l40M00
3133B28l27Q4j1K36l36P0J21j76p0J7K00j03K66k33k63K55k02O7K6M57m17PJ26
3156B2K9J71m53K98M6k9l40O5L78m63J29K09k85K85nKl36r8J82K63j51j8K78k39
3180f0q4N1K40l68P6Q3j36K34k31k55O19k78J40J23k17m76L46L42j69M6j18K55
3202A63rk34j26K19j92R0n6j35L39L0K7j04j19j98L45j41J94k73N3P3O6q0m3k62
3226c73J84K1L30m40L50J19k09k3k57K11j6J41K7p2Q9k3j69m6j0K25k65j7K75
3249E2j04J41l14K78n34M99k9k13K05J26m3k05j4R9J42k25M38j97j93J01K55K5
$$ plain form
3271 290 192 90 26 1 58 362 42 172 -53 209 89 -25 136 -246 113 -262 57 380 9 151 15
3292 15 86 190 313 178 116 -78 131 13 -2 82 197 174 94 306 284 63 87 -123 99 200 419 -46 197
3315 197 45 90 184 -192 -60 -75 93 34 60 221 -45 153 69 -25 44 -53 222 -52 -90 274 228 -26 111 46
3339 46 188 -117 52 194 -43 -26 -152 -14 -128 341 119 182 -142 -132 26 6 17 34 129 145 19 -182 69
3362 69 -68 -174 -248 33 -389 -138 -131 -136 -72 -277 -35 337 -63 -95 -213 11 -60 -125 -236 92 403 -147 57
3385 57 24 -71 22 -182 -67 -56 45 -418 -241 -139 -68 -201 -33 -44 -167 165 -21 23 -160 33 -174 39 -131
3408 -131 16 -26 -16 -200 -2 -200 86 -125 -46 -31 -56 136 113 138 -185 123 189 37 -60 -266 -127 -55 -53 -92
3432 -92 129 -109 -132 -212 22 -214 72 271 339 424 119 196 -31 155 -16 -8 -114 4 81 58 117 110 112 251 102
$$ packed form
3271B90r8j02o4k5N7L04l20J30k25K62j20j14J61l82L59l75L19L23l71J42j36
3292A5P1J04J23j35o2j94K09j18j5Q4J15k3q0K12k2k21K4k10K22J01K19m65K43
3315A97j52M5R4l76J32j5J68n9K6J61k66J98q4r4O9r7K75k74l8L64m6k54J37o5
3339D6J42l05J69J42k37J7j26J38j14M69k22O3l24J0J58k0J1J7R5J6j26k01K51
3362F9j37j06p4K81m22K51PnO4k05K42L72m00l2j18K24p1o5j11L28L11n50K04
3385E7l3r5R3k04J15J1J01m63J77J02P1j33J68j1j23L32j86M4j83J93k07K13j70
3408a31J47m2J0j84J98j98K86k11P9J5k5J92k3K5l23L08O6j52r7k06J39P2Kl9
3432i2K21k38k3q0K34k36K86J99O8Q5l05P7k27J86j71Qj06J18P7k3N9pKJ39j49
$$ plain form
3457 102 -197 136 86 -266 87 -93 -302 129 -168 186 171 62 -96 86 11 -101 47 267 13 79 159 -45
3479 -45 76 90 244 18 113 -77 234 75 52 -70 104 -45 -100 222 -155 -77 -27 110 19 2 4 209 209 159 62
3504 62 167 -42 85 115 67 67 0 58 134 -25 358 107 52 29 110 137 160 93 -97 -13 -62 -172 207 15 -65 -14
3530 -14 -200 -75 -35 59 -50 -90 86 -221 -43 -56 -7 -145 175 13 -44 143 86 5 7 -124 -76 241 6 -59
3554 -59 -31 -109 125 -244 -88 -315 70 -77 -46 -113 315 21 -98 -5 -243 -97 -46 -59 -162 54 106 211 228
3577 228 14 -6 -18 -231 -289 55 -66 102 347 -205 15 44 -202 202 -122 70 46 -10 -40 174 -44 -166
3599 -166 264 -50 -201 174 -57 209 -34 126 -7 -165 73 -68 -172 86 -11 -6 61 -55 41 -47 -77 42
3621 42 -207 -43 71 212 -56 -73 99 38 458 -52 264 -37 -7 -14 -48 -76 -85 148 448 -70 132 50 5 143
$$ packed form
3457A02k99L33n0l52L53j80k09M31k97L54j5j09j58J82p5j12J48K20k54O6Q0k04
3479d5J21J4J54k26R5j90L11j59k3j22J74j49n5L22l77P8N0J37r1j7KK05%n0r7
3504F2J05k09J27L0m8%o7N8P6j59L83k51n5k3Q1K7K3o7j90Q4m9j10L79j92q0N1
3530a4j86J25M0R4j09m0J76l07J78j3M9j38L20j62n7J87n7q1Kj31M8L17k35o5
3554e9K8p8K34l69J56k27L85j47L1o7M28k94j19R3k38J46N1j3j03K16N2J05J7
3577B28k14k0j2k13n8L44j21J68K45n52K20K9k46M04l24J92k4n6l0K14k18j22
3599a66M30l14j51L75k31K66k43J60j33j58K38j41j04K58r7NO7j16R6q8l0J19
3621D2k49J64J14J41k68j7J72o1M20n10L16l01L0pl4k8rK33L00n18K02q2m5J38
$$ plain form
3645 143 216 181 203 40 -334 126 -253 24 -23 -211 38 -95 74 -133 -28 87 176 80 38 -33 48 206 5
3668 5 62 93 77 -7 -126 -99 105 50 138 164 -11 113 122 -45 50 -88 150 11 -153 265 84 -12 258 -281 286
3693 286 117 -211 105 -288 -103 78 243 -19 44 -25 266 -275 113 61 51 292 46 -42 1 -313 -132 410
3715 410 -57 125 189 270 33 -173 108 313 119 95 15 203 147 -195 -130 -135 -61 -224 224 121 -2 -15 -300
3738 -300 -16 0 199 -11 100 -4 -99 1 213 -230 51 142 -118 10 -11 -38 -81 -126 -39 66 -151 -128 139
3761 139 -30 -117 -128 -46 -81 18 202 -10 -241 -134 -60 67 9 -111 0 105 60 -103 -53 155 -59 -186 72
3784 72 43 -330 286 -334 -179 151 -78 -204 -108 -213 -69 -131 17 34 -88 199 -248 -234 -233 183 223 -184 13
3807 13 1 73 87 -171 182 186 435 103 -96 -224 76 -67 46 225 -468 258 4 -101 -61 438 52 152
$$ packed form
3645A43P3l5K2j63l74M60l79K77m7j88K49j33J69k07J05J15Q9r6m2p1Q1J58k01
3668EN7L1j6q4j19K7K04n5Q8K6j75J24Rj67R5j38K38j39j64M18j81r6K70n39N67
3693B86j69l28L16l93J85J81J65k62O3o9K91n41L88n2j0K41k46q8M3l14J81N42
3715D10m67J82O4Q1k37k06K81K05j94k4q0J88n6l42O5nP4j63M48j03j23j3k85
3738c00K84J6J99k10J11j04r5J00K12m43K81R1k60J28k1k7m3m5Q7J05k17K3K67
3761A39j69q7j1Q2l5R9J84k12k31J07P4J27n8j20J11J05m5j63N0K08k14j27K58
3784G2k9l73O16o20J55L30k29j26R6j05J44o2J48J7j22K87m47J4JM16M0m07J97
3807A3j2P2J4k58L53MK49l32j99j28L00j43J13J79o93P26k54j05M0M99l86J00
$$ plain form
3829 152 252 20 -89 -252 164 -8 -137 244 62 -311 22 15 141 249 -31 91 183 31 71 -221 128
3850 128 33 8 56 122 -37 28 177 98 -211 100 176 92 -258 -11 -80 193 21 -39 -139 0 79 -134 42 112
3874 112 30 226 137 -58 -147 56 -75 -58 83 43 -35 135 208 191 -58 -307 -180 14 9 -5 -167 91 -239 29
3898 29 -90 -1 -104 388 6 -14 290 -235 77 217 -83 -14 -242 28 46 -68 156 94 -7 71 -67 -48 -46
3921 -46 -29 -117 -11 309 -13 14 -47 -293 -278 -1 -274 128 95 38 -165 275 190 -82 80 -31 33 -68 -86 -11
3945 -11 167 -10 -30 -140 -105 77 84 135 233 -51 -66 8 -78 182 -10 -40 -297 -75 190 172 -30 -134 124 -102
3969 -102 -164 -73 -98 154 355 -85 268 -92 4 -100 178 231 -105 -28 -36 -95 -148 -22 135 48 2 -2 144 5 -131
3994 -131 -218 109 123 281 12 58 -110 86 -174 -5 13 208 -51 96 -146 -267 182 81 11 -97 73 -108
$$ packed form
3829A52J00k32j09j63M16j72j29L81j82l73L33pJ26J08k80J22R2j52M0k92L49
3850A28r5k5M8O6j59O5J49p9l09L11P6q4l50K47o9K73j72o0j00J39P9k13J76P0
3874A12q2J96q9j95q9K03j31J7J41m0p8J70P3j7k49k49J27J94nj4j62K58l30K68
3898B9j19Q9j03M92l82k0L04n25L12J40l00O9k28K70J8j14K24o2j01P8j38J9K
3921d6J7q8J06L20l22K7o1k46J5K77k73M02l3n7k03M40q5k72J62j11O4j01j8P5
3945a1J78j77k0j10L5J82PN1R8k84j5P4q6K60j92l0k57K22K65j8k02j04K58k26
3969a02o2R1k5K52K01m40L53l60R6j04K78N3l36P7qn9n3J26J57q7m6mJ46j39j36
3994a31q7L27J4J58k69M6j68J96k60J69J8J95k59J47k42j21M49j01p0j08J70j81
$$ plain form
4016 -108 -453 241 -74 16 -47 -359 -69 186 230 -196 164 -164 -210 -79 -106 -99 37 -228 -95 205 -277 143
4038 143 -87 183 112 -11 232 -83 -50 95 -137 -206 13 -56 -43 -77 -100 -44 -33 157 124 -6 238 45 -103
4061 -103 33 204 61 110 152 -234 234 -247 -99 -30 -19 12 -52 -175 349 201 -1 86 -78 102 27 -114 18
4084 18 7 -391 -299 -260 -154 -200 -240 -175 26 363 -263 357 29 81 139 -42 -30 -132 11 27 -130 -88 -53 -227
4108 -227 -73 131 91 -106 64 -16 -311 127 -78 18 -31 -241 122 208 -244 -138 -128 24 -163 -1 -42 302
4130 302 50 64 -164 -100 -196 65 5 89 -139 206 29 7 -18 11 85 34 -157 147 108 -43 101 -198 -61 -267
4154 -267 165 148 259 32 156 -207 -18 203 158 297 -51 172 82 113 -113 -14 182 -82 -1 50 -101 -63 -124
4177 -124 -369 42 -18 -288 45 175 68 64 -62 -133 172 -171 -43 -46 16 84 236 -74 -144 135 -94 62 44
$$ packed form
4016a08l45O94l15R0o3l12K90K55M4m26L60l28m6J31k7PJ36k65J33L00m82M20
4038A43k30K70p1j23K43l15L3J45k32o9K19o9J3l4k3N6J1J90l3j30K44j93j48
4061a03J36J71j43M9M2l86M68m81J48O9J1L1o4j23N24j48k02Q7j64J80p5j41J32
4084A8j1l98R2L9J06m6m0O5K01L37o26O20l28N2N8j81J2j02J43J6j57M2L5j74
4108b27J54K04m0j97J70q0k95M38k05R6m9k10L63Q6m52J06J0J52j87J62m1L44
4130C02k52J4k28O4r6K61o0Q4k28L45j77k2k5K9P4n1j91L04l9j51J44k99J37k06
4154b67M32j7J11k27J24l63J89K21m5J39l48K23r0L1k26R9J96k64Q1N1j51L8o1
4177a24k45M11o0k70L33J30j07mj26p1L05l43J28lO2O8J52l10p0K79k29J56j8
$$ plain form
4200 44 -110 -228 -34 212 28 -165 -55 -105 -3 137 -254 -230 7 88 530 -30 -111 254 -216 140 -75 -48
4222 -48 -16 3 -17 81 105 150 293 100 162 64 -207 -161 -219 80 -151 -35 -233 -302 -107 -236 115 -42 108 -51
4246 -51 -25 310 142 39 -29 -128 -116 109 97 -24 -255 96 125 -93 -271 -116 147 177 -18 65 -139 183 152
4269 152 -201 -50 299 -69 295 -10 115 -121 261 -58 -324 145 97 25 -358 -218 -82 199 -88 -283 -68
4290 -68 -30 188 21 37 19 -120 91 143 1 197 -26 -250 -106 48 9 179 -41 -208 -30 36 99 64 23
4313 23 195 -90 140 -38 67 53 13 161 200 -31 -53 299 -333 -19 128 151 148 -212 -290 23 171 99 77 -73
4337 -73 -244 102 -135 -106 53 61 -160 308 -222 -316 151 65 93 188 132 -194 -143 -38 76 -35 86 -91 90
4360 90 186 5 -219 -26 -130 -100 161 -113 80 98 29 -8 -26 167 -94 119 49 120 -219 -179 -175 -200 -15 -284
$$ packed form
4200D4j54j18J94K46j84j93J10n0J02J40l91K4K37Q1M42n60q1L65m70L56k15K7
4222d8L2J9k0R8K4M5J43j93O2r8k71M6n8K99k31J16j98o9J95j29L51j57J50j59
4246e1K6L35j68j03o8r9J2K25j2j21k31L51K9k18j78J55K63L0j95Q3k04L22l1
4269A52l53J51L49l68L64l05J25k36L82l19k66M69m8p2l83J40J36K81k87j95K15
4290f8L8K18j67J6j8j39K11N2j42J96k23k24J44J54l9J70k20j67J78O6O3l5m1
4313B3J72k85K30j78J05j4m0J48L9k31k2L52o32L14J47K3ll60p8L13J48p2k2j50
4337g3j71L46k37K9J59Qk21M68n30r4M67q6K8R5n6l26N1J05J14j11J21j77J81
4360I0R6j81k24J93j04L0K61k74J93J8o9l7j8J93k61K13p0P1l39M0Mk5J85k69
$$ plain form
4384 -284 -312 98 -42 -136 11 101 -69 95 -187 154 -90 -95 -114 144 243 -54 -3 106 95 95 272 224 -14 -35
4408 -35 -33 86 -309 -59 236 164 72 -1 187 307 -155 68 -151 -5 25 -86 45 -137 -44 305 11 -236 -12
4431 -12 58 12 -230 244 -73 -70 -2 -245 -32 -196 -250 -162 -153 -88 -140 -145 -57 -11 -116 -102 128 -230 -147 -6 -232 162
4457 162 357 -119 -164 77 -38 64 -277 -284 -94 183 -27 80 -155 25 134 170 -19 -181 -214 182 -109 -160
4479 -160 -69 132 -82 -235 2 -94 -45 -334 -277 122 118 111 -3 109 -184 166 -93 -5 31 -49 -32 140 146 -36 -75
4504 -75 154 202 -16 -68 103 220 33 135 -65 162 -159 340 30 -74 69 -138 258 -489 -2 48 -31 -106
4526 -106 -18 177 -94 79 167 -181 -70 -304 -232 270 96 145 -9 -92 159 -23 336 -2 140 -41 -9 -191
4548 -191 16 47 -18 99 -38 -224 -18 220 -211 -166 -18 414 240 -33 -131 217 25 117 99 8 49 -169 10
$$ packed form
4384b84k8M10j40r4J47R0j70J64k82L41k44nj9K58R9k97N1J09j1%J77m8k38k1
4408c5KJ19l95K50K95p2r2p3J88J20m62K23k19J46L0j11J31j82R3L49k94k47K24
4431a2P0m6k42M74l17LO8k43K13j64n4Q8RO5n2nQ8M6j05J4K30l58Q3J41k26L94
4457A62J95m76m5K41j15J02l41pJ90K77k10J07k35J80J09L6j89j62l3L96k91n1
4479a60R1K01k14j53K37r6M9k89N7L99mpj14J12k93L50k59Q8L6q0J7J72Oj82l9
4504g5K29M8k18n2J71J17j87J02k00K27l21M99l10j04J43k07L96p47M87N0p9p5
4526a06Q8J95k71J73Q8l48J11k34P2N02j74M9j54q3K51j82L59l38J42j81L2j82
4548a91K07L1o5J17j37j86K06K38m31M5J48M32j74k73r8L48j92R2j8r1M1k18J79
$$ plain form
4571 10 -206 117 106 39 3 144 109 -93 -133 -120 66 0 65 282 238 125 172 174 -46 98 144 94 217 150 -113
4596 -113 -166 66 418 -24 54 132 237 103 33 133 13 131 174 -33 -282 112 -80 45 -8 -127 57 107
4618 107 -295 -41 -161 -42 -182 84 -73 62 -350 -51 -41 -64 -26 94 131 267 25 66 166 -216 40 -90
4640 -90 -3 77 132 181 -107 229 152 110 -141 154 115 146 88 -22 -270 -81 80 217 -24 -80 -38 -77 -212 -131 -99
4665 -99 -174 69 68 169 62 -104 -89 -77 93 94 123 -46 116 -24 43 -202 81 -25 250 141 37 84 -143 240
4689 240 53 -251 229 111 -176 -138 -50 -74 -32 132 203 -63 73 50 79 231 97 -405 104 -109 232 -52
4711 -52 25 171 -169 -328 -89 -104 -218 -180 141 275 133 -190 -313 -30 -298 18 -120 205 214 -166 -28 -93
4733 -93 98 -264 270 11 -248 71 107 76 -289 12 -99 6 -141 -25 25 -84 11 -137 161 -35 70 -19
$$ packed form
4571A0k16L23j1o7l6J41l5k02m0J3J86o6O5K17m4j13M7Kk20J44M6n0J23o7k63
4596a13n3K32L52m42P8P8J05j34p0J00j20J18M3k07k49L94j92J25n3j19J84N0
4618A07m02K54j20J19j40K66j57J35m12K99J0k3L8J20L7J36k42M1J00l82K56j30
4640i0Q7Q0N5M9k88L36p7m2k51K95l9L1n8j10k48J89J61J37k41n6M2l9j35Q1L2
4665i9p5K43jJ01j07j66J5J2J70JK9j69J62j40O7k45K83j06K75j09j04M7k27L83
4689B40j87l04M80j18k87L8Q8k4M2J64P1k66J36k3K9J52j34n02N09k13L41k84
4711e2P7J46l40j59K39j5j14L8L21J34j42l23j23K83k68L16j38L25Rl80J38o5
4733i3J91l62N34k59k59L19L6l1l65L01j11J05j47J16N0j09R5j48K98j96J05q9
$$ plain form
4755 -19 2 -67 61 93 341 -156 126 -57 -57 -57 -70 -58 -256 31 -9 -10 -119 95 182 -15 -10 50 -240 -28 -21 -200
4781 -200 -78 164 -243 297 -201 -154 232 189 189 285 139 -235 -32 -173 -137 -142 -91 167 -135 107 -219 -56 151
4804 151 166 -93 241 -148 -341 84 -59 159 136 274 126 80 103 125 -73 40 5 12 17 -68 190 -148 123 -262
4828 -262 149 49 20 245 94 -24 -70 5 227 50 81 -100 157 -139 -96 63 184 62 10 92 217 203 114
4851 114 -211 157 121 -98 72 -214 -65 -69 -125 88 -208 -202 -213 -23 -146 -4 -173 216 59 -92 -162 113 77
4874 77 230 205 -147 175 -121 148 37 104 -128 122 -40 189 51 290 -211 105 96 -106 177 30 -125 -164
4896 -164 -190 69 -46 -129 -114 110 72 150 277 -173 65 72 87 83 -246 211 205 -28 -116 60 -92 165 202 128 127 346
4922 346 -92 -122 -137 193 -86 -108 16 54 -84 62 262 30 184 -331 84 43 158 72 184 152 112 93 202
$$ packed form
4755a9K1o9J28L2K48m97K82j83%%j3J2j98K87m0jj09K14Q7j97NO0k90K12Pj79
4781b00J22K42m07N40m98M7L86m3%R6j46l74K03j41L6nN1K58l02K42l26J63K07
4804A51J5k59L34l89j93M25j43K18k3J38j48m6K3K2j98J13l5PNq5K58l38K71l85
4828b62M11j00k9K25j51j18m6P5K22j77L1j81K57k96M3J59J21j22n2Q2J25j4q9
4851A14l25L68l6k19J70k86J49mn6K13k96Oj1J90j23J42j69L89j57j51p0K75l6
4874G7J53k5l52L22k96K69j11O7k32K50j62K29j38K39n01L16rk02K83j47j55l9
4896a64k6K59j15q3J5K24l8P8J27m50K38PJ5ml29M57ok33q8J76j52K57L7p4jK19
4922C46m38l0j5L30k79k2J24L8j38J46K00k32J54n15M15m1J15q6J12l2m0j9J09
$$ plain form
4945 202 27 22 -66 107 107 192 -60 62 -177 118 221 -117 41 141 -104 71 -24 173 -162 42 70 130 -173
4968 -173 28 37 332 -1 119 -276 -240 123 -9 72 28 -8 -56 68 -222 90 -6 169 -32 11 -142 -299 -210
4991 -210 -131 -39 73 -121 -104 185 69 -202 97 97 -87 312 338 122 -80 3 -158 84 -3 120 -166 185 185
5014 185 33 -109 -35 89 399 8 -48 -136 201 -290 35 -105 -62 -39 -187 234 -19 89 -109 170 71 -158
5036 -158 37 42 447 150 -148 -29 -253 223 156 115 204 -44 121 253 -15 107 -67 123 166 -43 -100 20
5058 20 147 -170 -97 -55 -124 107 -21 -199 17 -281 -288 153 416 92 73 -130 78 -143 -127 -91 -83 -218 -68 190
5082 190 -7 -76 116 -161 -53 -15 -40 -99 -290 -104 -72 126 -343 107 -240 62 17 -27 8 34 286 94 74
5105 74 -168 192 317 163 26 -53 -206 234 138 32 107 48 14 -224 -130 -33 -112 101 156 1 -211 150 -83
$$ packed form
4945B02j75nq8J73%Q5k52J22k39K95J03l38J58J00k45J75r5J97l35K04K8O0l03
4968a73K01RK95l33J20l95L6L63j32Q1m4l6m8J24k90L12r6J75k01M3j53j57Q9
4991b10P9R2J12j94J7K89j16k71K99%j84L99K6k16k02Q3j61K42q7J23k86L51%
5014A85j52j42P4J24L10l91n6q8L37m91L25j40M3K3j48M21k53J08j98K79r9k29
5036a58J95NM05k97k98J19k24M76o7m1Q9k48J65J32k68J22j74J90M3k09n7J20
5058B0J27l17P3M2o9K31j28j78K16k98pM41K63l24j9k03K08k21J6L6Qj35J50K58
5082A90j97o9J92k77J08L8k5n9j91J86L2J98m69M50l47L02m5m4L5K6K52j92k0
5105G4k42L60J25j54j37p9j53M40r6j06P5n9l4k38R4R7p9K13N5j55k12L61k33
$$ plain form
5128 -83 -20 -200 25 244 -185 -112 -158 -127 -3 -98 -203 -162 345 -109 91 -123 63 -25 -111 -251 188 231 210 118
5152 118 -147 -125 144 -87 -63 -1 45 -78 -568 22 90 -15 -198 109 -64 54 -40 409 64 -145 154 -181
5174 -181 236 53 -407 4 -184 17 74 41 354 61 76 53 -2 -22 192 67 97 -22 -171 -62 -233 -79
5196 -79 17 104 -20 -7 136 33 30 27 -141 48 188 -25 134 152 225 183 191 232 127 158 183 -184 299 -143 -105 35
5222 35 132 66 -87 -90 82 141 -97 -252 85 -126 -225 -95 -101 224 42 -254 86 -13 30 -153 -140 -294 -267 180
5246 180 24 -144 203 -101 -156 -87 -297 61 -2 140 -50 -127 -19 338 75 21 125 230 98 -217 -117 -132
5268 -132 -51 -182 65 -133 -67 258 -37 -134 349 7 -32 -109 -27 -213 -104 -181 5 7 237 1 177 90 -210
5291 -210 8 -85 124 282 23 155 -1 -3 36 -94 161 -75 -71 -32 49 9 49 -212 -74 153 210 -253 -48 -10
$$ packed form
5128h3O3j80K25K19m29P3m6L1J24r5j05M1N07m54K00k14J86q8q6j40M39M3k1r2
5152A18k65K2K69k31K4O2M6j23m90N90O8j05j83L07j73J18r4M49l45k09K99l35
5174a81M17j83m60M11j88K01N7l3L13k93J5k3n5k0K14j25L0j19j49J09j71J54
5196g9R6Q7j24J3J43j03llj68J89J40k13J59J8P3m2QM1j05L1K5l67M83m42L8J40
5222C5R7o6j53lJ72N9k38j55L37k11r9J30oL25j82k96L40r9M3j83J3j54K7M47
5246A80j56j68L47l04n5O9k10L58o3J42j90p7J08L57k63n4J04J05j32l15J00j5
5268a32Q1j31K47j98O6L25k95r7M83l42l9p7Q2j86J09p7J86KK30k36J76q7l00
5291b10K18r3K09J58k59J32j56kL9j30K55k36ML9Q1m0M0k61J38K27N7m63K05L8
$$ plain form
5315 -10 -157 -259 235 82 177 280 21 63 -226 -218 6 90 -232 -103 -152 -179 212 -28 85 -17 -49 87 -249
5338 -249 27 249 38 -146 -183 98 87 111 36 136 17 195 -115 -123 -15 -106 37 -109 75 54 -55 31 -169
5361 -169 -76 -133 200 -164 -41 -42 -227 6 -201 -92 -184 89 -160 148 -228 193 234 188 -116 -131 344 148 -299
5384 -299 189 -216 -300 42 155 1 63 172 153 68 -155 189 26 45 50 75 -29 87 237 -298 69 -69 -32
5407 -32 210 -250 78 89 -31 42 47 62 -223 -26 0 115 -4 281 -230 83 -100 -140 -94 112 -141 -157 -113 -207
5431 -207 -64 108 168 -161 249 -55 -124 179 34 40 8 54 -101 121 83 -222 78 -206 67 -26 -47 -54 -44 188
5455 188 -54 201 -22 -91 -5 185 150 -184 -13 -367 10 -191 -173 265 -176 254 13 63 207 257 88 -203
5477 -203 -117 -121 -87 -5 50 -113 -49 40 131 -54 26 4 -218 -82 -85 43 25 165 52 -198 60 -415 75 -154 15
$$ packed form
5315a0j47j02M94j53R5J03k59M2k89QK24Q4l22J29m9k7L91k40J13j02l2J36l36
5338b49K76K22k11j84l7K81j1K4p5J00j19J78l10qJ08r1J43j46J84k1j09Q6k00
5361a69R3n7L33l64J23jj85K33k07J09r2K73k49L08l76M21M1m6l04j5M75j96m47
5384b99M88m05q4L42J13j54O2J09j9q5k23L44j63J9NK5j04J16J50n35L67j38L7
5407c2K42m60L28J1j20P3NJ5k85J97K6J15j19K85n11L13j83m0M6K06k53j6M4r4
5431b07J43J72O0l29M10l04o9L03j45Ol2M6j55K22l8l05L00k84K73r3k1pJ0K32
5455A88k42K55k23o9Q6J90l5l34J71l54L77k01J8M38m41M30k41N0J44N0j69k91
5477b03Q6mL4Q2N5j63O4Q9R1j85Q0k2k22J36lJ28j8J40j13k50K58m75M90k29J69
$$ plain form
5502 15 -314 328 42 -238 -111 -163 -170 -68 9 260 162 -173 11 35 187 208 -102 -41 -86 -154 140 -52 158 -182
5526 -182 -184 -88 163 -12 -96 -84 -3 41 -179 -250 -79 149 -167 -449 23 123 136 155 25 -2 36 -71 23 72 -124
5551 -124 -50 14 -7 81 -255 182 -136 495 -77 -64 -171 195 127 158 129 84 25 -75 169 -25 51 -17 147 152 134
5576 134 0 -287 145 33 138 72 66 160 -266 94 164 -24 -207 -132 36 195 -105 -15 140 253 50 68 -6
5599 -6 -186 53 151 193 -30 136 56 219 281 -38 -282 -407 38 78 -194 -54 10 185 39 -130 -152 -79 -49 -109
5623 -109 -67 -19 160 -53 -197 205 16 -203 54 4 -169 -300 149 194 -18 164 -171 -28 -87 69 121 -163
5645 -163 101 110 46 -131 -101 125 103 85 -184 97 -55 -104 -361 -125 144 235 53 152 269 227 37 -56 180 -62
5669 -62 -104 -117 206 -182 58 -36 114 92 19 42 43 13 222 125 124 -27 61 93 -132 -217 -50 -183 -68 119 -89
$$ packed form
5502A5l29O42k86k80J27n2pJ02P7K51r8l35J84K4J52K1l10O1m5o8K94j92K10l40
5526a82kR6K51j75q4J2Q1M4k20p1J71K28l16k82M72J00J3J9j30k7L8j07R4M9j96
5551a24P4O4k1Q8l36M37l18O31n72J3j07L66o8L1k9m5n9j00K44j94P6o8J64Nj8
5576A34j34k87M32j12J05o6oR4m26L60P0j88j83P5J68J59l00R0J55J13k03J8p4
5599fj80K39R8M2k23J66q0J63O2l19k44j25M45M0k72J40O4J75j46j69k2P3L0o0
5623a09M2M8J79k13j44M02j89k19K57n0j73j31M49M5k12J82l35J43n9J56N2k84
5645a63K64Ro4j77L0K26k2j8k69K81j52m9k57K36K69R1j82R9J17m2j90r3K36k42
5669f2m2j3L23l88K40r4J50k2p3K3Jl0K09r7jj51Q8L2k25q5J67j33J15J87k08
$$ plain form
5694 -89 -93 -379 36 57 111 140 -207 31 35 125 -421 -35 130 -75 19 -65 204 76 -176 8 -88 -31 94 134 -107
5719 -107 99 20 131 -110 -233 56 115 43 223 -204 -350 201 -189 13 -170 -51 4 204 50 40 230 80
5741 80 -192 120 -194 -169 317 -317 -92 39 -86 -223 -55 -296 78 175 -26 223 33 206 -271 28 -62
5762 -62 -119 46 -35 -26 244 149 -27 -87 -108 -15 119 129 61 125 143 -188 -112 -42 -299 -332 -174 -311 -93 -234 75
5787 75 -34 -42 -141 41 74 214 -57 16 -68 26 88 -273 51 -26 271 172 19 -55 -119 -137 22 -58 205 57 289
5812 289 295 -231 180 -71 -126 -137 -118 -47 -207 56 105 -224 29 68 37 -87 2 117 10 54 59 20 283 68 -111
5837 -111 -14 -63 -105 -53 -121 280 133 284 -76 186 59 3 -59 -261 74 -96 -273 -27 -73 61 -97 -126 19
5860 19 -13 -356 -423 157 -190 254 -51 -44 -2 144 -26 -81 7 257 -14 98 348 -82 201 281 -193 -95 128
$$ packed form
5694h9mk86M15K1N4K9l47K38MR0n46L86J65k05R4q4K69j28k52J84r6N7J25M0k41
5719a07K06p9J11k41j23K89N9p2J80m27j46N51l90K02j83J19N5K00j54j0J90j50
5741H0k72L12l14K5M86o34K25J31j25j37J68k41L74R7k01K49j90J73m77K99r0
5762f2n7J65q1RK70r5j76o0k1R3J34J0o8O4J8l31P6P0k57l3J58j37K18j41L09
5787G5j09qr9J82L3J40k71P3q4R4O2l61L24p7K97r9j53p4o4j8J59q0K63j48K32
5812B89On26M11k51n5j1J9P1j60K63M9l29K53L9l1j24Q9J15j07M4Nl9K63k15j79
5837a11R7m9m2N2o8M01j47J51l60K62j27n6o2k02L35j70j77K46m6J34j58k9J45
5860A9l2l43o7N80l47M44l05PM2J46j70n5Q8K50k71J12K50m30K83Q0m74R8K23
$$ plain form
5883 128 -248 -408 137 -156 -17 3 9 17 -74 -75 172 -84 95 239 -192 -123 -3 -108 -158 237 -38 80 -226
5906 -226 87 -74 127 -109 157 204 73 159 -285 16 -13 -193 208 -174 -255 -78 -116 121 389 -156 86 211
5928 211 18 106 -45 194 17 50 65 70 -82 9 85 112 -251 46 66 296 -190 -11 -49 -39 -99 121 153 25
5952 25 443 42 410 -12 -218 56 209 93 -406 -57 43 -43 43 233 56 -181 -189 152 170 92 281 39
5974 39 -167 161 -77 26 93 -94 46 -51 127 257 -23 -57 -35 180 114 20 85 -275 45 86 -129 -20 47
5997 47 -96 -282 -431 -115 -123 -128 -203 -213 202 -189 -28 176 -113 -250 -204 -7 367 -87 -129 28 -115 -99 -22 -213
6021 -213 -32 -140 -67 -196 -125 40 48 133 -136 54 63 55 -356 146 106 145 61 17 5 -31 -175 -70 41 -338 -202
6046 -202 218 -71 -10 30 -213 -171 22 -131 -162 402 139 159 -6 130 89 -171 -158 -20 -2 -35 -333 116 -61
$$ packed form
5883A28l76j60N45k93J39K0OQr1jK47k56J79J44m31O9J20j05n0L95k75J18l06
5906b26L13j61K01k36K66M7j31Q6m44L01k9j80M01l82q1J77l8K37K68n45K42J25
5928B11j93Q8j51K39j77L3J5Nj52R1P6K7l63K97K0K30m86J79l8J0o0K20L2j28
5952B5M18m01L68m22k06K74J53j16m99L49J00q6Q6J90j77k37qL41J8p8J89k42
5974C9k06L28k38J03O7j87J40r7J78J30k80l4K2K15o6r4O5l60L20M1k15J09O7
5997D7j43j86j49L16qnp5j0M15l91J61K04k89j37M6J97L74m54m2J57j43J6P7j91
6021b13J81j08P3j29P1J65QQ5k69J90Rqm11N02m0L9q4m4j2l6j44J05J11l79J36
6046b02M20k89O1M0k43M2J93j53l1N64k63K0j65J36m1k60J3J38J8l3k98M49j77
$$ plain form
6069 -61 228 -262 80 169 -43 178 -124 113 -69 93 31 47 -42 -11 -81 45 -14 30 -411 5 -50 129 270
6092 270 -117 36 27 192 -145 -114 -113 -214 -97 121 -52 105 -111 31 -57 -73 -112 -5 -247 298 -135 -79 -39
6115 -39 -40 199 -72 -29 130 -64 99 38 -137 -222 148 -85 -1 36 -6 -116 140 -105 -89 37 10 262 -203 104
6139 104 -125 -124 -76 258 -160 101 -127 73 -94 50 -41 -50 115 101 250 234 37 68 -53 -113 328 -106 90
6162 90 99 236 186 272 -24 102 -272 -280 160 -85 -106 -59 7 232 6 -158 1 156 199 37 146 -120 -115 103
6186 103 -130 -208 -102 108 -134 -231 -105 90 -152 -55 -265 -88 -35 32 -8 106 -230 42 -209 29 67 -86
6208 -86 -106 -128 64 105 -209 -164 58 250 -145 6 -229 31 224 -102 25 -66 127 -151 -18 -103 -1 -44 13
6231 13 -35 212 136 -120 -18 -73 -93 -51 -195 130 -57 -58 -138 8 -79 -76 5 225 265 -65 -89 204 240 -16 -119
$$ packed form
6069f1K89m90L42Q9k12K21l02K37j82J62o2J6q9L1p0J26n9M4m41M16n5J79J41
6092B70l87J53rJ65l37L1Jj01J17K18j73J57k16J42q8j6l9J07k42N45m33N6M0
6115c9jK39k71M3J59j94J63o1j75q5L70k33Q4L7m2j10K56k45J6J26k7K52m65L07
6139A04k29JM8L34m18K61k28K00j67J44r1rJ65j4J49j6j97L1j21o0M41m34J96
6162I0RJ37n0Q6k96J26l74qM40k45k1M7O6K25k26j64J59J55M3j62J09k66NK18
6186A03k33p8J06K10k42r7J26J95k42R7k10J77N3O7m0J14l36K72k51K38L8j53
6208h6k0k2J92M1l14M5K22J92l95J51k35K60J93l26J27r1J93k78J33q5J02m3N7
6231A3m8K47p6k56J02n5k0M2j44L25j87jq0J46q7LQ1K20M0l30k4K93L6k56j03
$$ plain form
6256 -119 225 274 -82 -113 136 -12 114 21 -260 274 124 32 215 -137 115 -22 202 73 162 120 113 9 -231
6279 -231 -222 -122 228 113 9 162 215 -51 112 -29 149 322 -19 -329 -27 149 -278 -123 267 164 -101
6300 -101 122 79 132 -101 -247 -56 -209 7 -82 -67 204 220 -20 87 135 55 -50 -60 -98 25 -92 108 -28
6323 -28 -163 -284 184 38 129 176 -159 -101 -180 -195 253 116 -283 -57 -187 81 167 -8 137 355 -120 -60 61
6346 61 -153 -27 -17 -188 -102 -354 -108 119 68 60 -160 -172 -104 150 -46 -188 -27 -93 44 138 -159 -104 -285 387
6370 387 -57 -44 161 -48 123 -426 -210 -172 -129 -60 43 -159 -116 -236 -18 234 93 73 -40 -75 -85 204 -1
6393 -1 101 -48 219 -137 -224 -206 251 1 -97 -3 -19 -119 -177 -54 399 -146 58 91 555 57 171 143 -145
6416 -145 256 -44 73 -58 182 218 19 -115 -188 -40 216 75 313 -256 176 -114 -183 -86 112 235 0
$$ packed form
6256a19L44M9l56l1K49j48J26r3k81N34j50r2J83l52K52j37K24j29Q9m2pj04k40
6279b31RJ00L50j15j04J53N3k66J63j41J78J73l41l10L02J76m27J55L90j03k65
6300a01K23m3N3k33j46J91j53K16q9J5K71J6k40J07M8q0j05j0l8J23j17K00j36
6323b8j35j21M68j46R1M7l35N8p9j5M48j37l99K26j30K68Q6j75J45K18m75O0J21
6346F1k14J26J0j71Q6k52K46K27n1qk20j2O8K54j96j42J61o6J37R4k97N5j81O72
6370C87m44J3K05k09J71n49K16L8M3O9J03k02M3j20K18K52j41k0j13l5j0K89k05
6393aJ02j49K67l56q7J8M57k50r8R4j6j00n8J23M53n45K04L3M64m98J14k8k88
6416a45M01l00J17j31K40L6j99j34p3J48K56j41K38n69M32k90o9R7J98J23k35
$$ plain form
6437 0 53 106 -83 -119 -39 219 16 -57 191 346 -249 248 -276 22 120 -311 -174 136 118 31 -155 -19 179
6460 179 56 20 144 46 -34 -94 -134 -111 19 138 112 173 -58 -157 -143 -83 274 -112 -263 222 -5 55 60 -352 -98
6485 -98 -69 58 -275 40 27 143 -207 180 198 75 -112 -305 231 82 -59 -232 -121 42 -214 -289 -59 -92
6507 -92 -113 51 7 124 -177 13 156 -329 105 61 -70 -88 599 63 -20 -183 152 323 227 -172 169 -239
6529 -239 36 400 -106 47 85 13 87 -100 258 124 160 -35 147 -192 -10 11 -1 270 103 -43 -4 -206
6551 -206 -109 -7 189 279 -96 129 7 -176 -19 128 107 32 75 -112 88 -155 -155 23 -152 -222 302 76 138
6574 138 -93 -141 30 13 323 17 -42 38 14 -378 -16 96 -74 -255 169 116 -2 26 48 305 121 113 -124
6597 -124 79 -66 -252 -62 -137 143 69 -31 -42 182 174 -86 11 398 -210 -62 39 -6 -18 -203 245 -15 -99
$$ packed form
6437@N3N3j89l6Q0K58k03p3K48J55n95M97n24K98R8m31J37L10j8q7j86J36J98
6460A79j23l6J24r8q0o0m0K3J30J19k6O1k31r9J4O0L57l86j51M85k27O0Nm12K54
6485i8K9J27l33L15j3J16l50L87J8j23j87j93N36j49j41j73J11J63k56p5K30l3
6507i2k1J64m4J17l01J90J43m85M34m4j31j8O87n36q3j63L35J71r6l99L41m08
6529b39K75L64n06J53L8p2P4j87L58j34L6j95J82l39J82K1j2K71j67j46L9k02
6551b06R7J02J96R0l75K25j22j83J57J47k1p5M3j87K00k43%J78j75p0N24k26O2
6574A38k31m8J71j7L10l06n9Q0k4l92L62J12j70j81M24n3j18K8K2K57j84qk37
6597a24K03j45j86J90p5K80p4j00j1K24qk60R7L87o08J48J01m5j2j85M48k60q4
$$ plain form
6620 -99 302 -89 6 -123 60 -53 -30 -4 -10 -122 82 -18 105 -99 2 92 -173 -80 -170 -33 -68 -8 -154 217
6644 217 -154 -317 136 -11 92 -196 -78 305 -18 -353 28 267 -39 -12 170 85 -47 -107 175 59 -84
6665 -84 -48 -291 -139 101 -30 72 -25 -199 285 40 -204 -65 -65 181 -161 210 -45 -136 -321 126 7 26
6687 26 153 197 -102 -72 78 -281 205 -133 -80 -210 -127 61 -57 28 88 30 -83 -241 -153 57 79 339 -144
6710 -144 246 190 -17 -163 127 159 -342 5 -66 -66 -142 -90 -83 159 -24 -117 -34 -23 126 -192 -96 -11 172 173 -118
6735 -118 36 226 -152 -249 -121 -87 84 26 -211 -198 231 26 174 -220 74 -191 38 73 47 -24 -126 25
6757 25 -184 -156 -32 -76 -207 61 46 -55 42 -148 51 -118 -80 -149 28 0 -112 29 -172 89 14 324 -390
6780 -390 54 38 143 20 188 15 -284 4 247 39 -22 24 74 73 190 -26 276 -2 16 -175 109 152 46
$$ packed form
6620i9M01l91R5j29J83j13K3K6oj12K04j00J23k04J01R0k65R3r0J37l5O0j46L71
6644B17l71j63M53j47J03k88J18L83l23l35L81K39l06K7J82q5j32o0K82j16j43
6665h4L6k43J52K40j31J02r7j74M84k45k44J39%K46l42L71k55r1j85M47j19J9
6687B6J27M4k99L0J50l59M86l38N3j30Q3J88j18Q5O0n8j13j58Q8K10K2K60m83
6710a44L90n6k07j46K90L2n01L47p1%p6N2PK42j83r3Q3J1J49l18R6Q5J83Jk91
6735a18J54J90l78r7J28L4J71n8k37J3M29k05J48l94K94k65K29L5k6p1j02J51
6757B5k09K8J24m4j31K68j5j01R7j90J99j69L8o9J77k8j12J41k01K61p5L10p14
6780c90M44j6J05j23J68j73k99K88K43k08o1M6N0jJ17k16L02k78J8j91K84M3j06
$$ plain form
6803 46 -128 1 -68 103 -73 90 40 -104 119 97 18 26 -192 92 315 -98 309 19 -86 -11 -111 -49 260
6826 260 -44 -31 -61 392 -70 -294 -15 -82 17 -168 -36 -260 -16 226 -41 111 143 -275 18 78 -99 42
6848 42 107 78 -19 -153 113 129 61 54 87 76 78 -190 332 -56 176 -69 71 48 -116 -144 0 18 -61 5 98 75
6874 75 -253 -46 213 344 166 -122 277 -25 -179 51 183 226 35 153 -64 -198 279 147 56 -126 149
6895 149 -4 -176 231 -18 334 78 64 128 -26 197 166 -133 -94 -145 -175 2 49 -114 -12 -213 -20 57 403
6918 403 -79 -109 -328 16 -49 -49 127 71 -43 62 80 -148 43 -31 67 -32 -111 -275 18 -120 55 39 114 17
6942 17 -214 191 -130 -156 -2 -50 -129 -42 307 36 44 251 -147 -260 -227 0 48 274 -25 -40 127 -195 -270 57
6966 57 -96 96 345 -103 12 -156 -53 -57 -30 137 -116 -74 -202 61 -13 130 40 -303 -147 -42 -82 -157 -207
$$ packed form
6803D6j74J29o9J71j76J63n0j44K23k2p9Qk18K84K23m13M07k90j05P5j00O2L09
6826B60l04J3l0M53m62k24K79o7R9j85J32k24K44K42k67J52L2m18K93O0j77J41
6848D2O5k9r7j34K66J6o8pL3j1Kk68N22l88K32k45J40k3j64k8J44J8p9O6R3k3
6874G5l28K07K59J31j78k88L99l02j54K30J32M3j91J18k17j34M77j32r1j82K75
6895A49j53j72M07k49L52k56j4O4j54K23l1k99L9n1l0J77M7j63J02k01J93P7L46
6918D03m82l0k19L44o5%J76n6j14J05J8k28J91p4R8r9p9j64K93j38J75j6P5r7
6942A7k31M05l21k6J54m8p9Q7L49k71QK07l98j13L3K27M8K26k99j5J67l22p5L27
6966E7j53J92K49m48J15j68J03mK7J67k53M2j28K63p4J43r0l43J56J05m0p5n0
$$ plain form
6989 -207 -191 13 146 -106 -77 163 19 -5 -155 -47 21 119 351 -222 73 87 61 408 -68 -72 97 62 97 104
7013 104 -98 -193 -173 294 84 -155 4 1 -3 -131 172 48 -15 32 -135 -24 -139 -211 -101 -31 -153 -140 -19 -76
7037 -76 224 -104 117 -83 -254 -25 26 243 62 -5 -1 12 71 92 -57 -3 17 40 -109 -134 -16 7 63 -149 -117
7062 -117 97 -36 160 132 166 78 210 -140 -217 -9 222 -107 -69 -121 135 249 -12 1 -10 6 -211 -165 120
7085 120 -21 -208 327 -243 227 -127 158 -175 24 -363 -98 -135 48 117 -31 -404 126 -176 168 168 -207
7106 -207 378 -53 134 -113 188 203 194 171 -116 308 16 341 134 -163 -210 107 72 -76 159 -117 -2 300
7128 300 -48 -87 127 38 -77 158 1 216 19 36 58 -183 269 259 226 -182 -148 -48 326 -18 76 -295 -402
7151 -402 47 -94 152 2 5 232 -29 -204 -28 -107 26 24 163 128 -55 94 132 -121 49 289 177 -132
$$ packed form
6989b07J6K04J33k52K9K40j44k4j50J08O8R8K32n73K95J4k6L47m76mJ69l5L5P
7013A04k02r5K0M67k10k39J59lmj28L03j24o3M7j67J11j15p2J10P0j22J3J21n7
7037g6L00l28K21k00j71K29N1K17j81o7MJ3N9K1j49N4K0K3j49k5J18K3N6k12L2
7062a17K14j33J96k8L4q8J32l50p7K08K31l29L8n2K56J14k61J3j1J6k17M6K85
7085A20j41j87N35n70M70l54K85l33J99l87K65l7J83O9j48l73N30l02L44%l75
7106b07N85m31J87k47L01J5rk3k87M24k92L25k07k97m7L17l5j48K35k76J15L02
7128C00l48l9K14q9j15K35j57K15j97J7K2k41M52j0l3m08L4J00L74l44R4l71j07
7151d02M49j41K46j50LK27k61j75J76p9J33kJ39l5j83J49L8k53J70K40j12l09
$$ plain form
7173 -132 -129 -7 339 -246 117 12 66 -171 -128 90 163 94 -87 -146 -31 -6 -97 -150 164 120 -41 -55 88 -107
7197 -107 117 137 46 -211 -95 -12 67 -41 69 59 -175 118 -170 -120 -80 122 -176 -80 -24 38 11 -105 124 11
7221 11 -60 88 222 -39 79 40 231 160 -2 198 50 57 23 26 66 -220 24 46 53 -74 -71 -120 -278 -74 -185
7246 -185 -208 199 -3 89 27 -78 -63 121 122 288 -87 -282 -54 -38 152 -41 155 -504 -237 63 -101 -99 9
7269 9 153 4 87 118 -331 79 216 -161 -6 171 -121 63 60 -4 111 -45 16 46 -59 -136 173 -163 -309
7292 -309 52 36 -13 195 -164 108 21 23 99 187 -77 -129 -95 -28 219 66 -260 238 58 60 11 -160 106 83 -235
7317 -235 95 204 -235 430 70 53 53 53 -182 177 267 -395 187 191 -283 -78 17 280 147 59 -149 -132 106 -2
7341 -2 -199 8 -9 126 224 -94 -229 296 -25 -183 -32 -162 51 -289 30 -113 -30 193 -49 224 -395 -181
$$ packed form
7173a32LJ22L46n85L63j05N4k37M3K18P3o9j81n9J15K5r1n3L14m4j61j4J43j95
7197a07K24K0r1k57J16Q3P9j08J10j0k34K93k88N0M0K02k98R6N6O2k7j16K29j13
7221A1p1J48J34k61J18l9J91p1j62K00j48Pl4LM0k86K44K2Pj27Lm9j58K04j11
7246a85k3M07k02R2o2j05J5J84JJ66l75j95K28J6J90j93J96o59K67L00j64KJ08
7269IJ44j49Q3L1m49M10J37l77J55J77k92J84lo4J15j56O1L0j05p7L09l36j46
7292c09L61j6m9K08l59K72q7KP6Q8k64n2L4O7K47j53l26M98j80Km9j71K66k3l18
7317b35L30J09m39O65l60j7%%k35L59R0o62N82Mm74K05R5K63j33q8k08J7K38j08
7341bj97K07j7J35R8l18j35N25l21j58J51j30K13l40L19j43Q3K23k42K73o19K14
$$ plain form
7363 -181 -56 8 -85 100 -258 210 -198 -129 204 49 156 -162 216 65 90 11 -71 -169 234 -89 76 48 -101
7386 -101 -16 50 81 -126 124 48 -106 1 -119 -268 -181 27 -116 147 359 -88 -86 372 -193 -12 -129 -102 -137
7409 -137 -58 108 -8 -83 -184 37 224 162 -83 -182 -67 19 -138 -20 197 -17 91 9 -56 294 170 50
7431 50 -50 -2 -133 110 39 -31 -8 218 126 -8 179 -241 117 -17 -148 77 -62 -6 -193 -151 -89 148 -6
7454 -6 -51 -87 -11 34 103 -96 -106 53 -64 -64 162 40 -51 191 13 -359 -58 -369 -272 -14 -125 -203 92 -29
7478 -29 75 7 -27 -18 224 69 346 117 -91 -82 -97 19 54 45 130 195 -24 -80 -69 42 -228 103 -312 29 233
7503 233 -55 206 -107 -280 70 -17 119 -34 -24 203 193 -40 -101 138 -74 -220 -238 139 -18 69 -151 -24
7525 -24 231 34 -199 -52 -6 117 60 20 -17 -61 53 -29 -341 32 283 -16 -177 -2 185 -237 -184 -130 -54
$$ packed form
7363a81J25O4r3J85l58M68m08O9L33j55J07l18L78j51K5p9q2r8M03l23J65k8j49
7386a01Q5O6L1k07K50p6j54J07j20j49Q7K08j43K63K12m47KM58n65J81j17K7l5
7409a37P9J66j16p5j01K21J87o2k45r9J15Q6j57J18K17k14J08q2o5L50j24j20
7431E0j00M8j31K43p1p0K3K26r2j34J87m20L58j34j31K25j39N6j87M2O2K37j54
7454fm5l6P6M5O9j99j0J59j17%K26j22r1K42j78l72L01l11R7K58j11p8K95j21
7478b9J04o8l4RK42j55K77k29k08Rj5J16L5rQ5O5k19n6J1J11k70L31m15L41K04
7503B33k88K61l13j73L50q7J36j53J0K27j0k33o1K39k12j46j8L77j57Q7k20J27
7525b4K55j97k33J47M6J23n7m0l7m4J14q2l12L73K51k99j61J75J87m22N3N4P6
$$ plain form
7548 -54 -167 -39 -44 -214 -162 185 -20 -17 49 294 156 -183 -2 75 121 29 97 110 -135 -43 161 -76 61 -62
7572 -62 13 89 184 -187 -40 43 103 -329 -132 39 35 -52 -29 92 -273 -29 -207 21 -94 -313 120 2 110
7595 110 -23 -148 5 -24 33 127 269 136 103 79 53 208 -61 78 -43 183 -107 -24 176 -137 -86 -33 -158
7618 -158 -51 -36 -199 -157 -56 262 0 -135 184 -179 -257 2 107 -7 30 60 -12 274 53 37 -18 -203 -88
7641 -88 -8 -193 -38 134 134 -35 76 231 -151 -203 -262 -249 -64 -13 74 -15 -186 -99 127 39 -191 109 -90 -26
7665 -26 -167 172 28 -35 -186 -115 15 101 202 -182 92 -55 -137 -212 103 -130 85 -42 -34 -205 55 213 169
7688 169 -63 300 -71 138 223 -12 370 184 -34 -16 268 123 -48 231 -61 39 278 194 -105 -70 -106 -302
7710 -302 -22 -57 110 37 -77 -67 -30 45 448 22 2 100 141 -115 -268 73 -48 -22 -119 14 -308 -11 161
$$ packed form
7548e4j13J28nj70N2L47k05LO6K45j38l39J81P7M6r2O8J3k45R2K04k37J37j23
7572f2P5P6R5l71J47Q3O0m32J97J71mq7K3J21l65K44j78K28j15k19M33j18J08
7595A10j33j25J53k9N7R4J42j33l3k4k6J55k69J39j21K26k90Q3K00l13N1N3j25
7618a58J07J5j63M2J01L18k62j35L19l63p8K59J05j14L7L0p2K86k21j6n5j85J15
7641h8Q0j85J55J72%j69J11J55l82n2n9J3J85N1Q7q9j71Q7K26q8k30L00j99O4
7665b6j41L39j44o3j51P1J30Q6J01l84K74j47q2p5L15k33K15j27Qj71K60J58m4
7688A69k32L63l71K09Q5k35L82j86k18J8K84j45j71K79k92J00K39q4k99L5l6j96
7710c02K80l5J67p3j14J0L7P5M03m26k0R8M1k56j53L41j21K6r7J33l22K97J72
$$ plain form
7733 161 -109 -50 69 33 -12 184 78 22 -107 -214 175 170 -102 5 -123 -12 -130 346 -152 -220 -85 -50 -71
7756 -71 126 95 2 -109 -173 1 -170 194 -143 277 102 7 29 155 40 -30 51 -45 48 -68 236 229 -52 77
7780 77 80 51 97 -57 -173 136 319 -90 422 110 -229 310 -208 -264 75 -104 -19 238 341 180 55 -23 -35
7803 -35 -94 -135 43 -102 242 47 131 -143 271 -172 -142 -164 -284 69 -93 -103 -129 147 299 83 -129 486 -10
7826 -10 -42 -122 -21 54 -59 115 15 45 37 41 -88 -2 90 -93 192 227 206 29 176 135 -340 140 -114 115 -165
7851 -165 55 -2 -122 -4 -21 -89 -77 350 105 120 -230 -122 114 -23 230 -86 -42 156 -88 96 -64 -161
7873 -161 -209 277 -64 7 -123 192 150 41 96 81 -319 126 -19 -8 18 -72 -43 169 116 -200 -259 -270 -3 -50
7897 -50 25 -317 0 289 -139 7 122 282 -244 -129 126 418 -163 25 91 83 88 -110 218 -168 2 233
$$ packed form
7733A61k70N9J19l6m5J96j06n6j29j07L89nk72J07j28J11j18M76m98o8J35L5k1
7756g1J97l1r3j11o4J74j71L64l37M20j75r5K2J26j15p0Q1r6R3j16L04pk81J29
7780G7Lk9M6j54j16L09J83m09N12l12l39N39n18n6L39j79Q5K57J03j61j25p8j2
7803c5n9m1J78j45L44j95Q4k74M14m43L0k2j20L53j62j0k6K76J52k16k12O15m96
7826a0l2q0J01P5j13J74j00L0qMj29Q6R2j83K85L5k1j77J47m1m75M80k54K29k80
7851a65K20n7j20J18j7o8J2M27k45J5l50J08K36j37K53l16M4J98k44J84j60r7
7873a61m8M86l41P1j30L15m2j09N5j5m00M45j45J1K6r0K9K12n3l16n9j1K67m7
7897e0P5l42L17K89m28J46J15J60n26J15K55K92n81J88O6qNj98L28l86J70K31
$$ plain form
7919 233 -160 -200 -129 163 145 29 14 13 8 -89 -144 -141 112 -60 345 -260 -55 -251 347 66 58 -120 50 56 208
7944 208 35 194 -82 -258 36 136 303 2 -141 -139 -234 -98 134 -209 80 50 -36 122 58 41 -72 47
7966 47 8 -129 -178 125 13 -43 28 165 -48 -146 -74 161 90 -113 -16 -280 332 -125 -34 -84 82 13 -331 -71
7990 -71 73 31 -252 -40 24 102 -70 -40 -151 14 242 261 170 -273 -92 234 468 -21 16 -2 -250 -45 -35
8013 -35 -160 305 -270 -56 -30 -37 11 4 -216 -176 110 -98 27 119 -50 130 11 88 20 -70 -134 35 -47 189 -30
8038 -30 -239 -42 -393 120 -111 122 80 2 97 94 113 -51 57 -32 -77 35 50 331 35 -282 -163 -7 29 -193
8062 -193 281 -118 29 -269 -231 -193 147 152 75 2 -93 -118 150 -18 138 12 -46 111 -185 40 276 160 -68
8085 -68 5 -141 19 5 -70 82 -83 20 394 207 -17 -60 108 -83 194 150 -49 -150 -141 -86 43 194 253
$$ packed form
7919B33l93m0P1K92j8j16j5jnr7n5LK53j72M05o05K05j96N98k81qj78J70OJ52
7944B08j73J59k76j76K94J00J67l01j43Kr5J36K32l43K89l0q6J58o4j7j13J19
7966D7l9j37m9L03j12n6P1J37k13r8P2K35p1k03R7k64O12m57R1n0J66o9l44K60
7990g1J44m2k83K12O4P8j72L0j11J65K28J9r1m43J81L26K34m89L7j8k48K05J0
8013c5j25M65n75K14K6pM8pk20M0K86k08J25R2j69J80j19P7o8r0o4J69q2K36k19
8038c0k09J97l51N13k31K33m2p8R5lJ9j64J08q9m5J12J5K81k96l17J19J56L6k22
8062a93M74l99J47k98L8L8L40Np7p3r5k5K68j68J56j26n8J57k96K25K36j16k28
8085f8P3j46J60j4p5J52j65J03L74j87k24m3J68j91K77m4j99j01RN5J29J51N9
$$ plain form
8108 253 -94 -129 336 -150 93 -17 -109 24 -111 -23 78 339 26 238 104 -162 -120 -358 35 -249 84
8129 84 19 64 -185 -45 359 50 183 200 148 88 -93 100 -168 3 391 -42 49 86 -302 -35 -85 111 55
8152 55 80 -89 -141 109 90 -64 135 252 -203 -217 -91 -174 -75 -130 342 -196 -11 -131 189 3 -102 -156 44
8175 44 182 208 20 147 -140 80 40 -63 269 66 272 76 135 -225 -127 224
$$ packed form
8108B53l47l5M65m86K43j10r2J33j35Q8J01K61l13K12j34k66M2k38L93k84L33
8129H4o5M5k49J40M04l09J33J7n2o0j81J93k68J71L88m33R1L7l88K67n0J96n6
8152E5K5j69n2K50j9j54J99J17m55j4J26q3R9n5M72n38J85j20L20j86j05n4K00
8175D4J38K6j88J27k87K20m0j03L32k03K06j96N9l60R8L51
8191B24
$$ Imaginary data points
##PAGE= N=2
##DATA TABLE= (X++(I..I)), XYDATA
$$ plain form
0 0 0 0 0 0 0 0 8 -8 8 -8 16 -16 20 -24 32 -32 40 -48 61 -72 81 -96 112 -128 147 -168 192 -218 248 -280
30 -280 315 -354 396 -444 495 -551 613 -680 754 -835 926 -1027 1133 -1256 1391 -1545 1718
47 1718 -1914 2140 -2403 2715 -3089 3550 -4136 4904 -5967 7528 -10073 14930 -27548 129341
61 129341 275296 31406 9470 118020 120955 -21691 -7397 103604 131131 90931 144665
72 144665 182265 119162 63061 105291 97498 15644 4919 91297 114196 91080 140044 196888
84 196888 121094 29643 63665 106669 29846 -16389 77503 152771 100092 69096 125597 119604
96 119604 29762 23724 90610 54841 -35517 17802 145747 128566 21773 30516 104921 65751
108 65751 -30102 -23813 37285 39801 31101 66635 68629 15773 5157 37689 8077 -54345 -31555
$$ packed form
0@%%%%%%Qj6J6j6K4l2L6m4N6o4P2q8J09j33J53j77K08k40K75l15L60m10M66n28
30b80N95o69P50q40R39j046J164j293J434j589J761j953K160k389K647k936L263
47A718l632M054m543N118n804O639p686R040j0871J3495j7601K5003m2478J56889
61A29341J45955k43890k1936J08550K935j42646J4294J11001K7527m0200N3734
72A44665L7600o3103n6101M2230p793q1854j0725Q6378K2899k3116M8964N6844
84A96888p5794r1451L4022M3004p6823m6235R3892P5268n2679l0996N6501n993
96A19604q9842o038O6886l5769r0358N3319J27945j7181j06793Q743P4405l9170
108F5751r5853O289O1098K516q700L5534J994n2856j0616L2532k9612o2422K2790
$$ plain form
121 -31555 32353 16596 -20505 25304 69452 8417 -57017 -25049 -952 -67050 -99061 -19826
133 -19826 39050 850 -24874 9429 1288 -65328 -81958 -49548 -65355 -97454 -50230 16434
145 16434 -7904 -59848 -33563 1402 -51867 -116729 -99746 -62291 -73582 -73865 -27757 -9654
157 -9654 -42061 -52814 -37963 -67330 -115514 -102337 -58417 -62138 -78717 -43100 -10341 -42144
169 -42144 -75000 -55752 -51115 -98688 -114002 -63821 -35676 -58996 -56551 -16458 -19870 -67186 -78474
182 -78474 -57734 -71074 -92428 -58236 -14676 -27988 -51181 -26445 -8690 -47086 -79777 -58408
194 -58408 -38628 -54473 -49819 -10557 984 -20928 -19419 -4354 -29546 -65494 -50556 -16484
206 -16484 -22683 -29600 6538 33256 5429 -19388 -2854 -1555 -37865 -44568 -3314 16601 -325
$$ packed form
121c1555O3908j5757l7101M5809M4148o1035o5434L1968K4097o6098l2011P9235
133a9826N8876l8200k5724L4303q141o6616j6630L2410j5807l2099M7224O6664
145A6434k4338n1944K6285L4965n3269o4862J6983L7455j1291k83M6108J8103
157i654l2407j0753J4851k9367m8184J3177M3920l721j6579L5617L2759l1803
169d2144l2856J9248M637m7573j5314N0181K8145k3320K445M0093l412m7316j1288
182g8474K0740j3340k1354L4192M3560j3312k3193K4736J7755l8396l2691K1369
194e8408J9780j5845M654L9262J1541k1912J509J5065k5192l5948J4938L4072
206a6484o199o917L6138K6718k7827k4817J6534J299l6310o703M1254J9915j6926
$$ plain form
219 -325 8779 43770 39163 2375 -4673 8788 -5807 -22800 2557 35344 31549 25584 47062
232 47062 53422 20722 1183 15256 18315 2379 13771 47659 53120 38569 47286 59886 35669
245 35669 6866 17140 34563 23611 20487 51621 71042 52920 40151 51576 46024 16484
257 16484 11873 35723 42741 33176 46581 69931 61427 37974 37193 41968 23618 10552 29467
270 29467 48016 42344 41880 59934 60212 33740 21622 29687 24511 9401 19554 44447 46797 36211
284 36211 43042 49789 29562 6701 10591 19208 9893 8733 30759 43604 32316 24336 29648 21259
298 21259 -2009 -7841 4710 7429 2941 15115 30994 25331 10142 7899 6161 -10341 -21202
311 -21202 -10438 791 -1529 1236 14771 14736 -2409 -11966 -10583 -18378 -30508 -24170 -7670 -4866
$$ packed form
219c25R104L4991m607l6788p048J3461j4595j6993K5357L2787l795n965K1478
232D7062O360l2700j9539J4073L059j5936J1392L3888N461j4551Q717J2600k4217
245C5669k8803J0274J7423j0952l124L1134J9421j8122j2769J1425n552k9540
257A6484m611K3850P018r565J3405K3350q504k3453p81M775j8350j3066J8915
270B9467J8549n672m64J8054K78k6472j2118Q065n176j5110J0153K4893K350j0586
284C6211O831O747k0227k2861L890Q617r315j160K2026J2845j1288p980N312q389
298B1259k3268n832J2551K719m488J2174J5879n663j5189k243j738j6502j0861
311b1202J0764J1229k320K765J3535l5j7145r557J383p795j2130O338J6500K804
$$ plain form
325 -4866 -8398 -1964 3109 -11251 -27745 -28076 -25829 -33005 -33226 -18124 -7271 -12241 -15268 -11296 -18574
340 -18574 -35554 -40240 -33771 -32743 -34744 -24503 -11514 -12744 -22283 -23307 -24574 -37160 -46104 -39139
354 -39139 -30495 -30644 -26310 -14807 -11961 -23100 -30335 -29696 -34573 -43605 -40655 -27970 -21920 -21946 -16153
369 -16153 -10851 -18294 -29602 -31759 -31267 -35326 -34503 -23012 -13427 -12431 -12236 -9287 -13319 -23992 -28175
384 -28175 -25236 -25159 -24211 -15068 -4066 -2800 -5450 -4939 -6556 -15687 -22000 -18191 -13073 -11288 -5191 5305
400 5305 8529 2785 -713 -736 -6204 -12986 -10213 -1857 3172 5828 12132 16323 11861 5903 3617 1566
416 1566 -2404 -812 7543 14040 16523 19274 21831 19037 11518 7829 7157 6729 8056 14633 21980 24500
432 24500 24690 25161 22344 15360 10054 10639 12553 14869 19243 26243 29212 28049 24811 21464 16794 11566
$$ packed form
325d866l532O434N073j4360j6494l31K247p176k21J5102J0853m970l027L972p278
340a8574j6980m686O469J028k001J0241J2989j230r539j024j267j2586q944O965
354c9139Q644j49M334J1503K846j1139p235O39m877r032K950J2685O050k6N793
369a6153N302p443j1308k157M92m059Q23J1491R585R96J95K949m032j0673m183
384b8175K939P7R48R143J1002J266k650N11j617r131o313L809N118J785O097J0496
400E305L224n744l498k3n468o782K773Q356N029K656O304M191m462n958k286k051
416A566l970J592Q355O497K483K751K557k794p519l689o72m28J327O577P347K520
432B4500J90M71k817o984n306N85J914K316M374P000K969j163l238l347m670n228
$$ plain form
448 11566 11184 14587 18741 22904 26762 28581 27236 23117 18638 13475 10401 11144 14880 18430 21681
463 21681 24476 26148 23044 17978 12654 9261 7612 8334 11106 15381 18975 20695 20056 15910 10404
478 10404 6359 3855 2774 4300 7581 11875 14227 14048 11612 7780 3696 -708 -3691 -2829 87
493 87 3589 5762 7104 7461 4972 -164 -5117 -7927 -8279 -7500 -4991 -1879 1240 2062 759 -3070 -8184
510 -8184 -11579 -12808 -12705 -13013 -9779 -4087 -1402 -3598 -6758 -8548 -11779 -16283 -18546 -16445 -13059 -10289
526 -10289 -7243 -5450 -6549 -9927 -12728 -15579 -18885 -19862 -16129 -12114 -10901 -9338 -6285 -6903 -11673
541 -11673 -16049 -16600 -17443 -18164 -16425 -11738 -7647 -6868 -6504 -7917 -11336 -14423 -15640 -15704 -16077 -12961 -7038
558 -7038 -3897 -5154 -6064 -6056 -7986 -12830 -14636 -12272 -9565 -7703 -4187 -1175 -1222 -3169 -4376 -6126 -9775
$$ packed form
448A1566l82L403M154M163L858J819j345m119m479n163l074P43L736L550L251
463B1681K795J672l104n066n324l393j649P22K772M275L594J720o39m146n506
478A0404m045k504j081J526L281M294K352j79k436l832m084m404k983Q62K916
493H7L502K173J342L57k489n136m953k810l52P79K509L112L119Q22j303l829n114
510h184l395j229J03l08L234N692K685k196l160j790l231m504k263K101L386K770
526a0289L046J793j099l378k801k851l306r77L733M015J213J563L053o18m770
541a1673m376n51q43p21J739M687M091P79L64j413l419l087j217o4l73L116N923
558g038L141j257r10Qj930m844j806K364K707J862L516L012m7j947j207j750l649
$$ plain form
575 -9775 -10535 -7289 -4576 -3459 -315 3191 3369 -882 -3428 -3332 -4698 -6796 -4981 549 3222 4061
591 4061 5724 5652 2726 -783 -1565 -1563 -2738 -724 4967 7605 7124 7312 7887 5529 1173 -653 1283
608 1283 2007 2907 6891 10758 10259 8270 7339 6107 2938 878 2334 4647 5668 8164 11567 11545 8857
625 8857 6769 5697 3370 1276 2266 5566 7789 9232 10708 10731 8261 5869 4548 2946 1762 3378
641 3378 6503 8475 8233 9118 9021 6723 3867 2495 2153 1435 2603 5642 8148 7958 7253 6733 5283
658 5283 1942 -466 109 1198 2787 4454 6611 6732 5109 4001 2454 -147 -2321 -1658 434 1982
674 1982 3641 5018 5129 3144 1131 71 -1872 -3556 -2658 -357 2116 2687 2787 2991 1605 -867
690 -867 -2592 -3361 -4124 -3362 -711 928 1563 1316 1707 308 -2673 -4790 -4971 -3786 -2979 -1827 283
$$ packed form
575i775p60L246K713J117L144L506J78m251k546R6j366k098J815N530K673Q39
591D061J663p2k926l509p82Kj175K014N691K638m81J88N75k358m356j826J936
608A283P24R00L984L867m99j989r31j232l169k060J456K313J021K496L403k2k688
625H857k088j072k327k094R90L300K223J443J476K3k470k392j321j602j184J616
641C378L125J972k42Q85r7k298k856j372l42p18J168L039K506j90p05n20j450
658E283l341k408N75J089J589J667K157J21j623j108j547k601k174O63K092J548
674A982J659J377J11j985k013j060j943j684Q98K301K473N71J00K04j386k472
690h67j725p69p63P62K651J639O35k47L91j399k981k117j81J185Q07J152K110
$$ plain form
707 283 1373 762 -500 -2203 -4048 -5049 -5068 -4229 -3422 -1274 511 759 -887 -1812 -2353 -4278 -6160
724 -6160 -5596 -3688 -2419 -1712 -166 421 -821 -3090 -3962 -4657 -6089 -5314 -2687 -1105 -1450 -713 322
741 322 -678 -3834 -5270 -4649 -4320 -4740 -3133 -634 66 -175 -768 -1726 -3584 -4853 -4202 -3919 -4002 -2012
759 -2012 575 772 -1074 -1288 -1080 -2782 -5121 -4716 -2296 -1173 -1297 -347 1350 391 -1445 -2145 -3367
776 -3367 -3832 -3183 -1893 -928 -304 1002 1553 189 -1668 -1837 -1771 -3183 -3243 -1078 717 892 1484 1983
794 1983 892 -1258 -1833 -1338 -1821 -1820 -275 1888 2235 1033 1366 1677 177 -1898 -1739 -546 84 911
812 911 1881 3105 2087 1835 717 -413 -1234 -349 302 -266 1416 2952 3940 2082 1256 1306 995 -538
830 -538 -686 1128 2468 2441 2665 2976 2646 1788 776 56 -284 364 1450 2193 1851 2730 3254 2256 931
$$ packed form
707B83J090o11j262j703j845j001j9Q39Q07K148J785K48j646r25n41j925j882
724f160N64J908J269P07J546N87j242k269q72o95j432P75K627J582l45P37J035
741C22j000l156j436O21L29m20J607K499P00k41n93r58j858j269O51K83q3J990
759b012K587J97j846k14K08j702k339M05K420J123j24R50J697r59j836p00j222
776c367m65O49J290R65O24J306N51j364j857j69O6j412o0K165J795J75N92M99
794A983j091k150n75M95m83JJ545K163L47j202L33L11j500k075J59J193O30Q27
812I11R70J224j018k52j118j130q21Q85O51n68J682J536R88j858q26N0l11j533
830e38j48J814J340k7K24L11l30q58j012p20l40O48J086P43l42Q79N24r98j325
$$ plain form
849 931 606 447 -77 519 1559 2176 2557 2480 2957 1824 298 224 402 450 429 1823 2861 2357 1740 2263
869 2263 2078 356 -502 315 805 1019 1501 2216 1982 1627 1544 1177 -401 -888 -49 804 391 702 2171
888 2171 2461 910 613 718 -279 -1068 -298 983 1077 272 1433 2082 376 -460 -17 -18 -1334 -1079 911
907 911 1293 464 102 1418 884 -1341 -985 -82 -612 -1174 173 1405 408 -196 915 703 -1095 -1588
925 -1588 -175 -33 -1047 -586 1506 1000 -660 -87 950 -322 -1916 -832 897 -339 -1061 566
941 566 1640 -177 -1219 -25 335 -1577 -1754 422 698 -676 -445 1054 269 -1424 -1056 129 -1285
958 -1285 -1727 -247 647 -779 -905 739 558 -1629 -1557 -136 -314 -2292 -1604 838 -89 -1505 -521 658
976 658 -972 -2766 -1201 4 -1496 -2105 -340 423 -1343 -1987 -361 -665 -2717 -2247 -274 -796 -2455
$$ packed form
849I31l25j59n24N96J040O17L81p7M77j133j526p4J78M8k1J394J038n04o17N23
869B263j85j722q58Q17M90K14M82P15k34l55q3l67j578m87Q39Q53m13L11J469
888B171K90j551k97J05r97p89P70J281R4q05J161O49j706q36M43jj316K55J990
907I11L82q29l62J316n34k225L56R03n30n62J347J232r97o04J111k12j798m93
925a588J413J42j014M61K092n06j660N73J037j272j594J084J729j236p22J627
941E66J074j817j042J194L60j912j77K176K76j374K31J499p85j693L68J185j414
958a285m42J480Q94j426j26J644j81k187P2J421j78j978O88K442r27j416R84J179
976F58j630j794J565J205j500o09J765P63j766o44J626l04k052M70J973n22j659
$$ plain form
993 -2455 -1300 241 -997 -2479 -1476 -236 -2206 -2809 -1220 -404 -2296 -2223 -107 -559 -2465 -2413 -548
1010 -548 -1439 -3243 -2336 -301 -1135 -2533 -1050 -154 -1839 -3044 -1125 -462 -2199 -2651 -263 -60 -1679
1027 -1679 -1582 178 -338 -1971 -1507 -11 -917 -1939 -685 870 -441 -1528 171 769 -1164 -1362 220
1044 220 191 -1201 -516 1203 584 -1037 -136 1163 218 -842 474 1356 343 -320 1198 1967 574
1061 574 -37 1838 1918 383 380 2188 1808 768 1408 2759 2247 1087 1591 2765 1618 590 2120 2989
1079 2989 1705 1622 3094 3020 1500 1887 2593 2670 1157 1983 3269 2837 1824 2829 3375 2497 1559 2578
1097 2578 3048 1910 1818 2857 2986 2222 2446 3018 2828 1494 1424 2916 2378 1230 2159 3124 2259 1339 2186
1116 2186 2485 1352 842 1473 1933 1119 962 2170 2167 1184 762 1386 735 -172 556 922 616 249 834 1556
$$ packed form
993b455J155J541j238j482J003J240j970o03J589Q16j892P3K116m52j906N2J865
1010e48q91j804R07K035q34j398J483Q96j685j205J919O63j737m52K388K03j619
1027a679R7J760n16j633M64J496r06j022J254J555j311j087J699N98j933j98J582
1044B20k9j392O85J719o19j621R01J299r45j060J316Q82j013o63J518P69j393
1061E74o11J875Q0j535lJ808l80j040O40J351n12j160N04J174j147j028J530Q69
1079B989j284q3J472p4j520L87P06P7j513Q26J286m32j013J005N46q78r38J019
1097B578M70j138r2J039J29p64K24N72j90j334p0J492n38j148R29R65q65r20Q47
1116B186K99j133n10O31M60q14j57J208lr83m22O24o51r07P28L66l06l67N85P22
$$ plain form
1136 1556 370 -388 217 280 -828 -1169 -155 103 -763 -832 365 -508 -1393 -1415 -946 -1531 -2016 -1484 -772
1155 -772 -1284 -1847 -1620 -1018 -2043 -2531 -2089 -1949 -2296 -2411 -1629 -1659 -2257 -2202 -1861 -2602 -3265 -2927 -2593 -3285
1175 -3285 -2766 -2272 -1795 -2648 -2979 -2299 -2357 -3322 -3517 -2430 -2218 -3038 -2508 -1835 -2106 -2682 -2798 -2644 -3094 -3447
1195 -3447 -2707 -1846 -2186 -2263 -1966 -1582 -2174 -2815 -2238 -2163 -2256 -2133 -1340 -1133 -1282 -1152 -832 -1536 -1743 -1806 -1615
1216 -1615 -1446 -1418 -115 11 -388 -612 -103 -402 -1021 -1283 -414 125 -2 288 686 746 889 603 243 175
1236 175 -176 480 864 926 1428 1635 1841 1446 1225 951 955 671 1062 1656 2161 2314 2405 2273 1923 1723 1687 1519
1258 1519 1713 2062 2350 2586 2563 2325 2818 2438 2097 1483 1638 2023 2352 2540 2698 3039 2880 2722 2249 1911
1278 1911 2040 1604 1853 2159 2772 3169 2641 2143 2224 2205 1665 1581 1406 1978 2191 2265 2321 2624 2077 1497 1383
$$ packed form
1136A556j186p58O05O3j108l41J014K58q66o9J197q73q85k2M69n85m85N32P12
1155g72n12n63K27O02j025m88M42J40l47j15P82l0n98N5L41p41o63L38L34o92
1175c285N19M94M77q53l31O80n8r65j95J087K12q20N30O73k71n76j16J54m50l53
1195c447P40Q61l40p7K97L84n92o41N77P5r3J23P93K07j49J30L20p04k07o3J91
1216a615J69K8J303J26l99k24N09k99o19k62Q69N39j27K90L98O0J43k86l60o8
1236A75l51O56L84O2N02K07K06l95k21k74Mk84L91N94N05J53R1j32l50k00l6j68
1258A519J94L49K88K36k3k38M93l80l41o14J55L85L29J88J58L41j59j58m73l38
1278A911J29m36K49L06O13L97n28m98Q1j9n40q4j75N72K13P4N6L03n47n80j14
$$ plain form
1299 1383 936 946 1383 1618 1807 1971 1883 1800 1208 837 635 262 369 652 919 923 1158 1392 532 281 51
1320 51 -117 -315 -246 -23 226 190 505 456 -161 -615 -1126 -1084 -1254 -1049 -524 -288 -204 -645 -406 -638 -1287 -1474
1342 -1474 -1764 -1700 -1521 -967 -936 -715 -1084 -1361 -1571 -2047 -2371 -2106 -1838 -1789 -1589 -1067 -1375 -1746 -1936 -1808 -2109
1363 -2109 -3006 -2420 -2322 -1552 -1690 -1732 -1220 -1820 -2533 -2515 -2721 -2706 -2836 -1949 -1596 -1790 -1875 -1669 -1772 -2370 -2697
1384 -2697 -2526 -2114 -2290 -2366 -1314 -1263 -1484 -1680 -1584 -2117 -2807 -2006 -1768 -1606 -1757 -1082 -664 -1252 -1671 -1245
1404 -1245 -1199 -2104 -1805 -1331 -751 -1069 -699 131 -392 -977 -826 -570 -982 -1053 -397 273 138 309 669 910
1424 910 -467 -384 96 -210 -549 28 1185 1266 770 1082 1274 947 207 472 1041 574 770 1839 2362 1606
1444 1606 1480 1906 1409 461 918 1623 1821 1297 2045 2825 2542 1483 1774 2191 1367 1096 2053 2381 2162
$$ packed form
1299A383m47J0M37K35J89J64q8q3n92l71k02l73J07K83K67MK35K34q60k51k30
1320E1j68j98O9K23K49l6L15m9o17m54n11M2j70K05N25K36Q4m41K39k32o49j87
1342a474k90O4J79N54L1K21l69k77k10m76l24K65K68M9K00N22l08l71j90J28l01
1363b109q97N86R8P70j38m2N12o00p13J8k06J5j30Q87L53j94q5K06j03n98l27
1384b697J71M12j76p6J052N1k21j96R6n33o90Q01K38J62j51O75M18n88m19M26
1404a245M6r05K99M74N80l18L70Q30n23n85J51K56m12p1O56O70j35J71L60K41
1424I10j377Q3M80l06l39N77J157Q1m96L12J92l27p40K65N69m67J96J069N23p56
1444A606j26M26m97r48M57P05J98n24P48P80k83j059K91M17q24k71R57L28k19
$$ plain form
1463 2162 2188 2894 2774 1963 2051 2125 1782 1299 2048 3088 2797 2235 2714 2971 1921 1393 1787 1751 1399 1884
1483 1884 2447 2885 2275 2292 2421 1897 928 815 1895 1575 1223 1987 2219 1647 1467 1407 1506 447 123 876
1503 876 1169 976 987 1647 1502 728 278 704 17 -764 -15 779 417 296 637 783 -65 -901 -515 -660
1523 -660 -1357 -1118 -226 -166 -762 -373 -113 -764 -1905 -1694 -1025 -1637 -1634 -1118 -682 -1092 -1068 -1302 -1754 -2082 -2549
1544 -2549 -1668 -1566 -1926 -1394 -906 -882 -1720 -2139 -1954 -2482 -3038 -2568 -1698 -2067 -1799 -1310 -1250 -2047 -2188 -2217 -2294
1565 -2294 -3067 -2550 -1446 -1674 -2087 -1485 -1217 -1923 -2317 -2258 -1885 -2512 -2236 -1497 -918 -1195 -1361 -1001 -1259 -2368
1585 -2368 -2453 -1702 -1243 -1466 -963 -358 -299 -984 -629 -656 -1094 -1763 -1307 -774 -792 -672 312 213 -318 -434 86
1606 86 -322 -890 -529 330 584 126 699 1104 748 -28 68 358 186 -178 1086 1403 1047 966 1404 1093 456
$$ packed form
1463B162K6P06j20q11Q8P4l43m83P49J040k91n62M79K57j050n28L94l6l52M85
1483A884N63M38o10J7J29n24r69j13J080l20l52P64K32n72j80o0R9j059l24P53
1503H76K93j93J1O60j45p74m50M26o87p81P49P94l62j21L41J46q48q36L86j45
1523f60o97K39Q92O0n96L89K60o51j141K11O69o12LN16M36m10K4k34m52l28m67
1544b549Q81J02l60N32M88K4q38m19J85n28n56M70Q70l69K68M89O0p97j41k9p7
1565b294p73N17J104k28m13O02K68p06l94N9L73o27K76P39N79k77j66L60k58j109
1585b368q5P51M59k23N03O05N9o85L55k7m38o69M56N33j8J20R84r9n31j16N20
1606H6m08n68L61Q59K54m58N73M05l56p76R6K90j72l64J264L17l56q1M38l11o37
$$ plain form
1627 456 627 839 776 396 1392 1965 1805 1672 1664 1687 874 330 1164 1492 1385 1453 2318 2130 1735 1757 1568 1542
1649 1542 688 1110 1724 1777 1649 2277 2345 1950 1227 1590 1467 871 874 1792 1749 1805 1627 2194 1841 912 1249 1321
1671 1321 802 845 1449 1853 1559 1133 1479 1749 574 349 874 1089 493 671 1374 1359 907 867 942 265 -151
1692 -151 262 405 361 399 723 940 609 -241 148 48 -736 -726 -208 -245 -232 148 671 80 -911 -781 -402 -720
1714 -720 -1096 -494 -88 -171 -655 94 -156 -976 -1521 -1154 -1174 -1295 -854 -676 -221 -701 -935 -611 -1414 -1706 -1397
1735 -1397 -1360 -1364 -1377 -817 -467 -802 -1323 -919 -1182 -1902 -1736 -1549 -1100 -997 -826 -524 -630 -1333 -1256 -1140 -1663
1756 -1663 -1702 -1345 -1000 -917 -1130 -735 -691 -1390 -1469 -1170 -1298 -1563 -1204 -929 -740 -939 -679 -487 -848 -1375 -1279
1777 -1279 -1078 -1213 -665 -653 -56 -401 -507 -474 -795 -1349 -1061 -754 -304 -483 -220 -108 279 -429 -186 -433
$$ packed form
1627D56J71K12o3l80R96N73j60j33qK3q13n44Q34L28j07O8Q65j88l95K2j89k6
1649A542q54M22O14N3j28O28O8l95p23L63j23n96LR18m3N6j78N67l53r29L37P2
1671A321n19M3O04M04k94m26L46K70j175k25N25K15n96J78P03j5m52m0P5o77m16
1692a51M13J43m4L8L24K17l31q50L89j00p84J0N18l7J3L80N23n91r91J30L79l18
1714g20l76O02M06q3m84P49k50q20n45L67k0j21M41J78M55m80k34L24q03k92L09
1735a397L7mj3N60L50l35n21M04k63p20J66J87M49J03J71L02j06p03P7J16n23
1756a663l9L57L45Q3k13L95M4o99p9K99j28k65L59K75J89j99K60J92l61n27R6
1777a279K01j35N48J2N97l45j06L3l21n54K88L07M50j79K63J12L87p08K43k47
$$ plain form
1797 -433 -751 -780 -547 -268 -247 352 358 543 -127 -174 20 -54 -361 14 710 514 782 986 899 646 -7 250
1819 250 115 93 485 1182 1110 965 1012 979 598 621 243 529 644 660 1147 1278 1063 1307 1142 1136 581 670 803
1842 803 895 1260 1287 1295 1749 1097 1074 818 746 412 1052 1439 1183 1386 1474 1438 1227 997 951 743 752 777 1070 1322
1866 1322 1041 1110 1150 1213 553 324 629 427 700 995 1021 859 732 949 487 217 244 180 335 507 406 958
1888 958 561 514 -3 -10 -54 -426 -110 36 163 295 466 357 -142 -46 -119 -454 -794 -320 -359 59 -148 -5
1910 -5 -147 -283 -518 -807 -927 -758 -911 -870 -401 -561 -454 -553 -768 -1116 -1469 -1111 -976 -1253 -658 -522 -561 -880
1932 -880 -899 -924 -1031 -1459 -1115 -1186 -1002 -793 -850 -809 -745 -824 -1015 -1030 -1225 -1449 -1007 -1103 -841 -424 -685 -997 -962
1955 -962 -1184 -1126 -1180 -1081 -709 -672 -454 -386 -386 -887 -908 -950 -588 -879 -743 -563 -316 -345 -316 -320 -648 -509 -937 -567
$$ packed form
1797d33l18k9K33K79K1N99OJ85o70m7J94p4l07L75O96j96K68K04q7k53o53K57
1819B50j35k2L92O97p2j45M7l3l81K3l78K86J15J6M87J31k15K44j65on55Q9J33
1842H03R2L65K7QM54o52k3k56p2l34O40L87k56K03Q8l6k11k30m6k08RK5K93K52
1866A322k81O9M0O3o60k29L05k02K73K95K6j62j27K17m62k70K7o4J55J72j01N52
1888I58l97m7n17pm4l72L16J46J27J32J71j09m99R6p3l35l40M74l9M18k07J43
1910ej42j36k35k89j20J69j53M1M69j60J07r9k15l48l53L58J35k77N95J36l9l19
1932h80j9k5j07m28L44p1J84K09n7M1O4p9j91j5j95k24M42r6K62M17k61l12L5
1955i62k22N8n4R9L72L7K18O8%n01k1m2L62k91J36J80K47k9K9ml28J39m28L70
$$ plain form
1979 -567 -272 -460 -255 147 383 377 -226 -236 -399 -222 -508 -117 69 333 334 88 402 377 247 153 154 -37 561
2002 561 450 560 883 836 501 385 276 316 812 447 657 824 802 917 1124 800 700 205 499 575 527 816
2024 816 926 1091 989 842 606 485 326 598 730 890 792 997 1072 854 849 685 672 391 547 570 815 564
2046 564 991 952 803 473 831 54 306 605 569 549 561 961 747 435 456 322 28 177 224 616 465 466 480
2069 480 696 319 -358 420 71 -80 -183 272 158 448 -223 38 105 -360 -354 -365 -269 -125 0 52 -13 37 -72
2092 -72 -233 -182 -633 -304 -492 -248 -181 -237 127 -156 -226 -452 -499 -514 -640 -636 -426 -353 -334 -123 -266 -636 -827 -794
2116 -794 -712 -355 -762 -400 -380 -387 -441 -310 -697 -625 -374 -687 -602 -527 -263 -216 -323 -443 -370 -493 -534 -582 -487 -665
2140 -665 -355 -206 -14 -141 -491 -262 -603 -784 -717 -506 -279 -355 72 88 -417 -382 -352 -318 -498 -360 -275 -465
$$ packed form
1979e67K95j88K05M02K36oo03j0j63J77k86L91J86K64Jk46L14k5j30r4Jj91N98
2002E61j11J10L23m7l35j16j09M0M96l65K10J67k2J15K07l24j00m95K94P6m8K89
2024H16J10J65j02j47k36j21j59K72J32J60r8K05P5k18nj64j3k81J56K3K45k51
2046E64M27l9j49l30L58p77K52K99l6k0J2M00k14l12K1j34k94J49M7L92j51JJ4
2069D80K16l77o77P78l49j51j03M55j14K90o71K61O7m65Oj1R6J44J25N2o5N0j09
2092g2j61N1m51L29j88K44O7n6L64k83p0k26m7j5j26MK10P3J9K11j43l70j91L3
2116g94Q2L57m07L62K0pn4J31l87P2K51l13Q5P5K64M7j07j20P3j23m1m8R5j78
2140f65L10J49J92j27l50K29l41j81O7K11K27p6M27J6n05L5L0L4j80J38Q5j90
$$ plain form
2162 -465 -73 80 -202 -229 -216 -253 -195 -413 -512 166 -47 -6 19 102 44 -258 -142 -343 -251 -250 -132 135 237 282
2186 282 265 204 -184 114 -401 73 206 165 230 -12 557 144 329 218 187 26 281 434 558 365 606 415
2208 415 349 318 89 -84 209 303 253 638 580 591 609 242 223 299 336 -91 372 647 1042 629 336 660 466
2231 466 290 346 380 488 518 394 581 291 668 434 373 325 229 290 279 681 622 610 620 402 273 260 10 395
2255 395 519 96 276 432 393 354 577 100 -151 145 118 45 236 337 285 60 91 -61 381 -142 -122 -194 71
2278 71 267 255 119 71 -233 10 35 -104 -279 -205 41 26 52 -7 -64 0 -102 -220 -514 -353 -340 -375 139 -169
2302 -169 206 -255 -200 -178 -566 -410 -596 -238 -189 -419 -233 -416 -577 -360 -406 -434 -646 -437 -345 -403 145 -193
2324 -193 -385 -435 -545 -547 -565 -302 -168 -109 -429 -174 11 -198 -613 -511 -329 -635 -241 -152 -177 -34 -437 -290
$$ packed form
2162d65L92J53k82k7J3l7N8k18r9O78k13M1K5Q3n8l02J16k01R2JJ18K67J02M5
2186B82j7o1l88K98n15M74J33m1O5k42N69m13J85j11l1j61K55J53J24j93K41j91
2208D15o6l1k29j73K93R4n0L85n8J1J8l67j9P6L7m27M63K75L95m13k93L24j94
2231D66j76N6L4J08L0j24J87k90L77k34o1m8r6O1j1M02n9j2J0k18j29j3k50L85
2255C95J24m23J80J56l9l9K23m77k51K96k7p3J91J01n2k25L1j52M42n23K0p2K65
2278G1J96j2j36m8l04K43K5j39j75P4K46j5K6n9n7O4j02j18k94J61J3l5N14l08
2302a69L75m61N5K2l88J56j86L58M9k30J86j83j61K17m6k8k12K09R2n8N48l38
2324a93j92n0j10kj8K63J34N9l20K55J85k09m15J02J82l06L94Q9k5J43m03J47
$$ plain form
2346 -290 -244 -258 -401 -331 15 -710 -446 9 -112 -242 -48 -171 -468 -88 164 -51 -352 82 227 80 -113
2367 -113 -151 -42 -289 -85 -88 71 221 233 424 139 216 -9 -61 -77 -215 128 178 119 213 490 367 165 292
2390 292 245 -68 221 11 530 641 364 164 336 298 149 195 112 458 226 23 541 411 262 280 323 352
2412 352 357 394 453 249 289 605 208 420 330 252 288 18 311 91 328 58 54 494 338 2 -309 -213 -140 197
2436 197 49 69 61 252 -101 -181 57 82 153 -59 -129 246 199 135 59 286 -169 -206 56 -94 -236 -83 125 274
2460 274 240 -38 148 11 -121 -252 -70 164 216 56 59 62 -180 -196 -238 -279 -75 -279 -218 -208 29 18 -91 -339
2484 -339 7 -6 -238 -133 -268 -215 34 -167 83 -3 -93 -369 -91 1 -461 50 -60 -35 -221 -163 -210 257 -185
2507 -185 -147 -189 -246 -93 24 -134 -349 -151 -210 -264 11 -61 -84 117 -15 -264 67 -141 -267 -14 36 -240 -264
$$ packed form
2346b90M6j4j43P0L46p25K64M55j21j30J94j23k97L80K52k15l01M34J45j47j93
2367a13l8J09k47K04lJ59J50J2J91k85P7k25n2j6j38L43N0n9R4K77j23k02J27
2390B92m7l13K89k10N19J11k77k00J72l8j49M6q3L46k32k03N18j30j49J8M3K9
2412C52NL7N9k04M0L16l97K12r0p8L6k70K93k20K37k70mM40j56l36l11R6P3L37
2436A97j48K0qJ91l53q0K38K5P1k12p0L75m7o4p6K27m55l7K62j50j42J53K08J49
2460B74l4k78J86j37j32j31J82K34N2j60LLk42j6m2m1K04k04O1J0K37j1j09k48
2484c39L46j3k32J05j35N3K49k01K50q6r0k76K78R2m62N11j10K5j86N8m7M67m42
2507a85L8m2n7J53J17j58k15J98n9n4K75p2k3K01j32k49L31k08j26K53N0k76k4
$$ plain form
2530 -264 -464 198 -71 -35 222 125 -248 -277 -134 -272 -184 -107 -39 -17 132 60 -37 -24 -179 -20 -300 -364 -120 103
2554 103 82 123 -70 -161 -82 -3 -326 103 -178 -103 -32 -51 -164 -106 83 -109 -130 -80 218 -28 -95 -65 -15 -58 232
2579 232 194 12 -243 -96 211 -90 -71 293 -86 -7 178 -158 63 -34 223 -389 -72 -113 6 -107 -61 192
2601 192 -11 5 2 47 -70 231 414 -12 12 22 105 -145 -132 -171 46 62 16 138 -85 227 272 -78 152 -169
2625 -169 -49 76 -92 -43 -258 177 148 258 125 165 113 20 17 232 241 224 92 176 102 157 128 331 147 337 219
2650 219 185 243 -231 -30 262 321 99 212 42 -129 -149 300 224 -110 45 -30 74 115 12 -71 326 97 42
2673 42 5 -9 331 -32 102 38 52 295 -12 36 138 318 -74 24 137 26 -271 -204 270 320 -58 -241 156
2696 156 -168 -150 -209 -311 145 7 -12 122 -205 93 -13 160 -217 57 -126 100 -101 36 71 65 -137 -417
$$ packed form
2530b64k00O62k69L6K57r7l73k9J43j38Q8P7O8K2J49p2r7J3j55J59k80o4K44K23
2554A03k1M1j93r1P9P9l23M29k81P5P1j9j13N8J89j92k1N0K98k46o7L0N0m3K90
2579B32l8j82k55J47L07l01J9L64l79P9J85l36K21r7K57o12L17m1J19j13M6K53
2601A92k03J6lM5j17L01J83m26K4J0Q3k50J3l9K17J6m6J22k23L12M5l50K30l21
2625a69J20J25j68M9k15M35k9J10j33M0n2r3lK15Rj7j32Q4p4N5k9K03j84J90j18
2650B19l4N8m74K01K92N9k22J13j70j71k0M49p6l34J55p5J04M1j03q3L97k29n5
2673D2l7j4L40l63J34o4J4K43l07M8J02J80l92R8J13j11k97O7M74N0l78j83L97
2696A56l24J8n9j02M56j38j9J34l27K98j06J73l77K74j83K26k01J37L5ok02k80
$$ plain form
2718 -417 60 -103 67 -121 -290 -93 -74 2 -121 -165 40 -424 -2 -328 44 55 -49 -304 -166 6 -177
2739 -177 -254 -103 -167 47 -437 -190 320 -150 -127 -296 236 -226 5 -261 -174 189 -21 18 190 -122 -25 -22 -15
2762 -15 94 -223 -337 79 113 150 -108 13 -97 29 201 -155 -155 -201 87 7 174 -195 -25 25 -96 105 -20
2785 -20 -164 175 144 27 15 -97 -125 106 -167 60 -171 50 190 -29 -230 86 43 14 19 21 -67 54 104 7
2809 7 270 -187 -142 -127 -140 130 -308 -28 168 -122 15 17 136 254 131 -91 91 195 41 -23 172 122 202
2832 202 98 -9 214 121 -78 168 234 -140 158 288 -243 201 -44 74 -126 -34 132 96 173 -32 25 -149
2854 -149 84 51 474 85 -10 257 44 209 -103 -80 16 -122 119 272 -134 -30 -171 -43 29 16 -58 -29 174
2877 174 241 -165 296 160 73 226 198 -61 -49 99 -10 -80 -140 174 98 55 29 190 -38 -50 -71 349 285 -207
$$ packed form
2718d17M77j63J70j88j69J97J9P6j23m4K05m64M22l26L72J1j04k55J38J72j83
2739a77p7J51o4K14m84K47N10m70K3j69N32m62K31k66Q7L63k10L9J72l12R7LP
2762a5J09l17j14M16L4L7k58J21j10J26J72l56%m6K88q0J67l69J70N0j21K01j25
2785b0j44L39l1j17j2j12k8K31k73K27k31K21J40k19k01L16m3k9NKq8J21N0r7
2809GK63m57M5J5j3K70m38K80J96k90J37KJ19J18j23k22J82J04j54o4J95n0Q0
2832B02j04j07K23r3j99K46O6l74K98J30n31M44k45J18k00R2J66l6P7k05N7j74
2854a49K33l3M23l89r5K67k13J65l12K3R6j38K41J53m06J04j41J28P2j3p4K9K03
2877A74O7m06M61j36q7J53k8k59J2J48j09p0o0L14p6m3k6J61k28j2k1M20o4m92
$$ plain form
2901 -207 -105 -117 174 284 -282 19 106 -228 61 -133 -66 34 124 111 18 20 -294 141 -172 105 350 -166 74
2924 74 -96 -94 240 -141 -12 36 -121 185 26 -55 87 -17 126 234 176 30 62 -156 5 -264 -256 -188 38
2947 38 -185 -69 -45 244 -355 -13 -287 -327 -431 -241 75 -357 -118 242 -159 51 -85 163 5 -254 -215
2968 -215 -405 -241 -250 -136 1 -232 -245 9 -120 -27 -301 105 -176 92 -244 32 -209 -128 -133 -111 -198 91 -210
2991 -210 123 125 42 -115 70 -305 -228 19 52 -65 -81 -51 17 16 -36 -104 140 53 -18 -24 13 -102 8 109 -83 -149
3017 -149 6 6 154 -172 -141 216 15 122 130 211 177 -27 20 138 -2 -26 0 242 51 182 145 3 179 321
3041 321 61 159 -111 -32 293 9 357 106 136 61 227 -25 251 177 43 318 307 60 178 82 77 200 -86
3064 -86 -3 462 225 394 545 63 160 430 283 -94 41 46 304 53 34 -169 90 290 -40 -262 209 79
$$ packed form
2901b07J02j2K91J10n66L01Q7l34K89j94O7J00R0j3r3Kl14M35l13K77K45n16K40
2924G4j70KL34l81J29M8j57L06j59q1J42j04J43J08n8j46L2k18J61k69QO8K26
2947C8k23J16K4K89n99L42k74m0j04J90L16m32K39L60m01K10j36K48j58k59L9
2968b15j90J64rJ14J37k33j3K54j29R3k74M06k81K68l36K76k41Q1nK2q7K89l01
2991b10L33Kq3j57J85l75P7K47L3j17j6L0O8jn2o8K44q7p1oL7j15J10J01j92o6
3017a49J55%J48l26L1L57k01J07QQ1l4k04M7J18j40k4K6K42j91J31l7j42J76J42
3041C21k60R8k70P9L25k84L48k51L0p5J66k52K76p4j34K75j1k47J18r6nJ23k86
3064h6Q3M65k37J69J51m82R7K70j47l77J35NK58k51j9k03K59K00l30k22M71j30
$$ plain form
3086 79 -143 -4 67 95 59 71 231 156 -161 49 144 227 112 2 -127 -76 -32 -60 -65 -59 -310 -125 226 -183 -11
3111 -11 -112 -292 -102 -42 -72 -25 64 67 -304 -100 -10 253 8 71 -86 23 -158 -224 -175 -147 -1 -72 -41 7 8 -80
3137 -80 -240 -318 26 -35 -16 -123 -304 65 -200 -192 -277 35 -261 -188 -13 -48 -111 -20 -254 -281 43 -44 0 -239 -31
3162 -31 -247 -58 -20 58 23 -101 -109 -388 0 -59 80 51 -245 -192 -236 4 110 -49 23 218 -215 178 30 65
3186 65 -34 -171 -95 144 -52 -146 50 -4 34 -252 53 103 -96 -35 -73 101 61 -93 180 163 50 -147 37 -308
3210 -308 -129 -214 33 -8 -55 -64 -96 -196 104 61 192 153 -33 92 43 -93 110 -38 170 415 234 190 -33
3233 -33 134 -22 66 -165 76 -45 232 -123 155 18 76 -105 77 65 46 -143 186 269 -66 2 217 149 274
3256 274 -123 216 163 -122 136 -144 -81 87 19 -74 -88 -56 56 -186 86 91 -12 42 371 119 -191 49 259
$$ packed form
3086G9k22J39P1K8l6J2J60p5l17K10R5Q3j15j10j29N1M4k8nOk51J85L51m09J72
3111a1j01j80J90O0l0M7Q9Ll71K04R0K63k45O3j57J09j81o6M9K8J46p1L1M8Jq8
3137h0j60p8L44o1J9j07j81L69k65Qq5L12k96P3J75l5o3R1k34k7L24q7M4k39K08
3162c1k16J89L8P8l5j24qk79L88n9J39k9k96N3m4K40J06j59P2J95m33L93j48L5
3186F5r9j37P6K39j96r4J96n4L8k86L05N0j99O1l8J74m0j54K73j7j13j97J84l45
3210c08J79q5K47m1m7rl2j00L00m3J31l9j86J25m9j36K03j48K08K45j81m4k23
3233c3J67j56Q8k31K41j21K77l55K78j37N8j81J82j2j9j89L29Q3l35O8K15o8J25
3256B74l97L39n3k85K58k80O3J68o8r3j4L2J12k42K72Nj03N4L29k52l10K40K10
$$ plain form
3279 259 -217 109 -32 -98 171 -137 191 114 271 61 -305 89 178 78 -49 258 0 -45 5 397 -20 -61
3301 -61 -238 -62 37 178 28 151 184 -259 -146 -301 165 52 -40 -117 -339 284 -91 10 171 59 177 -271
3323 -271 171 -106 -189 -233 97 -326 -201 -110 -133 -47 -182 -57 153 242 -33 -251 -331 115 -145 -379 170 -136
3345 -136 149 -253 23 -43 197 -58 -61 21 -65 -144 -153 -249 -352 245 -400 10 -136 211 -117 235 -377 -70 -26
3368 -26 -120 57 -211 151 -141 -257 7 -13 -254 80 -30 -374 -76 -242 -126 -58 28 -67 91 -69 -113 163
3390 163 16 -10 -115 -130 106 -118 -218 -250 83 138 111 65 113 -96 380 -168 118 136 -84 -3 24 236 80
3413 80 109 49 -72 -276 -25 121 108 -138 197 -105 322 -2 245 203 42 45 -154 48 -65 88 218 66
3435 66 -33 -132 27 144 -128 116 193 355 134 -44 393 190 211 -50 38 93 47 -102 281 218 -1 55 156
$$ packed form
3279B59m76L26j41o6K69l08L28p7J57k10l66L94Q9j00j27L07k58m5N0L92m17m1
3301f1j77J76R9J41j50J23L3m43J13j55M66j13r2p7k22O23l75J01J61j12J18m48
3323b71M42k77q3m4L30m23J25R1k3Q6j35J25K10Q9k75k18q0M46k60k34N49l06
3345a36K85m02K76o6K40k55lQ2q6p9rr6j03N97o45M10j46L47l28L52o12L07M4
3368b6r4J77k68L62k92j16K64k0k41L34j10l44K98j66J16O8Q6r5J58j60m4K76
3390A63j47k6j05j5K36k24j00l2L33N5k7m6M8k09M76n48K86J8k20Q1K7K12j56
3413H0K9o0j21k04K51J46j3k46L35l02M27l24K47m2j61Lj99K02j13J53J30j52
3435F6r9r9J59J17k72K44P7J62k21j78M37k03K1k61Q8N5m6j49L83o3k19N6J01
$$ plain form
3458 156 165 289 167 210 -99 -43 163 82 -177 -248 125 17 89 148 183 250 -214 133 -31 38 -154 -279 95 161
3482 161 -257 58 263 -133 8 -289 -12 -68 -189 -64 64 171 -355 -78 -251 4 264 -32 -140 24
3502 24 -129 -42 202 -28 -109 -191 62 -231 4 -50 -233 152 -118 -225 -147 -95 -151 74 -292 -230 133 -70 4
3525 4 -244 -194 -34 -55 -38 -139 -107 -133 -167 -429 -19 256 -237 -351 -224 34 -33 -251 -41 -161 -446 -184 220
3548 220 -11 -321 -17 4 -71 -49 9 -22 41 -61 -138 -64 -66 45 -144 -132 -10 101 -6 -35 94 101 -13 301 22
3573 22 48 -101 48 196 275 -151 -105 90 -140 -19 155 16 280 110 98 32 101 135 -2 -386 92 -247 -193
3596 -193 297 -217 -77 68 -64 -184 42 -25 -61 -280 -303 -116 -92 30 -208 178 -53 159 -381 36 41 118
3618 118 -66 88 10 -145 -420 79 -134 21 -112 201 -46 -82 6 -180 -30 128 118 74 -260 -37 1 -179
$$ packed form
3458A56RJ24j22M3l09N6K06q1k59p1L73j08P2N9L5O7m64L47j64O9j92j25L74O6
3482A61m18L15K05l96J41k97K77n6j21J25J28J07n26K77j73K55K60k96j08J64
3502B4j53Q7K44k30q1q2K53k93K35n4j83L85k70j07P8N2n6K25l66O2L63k03P4
3525Dk48N0J60k1J7j01L2k6l4k62M10K75m93j14J27K58o7k18K10j20k85K62M04
3548B20k31l10L04K1p5K2N8l1O3j02p7P4kJ11j89J2J22J11j07k9J29Pj14L14k79
3573B2K6j49J49J48P9m26M6J95k30J21J74j39K64j70j2o6O9L4j37l84M78l39N4
3596a93M90n14J40J45j32j20K26o7l6k19k3J87K4J22k38L86k31K12n40M17NP7
3618A18j84J54p8j55k75M99k13J55j33L13k47l6Q8j86J50J58j0m4l34K23L8j80
$$ plain form
3640 -179 72 102 98 88 -112 -25 250 194 -17 -81 -108 -235 115 312 -114 -97 -1 -66 421 -35 87 -83 17 -71
3664 -71 67 0 -65 72 -442 345 87 195 -97 40 35 108 -8 4 99 39 71 108 -64 -171 10 -31 -111 87
3688 87 -77 -122 -59 145 -133 -86 129 -255 258 -83 130 306 185 58 -198 -71 60 -287 145 -47 -145 98
3710 98 201 -109 156 253 95 -53 -196 -101 -113 -159 -64 -95 114 -81 -109 -238 -150 56 -74 -55 30 -127 161 -92
3734 -92 -355 252 194 -26 153 -92 227 -90 256 66 -143 59 -35 118 186 98 123 38 -252 -153 130 -147 86
3757 86 224 -68 -58 151 -10 -108 -37 7 -52 122 -45 36 -85 -17 -5 183 -181 86 64 -39 28 -20 151 281
3781 281 152 183 29 -20 -254 -45 204 131 236 -179 219 -57 150 -382 -45 -172 -176 56 139 -274 -255 67
3803 67 -74 130 -194 187 205 27 24 -31 -206 -22 4 283 -22 28 -118 -47 298 27 80 -147 298 -146 -225
$$ packed form
3640a79K51L0mj0k00Q7K75n6k11o4k7j27L50J97m26J7R6o5M87m56J22j70J00q8
3664g1J38o7o5J37n14P87k58J08k92J37nP3j16J2R5o0L2L7j72j07J81m1q0J98
3688H7j64m5O3K04k78M7K15l84N13l41K13J76j21j27k56J27J31l47M32j92r8K43
3710I8J03l10K65R7j58j48j43R5j2m6R5l1K09j95k8j29Q8K06j30J9Q5j57K88k53
3734i2k63O07n8k20J79k45L19l17L46j90k09K02r4J53O8q8K5q5k90R9K83k77K33
3757H6J38k92J0K09j61r8P1M4n9J74j67Q1j21O8J2J88l64K67k2j03O7m8J71J30
3781B81j29L1j54m9k34K09K49p3J05m15L98k76K07n32L37j27mK32Q3m13J9L22
3803F7j41K04l24L81J8j78ln5j75J84K6K79l05N0j46P1L45k71N3k27M45m44p9
$$ plain form
3826 -225 120 23 -76 -32 29 -92 115 104 190 -39 233 306 -142 227 -75 -6 119 -205 95 213 27 -136 -55
3849 -55 174 -77 0 -34 -32 124 -113 -258 157 -98 96 -20 9 -80 276 -9 -120 203 -143 -112 -93 108 19
3872 19 347 -182 170 -45 -230 194 -66 -129 226 41 177 133 -29 -82 -240 -236 -271 -67 -187 287 148 147 -124
3895 -124 -123 -65 -34 -122 -123 165 -111 -116 -32 -40 157 -147 78 82 156 -155 -186 68 -178 17 -199 -36 94 -115 184
3920 184 -94 -69 144 269 -30 -393 41 168 -238 90 527 104 357 -9 -11 -169 81 -118 43 -87 -101
3941 -101 -83 -147 -107 5 -132 -252 -156 -87 45 -66 65 247 -36 63 10 -85 -260 201 67 410 -318 -80 -51
3964 -51 -281 -312 58 -14 -46 -135 -20 68 66 -64 -286 -204 256 25 89 -322 26 -193 -257 72 -9 164 -71 136
3988 136 -65 -59 271 59 129 69 -230 275 -76 163 -144 -115 -134 -114 -9 41 -22 159 -118 -210 -153 190 23 83
$$ packed form
3826b25L45r7r9M4O1j21K07j1Q6k29K72P3m48L69l02O9J25l24L00J18j86j63Q1
3849e5K29k51P7l4KJ56k37j45M15k55J94j16K9q9L56k85j11L23l46L1J9K01q9
3872A9L28n29L52k15j85M24k60o3L55j85J36m4j62n3j58Ml5K04j20M74j39jk71
3895a24JN8L1q8jK88k76nQ4qJ97l04K25MP4l11l1K54k46J95k16J63J30k09K99
3920A84k78K5K13J25k99l63M34J27m06L28M37m23K53l66kj58K50j99J61j30j4
3941a01J8o4M0J12j37j20R6O9J32j11J31J82k83R9n3r5j75M61j34L43p28K38K9
3964e1k30l1L70p2l2q9J15Q8kj30k22Q2M60k31O4m11L48k19o4L29q1J73k35K07
3988A36k01OL30k12P0o0k99N05l51K39l07K9j9K0J05N0o3J81k77r2N7L43j67O0
$$ plain form
4012 83 -59 -14 49 111 -425 -155 -317 -130 13 -148 64 -277 163 64 184 -96 266 -176 -303 225 -108 -54
4034 -54 81 90 -199 130 -186 -81 -62 -79 -27 189 -56 -61 481 -106 180 -120 170 335 215 -62 54 -65 -117
4057 -117 129 -228 -160 -79 -133 -102 -7 84 -360 -215 93 -71 51 20 37 -228 -45 -108 44 35 134 -315 -53 -48 151
4082 151 -74 -159 -174 7 144 160 166 366 156 -8 -249 47 131 43 -55 -210 122 44 123 144 23 227 242 -20
4106 -20 -93 -247 172 152 -160 -148 323 175 95 146 -115 -44 0 80 -244 -129 33 157 137 -194 -55 -184 309
4129 309 72 17 -126 197 213 10 -56 -219 -86 163 -36 -13 -117 224 130 -221 -57 -134 232 68 228 -316
4151 -316 14 96 -43 -105 -96 191 168 -38 -76 -130 -144 -138 -143 -144 57 -104 -70 -127 149 -177 35 161 -133 -217 106 102
4177 102 147 -112 114 66 103 -26 -125 5 251 279 -146 5 80 -189 -4 17 68 228 -16 130 -46 63 91
$$ packed form
4012H3j42M5O3O2n36K70j62J87J43j61K12l41M40r9J20k80L62m42j27N28l33N4
4034e4J35Rk89L29l16J05J9j7N2K16k45nN42n87K86l00K90J65j20k77J16j19n2
4057a17K46l57O8Q1n4L1R5R1m44J45L08j64J22l1J7k65J83o3J52rR9m49K62NJ99
4082A51k25q5j5J81J37J6OK00k10j64k41K96Q4q8r8j55L32p8P9K1j21K04J5k62
4106b0p3j54M19k0l12J2M71j48q0N1k61P1M4Q0l24J15J62J24k0l31J39j29M93
4129C09k37n5j43L23J6k03o6j63J33K49j99K3j04L41r4l51J64p7L66j64J60n44
4151c16L30Q2j39o2RK87k3k06l8n4j4OnjK01j61L4n7K76l26K12J26k94q4L23m
4177A02M5k59K26m8L7j29r9J30K46K8m25J51P5k69J85K1N1J60k44J46j76J09K8
$$ plain form
4200 91 -244 183 216 161 13 84 84 -140 -166 -97 -175 -212 -205 52 -110 -129 204 -91 322 -328 26 -250 -142 135
4224 135 -37 243 7 53 21 198 -24 -6 150 123 -256 69 -105 87 -157 -194 270 181 -75 -15 -5 55 -100
4247 -100 -17 72 55 78 -36 25 11 -26 193 49 -279 -201 14 103 16 -74 -48 69 18 29 135 -156 -7 186 66
4272 66 42 42 -160 -175 290 -93 81 152 -34 -291 -73 -67 -187 -68 -383 110 -9 -102 -131 -131 58 4 83 -18 135
4297 135 -334 296 95 122 -51 127 -17 0 128 -135 30 -106 91 -38 169 52 -260 247 -37 54 92
4318 92 31 277 -153 70 -134 142 113 -71 17 -49 -106 -222 -155 68 -153 279 70 9 257 -185 -152 -10 103
4341 103 -130 135 165 -89 176 73 156 -12 -146 -19 34 63 -201 -350 -170 204 -97 -168 177 96 215 89
4363 89 341 100 -89 -56 -126 178 -9 -7 125 289 6 136 -30 490 -234 33 26 -158 -210 277 -129 -126 8
$$ packed form
4200I1l35M27L3n5j48P1%k24k6O9p8l7PK57j62j9L33k95M13o50L54k76J08K77
4224A35j72K80k36M6l2J77k22J8J56k7l79L25j74J92k44l7M64q9k56O0J0O0j55
4247a00Q3Q9j7K3j14O1j4l7K19j44l28P8K15Q9q7r0K6J17n1J1J06k91J49J93j20
4272F6k4%k02j5M65l83J74P1j86k57K18Oj20J19l15M93j19r3k9%J89n4P9j01J53
4297A35m69O30k01K7j73J78j44J7J28k63J65j36J97j29K07j17l12N07k84R1L8
4318I2o1K46m30K23k04K76k9j84Q8o6n7j16O7K23k21M32k09o1K48m42L3J42J13
4341A03k33K65L0k54K65j03Q3j68j34J27N3K9k64j49J80L74l01p1L45q1J19j26
4363H9K52k41j89L3p0L04j87KJ32J64k83J30j66N20p24K67pj84n2M87m06LJ34
$$ plain form
4386 8 296 -277 -36 -200 252 66 -88 -16 -66 61 -184 -29 134 31 -106 -22 40 113 -131 -34 75 33 32 -47
4410 -47 -173 141 -112 66 116 251 215 -98 -16 -57 -183 -4 -16 -272 270 -94 -212 -77 62 10 109 204 18
4433 18 -88 56 114 -29 5 -60 146 -32 -59 -266 -118 154 102 10 -112 -69 0 -165 -218 -35 238 133 218 -24
4457 -24 -39 -208 -176 110 52 56 21 -12 -104 180 271 269 237 -22 187 -34 -42 -37 -16 46 -107 -190 22 91 -49 12 153
4484 153 61 163 56 -56 -158 -347 113 -239 -20 213 -169 -124 265 -67 -301 -98 244 -7 -83 15 -171
4505 -171 -249 53 88 103 -83 20 -26 -77 -62 -123 -288 -40 -192 -110 -246 78 31 -168 -184 -30 110 269 43
4528 43 -154 -205 -64 -209 -150 17 -44 193 -88 -7 132 -107 116 -138 14 -82 15 -57 -173 -115 -26 -117 -420 -96
4552 -96 -263 102 -59 -65 106 29 -279 56 -132 -383 -421 93 109 -182 -53 6 209 -142 56 -151 61 -41
$$ packed form
4386HK88n73K41j64M52j86j54P2n0J27k45J55J63j03j37Q4O2P3k44R7J09m2jp9
4410d7j26L14k53J78N0J35l6l13Q2m1j26J79j2k56N42l64j18J35J39n2R9R5j86
4433A8j06J44N8j43L4o5K06j78k7k07J48K72n2r2j22M3O9j65n3J83K73j05Q5k42
4457b4j5j69L2K86n8Ml5l3r2K84R1kl2k59K09k21qNK1O2j53q3K12O9j40O1J41
4484A53r2J02j07j12j02j89M60l52K19K33l82M5L89l32k34K03L42k51p6R8j86
4505a71p8L02L5J5j86J03m6n1J5o1j65K48j52Q2j36L24m7j99j6J54J40J59k26
4528D3j97n1J41j45N9J67o1K37k81Q1J39k39K23k54J52r6R7p2j16N8Q9r1l03L24
4552i6j67L65j61oJ71p7l08L35j88k51l8N14J6k91J29N9K03l51J98k07K12j02
$$ plain form
4574 -41 -158 -17 -27 -172 -120 -19 2 389 115 -14 -12 97 66 -97 -116 162 11 9 -82 54 -185 1 262 70
4598 70 -70 127 -139 232 -103 -261 54 -40 140 17 213 -318 93 -47 206 135 258 -176 154 115 26 -9
4620 -9 94 -269 7 -100 101 13 -7 -57 117 233 -9 -46 -22 64 -124 36 -56 182 152 179 75 54 -43 204
4644 204 16 219 -136 454 112 88 189 167 7 63 27 -7 -58 196 -100 -52 64 45 -42 -74 -227 84 37 -53
4668 -53 -180 -40 -165 -81 -76 -126 281 23 -53 73 -32 -172 -38 62 60 -106 -213 139 -15 232 -140 -160 -59
4691 -59 239 159 48 63 132 13 226 355 102 153 -103 96 63 -115 -8 -63 -80 54 -87 4 95 97 -12 -137
4715 -137 -243 -6 -258 15 42 -126 69 129 138 163 -206 -155 33 56 -182 -256 -4 -189 11 239 -15 -48 90
4738 90 -127 -319 102 -163 203 115 -76 -75 -102 -164 8 11 108 47 143 143 -10 -44 -131 9 -178 -76 -254 -86 -58
$$ packed form
4574d1j17J41j0j45N2J01K1L87k74j29KJ09l1j63j9K78j51kr1J36k39J86K61j92
4598G0j40J97k66L71l35j58L15r4J80j23J96n31M11j40K53p1J23m34L30l9q9l5
4620iJ03l63K76j07K01q8k0n0J74J16k42l7K4Q6j88J60r2K38l0K7j04k1r7K47
4644B04j88K03l55N90l42k4J01k2j60N6l6l4n1K54k96M8J16j9q7l2j53L11m7r0
4668e3j27J40j25Q4Nn0M07k58p6J26j05j40J34J00kj66j07L52j54K47l72k0J01
4691e9K98q0j11J5O9j19K13J29k53N1k56J99l3j78J07n5j7J34j41R1R1Kj09j25
4715a37j06K37k52K73K7j68J95O0RK5l69N1J88K3k38p4K52j85K00K28k54l3J38
4738I0k17j92M21k65L66q8j91Jk7o2J72LR7o1R6%j53l4q7J40j87J02j78J68K8
$$ plain form
4763 -58 -149 -11 50 91 66 -78 278 -64 3 46 9 153 109 -43 -6 -75 71 216 1 -103 189 183 43 167
4787 167 60 57 122 -74 -163 -80 56 55 235 -130 121 -105 36 -183 -47 -108 -112 -23 -62 63 -212 -93 -64 6 -207
4812 -207 34 288 -82 -1 -355 116 -116 147 34 -204 -128 -2 -57 30 -10 187 -191 -121 139 -157 371 -77
4834 -77 -97 -244 -58 -73 69 -156 -46 210 -331 -182 -125 98 27 -78 -285 276 -15 98 -55 62 -136 84
4856 84 -49 -187 -57 92 -127 160 164 -309 87 -90 111 29 -45 -6 -191 -116 -1 143 -249 14 141 -135
4878 -135 6 127 2 -166 -56 41 125 -283 67 90 -13 -211 291 111 -54 55 120 75 -27 -34 301 38
4900 38 -229 -54 122 211 -291 -227 115 -343 -30 47 -44 249 145 -53 -19 159 -150 -136 -94 103 -98 -67 -12
4923 -12 -251 -91 -70 226 -46 -63 146 172 -167 -89 28 -129 193 -90 171 -32 -210 -143 -13 -90 35 81 550
$$ packed form
4763e8r1J38O1M1k5j44L56l42O7M3l7J44m4j52L7o9J46J45k15j04K92oj40J24
4787A67j07lO5j96q9Q3J36jJ80l65K51k26J41k19J36o1mQ9l9J25k75J19K9P0k13
4812b07K41K54l70Q1l54M71k32K63j13k38P6J26n5Q7m0J97l78P0K60k96N28m48
4834g7k0j47J86j5J42k25J10K56n41J49N7K23p1j05k07N61k91J13j53J17j98K20
4856H4j33j38J30J49k19K87Mm73L96j77K01q2p4L9j85P5J15J44l92K63J27k76
4878a35J41J21j25j68J10R7Q4m08L50K3j03j98N02j80j65J09O5m5j02pL35k63
4900C8k67J75J76Q9n02O4L42m58L13P7r1K93j04j98L4J78l09J4M2J97k01L1N5
4923a2k39J60K1K96k72j7K09K6l39P8J17j57L22k83K61k03j78O7J30p7J25M6M69
$$ plain form
4946 550 -148 -234 -60 -12 -6 0 124 -226 3 50 -236 144 -64 13 -170 -4 -78 -188 -172 36 -79 145 -111
4969 -111 -178 72 -68 112 -74 -103 -4 -95 -468 324 115 -138 -239 -170 -124 -71 -362 -129 -9 59 -154 -68 44
4992 44 -10 83 -56 -97 37 210 57 52 120 -149 -53 -97 236 77 112 37 -96 218 -85 -248 -73 111 -16 86
5016 86 -100 202 56 -244 28 -140 3 231 192 -21 -56 172 27 -75 -22 194 -284 96 125 371 14 155
5038 155 -55 -36 -188 -110 -84 -166 182 138 -151 280 163 -163 23 -114 -261 86 150 176 -49 -27 -161 -210 182
5061 182 111 77 214 -154 -148 -406 -76 -230 -283 56 -80 -5 -48 -86 9 14 75 -174 -29 -457 -42 307 173 -178
5085 -178 -131 -280 16 -121 -84 274 178 -47 65 -93 -217 26 102 47 107 -335 -102 119 -94 21 -120 -186
5107 -186 191 -109 0 -61 -124 91 -237 -177 -204 -136 -96 -82 259 14 137 324 -20 42 -222 -188 -197 -45 -227 390
$$ packed form
4946E50o98q6J74M8OOJ24l50K29M7k86L80k08P7j83J66p4j10J6K08j15K24k56
4969a11o7K50j40J80j86k9R9r1l73P92k09k53j01O9M6N3k91K33J20O8k13Q6J12
4992D4n4R3j39m1J34J73j53nO8k69R6m4L33j59L5p5j33L14l03j63J75J84j27J02
5016H6j86L02j46l00K72j68J43K28l9k13l5K28j45j02N3K16m78L80K9K46l57J41
5038A55k10J9j52P8K6q2L48m4k89M31j17l26J86j37j47L47O4K6k25K2j34m9L92
5061A82p1l4J37l68Ok58L30j54n3L39j36P5m3l8R5NO1k49J45m28M15L49j34l51
5085a78M7j49K96j37L7L58r6k25J12j58j24K43P6n5O0m42K33K21k13J15j41o6
5107a86L77l00J09o1o3K15l28O0k7O8M0J4L41k45J23J87l44O2k64L4rJ52j82O17
$$ plain form
5131 390 217 50 -83 -19 58 212 61 135 -121 50 159 18 21 -32 -24 81 401 104 -227 -361 -1 -146 155
5154 155 23 -160 -26 47 68 21 138 -283 36 189 -144 162 418 77 114 271 154 -62 69 170 -121
5175 -121 21 -115 -349 -41 -218 123 181 152 214 75 -184 80 -110 -110 -250 -30 -201 110 -39 418 -28 218
5197 218 133 77 -185 12 -37 13 -92 -227 -132 -94 96 112 121 177 -31 -211 124 -47 -300 -161 -10 -121 -192 36
5221 36 -13 91 123 -57 40 -137 64 129 98 -66 -218 -393 -40 261 67 17 -194 -3 -172 228 -88 -89 -260
5244 -260 275 160 75 55 123 225 -142 -4 222 -143 114 258 88 -117 -112 -19 -229 -33 -50 125 -249 33
5266 33 -49 -168 -175 -42 199 -27 -127 -211 118 36 -61 190 -199 -45 -30 -166 61 78 -129 -11 -41 -89 168 -391
5290 -391 325 -66 82 76 334 -25 -14 5 -121 265 64 -13 -128 146 -385 76 51 -10 171 1 -186 172
$$ packed form
5131C90j73j67j33O4P7J54j51P4k56J71J09j41Ln3QJ05L20k97l31j34L60j45L01
5154A55j32j83J34P3K1m7J17m21L19J53l33L06K56l41L7J57j17k16J31J01k91
5175a21J42j36k34L08j77L41N8k9O2j39k59K64j90%j40K20j71L11j49M57m46K46
5197B18q5n6k62J97m9N0j05j35R5L8J90J6RN6k08j80L35j71k53J39J51j11p1K28
5221C6m9J04L2j80R7j77K01O5l1j64j52j75L53L01j94n0k11J91j69M00l16jj71
5244b60N35j15q5k0O8J02l67J38K26l65K57J44j70k05NR3k10J96j7J75l74K82
5266C3q2j19pJ33K41k26j00q4L29q2r7K51l89J54J5j36K27J7k07J18l0m8K57n59
5290c91P16l91J48oK58l59J1J9j26L86k01p7j15K74n31M61k5o1J81j70j87L58
$$ plain form
5312 172 20 -44 -154 -271 -40 566 -237 -114 126 207 -20 -78 114 114 -100 13 7 -98 -311 391 -247 -125
5334 -125 -5 -13 102 -253 103 -139 83 -83 76 -147 149 94 -50 46 -97 -27 92 -78 -1 112 329 60
5356 60 154 -56 112 -40 -322 -181 -218 -210 47 91 -123 -35 233 70 -102 -72 134 -204 139 -166 -412 49 66
5379 66 366 -81 162 126 -68 3 -235 206 -124 151 172 -55 79 -5 14 161 369 -58 -82 -256 59 -130
5401 -130 7 -14 -104 -16 28 -168 101 -151 -6 145 -92 -11 70 -103 114 -281 -81 30 268 -48 -5 134
5423 134 48 148 238 -219 -249 -152 -188 -107 -82 -2 76 -107 107 -55 -117 45 31 -412 -83 25 314 -81 -77 51
5447 51 -64 -165 -7 78 171 -96 -148 23 -303 178 -82 247 -25 273 -91 -48 233 429 -79 282 -96 56
5469 56 38 92 233 -6 47 -49 -55 -50 -69 3 -149 -44 -120 -83 145 147 194 -83 134 78 -23 -94 -157 -272 205 16
$$ packed form
5312A72j52o4j10j17K31O06q03J23K40Q1k27n8J92%k14J13oj05k13P02o38J22
5334a25J20qJ15l55L56k42K22j66J59k23K96n5j44R6j43P0J19j70P7J13K17k69
5356F0R4k10J68j52k82J41l7QK57M4k14Q8K68j63j72L0K06l38L43l05k46M61J7
5379F6L00m47K43l6j94P1k38M41l30K75K1k27J34q4J9J47K08m27k4j74L15j89
5401a30J37k1r0Q8M4j96K69k52J45J51k37Q1Q1j73K17l95K00J11K38l16M3J39
5423A34q6J00R0m57l0R7l6Q1K5Q0P8j83K14j62o2J62j4m43L29J08K89l95MJ28
5447E1j15j01J58Q5R3k67n2J71l26M81k60L29k72K98l64M3K81J96n08L61l78J52
5469E6j8N4J41k39N3r6oNj9P2j52J05p6L7K28KM7k77K17n6j01p1o3j15M77j89
$$ plain form
5495 16 -122 51 38 12 234 -144 167 -39 122 -190 162 -58 111 77 -55 3 -29 -27 -177 109 325 158 -59
5518 -59 -244 -160 -49 -103 -31 88 69 -342 -175 -201 24 37 135 -126 212 2 140 -129 67 97 226 -35 -98
5541 -98 -62 70 -74 5 -16 -58 87 33 68 61 153 -114 146 -25 -11 -153 6 -215 -8 -96 -291 293 -287 77
5565 77 -226 100 110 154 -370 103 -13 -29 -44 76 351 -6 87 110 40 66 -49 176 85 -164 -29 -260 -60
5588 -60 -83 104 -14 -293 -147 103 253 -75 1 21 -187 -30 -15 318 -35 -2 -240 -15 -55 -81 36 208 61
5611 61 93 -63 332 89 -41 83 -196 165 57 25 -31 -1 131 217 57 40 -304 -62 222 283 -119 -5 128
5634 128 -25 215 63 120 -321 -100 -140 -238 -111 225 72 123 65 -162 196 171 72 -105 -98 63 74 -18 56 47 -76
5659 -76 161 -89 -171 -95 11 9 42 -61 -194 -85 -89 12 -9 -310 196 -177 1 241 -28 156 16 -98 -341
$$ packed form
5495A6j38J73j3k6K22l78L11k06J61l12L52k20J69l4j32N8l2Kj50K86K16j67k17
5518e9j85Q4J11n4P2J19j9m11J67k6K25J3R8k61L38k10J38k69J96L0J29k61o3
5541i8L6J32j44P9k1m2J45n4L5pR2k67K60j71J4j42J59k21K07q8j95N84n80L64
5565G7l03L26J0M4n24M73j16j6j5J20K75l57R3K3p0K6j15K25r1k49J35k31K00
5588f0k3J87j18k79J46K50J50l28P6K0k08J57J5L33l53L3k38K25m0k6J17J72j47
5611F1L2j56L95k43j30J24k79L61j08l2n6L0J32Q6j60j7l44K42K84O1m02J14J33
5634A28j53K40j52N7m41K21m0r8J27L36j53N1n8k27L58k5r9j77PJ61J1r2P4rj23
5659g6K37k50q2P6J06kL3j03j33J09mJ01k1l01N06l73J78K40k69J84j40j14k43
$$ plain form
5682 -341 10 -82 -141 81 -19 86 38 -137 155 -39 138 44 4 -100 43 -9 10 -56 -150 -233 -44 66 96 -61
5706 -61 5 -217 -120 -106 -106 234 -154 -18 173 -123 -136 150 186 209 88 -72 -13 -2 -190 139 72 6 -206 160
5730 160 15 62 204 197 130 29 203 -123 170 11 -10 -227 -58 84 84 -160 -183 -62 -79 -246 152 52 159
5753 159 247 153 -50 -4 192 -209 -82 106 -124 -29 -194 -2 -194 196 -16 92 -46 75 299 -106 121
5774 121 -180 -286 -162 -19 31 -166 92 -156 -173 -28 -167 110 74 205 57 -110 -144 116 147 190 -19 136
5796 136 -299 101 113 16 -59 135 38 -197 111 -5 147 38 203 206 -185 -106 -355 97 90 -50 27 66 -11 101
5820 101 0 -86 -210 90 126 142 95 -103 19 -123 27 -73 -70 -183 22 285 247 239 99 199 206 181 55 -113
5844 -113 -207 32 -283 8 149 176 296 -265 -77 -40 4 -319 -89 -194 -95 -53 -38 37 -100 152 31 -153 -250
$$ packed form
5682c41L51r2n9K22j00J05m8j75K92j94J77r4m0j04J43n2J9o6r4q3J89J10L0j57
5706f1O6k22R7J4%L40l88J36J91k96j3K86L6K3j21j60N9J1j88L29o7o6k12L66
5730A60j45M7J42po7j01J74l26K93j59k1k17J69J42%k44k3J21j7j67L98j00J07
5753A59Q8r4k03M6J96m01J27J88k30R5j65J92j92L90k12J08j38J21K24m05K27
5774A21l01j06J24J43N0j97K58k48j7J45j39K77l6J31j48j67l4K60L1M3k09J55
5796A36m35M00J2r7p5J94r7k35L08j16J52j09J65Ll91P9k49M52pj40P7L9p7J12
5820A01j01q6j24L00L6J6m7j98J22j42J50j00Lj13K05K63l8qj40J00Pk5j26j68
5844a13r4K39l15K91J41K7J20n61J88L7M4l23K30j05R9M2J5P5j37K52j21j84r7
$$ plain form
5867 -250 -84 -14 -55 268 -106 -14 -80 -129 72 -289 -207 -76 229 104 51 189 152 198 -252 164 133 28 -60 81
5891 81 1 -236 52 -55 82 232 -52 -162 48 45 -113 -114 96 139 12 13 36 -58 164 80 208 -108 -80 -27 -122
5916 -122 64 -113 195 19 -53 -6 -19 -19 -413 -70 107 -61 -66 96 -34 -162 193 104 20 -121 37 -70 -98
5939 -98 -42 -127 -247 155 -14 -149 64 39 88 -83 -554 35 -174 -1 -100 -240 27 -137 -149 -269 -20 205
$$ packed form
5867b50J66P0m1L23l74R2o6m9K01l61Q2J31L05j25n3J38l7M6m50M16l1j05q8J41
5891H1q0k37K88j07J37J50k84j10K10lj58jK10M3j27JK3r4K22q4J28l16K8N3r5
5916a22J86j77L08j76p2M7j3%l94L43J77j68nJ62j30j28L55q9q4j41J58j07k8
5939i8N6q5j20M02j69j35K13k5M9j71m71N89k09J73r9j40K67j64j2j20K49K25
$$ [...]
8191a89
##END NTUPLES=NMR FID
##END=
