##TITLE=1H_SR_11_2
 D6, 8 sc, 
 10.7.2020
##JCAMPDX= 6.0         $$ Bruker NMR JCAMP-DX V2.0
##DATA TYPE= NMR FID
##DATA CLASS= NTUPLES
##ORIGIN= UXNMR, Bruker Analytische Messtechnik GmbH
##OWNER= root
$$ XWIN-NMR		Version 3.5
$$ Fri Jul 10 10:06:10 2020 Russian Standard Time (UT+4h)  she@DPX200
##.OBSERVE FREQUENCY= 200.1315
##.OBSERVE NUCLEUS= ^1H
##.DELAY= (6, 6)
##.ACQUISITION MODE= SIMULTANEOUS
##.ACQUISITION SCHEME= undefined
##.AVERAGES= 8
##.DIGITISER RES= 18
##SPECTROMETER/DATA SYSTEM= spect
##.PULSE SEQUENCE= zg30
##.SOLVENT NAME= CDCl3
##.SHIFT REFERENCE= (INTERNAL, CDCl3, 0, 15.7039)
##AUDIT TRAIL= $$ (NUMBER, WHEN, WHO, WHERE, WHAT)
$$ ##TITLE= Audit trail, XWIN-NMR		Version 3.5
$$ ##JCAMPDX= 5.01
$$ ##ORIGIN= Bruker BioSpin GmbH
$$ ##OWNER= she
$$ F:/spectra/data/she/nmr/H-F/1/audita.txt
$$ ##AUDIT TRAIL=  $$ (NUMBER, WHEN, WHO, WHERE, WHAT)
(   1,<2020-07-10 10:04:52.78 +0400>,<she>,<DPX200>,
      <created by zg, POWCHK disabled, PULCHK disabled
       configuration hash MD5:
       00 E9 B6 7A A2 85 ED C7 34 08 36 98 17 FE 4E 26
       data hash MD5: 16K
       D6 5E 33 6D 28 CD A9 F2 45 12 C1 2C 63 EC 84 59>)
$$ ##END=
$$ 
$$ hash MD5
$$ 0B 7F 05 DC 9D 44 CC B9 6E F8 7A 72 65 25 D5 95
##$RELAX= 
##$RELAX= 
##$RELAX= 
##$RELAX= 
##$RELAX= 
##$RELAX= 
$$ Bruker specific parameters
$$ --------------------------
##$DU= <F:/spectra>
##$EXPNO= 1
##$NAME= <H-F>
##$PROCNO= 1
##$TYPE= <nmr>
##$USER= <she>
##$AMP= (0..31)
100 100 100 100 100 100 100 100 100 100 100 100 100 100 100 100 100 100 
100 100 100 100 100 100 100 100 100 100 100 100 100 100 
##$AQSEQ= 0
##$AQ_mod= 1
##$AUNM= <au_zg>
##$AUTOPOS= <>
##$BF1= 200.13
##$BF2= 200.13
##$BF3= 200.13
##$BF4= 200.13
##$BF5= 200.13
##$BF6= 200.13
##$BF7= 200.13
##$BF8= 200.13
##$BYTORDA= 1
##$CFDGTYP= 0
##$CFRGTYP= 5
##$CHEMSTR= <none>
##$CNST= (0..31)
1 1 145 1 1 1 1 1 1 1 1 1 1 1 1 1 1 1 1 1 1 1 1 1 1 1 1 1 1 1 1 1 
##$CPDPRG= <>
##$CPDPRG1= <>
##$CPDPRG2= <>
##$CPDPRG3= <>
##$CPDPRG4= <mlev>
##$CPDPRG5= <mlev>
##$CPDPRG6= <mlev>
##$CPDPRG7= <mlev>
##$CPDPRG8= <mlev>
##$CPDPRGB= <>
##$CPDPRGT= <>
##$D= (0..31)
0 1.2 0 0 0 0 0 0 0 0.06 0 0.03 0 0 0 0 0.0002 0 0 0 0 0 0 0 0 0 0 0 0 
0 0 0 
##$DATE= 1594361092
##$DBL= (0..7)
120 120 120 120 120 120 120 120 
##$DBP= (0..7)
150 150 150 150 150 150 150 150 
##$DBP07= 0
##$DBPNAM0= <>
##$DBPNAM1= <>
##$DBPNAM2= <>
##$DBPNAM3= <>
##$DBPNAM4= <>
##$DBPNAM5= <>
##$DBPNAM6= <>
##$DBPNAM7= <>
##$DBPOAL= (0..7)
0.5 0.5 0.5 0.5 0.5 0.5 0.5 0.5 
##$DBPOFFS= (0..7)
0 0 0 0 0 0 0 0 
##$DE= 6
##$DECBNUC= <off>
##$DECIM= 24
##$DECNUC= <off>
##$DECSTAT= 4
##$DIGMOD= 1
##$DIGTYP= 9
##$DL= (0..7)
0 120 120 120 120 120 120 120 
##$DP= (0..7)
150 150 150 150 150 150 150 150 
##$DP07= 0
##$DPNAME0= <>
##$DPNAME1= <>
##$DPNAME2= <>
##$DPNAME3= <>
##$DPNAME4= <>
##$DPNAME5= <>
##$DPNAME6= <>
##$DPNAME7= <>
##$DPOAL= (0..7)
0.5 0.5 0.5 0.5 0.5 0.5 0.5 0.5 
##$DPOFFS= (0..7)
0 0 0 0 0 0 0 0 
##$DQDMODE= 0
##$DR= 18
##$DS= 0
##$DSLIST= <SSSSSSSSSSSSSSS>
##$DSPFIRM= 0
$$ [...]
##$SUBNAM2= <"">
##$SUBNAM3= <"">
##$SUBNAM4= <"">
##$SUBNAM5= <"">
##$SUBNAM6= <"">
##$SUBNAM7= <"">
##$SUBNAM8= <"">
##$SUBNAM9= <"">
##$SW= 24.9337058887773
##$SWIBOX= (0..15)
0 0 2 0 0 0 0 0 0 0 0 0 0 0 0 0 
##$SW_h= 4990.01996007984
##$TD= 16384
##$TD0= 1
##$TE= 0
##$TE2= 300
##$TE3= 300
##$TEG= 300
##$TL= (0..7)
0 120 120 120 120 120 120 120 
##$TP= (0..7)
150 150 150 150 150 150 150 150 
##$TP07= 0
##$TPNAME0= <>
##$TPNAME1= <>
##$TPNAME2= <>
##$TPNAME3= <>
##$TPNAME4= <>
##$TPNAME5= <>
##$TPNAME6= <>
##$TPNAME7= <>
##$TPOAL= (0..7)
0.5 0.5 0.5 0.5 0.5 0.5 0.5 0.5 
##$TPOFFS= (0..7)
0 0 0 0 0 0 0 0 
##$TUNHIN= 0
##$TUNHOUT= 0
##$TUNXOUT= 0
##$USERA1= <user>
##$USERA2= <user>
##$USERA3= <user>
##$USERA4= <user>
##$USERA5= <user>
##$V9= 5
##$VALIST= <valist>
##$VCLIST= <CCCCCCCCCCCCCCC>
##$VD= 0
##$VDLIST= <DDDDDDDDDDDDDDD>
##$VPLIST= <PPPPPPPPPPPPPPP>
##$VTLIST= <TTTTTTTTTTTTTTT>
##$WBST= 1024
##$WBSW= 4
##$XGAIN= (0..3)
0 0 0 0 
##$XL= 0
##$YL= 0
##$YMAX_a= 11134
##$YMIN_a= -4854
##$ZGOPTNS= <>
##$ZL1= 120
##$ZL2= 120
##$ZL3= 120
##$ZL4= 120
##$ABSF1= 10
##$ABSF2= 0
##$ABSG= 5
##$ABSL= 3
##$ALPHA= 0
##$AQORDER= 0
##$ASSFAC= 0
##$ASSFACI= 0
##$ASSFACX= 0
##$ASSWID= 0
##$AUNMP= <proc_1d>
##$AZFE= 0.1
##$AZFW= 0.1
##$BCFW= 1
##$BC_mod= 2
##$BYTORDP= 1
##$COROFFS= 0
##$CY= 11.3945322036743
##$DATMOD= 1
##$DC= 2
##$DFILT= <>
##$DTYPP= 0
##$F1P= 16.9975609425685
##$F2P= -3.02152046262296
##$FCOR= 0.5
##$FTSIZE= 0
##$FT_mod= 4
##$GAMMA= 1
##$GB= 0.15
##$INTBC= 1
##$INTSCL= 1
##$ISEN= 128
##$LB= 0.24
##$LEV0= 0
##$LPBIN= 0
##$MAXI= 10000
##$MC2= 0
##$MEAN= 0
##$ME_mod= 0
##$MI= 1.114404
##$NCOEF= 0
##$NC_proc= 0
##$NLEV= 6
##$NOISF1= 3.799351
##$NOISF2= 2.8
##$NSP= 1
##$NTH_PI= 0
##$NZP= 0
##$OFFSET= 15.70392
##$PC= 1
##$PHC0= -9873.929
##$PHC1= 12.20092
##$PH_mod= 1
##$PKNL= yes
##$PPARMOD= 0
##$PSCAL= 0
##$PSIGN= 0
##$REVERSE= no
##$SF= 200.130013532006
##$SI= 16384
##$SIGF1= 3
##$SIGF2= 2
##$SINO= 400
##$SIOLD= 16384
##$SREGLST= <1H.CDCl3>
##$SSB= 0
##$STSI= 0
##$STSR= 0
##$SW_p= 3612.71676300578
##$SYMM= 0
##$S_DEV= 0
##$TDeff= 0
##$TDoff= 0
##$TI= <>
##$TILT= no
##$TM1= 0
##$TM2= 0
##$TOPLEV= 0
##$USERP1= <user>
##$USERP2= <user>
##$USERP3= <user>
##$USERP4= <user>
##$USERP5= <user>
##$WDW= 1
##$XDIM= 8192
##$YMAX_p= 0
##$YMIN_p= 0
$$ End of Bruker specific parameters
$$ ---------------------------------
##NTUPLES= NMR FID
##VAR_NAME=  TIME,          FID/REAL,        FID/IMAG
##SYMBOL=    X,             R,               I
##VAR_TYPE=  INDEPENDENT,   DEPENDENT,       DEPENDENT
##VAR_FORM=  AFFN,          ASDF,            ASDF
##VAR_DIM=   8192,          8192,            8192
##UNITS=     SECONDS,       ARBITRARY UNITS, ARBITRARY UNITS
##FACTOR=    0.0002004,     1,               1
##FIRST=     0,             0,               0
##LAST=      1.6414764,     0,               0
##MIN=       0,             -4854,           0
##MAX=       1.6414764,     11134,           0
$$ Real data points
##PAGE= N=1
##DATA TABLE= (X++(R..R)), XYDATA
0@%%%%%%%%%%%%%%%%%%%%%nJ3j6J6j6J6j6J6k0K8l2L2l2M0m8M8n3O1o7P5q3R1
43D8j01J11j23J38j54J72j91K16k48K81l24L82m59N72p50J067j816O697N616j1770
63f36Q42O408j423o293K267K561l259k581K375q9j664Q33J041j582L17J480j081
80d84j221J951K1k877J24L021o26k321J133J624j921j289K034J600r71j185j72
97a559J005J620l83k275N45K882o38k739J623L186j885l302J495K512j070j128
113a11J141J96j332k81M50R6M13j85j399J17J664p66j873J495J651k516j469L354
131F45J446l375q56L073r9k715J153K771j023j941P65P00n00N95L42j328M12K018
149B083j124k580J604K604k102k467K312K138k150j562J576M22j585J86J549k87
$$ y = [0, 0, 0, 0, 0, 0, 0, 0, 0, 0, 0, 0, 0, 0, 0, 0, 0, 0, 0, 0, 0, 0, -5, 8, -8, 8, -8, 8, -8, 8, -12, 16, -16, 16, -16, 24, -24, 24, -29, 32, -35, 40, -43, 48, -53, 58, -65, 73, -81, 91, -100, 116, -132, 149, -175, 207, -252, 320, -430, 637, -1179, 5518, 11134, -636, 206, 6614, 5191, -1102, 1165, 3726, 467, -2114, 261, 172, -1492, -659, 382, -1200, -883, 597, -484, -1705, 246, 267, -2610, -2486, 535, -91, -2412, -1279, 345, -1576, -2865, -831, 769, -202, -1387, -1559, -554, 1066, 683, -1592, -1047, 1835, 1197, -1542, 81, 3267, 1382, -1920, -425, 2087, 1017, -111, 1030, 1226, -106, -387, 63, 159, 572, 387, -1012, -895, 769, 3, -1870, -375, 1276, -1240, -2709, 645, 2091, -1284, -2140, 933, 834, -1881, -728, 2043, 1020, -921, -156, 544, 44, 639, 981, -347, 65, 2083, 959, -1621, -17, 2587, 485, -1982, 330, 2468, 318, -1244, 332, 754, -831, -645, 904, 617]
165F17j294j05N31K18q0m03k0P78q7j323K58J877k03k077L06K050l11j634O66
184b36J569n39j392k0R27P62n8j070m69J205M83j647n48J760L65j801NJ625o68
203B53j711Q29J324j088r17J292N92j270m87P87K30k28J73o4j01N14j41r81N61
222d33J646o35j870R10K158q53j971Q64J674q01j211Q64J065o19q39J32L85J1
240D77k00k11J53L41l73o68K44N26m61n24O16M18q70m73Q91M91q98o01P88P67
260D33m66p71K42R39k4j043r7J311L69j279m13J348M67j338n50J215O20q06m01
279b44N89J66n45k91L08M27K4l59j65L08n0o41K0R03M6r96j9J029j91j225J97
300g09J376p7j262k5J121J23r83k31Q39M72o06n65M53P79l07r10J19R36J7r15
$$ y = [617, -677, -782, -251, -33, -113, -516, -536, 242, 155, -1168, -910, 967, 764, -1313, -1007, 1043, 732, -902, -236, 1333, 794, -598, -618, 309, 1071, 1013, -57, -526, 679, 1162, -485, -1033, 727, 1092, -709, -704, 921, 253, -1458, -629, 695, -393, -1310, -18, 574, -696, -1183, -396, -166, -394, -221, -285, -386, 128, -13, -994, -433, 1213, 578, -1292, -382, 1776, 923, -1048, -184, 1490, 689, -522, 342, 1407, 788, -51, 81, 466, 477, 277, 66, 219, 560, 187, -481, -237, 289, -172, -696, -80, 338, -532, -1005, -114, 377, -521, -1122, -334, 433, -33, -804, -562, 377, 353, -690, -787, 524, 893, -386, -799, 549, 1016, -322, -872, 343, 963, 157, -244, 345, 511, -34, -325, -17, 410, 434, 75, -90, 218, 168, -473, -453, 450, 496, -500, -519, 510, 319, -906, -709, 667, 590, -672, -697, 424, 547, -436, -667, 172, 644, 38, -527, -74, 705, 398, -512, -393, 543, 560, -355]
320c55j8R15M0q76j62O75L3o13N7O93K0p30j94N49J59n32j84O80L43p14n59O17
342a56O17o04o76O44Q88n04r72L08R72j36q78M7R67J81q38l16P51L65o83m12O81
363B46O05n20o04L54M39m47m71M37N73l88n72K53M45l92o05L49P36j93p89N2O86
384A94n0p96pR22K09r00l66Q44M71p46n51P01O91n23o94M78P20l36p21K49P03
405D92j22o16J86O53r1o68q0N57O5m62L7N80kp30k45N95K69n55k63O24L53p17
427a40o01N39O33m14o21M22P10l91q54J61Q81Qp63m8P46J41p14k69O37L15n58
448a80k66N81L49n13l91M36L79m03l45M29M47l53m55K83M30l33n04L09O50j88
468C62o97M6O18j5o63n2O96J80o70k81N77L14n15m07M96M92l52m96K46N02j98
$$ y = [-355, -373, 542, 582, -294, -456, 219, 252, -361, -304, 389, 409, -321, -515, 34, 193, -339, -523, 157, 500, -214, -773, -156, 461, -143, -819, -175, 713, 209, -763, -455, 517, 381, -497, -450, 517, 698, -140, -456, 295, 660, -23, -435, 246, 851, 331, -273, 81, 520, 73, -398, 39, 612, 224, -348, -95, 350, -42, -647, -298, 438, 245, -544, -492, 194, 144, -652, -659, 263, 472, -428, -794, 50, 521, -225, -776, -75, 616, 93, -601, -123, 597, 261, -460, -211, 492, 370, -246, -60, 593, 502, -166, -246, 311, 376, -86, -49, 531, 529, -201, -446, 149, 418, -137, -400, 224, 577, -140, -741, -202, 431, 17, -604, -182, 528, 137, -717, -556, 325, 333, -430, -478, 268, 409, -305, -574, 63, 378, -180, -446, 135, 484, -29, -420, 16, 395, -8, -353, 76, 523, 170, -285, -2, 428, 95, -409, -100, 550, 362, -335, -289, 329, 314, -349, -401, 295, 475, -195, -476, 101, 415, -100, -507, -11, 481, 129, -367, -121, 381, 183]
489A83n15J52N25q1m75J00M89j24n93K3N67L4m88K7M96o5o52q0O09J77n33j70
511c94N45K08o14m03N06N17k98m66K65M49k66n39K06O44ln87j4N50O1n04p7N17
533C03J52m41j54M48J55m27j83L85J78m26k50L89L14l62m00K46L51l15m58K80
553b15N44j81o01O3N50n8n84j2O51J50n53k23M79K06m20k00N10L11m20l45L17
574c1L62k52l18K68L67k17l27K04L46k22m20J69M72p7m50J8M49l1n69q9N58J88
596C98n07k04M37K01m88l17M53M04l31m54K60M38j92m76J48N01p1m32O1M51p8
617B02n01N3N28K2m89n9M42O0m05q0L82Q1m10j79M06L33l25m09K40L83l01m45
639d71L28O08k09o69P3N53p3m53J19M98k0n03n1M12J35l24j49L60K59l25l03K76
$$ y = [183, -332, -180, 345, 264, -211, -111, 378, 254, -339, -316, 251, 285, -203, -176, 320, 255, -397, -477, 132, 309, -224, -394, 151, 359, -255, -658, -152, 365, 67, -399, -134, 315, 49, -490, -284, 360, 357, -230, -244, 306, 367, -137, -214, 303, 455, 14, -140, 308, 463, 36, -147, 238, 416, -10, -260, 129, 443, 81, -319, -73, 278, -37, -495, -215, 329, 148, -453, -390, 160, 102, -482, -494, 157, 307, -246, -469, 10, 216, -204, -404, 106, 417, -3, -348, -31, 331, 79, -239, 29, 396, 179, -148, 56, 402, 180, -240, -71, 401, 324, -126, -108, 341, 310, -259, -348, 210, 398, -109, -313, 124, 325, -163, -480, -27, 377, 46, -408, -148, 290, 98, -378, -230, 271, 200, -232, -171, 280, 202, -299, -246, 282, 304, -185, -244, 198, 258, -147, -227, 155, 236, -174, -353, 53, 386, 61, -348, -108, 275, -26, -471, -143, 465, 256, -413, -340, 213, 140, -313, -194, 304, 284, -219, -270, 142, 277, -47, -196, 164, 423, 98, -205, 71]
661G1L09k83l32L38M22l31m65K38L87k42m24K51M16k15m65Q8M30qm49j29L89J79
683A75l51k10L85K71m58m01M48M79k90m15K76L69l06l27K97M00j74l80J27L92
703C07p4l79K9M13J6m14l6M55R1m69j77L94J33l54j03L58J67l92l24K46L78j33
725A32m08Q1M42n1m96RM91l8n09Q5O14l1n98o2M32N1k89M8K81j0k91j45J75K48
749A61n8k89P3L65j14n05J08O35r9o56R7O24j12n44J94N04k49n02J84M54k8l07
771f4m9J40J05o7j81P6K56m1l40R3M01j44m91J17N28n8m80J10L76j79m21J49M28
794B64l0l72l8K90Ql29q3L71J88l47k60K76K75k61k69K47K16k16j90K46K44j82
816D8l12M9L06Q3k37p4K70O4l58j14M51J72m35j49M53J21m49j03M47Q8l74p8K91
$$ y = [71, 380, 97, -235, 103, 525, 194, -271, -33, 354, 112, -312, -61, 355, 140, -325, -237, 193, 185, -264, -393, -4, 175, -176, -386, -1, 270, -188, -589, -141, 338, 48, -367, -91, 278, -28, -355, -58, 342, 168, -212, -85, 307, 233, -146, -117, 296, 312, -102, -138, 317, 408, -61, -238, 156, 289, -65, -168, 190, 357, -35, -359, -113, 265, 132, -276, -195, 247, 196, -300, -291, 200, 162, -347, -262, 352, 321, -277, -339, 93, 144, -145, -97, 184, 174, -117, -262, -87, 161, 103, -186, -113, 252, 138, -367, -259, 376, 277, -379, -282, 342, 230, -314, -120, 384, 135, -367, -183, 271, 243, -64, -113, 27, 132, 65, -116, -40, 216, 175, -165, -72, 329, 185, -306, -189, 339, 281, -199, -89, 287, 108, -313, -164, 264, 234, -138, -176, 114, 122, -207, -290, 81, 269, -78, -338, -62, 213, -48, -317, -70, 146, -70, -260, -14, 230, 48, -264, -215, 91, 174, -63, -137, 133, 197, -161, -275, 176, 348, -87, -236, 217, 338, -111, -214, 233, 321, -53, -131, 160]
839A60R1k02j49R4J39k3j85k2K54M4l80j01M08J27m47j44M41J21m16o3L82J8m09
862b62m3L60J32k48j26J71R9j76j66K17K78j08l49M8L11n7l01J28L46r2l46N6
884a28L00Lk78m3K56J13j76j63J33K03j74k50K18L15k21l69K22L48k41l33K25
905d0L04k26k85J97K78j66k32P2J83k1j72k5J91J14k19k46K12K91j83k93K31K80
927B45k81l00K83L30k58l05K20K99j61k80J16K36j00k19P3K50j6k62m1K33R0k58
949a06j17K74K12k73k05K02K11j86k08J96K86j63l14J23L14j13l06J17L47m9l76
970a34lL16qk97J9K97j0l16p3K62J02k12j64J90J45j81j86J60K40j51l04J17L19
993A28q4l21J06L49m5l86K6L54K0k88J1L02K6l09p6L04J17k02j10J75J56j91k07
$$ y = [160, 251, 49, -100, -6, 133, 110, -75, -97, 157, 201, -179, -280, 128, 255, -192, -336, 105, 226, -190, -253, 129, 147, -262, -305, 55, 187, -61, -187, -16, 83, -93, -259, -42, 236, 128, -221, -173, 138, 81, -220, -92, 254, 162, -184, -128, 172, 175, -103, -146, 110, 223, 47, -116, 17, 220, 46, -204, 14, 329, 108, -261, -39, 309, 68, -265, -40, 264, 38, -247, -50, 228, 62, -170, -98, 85, 64, -108, -133, 58, 172, -47, -293, -81, 210, 27, -266, -35, 245, -36, -336, -53, 277, 19, -286, -66, 233, 72, -208, -92, 144, 44, -175, -102, 148, 132, -130, -171, 62, 152, -106, -223, 51, 263, -10, -215, -13, 198, 12, -196, 0, 286, 123, -191, -68, 246, 133, -173, -56, 291, 242, -134, -137, 179, 171, -126, -107, 190, 180, -136, -209, 53, 155, -57, -221, -31, 114, -67, -253, -93, 147, -4, -308, -191, 128, 44, -277, -171, 178, 133, -253, -227, 127, 147, -141, -130, 172, 198, -111, -187, 117, 234, 32, -78, 97, 253, 62, -145]
1016a45J53K30j09k36R9K47j17l17O0L11k6l04j6K96J2l13n2L02P9k84r9K83J24
1039A78k65j78K14J91j69j92J76K16j28k45Q3K54n9k38O3K93k0l34NK75L5k57
1061a02m7K71P2k75r6K40J25k26j62J97J89j52k25J55K25j55k43J24K67p1k64
1082a53Q3K47n9k58NK59L8j86l7J82L6k18q9K33J52j94j70J65J55k08k01J75K34
1105A91j29k31Q1J84j12k19R0K45l2k55qK25L5j99q3K32J00k28j04K32J59k19
1127d5j35K00J86j80j65J95J99j48j87J23J61p7j85Q4K15n5k51j6K08L0k31l9
1149a13K20O5k48j05J88R5j87j19J78J26j65j61J25J82j11j70R0J98m9k03O1K09
1171A06l5k22L2K68Ok40rK09J5k16oK02P9k01j00J58R9j46j38J44J77j03k16O8
$$ y = [-145, 8, 238, 129, -107, -8, 239, 122, -195, -135, 176, 150, -154, -170, 126, 138, -175, -227, 75, 154, -130, -229, 54, 178, -87, -265, -51, 140, -29, -221, -45, 171, 43, -202, -119, 135, 76, -162, -99, 194, 174, -160, -155, 120, 155, -102, -149, 122, 194, -81, -177, 63, 188, -38, -200, -3, 186, 34, -191, -36, 189, 34, -209, -85, 182, 111, -153, -70, 177, 118, -140, -135, 124, 162, -24, -61, 121, 157, -61, -150, 83, 235, 41, -129, 36, 191, -17, -218, -43, 191, 62, -169, -88, 96, -16, -235, -145, 100, 68, -187, -195, 30, 65, -134, -217, 15, 115, -113, -217, 15, 174, -45, -180, 20, 206, 26, -139, 56, 255, 107, -80, 43, 204, 127, -58, 26, 241, 186, -65, -81, 127, 157, -74, -113, 107, 172, -76, -181, 7, 102, -85, -204, -26, 100, -65, -226, -101, 81, -30, -200, -110, 88, 39, -164, -103, 106, 71, -151, -119, 149, 155, -85, -94, 115, 130, -86, -92, 110, 189, -12, -112, 46, 145, -1, -139, 5, 182, 79, -137, -69]
1195f9J89p4k01P2K44o7k49M4K34k4k22J3K20J2k03k2J92O6j70r2J57R5j53j26
1219a34J58J54j41k02J09J85q5j98R8K02p4k49K6K19jk06J2K16J2k41o0K18O9
1242H7j76n6J84Q7k01j01J72J51j38j26J20J54q9j62Q2J82n4j83K6K20Mk19m9
1265h5K33L7k41o7K35P6k22j11J96R9k21j02J92J17j66j54J16J36j02j48P4J73
1287F5l7j82L7J81j7j71k8K10O6k07p6K21J16k00j28J92J39j86j18J92J56j90
1309C5j95J70J86j26j61J05J71j14j95N9J63nj48OJ36Lj72p2J58J21j38j10J32
1332IJ32j61j71J62J96j38k02J33K12j50k16J55K16j24k16Q7J98n5j83M2J53j8
1354F1j52j9J27P6j16q8R2J12r2j70J24J93r3k05R0K04r6k29J24K51q8k33O6K21
$$ y = [-69, 120, 46, -155, -83, 161, 94, -155, -111, 123, 99, -123, -110, 110, 122, -81, -103, 89, 155, -15, -107, 50, 145, -8, -134, 24, 178, 37, -165, -56, 129, 44, -154, -56, 146, 72, -177, -151, 68, 67, -139, -127, 89, 101, -140, -200, 18, 87, -89, -145, 39, 126, -75, -176, -4, 147, 9, -117, 3, 157, 68, -94, -12, 170, 116, -67, -41, 179, 183, -36, -85, 148, 185, -56, -123, 112, 188, -34, -145, 51, 150, -71, -173, 19, 136, -30, -184, -68, 68, -34, -182, -108, 65, 28, -154, -117, 64, 47, -124, -152, 58, 124, -83, -159, 62, 178, -22, -150, 42, 181, -5, -123, 69, 225, 35, -160, 10, 196, 70, -91, 14, 185, 71, -124, -65, 98, 93, -55, -49, 87, 90, -82, -154, 4, 125, -13, -123, 9, 141, -20, -191, -29, 167, 29, -173, -40, 172, 22, -194, -39, 177, 53, -163, -76, 122, 67, -116, -74, 79, 61, -91, -110, 17, 93, -23, -111, -19, 93, 1, -169, -45, 148, 55, -150, -60, 144, 48, -181, -57, 194, 106, -127, -61, 160]
1378A60r2j87P0K15l8j83pJ59J7j27m6R5P2q0j13P6J50q6j81L5K25m4k12K4K18
1403A20n9k38M2K23nk34M1K16n3k18K0K18J2j57k8J01N6j00p7J09R4o3j15O6J48
1428A19l4j97L3K16mk10j1K15Nj79j1J92j6k07RJ96L1j73n9J32O4j51n2J25Q4
1453A17j19j07O9R8o4j10O5J68o3j82qJ67L2j63j7J48N8j72n5J63O7j73o3J81
1477C7J06j60j19J19J34j21r0J08R2q3j24R9J26q0j09L0J46kj43kJ23J8j41m1
1501g7J22R4j58o7J32Q3j51j13J40J42j21j55J04J25r8j21Q2J22q6j26P2J28l8
1524C5j52K7J23mr3k2J23L5j30m4J03Q1r4r9J21J16j19j42J04J46q6j59R8J68
1548A36q4j63M2J74n9j41Q2J27n0j44L0J29%j01j3P5M5p9p1Q0J09p3j54Q5J50
$$ y = [160, 68, -119, -49, 166, 128, -55, -62, 97, 114, -13, -59, 36, 108, 28, -85, -9, 141, 55, -126, -91, 134, 90, -122, -98, 120, 61, -177, -135, 88, 83, -151, -110, 106, 53, -165, -145, 73, 85, -72, -100, 1, 57, -43, -120, -11, 83, 20, -95, -29, 119, 85, -112, -79, 137, 133, -77, -88, 127, 132, -47, -58, 134, 118, -89, -80, 116, 147, -26, -85, 47, 111, -40, -92, 33, 117, -2, -109, -40, 58, -6, -116, -51, 117, 54, -128, -136, 31, 63, -100, -117, 31, 89, -83, -138, 25, 92, -81, -144, 37, 143, -17, -136, -17, 117, -4, -94, 14, 106, 23, -101, -2, 124, 44, -65, -35, 111, 109, -34, -36, 87, 105, -36, -77, 45, 139, -19, -86, 46, 129, -22, -135, 5, 147, 26, -129, -25, 100, 2, -119, -37, 85, -1, -127, -55, 73, 35, -117, -90, 33, 29, -64, -86, 37, 72, -58, -102, 1, 82, -12, -111, 10, 126, 7, -135, -31, 115, 29, -130, -32, 136, 52, -111, -69, 105, 46, -95, -13, 114, 64, -80, -50, 79, 79, -22, -35, 40, 85, 6, -65, 15, 124, 51, -103, -18, 132]
1573A32q8j48O4J65q8j77O8J76o1j69O5J23l7j52L0J29Lj27pJ10M1j13p8J13J01
1598G5o3j13O8J06o4j32J03J57q2j46O2J64m0j54K4J63pj52qJ40L2j72l1J38O1
1623A29j45p3J25P9j25j11Q2J18o7j13O6J22q4j39N8J33j1j64K7J61Oj67k0J52
1647C9M2j50l6J48L1j21n7J34Q0j09r5Q8J13q7j06O3J29o3j49N3J46k9j34K4J35
1672H9j8j59mJ51M7j23o2J02M8j20n3J31Q3j12j11J05J05p9j29Q0J37o5j26M3
1696d0J37n4j33K6J38kj46l0J30M1j37l7J13M8j15o1J15R2j18r4P5J24r1j01P1
1721d9J16n2j27N0J26k6j16J7J53kj48qJ46K2j11m7J14M7j04m2Q0P9j06q0P5J00
1747A07o5j16L9J21n5j20L8J29m1j35K0J34l3j26J0J32Rj19l7R4N6r0m9J08P1
$$ y = [132, 44, -104, -40, 125, 37, -140, -72, 104, 43, -126, -61, 62, 25, -127, -97, 32, 35, -92, -99, 11, 52, -61, -139, -26, 75, 12, -101, -33, 73, 9, -123, -20, 137, 55, -91, -29, 135, 95, -59, -35, 128, 121, -31, -39, 101, 133, -39, -70, 68, 129, -16, -89, 36, 115, -10, -121, -39, 79, 12, -101, -35, 87, 3, -136, -78, 55, 44, -120, -93, 68, 74, -93, -113, 39, 81, -69, -105, 43, 74, -47, -104, 30, 110, 1, -94, -6, 107, 20, -86, -23, 106, 43, -106, -53, 93, 64, -70, -46, 89, 71, -88, -92, 59, 106, -17, -79, 23, 71, -49, -102, 29, 112, 0, -111, -6, 99, 20, -109, -29, 108, 43, -83, -40, 97, 43, -90, -64, 74, 72, -74, -104, 26, 67, -70, -107, 6, 54, -61, -122, -7, 85, -33, -127, -52, 72, -19, -120, -49, 67, 15, -112, -62, 64, 38, -78, -61, 92, 90, -58, -66, 80, 102, -9, -56, 58, 105, 1, -41, 39, 118, 12, -68, 7, 107, 42, -74, -35, 86, 31, -89, -51, 78, 37, -98, -78, 56, 23, -103, -93, 39, 48, -71, -108, -14, 42, -48, -97, 11, 82]
1772H2q9j03Q6R0o5q2P3R9m7j21L8J12j8j00K2J08j8j00j6J13K2j04l3Q5N6j00
1798a0n8J00O9j16p3R1R6j01q3R1Q0n6j12N1Q5j9q1PQ7Lj15k7J12M2j15m4J17
1825B1M6j24n8J19O0r4n5Q8O6r5o9Q5P6n4r0M6Q2k4r0KJ09j2j01QJ25J2j17l2
1853g0J09L6p9m3Q6N2q9n7O9O1m7q4O8P8m6j09L2J07k1j15J3J12k4j12K2R9k3
1880B5j00mR1K5q3l4P9N0p7p7Q4P2p0p0O4R8m9j31M9J15j3j00K1J05l2r4J7J03
1908F4qq3rQ2K1j00j9Q6N7o5q6P9O9q7q3Q9R3p3r4L3J03l4j15M1R2j3j10K2R8
1937E0Kj15j3R5K3j02k6R1M0p8n6P4O5p3o5O9Q2o1p7M3R7l7r3J7J11pj13lJ15
1966E5J9j28lJ17K2j00l8R8L3q1m0O1N0m5n7L4O7l8q2K7R5j1j10J0R8nj11j1J23
$$ y = [82, -7, -110, -24, 66, 1, -81, -8, 91, 44, -77, -39, 73, 55, -45, -23, 85, 67, -33, -49, 64, 86, -18, -51, 34, 90, -10, -68, 32, 101, -15, -88, 3, 99, -2, -85, 6, 86, 30, -82, -31, 54, 35, -46, -39, 48, 51, -64, -91, 21, 63, -52, -96, 21, 67, -57, -115, 4, 64, -30, -85, 3, 69, -26, -95, -10, 66, 12, -78, -32, 50, 26, -64, -62, 47, 35, -66, -58, 67, 79, -38, -70, 39, 75, -4, -47, 39, 91, 2, -55, 14, 75, 28, -56, 12, 90, 44, -65, -33, 74, 53, -62, -49, 63, 39, -73, -51, 48, 25, -75, -79, 12, 37, -46, -80, -1, 49, -28, -105, -21, 51, -19, -89, -25, 73, 24, -107, -58, 57, 44, -56, -35, 70, 38, -56, -39, 64, 56, -27, -36, 46, 67, -33, -52, 34, 91, 26, -60, 19, 88, 1, -82, 7, 100, 27, -67, -34, 69, 35, -80, -39, 53, 40, -70, -48, 50, 52, -63, -76, 19, 42, -60, -86, 5, 45, -33, -89, -15, 50, -23, -88, -19, 63, 2, -75, -32, 65, 28, -65, -48, 63, 56, -57, -60, 55, 74, -54, -57, 60, 82, -18, -56, 42, 75, -6, -46, 15, 65, 20, -37, -3, 64, 26, -56, -29, 66, 55, -55, -45, 53, 48, -63, -74, 49]
1995D9J9j12l1J13J4r7n8J08N0q3o2O6P3o6n7M8Q2m6p9J6J07l4q2J4R6lj01OR2
2024D2K7r9l1Q5M4r2k5Q4O4r5o7P0P8r0n5P2Q6o6r8L8J10m7q7L5P5j3q2mP1K1
2054E1o7l0O4L9q8m8P3N7p9p0O4R8p7q1N4Q6n3p4L7R2m9p3M0P9k7q6L3P1Mo2k9
2085e1Q3K0n6j8M7O1o0p2M3P6l8p5L3Q3k8j06L9Q7l0j01L9R1k1j08K9P0k2p2J9
2114c8M8kn2KM0M5o3n8N0N9k6o6L2P8k5j07L1R0k0p7L5Q3l0r8L1Q7ko8lN9j6n0
2146c1j0P1J0m9k5M6L1k9m9J1O4j2o5J2P3j8p5J4J09k9j06J3J17rj00mQ7kp0j7
2176d2Q1lo7j3O0K8p2m4M8O3n0n6K7O0k8o3L3N5j1o0lP7J0j01LR8Po0k5R0J4q1
2208b5k4P8M3o7l9P4L3n6o3M9O7l7o3J9P1l8o1J0O2Rp1j6O5J4p1k6O9M0o2n7N7
$$ y = [49, 68, -44, -75, 38, 52, -45, -103, 5, 55, -28, -90, -24, 49, -17, -74, -26, 56, 10, -69, -53, 54, 20, -62, -48, 48, 45, -56, -50, 42, 69, -30, -61, 24, 68, -24, -49, 35, 99, 4, -63, 7, 85, -5, -60, 12, 98, 32, -66, -28, 82, 35, -52, -17, 58, 45, -37, -41, 30, 51, -16, -46, 18, 57, -31, -79, -6, 51, -28, -98, -34, 64, -13, -94, -40, 46, -7, -81, -44, 48, -1, -74, -34, 45, 18, -68, -35, 36, 40, -22, -51, 32, 52, -4, -22, 25, 86, 26, -46, -3, 73, 35, -40, -7, 76, 48, -58, -19, 68, 38, -63, -24, 67, 46, -62, -33, 37, 15, -57, -38, 10, 8, -44, -42, -2, 43, -20, -78, -28, 31, 5, -61, -29, 49, 24, -83, -52, 38, 18, -59, -24, 59, 29, -69, -38, 49, 47, -21, -24, 35, 19, -31, -41, 30, 40, -9, -34, 12, 43, 14, -35, -24, 40, 28, -37, -25, 48, 30, -45, -31, 78, 49, -57, -44, 73, 64, -36, -40, 47, 45, -25, -42, 39, 36, -31, -44, 16, 44, -28, -72, -24, 39, -11, -67, -40, 20, -8, -71, -38, 17, 6, -54, -57, 20, 30, -71, -68, 30, 37, -23, -48, 42, 56, -25, -49, 29, 72, 5, -34, 40, 73, 17, -46, 3, 70, 33, -30, -11, 60, 22, -39, -29, 33, 42, -29, -45, 20, 34, -37, -63, 6, 46, -16, -73, -16]
2239a6O4q0m7O5N5o0p0O4P1m9n9M8N1j9p7L0Q0j3o4PL6K0n7j6O4L3n9m8M7O0o2
2270an3N3P4n7o7M3M9m0o2N5P3n4p4L8O1j7n9J4M2J7n7k4P7J7n6m4M8N1n2o3M7
2301b1O1l6p6M3P5k5q7J5R5m4o0J5P4j4p1J8O1%o6j8O4L6n6j9M5K9m5m3L4Q4m8
2332B0q0M6P1j0r0L1Q3m0p4J2R6k2q7MP2Mn7j2N4K9o3k7L2L5m0l5M1M2l7o7K1
2363d8O9j4o1J1Q4j4q2J0Q1j2o0mP7K0r2j1P3K5n7m7O2M5n8m0M7N3l7o4L5N6k3
2394B4n0NO9j5n8mM5J5n9oN8J3n6l2O8L3o6k2L8L4m3n0N8L9l8m3K7M0k7n6K5N8
2426B4j1n8J2O0rm6kM6K1n7j8M9L3o3k0L9L7l2m7M5L4k6m0L4M9l3m6J5O3k8n6
2457c1J7M7j0n7kP4om8j0N0L5o4l0M3M7m7l6K5N1m1n1K9N7m4m9K4O3l3m4K2N2
$$ y = [-16, 48, -32, -79, -14, 41, -19, -89, -25, 46, -3, -62, -14, 37, 18, -59, -29, 51, 38, -26, -19, 17, 37, -20, -36, 28, 61, 2, -46, 1, 61, -1, -54, -1, 73, 16, -51, -8, 41, 1, -61, -6, 67, 13, -61, -23, 38, 21, -38, -24, 18, 35, -22, -46, 31, 48, -8, -52, -4, 47, -5, -68, -21, 40, 4, -72, -29, 46, 21, -66, -51, 44, 0, -60, -45, 29, 15, -56, -38, 23, 23, -43, -61, 3, 39, -17, -36, 9, 38, -7, -50, -16, 68, 20, -60, -14, 57, 47, -43, -12, 71, 31, -43, -31, 65, 43, -44, -40, 32, 36, -21, -33, 21, 50, -13, -40, -8, 27, -13, -48, -7, 35, -2, -69, -48, 21, 7, -54, -43, 41, 27, -55, -45, 36, 24, -36, -40, 37, 57, -35, -46, 27, 52, -5, -52, 10, 55, -3, -43, 4, 57, 20, -44, -9, 47, 24, -26, -21, 48, 33, -25, -29, 16, 31, -28, -34, 24, 37, -19, -51, 17, 50, -16, -38, 0, 34, -9, -59, -1, 38, 0, -43, -16, 24, -3, -59, -34, 24, 13, -45, -33, 27, 18, -28, -30, 16, 37, -20, -38, 11, 44, -19, -39, 0, 37, 5, -42, 3, 37, 11, -29, 5, 54, 21, -25, -10, 53, 25, -31, -14, 33, 23, -34, -36, 38, 32, -16, -26, 24, 59, -5, -35, 8, 55, 8, -28, -3, 48, 7, -44, -15, 42, -2, -51, -27, 36, 3, -41, -19, 33]
2488C3j5m8MM3Jm5rN9J7n8j6M7K5o2k7N8N7o6k5L2L4k9m8L6M9k1n9J0N0No4ON1
2521B5J2m4k1N0J2o0oM3K3n3qK6M3n1l6L5K9k3m3K2M9rp3J5P9k2n8LO4k0m3jN5
2554A4J6n9j8N6J6l8l4M8K8k2m7L2N4k8m9K8N8m6m4K2O4l2m5OM9on5LO3Lo2j6
2586d1N5L1m6l8M0M4m7m0K8O1m4m2K0M7j2n7J0N9j6m3pN0jk6l1N1K4n1k0N9J0
2617B7o0oL8L2n1l0L7L9m0l5K4O5k5n4K3M7j2m7PM4J2o5ML6K7n3j9L6L1l6l2M9
2649A3K4l7m0L6L8k8m2K3M5k6l8K0M1k1m5nP2Jo8qO1Qn3l1O0L8o1j8L2L9k1n2
2681d3K4M3qm4J0M2Jn5J1O4k1n0J6N8j2m8PM7j3m4j6N1Pk7l6L2N3m3m2J9N3j9
2713A7n1QM9j3n6J5M1J1o0KN3nl4j2M9Qn1J0K6K4k6l8M9J8l8k1K8K7l5k8J6M3
$$ y = [33, 18, -30, -26, 17, 18, -27, -36, 23, 40, -18, -34, 13, 38, -24, -51, 7, 64, -2, -27, 5, 39, 10, -38, -2, 47, 26, -33, -23, 27, 32, -32, -26, 25, 37, -7, -28, 22, 34, -26, -32, 11, 34, -19, -27, -1, 42, -9, -45, -10, 19, -4, -47, -25, 24, 15, -58, -43, 36, 14, -44, -41, 23, 3, -40, -41, 14, 30, -29, -47, 9, 25, -13, -47, 1, 29, 7, -40, -8, 46, 18, -31, -3, 55, 9, -35, -13, 51, 19, -26, -20, 29, 23, -32, -29, 34, 37, -25, -41, 14, 45, -1, -39, 1, 45, -2, -42, -14, 47, 3, -39, -19, 28, 16, -41, -31, 28, 12, -31, -38, 12, 11, -15, -46, 5, 29, -22, -42, 17, 27, -33, -39, -1, 31, -20, -50, -13, 26, -14, -49, -25, 40, 15, -39, -16, 31, 19, -28, -21, 23, 35, -30, -26, 10, 37, -16, -35, 1, 32, -4, -36, 13, 37, 0, -40, -4, 34, 6, -36, -13, 32, 6, -32, -12, 29, 8, -37, -42, 30, 31, -37, -45, 16, 24, -29, -60, 0, 38, -23, -41, -9, 30, 9, -43, -19, 24, 16, -28, -18, 24, 25, -30, -19, 45, 24, -26, -10, 48, 36, -12, -5, 42, 29, -15, -31, 20, 27, 0, -36, -4, 49, 6, -36, -17, 36, 17, -34, -26, 23, 10, -46, -31, 10, 21, -39, -37, 16, 11, -23, -35, 14, 22, -29, -19, 7, 31, 5, -33, 16, 34, -4, -25, 3, 30, -5, -33, -17, 26]
2745B6k4l1J3L9j2m6J2N2Kn2nK4K9m1j9N0J5m2j6K0M6m3k6L4K6k8l6L0L6k8k2
2776a7RL2k0l3J1L7J1n3j0L2K5l8k4N8%l8k4L8L6m2l2M3L1l0l9K5M8k3l6QM1j1
2808A5k7kM1j2j9oL2J2l8j2L8Pl2j5L5J9l9l0L7K9l2l0J9M3k1n3L2M3k9m3K5L1
2840A8nm0LL9Kl8mJ8K2k2k3L4J8k1m4N0K2k9l3K7M5k9m3J9M5k1l3JM9j1m7J7K8
2873A4Kk3j2M8lm0j9L2K9j7m6K2L6j0k7J2M1j8m1RL9om6RN2k2m3MM6ol5J0RJ9
2907A9m2rM3%j8l4L9J1k2k2J8L2k5l2J9L2Jm1jL7K0m4%M3K0o4rN5%n1j2N1J6l0
2941@l1K3L6k9m1M8K9k5l8K9J9jl6oN0k1l5rN9Kl4j9L1J7k7k2M5J6l6k3L1K9l9
2974hk0J8K9j5l4J4L5qm6J7L3ok6J0J2J1l5LL5Lk2j3J6L3l4k5L1K9l1l4L4K5k1
$$ y = [26, 2, -29, -16, 23, 11, -35, -23, 29, 31, -21, -26, -2, 27, -14, -33, 17, 32, -10, -26, -6, 40, -3, -29, 5, 31, 3, -33, -3, 33, 5, -17, -8, 24, 4, -29, -18, 19, 30, -23, -33, -1, 24, -14, -38, 20, 20, -18, -42, -4, 32, -10, -42, 1, 32, 2, -37, -12, 36, 13, -23, -15, 26, 15, -12, -14, 27, 15, -4, -10, 22, 34, -4, -16, 22, 29, -3, -18, 17, 36, -3, -33, 4, 33, 1, -29, -10, 33, 12, -41, -9, 34, 5, -38, -13, 18, 13, -27, -24, 15, 17, -21, -25, -7, 15, -7, -30, 4, 22, 1, -43, 7, 29, 0, -33, -6, 39, 10, -33, -14, 31, 10, -23, -22, 27, 16, -31, -14, 14, 16, -7, -19, 29, 26, -14, -33, -1, 28, 11, -35, -13, 23, 13, -14, -2, 39, 21, -20, -11, 28, 22, -24, -15, 37, 15, -28, -24, 22, 16, -19, -9, 0, 19, -23, -32, 11, 11, -7, -41, -2, 9, -13, -35, -17, 15, -10, -42, -23, 9, 10, -31, -32, 5, 25, -19, -19, 24, 44, -20, -29, 26, 26, -25, -37, 14, 30, 0, -31, -8, 28, -1, -42, 6, 35, 10, -28, 1, 20, 19, -17, -23, 27, 6, -29, -38, 21, 23, -11, -30, 1, 18, -9, -31, 14, 30, -6, -29, 2, 31, -8, -28, -10, 19, 4, -30, -16, 19, 11, -35, -18, 15, 9, -17, -7, 5, 16, -19, -16, 19, 22, 0, -13, 3, 36, 2, -23, 8, 37, 6, -28, 6, 31, 10]
3007A0l6K3J7kl7J1M2j0l0kK2kk4nK8lk0j8L5J8l7oJ4L3j0m1L0K2l2j9J2M2k0
3040Em4K0L1j1k7nN0Jl3mL4J1l7nJ3L0l5j1J7L3l0j8J3K5ml8J5M2k0l3OL8ol7
3074a4lL2ml0kL3J1m7PJ9J8j9j6J8J9k8j8J5K9j1l8K1L1j7l3NL4ok3qK7J3k9J
3108a3K6Nl3jK8mj0j4K1J9j2l1J8K4j9k7K2K2jl1J0K1Jm0J3K1Ol3j3L7Kk5k1L2
3142@J9l3j4K0K7j8k7K9J4j9j7J4K3ol5ML2lm5K0L7Km7oM8kl3mL2K5l8rK3Nrk7
3178a8K4J5j5k5K0K0j9qRK0rl1J4M0j3l4MK5jl0MJ2K0l4qK6J4k2k6L3K4l4j8K4
3212CJ9j8k8J2K7j8j9LK8Ml3j1M5Ll2lJ1J9k2pK9J6k7k5J9L5k9l1K2K9j0j6j5
3245b0M1j2k3J2K8nn0J9L3j5k5PK5J2l3j4J8J2j5j4J9J4j9k6L3L2m2j5mM9mm6
$$ y = [10, -26, -3, 14, 12, -25, -14, 28, 18, -12, -14, 8, 6, -18, -23, 5, 2, -18, -36, -1, 17, -20, -26, -12, 21, 11, -30, 0, 22, -10, -29, -17, 25, 5, -39, -19, 12, 1, -26, -31, 19, 20, -13, -17, 17, 28, -9, -14, -1, 29, -6, -17, 0, 33, 3, -15, -2, 23, 19, -19, -4, 38, 18, -15, -9, 29, 23, -14, -17, 15, 11, -19, -21, 12, 23, -24, -17, 2, 20, 1, -15, 3, 22, -6, -24, -9, 20, 9, -29, -8, 23, 6, -27, -22, 12, 6, -17, -25, 2, 15, -14, -13, 13, 18, -15, -16, 12, 8, -2, -16, 5, 24, 12, -19, -1, 23, 4, -23, -1, 21, 20, -11, -1, 20, 21, -19, -6, 15, 21, -12, -25, 12, 14, -11, -32, 0, 19, -14, -28, -8, 19, 1, -26, 3, 17, -2, -19, -5, 18, 12, -23, -19, 13, 10, -35, -15, 22, 24, -23, -29, 19, 17, -16, -20, 12, 37, -1, -10, 13, 18, 9, -18, 6, 21, 6, -19, 1, 21, 2, -6, 3, 23, 14, -17, -3, 37, 24, -10, -6, 19, 18, -12, -8, 4, 24, -10, -18, 8, 22, 0, -26, 7, 31, -3, -21, 3, 22, 4, -24, -12, 15, -3, -22, -19, 9, 13, -20, -31, 14, 17, -15, -18, -7, 12, -10, -17, 12, 28, 1, -24, -5, 30, 1, -30, -8, 21, 11, -5, -20, 21, 9, -14, -2, 26, 21, -29, -10, 23, 8, -17, -10, 15, 27, -6, -20, -2, 10, -5, -19, 0, 14, -5, -31, 2, 34, -8, -23, -27, 22, 18, -28]
3277b8J0L6pk7kL4k1oj3J2L5l2j2L0K5l4k3K5J9j8j5jL0qk9J5J6ll3J8K8Ll0q
3311a4L2pk1j5K9J2l0j9L2Pk8qK0K8k9jkL9k1k9J4K4rj1oJ7Lm0NK8J7l5j3L8R
3346A6k1j3K4Pj5j4K1Nj8rK1J9j8k5J8K2pl0J5L3j5k4MK6Lk7pJ2Nj0j%K7k5k2
3381b3K1Rk0j5L3Knk4QK4pk3LL0jl0mL7mk3k0K6K1k5j0K7Oqj2K2Mj3k8K9J3ll1
3418a4J4K3j7j9LK5j1k3PK9Pl4MK1kj2nJ6Nk8qK2Rj7k3K1K0j5j9J0K6j7j6PL1
3453B0k1j5J5J1j1k5J2K2jk2qJ8J7j3qJ4Klj6PK4j0k9J4J7j4kMJ5Nm1J5K6lk2
3488fNK5nj8J1Nj4Jj4K2J0k5rNK6k7j5K3Oj0k5K0PJ3k9OJ8oj7NL0lk8j6K5J2k3
3525a5j4K6J2qj1J5J4Ml5K0J6j4k1PK5k4rK1Lnj4KJ9mk9OL7nj9rJ5J8k5j3MJ8
$$ y = [-28, -18, 18, 11, -16, -18, 16, -5, -11, -24, -12, 23, -9, -21, 9, 34, 0, -23, 2, 21, 3, -12, -13, 17, 9, -20, -5, 11, 8, -25, -7, 21, 24, -6, -14, 18, 11, -10, -25, 4, 16, -14, -33, -1, 6, -22, -30, -10, 18, -11, -12, -14, 25, 4, -25, -11, 13, 4, -7, -13, 4, 7, -33, -28, 0, 17, -18, -31, 7, 16, -5, -18, 6, 13, -2, -16, 5, 10, -8, -17, 4, 23, 5, -20, -2, 20, 13, -17, -2, 31, 16, -8, -4, 22, 25, -2, -9, 3, 8, -2, -3, -3, 24, -1, -23, -2, 7, -13, -28, 5, 7, 2, -22, -14, 10, 3, -20, -17, 13, 12, -18, -22, 15, 11, -12, -32, -6, 15, -10, -20, 7, 13, 5, -7, 15, 19, 6, -22, 7, 20, 17, -14, 0, 23, 6, -13, -10, 15, 4, -19, -12, 17, 24, -10, -6, 15, 13, 1, -4, 12, 17, -11, -19, 3, 12, -5, -28, -7, 13, -2, -21, -11, 15, -2, -18, -11, 20, -1, -16, -1, 10, -1, -26, -14, 8, 7, -15, -23, -5, 12, -1, -9, 5, 7, 4, -12, -5, 19, 9, -20, -6, 11, -3, -5, -1, 14, 19, -22, -7, 19, 16, -6, -1, 24, 19, 1, 12, 17, 3, 4, -10, 12, 22, -3, -12, -7, 19, -8, -23, 0, 6, -4, -29, -9, -2, 11, -18, -12, 6, 0, -17, -12, 18, 15, -13, -29, -4, 8, -15, -29, -3, 9, 1, -10, 5, 19, 23, -12, 8, 24, 10, -11, -4, 21, -3, -12, 9, 12, 7, -7, -5, 14, 10, -19, -13, 24, 19, 0, -9, 6, 24, -1, -14, -10, 8]
3561Hj1j2J1K4k3j4J1K4k4rJ0PLj8OJ1Qk3pJ2J5j0j6K2J5j6pJ7Rj8j7K3J8j2j3
3596Dj1L0j2qj5M0j4j7MQJ7j3j6K6Nk3j6J9J5k2jLJ6k0j7KK4pk1J7K4k3j1mK6
3631Ij8j0J0J2Nk1j1J7Qj0mJ1J5k8kJ5K5j4k1QK8j4k4J1L0k2qJ1%krKJ6jj6%J1
3668IPj0j4K0Oj2j0J0Ooj6J1J3j9j1jJ6J6j9lJ2Nk1pK9ok1OJ6kj4lJ1jJ1j1%J9
3706A6j3j4K1Roj4oK8j3j1%MNj9OK0Jj8mK0Mj5j3K0J5k2j1J6K1k6k0J4K5k1k5
3741b6K3nJ6k6J4%Lo%J6pk0J5J1k2JPMOj3kRJ0mj5PJ7mj3OJ8jl2K9%oj1rL4j0
3781A4pk4K9nppJ4Llj6J3Rj1j8J4Qpj2KL5k7mj6K9nj9J8kmkj5J4J6j3j4J5J3k3
3819a5j4L2Jj5%J3K0k7j1J9K1j8j3J7Jj7J0j0J8nkrROMk2J3Mjk3K7%lk4J1Onj3
$$ y = [8, -3, -15, -4, 20, -3, -17, -6, 18, -6, -15, -5, 2, 5, -13, -7, 4, 12, -11, -18, -6, 9, -1, -17, 5, 20, 4, -3, 14, 23, 5, -12, 11, 29, 17, 4, -7, 23, 11, 3, -12, 28, 14, -3, 1, 9, 26, 13, -3, 23, 28, 5, -11, 8, 23, 1, 0, 3, 19, -1, -18, -16, 8, 1, -20, -3, 21, -2, -13, -17, 9, -9, -19, -9, 3, 8, -13, -24, -7, 1, -9, -13, -2, 13, -15, -17, -2, 23, 9, -12, -4, 24, 10, -14, -3, 27, 5, -3, 8, 8, 6, -3, -1, 15, 14, -2, -2, 9, 16, 6, -8, 12, 18, 6, -4, 6, 12, 6, -10, 1, 14, -5, -16, -17, -1, 15, -4, -7, 5, 10, -11, -18, 11, 5, -16, -10, 6, 4, -10, -13, -2, -3, 8, -3, -3, 16, 3, -11, 10, 19, 13, -1, -7, 21, 8, -3, -3, 1, 6, -13, -7, 13, 14, -4, -8, 12, 16, 1, -12, 8, 23, 1, -10, 6, 27, 1, -19, -5, 20, -1, -26, -3, -8, 8, -18, -4, -4, -1, -7, -7, 9, 2, -18, -3, 8, -14, -13, -6, -2, 4, -9, -11, -2, 8, 4, -11, -4, 13, 9, -4, 2, 20, 19, -13, 16, 16, 10, -1, -10, 24, 14, 7, -17, 12, 7, 0, -7, 7, 10, 7, -9, 4, 13, 2, -16, -2, 6, -1, -13, -11, 24, -3, -7, -23, 6, 1, -18, 0, -2, -6, -8, -23, -9, 7, -6, -20, -5, 8, -15, -29, 3, 4, -11, -11, 2, 22, -5, -16, 3, 24, 6, -7, 10, 11, -6, 4, -6, 12, 7, 5, -4, 5, 11, 15, -7, 6, 10, 9, -14, 13, 13, 10, -14, -3, 3, -2, -15]
3857a5oL2j5qmJ6pNj6K8oj0qRJ2j0j2K4j6Lk0K5J5l0%jK7j0j2J5MLrMOopJ0j0
3896@J4k6J3jJ2k0JQJ5k0j0K2Qoj8J0J0j4oLJ6j0j4pK9kk1LPOj2NrK9j9pMPlj7
3936b0K5jkj7PK5j1j1kJ4ok2J5K5k0llK5j8KkjQoKJ8p%k0JJ9j4oJ2Pj7mRRqj1
3977iJ1N%j1oJ1nj0mQJ5j0j1J9%Rl5K6Rk1j2K5LlkoQ%j8JL2kj8nQRj6nJ6mj2N
4019eQJ7j6j6K8k0J8j9J1J6k1j6J0QomlJ2%j9OJ4Mk3mJ4JnOJ3rKk1J6OqLJJ1k0
4059a0MRKKk2J0K0j5mMQLk0RJ3nj2qJ7Kj8MKK5j8%KPKl4K6PqrJK3k1j5J6J2nj7
4101a1LJ7j0j1%J2Qj7QKKnj8J5kNj3J0J8j7lPjjpJ8mLrrK1kj5JJ2pLj4J5Kj1j0
4143a5PJ8j9JNL%j3PJ1j5j2K1Q%j3PJJoj3J4KJpJ2rj0JK4j5Pj3KJ3opQqJ6k1Q
$$ y = [-15, -21, 11, -4, -12, -16, 0, -7, -2, -18, 10, 4, -6, -14, -5, 7, -3, -15, 9, -7, -4, -24, 1, 16, -14, -14, -15, 12, 2, -10, 5, 9, 12, 3, 7, 13, 7, 0, 10, 0, 14, -12, 1, 0, 12, -8, -7, 1, 16, -4, -14, 8, 16, 10, -8, 2, 12, -2, -8, -5, 11, 1, -13, -20, 9, 7, -14, -11, -4, 2, -10, -5, -14, 15, -4, -11, -7, 0, -3, -20, 5, 4, 2, -15, -8, 17, 6, -5, -7, 7, 1, -21, -6, 19, -1, -4, -7, 18, 0, 2, 0, -1, 7, 1, 3, 21, 14, 14, -6, -5, 14, 0, -6, 6, 13, -4, -8, 1, 10, 2, -9, 2, 7, 7, -4, -10, 1, -4, -14, -18, -10, 5, -5, -16, 3, 3, 12, -23, 3, 12, -9, -21, 4, 7, 4, 2, -4, 4, 4, -14, -13, 19, 17, -1, -6, 2, 11, -5, -10, 6, 2, -10, -5, 3, 20, 4, -12, 16, -4, 14, -5, 6, 22, 1, -15, -5, 3, -3, -7, -10, 2, 2, -17, -11, 3, 7, -16, -20, -6, -5, -10, -4, 9, 0, 2, -19, -3, 3, -5, -2, -1, 10, -10, -6, 3, 5, 7, -15, -5, 15, 0, -4, 0, 8, 11, -9, 0, 13, 8, -4, -12, 5, 7, -11, -7, -5, 20, 2, 2, 4, 11, 13, -21, 5, 12, 4, -5, -4, 19, -2, -17, -1, 11, 6, -11, -8, 9, -1, -12, -12, 0, 8, -9, -1, 1, 3, -2, -20, -5, -7, -2, -15, -5, 13, -4, -7, 0, -1, -2, -9, 9, 5, 8, -1, -10, 11, 9, -6, -5, 7, 0, 3, -11, 4, 6, -5, -15, -8, 10, -9, -8, -3, 0, 0, -13, -6, 5, -10, -22, -1, 7, 7, -6, 1, 2, 3, -3, -16, -2, 0, 1, -6, 6, -3, -13, -12, 12, -3, 4, -9, -7, 6, 0, -7, 1, -7, 9, -12, -4]
4185dPPjj5J0mLj3J3J1j1j1J3J2j6%lJ3k2nJ2J1Mk2RnMj8K8Jj2j8J3KPqqJ9Mk4
4225a7PJ1J6j4j1OJ%ojJ3j2j1OJ5Kj0OMJ9k2nJ8Jk0jRJ0k0OJ3Mk6PRPj7KRKj3
4266cnJ5J5j3rmJ%j0J3m%JmRrLj2J1J3mj9J5J6j4j3PJ1j1lNoJ0mOJPj5jPkokQ
4310AJ2j6%%J0jrkJ4pLJ2j0nj5JK7prRKknOj0Pk1J1NNj5j1J8Kj3J5KoJ0ok0J7
4352aLj0J2%Nj3MOk%MK%j0nJ6Lmj4QJ2k7NJ3mprJ3Rj3nQJ2k0J0nJ4lMj9J3Pj9
4395gJJOkknKnMLJ5qk3K5nj1J1mLOk1J5jJkoJ1JnjNJ0rj3K1orLOlJ4k5NJ3kk1
4441a4RJ6k5QlJ4Qj8QnQr%J0j9LJ6pKlpJ2oj3NNJ2j6J6qJ4j4j6J5J3%k0MNoJ1
4482EqJ0LqKj1K0roJ3j7J6k1J5lr%LRppnJ7%J3k1J5j3rJ0nJ0rnRKlqPOOj4oJ6
$$ y = [-4, 3, 10, 9, -6, 4, 0, 3, -10, 3, 14, 3, -8, 5, 17, 1, 1, -2, 11, -11, -16, -4, 7, 11, -11, -2, -7, -3, -21, 7, 8, -4, -22, -9, -7, 0, -8, -16, 3, 7, -17, -10, 1, 17, 3, -8, -2, -1, -1, -7, -8, 5, -7, -18, -12, 3, 5, -5, 1, 5, 24, 2, -3, 15, 16, -4, -5, 4, 14, -6, 0, 13, 17, -9, -2, 7, 14, -3, -1, 8, 10, -3, -8, 7, 22, 9, 0, -4, -3, -3, -13, 0, -4, -4, -3, -7, 2, -7, -4, -16, -5, 8, 4, -15, 0, 16, 2, -11, -4, 7, -4, -7, -2, -8, 2, -2, 4, 5, 12, -3, -4, 3, 1, -5, -7, 1, 13, -3, -3, -3, 7, 6, -3, -5, 9, 2, 5, 17, 7, 2, -13, -12, 15, 8, -1, 8, 10, 8, 3, 9, -1, 6, -15, -4, 1, 6, -9, -20, -2, 0, -13, 2, 4, -2, 8, 2, -18, -1, 2, -8, 4, 4, 9, -4, 0, 6, 4, 4, 8, 10, 10, 0, -5, 11, 14, 10, -4, 4, 16, -11, -6, 7, 3, -4, -13, 0, 9, -4, -9, -1, 11, -9, 1, -4, 10, 7, 11, -8, 5, 12, -7, -6, -5, 1, -1, -3, -8, -6, -11, -7, -4, 11, 3, -20, 5, 0, -11, 0, -4, -1, 5, -16, -1, -2, -1, -3, -9, 2, 3, -2, -3, 2, 12, 3, -10, 11, 5, -4, -1, 5, 2, 16, -9, -4, 9, 7, -14, -5, 11, -14, -6, -9, 5, 13, -5, 3, -2, 6, -3, -3, 7, -12, -9, 7, 0, 2, -1, -8, 4, -2, -15, -10, -5, 7, -9, 7, -1, 13, -1, -17, -2, 11, 11, -9, -5, 0, -6, 5, -3, 7, 10, 2, 4, -7, 13, 4, -2, 11, -6, 10, -11, 4, 1, -8, -8, -5, 4, -3, -10, -15, 2, 2, 15, -6, 9, -4, -13, -3, -8, 2, -7, -12, -3, -1, -4, -12, -5, 1, 7, -7, -13, 3]
4526CJ%Jm%rQlRroJ4Mj7LnNJkJ4nRj4kNMJqJ4k2OmJ2koOMJj3pJ9j2LJPlrKNqL
4577ejoJ3rMjJ2j5jpJ3Nj2PJ%jMrkJJ0mk%MJKmRj%rOj6OQLqNL%j6RjmoJ9o%MN
4629HnppJ8j0lMkJ0j8mPJ3qNpMj4NJ2kJ1j8J1JJ7opj1kRolRJ0j4J1ojnRjrLJ1
4674A2rj6J3Oo%KjlJ1q%j1J3jrPMopJ3Qj3qNnJ6j6J0qPMPQl1QJ4qPj6ROqPj6R
4720@kj1RJ4pMKj8K2j4kPNopJlJ2nk0K0nJjLj1Q%lK1k4J1%%KmmMmNjK5k4NmLk
4767BpNJ3lj0mJ%LnLQjLnjkNpOlmPlmkQqJ2krQkj1NMJKj3RPj5J1mJ3pj5NqKOn
4819a1OJ0j3NJ0Nj9J2Oj6J0jmJ3j5Qoj2QRj2J4lk1J1jJ2j2K0rJ%omJ3rOj0MpJ
4860gLNJpJ2%KoQnlj1J4rkLpJ2j1oRLjj1J0J3lnJ5j8KRj2NMp%J0pj3J1j2J3J3
$$ y = [3, 4, 4, 5, 1, 1, -8, 0, -3, 6, -3, -9, 5, 9, -8, -5, -10, -5, -4, -6, 8, 3, 12, -2, -4, 1, 5, 6, -2, 12, -10, -4, -8, 4, 2, -4, 2, 6, 7, -6, -13, 6, -6, -3, -2, 5, 2, -7, -5, 0, -8, -5, -6, -12, 1, -8, -4, -5, 7, -8, -9, -16, -3, 2, -10, -3, -2, -2, -3, 1, -8, -10, -9, 1, -3, -5, -5, -1, 0, 2, -2, 7, 6, 6, -3, 3, -13, -7, 1, 4, -4, 1, 4, 4, -12, -3, -4, -8, -14, 5, -1, -1, 3, 8, 3, -4, -11, 7, -3, -6, -2, -4, 6, -12, -16, -9, 4, -4, 1, -6, -2, -16, -11, 1, -1, 10, -8, 3, 4, 21, 15, 8, -3, -5, 4, -2, -5, 4, 14, 0, 11, 5, 4, -1, 8, 7, -2, 1, 12, 3, -13, 0, 6, 0, 0, 2, 1, -2, 9, 1, 1, -10, 3, 2, -7, 0, 4, -2, -9, 4, 12, -1, -9, -4, -9, 7, -9, 1, -7, 0, 4, 11, 19, -12, -4, 10, 2, 9, -7, 2, 8, 0, 7, -9, 0, -2, -13, -4, 10, 3, 7, 9, -9, 13, -1, -3, 4, 9, 3, -4, -3, -6, 6, 1, -19, 1, -4, -3, -4, -1, -12, -4, -4, -7, 14, -10, 1, 1, 1, 3, -1, -5, -1, -5, 0, -1, 24, 0, 5, 1, 4, 2, -5, 0, 13, 10, 0, -4, -3, -3, 0, -5, -2, 6, 5, 8, 3, 2, 0, 5, -2, 4, 1, -3, 4, 1, -3, -5, 3, -5, 7, 5, -4, 4, 2, -9, -4, 0, 1, 3, -10, -1, 6, -9, 2, -2, 11, 4, -11, -6, -14, -12, -6, -11, -5, 5, -8, -3, 7, 12, -7, 5, 11, -5, 5, 4, 0, 13, -2, 6, 0, -12, -4, 5, -7, 7, 4, -17, -6, -7, 5, -7, 13, 4, 5, 5, -1, -5, 8, -1, 5, -5, -1, -8, -7, -4, 1, 2, -5, 7, 7, 9, 3, 11, 6, 3, -8, 6, -3, -5, -2, -9, 3, -8, -14, -5, -2, -3, -14, -4, 9, 6, 1, 16, -2, 0, 9, -3, 2, 6, -1, -1, 9, 2, -11, 0, -12, 1, 14]
4904A4j9%Rj1jJ3qPj3RMj7jJ2klMN%o%lOOjj4POJ3j7%mOJNjmmrJ1kmJ9Nj1j1k
4951f%J5oqOrK0j2j2J2M%%qPj0nK0kj2K1j9JlpJ7lKpOj8J1qK8pj5MPjj0J2jKr
4995cOKojJ3mljjoK8qk2OkJ0mj2kJ0q%J6kmKojJ7pqJ3rMj5PmmJNRnj4J5JpnN%
5044dNj0J0PrMoO%oLnJ8j8LLLj0NOmJ3okPj2pPp%J7j3kKqJ1JqJ1Mj0Lj0K0j5K
5090a%oJ2pkqOOLLj6J6nk0J3K6k9MJ0Qpj5MJ1j4QloJ8rjj0J5KMJ1oj4K%KLKmo
5135@jnL%j0kJ2KmNOkLnpJ4lPk5K3j6LPkj0PnJ4lqLJ1oqJ7qNj3J3rkKMrJkJ7k6
5183a2K4noJ5Lj0lJ2j1MLKj4NqMlOn%%Lj5RJKOj3LKj0RjjNj6J0JkPmQkJoNRrj0
5232gJ2pJpMLJ3j7jJ3Kj8OKplRQnJ0qRj1MlNLJj3J4qnJ1qkLoLKnJ0rOPj3LrJ5
$$ y = [14, -5, -5, 4, -7, -8, 5, -3, 4, -9, 0, 4, -13, -14, -2, -4, -7, -3, 2, 2, -4, -4, -7, -1, 5, 4, -10, -3, 3, 16, -1, -1, -5, 1, 2, 7, 6, 2, -2, -11, 0, -2, -6, 13, 18, 7, -4, -6, -6, 9, 3, -5, 1, -8, 12, 0, -12, 0, 4, 4, 4, -4, 3, -7, -12, 8, 6, -6, 15, -4, -3, -6, -13, 4, 1, 3, -4, 2, -16, -5, -13, 15, 8, -7, -3, 4, 3, -7, 5, 4, 6, -3, 3, 5, -1, -2, 11, 7, 4, 3, 2, -4, 24, 16, -6, 0, -2, 8, 4, -8, -10, 0, -8, -8, 8, 6, 2, 4, -2, -3, 14, 7, -1, 12, 3, 7, -8, -1, -5, -9, -8, -3, 6, 1, -13, 2, 3, -4, -9, -4, -4, 1, -9, 1, 8, -1, 3, -3, 3, 3, -3, 0, -5, 13, -5, -2, 1, 4, -6, -1, 5, 1, 14, 8, 6, 13, 1, -6, 1, -6, -6, 11, -2, -4, -2, -10, 1, 2, -6, 5, 9, -1, 2, -8, 12, -3, -1, -1, -7, 5, -2, -4, -12, -6, 0, 3, 6, -10, 6, 1, -19, -6, 20, -9, -5, 5, 13, 6, -9, -5, 6, -8, 0, -3, -9, 9, 0, -1, -11, 4, 6, 10, 21, 15, 1, 3, 3, 5, 8, 10, 6, 0, -1, -6, -3, -3, -13, -15, -3, -1, -5, 0, 6, 4, 7, 2, -5, 9, 6, 13, -12, 11, -5, -2, 5, 3, -7, 0, -5, 9, 6, -2, 1, 12, 6, -2, 15, 7, 12, -1, 12, 3, 1, 3, 7, -2, -1, -3, 14, -12, 12, 7, 1, 16, 19, 9, 6, 18, 7, 11, 14, 16, 2, 7, -1, 3, 0, 6, 1, 1, 1, 4, -11, -2, -1, 1, 7, -6, -3, -1, -11, -2, -3, -4, 1, -15, -5, -4, -6, 1, -3, 5, 3, 4, -2, 3, 12, 3, -7, 5, -2, -1, -8, -4, -1, 12, -5, -6, 7, 9, -9, -3, -1, -8, -11, -2, 6, 1, 11, 3, 12, 1, 5, 2, 7, 10, 11, -2, 12, 4, -1, 10, 2, 0, 3, -3, 0, 2, -3, 7, -2, 4, 11, -2, 1, -8, 7]
5280GqlJ9kknMj0L%PoJ0rMq%kMJ2Mj6PpJJLjRpMomLj1LLnjR%jNj6MJ5j2J7j6%
5330@jqpJ6jpJ2j0pJ6Kj1LNjKkjmjPK%kJ3mj0Rj1Kj5K4knjNmJ4%rmPpMqnJrJ5
5379Bj0PKnKONJj1%nQNknjOj2RJnLj0J5Nk0J3J2lj1JlkMqL%NqNjkPJ2j5LqlLJ9
5429A4j8Lj0J2JkKlpLJ3rQjmrMNNqKmmJ0nJmLKJ2npmJ3nNj0PQkrNmNlj4NJ5qL
5479Gj2rK3jKmjNj2%RPmj2K1k8J1j0LQrK%J2%qJ3j3nllkOLqJ6j6RoLRrRnQoOo
5527@nJ3o%oK1mlmmPqj5K5j3MONj1KKpK2k5J4j4Lj3J7KPj8NLMj3JK1j8J0j2J1
5569F%ojlMj2RPNj4J2%jj4PRj3RJ2pRnkj2Q%qJ1qj%MOj4KqJ3qllNNJm%rJ1lJ0
5618F%j5kJ5M%qJjNmoJ0Nj4J4rKljj%JoKJ5nJ0j7J2JjojKKKkj0Rkj4K2m%Mpj2
$$ y = [7, -1, -4, 15, 13, 11, 6, 10, 0, 3, 3, 10, 4, 14, 5, 9, 1, 1, -1, 3, 15, 19, 3, 10, 3, 4, 5, 8, 7, 16, 9, 13, 7, 3, 6, -5, -2, 1, -4, -5, 4, 4, 3, 8, -8, -4, 11, -1, 16, 0, 0, -1, -9, -16, 0, -1, -8, 4, -6, -13, 3, 5, -6, -3, 2, 1, 3, 1, 0, -4, -5, 2, 4, 4, 2, 15, 11, 1, 10, -1, 1, -14, 10, 8, 3, 2, 7, 3, 17, 17, 8, 4, 11, 4, 8, 0, -5, -4, -13, 2, -8, -1, 1, -4, -2, 4, 9, 10, -1, -1, -6, 2, 7, 5, 0, -1, 5, -7, 2, 3, -2, 1, -9, 6, 11, -9, 4, 16, 13, 2, 3, 0, -2, 2, -6, -3, -3, 2, -6, -1, -2, -4, 3, 15, 0, 3, -5, -8, -5, 14, -4, -1, -11, 1, 2, 0, 2, -1, -8, -5, 8, -1, 7, 6, 2, -7, -3, 2, 7, -1, 1, -3, -7, 3, -2, -1, -5, -2, 0, 12, 7, 0, -4, 9, 4, 9, -1, 6, 14, 12, 3, 8, 4, 9, 6, -8, -3, 12, 4, 7, -5, -14, 9, 8, 10, 6, 5, 10, -2, -2, 7, 14, 10, -2, 19, -9, 2, -8, -5, 3, -6, -4, -4, 8, 8, 0, 13, 0, -5, -8, -11, -13, -7, -4, -12, 4, -12, -3, -9, -6, 3, -6, 3, -2, 6, 0, 6, 0, -5, 8, 2, 2, -4, 17, 13, 10, 6, 2, 9, 1, -14, 11, -2, 2, 8, 13, 2, 4, 6, -1, 21, -4, 10, -4, -1, -14, 3, 5, 12, -6, -1, 2, 6, -7, -6, 15, -3, 7, -5, 6, 6, 0, -1, -4, 0, -12, -3, 4, 9, -5, 7, 7, 6, -8, -1, 8, -5, 4, 16, 9, 18, 13, 11, -1, 7, 7, -1, 10, 2, 1, 1, 5, 11, -3, -1, -9, 4, -4, -7, -10, -5, 0, 1, -3, -3, -12, -1, -4, 6, 6, -9, -11, 4, 8, 8, 0, 1, 0, 5, 1, -5, 5, 10, -4, 10, 1, 3, 0, -1, -2, -2, -1, -7, -5, 10, 5, 15, -2, 10, 11, 10, 4, 3, 5, 7, 9, 7, -3, 6, 4, -10, 12, 8, 8, 12, 5, -7]
5666gPOJjkj5kJ3pjJ4k2J6Kj5J1MqNNPJj0Pkr%J1rOpJ0JkJj1J9rjMoNqLNj1J8
5713A7mj3J0j0kJ2rNJ4j3rOmJ1jlmj1J3kpMJ6j4j0KJ4j4%mROokkJ3n%j1Q%RpN
5757GJ0poPj1MJ2j2lJ6j5J3mnPoKk1J8pJNjKJMLNj4MJJpjoJ0%jplRjo%J1l%JJ
5806HJj3P%MnkJ7k6J7j0LNj1J6kOnMl%j1J3mpqJ6kNj9KNq%NNlnJ3kolJ0j8J7K
5852HmrMnJ1%j1J2JoJ0Nj7LkJ4j8JPj0LMqKJ0lJ%MJqJ4krQkJ0omQ%j5J5j1qO%
5899DOkJn%pJ5j1pK0l%nJmKmqLj1RPLlJ2j5J0m%kLoQLlk4K6Jj1mj1K1JkJLnJ1
5947A4j0JMj%n%nQj0KNJ3nqj%roJ9J4j3Jlj9N%kNRnJ1j7mP%rJ6Pj1MMlnJRJk0
5995a1NJ1j3J0njNkj2J7PmjMj2oJ3j0QpoOJ1j8QjONJ2jj8jnMJ2pNoMkokJ0j8k
$$ y = [-7, 0, 6, 7, 6, 4, -11, -13, 0, -7, -8, 6, -16, 0, 2, -13, -2, 2, -6, -1, 4, 11, 12, 2, 9, 7, -2, -2, 9, 0, 6, -1, 9, 10, 8, 9, -2, 17, 8, 7, 11, 5, 10, 2, 5, 10, -1, 17, 13, 0, 10, 0, -2, 10, 1, 6, 20, 7, -2, 4, 0, 11, 10, 7, 3, -8, 5, 3, -4, 0, 16, 2, -8, -6, 8, -6, -6, -10, -1, 5, -1, -3, -5, 8, 3, 3, -8, 0, 0, 9, 2, 7, 17, 10, 4, 11, 0, 4, 16, 4, 1, 17, 2, 15, 11, 6, 13, 7, 9, -12, 6, -1, 0, 5, 4, 6, 7, 11, 14, 19, 5, 9, 10, 11, 4, 3, -3, 7, 7, 6, -1, -4, 5, 4, -2, -2, 9, 6, 6, 7, 8, 9, -4, 3, 3, 7, 2, 0, 17, -9, 8, -2, 1, 6, -5, 11, 9, 15, 10, 14, 11, 11, 0, 13, 9, 2, -6, 10, 8, 13, -6, -4, 1, -7, -7, -2, 3, 0, -5, 8, 6, 0, -3, 7, -11, 6, 8, 4, -5, -1, -6, 5, 5, -6, 6, 7, 1, 11, 16, -1, 2, 0, 14, -4, -3, 4, -6, -3, 1, -7, -5, 5, 2, 3, 3, 7, 8, 0, 14, 12, 3, 11, 9, 19, 13, 9, 17, 17, 2, 17, 6, -2, 4, 4, 10, 8, 9, 4, 4, -3, 12, 1, -6, 14, 11, 11, 6, 7, 3, 5, 1, -7, -4, -15, -6, 1, 4, 1, 13, -2, 8, 4, 4, 2, 5, -1, 7, 10, 7, -17, 9, 10, -1, -5, -16, 5, 6, 4, 5, 8, 3, 14, 4, 5, 9, 8, 8, 3, 3, -2, 6, -4, -2, 3, 16, 11, 3, 2, 2, -7, -13, 6, 20, 7, 8, 5, -14, -9, -9, -11, -6, 3, -2, 9, -8, -12, -5, -5, -14, 2, 9, -2, 2, 6, 3, -2, -1, 8, 9, -11, -6, 5, -8, 2, -3, -4, 1, -1, -13, 4, 11, 7, 6, 10, -2, -8, 5, -5, 3, -4, -10, -4, 7, -11, -3, -4, 2, 7, 19, 18, 0, -1, -6, -2, 10, 3, 8, 2, 6, 4, -2, -4, 6, -12, -14]
6040a4QJ6mrkNJMjMlNmKj2%JPLmL%JJ2j9L%lROJrj3KOM%mjNnpJJ8j6NjQooQRj2
6093Brj4J8kjRj0J5j3J0nJkOjj7K2j2PMJj0nOq%J3jjPJj0PqNPj0Rkj9K3j2kPm
6138B%qPQj3KjMjj0J4mlkN%pRKj0OJNrmQpK0j6PooPOooJ2ojNJNrlOjOPj7J6Ok1
6190@PmLKj8J2MJ1j0nkrJ2jNj7J3krJ5kj2MqjJ5KOljj4K1lMk4J3J8k0Nj0J1j7
6232iJ6j0jK1j9Qj4R%J0OoJMj7KK3k5jkJ3nKjpJRrnJ3omLJOoj0J0Lj0oPqJ7j0
6277fjMKpK1rj0QJ2omjNj3J4L%j0oJ2kk%%oO%jLrjJ1nKkQqKnnJKJ2km%LlJ1k2
6327hJ6j0J3Nk5jK1j5JMnJoJ3Nj6J6n%j7J5J4j1pJ2Rj9RjjMlj0J8j8MmNmJ2jj6
6369fRJnlJ3pj3KLlPKJ3k8J6kQnLj5OQrlJ4j1j3K0KKQnlkpO%lKj1pJ8kmPKqoQ
$$ y = [-14, -6, 10, 6, -3, -5, 0, 1, 5, 4, 8, 5, 10, 6, 8, -4, -4, -3, 4, 7, 3, 6, 6, 7, 19, 0, 3, 3, 0, 9, 15, 16, 7, -6, -4, 2, 6, 6, 2, 1, 6, 1, -6, -5, 13, -3, 2, 1, 9, 3, -3, 5, 14, 2, -7, -21, -3, -5, -6, 3, -7, 8, -5, 5, 0, 1, -1, 5, 4, -13, 9, -3, 4, 8, 9, -1, -6, 0, -8, -8, 5, 4, 3, 10, 11, 1, 8, 0, 5, 12, 2, 11, 9, -10, 13, 1, -1, 6, 2, 2, -6, 1, 9, -4, -2, -3, 1, 0, -10, 4, 0, -3, -5, 0, 0, -7, 2, 4, -6, 0, 1, 6, -3, -7, 1, -6, 14, -2, 5, -1, -7, 0, 6, 0, -6, 6, 0, -1, 4, 5, 10, 1, -2, 4, 3, 9, 16, -1, 15, 21, 0, 7, 3, 6, 8, -10, 2, 6, 17, 7, 2, 0, -9, 3, 2, 7, -10, 3, 1, -8, 7, 5, -7, -3, -11, -12, 3, 5, 11, 8, 7, -7, 14, 11, 15, -9, 4, 22, 2, 7, -3, 8, -9, 7, -3, -4, 17, -2, 6, -8, 1, 1, 11, 17, 11, 12, 16, -1, 1, 24, -1, -2, -4, 9, 4, 6, 5, -2, -1, 8, -1, -6, 7, 1, -3, 0, 1, 7, 1, -9, 1, 4, -6, -12, -5, -13, 4, -6, -7, -3, -1, -8, 13, 4, -6, 2, 14, 8, 4, 3, 8, -5, 9, 12, 12, 2, -4, 8, 6, 4, 4, 4, -2, 4, 4, 3, 6, -3, -4, 7, 2, 4, 2, 10, 2, 4, -1, -6, -5, -3, 9, 7, 3, 3, 6, 3, 14, -8, 8, -2, 11, 16, -9, -10, 11, -4, -3, 1, -4, -3, -9, 4, 9, -7, 9, 4, 4, -13, 2, 16, 5, -2, 10, 19, 0, 9, 8, 7, 11, 8, -2, 16, -2, 2, -2, 3, -1, 11, 10, -6, 3, 4, -1, -4, 9, 2, -11, -9, -6, -9, -2, 0, 13, -15, 1, -1, 7, 2, 5, -10, -4, 4, -5, -8, 6, -5, -18, 2, 4, 6, 14, 9, 6, 4, -3, 3, 3, 0, 2, -9, -16, 2, 0, -4, 3, 5, -3, -9, -1]
6418aLj1J1nNJ1%mmJ%lnlj%MJ3k0jNNj0QJ4k0JJ7k1jQjOj4J0Kjj1J0j1RMlQqO
6464Bkj4J7j1Qmlm%MrK2j3Lj0ORJ1j5J6pqJ3k1J7j1QkMrnJ7j5QoNkMLnJ1j0mL
6508ANkpnj0PQJjLOj2NMLKQk0K0j2%ll%rJ2oJ3Jj%mPk1J5q%O%jkjNMmQkpj0mJ7
6559FmMqOrPQj9J0LJj0PjonOrK0jj1PKmLmjRKopJ4m%qoJ1pJnQJrJ8krLK%nJnM
6612aNkLnj1%PkJ6j8lJ4KmrRj2NOknK1plj3J6qLpJ0KLKqNj2K1j0%j0QK%nMmJ5
6659A8j2LoNm%kRlj0J3olNj6ONMk0J3MMJ%l%PmnnRomJ8j2lOJLj9QJ1jj2J3%kj5
6707gJ0onJ4jjLMlj8J2lPMqJ3nKklj2jJ9j4qJKLNpjJ1qnJ6lpLoJ3j4NK1k1QLq
6754BMJ1k5J3OKqJJ3j4KKj1J3j2lJ3KjojkKj5J8mRj6J0j0J0JPk0J0j3LLlpQ%k
$$ y = [-1, 2, -9, 2, -3, 2, 13, 13, 9, 5, 6, 6, 3, -2, -5, -6, -6, -2, 11, -9, -10, -5, 0, -10, -2, 12, -8, -7, 10, -11, -12, -4, -5, 1, -13, -3, -1, -2, -13, -3, -14, -5, -1, -4, 4, -4, 2, 0, -14, 3, -8, 0, -4, -7, -11, -11, -7, -16, 6, -7, -4, -14, -8, 1, 12, -3, 13, 6, -2, 11, -10, 7, -4, 4, 2, 6, -3, -8, 9, -6, 2, -4, 1, -1, 3, 6, 1, 12, 2, -2, 1, 6, 4, -3, -8, -18, -11, -3, -2, -3, 0, 6, -6, -1, 3, 6, 8, 16, -4, 16, 4, 4, 1, -2, -2, -11, 1, -5, 8, 9, 8, 8, 4, 11, -10, 5, -3, -3, 3, 3, 2, 0, -1, 4, 8, 4, 12, 10, 3, -7, -11, 6, 2, 6, -2, 4, -5, 2, 10, -9, 1, 4, 5, -5, 2, 1, -5, -10, -4, -13, 7, 6, -5, 2, 4, 0, 3, -1, -2, 7, 9, 3, -4, 10, 6, 6, -2, -8, 3, -4, -3, -8, 0, 1, -8, 10, 8, -1, 2, 4, 4, -1, 0, -5, -1, 4, 2, 5, 0, -11, -11, -4, -6, 10, -8, -11, 3, 5, 1, -8, 1, -11, -6, 0, -2, -7, 14, 7, 4, -9, 7, -1, 2, -5, 5, 7, 10, 12, 4, 9, -3, 18, 8, 8, -2, 6, 8, 8, 3, 7, 3, 18, 6, 9, 3, 8, 4, 4, 2, 11, 8, -2, 11, 5, 2, 7, -9, -3, 2, 6, -14, -1, 3, 7, 8, 8, 5, 5, 12, 8, 3, -2, 7, 1, -3, 15, 3, 0, 6, 7, 10, -9, -1, 10, 9, -3, 10, 10, 8, -7, 3, -3, -8, 6, 5, 4, 7, 11, 8, -10, 2, -1, 6, 10, 2, 15, 10, 12, 10, 7, -5, -6, 13, -1, -9, -8, -6, -3, 2, -5, -6, 5, -3, -8, 8, 5, -2, 1, -5, 8, -6, -1, 20, -1, 7, 10, 2, 6, 17, -8, 5, 11, 13, 5, 6, 19, 5, 7, 9, -2, 11, -1, -4, 9, 11, 10, 4, 3, 1, 3, -12, 6, 2, 11, -5, 5, -5, 5, 6, 13, -7, 3, -10, -7, -4, -7, -14, -6, -6, -8]
6797hLJ0onJ9j7QJKlqrJ0OqnRjlNL%jJ6njJpmlJ2Pk4K%J1Qk1J3lj1JMOMnrPm%
6847c%PnJ1j7NnJ0j1J8rnRnJ2j2mOmOJ2j8LLnkRlLoQLj4oJ7rJ5qnMjPppJ3rLl
6895AJ0j4jqPN%nJ4j6oNJ6pnoQkMnj0J5MlkPjOj6J6k1K2j3KkJ1mkj3nJ4J3j3J6
6939A6j8kJ2njKMjLj1Lk0K1JMkmJ3j5K6k6J0j1%OLj1J0mPj6J6Lk5QMKRj1OmlJ
6982@pJJ3RojjJrjqJ4kmJj8J9JmJ4kpkjKRMj5j0J8j3PpLOlOKj2kjNJ5rmJQj9k
7031a1KN%j6P%mJ6rRMj1J5rj4jJ7qJ1nMj3MJ4j2KlORmoKlPjoOjJOj6J3j7QRpj2
7078a2PJkJ3JnjM%pj0MNNj2oJ9mkLj2M%J6j4lJ1jOj8QJ2j0nMPlJoPJrRnOJj2K
7126blkJ8nj3JLlKK%PnKk%qJ3j1J3j7J6jjJnjj1RJ8k0OnKJ2mj3Q%JmNpNkjNRj8
$$ y = [-8, -5, 5, -1, -6, 13, -4, 4, 5, 7, 4, -4, -13, -3, 3, -5, -10, -1, -2, -5, 0, 3, 3, 2, 18, 13, 12, 13, 6, 2, -1, 11, 18, -6, -4, -4, 7, 15, -6, 7, 4, -7, -6, -2, 4, 8, 3, -6, 1, -3, -3, -3, 4, -1, 10, -7, -2, -7, 3, -8, 10, 1, -4, 5, 0, 12, 0, -4, 2, -2, 4, 16, -2, 1, 4, -1, -3, 6, 3, 6, 0, 8, 11, -3, -9, 8, -1, 14, 6, 1, 5, 4, 11, 4, -3, 10, 1, 4, 1, 11, -3, -4, -12, -5, 0, 0, -5, 9, -7, -13, -8, 8, 1, -4, -10, -2, -4, 0, -5, -15, 0, 4, 1, -1, 6, 5, 11, -5, 11, -10, 12, -1, 1, -1, 10, 6, 4, -9, -14, 0, 13, 0, 16, -2, -4, 8, 3, 2, 4, 8, 7, 10, -1, 2, -18, 3, 4, 8, 6, 2, 15, 0, 26, 0, 10, -1, -1, 5, 8, -3, 7, 3, 10, -6, 10, 13, -12, -4, 0, 2, 11, 0, 6, 2, -1, 0, -7, -6, 7, 16, 10, 9, 8, 9, 0, -1, -9, 5, 3, -1, 0, -18, 1, 2, -2, 12, 10, 3, 1, 0, 2, 11, 15, 0, -10, 8, -5, 2, -5, -2, 4, 1, 7, 9, -3, -5, -6, -1, 14, 5, 1, 2, 10, -9, -11, -9, -4, -4, -20, -13, -13, -17, -1, -10, -1, 3, -8, 7, -2, -16, -17, 0, -8, 3, -2, 2, -11, -7, 7, -5, -3, -6, 0, 9, 5, -1, 1, -2, 5, 4, -2, 4, 3, 4, 10, -6, 7, -10, -2, 7, 0, -12, -5, -4, -6, 7, 8, 3, 2, 6, 6, -1, -11, -7, -2, 3, -9, -15, 4, 0, -2, 1, -11, -7, -7, 9, -5, -8, 3, 2, 8, -10, -2, 10, 0, -5, -1, 6, 3, 4, -2, 5, 6, -3, 6, 1, 7, 8, -4, -2, -5, -7, 11, 6, -7, -6, -3, -6, -4, -2, -2, 5, 0, 2, 0, 0, -8, 5, -6, 7, -10, 6, 5, 4, 5, 0, -1, -12, -3, 15, -5, 1, -4, -2, 10, 6, -7, 1, 1, 2, -2, 3, -4, 1, -1, -2, 3, 12, -6]
7175fMPjl%PPj7MN%lMnlj5K6qrNjonJ9k0RJ0j3oNjJ0LrpOKOpK6l1LJ4j6QJ3qM
7223G%PmkjMj0J3Ok0jRlmKNrMNJJknpMMNjqrkK1PrmrQjNqMmJ3j2MpQj8J8nNrJ5
7276A1Pl0J2j0KKJ2%kjoJ7OrmnKmqJ1nlLJ4j2MjkmnJ0oJ0k7K3%l%Pj5Oj2j4K5
7320dQj0Qj2J0pJ0j0J5pklqJ1j1J0m%QOk%joOpJ0j0NjlQqJpNLpqK4j0RNj8J1q
7366ajKkqJ3pKPpjoJ3qQpLmnlJ3%rOj4J8nlmQj3J4PJlJ6j5k3K0lKMpKNj3jJ1j
7414ArJ8j3NPJ5j3k1QLnJJ3j8NKlqQN%mmNqnJ1Nj0J3j3PnJ7j5lmJ0LKj2J2Lj0
7458dJ9pRrnj%OMj0nPNrqPnJ6jk0J1pJ0J%jmRlj3NnOnJ0j6NMOj1kMPj1J6j5J2
7505Bj7R%j3K1rJ1j2lJ1nnRRj5OOmmKNmlKKMrNqjPj0J4nJ0nk0J9oJ0j0%%PmrQ
$$ y = [-6, -2, 5, 4, 1, 1, 8, 15, -2, 2, 7, 7, 4, 8, 3, 0, -15, 11, 3, -6, -1, -2, -8, -13, 6, -14, -5, 5, -8, -14, -9, -10, 0, 3, -6, -13, -7, -5, 1, -6, 20, -11, -8, 6, -10, -2, 11, 3, 7, 7, 14, 10, 8, 7, 11, 1, 14, 20, 0, -1, 8, 5, 1, 3, 8, -1, 3, 8, 9, 10, 8, 3, -4, 0, 4, 9, 8, 0, -9, -11, 10, 17, 8, 4, -5, 3, 2, 7, -1, 3, -1, 12, 0, 4, -3, 5, -13, 5, 0, 5, -4, 11, 18, -12, 0, -10, -8, -6, 6, 6, 4, 3, -3, 14, 20, 11, 7, 2, 4, 0, -8, 3, -2, -5, -2, 12, 0, 4, 3, 1, -3, -8, 2, -4, 6, -21, 2, 2, -1, -1, 6, -9, -3, -15, -29, -4, 4, -6, 2, -10, 0, -7, 3, -7, 8, 1, -1, -4, -12, -1, -12, -2, -6, -6, 2, 8, 6, 6, 5, -1, 5, -2, 8, -2, 3, 2, -1, 7, -1, 0, -7, -2, 1, -6, -14, 10, 0, 9, 14, -4, 7, -1, -2, 0, -2, -10, 3, -4, -2, 5, -2, -3, -9, 4, -4, 4, -3, 0, -4, -9, -12, 1, 1, -8, -2, -16, 2, -3, -6, -10, -2, -15, -1, 6, 7, 4, 20, 5, -18, 2, -1, 1, 5, -2, 0, 5, -8, -9, 2, 1, -8, 10, -3, 2, 9, 24, 11, -10, -2, 1, -4, -3, 10, -8, -3, -1, -4, -12, -4, 1, 1, -3, -7, -2, -10, -15, -4, 1, -9, 4, -9, -2, -7, 10, -5, -8, -12, -2, 1, 3, -9, 3, 6, -4, 15, 8, 17, 8, 3, 2, 2, 8, 12, 2, -3, 4, 9, 0, -8, -1, -6, 10, 9, -11, 0, -7, 3, 4, 4, 3, -1, 8, 5, -8, -3, -8, -2, -7, 3, -13, -8, -4, 2, -9, -11, -7, 0, -11, 5, -10, 2, -15, -6, -6, -19, 2, -7, 4, -8, -11, 0, -5, -10, -1, 8, -7, -1, 5, 1, -3, -1, 4, 0, -3, -1, 1, 5, -4, 1, -7, -8, -1, -11, 3, -2, 8, 3, -17, 2, -4, 6, -4, -4, -4, 3, -1, -10, -2]
7552boj0KJ8Jj7J6jNnKj1pN%Qjo%PMLj1jKMKk%j1J8JnJOKj1%qJ9oolJ2j2JJOl
7601Aj0Ro%mRplkJ0Nj1MqJ9j0J2j1qJ0j1OkQj1RoJ0j1lQmQj6J5j5K0KqOqJ0j0
7644dJ1qlOM%ploOKjkJ1qnJ1jJjnPJ1rOk2QpQnNqRPmOj0Nj0LJQoMj4PQlj0J1m
7695@J7pp%kJMJnoQkJj0RpOj4J3j3MKOK%mlMJ2pnNn%jM%j2OjPKj1NRj4NPojRj2
7747fK2j1lJ0j0rQLOJj2kJ0JQj9PJ4llrMnPqPj0mJJOlkPqmQrJ5mrRJkj5J0oMJ
7796eJKlLMj0MJJ5qjRk3J7kOk2LJ0MJ1orQLKj2nJ3qj2J8qjOmnj0ORlj2NQJLLj1
7844eMKqPPpl%Rj6J9jj6K4k6QllJ6qkMJLrRj0J0kOj1PLl%k%Rpj1J0j0J2Jj6J1
7890CJk%pJ7rLoqJj3J2J9j4j9J6Nm%rLJ2j1MjOj3NOJOKJ2j5j2J3jQj1Pj6J6Ln
$$ y = [-2, -8, -18, -16, 2, 3, -14, 2, 1, 6, 1, 3, -8, -15, -10, -10, -2, -3, -9, -9, -2, 2, 5, -6, -7, -5, -1, 1, -1, -1, -12, 6, 7, 2, 3, 9, 11, 0, 0, -8, 11, 5, -1, -4, 8, -4, -3, -2, 4, 1, -9, 0, -6, -6, -10, -1, -8, -11, -13, -3, 2, -9, -5, -13, 6, -4, 8, -3, -11, -1, -12, -6, -8, 0, -11, -2, -8, 2, -9, -12, -4, -8, 0, -16, -1, -16, 4, 6, -2, 4, -4, 6, -4, 7, -1, -4, 2, 6, 6, -1, -4, -10, -4, -2, -3, -5, 6, -2, -7, 4, 3, 4, 3, -2, 5, 16, 7, 13, -9, -1, -8, 0, -5, 0, -8, 1, 8, 4, 10, 0, 5, -5, -2, -1, 7, 1, 5, -9, -2, 6, 3, -7, 4, 0, 17, 10, 3, 3, 1, 2, 6, 7, 2, -4, 4, 2, 3, -7, 2, -5, 1, -13, 0, -13, -9, -7, -1, 1, 1, -3, -6, -2, 10, 3, -2, 3, -2, -2, -3, 1, 1, -11, -5, -6, 1, 3, -8, -3, 6, -8, -3, 4, -2, -3, 6, -6, 16, 5, 2, 12, 2, -7, 1, 4, 10, 11, -1, -3, 7, 8, 16, -3, 4, 18, 15, 12, 3, 7, 2, 9, 1, 8, -2, -6, -5, -4, 2, -1, -3, 4, -4, -8, 0, -9, 6, 2, -7, 2, 3, 1, -14, -4, -10, -6, -5, -4, -2, -5, -2, 2, -8, -4, -3, 12, 4, 3, 12, -11, 6, 4, 10, -12, -9, 1, 5, 16, 10, 1, 9, 12, 14, 2, -3, 10, 2, -10, 8, 0, -1, 5, 1, -4, -14, -8, 1, -2, -14, -9, -1, 0, 3, 6, -5, -1, 1, -7, 0, 7, 0, -3, -3, 6, -10, 9, 8, -8, 16, -10, -2, -5, -8, 8, 0, -2, 2, 3, 6, -3, 6, -4, 6, 4, 10, -1, 6, 9, 6, 6, 4, 4, 13, 6, -5, 5, -5, 7, 8, -8, 3, 4, 2, 2, -5, 12, 3, 6, 0, -8, -7, -20, -8, 11, -3, -22, -6, -1, -5, -5, -14, -11, 1, -10, -6, -7, -1, -14, -9, -3, -2, 4, 6, 18, 3, -9, 4, 3, 11, 0, 7, -9, 7, 10, 5]
7934EnKLnOoOLmpJ1nkkPmNjmljJOmJNpNoMjj1kMrKjPLljRPpNj1lJ9k0J4PJlj1
7988anKJ3ll%KMk8K3Rj0pKNoNjqJ0%ppJ0j2LOLj9LK4j1kKMLPlLlj1j0OLpJNPl
8037bNkKlMpJ2qOnj1KMLMjm%OknJ6ppJ1nK%j4J3%j1L%onK1j0nJ1Jj2PkJ2j5J3
8084InOlj0Lj2J5j1MJOj0QPmp%nPnNLkrMJ1qnJMLMj0QkQjoRpnKPj3JLLmokNJ%
8137dJ0mj1jJ2lj3K6j3J0j3nJ4qLjK4j6J0nj0rJlMJ2%nmJ1pkJLJ1omLj1NKRok0
8181a3J5kMkmJJ1onl
$$ y = [5, 0, 2, 5, 0, 6, 0, 6, 9, 5, -2, 9, 4, 2, 0, 7, 3, 8, 7, 3, 0, -1, 0, 6, 2, 3, 8, 1, 6, 0, 4, 3, -8, -10, -6, -15, -13, -14, -7, -4, -7, -8, 1, 8, 1, 6, -5, -8, 11, -9, 5, 12, 13, 10, -1, -6, -4, 9, 6, 3, 3, 5, 9, -19, 4, 13, 3, -4, -2, 3, -3, 2, 1, -7, 3, 3, -4, -11, -1, -13, -10, -4, -1, -20, -17, 7, -4, -6, -4, 0, 3, 10, 7, 10, 7, -4, -14, -8, -5, -12, -11, -6, 1, -2, 3, 1, 3, 0, 4, -3, 9, 1, 7, 2, -9, -7, -3, 0, 4, 3, -1, -1, 5, 3, -2, 14, 7, 0, 11, 6, 8, 8, -6, 7, 7, -4, -1, -1, -7, -12, 9, -1, -6, 5, 6, -6, 1, -1, 11, -4, 9, 4, 10, 7, -3, 0, -12, 3, -8, -4, -3, 3, -7, 1, 8, 4, -3, -3, -8, -1, -6, -1, 2, 0, -9, -5, 6, -2, -7, -6, -2, 1, 5, -5, 3, 1, 9, 8, 2, 11, 4, -1, 1, 8, -5, -4, -1, 2, -2, -8, -10, -5, -4, -4, 6, 2, -9, -10, 2, -1, -14, 12, -1, 9, -4, -9, 5, -3, 0, -1, 23, 7, 17, 12, 2, -7, -6, -9, -5, 7, 7, 2, -2, 9, 2, 0, 1, 4, 15, 9, 5, 8, -3, 2, 4, 13, 7, -13, 2, 0, 4, 2, -2, -1, 10, 4, -1, -4]
8191d
$$ Imaginary data points
##PAGE= N=2
##DATA TABLE= (X++(I..I)), XYDATA
0@%%%%%%%%%%%%%%%%%%%%%%%oJ4j6J6j6J6j6J6j6K4l2L2l2L4m2M8m9N7o4P0p8
44d0Q6r5J05j18J32j48J64j84K09k41K82l36M08n16P01j087L395n187k384Q971
64D117k019o336J321M469l153k318K838J541j940Q41J413j097m05J703p86j422
80a233J417O64k504J81L084k86k733R00J971j500j349K192J479j559j410M13J123
97H50R33o98k013L87K604n85k882J031K858j946l399J669K967j301j882R96M98
114H7j356k15R58K04J3j02r16J67J634l32j704J185J850j876j449L075J538l407
132f46j178L284M76k821P26K775j191k516Q60J321o51l9M08j048r3J606q57k421
150b005J317K574j894k587K207K294k333j933J837R96j538pJ603k93j437J34R83
$$ y = [0, 0, 0, 0, 0, 0, 0, 0, 0, 0, 0, 0, 0, 0, 0, 0, 0, 0, 0, 0, 0, 0, 0, 0, -6, 8, -8, 8, -8, 8, -8, 8, -8, 16, -16, 16, -16, 18, -24, 24, -25, 32, -32, 38, -40, 46, -49, 56, -62, 70, -78, 86, -98, 111, -130, 152, -184, 224, -292, 409, -678, 2717, -2470, -4854, 4117, 2098, -4238, -2917, 1552, -1601, -3919, -1081, 460, -1480, -639, 774, -323, -728, 975, 189, -1233, 184, 848, -1656, -1475, 1609, 1323, -1410, -510, 1461, -39, -1388, 804, 2283, 724, -686, -273, 850, 1783, 1085, -928, -541, 2063, 1478, -1404, -373, 2485, 539, -2860, -1191, 1776, 475, -1407, -411, 87, -1269, -1484, -526, -322, -309, -411, -1327, -1160, 474, 142, -1562, -377, 1473, -403, -1852, 1223, 2761, -646, -1824, 1460, 1936, -885, -159, 2616, 1425, -1091, -231, 1090, 439, 400, 808, -240, -333, 1273, 416, -2005, -688, 1886, -8, -2595, -388, 1906, -427, -2360, -523, 473, -1065, -1072, 531, 238, -1199, -1065, -82]
167h2K34k00k21N4O26O2r82K44J675j91j976L08K132k57j819M99J559o89j520
186e44K76J197L67n37j009l43J068M48j464n71J691M40j838k52J665l85j701P70
204g22J568r39j117J202P37j316n43J119L97m71M9Q5j63K93J8o95L87J348n81
223F56j801Q00K032r16k103Q42J821q19j441Q23J097q15j006L42O06m5k61j33
241c21J57K52k78n04L13O48l02m91N65M75p24l91R19N04q79m96Q82O93n89q00
261c67L60Q38j47r85k3J158K01j322m63J284M03j392n23J288N78j050n64O29K26
280A29n75k46M84L74j50m13j39K92Q6m29Q7Q34M6r63k3J039n9j088K70J359r4
301H21j309K5J233R4j034j57R40L51p18n18M97O66m07q72J59R37n4r67m7Q79o
$$ y = [-82, 152, -48, -269, -215, 411, 473, -509, -265, 1410, 1219, -757, -449, 1683, 1426, -393, 106, 1665, 976, -544, -268, 929, 1296, 759, -250, -593, 475, 923, -541, -1112, 579, 1019, -819, -1071, 594, 209, -1492, -722, 846, -93, -1210, -8, 729, -587, -1130, -11, 386, -85, -36, 49, -114, 179, 197, -498, -111, 1237, 656, -1145, -345, 1687, 771, -1332, -490, 1331, 512, -929, -106, 991, 176, -830, -488, 118, 73, -188, -321, -164, 88, -190, -694, -381, 267, -35, -526, 39, 514, -210, -601, 318, 822, -57, -553, 329, 1022, 433, -367, -7, 831, 684, -301, -324, 834, 1035, -287, -750, 534, 937, -455, -978, 310, 888, -162, -726, -97, 129, -446, -692, -208, 166, 16, -397, -536, -244, -158, -587, -500, 334, 380, -583, -606, 433, 374, -714, -444, 915, 821, -488, -463, 770, 864, -170, -327, 613, 964, 246, -272, 225, 891, 484, -388, -229, 708, 654, -313, -360, 519, 513]
322E13r60j38P54R5o50J5O15p4p36j33O29J94n05j68O20K28p02m55O89N97n60
343a32o20O64P94n72r12M18R96j67q91J19R46P1r12k61Q04L57o97l88P04N11o24
364B08o69L99N18m03m42M67N34m62o05K72N07l30n28M20O76k76p89J14P08n6p34
385d71N0Q75R9r09l18Q67M28p98n17P42O28o13o95M80P00m10p18K90P35j84o44
406c83J39O12j49o96QO50R4n03jN05o6o67j06O84L04n52k42N83K83o68m62O53
428B0O59m43o25M31O39m24p93L04R01p7q06o2P24Q1p48k16O91K77n91l09N41K85
450D59n60m07M53L73m17l53M11L68m15m64K88M43l05m61L44N85k61o84J11O58
470A66qo04K6P17J04o66k15O39L28n14l39N38M61m12m96K86N20k35m82J72N18
$$ y = [513, -447, -585, 169, 264, -386, -371, 244, 170, -566, -699, -70, 124, -381, -549, 71, 299, -403, -858, -169, 428, -132, -752, -88, 706, 134, -778, -360, 636, 469, -422, -303, 643, 714, -198, -459, 345, 702, 5, -383, 321, 832, 208, -461, -62, 456, 53, -389, 78, 612, 150, -455, -183, 324, -6, -534, -114, 562, 286, -503, -389, 319, 263, -471, -421, 454, 553, -356, -674, 193, 621, -177, -694, 48, 676, 63, -632, -152, 548, 138, -580, -290, 445, 261, -383, -244, 368, 219, -477, -469, 181, 275, -228, -229, 276, 210, -457, -563, 121, 425, -127, -369, 214, 497, -171, -633, 20, 679, 236, -389, 42, 681, 257, -536, -232, 669, 592, -214, -276, 448, 529, -219, -435, 256, 533, -58, -367, 174, 459, -101, -508, -55, 318, -99, -452, -41, 327, -88, -552, -264, 179, -126, -587, -243, 342, 81, -603, -492, 166, 158, -446, -420, 297, 401, -265, -480, 159, 487, -27, -366, 172, 633, 221, -275, 11, 531, 296, -186, -14, 504]
491E04j16m93N4M38j43n61R4N74J5n40m9M60o2o18j3O41J55n73j89N16J53n76
513c29l04N73M86l75n00K59M48k52m81K55O28r9o07qN55N4n27n3N21J15m89j48
535b78M50J42m47j89M14J81m16j97M14K93l97l71L04L76k76l67L21N08k39n71
555c45J23N80n1n53M3O44N8o15k05M98K28m51j97M69K53m99l59L49L65l01l47
576c13K66L18k58l59J95L00k15l88K05M47j08m78L3M51l7n02ON96J40n03k04M88
598H0K09m45k20N01L81l88m09L11M58k18m57J75N03q6m85N5M44q6m97N0N22l4
620C64n30l1M20M3m38q3L68N5l99j39M13K42l88l86K63L80k46l90L25N29k76o61
642e65J46O05k4m65J03M92p7n09MM64J26l41j20L32J96l28k93K84L26k56l32K96
$$ y = [504, 388, -105, -51, 387, 244, -317, -223, 351, 366, -174, -223, 237, 175, -443, -456, 185, 340, -233, -422, 94, 247, -329, -633, -60, 426, 51, -449, -190, 258, 6, -475, -220, 408, 309, -298, -306, 249, 303, -224, -277, 244, 359, -130, -278, 172, 314, -133, -322, 92, 273, -143, -340, 74, 367, -30, -401, -97, 279, 3, -364, -43, 465, 226, -345, -222, 358, 307, -246, -203, 441, 499, -116, -321, 177, 405, -46, -243, 226, 479, -20, -379, -30, 335, 34, -313, -47, 271, 13, -346, -151, 149, -66, -454, -249, 198, 90, -388, -355, 96, 59, -443, -437, 159, 299, -204, -408, 80, 289, -156, -376, 125, 506, 118, -291, 20, 478, 260, -197, -22, 481, 395, -90, -35, 409, 323, -174, -124, 398, 364, -166, -197, 223, 266, -172, -255, 113, 168, -231, -370, 43, 285, -103, -489, -226, 154, -92, -482, -157, 372, 96, -565, -419, 186, 162, -303, -200, 292, 215, -294, -290, 174, 300, -41, -161, 171, 367, 39, -254, 30, 356, 100, -232, 64]
664F4L78l39m56K63M40k55l98K66M05k66m37J45M58m4m50o2M09J87l66k00L61
685A03K38m64l19M74M48l51m70K70L58k67l39K99L70k44m04J47L62j04l82N6L96
706A77j9m14k9M43M6m71j29M41J75l59j08L54J27l84k37L48L86j80l83J05M30
727C19n2m60K7M97Lm92N6N62p4o28l2N39P5l68j1K61o1l28n6K61J90j54k65N1
751a40L01j11m22J01N74j19o49R7O45j09n71J48N19k13n02K35N00j10l81pK30
772A6Q3j08j01P4K29m6k88M3L85j13m32J34N32r0n26Q6M10j42l91J76M30r3m16
795a48j1L06J4k89n1L49J29l55k42L20K61k92k63K35K42k18j95K25J88k17k88
816c00J10L28M3k67r8K37O8l13p2M09J47m38j51M21J34m47r6M44Q7l83p2L29Q2
$$ y = [64, 442, 103, -353, -90, 350, 95, -303, -37, 368, 102, -335, -190, 268, 224, -226, -288, 121, 308, -58, -258, 103, 341, -123, -442, 32, 480, 129, -341, -71, 287, 20, -319, -20, 350, 106, -298, -151, 211, 107, -275, -219, 177, 158, -256, -285, 158, 204, -267, -396, 45, 220, -139, -247, 107, 234, -150, -387, -39, 347, 167, -216, -111, 319, 267, -193, -166, 331, 334, -158, -102, 460, 386, -242, -274, 265, 340, -28, -39, 222, 161, -167, -223, 38, 228, 74, -191, -140, 161, 50, -372, -271, 303, 184, -465, -368, 277, 168, -403, -255, 264, 51, -451, -216, 284, 174, -207, -214, 16, 99, -9, -110, -36, 193, 147, -141, -98, 287, 174, -258, -124, 408, 318, -208, -122, 288, 146, -245, -69, 361, 268, -148, -159, 147, 161, -128, -179, 170, 299, -56, -298, 22, 283, -9, -272, -37, 205, -13, -208, 17, 205, -12, -300, -190, 138, 181, -86, -184, 53, 121, -192, -264, 145, 292, -146, -297, 124, 258, -189, -285, 159, 246, -137, -209, 120, 202]
839B02k65j10J57J44o0j57K3K08L6l23p4M05J21m42j12M49J33m43p5L82J8l90
861a73l4M06R6l25j44J79J11j63j22J86K44j91l36P0L32m7k95J09L08j45l34P6
883a92L26m2k73oK58Q7k31j37J59J78j51j97J86K94k16l31K29L59k20l59K57L38
905C16k28l03K27K76j82k43R6K15j8j81k0J78P0k23j85K25K73k15k85J84K76k59
927fl01K69L29k80l30K37L01k10l01J58K46j19k30J12K28m6k62k0K51P7k32j00
949b29K82J72k67k18K42K33j64k07K00K50j91k93J42L12r8l10J11L33j09l53J6
970a46L45rl06J8L02k9l33l7K93Q0k59j24K17J39j78j73J53K23j74k61J29L09
992A79q2l08P6L43q4l74M9L87kl13lK85j7k99j6K91R9k37j37K01J10j79j86J86
$$ y = [202, -63, -173, -16, 128, 68, -89, -66, 142, 178, -145, -219, 186, 307, -135, -247, 202, 335, -108, -183, 199, 217, -173, -207, 199, 295, -30, -174, 5, 116, -47, -169, 17, 261, 70, -266, -196, 136, 89, -206, -97, 211, 66, -268, -192, 134, 92, -181, -187, 71, 158, -73, -210, -51, 127, -24, -221, -35, 259, 43, -288, -59, 300, 80, -279, -22, 316, 88, -215, 12, 288, 106, -137, -41, 174, 156, -25, -45, 133, 203, -20, -205, 20, 293, 78, -207, -23, 253, -6, -307, -38, 291, 11, -319, -82, 219, 9, -292, -134, 112, -7, -237, -125, 103, 57, -205, -225, 26, 103, -129, -229, 53, 225, -42, -260, -18, 215, 51, -156, 44, 294, 103, -190, -48, 264, 166, -144, -33, 300, 191, -162, -146, 199, 190, -116, -98, 204, 175, -158, -195, 98, 178, -81, -205, 12, 151, -27, -200, -47, 176, 2, -259, -130, 179, 97, -211, -135, 208, 124, -250, -201, 186, 184, -129, -132, 153, 136, -163, -179, 112, 211, -26, -163, 38, 148, -31, -217, -31]
1016c1K35j40k32P5K45j07k72R2L19k7l12KL20Ol09k1L11N2k74q0K87J11k64j75
1040a89K38J68j71j81J53J97j59k41J18K30p8k45N2K69p1k98OK84J8k65m3K65
1062E7M2k64j01K71J09k28j43K24K10k00j94J66K33j49k33J58K66q2k49Q0K33
1083B06n7k61O2K59J5k22o4J81K7j93q0K44J13k17j75J61J41j91j72J78K33j65
1105B3k38R0J95j18j81J06K33o3k33MK25L8k12l9K06R7k01j04K22J36k11j42K22
1128E5J63j97j69K00J76j71j91J13J80r1j72P2J89p8k41K4K12L4k19n1K26O2k36
1151a10r7K24J20j86j06J97J27j81j40J45J66j06j71R9J98p7k19O2K03n1k24O3
1173f4K25j9k59k8K26mk12oK13K8k02q4J56R5j47q9J26J74j25k18R2K12n0k07
$$ y = [-31, 204, 64, -168, -93, 152, 45, -227, -135, 184, 157, -155, -153, 167, 173, -136, -157, 154, 206, -68, -148, 139, 250, -14, -189, 49, 217, 46, -135, 18, 215, 56, -185, -67, 163, 85, -160, -108, 161, 90, -208, -202, 82, 100, -165, -208, 57, 99, -165, -266, 5, 114, -114, -257, -33, 177, -23, -217, -51, 182, 33, -200, -42, 224, 142, -107, -27, 206, 149, -112, -50, 209, 224, 2, -62, 119, 146, -47, -127, 117, 230, 13, -162, -1, 140, -51, -223, -45, 188, 23, -215, -125, 70, -48, -229, -123, 110, 47, -186, -182, 43, 81, -131, -170, 36, 133, -68, -172, 50, 186, -25, -167, 55, 218, 21, -148, 52, 228, 57, -134, -21, 159, 68, -104, -32, 157, 79, -162, -138, 74, 108, -111, -162, 64, 126, -110, -207, 17, 137, -49, -155, 42, 169, -12, -152, -7, 159, 53, -118, -19, 179, 102, -117, -55, 148, 97, -127, -64, 161, 142, -117, -145, 81, 77, -135, -141, 72, 100, -102, -186, -30, 65, -82, -171, -45, 129, 4, -214, -122, 90, 40, -167]
1197a67J00K23p3k25N5K43j4k23K9K15%k07lJ72N4j84p5J54Q7j61j01J37J50j70
1221A6j93J00K13r2k03Q1J82p6k39M6K41k6j93OK08nk28l7K31P6j95m6J80O5j84
1246g2q8J92J20j41j21J07J56j11j46Q4J70o9j88N2J99k5k19j1K32J7k34o4K30
1269G0P9k18j09K21R0j99r8J83J32j80j43J48J39r9j38R5J61o8j74M5J66j9j77
1292i3mJ88L8k01p2K23Q5k07j37K02J37j94j32J73J48j98j69J72J89j25k02J22
1314e7J69j05j84P5J98m1j44J2J40Nj58k1J60J08j49j11J39J27j47j54J83J71
1336B16j47k08J43J92j50k14J52K08j38j95P7K08q9j82L1J65k7j57j7J61M4j24
1358e1r3J00J23j03j35J09J80j02k00R1K03q2k18J24K41r8k56R5K25q0k04Q1K21
$$ y = [-167, -67, 156, 83, -142, -87, 156, 142, -81, -52, 163, 163, -44, -47, 125, 179, -5, -80, 74, 161, 0, -101, 36, 186, 16, -177, -77, 136, 44, -159, -78, 104, 28, -211, -165, 76, 50, -143, -137, 71, 66, -162, -199, 32, 108, -87, -133, 47, 112, -72, -160, 32, 152, 11, -110, -3, 153, 42, -104, -20, 150, 81, -107, -55, 144, 119, -100, -111, 121, 138, -96, -160, 70, 149, -69, -178, 43, 133, -66, -164, 19, 151, -29, -172, -24, 115, 16, -122, -27, 134, 66, -108, -63, 103, 84, -93, -97, 91, 129, -72, -144, 79, 164, -43, -180, 22, 159, -35, -167, 6, 154, -44, -213, -41, 148, 23, -179, -57, 112, 7, -177, -102, 96, 55, -89, -77, 63, 68, -90, -111, 49, 157, 8, -103, 36, 163, 16, -138, 45, 216, 69, -139, 4, 196, 46, -168, -16, 192, 54, -141, -64, 144, 55, -127, -96, 69, 42, -115, -132, 29, 73, -51, -144, -44, 79, -24, -159, -50, 130, 28, -172, -81, 122, 40, -178, -54, 187, 89, -167, -72, 153, 73, -131, -50, 171]
1381A71n0k06RJ84qj24l5J09P2j04j01Q0J24p8j56M8K10l8k22K0K09l9k16L4K43
1406A36k7k32L0K03m7k04M1K11j1j89j2J18M3j16m6R4R2q0j06O2J30m4j82M6K01
1431A11jk17j2K19J4j92j6J91qj85rK17J7j91m1J38O3j22o1J34N9j17j05Q7J00
1456G3m9j07P9J39q4j51RJ80J4j58k9J47L2j56n7J67O5j66n8J52Q6j60j35J63
1480dJ24j42r3J19R6j08j12J03J05r3j10N6J30j7j27j1J41%j22l7J39O4j19q9
1504a07J31P6j23j00J53J30j31j50J08J52j08j33R8J18q3j21P7J16m9j37K0J42
1526G9k2j19j0J34Oj22m7J23N3j00q0J06R7j19j31Q3J71r0j44R5J53j05j83R6
1550g6J70n8j50P2J49o8j35K9J44j4r9j3Q3M8r2n7Q9Q5q1j19P8J29p3j58Q7J55
$$ y = [171, 121, -85, -76, 108, 100, -24, -59, 50, 122, 18, -83, -3, 121, 43, -113, -65, 145, 107, -115, -95, 114, 75, -141, -107, 136, 109, -123, -93, 110, 63, -141, -100, 111, 100, -89, -101, 17, 60, -56, -102, -8, 84, 4, -102, -40, 90, 46, -136, -90, 111, 110, -107, -119, 100, 114, -78, -94, 97, 89, -96, -105, 112, 129, -62, -103, 35, 98, -24, -85, 49, 108, -9, -114, -27, 73, 24, -83, -4, 135, 51, -100, -91, 89, 103, -55, -84, 63, 95, -61, -118, 49, 114, -52, -110, 42, 128, -32, -167, -4, 120, -22, -115, 4, 100, -8, -120, -17, 88, -5, -115, -59, 71, 54, -73, -84, 57, 57, -65, -102, 37, 101, -18, -107, 24, 100, -23, -123, 30, 160, 29, -121, -13, 139, 31, -102, -4, 114, 31, -90, -13, 103, 54, -83, -63, 79, 57, -62, -72, 62, 68, -54, -101, 22, 75, -25, -105, 1, 98, -21, -152, -69, 102, 12, -132, -37, 116, 11, -172, -76, 94, 36, -114, -42, 107, 39, -96, -67, 77, 63, -36, -49, 34, 82, -10, -67, 22, 107, 26, -93, -15, 114, 41, -117, -30, 125]
1576A25q9j65P5J92o9j69M5J49n5j36L9J41j8j30j1J03L1r6o0R7J20r7j08O8J09
1601I1p4j18R5J35q5j68P3J57n4j61L3J69k6j64OJ52Mj53j1J36K7j20o3J33O3
1626G7j09r5J05J20p5j14Q0J12p1j18N9J49n1j37K1J67j1j63pJ48J5j36m6J45
1650F5L2j41n5J42O5j33j04J13J01p5j26O8J11n4j49O3J40l4j44K4J22qj36RJ53
1675D9L9j56l5J19N1j01o0J36Q6j32r1R1J23p6j17Q0J23o6j49M7J29l6j18J8J39
1700I3j4j52j0J42K9j34l3J01N3j22o4J11O9j04q4J11Q4p7r0P8R8p5j25N2J38
1725G5k2j41L3J36l5j30NJ47J0j22n4J26L9j08n8J20N8j04p0P9R8q2r9O4R5l2
1751B8j06M7J14m8j08J6J24j4j30L0J29J5j22m2J12K8q4m1R1M3q7p7P8R6o8j01
$$ y = [125, 36, -129, -54, 138, 69, -100, -55, 94, 39, -97, -58, 83, 65, -65, -76, 27, 58, -38, -98, -1, 119, 22, -86, -18, 91, 17, -101, -6, 129, 44, -124, -51, 106, 52, -109, -76, 93, 67, -97, -91, 61, 65, -88, -99, 37, 64, -56, -119, 14, 77, -32, -127, -22, 98, 23, -91, -11, 101, 30, -88, -29, 120, 69, -68, -47, 120, 109, -54, -61, 87, 102, -34, -80, 65, 97, -44, -99, 43, 108, -25, -129, -16, 85, 10, -116, -48, 63, 9, -140, -77, 63, 29, -115, -91, 31, 23, -113, -104, 49, 88, -68, -103, 16, 67, -34, -94, 42, 128, -4, -95, -4, 119, 43, -74, 6, 129, 63, -86, -39, 90, 54, -64, -46, 93, 79, -73, -83, 59, 88, -46, -79, 22, 75, -47, -111, 0, 69, -35, -119, -8, 76, -1, -91, -13, 85, 10, -115, -63, 75, 53, -88, -55, 81, 46, -84, -79, 68, 78, -44, -98, 28, 67, -41, -99, 21, 79, -25, -95, -16, 82, 0, -99, -35, 60, 28, -78, -31, 83, 35, -73, -57, 67, 53, -77, -47, 82, 97, -25, -67, 45, 73, -11, -52, 39, 82, -5, -82, -4, 92, 24, -77]
1777g7O8J00o7j30N0J18l5j11J8J14k8j19J6J05L1j08m1Q9N3q9n9J13O6j03p1
1802i7J11P5q7p0P4Q6n5j05N0J03k4r0MR3qj11OJ02K8r5n0R9L3j25l4J12N6j01
1830b0n4Q2M4p4p5Q4P8m9r3M1Q4k4j00K8R4nj12pJ38j6j18j4J18J8r4k8J00M1
1858F7r4n6Q7N7o9o5O2Q5n3j00M2J07k4j10K6J08l1r3J8J05qj00rR1J9q9k2P8
1886B9M2q1o5Q0P5o5p8M9R8o8j14O7J16m6j11K8Q9k3j04L4R0lr6LP4J3q0l2R7
1915A8N2q8q0Q1Q1q0p1R8P2p3j03P3R6m6j03M5R9k9r8K1R6Nj00j6J10K8j12m2
1943f6J06M1q0p5R3N1p9m5O2P1p0r1M9R3m9r8K5J03Jj19NJ19oj24NJ09J5r2n4
1972a00J10M9r5m2P0N3o5n4O2O2n4p0M4R9k0j13J2J05Kj02KJ19Lj12k2J11K7j09
$$ y = [-77, -9, 91, 24, -106, -56, 62, 27, -84, -66, 48, 20, -99, -83, 22, 53, -55, -96, -7, 46, -43, -102, 11, 77, -26, -97, 14, 89, 2, -68, 6, 92, 37, -68, -18, 85, 61, -29, -25, 68, 60, -51, -45, 57, 85, -10, -60, 39, 72, -53, -87, 25, 81, -20, -74, 8, 52, -22, -97, -13, 65, 16, -77, -36, 48, 24, -76, -48, 46, 41, -71, -78, 60, 44, -74, -88, 30, 48, -46, -74, 26, 67, -27, -83, 4, 61, -8, -73, -11, 74, 21, -79, -37, 70, 46, -64, -38, 70, 39, -54, -36, 69, 61, -39, -48, 43, 62, -27, -49, 29, 71, -10, -75, 5, 80, 15, -63, -14, 84, 16, -98, -31, 85, 39, -72, -44, 45, 22, -82, -48, 42, 39, -57, -54, 20, 33, -47, -79, 18, 70, -18, -98, -17, 64, -16, -87, 11, 83, 10, -93, -20, 76, 30, -73, -28, 71, 42, -56, -35, 61, 66, -34, -50, 60, 88, -24, -66, 40, 81, 1, -74, 19, 70, -9, -54, 8, 79, 9, -82, -33, 60, 11, -87, -62, 41, 42, -77, -72, 47, 41, -83, -78, 31, 46, -46, -100, 10, 59, -36, -78, -8, 45, -20, -74, -12, 50, -4, -74, -30, 69, 49, -64, -52, 53, 55, -47, -45, 74, 77, -35, -57, 54, 81, -28]
2000b8k0J06K7q6n8Q0N6n7p4O4O6o2q9L3J04k7q5OP8j4q8oJ06J2j03lO6L3p8l3
2030g4P5O7r8n8P0P6p1o4O5R7o8r1N5Q1m1p4L4Q5l4q4J0P3K3p5j9Q1K9q2m5O6
2060IO8n4r1P4O8p4p1O8P0n1r4P0Q8o3q8O0O7k7r4K1P9ro3j8O5K6o7l1O5L8o0
2091a9o6N9P6m0r1L0J01m0r7M1J07m4j03N1J08k9r5L1P0j8o3J5N9Ro4PO4J4o3
2120A0m7N5N4k5o9K2P0k5j07L6R7k8r9K0R9l7j09K1R9j1r7QP0jp0PO2ll9j8L9
2151a6L7l7n6M4P1k8p0J0Q9j8p4J3R8k3j01K5J03lj00kR9Lq3j8R2Po1k9N7K6n2
2182Cm7M5O2m3p2L4O3k5o6J2Q0k9o5QP1Kr1PQ9J5r3k7Q7K9r3k7Q1L2o3l1M8N3
2214D9p3l6N3N4m1p0L7M9k0m9J2P3j4n9mO5J4n1j4O9L2p6l8P3M7p4m2O2N9o6o8
$$ y = [-28, -48, 58, 85, -1, -59, 21, 77, 20, -54, 10, 76, 14, -75, -42, 62, 35, -50, -44, 34, 20, -68, -74, 32, 44, -59, -62, 4, 37, -41, -74, 1, 68, -30, -88, -18, 58, -13, -77, -12, 85, 17, -74, -19, 62, 21, -53, -19, 66, 32, -52, -42, 31, 54, -21, -40, 41, 70, -12, -57, 9, 77, 23, -68, 6, 74, 0, -71, -3, 67, 16, -78, -8, 80, 17, -71, -11, 56, 29, -65, -44, 35, 26, -37, -55, 10, 36, -31, -62, 3, 41, -19, -85, -26, 50, 10, -81, -51, 50, 10, -87, -46, 61, 17, -86, -35, 73, 44, -51, -20, 50, 32, -31, -16, 43, 52, -12, -5, 59, 73, 10, -37, 18, 72, 47, -22, 0, 70, 45, -62, -26, 71, 43, -56, -36, 63, 26, -83, -62, 37, 26, -71, -63, 7, 6, -64, -57, 5, 2, -37, -55, -16, 21, -16, -72, -28, 43, 15, -55, -45, 44, 26, -48, -35, 63, 40, -61, -36, 67, 64, -36, -38, 61, 64, -19, -37, 55, 62, 1, -28, 29, 55, 3, -44, 1, 63, 20, -52, -18, 45, 20, -46, -34, 46, 17, -48, -40, 31, 33, -58, -51, 38, 53, -40, -67, 20, 49, -44, -71, 10, 42, -21, -52, -4, 49, -24, -60, -7, 47, 6, -64, -27, 22, 2, -47, -35, 38, 24, -35, -39, 26, 40, -11, -25, 44, 76, 0, -38, 35, 82, 8, -34, 28, 87, 21, -47]
2245d7P4L7m8n7L4N7m2n5K6N3j5n5j9O1Om9j7N4J4l8n7N6N5n6n2N8N9n8p7O5N9
2276B6l3n2L8P3m6p4M5Q6l7n3J6O7ro2kN0K7m7l5M6L9m3o8N1P0l7r4M3Q5l7q7
2307e4L2P8m1p2K9P7k1r2K7P0qo7j0M8K0m7k8M7L0m7l3N1L9l9m7L0O9k0q5J6Q1
2338C3k1p8L2P0oo1nP8Lq5PP6%n1l8O0L7m7k5M2L0l2m5J4P4j5r0L7P8l3p1LO2
2371C3Np2RO1lp5j0O8J9p2l2O0K1m4k5L9N2n6n7M8K9j4m3J7O1po1rQ0J1m6j4O8
2404D1mn7KN3K3n2k7N7K1m5l9O0L2m1m5M3L8l9l5QP2l8o3J6O7k0o5PM1J7n3j7
2436d2N1J0n2j9M4J7l8k4L3N6n1m5M4M0k7m8K2O1k7n6J9P0j0o3J6N0om3oO3K0
2467E9o7k0O2L9n5l2K5M6l5l4L4L7k2n4K3K7j2o0K2O0j4m9KL6pl7JM2Ro9j3O1
$$ y = [-47, 27, 64, 16, -41, -7, 50, 8, -47, -21, 32, 17, -38, -57, 4, 10, -39, -56, -2, 12, -26, -83, -27, 28, -28, -80, -22, 37, -21, -98, -33, 26, -7, -59, -21, 52, 6, -68, -23, 63, 26, -27, -11, 56, 47, -15, -17, 33, 60, 13, -22, 24, 63, 20, -48, 3, 73, 36, -58, -15, 70, 33, -54, -22, 56, 15, -57, -28, 49, 28, -64, -37, 33, 25, -42, -52, -4, 16, -31, -59, -12, 18, -29, -62, -11, 28, -11, -58, -28, 41, 21, -64, -48, 33, 12, -66, -34, 36, 30, -31, -36, 42, 45, -40, -33, 43, 43, -8, -46, 14, 51, 4, -21, 21, 51, 19, -26, -12, 62, 47, -43, -6, 72, 39, -32, -29, 33, 38, -34, -25, 36, 33, -42, -52, 16, 35, -37, -69, -9, 12, -32, -57, -18, 34, -22, -79, -31, -2, -16, -59, -42, 19, 12, -49, -58, 22, 33, -13, -27, 41, 37, -20, -18, 35, 58, 6, -21, 36, 57, 12, -27, 33, 65, 24, -21, 22, 60, 21, -14, -6, 66, 28, -35, -19, 48, 28, -37, -30, 11, 28, -25, -42, 9, 19, -33, -52, -8, 9, -29, -53, -20, 36, -15, -60, -16, 24, -3, -51, -29, 32, 5, -51, -32, 38, 28, -35, -19, 31, 25, -18, -24, 39, 59, -8, -28, 34, 73, 18, -14, 11, 57, 22, -12, 22, 59, 37, -17, 6, 33, 21, -39, -17, 43, 29, -20, -18, 18, 11, -26, -25, 17, 26, -43, -56, 5]
2499EJ7n3k8M1M0m1l2K8N3l5n0L6M7k0n5J2M6J2n0oN0J8o6j3P2K4o8kL7K7m3j9
2531a6M8J5l7l1L9L5l0m9K8N1k9o8K2O1j4n7J1M9ko2J0M3Mn5k1N9J3m4l5M6L4
2562A8k9m6L3L9j9m7K4M6l0m3K5O6l1o2K6N1ll8oP0nn7rN4J8m7k9N0M2m8m1L0
2594BM8j6n2K0M6k5n9K3N7k2n1J7L5J3p6J5M2jm7j9N3Qn2k8P2J9o9l5M8O0m0m6
2626f0M7L6k7o1M3M5mn8J4N2nn0rN4K3l7k9N0J8n8pM2M1m5l6K2N4n1k3K2M1k5
2658A9m2J2M0po5K0N3Pp8J0N3Ln5qM7J0m4k0M4L1m6l5K7L6j9n0K9M4pn5J4O5k2
2691A1n4RM5pl8J1M2Rm3j0L0K8l8j4M6J9l2m2K3P1l7m8J9N8l5m6J6N2on2J2K6
2723B5Ln2KL6J1l9k1M2J2l6l4M4J5l9k2K6L1k0l9J9N0k7m5K1N6lo3J9L7Qm1j8
$$ y = [5, 22, -31, -59, -18, 22, -19, -51, -23, 30, -5, -55, -19, 28, 8, -47, -35, 11, 23, -27, -33, 17, 35, -31, -44, 28, 52, -16, -18, 19, 46, 3, -16, 32, 47, 10, -21, 18, 53, 23, -26, 2, 53, 24, -44, -22, 39, 25, -32, -21, 28, 26, -36, -26, 17, 21, -34, -55, 4, 17, -27, -62, -16, 18, -11, -57, -24, 15, -4, -51, -27, 19, -11, -54, -29, 37, 6, -56, -30, 21, 18, -20, -26, 44, 39, -18, -27, 27, 45, -2, -31, 19, 61, 13, -28, 2, 50, 34, -18, 2, 48, 23, -36, -13, 44, 22, -29, -12, 23, 36, -40, -25, 17, 16, -31, -50, 3, 11, -41, -69, 3, 22, -47, -82, -34, 26, -14, -60, -13, 23, -4, -65, -22, 23, 19, -39, -25, 27, 22, -28, -37, 17, 40, 3, -26, 24, 42, -16, -23, 19, 60, 15, -21, 1, 55, 4, -19, 3, 44, 19, -23, -11, 29, 22, -43, -23, 30, 37, -41, -31, 22, 25, -30, -38, 9, 19, -25, -45, -1, 30, -16, -51, -24, 12, -7, -57, -28, 16, 9, -46, -32, 33, 11, -43, -34, 11, 4, -34, -23, 19, 28, -15, -25, 5, 33, -5, -19, 27, 46, 14, -28, -5, 66, 29, -19, 0, 58, 23, -23, -7, 45, 39, -13, -1, 25, 28, -24, -22, 14, 25, -14, -35, 7, 19, -17, -51, -7, 8, -31, -53, -27, 4, -16, -55, -36, 14, -13, -58, -37, 19, 16, -47, -28, 9, 17, -24, -42]
2755d2N4J4m0j9M8K1l3k4L2K7k5k3L0J6k6l1K6L6j1n0K3L3j7m5J2L3j0l5NL8O
2786B3n7j4M4L2n4k2L5J6k0l4K1N2m1k3J1N5m0l5L9K2ok8J1J8mj7JM8j4l6J0J5
2818HK3k8k0K7K2k3m5N0L1m6l9M2N0l3m6K4N3j9n8K3L7k0m2K1L5j1k9oK8Lj9k3
2850c0J9J9k7k7J8L3k9j6K1L7l5m1J9P0l3n1L3L6nn6L3M1k4l3K6L2%l2k8M6J6
2881C2j2k5J1L3j2l6J4L6j1m9J1M6qn1J8L5j1l0kM8k0l9mM5Ln1j2M0K0m3j6K1
2913a9K8k8qJ0J8j1k4J2M3pn7J5M0ol9NM1J1n2J5L6Nn1oM4K0l3l4L9K9l3j6K1
2946HK6k1k6J7K4j0k8KL0Jm7NM3mm5nK6K3m6j2M3J2l1l2K5K8j2m0K4L3k0l5L6
2979hJ9j1l6J3K9nj6jK3J2l9jL6Nk6k8L5M1l3l4K9L0j8m5L6L6no9K7M0j2l7MM8
$$ y = [-42, 12, 26, -14, -33, 15, 36, 3, -21, 11, 38, 13, -10, 20, 36, 10, -21, 5, 41, 30, -20, 3, 36, 19, -26, -14, 19, 9, -26, -21, 17, 23, -34, -48, -4, 28, -26, -48, -13, 3, -17, -51, -30, 22, -19, -42, -31, 24, -16, -51, -12, 10, 4, -24, -13, 5, 1, -16, -15, 33, 19, -17, -7, 8, 31, 3, -17, 10, 32, 9, -36, 14, 45, -1, -40, 2, 52, 19, -27, -3, 50, 31, -27, -4, 33, 13, -29, -8, 27, 16, -13, -19, 9, 12, -7, -30, -11, 8, -19, -46, -28, 5, -24, -40, -19, 18, -17, -58, -39, 31, -2, -53, -20, 16, 11, -45, -12, 29, 5, -28, -2, 30, 30, -2, -30, 16, 32, 20, -5, 6, 39, 27, -9, 5, 41, 30, -19, -8, 38, 30, -21, -3, 32, 21, -9, -11, 37, 17, -22, -26, 19, 22, -29, -41, -1, 19, -24, -40, -19, 9, -19, -27, -17, 1, -10, -34, -22, 21, 14, -43, -28, 12, 6, -33, -28, 13, 24, -28, -13, 23, 28, -23, -29, 15, 35, 2, -32, 7, 36, 3, -13, 8, 34, 13, -13, 4, 28, 18, -10, -8, 22, 23, -24, -19, 24, 20, -25, -30, -4, 19, -27, -39, 4, 16, -15, -47, -22, 6, -6, -46, -22, 11, -9, -44, -8, 11, 0, -36, -23, 6, 1, -15, -16, 7, 19, -20, -21, 15, 20, -6, -34, 1, 42, 9, -25, 4, 34, 16, -29, 7, 43, 38, -31, -4, 36, 24, -13, -9, 39]
3013C9j8l1j0L8Om1j0L5Ll2j9M2J4k8j9J4J8j2l2J1L2k3k0K1M1j9m4J5M8j5l6
3044c2J4K0Ol6RJ9J8l3j1L5J3j9k1K5J0rj6jN0k3m2K6K7ql3QL5nm3PM6j3l7jK8
3079A3Pl5j2K8J5k2k5J6J0k1j4K0K2j5l2K0K6pl6K2L0om1J4L0Ml8J7K0pk2lK1
3112aK6k3k6L4Mj1j5K0K1k4j6J4J7ol7J4M0j7l4MJ8Nk0j0J9J2k7j4K8Mk0k3L0
3145a4J7j5j6NK3nk3MJ8nk1J6J6Kk3OJ7Ml3JL8J2m2%K5J3l0j2K0K6k3k7L0K7l5
3180dj5K3K2j1k3jK3j3k2J3L0nk8MK7pm6RL0J3m1j0L8Ml6j0L5K2l6k1K3K0j5l1
3214c9J6L9j6k7OL5j5k6RL2j2j8LJ8J6k6k0L5J9j3m3L6K6l0k4J9M0m1j4%L6mm1
3247b4J6J3Kl9J2K8kl3oL1Qk5k8K6K6l3OlK8k8j5L1J9pl8J3L5l1j6J7K9Nm6%M6
$$ y = [39, 21, -10, -20, 18, 24, -17, -27, 8, 11, -21, -40, 2, 16, -12, -31, -17, 1, -11, -43, -32, 0, -23, -43, -22, 19, 0, -44, -29, 19, 4, -32, -18, 2, 8, -28, -19, 0, 18, -15, -26, 9, 22, 3, -18, 7, 17, 8, -8, -9, 41, 18, -24, 2, 29, 21, -12, -4, 31, 26, -17, -10, 36, 23, -14, -15, 13, 20, -15, -27, 1, 16, -6, -31, -15, -5, -26, -40, -20, 2, -13, -45, -25, 1, -6, -42, -20, 10, 4, -37, -23, 7, 11, -27, -10, 10, 3, -19, -22, -1, 25, 2, -24, 10, 14, 3, -12, 8, 29, 5, -11, 3, 20, 14, -23, -9, 31, 14, -20, -16, 2, 7, -13, -23, -4, 8, -19, -33, -5, -1, -21, -44, -14, 3, -12, -28, -23, 0, -5, -28, -24, -6, -11, -32, -16, 0, 2, -21, -15, 2, 6, -27, -26, 12, 24, -18, -18, 7, 20, -10, -22, -2, 24, 1, -26, 4, 31, -4, -19, 4, 26, 15, -8, -9, 14, 1, -21, -8, 22, 17, -11, -7, 20, 13, -33, -24, 6, 19, -22, -32, 6, 10, -26, -36, -1, 21, -15, -36, -13, 7, -8, -39, -23, 16, 0, -27, -21, 14, -1, -27, -18, 14, 2, -16, -13, 5, 21, -5, -25, 10, 29, 16, -27, 9, 35, 5, -19, 0, 40, -1, -15, -15, 21, 17, -24, -8, 5, 7, -32, -20, 8, 6, -27, -33, -2, 6, -19, -47, -21, 5, -28, -22, -25, 3, -25, -40, -9, 10, 3, -35, -22, 13, -18, -34, -17, 12, 17, -29, -29, 17]
3282A7ol0jK7J3k8rK7Rj7k7L9J9k5j8LL1j4k7%L4nl2PK9qk8PK1jk1oJ9J3l0j3
3318c1L4Rl8lL2Kj9j0PK9j6k1OK0nj0pL3J0l5JJ2J9m3jK8Qj8j7K5J9k7j4K7J4
3353B0k5rJ9J4j3k9K7J6j3j8%K2%l0KK4Jk0lL6nl2j6L5Jj7j3K7jj2qqM2j4k8J5
3389a3K8pl8J3K2nnpJ4Pj3KRJ2j6j9J4K3j4j8K6Qk0j0J1K7m5j4L3J9k2j4JK9j9
3424aj8PJ9rkrJ5jj3okK7j6qmK5j9qOK4j9j8J7J7ol1J8K0j4k1J9L7k2rlJ8Lk7
3462a4kK5jmj2RJ1nj6ML1j8j3RK5k3k7J8J9j3k5J0K1%j8j0J7Ok0NK0j0j2K%J3
3498Bj2qRJ1mk5K0J8j6l5K8K9j6k7J1K5Kk7pL1j0j3MK9kk2pRJ2qj1RJ7j5k4J8
3534eJ6j2k2PK9ok8LL0k0j2ONJ3j7qJ7Jk1j7L2K1l1j6K4J5j1pRK9m2mJ0J8Ok9
$$ y = [17, 11, -19, -20, 7, 20, -8, -17, 10, 19, 2, -25, 14, 33, 8, -10, -7, 24, 10, -17, -17, 17, 12, -20, -13, 16, 8, -20, -13, 8, 7, -14, -20, -1, 12, -18, -31, 3, 12, -26, -29, 3, 5, -14, -24, -17, 12, -4, -25, -19, 1, -4, -14, -21, 12, 22, -13, -12, 0, 19, -24, -25, 3, 11, -7, -24, 1, 20, -7, -21, 6, 20, -5, -14, 5, 19, 6, -23, 4, 20, 7, -11, -11, 11, 11, -19, -17, 7, 8, -12, -15, 21, 16, -16, -32, 3, 4, -13, -26, 1, 0, -12, -20, -28, 14, 0, -28, -13, 15, 8, -30, -17, 5, 0, -5, -12, 2, 9, -4, -2, 7, 19, 3, -16, -2, 21, 7, -11, 15, 23, 3, -7, 4, 31, -14, -28, 5, 24, 2, -12, -11, 18, -1, -19, -12, 7, -2, -4, -13, 2, 1, -12, -18, -20, 7, -9, -17, -21, 4, -15, -23, -17, 7, -12, -30, -13, 4, -2, -33, -15, 5, -9, -30, -11, 26, 4, -5, -8, 10, 13, -14, -16, 9, 8, 4, -8, 1, 12, 7, -9, -5, 26, 8, -5, 4, 29, 6, -21, -3, 16, 3, -22, -12, 9, 9, -9, -19, -2, 4, -16, -11, 9, -1, -13, -11, -11, 2, -10, -18, -9, 2, -2, -27, -7, 11, -5, -40, -12, 17, 1, -26, -15, 10, 12, -15, -22, 9, -1, -14, -10, 19, 17, -5, -12, -3, 9, 1, -10, -1, 16, 1, -23, -5, 11, -1, -23, -16, 13, 7, -21, -18, 12, -8, -20, -14, -9, 4, -13, -21, -4, -3, -24, -41, -9, 12, -19, -35, -11, 4, -7, -14, -5, 24, -18, -22, -12, 6, 12, -17]
3570a7J3J2nj0%K6Kk6kK4Kj9qJ8K1k7k8L5Qj7j5J3K8l4j8K0J3pj8J0K3mk4nJ8
3605BMj3oNJ2j6%J4J6j7l4K2Qj5j3J9J1%k0J1J7Pm8K8jJ3j0mK3j6j0lK2Qj3j1
3641hJ0J8j7k3K8K1l2j7K1K1j2k3KJ2Qk5kJ8mqjOPj9j1K6Nj3j2J4J1mk3J7Nj6
3677b0kJ9Qok4LJ9Oj4jK4Jj6j1K5Kpj3kJ5mqJ0Oqq%K5j2j6PJ9k0k7J3K4Ql2jK5
3717Gqk6LJ9Nk6%J5J2k3oJ9J9k9pK0Mmj1NJ3j7nJ5J4j7j5K0J7j2mlJ9lj1LjJ1
3755A2j5pK2J7j5j4PRj9j1K0MJj4OJ6j4mkJ0rj0lJ0Lk1J3kPj3KK0j5j0kK3pjk4
3794c0J3J9j2pRJ5kj9J9J3j1j4OJ5nln%MjmJ5Jj6qK1Pj7njK5j8j9LK7pl3J9Qj
3834Aj6J7J0j5mj6K1jj6qK1J6k6rJ2L%j4NK1j6j6K4K0rk6J6QLk2J1RMk1QJ6Pk4
$$ y = [-17, -4, 8, 3, -7, -7, 19, 21, -5, -7, 17, 19, 0, -8, 10, 31, 4, -24, 11, 19, 2, -13, 0, 28, -6, -24, -4, 9, 2, -16, -6, 17, 13, -11, -16, 2, 6, -7, -13, -8, 4, -12, -12, 2, 18, 1, -33, -11, -3, -18, -31, -12, -1, -1, -21, -10, 7, 14, -34, -6, -7, 6, -4, -8, 15, -1, -11, -14, 8, 16, 3, -8, 2, 20, 3, -20, 8, 29, -3, -20, 1, 22, 10, -13, -11, 1, 9, -16, -18, 0, -4, -12, -13, -7, 0, -19, -30, -4, 1, -12, -24, -10, 1, -3, -26, -9, -4, -20, -22, -3, 5, -1, -25, -22, -3, 3, -11, -12, 12, 13, -3, -14, 11, 13, 6, -7, -9, 6, 2, -6, 4, 10, 2, -6, -6, 19, 7, -9, -2, 17, -3, -30, -17, 7, 15, -17, -18, 7, -1, -27, -24, -5, 0, -26, -26, -11, 1, -22, -28, -9, 10, -19, -26, -6, -2, -6, -17, -12, 1, -16, -21, -6, 8, -9, -24, -4, 13, 1, -3, -6, 13, 10, -1, 2, 1, 12, -3, -10, 12, 29, 14, 0, 7, 16, -3, -14, 6, 10, 11, -3, 3, 19, 5, 1, -1, 9, 0, -10, -13, -3, 0, -21, -8, -10, -3, -16, -14, 6, -9, -19, -21, 2, -5, -6, -30, -17, 2, -10, -17, -8, 7, 5, -14, 5, 18, 7, -7, -1, 14, 9, 6, 1, 1, 5, 4, 0, 15, 16, 0, -8, 13, 20, 3, -2, -3, 22, 4, -15, -12, 15, 8, -25, -6, 2, 1, -15, 2, 12, -3, -7, -23, -2, -3, -19, -27, -6, 10, -16, -25, -13, -10, -10, -24, -19, 2, -14, -30, -6, 14, 5, -21, -5, 3, 6, -16, -5, 4, 8, -13, -5, 11, 18, -6]
3872f%K1mj4kJ0J7k3mJ4J4j5n%J4j6j3J2JJ1j7jK0qj5LjPj2kQJ0k9PQRnpQJ1j4
3913hj2J3J9rj4NMJ0kmJ3jj9NJ7%j8KLPmnJ6jrj3J3Mj3j5K8%j3k8K2j%rKJ3Ol0
3955b6RJ0J4k7j3K5J0j8rQK3j9k4K2J9kj5QOlq%J5j0pPJ2Rj8%J2J6k4pJ3Rj5n
3993cK4%kj7LmQj2KJ4j9K4j9Llj6J0pK0j3j5J8J1l3j7L6Lj2j3K6lpj6J1J8lj9
4030b2J2Rj2%PJ0Kk0%J3J2kj4RPk5K2lJ4k3oRJ5j5jRLj1kNJ2j1pkJ1nj2J0kJj
4071dj8J5Ppkj1K2k3OKKmpLK3j8KMNNj2J0mJ1j8J3J1qoQjJ2nj4K1jk0KJ2KqMj
4114A0JJk1QK8j1j1j0QoJ1k4J8opLLJ2rj7RJ7k1jKJ7k9PLJ1nqLJ0jj0LK0j2mP
4155aMMlJ0Rj6LmoKMJQMrlJJ1lj9K5j4jqOJ1j5j6NJ4Ml2QJ1Oj2kJ9k7J5pMjMk5
$$ y = [-6, -6, 15, 11, -3, -5, 5, 22, -1, -5, 9, 23, 8, 3, 3, 17, 1, -12, 0, 1, 12, -5, -6, 14, 6, -9, -6, -7, 0, -12, -14, -6, 4, -25, -18, -10, -1, -6, -13, -5, 6, -8, -20, -7, 12, 3, -11, -6, -2, 8, 6, 2, 15, 14, -5, 0, 17, 17, -1, 1, 4, 11, 7, 2, 18, 17, 8, -5, 8, 12, -1, -16, 12, 12, -1, -29, -7, -8, -8, -17, -15, -2, 4, -26, -17, -7, 7, -20, -33, -8, 2, -16, -25, -17, 6, -13, -37, -15, 4, 2, -13, -5, 1, -2, -10, -10, 5, -5, -12, -5, 7, 16, -2, -2, 10, 26, 2, -5, 8, 17, 2, -3, 21, 21, 19, 2, 5, 1, 9, -3, -1, 13, -6, 18, -1, 2, -1, -17, -7, -14, 6, -7, -22, -4, 7, -26, -43, -7, -4, -16, -29, -3, -6, -13, -29, -18, 0, -3, -22, -10, -1, -13, -13, -6, 4, 6, -14, -14, -1, 11, 9, -5, 4, 11, -14, 8, 5, 19, -4, -10, -1, 14, -1, -2, 7, 10, -1, -3, 2, 14, 3, -4, -6, 5, 0, -12, -2, -4, -3, -4, -22, -7, 0, -7, -9, -20, 2, -21, -15, -13, -11, -15, -22, -19, 4, -14, -12, -8, -3, 2, -10, 0, -4, 7, -11, 2, 13, 5, -1, 7, 6, 18, 13, -1, 20, 19, -1, 1, 13, 15, 7, 11, 10, 11, 12, -9, -1, 27, 16, 5, -5, 3, -3, 8, -16, 2, -4, -11, -8, -5, 7, -2, -19, -10, 7, -14, -15, -13, 4, -25, -18, -15, -4, -9, -17, -14, -4, -5, -15, -12, 8, -4, -8, -1, 3, 7, 4, 14, 23, 7, 10, 6, 0, 2, 6, 7, 15, 19, 10, 7, 8, 19, 16, -3, 22, 8, 7, -1, 5, 16, 1, -15, -10, 4, 8, -24, -16, -5, 1, -11, -13, 6, -21, -6, -13, -9, -10, -6, -31]
4200c1K5Onj3K7qqnlK5j1%%RJnj0K2lj6P%QKk0MJ5%j2J4j3Mj0RJ3j6lj2K4Lj6
4241bj5J6j1kOoMrmJ6Mk0%J2mOrLJ0j3LJ2Ppj6J4jMLPKK%j8K0Oqj0J9opkJ2kl
4286A3nLJ4j7LMmLj1oMJ1nrQooj3K9j1j1PJLnrMLJ4k2nJ2lnJ3Pj3pJ2pJ6oj9L2
4330A1rNoOLlMJ3j7Qj0RJ4k5kRJ2j7mKJ0j2kJ1kj8JJJ1j2j0J3jkm%%kj5J4%Mj2
4373b4J0NRj0pMJ0j2J2qJ7qj1%K4j4pOLJ8j7%J1MkklLj0kJ2J6j7kJ5olk3PPJp
4415a%NqnjOoKj7J2Mkj6K0j0MLLJ4k0Rj1K0j5KN%nmMOJmJ4Nkj8J5M%mKKkkl%L
4463IokJ9rrLLRqjj5J7j7%%%J5j7nJ7qnqQRj7%J6qMonJ6Kj3RPj1qN%J8j7LJ7o
4509EkKnK5j9Qko%LMQj8%JjRp%J1qoqJ1JpPnnpj1J3LJmOkj2mROj3mJ2NmpJ8jn
$$ y = [-31, -6, 0, -5, -18, 9, 1, -7, -12, -15, 10, -1, -1, -1, 8, 9, 4, -6, 16, 13, -3, 4, 4, 12, 14, -6, -2, 13, 13, 1, 15, 2, 6, -4, 5, 18, 2, -1, -13, 11, 14, -2, -17, -1, -12, -14, -8, -14, -10, -19, -23, -7, -3, -23, -23, -11, -15, -9, -18, -15, -5, -18, -15, -3, 4, -3, -19, -5, -6, -2, 1, 8, 10, 12, 12, -6, 14, 20, 12, 2, 21, 15, 8, 6, 18, 16, 13, 8, 11, 25, 8, 11, 15, 11, 14, 3, -3, 1, 12, 7, -2, 6, 0, -6, -19, 10, -1, -12, -5, -4, -1, -6, -15, -11, -8, 6, -16, -21, -9, -12, -17, -4, 3, -10, -17, -5, -12, 4, -2, -21, 11, 2, 7, 1, 7, 10, 7, 11, 24, 7, 15, 5, 14, 28, 3, 1, 10, 22, 5, 1, 3, 13, 1, -1, 10, 8, -10, -9, -8, 3, -9, -19, -6, -7, -9, -13, -13, -13, -15, -30, -16, -16, -12, -24, -14, -9, 0, -10, -17, -13, -3, -15, -3, -11, 6, -2, -13, -13, 11, -3, -10, -4, -1, 17, 0, 0, 11, 15, 13, 11, 8, 11, 1, -1, 11, 27, 10, 8, 23, 17, 14, -9, -2, 5, 6, -1, -1, 4, -4, -9, -10, -4, -10, -8, -25, -13, -9, -11, -27, -7, -17, -13, -10, -7, 7, -13, -4, -15, 5, -10, -8, -3, -3, -8, -12, -8, -2, -1, -5, 9, 14, 12, -6, 9, 13, 13, 9, 11, 13, 11, 9, 6, 6, 9, 3, 1, 20, 11, 2, 5, 8, 17, 9, 8, -7, 10, -7, -7, -7, -7, 8, -9, -14, 3, -5, -10, -18, -10, -1, -18, -18, -2, -10, -6, -12, -17, -1, 1, -12, -3, 4, -7, -15, -10, -10, 8, -9, -6, 11, 5, 3, 5, 0, 25, 6, 14, 12, 6, 6, 9, 13, 21, 3, 3, 4, 3, 12, 5, 5, 16, 8, 2, -6, 5, 6, -1, 6, 1, -4, -11, -22, -9, -6, -5, -9, -3, -5, -17, -21, -12, -6, -19, -23, -11, -6, -10, -17, 1, 0, -5]
4559eLnNJ3j4lJ7orJ0jNk3J1J6j4J0j0LMnj3J9QoQj6Mj3QjKn%qPKkl%nPpJ2pq
4605a5pjPnJ0kQOk7J3JJ0oJ1qklLJ8nlJRj8J4nQj1JKJ5mOk2J5mj3J6j5RlpMJn
4650c%qJ2pLKnlj0NrOlKJ5Pk7KKJ2JOj5QNmKQrQ%pJ6j6KmJ0R%jL%mmK1k4KLJp
4700CJmJ8j0%qJQk1qJ8jMj4J0nnKj9J7j2OMpPpJ2J1j5OpPJ1j8LK4j2ooJ2Mn%J
4744@J2qKMj0J2jkJ0j2j4J3PllqK0k3MjJ0j0%RnMqqMnkJ4j4NoqJ3%kOj0J5j8K
4788a5PJ3j3KQj2J4j0MJ1%kNJ0qpJ0oMj6J8%J%qRj5lQkPqKJQj6nLJ6rj8Q%Rj2
4833gJ4rj1m%J3j4MkKJ0QporJ5mkKoRKrQ%Rj0J2j1J5%oJ0rQRpj4%QJQnpKjj2J0
4881GOj5j8K3nmRk2K0Jj9NQj2J2nJ4pj1LJ1j3K0j5LrkNPpNJ7nj4QjJ0qoRj4QJ8
$$ y = [-5, -2, -7, -2, 11, -3, -6, 11, 5, -4, 6, 5, 10, -13, -2, 14, 0, 10, 0, 3, 7, 2, -11, 8, 16, 10, 18, 2, 6, -7, 1, 0, 2, -3, -3, -11, -4, -2, -4, -7, -7, -12, -5, -12, 0, -7, -15, -22, -23, -16, -21, -11, -13, -5, 1, -26, -13, -12, -2, -8, 3, -5, -7, -10, -7, 11, 6, 3, 4, 13, -5, 9, 4, 12, 1, 2, 4, 19, 15, 21, -1, 14, 10, -3, 13, -2, 7, 4, -3, 1, 2, -3, -3, -11, 1, -6, -3, -1, -6, -9, -19, -14, -23, -17, -20, -18, -3, 4, -23, -21, -19, -7, -6, 0, -15, -7, -2, -6, -4, 4, -5, 3, 3, -4, 12, -4, -2, -6, 4, 13, 13, 12, 15, 15, 11, 7, 28, 4, 6, 9, 10, 3, 4, 0, 18, 8, 8, 0, 1, 9, -12, -20, -2, -3, 1, -13, -3, -8, -13, -11, -30, -13, -25, -19, -15, -22, -15, -22, -10, 1, -14, -8, -15, -8, 3, -15, -12, 12, 0, -6, -12, 0, 4, -1, -1, 0, 12, 4, 6, 10, 0, 12, 11, 9, 19, 7, -7, 6, 13, 10, 7, -1, 19, -4, 0, -1, 9, -1, -1, 8, 3, 7, -1, -9, -5, -10, -12, 2, -12, -7, -13, -21, -8, -8, -10, -4, -14, 1, -17, -15, -8, 5, -8, -6, 2, -10, 4, -6, -2, 9, 9, 7, 12, 22, 14, 7, 17, 11, 15, -1, 17, 17, 18, 18, 10, 19, 4, 1, 9, 7, 14, 6, 8, 9, 17, 1, -4, -1, 15, 6, -12, -4, -4, 5, -7, 7, -2, -13, -17, -17, -4, -18, -14, -16, -14, -4, 4, -3, -9, -18, -3, -7, -9, -7, -13, -4, -2, -11, -3, -3, 6, -4, 8, -3, 12, 12, 6, 16, 7, 15, 24, 17, 3, 3, 11, 12, 20, 15, 8, 10, 9, -3, 7, 13, -2, -20, 3, -2, -6, 3, -19, 1, 2, -17, -12, -4, -16, -4, -9, 5, -2, -13, -10, 1, -12, 8, -7, -4, -13, -15, -10, -3, -10, -5, 12, 7, -7, 1, 0, 10, 2, -4, 5, -9, -1, 17]
4924A7j0PJpoORj1KJ0j3Kj0jJ7j8%j0J5Mj6krJ3Oj9MLj1J3Rj6Kj6J9J4rjPNj8
4965a8J1pK2qLJpnMPLjPqjPqRrJ7j3j0RJ1j1j2J2NO%ojlj0MOOqrQnqljJ5%k0J7
5013bj4Mj3K0M%j1oOlj2J3mJ2oNPj1PQmJ1Mj9J1NlMj5J8rPml%j4J5J6k4J2j3l
5055dJ1oMqQmoPJnJmqkMKPj1llJ1oj4J3RLr%OkP%Qj1NMnONpOjRmmQ%rMlQj0Ko
5109DnKOokmNLlp%lJ3lqJ0Lj1%j1J2KjNnnJrQJ0qMjmMJ4lkrQPknmKnKNkLKnNJ0
5163A7mRnj1J1j2KJ1j0j4J3J2k0oo%J2%oNqJoPmKrK2mj0LRJkj1JK4k8QJ6m%jn
5207@PNmnJ2j5mlMQJ2llLj3J5j1J5koP%j6KmlKOj2J1j4kNLloPPjpoJOJNj2J0j7
5255a8OJ6kj4QJKj0J7%QplmNJ6j5N%kpK0rj0jJ3JjrlOJ0j3KmkJLmj0NKlrkLMJ8
$$ y = [17, 7, 14, 15, 8, 2, 8, 17, 6, 8, 18, 5, 7, -3, -4, 13, -5, -5, -15, 0, 4, -12, -14, -23, -10, -4, -23, -19, -16, -27, -14, -5, -21, -19, -35, -16, -2, -11, -12, -5, 0, -18, -7, -14, 8, 0, 3, 4, -3, -8, -4, 3, 6, 5, 12, 4, 3, 10, 2, 11, 2, 19, 6, -4, 5, 16, 5, -7, 5, 10, 16, 16, 10, 9, 6, -4, 0, 6, 12, 4, -5, 3, -2, -10, -13, -14, 1, 1, -19, -2, -16, -12, -25, -5, -1, -1, -12, -18, -12, -15, -27, -14, -18, -6, -12, -7, 0, -11, -4, 4, 0, 11, 15, -4, 7, 12, 9, 13, -2, 16, 7, 14, 10, 7, 7, -7, 8, 24, 0, 12, -1, -4, 7, 1, 5, -3, 5, 1, -5, 2, 3, -2, -1, -5, -13, -15, -11, -9, -2, -13, -16, -19, -8, -14, -28, -15, -6, -3, -12, -12, -6, -8, -1, -1, 7, -4, 1, 5, 0, 6, 11, 4, 10, 9, 18, 14, 10, 18, 18, 9, 13, 10, 18, 8, 10, 4, -1, 1, 7, 1, -1, -5, 0, 3, 0, -7, -7, -10, 3, 0, -8, 2, 5, -6, -6, -17, -5, -3, -4, 1, -4, -9, -8, -17, -9, 1, -7, -3, -4, -8, -4, 10, 7, 5, -4, 4, 11, 9, 4, 0, 2, -3, -1, 4, 2, 5, 7, 2, 7, 17, 13, 22, 17, 6, 17, 5, 7, 18, 8, -6, 7, 19, -1, -7, -13, -13, -1, -1, -7, -2, -10, -9, -15, -8, -12, -10, -19, 3, -1, -11, -8, 1, 2, 0, -11, -10, 14, -14, -6, 10, 6, 6, 5, 0, 7, 12, 8, 3, 15, 0, -4, -7, -3, 5, 17, 14, 11, 14, 1, 16, 5, 20, 18, 12, 19, 19, 3, 5, 1, -2, 0, 6, -6, 5, -9, -11, -6, -3, -6, -12, -5, 2, 1, -6, -12, -11, -5, -4, 1, -11, -1, -18, -12, 4, 2, -12, -4, -3, -1, -11, 6, 6, 14, 7, 4, 0, 5, 21, 6, 11, 11, 9, 2, 22, 13, 3, 2, 15, 16, 15, 6, 3, 9, 19, 6, 8, 4, 2, 3, 6, 2, -8, -3, -1, -4, -13, -15, -12, -8, 10]
5303A0j2nNrLoKJ6j4jjMR%J%LjkmLLKMoj6K6lqJJ2m%jNnj2QjnMOJj2JnJ3k3OJ
5353g%lj0MJ4onjjJ0NMor%PmQ%j3J5nPj1J1Jj7K2j0pK2j1LlJ1mqNnjRlJ1j1j3
5398eJ3j3J9j5J4rjoLJOnjkj1j1J4LnQKj3LkJ8j7ORj1Rk0NJ0%NKrMMj1J7j5J3
5441FLpPNj1LRp%j%PJ0j8J2j8PKj0PqqK0%j0kOnRrmNJnqQJ5l0J0J3j2pjKOpJJ1
5489cJJjlJ3qNjqo%J4pNJJ1rJjMJKlnMKqpJ7nnoPnJ0%j0Mj9J9kqmKrJ4Qj3%j6
5539b6J9JrOkMRj0MKkj1J0pOkJ1PlKqJ1j8J8%Qk1KPNMjjj3PKRjj3j2J1J1j7J%
5584@Pj6J3qkpNqJ4okMqJ2lN%pJ1qo%kJ0Kj0Rj1LNLqQMj1J6Mj4NJ3j1%QmRj2l
5631CJ1oj3PNj0LjJ9nj7rJ2j0PrK3k9OKkQLkMj8ON%mJ5jKrOm%lQpJ0j8J4jNoN
$$ y = [10, -2, -7, -2, -11, -8, -14, -12, 4, -10, -11, -12, -8, 1, 1, 2, 2, 5, 4, 2, -2, 1, 4, 6, 10, 4, -12, 14, 11, 3, 4, 16, 12, 12, 11, 16, 11, -1, 7, 6, 1, 5, 11, 12, 0, 1, -4, 9, -14, -8, -7, -7, -10, -20, -16, -2, -8, -13, -14, -15, -5, 0, 4, -2, -11, -11, -4, -8, 0, 0, -13, 2, -3, 4, -7, 4, 5, -12, 10, 0, -7, 15, 4, 7, 4, 15, 11, 3, 8, 3, 2, 11, 8, 19, 8, -5, 8, -5, 14, -1, 13, 4, 3, -3, 0, 1, 7, 2, 1, -1, -12, -23, -9, -6, -11, -3, -1, -14, -11, -13, 5, -12, -6, 3, -8, 1, -19, -14, -4, -4, 1, 3, -6, -2, 2, -9, 8, -7, 6, 9, 2, 9, 14, 3, 6, 15, 8, 8, 7, 7, 14, 24, 6, 18, 0, 7, 9, -1, 6, -2, -10, 10, 10, 0, -2, 4, -1, 8, -1, -5, 0, 1, -4, -12, -4, 11, -19, -9, 4, -8, -15, -16, -14, -8, -15, -14, -3, -2, -1, -2, -5, 8, 0, 5, 4, -4, -10, -10, 4, -3, 2, 3, 14, 5, 6, 5, 9, 10, 12, 9, 4, 8, 10, 2, -5, 12, 7, 2, -4, 3, -2, 8, 8, -2, 2, -17, 2, 0, -8, -12, -10, -19, -5, 3, -10, -10, -26, -7, -6, -15, -9, -11, -7, 2, -8, -4, -2, -4, -15, -5, -12, -6, -8, 3, 10, 7, 9, 1, 12, -6, 12, 12, 20, -1, 1, 8, 13, 17, 16, 15, 2, 9, 11, 20, 19, 6, -6, 5, 16, -1, 0, 0, 7, -9, 4, -4, -6, -13, -8, -16, -2, -8, -10, -6, -14, -2, -5, 0, 0, -7, 4, -4, -10, -10, -12, -2, 0, -10, -1, -12, -9, -4, -1, -9, -1, 3, -8, 8, 12, -2, 3, 16, 5, 5, 13, 9, 18, 6, 3, 14, 8, -5, 2, 7, -3, 0, -1, 18, 13, -4, -13, -1, -11, -4, -13, 10, -19, -13, -11, -13, -5, -2, -4, 0, -18, -12, -7, -7, -11, 4, 3, 5, -4, 2, -2, -2, -5, 3, -4, 6, -12, 2, 1, 6, 0, 5]
5678EPKoMJjqoJ4%OmrKLOj7J3j1j1J4J1%k7J6J0k6K3j6Rj8J2Lj6JkJ8j3QqQqJ1
5721@jj1J1kJ2rplMNj0J4RllqJ4moPkQJoQj3lJ2qNnj4J3ljJJJj0LM%rLlKqKJ3
5770Aj1jJ%LmKQoLkKqKJ3%Rj7PkJ4j2lK0j6lOmJ7J0rj2KLKlpJ0lJ3k4PkmqJ0p
5817coMoKJ2j2jJ1j5J0plkMjOJKj8J8n%J3j5%RNj5J0pJ2llOkPjLkJjPr%JNjkN
5866A4JjjjoLooJ3jpLMj5PkqJ0nMnlMJlJ3j7RKmpJrJ7kJ2j1NMrPlRnlkPJ1j6K
5916EQJj3JJ6j1LJppJ3j0J0qkoJ9j3PJj0%mRrlJkJjpJ7j3oJ2lLj1NJ2j0J0j3L
5960a1MJ0j1J0k%JJ2pRj8LJ4LLj7L%%kMM%rJ1jj4kJ4j1Km%moJ8nLmJr%J3j1kO
6006bl%j4QjpNOJ0j2NKJmPJL%jNOlL%nkOJkoOj4J3kKkKj4O%j1J9j3%Mm%Rj9KP
$$ y = [5, 12, 14, 8, 12, 13, 12, 4, -2, 12, 12, 18, 14, 5, 7, 10, 16, -1, 12, 1, -10, 4, 15, 15, -12, 4, 14, -12, 11, -5, 4, -14, -2, 1, -15, -14, -16, 2, -11, -3, -11, -3, -11, 0, -1, -12, -1, -3, 9, 0, -7, -10, -6, -1, -11, 3, 12, 9, 6, -2, 12, 8, 2, 9, 7, 15, 16, 10, 18, 5, 2, 14, 6, 11, 6, -8, 5, 2, 1, 2, 3, 4, -6, -3, 1, 1, -8, -5, -8, -6, -14, -12, 1, -10, -11, -10, -10, -7, -11, -9, -1, -7, -4, -6, -4, -12, -10, 3, 3, 12, -5, 2, 0, 14, 2, -1, 19, 3, 0, 6, 2, 19, 29, 20, 8, 10, 13, 15, 12, 5, 15, 12, 25, 1, 8, 6, 2, -6, 4, -3, -9, -5, -11, -9, 3, -9, -10, 1, -14, -4, -11, -14, -16, -12, -13, -7, -6, -4, -22, -4, -9, -9, 4, -11, -11, -2, 3, -12, -2, -9, 3, 0, -3, 3, 1, 8, 7, 10, 8, 9, 8, 15, 6, 6, 7, 12, 11, 9, 14, 15, 14, 13, 12, 6, 9, 3, -3, 10, 9, 2, 5, 9, -6, 1, -1, -9, 1, -4, 0, -5, -8, -4, -3, -6, 7, -10, -1, 1, -3, -10, -9, -18, -1, -3, 9, -2, 3, 7, -2, 5, 2, 11, 6, 3, 1, 8, 19, 3, 5, 13, 14, 1, 2, 18, 7, 10, 11, 4, -3, 10, 0, 10, 2, 0, -6, 13, 0, 7, 8, -2, -2, -6, 3, -6, -9, -8, -10, -9, -10, -17, 0, -13, -19, -7, -10, -7, -18, -13, -1, -11, -1, -14, -11, -7, 3, -8, 2, 0, 0, 1, 13, 6, 15, -3, 0, 14, 17, 20, 3, 6, 6, 6, 4, 8, 12, 12, 3, 14, 13, -1, -3, 11, 0, 2, -2, -2, -6, -12, 6, 1, 4, 0, 1, -8, -8, 5, -6, -8, -2, -5, -5, -19, -11, -12, -19, -14, -8, 2, -10, -5, -3, -2, -6, 1, 2, 5, 5, 4, 9, 15, 12, 15, 15, 10, 8, 14, 15, 13, 7, 13, -1, 12, 10, 12, 10, 12, -2, 4, 4, -7, 12, -1, -1, 3, -1, -1, 8, -11, -9, -2]
6057bolJ0j3Rj0K2k2J8orqMJ0nkpJ2j4J5pJ6J0j6jMRKlJ0Mj3kQoPqpLJ3j1MKJ2
6101B3j5KNk0J3jJnmnlPj3NJ4j1JoOjj6J8Rj0j7J6Pj5J1m%j6J7JnJ6nnmJ6OLj7
6144aJNMmK0j7jnJ5%pjKkmJJ0j2lnJ0oO%qj2J7j0joKlJ2nmL%qJ0J0j8O%jMj4J0
6191a0J4j9KJJ5%LJ%lJJ4oPj0j1OKNqJ6j2MqQpLkj8J4j0J6rj2kJ5qJKLj0oJ0o
6235a4PqPMoMmKqONkOj0qPOklNK2qj4MJ6j3%RmJ1Qj2ojJ0j0JkLMj1KJ6j1qJ2j3
6282aJ5j8MolNlJljMOMj0lj5K3onQnpLkJmJ7MKrPrJJ1Oj4oJ4Qj1QrKJ5k9J4OM
6330A4%moLMllMmoMRk1lJ3lmNlj1jrJ7Lmj2J4mlJ3j7J4Pj6lORmkJ2rJ3j7J9j7
6375fORp%J5rJ3ponkJ5j0J1j0J1j6Rr%J2pljKNj0J0j1pJkQjmmJ3rlmmJ0olJ3k0
$$ y = [-2, -8, -11, -1, -14, -5, -15, 7, -15, 3, -3, -12, -20, -16, -6, -11, -13, -20, -8, -22, -7, -14, 2, 12, -4, -5, -1, 8, 10, 7, 17, 21, 8, 6, 14, 8, 15, 7, 0, 3, 16, 5, 9, 11, 23, 8, 10, 15, -5, 8, 7, 8, 3, -1, -6, -9, -2, -15, -10, 4, -7, -6, -12, -6, -7, -23, -5, 4, -6, -23, -7, 0, -15, -4, -8, -8, -24, -7, -6, -11, 5, 0, -5, -9, 7, 13, 16, -1, 0, 5, 9, 5, 25, 8, 7, 2, 17, 17, 10, 9, 11, 9, 5, 6, 16, 4, 1, -4, 6, 0, 6, 6, -2, -14, 3, -7, -8, -14, -12, -15, -3, -8, -12, -9, -9, -17, -7, 3, -15, -9, -9, -10, -6, -20, -10, 4, -15, -13, -12, 3, 3, 6, 7, 7, 4, 5, 19, 13, 20, 10, -1, 5, 7, 12, 4, 20, 8, 12, 4, 12, 5, 8, 6, -12, 2, -8, 8, -1, -13, -15, 0, -8, -7, -5, -2, -12, -18, -8, -14, -7, -15, -8, -4, -10, -6, -10, -8, -16, -10, -5, -7, -1, -11, -19, -12, -6, -8, -11, -6, 16, 8, -6, -2, 14, 1, 1, 10, 6, 17, 25, 13, 7, 6, 16, 6, 7, 5, 8, 12, 1, 3, 19, 8, 0, 12, -1, 14, -4, 0, -6, -9, -4, -7, -6, -9, -10, -6, 0, 4, -6, -9, -24, -1, -7, -12, -4, -9, -16, -13, -15, -14, -18, -1, 3, 5, -4, 3, -6, -5, 6, 12, -2, -8, 6, 14, 3, 11, 2, 4, 19, -10, 4, 10, 14, 14, 10, 4, 7, 11, 8, 5, 9, 5, -1, 3, 12, -9, -12, 1, -2, -6, -1, -4, -15, -16, -25, -8, -5, -9, -21, -7, -11, -14, -1, -18, -4, 3, -13, -16, -10, -1, -5, -7, 5, -4, 9, -8, 11, -6, 0, 9, 2, 2, 17, 8, 21, 14, 8, 3, 1, 16, 6, 17, 7, 18, 2, 11, 2, 2, 14, 7, 4, 3, 5, 10, 0, 10, -1, -8, -7, -9, -1, -2, -6, -10, 3, -6, -9, -13, -17, -7, -13, -16, -3, -23]
6421b3J3oK0j6J0j0jjPnJ9llK0k2mJ6%jlmJLkJ1j2rmJ5Nj6J5lKqNk2J4MmoNp%
6465a0Lj2PPrlJ6j0jOjoRnnMjJMqJ4okJJ2j1OMoJ3KmMmKRj0Qj5J3j3Qj7K7mj3
6511DknJ6j7MoRpJ3k0QnOpljoJ1n%J4lkQj8J4j3OMnlMnMmOnOjmJ1KnKPJnOPj3
6561ClmJ9r%kOkmkjJ1rmPMrK%kmpJJ0nj3J0Mkj8J2kKK0j4PljrNJ1jKlnJ3jjjl
6611Ej4J1MLj2K1mj7J4jnJ1nMNj7rMQmJ0j3J3j7Nj4K0jj1J2j9jjoJ0RmpnJ7pk
6653a0j0N%%KNQMkj4J1jJ5j8J4j3NJ2M%%rrJ7J0rNk5K1nNPk4PlPqJ0oqNkmj%K
6699@MOoj1Rj7MqJ2jJPj3Jj1J8QqqJ5MKnj%PLj5J4mQJpKJ5j6Nj3%LJ6njLnkj5
6746dPnNj3jJ0joKnjJ2rmjJJQmPjjpJ6k3JkPOjPPnLkj8K2j9J9j9J9lKjOj9NJK
$$ y = [-23, -10, -16, 4, -12, -2, -12, -13, -14, -7, -12, 7, 4, 1, 21, -1, -5, 11, 11, 10, 7, 3, 4, 7, 5, 16, 4, -5, -9, 6, 11, -5, 10, 7, 9, 1, 6, -16, -2, 2, -2, -8, -3, -10, -10, -7, -19, -12, -5, -14, -17, -1, -11, -12, -6, -7, -13, -4, -9, -14, -10, -11, -10, -6, -14, 0, -6, -8, -7, 5, -6, 0, 4, -2, 11, 13, 9, 13, 9, 11, 20, 10, 18, 3, 16, 3, 11, -6, 21, 17, 4, 2, -3, 13, -4, 0, -6, 3, -4, 9, -11, -3, -8, -2, -9, -12, -13, -19, -8, -13, -13, 1, -2, -4, 4, -14, 0, -13, -7, -3, -8, -11, -7, -12, -8, -12, -6, -11, -5, -6, -10, 1, 3, -2, 0, 7, 8, 3, 9, 16, 3, 0, -4, 15, 6, 6, 4, 10, 8, 4, 2, 1, 12, 3, -1, 6, 10, 1, 3, 3, 1, -3, -10, -9, 1, -4, -17, -7, -3, -5, -23, -11, -13, -11, 9, -5, 2, -1, -2, -11, -6, 5, 4, 6, 3, -2, 11, 10, 9, 8, 5, -9, 2, 6, 9, -3, 18, 14, -3, 11, 10, 5, 16, 11, 15, 20, 3, -6, -2, 6, 2, 12, -1, 12, -5, 0, -14, 6, 5, -6, 6, -13, -14, -15, -21, -11, -2, -6, -13, -18, -1, -8, -10, -20, -15, -15, -15, -13, -8, 0, 4, 2, -12, -1, -2, 13, -5, 9, -4, 1, 13, 17, 17, 17, 8, -1, 16, 26, 17, 22, -3, 18, 13, 18, 25, 1, 8, 5, 12, 4, 14, 8, 0, 5, 3, -1, -2, -2, 0, 4, 10, 4, -7, 2, -15, -11, -19, -7, -8, -7, 0, -13, -12, -23, -5, 3, -5, -13, 2, 6, 8, 3, 2, 2, 9, 12, -3, 11, 7, 15, 16, 9, 11, 26, 10, 15, 2, 2, 5, 21, 16, 15, 18, 13, 11, -4, 3, -2, 3, -10, -11, -1, -2, -8, -6, -11, -12, 0, -9, -13, -14, -13, -12, -4, -8, -1, -2, -3, -10, 6, -17, -16, -18, -11, -5, -6, 1, 8, 3, 6, 4, -14, 8, -11, 8, -11, 8, 5, 7, 6, 12, -7, -2, -1, 1]
6795AkRKQj5jPlMJk3K3j5ROj7Rj2oJ2j2J4jmj3J4%ojjKRj4MJ4rqoJ3jqLlJ4Nj2
6841a0PjLjLoRoNJ7j5oJ3mQlj5JJ7k0MJ3j2%J2Kj0%kKj2jPrPlpPjJ3j9NKk1J1
6886a6J6oJj2PJ4rKOrPRopJ1Jj1RlOkljp%QklnJ5j4J2OoLpjqRJJjj1JNj3K2k4
6934a5Rj5kRQkoJ6j0lrJ7j6J9j1qJ6pLKlKJMJ1j1jRQj2RqJ1j3RNjpkqOJ5on%O
6980A4jj1lmO%lPk0J2%pJkQj0OoQOj9J8kpJ%J0j1JJ1pl%JK1j0LjJnLMrJ2oRLj3
7028F%PrMPkj8RMj0KllQoOOj3jJ1lj6Qj0QjlNkj0LJ0j7J4Kj0%KOjlrONJ0mlQ%
7077@l%JOK%Qk1K0njQJpLMlj8J7j0j0J0n%LqJ3j3J1j3rK3qOk1J9pknJ0lJj1KQ
7122g%rJ2j4J3j0J1J1j1L%PlJmMLj2J6oLj2J5j1MNj5ROj0J5j3LP%j0lOj3OlJM
$$ y = [1, -1, 8, 10, 18, 3, 2, 9, 6, 10, 11, -12, 11, -4, 5, 11, -6, 3, -9, -15, -3, -15, -1, -2, -6, -19, -5, -5, -11, -12, -13, -11, -2, -16, -12, 2, -7, -15, -21, -8, -9, -17, -14, -17, -3, 2, -10, -3, -4, -1, -2, 1, -5, 4, -2, 3, 20, 5, -1, 12, 8, 16, 13, -2, -1, 16, -4, 0, 13, 1, 1, 13, 15, 5, 5, 3, 5, -7, -8, -1, -10, -3, -6, -13, -6, -7, 6, -13, -8, -6, -27, -16, 0, -6, -5, -17, -10, 4, -5, -3, 3, -6, 1, 10, 4, -3, 8, 9, -2, 7, 4, 10, 8, 5, 4, -3, -3, 5, 3, 0, -5, 10, -4, 8, 14, 8, 11, 4, 3, -5, 4, 5, 6, 5, -6, -5, 0, -13, 9, -15, -6, -21, -23, -14, -6, -8, -14, 2, -8, -11, -20, -3, -19, 0, -11, -19, -3, -10, -7, -5, -8, -6, -5, -1, 10, -1, -2, 7, 15, 3, 12, 4, 15, 2, 11, 16, 15, 8, 6, -2, 4, 19, 13, 8, 8, 14, 13, 2, -1, -5, 1, 1, -2, 5, -15, -3, -3, -10, -9, -11, -3, -13, -7, -13, -5, 1, -18, 0, -2, -9, -8, -8, 2, -9, -8, 3, -4, -7, -7, -6, 15, 5, 8, 7, 8, 3, 6, 10, 1, 13, 7, 16, 19, 6, 6, 13, 4, 8, 15, 13, -5, 4, 8, -2, 0, -3, -6, 2, -4, 2, 8, -5, -6, 5, 2, -14, -6, -16, -8, -9, -12, -7, -9, -19, -16, -6, -23, -9, -7, -17, -17, -15, -9, -10, -13, -22, -16, -11, -1, -5, -8, 0, 0, -3, -3, -2, 4, 6, 6, 14, -7, 13, 8, 7, 15, 16, 9, 12, 16, 13, -5, 12, 2, -8, 2, -3, -3, 0, -8, 5, -8, 3, -10, -19, 4, -4, 2, -19, 0, -7, -9, -14, -4, -7, -6, -17, -15, -7, -7, -16, -4, -18, -5, -15, -4, 7, -4, -1, -1, 6, 3, 4, 0, 4, 7, -5, 11, 5, 8, -4, 11, 0, 4, 9, -6, 3, 9, -1, 14, 1, 4, 11, 11, 1, -2, 4, -9, -3, -6, -5, -1]
7165amPj6nJ2Rk8J3jNKqJ0JQj6OoJ3j3QnLJ0pNlOPqpJ2j2K2j4%J2prJ0mrJ1ol
7210@KKoJ3j1pJ3j0Rjj9JPLmkLqj%J7j1JLqOnMkJ4k3J6mOQrqPMpjkOQlnRoPNo
7261ElJ2roLOpOlNmKjj1JkPKpmPlkJnmOJ1qj0LLmQj3J0Rj4nJ7j1J4Kj3JOoQon
7311a1J9j5MJJ2j0J4nrKmJ1nqJ5j0mRjoMq%JMJlopLNL%j2RpOj1N%JJ5k3J%J5l
7358hpQnJ1%jOj2OP%olkLKJ%OjMkrQj0J1j3J3kPk2K4j2jqjKj3J5joNJrJJkj1K3
7407bk0J3j0NJ2j3M%kj0J0NlkJ1Mj0PQpj3J7Rrp%JjMKjp%jkQlMoJ2mjpjqKPkm
7456a1lQNomj7J2nPMpJ0llkKj5J9J2j4pJ0KrP%J7JklQpNlJ3j5j3J8kLj0QNoNn
7502IpJ1jj5NLKjoooK1k3%J4j1PjNqj0RnJJ8j9OlPj0J%PoLN%%jkjOmMNlPKnLO
$$ y = [-1, -5, 2, -14, -19, -7, 2, -26, -13, -14, -9, -7, -15, -5, -4, 4, -12, -6, -12, 1, -12, -4, -9, -6, 4, -3, 2, -1, 5, 12, 4, -3, 9, -3, 19, 5, 5, 17, 10, 1, 11, 7, -2, 9, 3, 0, 2, 4, -2, 11, 0, -7, 6, -4, 5, 4, -15, -14, -7, -4, -8, -10, -7, -15, -16, -16, 1, -10, -9, -6, -14, -8, -13, -9, -11, 3, -20, -4, -8, -2, 6, -3, -11, -4, 0, -7, -8, -10, -4, 4, 1, -4, 5, -1, 6, 11, 5, 2, 14, 5, -1, 2, 8, 1, 7, 4, 9, 5, 7, 6, -5, -4, -6, 1, 3, -4, -8, -1, -4, -6, -5, -10, -14, -8, 3, -5, -15, -12, -9, -13, -5, -18, -8, 1, -13, -18, -1, -12, 2, 4, -9, -8, -2, -8, 0, -6, -11, 8, -7, -3, -2, 10, 0, 14, 9, 0, 2, -2, 9, 4, -4, 11, 1, -3, 6, 5, -1, 3, -5, -5, -4, 0, 1, -2, -8, -15, -12, -7, -4, -4, -16, -7, -14, -8, -19, -14, -14, -13, 2, -21, -20, -20, -5, -8, -15, -7, -12, -1, -1, -2, 4, -8, -2, 5, 5, -1, -4, -6, -3, -1, 0, 0, 6, 5, 9, 7, -2, 6, -4, 7, -6, 7, 5, 12, -10, 14, 2, 1, -7, -8, -6, -19, -4, -5, -11, -6, -5, -14, -13, -12, -14, -25, -2, -22, -9, -19, -14, -2, -15, -11, -11, -13, -23, -13, -8, -11, -13, -2, 2, -8, -1, 7, 0, -13, 4, 13, 4, -3, -3, -2, -3, 1, 3, 2, -5, -5, -6, -8, 0, -3, 1, -5, 7, 3, 2, -5, -6, -14, -12, -5, -7, -11, -14, -6, -1, -7, -11, -28, -16, -21, -14, -10, -17, -7, -10, -13, -15, -13, -28, -9, 3, -11, -18, -8, -6, -15, -8, -8, 9, 10, 8, 5, 13, 6, 11, 8, 21, 6, -7, 11, 9, 12, 2, 10, 15, 9, 14, 9, 2, 13, 12, -3, 2, 5, 7, 6, 0, -6, -12, 9, -14, -14, 0, -11, -4, -5, 0, -8, -18, -9, -14, -13, 5, -14, -8, -11, -4, -14, -13, -13, -6, -12, -9, -4, -4, -4, -5, -7, -8, -2, -6, -2, 3, 0, 7, 9, 4, 7, 13]
7553A3qoJJ0olJJlJ0lprRj2NMnPqKLnMJNj8Pj8J0%RpNJ0j1LOj3J0nNJ3k1J3J1
7599A0oqQkQj2PlQJpPLj3nJ3ql%KQLklkKrJ1j8J4j0J0lmj2QRrnnLKMoQj4Rl%M
7649a0pPoLqJ0RlKLkJ2rj2K1MmLmmJ0qlOj0NpJ1Nrj6J7ljKjj1QLmopJ2Rj5KkN
7697crJ0lO%j1%JRJj4kLJ1j0LlK1j7MJ2j2J1j4J2mPJ0j3QJj7PqK2j7RpJ1j1qP
7739CPj0Nj2PkklLPk1J2Qj4lQlrPj2J2ljJ4%j1J2j1JJ2j0QJlpJ0KJ0loJ2qLJ9
7783B9k0jQLoJjjKLkj4%mkJ6Nj0nJ1nj2NJj8RJ2k6J0J0jnJ2k2LLlj1J4NlOj1J
7827a4QNJ3rLrOrKQmqRMJ2qj8J2LLkKqLRk2J2jnnJkMklNmPMjj3mJ5j9J1j1N%J3
7876bpn%klPQJKmNnLmJ6lkJ0j1nPKMj0nMJ0MpnJ7qj1KjLjlK1k2QkpJ5k7Rjj2P
$$ y = [13, 5, -1, 0, 10, 4, 1, 2, 3, 0, 10, 7, 0, -9, 0, -12, -7, -3, -8, -1, -9, -7, -4, -9, -5, -4, 1, -17, -10, -28, -18, -18, -9, -16, -11, -1, -12, -9, -3, -16, -6, -11, -6, 7, -14, -1, 10, 4, -4, 4, 2, 10, -2, 5, 2, 10, 11, 4, 11, 14, 1, -4, 9, 1, -2, -2, 0, 8, 11, 9, 6, 4, 6, -3, 8, -10, 4, -6, 4, 1, -3, -15, -7, 2, -7, -12, -17, -14, -12, -8, -14, -6, -20, -11, -14, -14, -10, -17, -10, -16, -13, -21, -11, -2, -5, -3, 0, -2, 10, 1, -11, 10, 14, 10, 13, 9, 5, 15, 7, 4, 10, 0, 5, -2, 9, 14, 5, -11, 6, 3, 2, 4, 3, -8, 0, 3, -1, -7, -14, -2, 7, -8, -6, -8, -3, -12, -2, -5, 1, 1, -10, -10, -9, 0, 1, -13, -15, -12, -1, -11, -8, -11, 10, -7, -3, 9, -3, 8, -6, 6, 2, 9, 19, 6, 14, 15, -2, 5, -3, 19, 2, 11, 4, 15, 4, -4, 3, 10, 0, 5, -7, 0, -2, -4, -7, -4, 3, -18, -6, 2, -12, -15, -7, -10, -19, -12, -24, -12, -15, -16, -2, -2, -13, -1, -12, -11, 1, -9, -1, 0, -3, -10, 0, 2, 12, 9, 3, 15, 7, 10, 29, 9, 8, 16, 19, 13, 14, 13, 12, 14, 17, 15, 1, 1, -3, -5, 11, 16, 6, 1, 12, 7, -5, 0, 1, -17, -8, 4, -22, -12, -2, -3, -8, 4, -18, -15, -12, -15, -26, -12, -7, -10, -4, -15, -14, -6, -1, 12, 3, 6, -3, 3, -6, -4, 4, 0, -8, 1, 5, 17, 9, -9, 3, 6, 9, 7, 9, 1, 4, 13, -9, 3, 2, -3, -8, -7, -9, -5, -7, -10, -5, -9, -2, 2, 1, -12, -16, -1, -20, -9, -20, -15, -15, -2, -9, -14, -14, -16, -19, -12, -4, -3, -1, -5, 0, -5, -2, -6, 10, 7, 5, 15, 4, -1, 6, 8, 12, 2, -3, 1, 11, 15, 8, 3, 20, 12, 1, 3, 2, 5, 4, 1, 22, 0, 8, 6, -1, 14, -13, -4, -5, -17, -10]
7925a0Oj3NjOqoJ3Kk1J2kN%KqJ4Qj2KNrML%J2j3QQqQqK1j6RNrj8J2kQjqmO%nN
7973GkkNpjPJj1KpJJ5k0lJ5%Koj%pJ1Jjjj7J7Pj4Mk%RJLLj1J7Kllo%jJ4lqPjj2
8023AOOpOj3NQNr%j3J8j7Nj1J0Kj4JJ3k2PJ2j5oLRJNj0J8qnMMKnrRJ2j9LMlJ0
8068C%PmqJ1pKJ0j1J0LnrJ6k5K0%Mj6rJ4Kjj0J0j1RPoj7J8j2nJ0j8LJ4j4KkJ1
8109djJ1j5lKLKj3J7jojOkPQqlJ4j1%KnNQonQlOKpJmjKpJ7j9LQpKKnqMpNQj5Q
8161fLJj2O%J0plmJ3j4J8olKQlj0jJ1NqkQNoJOlJ1
$$ y = [-10, -4, -17, -12, -13, -7, -15, -21, -8, -6, -27, -15, -17, -12, -12, -10, -18, -4, 4, -8, -6, -1, -10, -6, -3, -3, 9, -4, 4, 12, 4, 12, 4, 25, 9, 18, 23, 14, -4, 8, 6, 14, 13, 5, 1, 7, 7, 2, 7, 5, 3, 8, 1, 0, 7, 8, -3, -1, -8, -7, 8, -12, -15, 0, 0, 2, -4, -5, -5, -12, -1, 0, -1, -2, -19, -2, 5, -9, -5, -7, -7, 2, 3, 6, 9, -2, 15, 17, 14, 11, 5, 5, 4, 18, 15, 7, 14, 13, 1, 7, 13, 6, 12, -1, 4, 12, 17, 8, 8, -5, 13, -4, 1, -10, 0, 2, -12, -11, 2, -20, -13, -1, -16, -22, -19, -10, -9, -4, -14, 4, -4, -9, -5, -1, 1, -4, -13, -4, 8, -11, -8, -4, -7, 3, 3, 10, 6, -2, 9, 2, 4, 14, 3, 13, 16, 11, 2, 18, -7, 13, 13, 17, 1, -8, 6, 8, 7, -3, 7, -4, 5, 12, 6, -11, 7, -5, -10, 0, -18, -15, -1, -15, -13, -15, -4, -5, 6, -9, -12, -10, -7, -5, -18, -1, -2, -8, -9, -3, -5, 2, 10, 2, -1, 13, 2, 2, 4, -1, 4, 12, 6, 1, 9, 6, 12, 14, 7, 8, 4, 3, 5, -2, 15, -4, -1, 7, 0, 2, 4, -1, -9, -5, -12, -7, 1, -14, -6, -3, -2, -14, -8, -8, 2, -5, -8, -12, 1, -13, 5, -1, -4, -2, 6, 3, -7, -8, 3, 8, 0, -2, 6, 11, 5, 6, 12, 9, 20]
8191B0
##END NTUPLES=NMR FID
##END=
