##TITLE=1H_SRXYk1
 CDCl3,8 sc, 
 23.9.2021
##JCAMPDX= 6.0         $$ Bruker NMR JCAMP-DX V2.0
##DATA TYPE= NMR FID
##DATA CLASS= NTUPLES
##ORIGIN= UXNMR, Bruker Analytische Messtechnik GmbH
##OWNER= root
$$ XWIN-NMR		Version 3.5
$$ Thu Sep 23 12:44:43 2021 Russian Standard Time (UT+4h)  she@DPX200
##.OBSERVE FREQUENCY= 200.1314
##.OBSERVE NUCLEUS= ^1H
##.DELAY= (6, 6)
##.ACQUISITION MODE= SIMULTANEOUS
##.ACQUISITION SCHEME= undefined
##.AVERAGES= 8
##.DIGITISER RES= 18
##SPECTROMETER/DATA SYSTEM= spect
##.PULSE SEQUENCE= zg30
##.SOLVENT NAME= CDCl3
##.SHIFT REFERENCE= (INTERNAL, CDCl3, 0, 15.7039)
##AUDIT TRAIL= $$ (NUMBER, WHEN, WHO, WHERE, WHAT)
$$ ##TITLE= Audit trail, XWIN-NMR		Version 3.5
$$ ##JCAMPDX= 5.01
$$ ##ORIGIN= Bruker BioSpin GmbH
$$ ##OWNER= she
$$ F:/spectra/data/she/nmr/H-F/1/audita.txt
$$ ##AUDIT TRAIL=  $$ (NUMBER, WHEN, WHO, WHERE, WHAT)
(   1,<2021-09-23 12:43:46.07 +0400>,<she>,<DPX200>,
      <created by zg, POWCHK disabled, PULCHK disabled
       configuration hash MD5:
       00 E9 B6 7A A2 85 ED C7 34 08 36 98 17 FE 4E 26
       data hash MD5: 16K
       49 0E A3 BA 45 8C 85 79 8C BF 5E 67 D3 E5 86 0C>)
$$ ##END=
$$ 
$$ hash MD5
$$ 65 72 2D 70 F2 50 86 49 3F 80 AC 6D C7 8C 1C B3
##$RELAX= 
##$RELAX= 
##$RELAX= 
##$RELAX= 
##$RELAX= 
##$RELAX= 
$$ Bruker specific parameters
$$ --------------------------
##$DU= <F:/spectra>
##$EXPNO= 1
##$NAME= <H-F>
##$PROCNO= 1
##$TYPE= <nmr>
##$USER= <she>
##$AMP= (0..31)
100 100 100 100 100 100 100 100 100 100 100 100 100 100 100 100 100 100 
100 100 100 100 100 100 100 100 100 100 100 100 100 100 
##$AQSEQ= 0
##$AQ_mod= 1
##$AUNM= <au_zg>
##$AUTOPOS= <>
##$BF1= 200.13
##$BF2= 200.13
##$BF3= 200.13
##$BF4= 200.13
##$BF5= 200.13
##$BF6= 200.13
##$BF7= 200.13
##$BF8= 200.13
##$BYTORDA= 1
##$CFDGTYP= 0
##$CFRGTYP= 5
##$CHEMSTR= <none>
##$CNST= (0..31)
1 1 145 1 1 1 1 1 1 1 1 1 1 1 1 1 1 1 1 1 1 1 1 1 1 1 1 1 1 1 1 1 
##$CPDPRG= <>
##$CPDPRG1= <>
##$CPDPRG2= <>
##$CPDPRG3= <>
##$CPDPRG4= <mlev>
##$CPDPRG5= <mlev>
##$CPDPRG6= <mlev>
##$CPDPRG7= <mlev>
##$CPDPRG8= <mlev>
##$CPDPRGB= <>
##$CPDPRGT= <>
##$D= (0..31)
0 1.2 0 0 0 0 0 0 0 0.06 0 0.03 0 0 0 0 0.0002 0 0 0 0 0 0 0 0 0 0 0 0 
0 0 0 
##$DATE= 1632386625
##$DBL= (0..7)
120 120 120 120 120 120 120 120 
##$DBP= (0..7)
150 150 150 150 150 150 150 150 
##$DBP07= 0
##$DBPNAM0= <>
##$DBPNAM1= <>
##$DBPNAM2= <>
##$DBPNAM3= <>
##$DBPNAM4= <>
##$DBPNAM5= <>
##$DBPNAM6= <>
##$DBPNAM7= <>
##$DBPOAL= (0..7)
0.5 0.5 0.5 0.5 0.5 0.5 0.5 0.5 
##$DBPOFFS= (0..7)
0 0 0 0 0 0 0 0 
##$DE= 6
##$DECBNUC= <off>
##$DECIM= 32
##$DECNUC= <off>
##$DECSTAT= 4
##$DIGMOD= 1
##$DIGTYP= 9
##$DL= (0..7)
0 120 120 120 120 120 120 120 
##$DP= (0..7)
150 150 150 150 150 150 150 150 
##$DP07= 0
##$DPNAME0= <>
##$DPNAME1= <>
##$DPNAME2= <>
##$DPNAME3= <>
##$DPNAME4= <>
##$DPNAME5= <>
##$DPNAME6= <>
##$DPNAME7= <>
##$DPOAL= (0..7)
0.5 0.5 0.5 0.5 0.5 0.5 0.5 0.5 
##$DPOFFS= (0..7)
0 0 0 0 0 0 0 0 
##$DQDMODE= 0
##$DR= 18
##$DS= 0
##$DSLIST= <SSSSSSSSSSSSSSS>
$$ [...]
##$SUBNAM2= <"">
##$SUBNAM3= <"">
##$SUBNAM4= <"">
##$SUBNAM5= <"">
##$SUBNAM6= <"">
##$SUBNAM7= <"">
##$SUBNAM8= <"">
##$SUBNAM9= <"">
##$SW= 20.0188988654967
##$SWIBOX= (0..15)
0 0 2 0 0 0 0 0 0 0 0 0 0 0 0 0 
##$SW_h= 4006.41025641026
##$TD= 16384
##$TD0= 1
##$TE= 0
##$TE2= 300
##$TE3= 300
##$TEG= 300
##$TL= (0..7)
0 120 120 120 120 120 120 120 
##$TP= (0..7)
150 150 150 150 150 150 150 150 
##$TP07= 0
##$TPNAME0= <>
##$TPNAME1= <>
##$TPNAME2= <>
##$TPNAME3= <>
##$TPNAME4= <>
##$TPNAME5= <>
##$TPNAME6= <>
##$TPNAME7= <>
##$TPOAL= (0..7)
0.5 0.5 0.5 0.5 0.5 0.5 0.5 0.5 
##$TPOFFS= (0..7)
0 0 0 0 0 0 0 0 
##$TUNHIN= 0
##$TUNHOUT= 0
##$TUNXOUT= 0
##$USERA1= <user>
##$USERA2= <user>
##$USERA3= <user>
##$USERA4= <user>
##$USERA5= <user>
##$V9= 5
##$VALIST= <valist>
##$VCLIST= <CCCCCCCCCCCCCCC>
##$VD= 0
##$VDLIST= <DDDDDDDDDDDDDDD>
##$VPLIST= <PPPPPPPPPPPPPPP>
##$VTLIST= <TTTTTTTTTTTTTTT>
##$WBST= 1024
##$WBSW= 4
##$XGAIN= (0..3)
0 0 0 0 
##$XL= 0
##$YL= 0
##$YMAX_a= 162827
##$YMIN_a= -81070
##$ZGOPTNS= <>
##$ZL1= 120
##$ZL2= 120
##$ZL3= 120
##$ZL4= 120
##$ABSF1= 10
##$ABSF2= 0
##$ABSG= 5
##$ABSL= 3
##$ALPHA= 0
##$AQORDER= 0
##$ASSFAC= 0
##$ASSFACI= 0
##$ASSFACX= 0
##$ASSWID= 0
##$AUNMP= <proc_1d>
##$AZFE= 0.1
##$AZFW= 0.1
##$BCFW= 1
##$BC_mod= 2
##$BYTORDP= 1
##$COROFFS= 0
##$CY= 11.3945322036743
##$DATMOD= 1
##$DC= 2
##$DFILT= <>
##$DTYPP= 0
##$F1P= 2.36226072786647
##$F2P= -0.459571619588291
##$FCOR= 0.5
##$FTSIZE= 0
##$FT_mod= 4
##$GAMMA= 1
##$GB= 0.15
##$INTBC= 1
##$INTSCL= 1
##$ISEN= 128
##$LB= 0.24
##$LEV0= 0
##$LPBIN= 0
##$MAXI= 10000
##$MC2= 0
##$MEAN= 0
##$ME_mod= 0
##$MI= 1.114404
##$NCOEF= 0
##$NC_proc= 0
##$NLEV= 6
##$NOISF1= 3.799351
##$NOISF2= 2.8
##$NSP= 1
##$NTH_PI= 0
##$NZP= 0
##$OFFSET= 15.70392
##$PC= 1
##$PHC0= -14092.83
##$PHC1= 45.40088
##$PH_mod= 1
##$PKNL= yes
##$PPARMOD= 0
##$PSCAL= 0
##$PSIGN= 0
##$REVERSE= no
##$SF= 200.130013532006
##$SI= 16384
##$SIGF1= 3
##$SIGF2= 2
##$SINO= 400
##$SIOLD= 16384
##$SREGLST= <1H.CDCl3>
##$SSB= 0
##$STSI= 0
##$STSR= 0
##$SW_p= 3612.71676300578
##$SYMM= 0
##$S_DEV= 0
##$TDeff= 0
##$TDoff= 0
##$TI= <>
##$TILT= no
##$TM1= 0
##$TM2= 0
##$TOPLEV= 0
##$USERP1= <user>
##$USERP2= <user>
##$USERP3= <user>
##$USERP4= <user>
##$USERP5= <user>
##$WDW= 1
##$XDIM= 8192
##$YMAX_p= 0
##$YMIN_p= 0
$$ End of Bruker specific parameters
$$ ---------------------------------
##NTUPLES= NMR FID
##VAR_NAME=  TIME,          FID/REAL,        FID/IMAG
##SYMBOL=    X,             R,               I
##VAR_TYPE=  INDEPENDENT,   DEPENDENT,       DEPENDENT
##VAR_FORM=  AFFN,          ASDF,            ASDF
##VAR_DIM=   8192,          8192,            8192
##UNITS=     SECONDS,       ARBITRARY UNITS, ARBITRARY UNITS
##FACTOR=    0.0002496,     1,               1
##FIRST=     0,             0,               0
##LAST=      2.0444736,     0,               0
##MIN=       0,             -81070,          0
##MAX=       2.0444736,     162827,          0
$$ Real data points
##PAGE= N=1
##DATA TABLE= (X++(R..R)), XYDATA
0 0 0 0 0 0 0 0 0 0 0 0 0 0 0 0 -8 8 -8 8 -9 16 -16 24 -24 30 -32 40 -48 54 -62 71 -80 88 -103 115 -129 146
36 146 -166 184 -207 230 -255 286 -316 350 -386 427 -472 520 -574 631 -696 766 -844 932 -1030
55 -1030 1141 -1268 1414 -1580 1779 -2020 2314 -2688 3177 -3850 4841 -6443 9491 -17396 87111
70 87111 162827 24176 -47310 -48015 40692 95900 86670 14054 -25352 -5689 56195 79781 46295
83 46295 -21036 -54135 -36202 8451 23296 1432 -33033 -40934 -21613 3482 887 -28571 -59808
96 -59808 -63551 -43874 -20148 -14353 -21876 -29367 -23683 -9395 518 -6135 -21602 -29229 -20314 -1367
110 -1367 13975 18364 16394 16735 23370 28598 26792 18721 11217 10083 16717 26517 32495 31791 28278
125 28278 25522 22883 18658 10814 1643 -5730 -6231 -1965 2313 3377 971 -3200 -8146 -12881 -18769
140 -18769 -24445 -28298 -27925 -24068 -18149 -12987 -9995 -10347 -12048 -13948 -15037 -16230 -16550 -13870 -8551 -1576
156 -1576 5854 10873 13202 13366 12558 10210 8690 7624 8608 11233 15634 20388 23890 24069 21624 17411
172 17411 11750 6874 3191 708 709 2341 4237 5094 4411 1420 -3710 -9026 -13869 -17190 -19164 -18697
188 -18697 -16231 -13238 -10620 -8849 -8492 -10020 -12811 -14788 -15801 -15773 -13140 -8960 -3385 1465 5469 7264
204 7264 7353 6058 4793 3699 3914 5769 9482 13174 16825 19420 19545 17926 15048 11630 7799 5558
220 5558 4988 5437 6346 7955 8496 7453 4583 723 -3763 -8137 -11155 -12866 -12495 -10851 -8749 -7425
236 -7425 -6658 -7853 -9875 -12610 -15116 -16141 -15643 -13492 -10308 -6125 -2797 -245 722 486 -324 -1365
252 -1365 -1470 -736 1644 4547 7931 11474 13749 14440 12928 11602 8800 7057 6019 6016 7377 8933 10252
269 10252 10549 9741 7666 4314 932 -2578 -4913 -5625 -5707 -4516 -3226 -2396 -2764 -4538 -6619 -9256 -11543
286 -11543 -12356 -12708 -11042 -8562 -5782 -3806 -2199 -1809 -2433 -3741 -4524 -4881 -4128 -1886 750 3975 6521
303 6521 8293 8949 8319 6589 5088 3728 3408 4268 5528 7254 8631 9232 8346 6914 4160 1676 -823
320 -823 -2301 -2724 -2255 -1571 -853 -87 -599 -2043 -4106 -6404 -8353 -9665 -8980 -8175 -6187 -4150 -2531
337 -2531 -1630 -1953 -2550 -3772 -4315 -4609 -3814 -1866 411 2915 5029 6146 6236 5795 4555 3390 2820 2674
355 2674 3616 5016 6370 7905 7882 7311 6101 3890 1534 95 -1392 -1717 -835 -372 509 410 -334 -1712
373 -1712 -3619 -5502 -6841 -8148 -7887 -7067 -5659 -4075 -3065 -2531 -3172 -3995 -4582 -5286 -5505 -4664 -2969
390 -2969 -839 1092 2931 3799 4094 3859 2937 2215 1851 2615 3356 4522 6475 7315 7799 7467 6187 4580
408 4580 2953 1771 1211 965 1463 2189 2556 2413 1756 203 -1783 -3450 -5000 -5588 -5533 -5139 -3988 -3213
426 -3213 -2969 -2769 -3080 -4417 -5416 -6127 -6036 -5349 -4073 -2557 -594 650 1462 1284 844 272 -2 -210 643
445 643 1682 3052 4777 5469 6099 5602 4825 3424 2467 1713 1536 1766 2196 3057 3700 3340 2905 1591 -67
464 -67 -1579 -2712 -3322 -3096 -2415 -1971 -1111 -947 -1467 -2058 -3118 -4079 -4705 -4883 -4416 -3449 -2235 -693 -42
483 -42 19 363 -407 -773 -1042 -1233 -420 386 1911 2960 3882 4290 4158 3176 2531 1503 1024 970 1527 2409
503 2409 2919 3285 3074 2281 1285 104 -1232 -1923 -2371 -2056 -1559 -1406 -322 -574 -1131 -2014 -2809 -3713 -3929
522 -3929 -4068 -3623 -2765 -1737 -717 -316 -1 -389 -473 -1045 -1368 -965 -484 461 1612 2728 3206 3505 3500 2745
542 2745 2099 1596 1254 1425 2352 2611 3240 3535 3245 2620 1794 419 -595 -942 -1269 -1402 -697 -409 -386 -327
562 -327 -836 -1548 -2552 -3438 -4024 -4004 -3464 -3059 -2262 -1358 -946 -1018 -1395 -1716 -2133 -2268 -1815 -936 -286 961
582 961 1337 2321 2338 2253 1862 1498 1164 1193 1648 2034 2736 3300 3308 3112 3065 2168 1469 491 560 -156 260 501 1019
605 1019 792 831 206 -601 -1509 -2122 -2616 -2826 -2124 -1935 -1643 -1250 -779 -1002 -1721 -2000 -2599 -2593 -2481 -2004 -1068
626 -1068 -321 292 841 837 762 486 220 -15 101 524 1248 1837 2211 2691 2417 2379 1497 1047 364 366 337 525
648 525 1066 1319 1330 1216 751 -105 -714 -1528 -1643 -1889 -1429 -1207 -859 -618 -543 -435 -1248 -1790 -1789 -2206 -1750 -1340
670 -1340 -888 -247 254 489 515 190 34 0 -270 43 423 708 1616 1968 1818 2256 1682 1199 804 555 349
691 349 328 663 911 1263 989 920 458 -502 -774 -1293 -1281 -1365 -1123 -1096 -447 -548 -681 -968 -1333 -1530 -1953 -2139
713 -2139 -2058 -1454 -988 -402 153 262 151 -57 -86 -175 -378 -406 371 1199 1308 1777 2002 1859 1560 1009 986 721
735 721 591 684 975 1570 1666 1557 1250 922 419 -246 -629 -1089 -701 -397 -397 -306 -283 -304 -933 -1367 -1766 -1822 -1867
758 -1867 -1802 -1246 -1287 -592 -753 -520 -608 -872 -1027 -976 -1034 -736 -288 363 501 1006 1006 1085 836 739 405 595 458
781 458 761 1141 1703 1659 1593 1621 1114 671 261 185 57 56 51 387 300 408 118 139 -606 -804 -1160 -1416 -1236 -1092
805 -1092 -643 -405 -236 -311 -562 -676 -1334 -1338 -894 -1010 -566 80 250 606 577 534 307 111 31 182 267 399
827 399 918 1154 1224 1043 1168 946 452 177 61 86 29 108 712 719 351 341 -54 -262 -669 -868 -950 -841 -665
850 -665 -471 -106 -517 -314 -248 -644 -856 -644 -1066 -545 -325 -388 257 300 509 507 306 294 107 227 175 409 757
873 757 1133 1278 1355 896 709 400 164 160 -56 347 40 621 586 673 177 -49 -778 -694 -887 -1156 -796 -592
895 -592 -327 -503 -520 -544 -371 -857 -1072 -1149 -939 -891 -625 -469 115 10 119 -177 -10 -71 110 -195 305 369
917 369 873 1206 1090 1121 818 800 618 698 547 363 716 874 807 841 917 511 220 189 -561 -422 -474 -430 -246
940 -246 -149 -42 -164 -364 -643 -741 -1137 -1090 -879 -681 -524 -459 -347 -645 -192 -283 -324 -596 -357 -427 -105 224 254
963 254 676 870 580 492 544 531 210 212 382 447 760 754 846 711 781 183 105 -79 -69 -370 -211 15 238 348
987 348 513 -277 -336 -528 -505 -570 -607 -618 -607 -36 -63 -33 -170 -456 -552 -235 -315 -308 -25 49 -237 371 513 506 295
1012 295 317 216 114 210 476 553 713 564 736 425 416 316 292 -282 -319 -84 131 114 80 55 137 -181 -149 -480
1036 -480 -485 -577 -502 -553 -601 -165 -287 -5 -348 -422 -491 -520 -467 -354 166 37 -13 387 409 50 298 139 -197 44
1060 44 317 292 288 587 622 892 537 316 314 181 116 11 156 244 155 241 307 213 -66 -134 -189 -374 -362 -416 -474 74
1086 74 -213 -269 -501 -420 -545 -617 -366 -253 -359 -280 -98 -93 -52 -231 103 -81 -70 -283 -95 -218 215 243 531
1109 531 792 598 534 182 338 18 147 317 -28 411 299 345 489 230 88 -59 -291 -234 -22 -289 -92
1130 -92 -131 -95 64 -164 -141 -387 -390 -391 -633 -225 -381 32 -74 -267 6 -42 -397 -206 -184 -283 -357 15 71 79 420
1155 420 202 389 228 223 -30 110 90 177 291 291 354 35 372 -11 -64 -364 -161 -290 -205 11 103 148 170 272
1179 272 -216 -335 -410 -468 -455 -442 -407 -192 -72 -111 72 36 -206 -156 -192 -17 -154 80 70 76 -139 77 247 346
1203 346 -183 -12 -77 60 37 340 342 468 540 171 228 -166 -62 -287 107 176 45 -17 -207 -73 -507 -102 -135
1226 -135 -391 -108 -102 -251 -109 -178 -162 -17 -252 -131 1 -101 -78 -46 -109 39 119 209 131 226 401 133 259 89
1250 89 351 79 136 -159 378 452 122 418 251 180 -253 205 34 53 274 7 177 156 -186 -115 -91 -11 -457
1273 -457 -457 -140 -318 -194 -128 114 102 -89 -362 -381 -262 -327 -133 -349 119 308 14 -67 92 -113 -132 175 -46
1296 -46 226 16 69 72 524 -12 114 90 98 259 134 198 254 336 106 281 40 -91 88 55 13 -188 -300 -122
1320 -122 147 -342 -41 -127 -145 -222 -70 -1 -69 -158 -29 -35 254 60 -63 109 -37 169 -44 -78 -157 -45 265
1343 265 -85 222 261 59 7 -14 275 154 -43 93 316 333 154 177 277 113 47 61 -206 -463 46 125 -69
1366 -69 199 99 98 -295 -83 61 -274 -198 -25 -56 85 127 -149 86 -56 -106 213 70 14 177 92 58 63 285
1390 285 89 242 432 175 62 350 257 -110 48 176 362 229 293 -51 123 183 -175 -253 -115 -64 -180 -69
1412 -69 30 -149 50 -170 -292 -295 -379 -335 -113 -239 -45 209 -48 -203 -326 -133 -226 -44 -14 193 -54 139 215
1435 215 91 55 297 28 112 -90 276 236 305 176 -38 553 78 297 -14 121 26 232 -192 76 50 -38
1457 -38 396 52 -29 -69 55 -189 15 65 -149 -87 -72 -171 -271 -226 116 -166 -173 -278 -259 -219 -47 195 40 137
1481 137 190 107 -13 -290 -8 3 125 153 176 304 58 298 197 -18 -53 -73 -35 45 -72 -18 139 2 -109
1504 -109 65 244 -85 -38 -110 -159 61 -18 -56 84 43 -197 -98 78 -191 -80 -71 -107 39 128 181 -230 42 -37
1528 -37 -366 234 -139 -49 -46 218 -14 70 131 56 99 109 99 -15 -56 183 82 -20 -25 -16 -132 -38 -85 68 -297 100
1554 100 -128 100 -170 -206 -77 298 -69 -99 62 185 -408 23 -141 -276 -36 -80 -146 42 -79 -93 149 -250
1576 -250 72 193 140 144 246 -54 33 121 11 -27 -174 172 -59 14 -14 -9 -125 -14 -162 -130 -33 -148 -132 -11
1600 -11 -46 -318 -49 90 -127 -367 -232 -144 -17 -161 -141 -67 -270 -63 -27 13 -182 10 12 37 -19 -71 132 166
1624 166 13 148 157 7 243 21 1 76 -195 53 -9 476 167 249 -42 95 166 -93 -43 -255 -26 -36 31
1647 31 238 -172 -15 -25 -95 -234 -241 28 -117 68 -97 256 -142 0 -44 -168 -82 63 -64 -230 -16 15 -321
1670 -321 23 68 84 204 45 85 111 -33 -4 16 179 116 187 -108 -2 -156 142 -70 -22 -117 -141 -24 -248 8
1694 8 37 51 126 -164 -362 -104 -101 38 69 131 68 86 143 -51 -230 28 -161 285 50 139 425 -54 -94 201 176
1719 176 -38 118 -23 -228 -82 -48 -217 78 -24 73 -283 -54 -120 -190 10 -266 348 -45 -90 -51 120 183
1741 183 -187 -239 -237 0 -90 32 -63 233 -185 -40 -43 -147 -182 -100 -169 -27 41 17 200 154 55 85 108 -44 -287
1766 -287 -62 236 -15 314 203 47 -129 -81 -73 104 -18 200 -154 -14 -46 67 82 -104 58 -157 113 437
1788 437 119 -143 -142 229 38 -38 -78 37 -133 134 -185 45 -14 69 -167 171 -163 -43 -60 -111 134 -58 210
1811 210 -86 100 28 118 -41 -22 -151 130 -161 -35 35 140 -137 208 132 -67 -107 141 369 224 70 -34
1833 -34 64 28 32 246 -186 -250 179 3 -262 -88 39 -148 35 -245 -66 -86 -4 -92 218 -104 -64 6 -87 -283
1857 -283 -61 -314 -36 -155 -100 251 -49 29 24 11 -154 128 260 93 254 166 -9 86 -89 -183 -66 42 50
1880 50 -268 -111 108 -98 -110 36 -301 2 -285 -24 10 113 -122 145 27 -251 -48 62 9 -231 -277 12
1902 12 -18 95 -171 9 91 -43 239 209 -102 115 -180 41 247 73 -121 298 130 -101 48 26 -174 -16
1924 -16 264 33 -101 189 180 -10 -40 -151 -24 24 -280 45 -37 61 -19 53 -26 -114 -201 -44 67 125 56 -55 -24
1949 -24 -13 -31 64 51 -269 -4 -20 93 -33 236 26 -121 -47 73 20 -65 37 33 136 -185 202 30 30 -28 24
1974 24 -94 53 -23 9 233 -173 -169 -94 -117 -75 -57 -296 -33 72 -416 162 -106 173 87 -111 -198 80 22 -35
1998 -35 177 145 -3 -104 -57 -41 124 359 -298 54 -160 -60 -52 -169 210 32 17 234 -173 -185 28 84 -23
2021 -23 343 -90 -148 -85 18 147 62 -4 -112 -131 -14 234 72 61 -113 -10 193 -259 75 230 -156 -83 176
2044 176 90 -11 -92 -205 40 -50 -224 102 39 87 35 65 -22 -234 159 -238 -26 -92 27 -31 59 -109 -281 68
2068 68 -98 -77 -65 -132 -168 -150 129 102 125 -159 -81 65 -29 -31 111 -70 12 146 -56 272 86 74 147 99 -46
2093 -46 -99 -135 26 177 -17 112 -209 129 -113 176 221 79 -2 -70 -14 -89 56 34 -84 -48 77 -62 -58 -186
2117 -186 -90 34 77 70 155 158 -102 -83 -120 310 81 -22 -35 -28 -122 136 93 -241 101 124 -80 -206 -138 -59 97 176
2143 176 251 -15 211 188 -86 20 -138 42 -113 219 37 -54 -69 -81 -26 -88 -48 101 -18 -219 71 -74 117
2166 117 43 115 -112 -165 -15 97 102 -246 -288 -135 3 -9 39 -277 8 146 -132 116 -161 116 -242 -73 196
2189 196 -71 103 -352 -92 44 195 -33 143 -39 -148 -160 -127 -26 -91 -130 -86 -2 -59 152 -142 -159 -51 133
2212 133 -149 -40 -63 138 -69 211 -248 -141 345 -281 90 -176 -28 53 -60 93 -78 -50 142 68 -127
2233 -127 122 -181 -220 119 69 64 154 162 -23 -34 -193 -42 325 15 -223 -147 -183 -347 -11 32 -66 -61 384 -180 -256
2258 -256 -285 -82 -51 25 27 15 -179 3 -5 4 -102 -82 -16 -114 238 -149 35 -176 115 118 87 -182 -146 -179 -159 17
2284 17 142 30 -99 149 -44 114 -110 -6 57 103 -127 32 -48 -335 80 -104 20 -173 -139 -166 16 145
2306 145 -44 281 111 -153 -94 -47 115 -180 16 -27 -70 61 282 239 90 62 -214 181 17 6 19 -110 39
2329 39 101 356 2 115 18 -263 -15 65 106 70 -1 -89 206 74 31 -3 -177 138 128 45 43 27 93 57 293 -48
2355 -48 -191 -52 -186 214 -143 -41 49 -315 47 105 81 194 73 -42 -213 -109 3 -46 105 -146 23 76
2377 76 -95 29 82 178 -276 -182 -81 26 196 12 -56 -106 67 69 -126 -9 -361 -44 16 9 -72 -103 -46 -54 -75 142
2403 142 23 146 -152 31 76 -60 -97 9 136 315 133 -15 -106 -146 -131 -167 29 51 -120 19 56 -134 -36
2426 -36 -29 163 178 161 -148 -45 57 -176 -144 -155 -106 -163 44 -67 3 -186 -17 214 -351 11 -11 49 -33 -40 105
2451 105 280 -12 -19 -13 -4 63 -58 43 4 -143 -114 -46 192 150 -55 -6 -119 9 3 59 30 27 -11 5 -15 65 -85
2478 -85 210 102 -161 -196 0 275 -10 291 -101 96 -2 164 -294 -170 116 256 110 27 224 -312 32
2499 32 -201 118 110 78 -190 -40 -83 102 -47 218 148 127 -149 -62 -51 93 -70 -194 59 -78 -119 65 236
2522 236 -160 30 91 33 118 -199 -129 96 -83 -42 -91 22 109 88 158 305 93 76 -88 29 -71 167 -5
2545 -5 -28 238 251 128 -133 -160 90 40 -90 -256 74 150 43 -144 13 -76 190 345 167 169 91 -138 -185 -238
2569 -238 310 -46 -134 -272 93 -267 109 142 -56 83 341 -143 -45 48 -80 29 254 -85 75 241 -241
2590 -241 -82 177 242 -204 150 37 139 -235 -43 -44 264 -88 -140 -47 187 -43 89 89 58 112 -213 -91 104
2613 104 -29 191 -174 29 -55 259 -49 190 -167 -68 58 -15 230 -136 62 50 -5 -126 180 125 -5 -160
2635 -160 -64 -188 71 -129 85 -125 275 -105 -113 -108 127 60 -101 113 70 253 -133 23 66 43 -80 -271 -113
2658 -113 -292 40 0 81 -28 -192 13 29 -410 158 65 -224 -107 -234 -95 239 27 211 126 103 32 82 160
2681 160 103 73 -42 163 95 -2 -88 197 39 -265 305 -84 4 -100 -26 54 -18 -31 76 -106 31 -21 2 -26
2705 -26 -227 98 -64 -139 32 62 -29 -127 -155 168 49 80 -21 155 140 -44 -53 -97 -146 71 -127 -130 -44 179 6
2730 6 -149 -65 -173 220 87 12 238 -80 -46 362 -220 218 180 -192 7 326 -171 -59 -246 231 -36 28
2752 28 -36 -58 -129 194 152 -86 64 16 36 -175 102 -144 -171 92 -120 102 22 -38 266 -367 103 -12 -128
2775 -128 -63 93 81 -145 26 -121 -32 67 -52 38 124 67 -51 -4 3 71 41 11 153 153 21 3 -202 -39 -182
2800 -182 219 32 29 -222 -224 -199 29 -170 -9 202 276 33 181 145 147 107 31 187 68 57 -1 -5 53 119 -65 60
2826 60 -201 -14 -108 -77 -27 50 76 84 -49 235 26 52 54 -145 101 -281 -29 212 163 -233 30 -37 32 184 -152
2851 -152 58 237 69 41 63 0 157 244 -172 52 -79 -147 191 127 2 -4 220 183 36 -279 -22 171 20
2874 20 -176 -178 373 53 -97 -108 83 -305 -177 71 82 277 119 119 147 -1 -122 2 89 -64 162 34 118
2897 118 -65 -123 259 -129 116 -35 49 163 36 161 -235 -129 30 -23 -112 -235 212 -202 -398 21 -35 -115
2919 -115 108 152 95 -94 130 77 278 -139 -67 298 166 81 -47 56 -10 17 -237 128 214 193 126 -150 -16
2942 -16 79 -32 3 139 -217 -165 -161 -50 135 -145 50 -174 -77 -37 109 -43 -40 96 -12 -166 -134 225 92 104
2966 104 172 95 -56 -79 -19 -83 191 81 -299 61 -102 177 -66 54 -17 -133 -119 -182 4 99 263 20 -195
2989 -195 58 -17 8 -7 -120 173 -70 6 218 -77 -182 11 266 -83 112 -125 -144 -178 -35 92 -6 7 31
3012 31 -54 -10 -19 -127 -167 -209 -65 250 38 52 -64 7 -292 -190 140 148 68 -29 -86 253 53 -292 -178 -44 -104
3037 -104 -158 -116 159 -105 -55 -183 112 -120 -261 -148 -14 30 -31 -71 -119 -153 48 153 -32 -274 -212 58 74
3060 74 140 -174 -170 11 -106 -21 -93 -158 240 49 -164 -196 45 -88 -173 221 10 37 62 -40 -52 202 -160 43
3084 43 179 177 -73 19 -6 130 70 144 62 -126 -67 255 -139 -34 -141 52 120 -106 162 -12 76 -118 59 -180
3108 -180 -120 -308 99 -103 81 67 113 -145 -118 38 83 -183 169 -126 -81 -111 -358 40 -54 105 -12 -100 -39
3131 -39 151 111 167 -162 134 -27 -152 -65 36 -83 -64 -260 -166 -219 57 -90 140 -146 106 85 -27 -7 58
3154 58 -87 -31 -12 -113 -31 82 -90 72 113 20 31 -99 -121 251 -134 39 146 -28 287 -48 -74 -278 -114
3177 -114 -132 222 -150 -146 -77 -153 85 278 -136 31 166 -103 221 -240 -134 122 -38 -151 -82 369 73 -199
3199 -199 -191 -354 -86 125 11 63 140 168 -194 -66 28 -163 53 -78 151 188 -57 -20 288 -24 25 -66 -459
3222 -459 181 68 49 277 -147 19 -107 180 2 35 -163 56 160 -150 -95 30 -50 -34 244 133 47 -286
3244 -286 -215 85 -72 -77 -292 48 90 185 160 -210 308 -144 45 -61 61 -62 -116 278 -11 -220 -188 122 50
3267 50 -28 -297 -13 -208 332 -107 89 -40 145 40 -212 114 187 -62 108 -92 -182 -7 161 96 97 -176
3289 -176 -18 -103 -15 -76 15 -30 70 25 14 -210 -112 243 -20 -2 -201 -174 78 182 154 105 -54 193 22 -123
3313 -123 118 77 188 -137 204 -142 85 -230 77 -25 -59 32 -125 -90 -256 -294 40 141 -150 -37 -19 -33
3335 -33 -84 196 117 91 -79 24 -124 -166 -147 -137 -245 -135 -276 -190 212 197 82 -234 -191 35 17 170 -72 21
3359 21 -195 271 -10 -98 164 -9 145 123 68 142 -6 246 -250 -77 -134 -32 309 -176 -97 -100 -84 -212 177
3382 177 102 1 -119 -23 183 128 -238 -136 -263 -18 215 54 238 17 -43 103 26 345 -99 -27 3 -6 95
3405 95 -36 -165 109 161 -182 58 -119 -41 75 -26 261 -108 3 100 -13 188 48 57 -100 28 -138 196
3427 196 -138 -2 -13 197 129 -52 -135 233 -238 4 -46 -311 82 -107 72 61 72 146 208 39 -86 6 27
3450 27 107 140 14 -39 -279 -8 -244 131 -34 102 182 191 -69 -49 71 11 56 -7 -79 26 113 -92 -15 31 -112
3475 -112 161 150 -34 -1 195 12 128 -2 63 177 -96 138 -207 252 179 143 95 142 15 3 93 30 -94
3498 -94 -159 -133 18 171 135 86 117 16 -157 30 -166 65 -1 126 -56 -10 252 25 -28 19 -71 172 -24 407
3522 407 -151 -242 151 -49 13 103 23 97 95 -101 -211 -133 160 -46 128 110 -242 131 257 -122 84 -92 87
3545 87 248 -141 -16 -9 -134 -38 -144 -75 247 62 -81 -26 149 187 67 203 -162 76 -21 26 -2 -94 -54 44
3569 44 9 39 17 -40 -50 -206 23 233 -191 60 -44 49 -113 13 135 -6 7 73 -46 256 83 -22 -238
3592 -238 -14 181 -118 -116 -177 20 67 172 12 -126 -107 124 -45 183 -316 -217 -21 111 195 191 261 112 101 -104
3616 -104 114 59 192 -40 29 -244 -124 82 104 -30 -321 -5 -284 -311 106 166 -27 179 131 -177 194 -18
3638 -18 -26 -1 -274 -52 29 -84 -79 109 75 -125 8 -40 129 53 75 61 -210 253 -42 -121 -57 79 90 76 -58
3663 -58 -141 89 -168 84 -142 -68 -41 126 53 -92 -149 39 395 -48 -73 145 -85 -154 -97 19 -11 -48 -408 8
3687 8 340 -98 -113 -50 -47 103 -67 -134 116 47 -58 82 375 -58 7 110 179 42 183 -19 -52 425 124 30
3711 30 8 -194 118 32 -40 206 93 -80 57 22 35 47 98 49 -94 -36 197 -108 145 126 -277 118 249 -102
3735 -102 -96 -98 -15 86 110 -2 153 30 -204 1 8 239 196 134 98 -167 36 148 -100 -126 39 -27 -141 -98 -133
3760 -133 -281 173 151 101 207 18 41 -14 -39 42 -89 -111 -104 -227 -348 161 -77 43 -62 62 -73 -9 172
3783 172 -33 43 -11 -134 -270 -61 129 74 49 -219 119 189 -84 -299 222 -232 -195 -73 -379 187 18 -59
3805 -59 196 26 98 -137 -118 -17 -88 214 -173 -257 -244 -212 241 4 -102 -127 -60 -201 67 60 -82 70 32 -218
3829 -218 233 92 184 261 -67 -11 184 -151 -22 -26 -137 -62 -172 -104 -147 237 276 14 115 -307 102 -115 9
3852 9 80 58 -22 13 172 95 -290 -99 38 145 21 103 180 54 -85 -2 5 -207 60 -50 -3 -159 -121 215 -253
3877 -253 -11 -27 -33 -112 13 77 173 49 -14 -98 126 23 -74 128 88 -178 -178 -167 125 -224 172 -161 -68 15 62
3902 62 175 28 -143 178 -16 2 277 -35 -35 -32 -80 121 199 75 -128 75 143 -141 210 324 -36 355 107
3925 107 -81 -62 -211 -72 13 -116 8 138 -45 -73 76 -99 -48 25 145 -75 7 143 27 67 -242 -112
3947 -112 85 -65 109 -143 -127 -216 19 -34 7 154 188 197 43 -19 -11 -74 159 83 -204 136 -6 152 -314 -72
3971 -72 217 1 -131 -39 -214 175 22 200 -71 -91 79 138 -201 -17 280 -75 149 -80 26 -109 53
3992 53 56 -65 124 -176 41 -49 -132 100 284 52 51 238 -1 1 -102 -10 -159 -159 -255 167 -174 106 -45 137
4016 137 -182 -39 -226 -71 76 -23 122 259 167 14 -70 66 -1 -76 -13 -167 73 137 -175 74 107 241 187
4039 187 -224 -51 -302 164 93 70 207 -22 -162 102 66 157 39 -185 131 149 263 277 233 41 205 -356
4061 -356 115 306 195 53 -78 93 48 67 171 -1 -15 -130 -103 98 0 -45 -96 139 -243 95 0 -7 273
4084 273 139 156 -31 37 368 9 -188 25 15 -5 -44 -282 32 -62 -140 -379 180 -11 53 -90 -105 -120 -216 -95
4108 -95 14 -246 -37 42 -26 -172 113 -283 60 -69 -153 -95 -79 -212 -55 -15 -1 -33 55 -73 -126 72 71 -211
4132 -211 97 -59 112 -103 -137 -188 -203 -33 183 229 -142 -145 116 37 112 -117 -51 4 35 -35 66 119 -86 -56 -3
4157 -3 -13 155 -83 158 -362 159 13 -45 83 163 398 -227 8 -108 -152 3 27 54 67 -174 33 8 -95
4180 -95 -44 -57 -17 43 -88 100 120 258 -181 -144 -24 -19 51 72 -182 16 158 84 -32 285 -216 -138 37 -75
4204 -75 -113 -66 47 181 -168 25 148 46 74 50 275 78 154 112 59 132 16 -202 -59 -99 -38 297 -146 -55
4228 -55 232 0 208 202 168 65 112 -23 -5 -33 151 -105 -73 149 173 52 16 -196 107 73 55 156 87 -5 -12
4253 -12 -128 135 86 -50 202 322 35 -213 96 88 173 -51 -48 -54 -166 -44 -35 136 147 -215 89 216 -227 99
4277 99 0 213 27 -188 74 209 57 111 -182 20 -161 -272 267 101 157 3 234 -39 -248 -143 132
4298 132 -3 -142 94 -57 -216 82 -219 118 -156 -61 68 -64 207 8 108 109 175 -107 -90 7 -121 -33
4320 -33 -117 -217 -13 45 -119 -240 -179 -171 65 158 -102 47 254 -187 207 72 -27 -31 -14 177 -113 79 56 137
4344 137 16 -80 241 -181 -57 -181 -196 2 -40 -167 -295 -166 96 51 50 -10 55 63 77 -60 -28 47 -102 -105 -75
4369 -75 208 -76 -136 124 19 -101 31 -143 -285 49 86 -59 -109 40 -82 -69 -138 -16 34 -86 -152 104 -247
4392 -247 52 85 -38 42 -203 -74 -238 -71 51 -44 -46 102 -161 -68 35 37 230 85 -95 -253 -96 320 -70
4415 -70 -136 -56 90 -107 4 -6 228 19 47 28 391 27 109 139 -23 166 128 -48 11 80 -66 -168 79 -45
4439 -45 -16 -55 -108 -34 -62 -34 211 74 -157 65 181 149 205 143 71 69 124 210 68 97 -44 -24 -87 -304 -64 -72 113
4466 113 205 55 -85 -154 -321 -37 -13 -105 113 -92 -44 -11 -14 119 -102 -80 19 79 163 -106 -56 201 82 7 -52
4491 -52 -202 -33 -243 28 -2 64 -259 126 -72 47 132 -73 52 -167 15 347 -270 -24 48 -92 -230 -149
4513 -149 -19 -7 46 158 162 54 174 37 153 -113 138 109 -106 -283 -44 -119 92 -59 75 75 10 22 -72 130
4537 130 -336 271 -110 -203 -80 -122 246 267 34 -18 13 -111 -151 -141 -238 11 26 -228 -130 183 91 -63 106 -140
4561 -140 203 -68 -146 -81 121 -1 -79 101 8 -187 36 -60 171 132 346 -158 -71 -216 16 58 -340 197 -5
4584 -5 2 -96 306 111 74 -29 167 -60 82 78 49 192 -69 -91 125 -70 399 223 -293 -82 -118 97 129 69
4608 69 43 147 -182 99 -160 -158 71 -89 -69 -226 112 32 83 12 -36 -173 84 178 -217 -240 -20 -95 -87 103 -9
4633 -9 -109 4 66 52 -12 -344 -221 -367 -222 -32 193 -10 -173 -87 145 -174 -230 -146 -251 185 264 -157 -60
4656 -60 142 -11 -16 -156 70 -162 -13 2 187 -245 -54 -92 -58 143 -54 -71 -223 8 79 -103 -82 8 117
4679 117 155 146 -307 1 36 -1 63 -8 -21 -38 -51 -113 -107 108 147 45 148 45 3 130 -151 120 9 53 253
4704 253 -123 -189 71 110 -97 95 78 57 -62 -58 -71 0 -125 -31 -111 96 -54 -29 151 273 49 98 -55 56
4728 56 66 -155 -11 209 -107 20 -9 -104 76 -58 268 -332 3 40 -60 -54 -119 31 -22 6 140 354 -147
4751 -147 -51 90 -1 317 227 85 238 11 -40 58 -82 57 24 286 77 -52 -46 107 -166 155 -239 38 -86
4774 -86 89 -111 -122 12 -13 196 28 -297 68 -77 181 385 29 -234 -24 -23 -94 -240 -251 47 12 -99 210
4797 210 -228 158 65 12 -98 13 -141 -171 20 -156 -125 259 -72 -149 -75 -80 -158 -112 -164 61 355 0 -13 -151
4821 -151 93 175 212 188 11 53 -105 -116 -250 17 -10 -110 122 128 -31 -69 140 -233 155 88 -110 -8 -262
4844 -262 96 291 -86 352 22 -254 -89 132 29 13 3 5 170 113 -8 191 -71 -47 -24 -40 -96 232 163
4867 163 172 -210 -57 75 52 34 122 39 358 308 150 -76 -130 147 -109 -203 -164 -131 6 12 -71 -120 -63 14 -33 193
4893 193 209 139 -88 -99 -280 19 100 96 -105 114 107 -19 214 -1 147 -171 -210 31 -25 104 -71 56 -35 -155
4917 -155 185 -137 104 -80 64 160 -29 30 213 -37 -124 -71 53 121 -80 -106 28 -148 189 198 -129 -96 -19
4940 -19 -75 -89 -157 169 -80 -84 -281 161 31 -205 212 66 -193 67 177 49 9 -58 216 -48 -30 66 82 21
4964 21 -99 -138 -91 -173 -130 92 7 -14 -197 90 22 -255 53 291 -128 -98 289 124 -142 -138 88 4 193 101
4988 101 219 -79 -131 42 125 173 183 105 55 141 -67 24 -66 -41 -138 59 -111 37 -38 176 106 57 43 -166 -153
5013 -153 131 210 -75 99 74 -93 94 -1 153 -67 -195 26 95 82 -84 -31 138 -90 216 61 133 -96
5035 -96 -70 -271 42 -44 -99 -255 -97 129 -167 96 -12 20 109 203 -87 -115 -18 -215 -47 -204 -164 177 361
5058 361 20 -205 247 71 -115 92 16 41 22 -210 117 27 -215 -107 -205 57 8 35 99 270 0 -88 118
5081 118 -51 362 -137 52 25 58 142 108 183 -130 313 -13 185 57 97 66 21 48 63 -33 -128 73 -90 91
5105 91 -29 119 -96 111 -35 -41 25 237 124 -316 -244 -150 -8 -88 215 2 -139 -171 135 4 179 9 -121
5128 -121 -6 -156 -130 -130 -10 -253 -15 -147 -130 -60 -27 118 -184 -45 18 22 -81 108 -305 90 -107 60 -159
5151 -159 -175 -52 -46 -103 156 268 87 122 9 -22 229 0 -115 5 200 -5 56 -101 249 71 0 -219 243
5174 243 169 -5 -32 198 65 -281 30 -168 -86 -163 -140 165 130 -221 -89 -126 222 -146 -115 -75 239 -51 70
5197 70 280 -47 140 153 -177 72 -31 -209 -159 -138 31 2 -153 -325 -208 73 -13 94 -68 -236 -56 44
5219 44 -41 -96 119 -93 -108 -18 -64 -234 156 143 145 95 64 -90 -60 -125 61 329 214 -78 71 274 -135 164
5243 164 -29 -145 10 -158 139 161 -142 140 -1 -51 -185 193 74 42 150 -67 -173 -125 122 117 -113 127
5265 127 48 -138 149 10 -68 83 -305 -113 -189 -69 64 -109 -177 117 376 -24 40 -27 -119 -41 83 -69 81
5288 81 -28 -172 -181 110 -141 151 -180 70 121 43 24 -41 37 -25 175 -180 -61 -346 -207 -234 22 -98 71
5311 71 -79 1 -91 -234 -237 104 -115 -373 -90 -125 20 -15 -50 -48 117 -243 -244 -25 -6 148 170 -182 120 -98 30
5336 30 -108 89 -197 110 -6 43 190 65 207 69 142 -36 14 -214 168 43 78 45 -186 -9 -121 -64
5358 -64 130 17 -59 69 -64 -121 -12 93 -259 -100 -68 42 -61 -72 -113 208 106 -81 -107 95 233 -106
5380 -106 179 -100 296 123 47 -135 -310 188 138 -189 -38 -140 135 92 -68 12 228 179 102 7 -29 134 124
5403 124 44 -90 -24 -58 38 116 -17 94 -73 65 207 -246 187 -89 -88 19 -167 -103 -21 246 -110 -94 21
5426 21 -99 68 -163 63 -210 89 86 -185 -34 -12 -107 137 408 70 -44 -278 -216 19 -31 -39 1 267 31
5449 31 166 -235 222 167 -385 -187 -195 -127 78 -157 -89 115 -45 -60 8 -205 46 -33 94 167 -173 -276 -36
5472 -36 20 21 -107 -142 91 237 -145 -74 -134 -81 -35 -91 236 -81 92 -14 -206 343 183 -43 -132 161 115 -175
5496 -175 -79 -16 -150 -157 33 -473 -108 -104 -7 -25 -3 -1 -153 -92 258 -204 249 -160 -45 105 54 -46 -157 -170 -117
5521 -117 -117 -77 -25 52 83 200 58 231 -46 -329 154 -294 -96 -45 -87 -121 -191 181 56 20 -74 -244 -172 144
5545 144 53 132 365 -170 205 -1 -26 87 111 -169 135 56 -112 -22 38 -154 -28 -20 231 -132 -49 177 -268
5568 -268 -15 88 -71 -62 50 140 109 220 112 62 205 16 -68 -65 82 152 263 -203 -52 16 -56 -55 113 -129
5592 -129 109 -183 -69 27 -59 93 -330 45 92 46 -221 -58 -152 -52 -47 -34 -101 -42 -69 76 14 26 129 222 28
5617 28 -82 -25 127 67 178 -95 38 150 52 216 65 141 -141 -18 -183 25 -44 95 -26 233 105 -192
5639 -192 -101 33 -34 133 101 -204 -180 -108 -108 -94 -61 -15 -139 45 -140 -149 68 194 -139 -85 -142 88 125 -133 137
5664 137 177 108 -276 88 52 -245 60 -41 -33 170 210 -55 109 -195 -81 219 71 -124 -4 -156 54 -105
5686 -105 169 76 -46 61 -64 185 76 30 70 -132 30 143 60 10 85 0 -31 -41 -6 126 -54 75 -5 -67
5710 -67 -226 115 -126 107 269 -1 -261 74 52 217 -25 -2 -65 52 69 -173 58 -98 -188 -133 148 -204
5732 -204 18 50 121 46 190 151 -99 -16 185 92 7 -123 -20 -48 -32 35 -79 -153 -74 -66 -41 285 206 -178 53
5757 53 -160 -19 80 -59 142 -13 -54 156 92 58 -175 71 147 -315 -224 0 311 104 -244 -100 56 102 -2
5780 -2 47 123 61 -207 -103 -22 -93 -5 218 -85 -303 191 -33 13 -20 -31 19 -143 -3 246 -209 -105 -15 196
5804 196 -195 136 7 -152 -186 -215 -75 -158 -138 27 -40 -21 -83 67 -129 49 -148 131 -50 9 -170 -33 173
5827 173 -38 -42 -51 251 121 55 152 7 102 47 36 -7 88 -272 -16 62 230 -132 97 -51 18 -256 -62 103
5851 103 -31 282 -203 -214 -180 -42 79 2 -84 -127 23 101 195 -114 73 243 -157 -199 -162 141 -85 -224 104
5874 104 7 117 -158 -12 56 -93 -93 136 -12 -17 71 313 264 21 15 -179 -62 -303 185 -37 150 -104 -34 101
5898 101 -78 144 61 90 91 -166 109 140 27 34 -93 -223 64 -240 168 152 194 -293 -236 109 100 18 372 179
5922 179 -61 -286 48 -433 -2 209 9 -130 49 173 -240 145 -259 108 -268 106 68 50 180 22 76
5943 76 -88 66 -187 -184 22 5 -85 -139 83 -40 91 -240 -191 -181 11 -149 40 48 2 199 -162 -205 65 114
5967 114 105 -207 14 -99 -111 -44 126 74 -46 -40 -102 110 15 -132 -47 -6 -109 91 -159 -42 -136 71 118 261
5991 261 -185 5 69 36 52 144 176 50 16 52 -161 -39 325 34 217 -220 -76 -217 45 40 180 56 -289
6014 -289 93 61 -7 229 127 -72 131 -16 -229 72 172 -152 -32 20 417 251 -61 -90 65 117 -118 22
6036 22 -181 95 207 65 188 -272 -82 121 81 8 -83 -13 48 -98 -72 55 -122 154 124 9 200 -73 -347
6059 -347 274 -49 -25 144 -7 -63 -11 42 32 216 25 -101 -144 164 -31 -38 -70 -72 81 142 270 -254 -17 -87
6083 -87 255 39 26 -43 360 213 65 28 -181 143 -66 95 -78 -112 285 102 80 8 208 -60 74 -116
6105 -116 -137 -92 53 49 -52 -131 26 69 299 193 -17 281 -194 158 82 -113 -26 65 113 238 63 -43 138
6128 138 145 -283 28 220 132 64 -43 52 -7 -179 -138 -34 46 14 -175 23 -51 245 78 -54 27 -196 251 72
6152 72 -191 79 145 43 -255 -72 -154 71 -69 -127 88 -14 -184 136 178 3 41 164 -231 -240 -17 56 14
6175 14 -25 180 119 38 -45 -181 -47 242 81 107 72 -2 191 269 -17 -65 1 17 -3 -47 82 57 3 13 42 212
6201 212 -287 -66 -43 10 -78 -103 64 -171 -54 255 179 183 -206 -18 -85 188 21 115 60 -152 -116 -265 -87 -110
6225 -110 24 4 -87 -31 138 10 29 -88 51 -124 41 168 -103 -152 -4 60 -284 330 -61 -55 -116 -105 21
6248 21 168 67 196 -35 -254 -89 163 -186 -151 83 -13 -223 62 177 -89 13 59 -25 126 217 41 197
6270 197 -379 3 -143 -39 95 -9 -68 27 -176 -63 -283 -21 272 -237 69 -220 -142 -131 -270 -40 -41 -24
6292 -24 51 -103 124 78 102 38 182 69 40 228 130 -8 56 -108 -9 48 -211 80 -31 -7 89 15 132 -30
6316 -30 -239 -47 230 -86 -150 -20 -435 -35 -16 87 3 52 -159 -137 402 200 -216 -104 58 142 -1 155
6338 155 239 -61 -56 -87 25 -28 -84 -6 255 76 212 24 107 -21 103 107 148 120 -104 182 69 25 199 -124
6362 -124 28 123 -6 73 38 -112 77 231 145 -87 -55 46 -97 -117 -209 -119 -113 68 139 -25 -151 -73 239 -118
6386 -118 69 86 309 -237 42 54 -64 -117 -82 -159 120 41 138 -245 -157 120 -250 67 112 307 177 -88 -108
6409 -108 172 141 113 -176 -5 131 156 -115 -214 -174 317 -236 -114 -7 -159 -66 58 -80 2 89 -196 -245 135
6432 135 83 -136 131 156 -211 293 295 -19 -98 0 -138 77 -210 -127 364 -53 -51 36 -43 -50 -46 -236 -191 74 77 -144
6458 -144 -163 -57 -115 371 -116 109 30 -120 -21 -186 -222 -33 -92 -196 79 -48 -311 -235 -44 279 56 -51
6480 -51 63 -155 -134 -34 -48 41 33 82 -10 98 223 124 -4 -117 254 -119 181 -31 -38 27 234 -14 -44 -21 -113
6505 -113 -106 -75 -312 -32 -7 -70 52 56 125 39 -45 -45 -66 -71 185 49 198 -96 319 -135 -167 0 -30 4 -40 7 54
6532 54 83 217 166 -176 58 -39 222 1 381 -60 -32 -127 -189 -261 440 72 -76 122 -9 -95 65 264 -71
6555 -71 -131 121 -30 -17 188 -87 -80 154 -224 216 117 92 -191 -145 181 -51 146 190 133 -101 -21 -56 3 77 -215
6580 -215 0 90 -107 40 -181 113 59 -34 -128 55 -198 20 245 173 18 23 110 -20 15 9 141 134 -81 -174 -238
6605 -238 -103 88 44 -117 -76 -21 64 204 -68 -207 -206 -20 -127 25 286 80 -275 109 -56 -19 -203 27
6627 27 95 -214 202 235 164 -48 75 75 -181 -24 98 -47 74 -55 -160 -66 21 -146 -160 -124 -30 -93 -147 -63 243
6652 243 54 -147 -77 129 220 96 68 148 -193 -28 115 -187 200 159 264 26 80 343 8 -195 -203 -17 -17
6675 -17 -162 1 112 160 -36 117 -69 173 -66 -65 194 240 62 -158 -2 -11 -125 52 -249 285 350 14 61
6698 61 204 -66 -16 -79 -78 -355 -26 122 173 213 -19 -160 -35 88 100 -215 -214 30 -33 -123 4 233 99 125
6722 125 9 -42 112 2 121 -131 -106 78 145 -66 156 8 124 20 -37 2 -284 183 -61 61 51 270
6744 270 -168 -149 331 -246 203 135 -226 109 -94 12 87 -114 -124 -24 94 -51 168 -82 -153 -190 -146 143
6766 143 -214 73 -70 87 9 -170 -22 -89 -209 245 198 188 138 -177 -33 -28 67 141 2 -186 54 135 118 -172
6790 -172 50 -36 301 -130 -27 -39 227 -44 -208 -17 73 50 -145 -70 -170 76 -173 -34 -261 25 -144 79
6812 79 -38 74 115 18 219 86 -13 -55 -48 -168 59 94 -32 91 -86 -212 -167 42 -111 -37 96 83 295 -75
6836 -75 -25 -118 -131 30 -128 27 61 87 42 104 88 -30 -61 57 -63 136 140 -174 252 -31 145 -26 174 101
6860 101 -114 37 -17 -83 97 -1 -22 -111 -194 -106 137 -120 -114 231 17 191 -125 196 -30 -78 -107 -147 15 52
6884 52 -9 -21 -118 148 73 -42 83 -183 -149 -95 -99 315 86 147 -94 146 67 322 -131 -108 -57 -159 257 -155
6908 -155 -64 125 138 -165 -14 -168 18 -136 -73 123 -103 171 -5 163 233 -131 -346 -201 -45 -168 130
6929 130 12 -70 -90 -95 -56 113 64 238 74 -105 433 263 -51 -35 -68 25 -247 94 46 -144 -181 -174 83 -213
6953 -213 -79 -23 36 -39 67 176 100 -384 -134 136 287 292 29 26 -119 -113 -124 -82 132 -70 -174 -265 23 -4 116
6978 116 307 207 39 22 -199 157 34 54 -54 -42 -179 179 3 -22 -27 -42 154 78 -296 -38 370 -331 -132
7001 -132 131 -260 83 94 134 -121 -232 -28 129 214 24 120 -42 -38 70 47 -176 -136 30 -295 -13 -14 -110 -7
7025 -7 1 41 -259 -11 54 -120 -34 -162 -105 377 -33 -224 -339 -132 -70 -106 123 -39 -90 301 43 -107 208 0
7049 0 -234 97 148 -218 35 -1 271 160 28 47 -207 -107 -81 -292 134 330 -85 16 54 181 -98 192
7071 192 -172 83 -19 -193 81 -24 -106 63 -97 -132 197 51 -32 315 -115 203 -277 -55 -107 -53 125 -63
7093 -63 176 138 165 59 -43 32 113 -17 16 -95 122 38 -68 19 68 -47 211 -233 93 -86 -221 153 -56
7116 -56 -37 -148 122 15 96 -34 125 -8 80 80 -91 -123 -18 1 -6 -64 -114 -12 -20 31 -110 28 259 80 -49
7141 -49 -64 28 79 152 116 195 69 304 206 -65 -38 -200 458 -169 -47 136 162 -116 250 -149 120 66 78 96
7165 96 -108 56 44 -252 2 -156 -89 105 321 196 -61 -225 165 248 -26 81 -299 103 86 225 216 -86
7187 -86 231 22 -134 10 -108 55 -122 -209 -365 -113 20 -28 -68 -93 -59 -195 114 -75 28 -227 163 -152
7209 -152 -109 6 -6 150 278 -269 -251 -92 39 146 23 179 110 -203 72 -135 -10 -62 53 -36 -25 31 -92
7232 -92 -174 -10 -13 -56 -42 71 117 79 -56 -90 6 -123 -224 -70 -31 37 53 -13 20 123 128 -255 -178 -26 101 176
7258 176 -144 -354 -102 -173 -138 -295 -78 -69 233 -130 -51 52 -26 -123 -71 54 259 35 -3 9 213 148 -92 -80
7282 -80 -168 64 55 -121 -148 -70 94 -27 -150 137 164 195 162 114 128 -41 153 -95 -14 -224 125 -126 -8 4
7306 4 -155 -76 -73 -77 346 133 342 151 92 -71 -77 -3 18 136 136 -28 -41 -167 53 271 -162 -72 71 92 -66 -60
7332 -60 -167 -66 222 147 -229 -90 -83 90 81 -50 -156 58 232 -108 58 -35 -39 -13 -47 -134 -112 137 -94 83
7356 83 137 -201 -48 107 209 -102 -115 -195 -33 58 -25 294 -217 -27 46 -246 -44 -167 -48 8 -109 82 212
7379 212 20 24 148 -83 112 68 -151 -319 241 5 96 -27 179 -24 -161 -21 19 39 -103 89 -80 -183
7401 -183 173 29 222 33 20 80 -34 -78 246 231 47 154 24 -101 182 39 21 -206 -160 -100 -368 7
7423 7 22 -253 0 61 -144 -13 204 -133 -65 118 -65 -2 66 115 39 -6 240 301 -78 -21 28 -135 119 40 -97
7448 -97 139 -112 64 -142 207 -217 -70 -123 -42 14 -76 13 152 174 -54 14 -72 -35 106 107 175 -44 -102 77 69
7473 69 54 114 210 228 75 149 -70 61 -75 -69 178 -122 204 -93 -46 -178 -138 91 -216 37 -110 -107 -200 -1
7497 -1 -115 -28 85 51 -167 -155 77 -163 -19 77 -267 -215 329 -182 -69 -249 98 21 61 -261 182 -42 68
7520 68 -40 85 -98 -2 -53 -237 -203 116 80 -142 -126 -74 -99 178 244 104 53 15 212 -86 -159 54 -168 154
7544 154 152 -58 -70 66 121 -57 -100 127 -83 78 -158 195 90 336 -17 -56 71 61 -133 90 -214 107
7566 107 257 118 320 -148 0 -138 63 -5 -145 206 -18 -109 -17 -24 202 43 111 -73 -54 260 74 -39
7588 -39 148 232 -318 81 230 -183 -49 -225 61 54 -118 121 -73 108 -1 320 -61 -7 209 214 -47 -78 -188
7611 -188 -124 87 -71 218 -83 58 286 -300 -182 95 -90 -122 -323 118 -248 205 -23 8 -161 36 150
7632 150 240 -176 42 35 -8 148 155 -262 -33 -198 -218 267 -168 227 22 85 70 -27 -171 110 -219 152 -48
7655 -48 -15 -250 109 -161 -14 -98 144 -44 -1 137 23 -71 9 -58 56 -196 -259 -41 286 -170 -5 -156 -110
7678 -110 335 -119 -10 -83 102 94 -2 -41 160 94 286 67 431 -86 -69 304 -173 -39 -88 20 6 -16 -70 95
7702 95 24 -146 99 -102 181 -21 -35 120 216 -85 -46 -39 -52 5 137 45 206 -47 -18 -19 -35 -157 157 -68 -146
7727 -146 30 -199 -116 -209 46 -45 62 -172 -274 -66 -37 -122 205 246 5 -113 75 -67 -22 90 -109 229
7749 229 210 141 168 -13 -15 125 -51 310 182 -100 -74 216 -28 76 -28 -71 27 125 303 -22 62 -133 168
7772 168 4 110 -8 -110 56 -20 159 113 8 92 37 -82 96 59 139 224 186 54 61 -21 -64 -55 133 -64 51
7797 51 -68 -326 -407 -70 -7 -56 -6 -261 -39 -125 87 35 13 219 19 160 -37 -167 -179 113 240 2 -40
7820 -40 18 -57 -36 56 203 -33 -76 -81 -280 -81 -25 84 101 -497 -10 -22 253 126 -48 -47 -118 -167 30 26 -43 21
7846 21 3 -85 24 -39 89 -33 -48 48 33 -180 -118 -7 -63 79 -248 34 -1 180 -311 223 -332 -11 -163
7869 -163 129 36 15 -200 185 -254 184 66 -284 154 -6 17 20 41 101 163 -66 222 -55 -60 -176 -215 -175 160
7893 160 374 -79 102 80 -173 105 38 136 -173 47 -135 -116 -22 -13 -65 178 -118 94 65 87 -173 -104 55 174
7917 174 19 -110 -52 206 111 47 166 -137 86 -32 24 63 163 -128 39 -224 210 -154 -81 34 45 98 -25
7940 -25 -112 75 -9 38 -12 115 -75 184 184 85 -128 129 -84 -2 114 -37 119 -252 295 -133 -48 -237 -62
7963 -62 13 -47 -117 44 115 -72 74 -143 -121 199 -91 79 -173 150 140 -58 250 -87 53 -97 -18 -265 18
7986 18 114 8 -144 -115 -486 127 75 37 100 131 -55 196 71 35 250 -113 343 -119 65 13 195 -184 62
8009 62 -97 -188 136 29 -291 77 42 109 -155 123 71 217 125 -184 74 -44 -106 -152 236 188 73 -31 -114
8032 -114 87 1 -169 -111 38 -19 107 -40 -199 64 -67 142 -215 128 104 50 -210 -188 -203 -216 112 64 1
8055 1 14 -199 44 -255 240 64 218 21 -14 297 -81 -26 -110 -39 -307 -140 -266 -20 -120 -32 130 105 -34
8078 -34 141 44 -140 -83 258 77 -69 4 -54 148 340 -2 -85 -148 15 -131 -150 241 43 -78 -60 -41 38 -39
8102 -39 -104 232 -38 51 -112 -44 -315 255 -74 83 -43 7 149 62 188 -112 -147 -53 -156 -331 169 -69 -104
8125 -104 -123 318 -9 104 -178 44 200 -28 -169 34 0 100 118 59 -185 -102 -34 45 5 311 -164 24 -20
8148 -20 35 143 10 105 17 -6 128 82 86 176 189 331 -145 -283 -14 -134 130 -28 -126 -179 -14 155 -55 -122
8172 -122 -6 65 -62 -264 -296 -88 -110 200 263 189 248 91 243 -108 -82 -42 -163 -234 118
8191A18
$$ Imaginary data points
##PAGE= N=2
##DATA TABLE= (X++(I..I)), XYDATA
0 0 0 0 0 0 0 0 0 0 0 0 0 0 0 0 0 0 5 -8 8 -8 8 -8 13 -16 16 -21 24 -24 32 -34 40 -47 53 -59 67 -75 85 -94
38 -94 107 -117 133 -146 164 -180 199 -221 244 -269 295 -326 360 -395 437 -479 530 -586 650 -725
58 -725 810 -912 1030 -1178 1362 -1600 1924 -2393 3123 -4455 7656 -33584 5399 76862 19511
73 19511 -58840 -81070 -5552 78659 102715 45709 -17246 -30418 16896 63380 66846 27207
85 27207 -3240 5876 47429 76745 65240 22706 -9499 -9330 12521 24894 14160 -8282 -17747
98 -17747 -6190 13445 16928 -3146 -30806 -43837 -38865 -27892 -23389 -27627 -32680 -28769 -17662
111 -17662 -9330 -11760 -22708 -32699 -33864 -25066 -13518 -6700 -4477 -320 8112 15463 18422 14909
125 14909 7992 3858 6557 13130 19236 23805 26631 29070 30396 29423 24640 16174 8075 4312 4798
140 4798 7412 9563 10398 9311 7350 4276 -1661 -8966 -16278 -20697 -21775 -19795 -16446 -13099 -11740
155 -11740 -11206 -11738 -14159 -17404 -20200 -22199 -21136 -16747 -10782 -4135 1271 4520 6040 5742 4210 2582
171 2582 1669 2429 6080 11012 16154 20455 22856 22301 19692 15971 11826 8647 6374 6194 7396 9611
187 9611 10895 10871 8649 5300 227 -5417 -10119 -12746 -13966 -13264 -11405 -8938 -7828 -7943 -9529 -12526
203 -12526 -15814 -18367 -19233 -18030 -15222 -10803 -5870 -2431 14 768 -9 -1521 -2094 -1703 -563 2852
219 2852 7097 11681 14746 16886 17080 15625 12814 10300 8184 7623 8279 9834 11819 13458 13294 11643
235 11643 8380 3687 -423 -4236 -6324 -6805 -6235 -4705 -3652 -3392 -4605 -6996 -10081 -13197 -15520 -16211
251 -16211 -15522 -13353 -10513 -7321 -5319 -4028 -4066 -4844 -6094 -6939 -6273 -4297 -1793 2021 5417 8174
267 8174 10239 10313 9410 7294 6162 5211 5566 6825 9101 11210 12266 12603 11383 9089 5772 2704 60
284 60 -1120 -1318 -507 313 1274 1155 -237 -2785 -5477 -8078 -10533 -11524 -10573 -9077 -7323 -5219 -3968
301 -3968 -3078 -4267 -5420 -6853 -7588 -7322 -5847 -3164 -486 2270 4457 5505 5628 4769 3464 2510 2357
318 2357 3005 4273 6336 8200 9269 9497 8763 7090 4648 1970 475 15 -168 703 1871 2260 2075
335 2075 909 -1220 -3891 -5826 -7724 -8596 -7873 -6495 -5175 -3515 -2603 -2844 -3708 -4974 -5964 -6569 -6174
352 -6174 -5143 -2933 -644 1378 3361 3930 3751 3268 2301 1718 1649 2785 3662 5745 7556 8429 8345 7554
370 7554 6187 4141 2449 1200 812 1288 2210 3036 3117 2752 1514 -364 -2601 -4656 -6092 -6445 -6288
387 -6288 -5528 -4107 -3651 -2975 -3380 -4627 -5456 -6763 -7172 -6857 -5820 -4107 -2344 -268 1133 1590 1537 787
405 787 110 68 519 1284 3007 4480 6044 7094 7292 6749 5662 4486 3222 2442 2833 2865 3925 4611
423 4611 4863 4309 3426 1528 -459 -1790 -3114 -3478 -3407 -2846 -1992 -1755 -1657 -2466 -3491 -4774 -5904 -6552
441 -6552 -6281 -5498 -4203 -2558 -1679 -621 -225 -749 -1579 -2197 -1927 -1775 -833 889 2505 3809 4754 4869
459 4869 4243 3533 2485 1758 1643 2162 2578 3505 4333 4630 4104 3257 1978 425 -671 -1412 -1367 -1301 -684
478 -684 -210 -45 -39 -1151 -2020 -3112 -4159 -4467 -4474 -3873 -2829 -1748 -865 -646 -553 -1069 -1598 -2311 -2521 -1971
498 -1971 -1104 281 1755 2799 2888 2937 2892 1963 1633 1261 1047 1596 2282 3063 3654 3612 3490 3066 1630 528
518 528 -283 -1085 -1119 -705 -231 63 -101 -87 -1162 -1803 -2847 -3771 -3962 -3966 -3415 -2657 -1840 -1164 -427 -1166 -1670
539 -1670 -1831 -2271 -2569 -1808 -924 -260 1265 2090 2525 2463 2322 1831 1088 1064 1069 1675 2565 3324 3873 4098 3722
560 3722 3006 2177 1196 444 100 2 323 723 1134 1088 453 -266 -1328 -2318 -2960 -3246 -3426 -2764 -2375 -1969
580 -1969 -1357 -1493 -1726 -2226 -2813 -3056 -2707 -2632 -2008 -833 -256 505 1045 1220 879 535 349 24 316 1227
600 1227 1785 2643 2959 3455 3193 2796 1991 1394 1005 743 1010 1088 1956 1954 1775 1570 840 -126 -1059 -1429 -1926
621 -1926 -1654 -1529 -1029 -819 -557 -947 -1215 -1674 -2605 -2615 -2736 -2552 -1938 -1297 -593 -88 187 94 -52 -776 -737
642 -737 -555 -113 232 1065 1888 2176 2455 2198 2058 1288 870 544 612 1109 1132 1298 1710 1887 1398 709 -17
663 -17 -753 -1202 -995 -1274 -839 -418 -245 -6 -307 -704 -1339 -1832 -2066 -2170 -1718 -970 -895 -1 -226 -52 -159
684 -159 -335 -550 -613 -544 -126 306 889 1535 1930 1899 1807 1417 1069 701 689 690 1002 1266 1432 1870 1470 1343 526
707 526 143 -457 -784 -685 -596 -367 -299 -84 -220 -621 -949 -1603 -1889 -1913 -2188 -2124 -1129 -1010 -625 -496 -430 -449 -823
730 -823 -1025 -1133 -929 -403 27 338 889 1530 1593 1474 1046 780 781 868 724 1457 1454 1656 1752 1865 1737 1233 672
753 672 174 -134 -226 138 -77 118 207 47 -60 -651 -1014 -1393 -1759 -1701 -1688 -1219 -944 -872 -681 -759 -827 -1385 -1652
776 -1652 -1391 -1205 -988 -404 -30 267 456 536 632 338 383 45 166 409 886 1189 1425 1855 1681 1290 796
797 796 449 377 313 485 490 669 895 1027 549 295 -164 -339 -780 -1002 -984 -996 -772 -509 -427 -713 -390 -654 -1070
820 -1070 -1053 -1394 -1119 -1055 -532 -228 117 350 164 7 7 -224 -522 -313 38 592 682 1026 1155 1160 991 606
842 606 282 122 309 104 330 808 484 704 530 485 229 -429 -550 -880 -755 -726 -430 -115 -201 -228 -560 -697
864 -697 -1215 -1290 -924 -1115 -584 -401 6 -93 181 167 -25 -16 -345 -166 86 323 688 1065 898 1060 1195 843
886 843 399 607 416 312 533 682 726 818 743 776 509 248 -263 -540 -527 -797 -415 -293 -239 -428 -234 -539
908 -539 -763 -1214 -1255 -1057 -1100 -940 -766 -628 -449 -461 -426 -474 -299 -649 -498 -315 -189 -77 242 793 850 780 533
931 533 448 637 468 564 774 913 950 1106 1110 891 732 260 138 2 -388 -95 28 4 52 9 42 -312 -625
954 -625 -501 -875 -862 -931 -464 -348 -313 -390 -341 -696 -475 -760 -855 -809 -518 -297 -277 290 539 421 216 229 254 196
978 196 386 11 478 466 837 525 591 376 620 393 204 255 203 155 -18 188 366 322 6 166 -350 -508
1000 -508 -353 -471 -560 -764 -345 -102 -212 7 -435 -317 -645 -650 -631 -345 -390 -142 1 296 401 260 50 -188
1022 -188 -21 70 180 332 643 508 795 608 679 378 378 260 459 -102 94 43 175 380 436 -78 -25 -354
1044 -354 -151 -249 -546 -271 -208 -277 -160 -103 -576 -277 -644 -625 -458 -504 -233 -409 -94 -96 96 18 158 -60 38
1067 38 4 -87 139 390 696 409 772 679 553 271 160 113 270 106 351 670 814 385 664 246 228 -1
1089 -1 -217 -256 -193 -368 -441 -409 -211 -327 -399 -415 -478 -830 -666 -449 -398 -47 -113 -183 73 97 -247 -403 -488 -111 234
1114 234 -369 -73 368 261 506 325 341 419 262 181 256 368 468 489 673 305 557 580 659 375 103 0
1136 0 91 -210 111 224 -93 -144 70 -107 -542 -358 -427 -382 -128 -149 -36 74 -72 -116 -188 -354 -132 -295 -217
1159 -217 94 -9 -23 321 444 335 268 156 126 -31 -39 110 198 394 218 172 200 41 419 -89 -72 -18 -173
1182 -173 70 319 103 225 -17 28 -363 -339 -131 -484 -234 -539 -142 -414 31 -254 -85 -191 -206 -225 94
1203 94 -298 -50 254 205 384 234 136 327 30 42 195 -67 222 306 288 513 462 339 243 41 114 18 36 134
1227 134 154 -52 -54 -90 26 -99 -135 -299 -223 -435 -323 -362 -29 -121 -74 -104 -12 -60 -215 -394 -433 -176 -198 157 -44
1252 -44 308 336 99 -155 166 212 -112 205 257 575 337 563 484 401 188 192 -64 -246 -175 37 271 203 219 147
1276 147 -307 224 88 -53 -102 -21 -89 -13 -289 -121 -4 -436 -321 -190 -273 -267 52 -240 -110 -422 -97 24
1298 24 64 158 -350 -75 68 -80 -63 -5 221 374 262 86 -20 -58 58 244 -21 75 213 178 155 151 192 -68
1322 -68 97 -75 354 -13 -143 63 -121 -25 -120 -34 21 -79 137 -158 -161 -153 -99 -396 -106 -355 67 -30 -139 132
1346 132 -295 204 -100 95 147 285 65 31 235 133 131 -175 61 24 254 -38 119 235 336 139 112 137
1368 137 133 -286 203 -129 -328 81 -21 37 -32 -92 -386 20 -148 -554 -110 65 -303 -12 -6 85 -169 96 -198
1391 -198 -133 27 -249 174 418 102 -32 101 221 322 -37 82 -107 245 406 358 341 96 139 213 112 -120
1413 -120 -98 -107 -82 -178 -22 129 145 -18 55 -252 -111 -193 -163 -138 -238 -399 -338 -107 166 -185 -203 -14 -192 59
1437 59 16 -170 -177 -128 -264 -197 231 180 -31 99 -153 -131 214 24 46 140 405 144 122 381 89 60 -25 117
1461 117 -110 114 124 221 65 -7 -60 127 254 -269 -173 -312 -56 -96 55 -163 315 -94 -49 57 -65 126
1483 126 -13 0 -91 -64 0 23 -120 79 -15 -95 81 60 164 306 228 -21 -149 89 160 -13 71 -242 -17 -30
1507 -30 -175 -90 107 3 -201 31 5 -133 -233 -212 -3 251 132 19 179 182 -143 42 79 0 -179 -92 -187
1530 -187 -90 119 250 -41 -21 77 103 56 212 -70 18 -100 388 155 14 -271 171 94 274 -207 -87 28
1552 28 322 121 127 58 57 190 -11 49 -77 3 72 42 56 60 -118 -299 -191 -26 -128 -166 -165 110 84 -294 -48 101
1578 101 -175 68 98 -9 -137 -98 -25 135 -42 103 76 139 226 172 187 182 -71 62 59 180 82 239 11 23 -284
1603 -284 -71 -60 166 179 -177 -5 163 22 -33 -170 58 -1 -27 53 -64 -98 115 -75 -136 -215 -166 -409 -21
1626 -21 -124 -80 135 -52 33 -310 141 77 -169 -213 -126 218 2 -45 -172 95 186 192 28 -133 138 73 -202 -10
1650 -10 -64 -130 124 132 -80 291 117 -98 148 -269 -55 -182 43 12 83 -111 94 89 -245 2 -11 -249 -78
1673 -78 133 -16 -230 -124 201 47 58 66 -8 -111 62 -63 93 64 134 101 -117 -37 -131 90 -132 -55 158 -224
1697 -224 -56 61 -145 6 26 163 94 -38 -287 -70 -26 -67 -252 -90 -229 106 -188 20 -91 -40 68 58
1719 58 252 26 -62 244 5 75 61 128 43 -40 45 83 226 65 54 217 176 23 43 -186 173 112 94 -96 53
1744 53 -26 22 -5 83 147 46 7 -120 -351 151 -13 -10 86 118 -86 -116 89 -41 88 -134 57 91 146 -57 293
1769 293 215 123 -300 -5 -218 -131 596 311 0 134 156 210 218 16 13 -50 60 125 197 248 -159 -174 14 158 61
1794 61 34 -144 -214 176 -33 -86 -4 239 -75 -12 -96 -173 -271 -298 119 -172 110 42 -38 280 -1 -38 -152 -106 -195
1819 -195 -22 -20 -78 -193 48 250 -199 -243 -138 -100 179 222 -16 232 -303 -83 -177 -161 134 -53 124 115 175 214
1843 214 277 -206 -16 -27 -1 -258 -59 -149 -98 -213 -64 -23 -299 -100 166 -29 -140 73 110 -47 -96 112 -21
1866 -21 113 -188 330 320 -6 89 115 188 -125 -124 -205 57 65 97 190 -47 15 0 -221 123 241 -40 -64 284 -406
1891 -406 12 146 143 44 -20 -93 -141 136 -125 62 100 -161 -204 -118 -13 -274 68 -176 47 163 -155 -48 -82
1914 -82 -29 150 -13 -258 172 58 -161 -110 143 -78 -266 -5 73 -6 174 -89 103 -102 -98 149 -305 -80
1936 -80 312 270 56 -67 -77 25 -156 -65 -50 -134 -89 -307 -131 -125 36 -215 -59 -33 107 -10 101 -179 164
1959 164 167 -15 -221 122 15 136 38 -86 194 118 90 -38 31 137 -7 -76 -235 -86 178 -14 131 128 1
1982 1 118 -148 58 8 -19 -20 -5 -12 11 -37 0 -140 -147 -187 194 -178 221 -30 -26 -82 29 -184 95 51 4 174 -77
2009 -77 101 161 149 146 35 -177 112 -40 44 134 103 292 55 -12 -203 64 57 108 225 -213 112 -3 211 171
2033 171 -66 -70 103 146 -75 -90 79 28 -157 27 -11 60 67 -120 223 135 106 -63 10 30 85 -98 18 -22 26
2058 26 223 362 186 -26 4 -46 78 46 -9 30 79 7 67 -147 3 -185 -93 84 -68 -268 -264 28 11 -296
2082 -296 97 -147 34 350 -238 -158 39 56 58 -237 -157 58 -70 85 129 -89 129 -224 86 298 203 -298
2104 -298 -3 -39 47 -86 -136 -227 -64 116 -76 100 -51 1 34 113 -231 48 -110 59 -22 191 48 -123 -178
2127 -178 -12 -3 -126 70 211 -312 97 62 -313 -200 -36 -6 254 115 -110 -163 140 -112 110 167 -204 26
2149 26 -107 -45 -98 -297 4 -159 422 -118 -108 -63 208 58 -2 -90 131 56 -57 76 -117 0 -27 81 184
2172 184 -284 -183 50 -206 158 121 -144 -105 81 121 -266 52 -102 127 69 68 -33 81 255 -26 -185 -197
2194 -197 169 -102 -22 231 -120 -12 -45 68 145 -197 -77 12 383 -50 16 -141 244 112 162 22 -121 -18
2216 -18 49 1 -52 77 -48 130 -141 -264 -133 -29 -138 38 -1 -11 5 44 35 44 60 -199 114 363 37 -59 -18
2241 -18 85 -208 196 51 -24 -76 -115 246 -83 -34 50 290 -7 49 201 52 -62 -110 53 116 -91 43 -181
2264 -181 81 -160 88 264 91 42 -3 167 -74 403 -123 -24 122 95 199 81 -94 -242 -91 -90 134 54
2286 54 5 -49 22 -105 -44 -22 -76 -7 63 -95 108 -14 -229 64 -109 -35 130 -194 130 176 -98 -36 124 -148
2310 -148 -147 -132 -69 -183 16 21 -181 256 -116 213 135 10 166 104 75 64 70 -21 115 111 -101 -184 -29 -156 167
2335 167 -147 -197 80 122 -193 10 222 103 43 -101 -149 -68 -137 10 -75 88 179 165 -30 153 -35 -37 -88 -24
2359 -24 -67 1 19 -44 -246 107 -277 56 22 225 -167 -181 254 82 -117 119 209 208 288 85 -292 -233 223 33
2383 33 74 112 -34 -84 -227 7 114 6 252 119 126 -98 -252 195 229 -155 -3 170 175 67 190 -19 -40
2406 -40 -5 -6 89 -9 83 207 -141 50 -92 -181 71 60 70 -13 3 91 -91 246 143 53 96 -120 -12 32 -169
2431 -169 16 12 87 -103 96 -69 -53 -64 17 87 8 74 -5 -172 166 -125 179 -59 6 -240 -28 4 -27 -67 -333
2456 -333 307 -95 289 40 -115 174 145 -209 125 69 133 -114 -254 26 -58 13 -192 125 179 -48 111 -223
2478 -223 166 -261 -71 -241 -107 -98 -52 145 -151 132 -26 -30 -212 240 38 -25 23 10 -238 -19 4 31 -363
2501 -363 -3 88 -172 156 33 -316 35 -1 -148 148 -237 166 162 112 80 92 -9 -60 -32 47 43 86 -22 -190
2525 -190 -105 162 -18 -88 28 -149 78 -2 -222 96 -138 259 -12 -27 8 89 131 54 15 -41 -9 -78 143 232
2549 232 116 38 -81 261 -178 97 121 -87 159 102 100 28 -33 -35 62 -102 -169 -312 -95 -166 326 189 -91 -172
2573 -172 -25 -42 -23 -59 -146 19 -377 324 -49 93 24 -69 -20 -202 145 -113 231 -16 -407 -103 38 -21 -34
2596 -34 -167 53 -5 -71 63 -38 26 -100 -13 -312 -74 85 -25 -68 87 72 93 44 152 -199 48 147 16
2619 16 -82 -78 165 42 128 165 -149 -9 -137 254 -61 7 -65 110 82 166 128 53 169 156 -272 15 170 -146
2643 -146 268 21 91 -21 -24 188 -53 -114 273 114 119 -135 -298 94 207 166 139 277 78 238 -168 -49 301
2666 301 -45 -15 145 32 248 -99 71 30 60 69 -165 127 107 1 -15 136 -89 -175 67 99 20 -24 145 -7
2690 -7 -345 231 185 309 112 -131 85 19 -21 175 28 -73 26 181 80 23 5 85 26 143 25 49 226 51
2714 51 -403 183 -93 -102 109 -51 114 -220 121 14 74 -218 -47 197 109 323 45 76 29 -181 39 -58 108
2737 108 226 81 -67 16 11 -147 -128 -168 -109 -80 209 59 -39 -3 -109 24 -90 -162 85 -194 312 -15 31 -150
2761 -150 37 -111 16 167 88 48 -13 -239 -252 -118 22 -90 -355 162 43 -148 5 318 99 -166 -90 1
2783 1 56 107 -79 85 -81 -94 208 -52 -164 -73 45 -120 38 8 188 -14 -13 -48 -182 -104 100 -51 285 119
2807 119 -159 -3 28 -172 -29 106 23 -46 36 -35 -122 -42 95 30 -90 -115 305 -88 -91 -26 -18 138 11 -172 142
2832 142 -180 -189 61 -157 91 -195 -94 199 56 142 37 153 -74 43 133 -146 330 157 49 -128 -3
2853 -3 244 -241 45 -123 -11 151 70 -34 108 14 -42 -211 -225 -37 117 -203 314 155 -123 -28 257 117
2875 117 -120 28 154 -18 80 6 41 41 -112 28 -176 -134 -19 -11 -197 -3 168 -1 195 -273 -146 59 38
2898 38 13 -102 -105 69 -113 -53 -85 -105 145 57 181 -163 -57 -92 -355 -213 171 -84 91 -44 66 88 129 79
2922 79 -42 26 124 -97 -1 126 11 -359 -270 36 -29 67 -81 218 -88 157 -130 -97 148 -111 21 -34 -65
2945 -65 -201 323 -241 -104 -37 151 -60 -155 218 -57 -136 -148 223 -188 115 25 -187 -50 88 245 -71 -207
2967 -207 -21 -315 138 104 127 -44 297 -113 66 -4 -174 138 -22 -176 53 12 -225 141 52 -45 31 76 -160
2990 -160 45 -145 16 -19 92 18 78 -40 -75 39 92 -104 -1 45 -124 314 150 314 29 -44 -267 -54
3012 -54 124 164 -133 -75 -109 66 45 -33 -31 216 76 112 133 262 111 -73 -119 134 199 144 109 152 -15 -67 159
3037 159 -189 110 -245 -124 -204 -23 124 81 41 105 137 -84 -29 -67 -215 -227 63 16 -142 230 -111 -1 -107
3060 -107 65 157 -66 -240 43 -76 -215 -77 -42 39 -245 17 76 -92 -39 174 -121 50 44 40 408 132 77
3083 77 -132 -19 151 -207 -16 -17 -187 -2 -105 -99 159 -138 127 -16 54 -71 -8 -51 -165 31 -69 -37 -17
3106 -17 -82 -26 263 -109 30 39 -160 -32 -100 242 -79 -133 14 83 -50 -117 42 19 103 143 399 126 -46 -43 -57
3131 -57 211 209 -20 46 89 -227 103 -63 -12 121 208 -144 -180 -11 -223 25 105 -40 -67 -85 127 -10 145 185
3155 185 109 179 -86 -45 -44 6 -418 -233 338 46 -161 -58 -39 -305 396 -81 -116 -169 -6 -60 34 208 -18 131
3179 131 126 44 -70 -120 -24 -101 -26 109 291 -90 79 158 169 63 -1 58 -188 -100 -30 171 152 -12 65 -53 27
3204 27 15 133 119 -56 -62 302 -134 15 330 -67 373 -135 168 1 12 -31 189 114 4 57 67 -169 -87 156
3228 156 3 46 115 95 184 33 -27 -93 162 156 108 -129 -98 164 7 -176 43 -94 -16 -178 -51 124 -190 -259
3252 -259 -249 127 -4 1 -28 285 -189 -141 86 -149 17 -11 -94 -186 250 -253 -226 -135 -67 -19 -103 -24 165 -21 38
3277 38 -161 -233 14 -21 -198 -95 -72 -18 99 6 -4 -110 81 64 74 -203 -73 -33 -63 -132 -42 -195 279 41
3301 41 236 -38 23 119 -370 -103 41 7 -63 -4 -136 -143 345 -218 55 -364 -16 4 58 -130 -155 412 43 -17
3325 -17 56 97 -13 169 35 53 -201 48 61 93 159 195 -137 54 235 204 106 -97 124 276 243 214 -95 21
3349 21 83 -148 202 28 86 116 -83 -42 -142 195 -43 -75 52 61 -32 -45 34 -194 -116 -32 138 14 34 227 19
3374 19 -82 82 289 168 -243 -51 5 -271 -211 41 -36 -52 11 244 144 84 -112 -51 -89 -134 7 30 -83 -5
3398 -5 103 146 15 -171 116 -71 37 -74 44 81 243 -176 -59 -9 103 171 -34 -115 -46 100 -22 -174 14
3421 14 55 35 -159 124 31 -23 133 154 -176 -298 -37 -98 -199 -130 51 191 192 29 2 3 -13 372 222 -190 -104
3446 -104 287 54 -236 179 -38 -250 -131 -53 30 -175 -87 157 162 -10 -39 -387 40 -45 -159 -249 -172 289 -84
3469 -84 119 -1 -244 -142 -9 -61 31 114 -55 -191 80 -72 44 70 -220 55 108 -31 -221 -71 -42 -151
3491 -151 -8 -16 -98 192 -64 163 -208 118 -14 60 75 -57 80 -4 120 68 -136 -69 33 2 -95 143 5
3514 5 194 207 -141 -217 26 -220 118 -65 -134 126 156 17 -310 167 -44 111 -201 189 160 170 -57 55 125
3537 125 -57 67 109 70 -27 30 -76 68 -104 -333 -89 -102 233 75 117 -173 -192 60 -76 362 -55 82
3559 82 42 -65 207 334 62 -90 73 154 100 -2 1 17 179 89 167 80 98 -86 -84 72 131 71 174 -147 60
3584 60 123 -58 -53 192 57 -309 -117 133 153 -89 -95 232 -245 -49 11 118 102 174 -125 5 -59 -227 -21 -150
3608 -150 -124 108 -16 66 67 229 31 150 -44 -98 33 10 61 -25 -139 -114 -90 19 130 -28 124 170 208 269
3632 269 -165 211 103 -269 147 49 41 -28 -124 178 -238 270 -55 28 -222 -94 16 122 68 -162 -160 68 171
3655 171 -37 -32 9 -326 -140 199 -8 99 -70 23 151 -39 185 -69 -27 -37 156 -45 -195 266 120 247
3677 247 -80 -4 51 48 2 -324 115 -80 193 -42 23 98 36 -59 34 240 -38 22 14 -174 -134 189 -13 308 10
3702 10 -73 -130 40 145 -63 127 30 -31 88 116 150 -274 -186 1 -71 103 107 37 28 214 -164 -159 120 -96 57
3727 57 161 -9 146 -134 59 -22 33 -55 -27 192 60 33 -114 -47 34 -5 -232 -124 86 -84 324 -276 68
3750 68 -200 -154 -153 20 89 -213 -113 -3 26 -127 63 30 -184 -102 -160 32 -71 -14 246 -75 289 -31 -15 -213
3774 -213 143 -35 -26 -174 16 49 -108 6 -91 -217 98 92 -239 102 208 -227 33 -180 -81 -76 -103 -32 10 -130
3798 -130 -11 -46 -268 95 -158 -47 -114 -29 -73 199 83 86 130 134 -159 -16 87 49 -45 15 34 225 111 -26
3822 -26 -282 -42 86 -209 -22 -278 34 45 82 294 -50 -93 132 -86 223 40 -252 -138 167 -10 -51 66
3844 66 -20 -89 -310 -342 116 -172 -229 -46 -215 -32 293 55 90 1 80 -88 -20 165 -237 -107 -315 93 204
3867 204 117 284 -98 -71 -211 -101 -38 -136 -83 106 162 -26 23 -39 5 -107 -7 -27 -34 -193 6 -70 109 163 -85
3892 -85 -71 120 -270 -276 -153 -150 85 22 -80 -205 67 -138 -195 -131 63 -26 2 -350 70 302 -6 -43 120 57
3916 57 -144 -143 86 -163 122 72 112 -9 -146 -128 202 -79 -6 -54 -5 306 -68 -58 150 -35 -4 204 77 -21
3940 -21 -34 -37 -49 -127 277 22 -128 7 48 61 45 101 -109 62 110 44 -266 120 15 46 86 -169 40 209 120
3965 120 -31 -23 -104 -198 61 56 154 4 -16 89 139 250 -210 -79 98 8 -62 92 -46 -124 -146 -46 176 -106
3989 -106 -24 -52 -94 24 -55 -256 70 114 78 96 95 172 42 -73 197 55 48 116 10 -32 165 74 109 -105 -142 125
4015 125 -77 -137 158 -44 6 -194 -132 198 33 367 -198 27 27 97 58 -29 51 203 -73 201 -125 -229 -153
4038 -153 -113 -79 -33 8 -202 -7 -42 124 21 176 65 40 58 -26 -6 -180 94 167 39 87 90 143 -98 -15 -201
4063 -201 -40 72 -34 218 -222 47 -50 52 44 -26 -101 104 -22 -77 375 163 -10 121 144 183 -48 -134 108
4086 108 -192 257 -170 -37 -43 373 -21 -248 226 36 -102 129 255 107 -14 138 136 -263 34 -73 163
4107 163 -147 -51 78 176 -214 -8 61 45 204 -75 123 -12 224 -95 -109 -31 -122 299 -230 -273 -85 -273 -85
4130 -85 -294 -163 142 -50 -18 277 -27 27 69 -75 125 107 170 -34 -17 196 270 17 -13 249 295 18 40 64
4154 64 137 28 33 147 -404 -82 -190 206 -98 128 -95 36 50 391 59 -83 76 33 -128 -30 193 417
4176 417 181 -20 174 46 17 35 -12 -61 -45 -253 -219 66 -70 -74 128 -204 10 210 -8 266 64 -134 20
4199 20 -25 61 -159 -197 -163 90 -64 100 87 -165 26 80 -47 255 233 23 -50 386 65 -146 311 -232 88
4222 88 -49 41 -143 28 253 246 62 209 -172 -105 160 30 30 156 177 -80 227 218 -26 -4 -32 -49 -160 -54
4246 -54 24 -7 -266 -57 -174 50 -110 -103 -52 35 -51 -106 -138 75 -300 23 63 168 -97 -85 237 -389 141 -108
4270 -108 134 11 -133 26 69 -14 -213 7 89 4 -109 -122 68 -129 -17 124 -182 -152 64 -165 -71 -90 -3
4293 -3 -59 38 -94 47 48 -65 156 109 26 18 8 -109 201 -178 119 123 42 -70 33 -150 -76 -75 -85 70 -196 -103
4319 -103 196 -210 -147 -91 -56 -69 -94 241 48 -52 224 -96 -118 134 35 55 -78 115 -28 10 2 -48 -39 19 -125
4344 -125 76 98 49 -29 -50 -11 -210 -54 94 186 -145 -103 -36 -187 14 -192 40 34 -70 73 -113 -190 -14 -161
4368 -161 50 24 38 -53 56 -8 -102 108 280 -203 96 -24 186 44 365 85 -57 -67 141 90 -164 -212 -102
4391 -102 60 -187 -49 -107 107 -93 9 -119 -47 138 126 -17 -124 136 -377 -61 119 -86 24 59 82 90
4413 90 46 70 73 126 -54 71 129 -191 98 -248 -43 -72 171 -14 -155 -11 163 6 -50 -94 -9 -90 -77 33
4437 33 171 -60 267 -249 -53 45 -84 265 -55 -104 -71 -89 55 84 -178 -79 -119 95 -30 69 -62 -68 58 88
4461 88 181 -6 -247 -18 -117 -217 -2 -286 7 -59 59 93 -135 70 -81 226 -139 -22 -116 -90 -173 12 127
4484 127 234 174 -214 11 71 -24 109 -66 -152 148 -22 46 133 155 -78 -137 -249 -127 -27 -239 -108 271 -23
4507 -23 -101 41 18 -144 -123 262 -205 11 -165 206 -212 18 80 -303 135 -240 211 216 -3 175 133 -226 54
4530 54 41 101 -195 305 -174 144 194 -46 220 -46 -60 -4 -64 -99 -65 -123 62 -172 81 252 -237 -132 158
4553 158 -235 86 43 -98 207 -42 -2 -50 -142 189 -154 226 -227 112 -295 -97 -342 26 -105 137 35
4574 35 41 -23 -24 -117 -113 -12 49 215 285 -45 233 53 -81 -19 4 225 44 -240 -194 -312 -64 238 -84 281 -247
4599 -247 -153 -95 215 3 -195 47 -36 127 3 -21 169 -41 -169 65 -113 -45 216 -73 -51 -251 -184 89
4621 89 -16 233 44 167 81 -87 -90 -5 -24 16 -24 130 156 -102 -14 -45 64 70 -39 83 138 -80 -69 51 -8
4646 -8 -208 174 253 38 -147 -173 -4 -141 66 -108 217 -220 -160 175 117 -142 -19 4 -191 -206 -13 180 -88
4669 -88 -156 77 304 -191 -266 206 -214 -83 -163 19 9 74 -4 -9 73 -69 -4 146 -82 -153 -91 -95 329 -86 20
4694 20 -194 -61 411 83 -95 44 59 -173 -256 -75 71 3 298 75 -157 56 75 -131 99 9 91 -14
4716 -14 2 -67 -20 -136 80 8 61 107 106 22 -82 -20 -25 -52 -56 -3 -97 152 30 -134 332 -53 5 41 39 -37 -184 -117
4744 -117 -39 -280 179 41 -58 -28 89 -187 6 -213 -87 105 -165 183 171 -59 -47 34 -40 108 123 -324 97
4767 97 193 -135 -49 28 -92 -131 42 -193 -55 -99 45 -79 -109 60 19 121 56 375 -69 16 319 59 155 -63
4791 -63 -165 -197 64 -27 80 -125 72 -193 146 65 43 113 -151 -422 97 62 79 95 114 84 197 -185 -177 -262 -36
4816 -36 134 40 146 159 -86 7 -216 179 -264 -342 -129 72 -222 90 -126 -113 282 -124 -151 71 26 -22 124
4839 124 35 31 -148 46 -72 97 -125 71 -136 9 -307 -79 -94 -155 -56 82 -57 43 -391 161 44 57
4861 57 -195 253 142 -93 -149 -146 -72 -68 -106 74 166 -79 -45 51 307 34 -42 175 196 259 -36 80 -9 235 49
4886 49 -129 46 -98 61 -103 312 -94 61 98 101 37 -134 86 251 -6 -68 -36 213 137 -62 -36 -103 -10 77
4910 77 121 -129 -102 -48 -212 108 -191 -137 -146 -104 -128 208 286 -103 192 -17 94 103 -124 -115 290 171 5 -66 -211
4935 -211 135 -186 -86 126 41 78 -97 -59 50 -32 -30 144 7 -157 -24 -184 -17 159 -159 123 -246 44
4957 44 -27 185 -18 -156 303 -92 261 147 50 8 137 63 -138 -5 82 -286 -172 77 248 82 -164 -66
4979 -66 158 -30 -60 -228 212 45 -171 318 -28 -84 -18 118 -131 -10 318 -55 -43 -45 67 -70 82 65 -180
5002 -180 -159 -336 -78 74 106 -27 37 204 -30 -15 232 43 -63 -22 15 -42 32 48 -172 313 -17 -133 88
5025 88 -148 82 -350 -32 -5 157 67 -81 98 -42 35 133 -36 -49 36 217 -182 1 -16 136 -121 80 -154
5048 -154 125 65 -89 31 -116 83 36 35 -29 231 128 -62 93 84 3 -80 -42 -28 -60 -50 -326 8 -3 -148 -58
5073 -58 37 10 -98 86 -135 193 4 186 -136 85 180 -79 -16 10 -38 -310 163 -96 -90 65 -6 -56 150 -66
5097 -66 -171 -104 -28 -87 -115 -53 115 -135 180 -84 -62 -17 127 -115 -131 207 -102 295 -280 233 115 -23 57
5120 57 -146 -113 77 -116 -129 72 -129 66 -257 173 -4 -211 -24 200 -118 232 -375 12 -86 242 125
5141 125 -119 -17 -156 441 4 -71 -5 148 55 40 -5 -159 -199 -58 82 -58 27 24 394 -25 -11 1 -41 201
5165 201 119 3 -221 273 -51 94 153 -106 147 -178 -31 -24 -99 -146 3 -179 129 -111 -1 82 174 348 155
5188 155 164 180 -79 15 -119 59 -73 214 217 50 -37 -216 -145 39 -1 -124 -151 -32 26 42 48 19 -203 -82 19
5213 19 -32 -219 -3 93 26 113 66 66 61 154 -85 -34 18 177 -163 -2 149 -53 -187 -217 213 -14 -133 19 15
5238 15 193 26 -86 148 25 -62 190 212 84 -83 -39 -109 221 58 -89 51 352 76 -172 39 -110 251
5260 251 -59 -109 296 64 -28 -421 257 110 265 78 -197 -285 -10 2 142 27 15 -200 -73 -272 -91 128
5282 128 -15 35 -2 152 -32 -41 71 75 -11 -211 59 413 174 48 -76 -60 -61 216 -69 -337 48 113 221 -4
5306 -4 120 75 114 188 -64 -71 -168 327 170 -108 -179 164 154 146 141 90 3 -214 -238 43 -74 -26 -23 -45 77 -46 83
5333 83 -92 144 -43 61 -115 172 194 -32 70 -269 -120 -45 115 -45 -185 -43 -229 40 -95 -67 71
5354 71 4 46 -98 105 17 176 14 162 236 -152 -86 24 -150 81 -39 7 -112 -179 -11 146 90 237 -174
5377 -174 234 212 -13 7 -53 200 -68 -258 116 73 80 146 164 -68 -131 19 -7 -117 3 221 74 56 -115 161
5401 161 100 170 -195 -193 -149 166 -79 -62 26 -146 90 237 328 -71 -68 -87 -28 253 89 -59 51 -6 21 15 256
5426 256 -101 -266 318 432 259 253 -52 174 110 184 168 158 -103 -172 212 134 -64 10 -52 77 -60 57 -166
5449 -166 55 -2 62 268 1 -130 -132 26 45 93 89 97 -118 121 2 61 -7 -43 30 -110 -96 -44 121 167 98 74
5475 74 13 -334 34 -133 -35 -89 -185 107 102 -89 203 -409 110 328 72 -246 332 183 96 -185 -173 58 118
5498 118 -139 149 -265 -92 3 64 -31 -101 76 -209 105 -251 101 -19 -64 88 -13 49 -30 24 -169 -35 -78
5521 -78 -1 36 97 -271 139 -88 47 97 14 -207 -22 -175 411 170 -40 -18 166 213 -126 -50 -72 9 47 -32
5545 -32 19 124 -93 -101 112 121 -14 -315 -148 15 167 48 140 116 -73 -70 -144 -100 -90 -40 -156 31 -55 -240 42
5570 42 -120 113 -46 128 -115 -38 -132 -38 -97 68 -70 26 140 -13 -28 -156 -107 19 150 -327 64 64 -179
5593 -179 -128 -155 -37 -46 -222 192 106 109 123 -89 -205 -110 132 -294 -21 289 140 116 -149 -29 15 -30 64 -18 -39
5618 -39 -33 211 -73 -199 -109 486 66 26 -142 -123 -137 15 278 98 52 298 -59 -133 228 -107 87 -237 -62
5641 -62 64 97 -42 -39 161 277 -3 234 98 -181 -73 -88 -80 29 -100 43 68 214 250 -85 148 -51 -23
5664 -23 -27 -45 -110 23 122 109 64 -90 -196 5 -25 -57 -10 -11 -76 97 314 -114 58 19 -121 -250 104 77 -197
5689 -197 -60 -101 -7 11 -28 -15 32 -62 210 54 25 -299 -20 -134 -46 -146 -71 119 -179 75 71 28 -216 -7
5713 -7 19 -248 112 -109 -205 48 281 -86 120 74 -318 -28 -201 75 100 207 -159 -33 -122 25 -109 307
5735 307 -33 144 -27 238 74 -303 153 161 162 -58 183 -48 -184 -78 -132 -51 -33 28 157 44 134 -53 -86
5758 -86 -160 17 142 -2 181 106 42 129 50 88 -16 -132 105 -266 -39 -84 -3 -217 64 12 31 13 -7 64 -58
5783 -58 -93 -51 -18 3 -19 -40 -214 -108 -123 60 -71 -176 -64 8 192 -179 111 -191 -83 342 177 -4 155
5806 155 -154 -58 -28 -96 129 335 -162 -156 -99 369 -207 -323 -19 312 -78 -110 -337 121 222 -331 66 -132
5828 -132 13 -239 -66 -174 -182 -88 -151 -63 196 -191 -102 195 -179 -157 363 90 138 -156 -64 -136 147 -35 -238
5851 -238 -166 14 -134 -201 -85 -168 72 156 -24 -289 -84 35 23 128 43 -129 186 252 -29 7 92 21 167
5874 167 80 303 14 -155 -42 -127 174 8 156 35 -47 -14 -106 -186 -77 -198 -164 -27 22 -42 -5 -157 411
5897 411 280 205 -189 29 -36 80 113 119 -103 -394 100 83 -38 258 176 -57 -89 52 -165 169 81 -286 -85
5920 -85 -93 132 65 202 91 -38 -118 -180 -31 124 223 162 -62 -108 58 -36 -38 -24 11 -124 79 -137 102 117 -74
5945 -74 164 104 -254 -122 7 11 -157 -30 229 50 92 -62 183 -24 -41 -4 -146 -152 -65 45 -350 67 -81
5968 -81 86 9 -159 -36 -138 225 -138 -125 38 114 9 -213 -125 182 -183 -43 125 -202 -34 -254 61 -90
5990 -90 -53 -222 -320 -47 182 -110 -76 126 172 1 -87 -125 4 -74 82 -413 116 28 -97 -82 102 -171 -108 -30
6014 -30 -70 33 -34 22 -263 -19 -94 130 -3 14 205 -280 170 -9 -175 -58 104 -30 -284 66 -117 -64
6036 -64 177 143 -127 -58 -152 -380 56 105 -102 221 52 75 112 -165 377 -238 -114 215 86 210 -183 -12
6058 -12 -23 -105 -210 125 -131 60 -65 15 3 14 -73 -14 76 69 -64 255 -8 315 29 -123 -120 -26 -214 86 165
6083 165 36 70 -96 -129 227 49 83 117 -103 95 -76 33 -107 -71 -19 165 48 -99 -31 -93 7 -64 206
6106 206 199 -272 125 -87 19 134 -221 246 86 19 121 -260 386 -79 204 -102 285 162 -118 108 -183
6127 -183 226 56 89 219 -45 -136 192 55 -116 -81 -88 243 -22 38 253 -23 -174 119 194 133 -66 -69 372
6150 372 -85 -67 -23 121 -258 -104 -19 -46 156 -75 133 3 137 171 -28 -272 -173 -33 -9 54 -166 -110 126
6173 126 -316 152 1 -175 -61 -69 -98 540 134 -118 -138 25 132 -161 -243 140 245 -142 -30 -245 -100 -19
6195 -19 -200 -179 215 -75 -24 16 21 -9 -134 -107 49 -137 122 -73 196 -71 -120 -145 115 -189 22 13 -219 20
6219 20 145 21 74 119 79 104 -174 -47 -51 -228 -72 0 -48 170 -279 54 53 125 -84 83 173 -113 -15 19 133
6244 133 -155 -188 -167 -141 345 407 71 -227 -14 35 -237 -29 -48 -38 173 -22 -24 183 95 -76 100 -69 -17 116
6268 116 58 140 -114 198 -414 30 54 28 77 -41 180 -66 -9 -39 87 -281 158 -62 24 225 42 -221 22
6291 22 242 -11 252 -26 55 173 -113 -392 85 111 180 76 103 85 -185 210 -8 -188 79 -113 36 134
6313 134 -179 148 48 73 -91 -5 -50 22 154 -423 -2 269 -152 -142 185 103 -59 -16 191 54 -42 79 240
6336 240 127 -185 79 184 146 -181 153 -41 -148 331 109 21 -113 -82 -151 -228 85 42 218 202 -168 78
6358 78 31 46 -61 4 -82 201 -70 5 29 96 -47 -136 -15 -37 32 -135 57 -177 75 116 311 -9 -233 -217
6382 -217 0 -182 -37 74 131 45 61 239 -8 -142 54 155 -207 118 35 71 -13 -245 -121 40 -42 134
6404 134 108 -179 33 -9 -145 119 251 -218 44 10 -18 34 291 284 -18 -82 -47 -120 -92 163 29 37 -192 -72
6428 -72 90 96 29 125 -163 -129 -122 90 2 129 -9 -169 -324 -224 341 28 164 -148 123 105 305 -18 -38 -263
6452 -263 19 -54 -198 243 -134 106 -106 -177 83 37 116 -33 173 154 40 167 104 -93 230 -21 -75 118
6474 118 123 144 124 -110 9 -77 -33 21 -58 -13 81 22 131 132 -105 189 122 73 253 97 59 -7 101 148 -191 13
6500 13 33 -230 185 -78 75 9 186 -100 -103 27 48 -290 -205 30 -39 -70 -134 -96 -62 -55 271 202 287 16 46 -31
6526 -31 -211 72 120 159 -187 354 -104 26 -246 -147 -369 67 -89 -177 -136 0 124 246 -62 -75 53 -112
6548 -112 173 -56 14 43 -11 22 -129 53 277 -163 -258 -108 -22 -40 -132 -63 -98 -53 77 -3 90 -84 -116 46 -195
6573 -195 -59 145 138 -155 69 -7 -78 74 -83 289 266 -4 -2 -206 16 61 38 58 -60 276 -76 83 17 20
6597 20 -98 -46 -74 -98 -79 -79 -45 -20 -4 8 230 11 -215 -168 -140 -233 52 -169 328 -266 -47 151 -52 -30 -262
6622 -262 17 21 -162 81 60 -167 -128 -9 29 38 -110 -196 -60 129 -206 -190 266 81 -13 281 193 38 7 46
6646 46 104 -30 66 -186 -97 -60 -107 -144 -68 93 -170 132 -30 123 30 -286 -58 -11 193 97 -50 8 -176 -79
6670 -79 117 -137 -11 -12 -44 -72 -130 -29 282 34 -36 -19 -56 -92 -238 -38 128 -55 65 -32 -331 -79 133 -95
6694 -95 270 -19 -40 17 -82 -21 -49 -161 -91 130 -118 -56 179 205 26 322 -4 13 353 -53 -139 -55 -77 -31 13
6719 13 75 194 -22 164 46 -86 -3 25 -58 -26 40 153 34 32 6 53 -181 -114 131 132 69 83 184 -37 -31 58
6745 58 59 304 -158 -63 149 -106 -263 -68 155 93 -69 164 1 -4 309 109 191 -8 240 -153 -158 54 -279
6768 -279 181 -17 -170 -51 189 -5 119 71 57 23 109 -146 273 -213 70 -76 31 234 -127 -180 109 -105
6790 -105 48 -376 -52 293 -113 -117 299 57 139 -177 -269 212 -135 -80 2 200 69 -159 46 175 -305 13
6812 13 106 -31 -77 127 14 -147 -262 347 -98 89 102 91 -159 185 -82 31 22 -124 86 -159 -253 187 -89
6835 -89 -149 10 -117 -16 262 226 117 30 -128 -165 -42 343 -113 -45 95 172 -106 190 62 -82 -8 -107 47
6858 47 257 -142 -219 -147 72 275 138 54 -176 140 122 -222 72 44 168 64 -239 0 -41 5 26 -221 -91
6881 -91 52 -154 -321 -202 38 100 -56 162 259 -82 -124 38 56 -11 117 -9 -38 -129 193 -352 107 22 -43
6904 -43 175 -74 -190 -26 -96 118 -25 -173 69 -180 56 107 28 79 -64 92 141 224 91 46 94 -46 98
6927 98 -37 -28 -173 -344 -69 66 -208 105 192 -20 38 -164 -64 164 9 -130 -135 168 76 3 22 92 146 -119
6951 -119 98 -32 21 89 116 82 72 48 -34 -91 -198 107 89 -112 3 283 -38 -142 125 -87 -91 37 -11 2
6975 2 -1 191 -73 -59 -106 -173 -163 -5 192 40 -280 -2 10 113 7 20 -283 -117 238 -103 -89 -168 85 215
6999 215 136 57 30 130 60 117 84 24 178 -35 63 89 -84 157 24 -131 -103 340 114 -101 -107 -165 115 131 -315
7024 -315 38 225 4 117 -135 -109 -26 -151 202 -49 -147 -57 244 -37 -129 -27 96 107 115 222 -183 181 19
7047 19 -129 109 -45 88 -86 -150 129 -133 -20 -52 -98 55 -249 -194 153 65 135 -62 -78 9 -49 71 126 77
7071 77 225 -142 -190 -23 -36 -91 29 124 80 279 183 235 -128 -22 216 -14 167 19 57 487 116 -46 42
7094 42 97 -232 25 -175 61 61 178 45 -79 89 211 36 284 -19 290 -10 193 3 94 -118 -327 31
7116 31 -113 81 -42 -100 89 15 82 89 185 18 101 304 -88 17 94 68 -169 118 -3 -60 -70 -109 -99 -95 51
7141 51 42 151 -24 293 189 -76 76 -11 181 -143 -298 -33 97 56 12 95 -56 -104 35 -75 -170 27 25 -239
7165 -239 66 -140 -122 -252 115 138 -86 -29 -14 -15 201 33 -54 -112 -84 -20 4 420 139 -125 -88 -139 -49 59 -5
7190 -5 -128 -224 163 98 -182 246 51 46 -25 -60 -1 -317 -39 -230 17 199 -87 -219 -142 202 6 -60 47 -41
7214 -41 -168 -66 -8 -180 -18 -39 -42 -393 77 -161 -111 263 183 -21 -99 -96 52 75 -187 26 -156 151 -228 156
7238 156 134 -124 38 -250 255 -36 68 164 -120 115 207 -86 -71 -168 -201 -92 -275 177 185 59 13 90 55 118
7262 118 2 102 107 -77 -91 111 -22 -46 58 -3 -83 41 -61 -179 -70 -91 -155 110 -104 276 -168 69 441
7285 441 -71 124 64 78 17 -74 18 -114 192 33 144 255 117 -1 -134 -112 -95 71 -101 -9 49 -260 -58
7308 -58 -128 174 -268 120 36 -124 373 2 31 25 -91 36 -35 130 115 -68 20 -84 111 236 114 104 -198
7331 -198 -109 6 -43 77 12 76 -153 113 -58 53 72 -318 102 -135 -140 -1 108 -45 -6 102 -49 115 -127
7354 -127 -175 162 36 -147 4 95 -216 -102 49 29 -52 92 -15 -15 -66 138 8 77 -90 -11 24 156 -59
7377 -59 15 11 155 29 142 89 67 207 64 -6 111 -6 -48 44 17 33 -154 -46 26 71 65 183 -66 384 -93
7402 -93 -211 90 -63 -58 -224 -30 -68 194 -190 -165 -384 -45 -16 72 -195 32 -165 -117 23 134 142 211 -26 -152
7426 -152 153 -15 1 103 -82 -133 -110 -209 -18 71 36 -166 -276 -97 -60 -219 177 -256 222 -133 -23 162
7448 162 -81 17 -43 -121 88 70 -68 -31 33 255 -58 -33 -50 144 -112 210 39 63 -138 -175 -245 -4 108 -55
7472 -55 3 -18 128 -125 -103 221 -151 -235 227 -234 182 -84 187 -103 180 -116 138 -85 -11 72 253 -69
7494 -69 279 7 -39 -21 -143 170 -80 -29 -47 244 113 -116 -23 -127 67 145 -295 -147 77 352 -142 -229 -125
7517 -125 -52 -133 80 -16 77 87 78 -23 -177 -65 -93 23 21 8 -242 184 92 225 162 -7 -272 -98 51 265
7541 265 -25 -68 -8 -83 -1 154 30 168 -209 9 -79 -233 38 106 -131 -29 86 -100 -155 -2 -103 -151 125
7564 125 -164 -135 -167 -134 -74 54 -77 -72 96 -9 -328 -186 -108 86 -137 -70 -92 2 -336 -21 -88 -66 -174 8
7588 8 -139 8 -12 -112 111 152 -43 15 -25 120 -34 -87 178 -161 60 152 139 -99 220 160 13 -41 -25 120
7612 120 -169 -73 -131 23 -233 14 -78 184 15 -21 47 -120 -154 -251 57 117 144 -146 -162 -174 122 36 -158 42
7636 42 26 -194 39 -306 -86 43 43 74 388 -313 5 120 -45 -35 257 -236 -49 -122 188 49 -190 186
7658 186 111 -265 -470 89 212 75 -34 29 101 -138 -144 -18 -91 92 166 139 107 94 -23 -113 -88 -107 264 -173
7682 -173 -105 -131 -35 -248 136 418 -287 16 -79 -92 -109 93 -129 -229 -131 227 -211 283 -26 119 -24 -93 -91
7705 -91 36 153 171 45 171 -114 -11 376 69 -219 37 -42 4 218 -139 134 28 285 69 311 -48
7726 -48 145 212 155 22 309 -6 -139 -71 -181 14 184 351 91 -282 124 -18 -27 32 -327 211 199 108 -8
7749 -8 -127 -41 229 -104 27 87 -235 37 -239 316 -78 -58 225 46 -159 -18 -177 -212 -114 -233 7 83 166
7772 166 249 31 87 -120 265 75 -364 -81 -153 143 27 252 -95 -30 26 173 89 283 58 -62 87 -102
7794 -102 -110 -72 227 9 61 122 171 112 79 182 -128 -25 148 91 -102 -54 -34 -95 98 131 53 8 123 -209 238
7819 238 17 -80 -283 7 -26 -114 -34 -239 17 150 -229 -314 86 -89 -59 62 133 -23 -305 -39 332 -38
7841 -38 67 -12 -102 69 31 -86 65 -48 115 16 326 224 226 -50 184 -204 -139 157 -27 -125 95 118 -72
7864 -72 -63 63 94 35 81 -25 150 148 -85 -104 69 257 83 -82 91 0 163 -63 184 -6 -66 168 88 -184
7888 -184 -9 151 -69 126 95 108 10 120 24 -201 -182 -120 -187 236 58 106 3 -80 139 283 103 105 -10 -78
7912 -78 -59 -34 77 58 -197 8 -18 112 -47 164 -61 167 -210 176 168 -110 -143 -86 -31 142 81 -72 19 -245
7936 -245 -86 -121 -142 82 -277 76 62 56 150 -205 40 -44 -25 -110 -104 222 -39 260 -159 8 1 -53 -38 47 67 -357
7962 -357 -57 -179 166 58 -34 -388 -237 -58 25 75 44 -119 96 70 -112 71 109 -176 -55 70 122 234
7984 234 -146 -102 118 119 -145 -196 -172 -111 -136 122 14 -194 20 -116 -279 64 -14 -93 160 -122 -176 -93 -2 241
8008 241 -64 214 90 275 -183 -71 166 -137 128 -49 151 -71 111 18 -129 265 191 27 83 227 -91
8029 -91 326 49 76 -87 -167 158 53 -282 35 -28 -87 22 154 4 52 118 67 314 -30 -57 16 -91 -1 160
8053 160 -91 78 51 198 184 -168 -33 47 35 16 -160 44 -33 187 28 -263 91 302 152 141 -27 60 25
8076 25 -108 -174 141 -210 127 -104 -49 187 -105 161 -126 47 -161 135 230 -246 -233 28 -216 171 216 -184
8098 -184 72 -102 88 -214 163 -50 -26 59 -242 -191 -1 63 85 40 -2 70 -215 -79 -35 210 186 -265 -30
8121 -30 43 256 -59 -198 108 50 204 81 99 5 -123 -260 17 -216 -20 104 -51 -4 213 196 211 -145 -248
8144 -248 104 80 369 244 -42 -62 214 -221 84 103 273 258 -271 -261 -30 47 -76 -29 126 -94 -56 -93 -156
8167 -156 -157 -127 -66 33 78 227 -54 -59 128 23 51 87 -137 121 -219 -91 197 44 263 -130 153 138 -218 310
8191C10
##END NTUPLES=NMR FID
##END=
