##TITLE=1H_SRR167_C_TFA
 CDCl3
 8 sc, 
 4.9.2023
##JCAMPDX= 6.0         $$ Bruker NMR JCAMP-DX V2.0
##DATA TYPE= NMR FID
##DATA CLASS= NTUPLES
##ORIGIN= UXNMR, Bruker Analytische Messtechnik GmbH
##OWNER= root
$$ XWIN-NMR		Version 3.5
$$ Mon Sep  4 14:21:56 2023 Russian Standard Time (UT+4h)  she@DPX200
##.OBSERVE FREQUENCY= 200.13135
##.OBSERVE NUCLEUS= ^1H
##.DELAY= (6, 6)
##.ACQUISITION MODE= SIMULTANEOUS
##.ACQUISITION SCHEME= undefined
##.AVERAGES= 8
##.DIGITISER RES= 18
##SPECTROMETER/DATA SYSTEM= spect
##.PULSE SEQUENCE= zg30
##.SOLVENT NAME= CDCl3
##.SHIFT REFERENCE= (INTERNAL, CDCl3, 0, 15.7039)
##AUDIT TRAIL= $$ (NUMBER, WHEN, WHO, WHERE, WHAT)
$$ ##TITLE= Audit trail, XWIN-NMR		Version 3.5
$$ ##JCAMPDX= 5.01
$$ ##ORIGIN= Bruker BioSpin GmbH
$$ ##OWNER= she
$$ F:/spectra/data/she/nmr/H-F/1/audita.txt
$$ ##AUDIT TRAIL=  $$ (NUMBER, WHEN, WHO, WHERE, WHAT)
(   1,<2023-09-04 14:20:49.96 +0400>,<she>,<DPX200>,
      <created by zg, POWCHK disabled, PULCHK disabled
       configuration hash MD5:
       00 E9 B6 7A A2 85 ED C7 34 08 36 98 17 FE 4E 26
       data hash MD5: 16K
       96 AC A4 85 DA E4 0F 52 78 86 CB B8 C7 AC 1A 9A>)
$$ ##END=
$$ 
$$ hash MD5
$$ 7A 41 17 EF B5 22 42 0B 17 79 87 50 B9 47 56 5E
##$RELAX= 
##$RELAX= 
##$RELAX= 
##$RELAX= 
##$RELAX= 
##$RELAX= 
$$ Bruker specific parameters
$$ --------------------------
##$DU= <F:/spectra>
##$EXPNO= 1
##$NAME= <H-F>
##$PROCNO= 1
##$TYPE= <nmr>
##$USER= <she>
##$AMP= (0..31)
100 100 100 100 100 100 100 100 100 100 100 100 100 100 100 100 100 100 
100 100 100 100 100 100 100 100 100 100 100 100 100 100 
##$AQSEQ= 0
##$AQ_mod= 1
##$AUNM= <au_zg>
##$AUTOPOS= <>
##$BF1= 200.13
##$BF2= 200.13
##$BF3= 200.13
##$BF4= 200.13
##$BF5= 200.13
##$BF6= 200.13
##$BF7= 200.13
##$BF8= 200.13
##$BYTORDA= 1
##$CFDGTYP= 0
##$CFRGTYP= 5
##$CHEMSTR= <none>
##$CNST= (0..31)
1 1 145 1 1 1 1 1 1 1 1 1 1 1 1 1 1 1 1 1 1 1 1 1 1 1 1 1 1 1 1 1 
##$CPDPRG= <>
##$CPDPRG1= <>
##$CPDPRG2= <>
##$CPDPRG3= <>
##$CPDPRG4= <mlev>
##$CPDPRG5= <mlev>
##$CPDPRG6= <mlev>
##$CPDPRG7= <mlev>
##$CPDPRG8= <mlev>
##$CPDPRGB= <>
##$CPDPRGT= <>
##$D= (0..31)
0 1.2 0 0 0 0 0 0 0 0.06 0 0.03 0 0 0 0 0.0002 0 0 0 0 0 0 0 0 0 0 0 0 
0 0 0 
##$DATE= 1693822849
##$DBL= (0..7)
120 120 120 120 120 120 120 120 
##$DBP= (0..7)
150 150 150 150 150 150 150 150 
##$DBP07= 0
##$DBPNAM0= <>
##$DBPNAM1= <>
##$DBPNAM2= <>
##$DBPNAM3= <>
##$DBPNAM4= <>
##$DBPNAM5= <>
##$DBPNAM6= <>
##$DBPNAM7= <>
##$DBPOAL= (0..7)
0.5 0.5 0.5 0.5 0.5 0.5 0.5 0.5 
##$DBPOFFS= (0..7)
0 0 0 0 0 0 0 0 
##$DE= 6
##$DECBNUC= <off>
##$DECIM= 32
##$DECNUC= <off>
##$DECSTAT= 4
##$DIGMOD= 1
##$DIGTYP= 9
##$DL= (0..7)
0 120 120 120 120 120 120 120 
##$DP= (0..7)
150 150 150 150 150 150 150 150 
##$DP07= 0
##$DPNAME0= <>
##$DPNAME1= <>
##$DPNAME2= <>
##$DPNAME3= <>
##$DPNAME4= <>
##$DPNAME5= <>
##$DPNAME6= <>
##$DPNAME7= <>
##$DPOAL= (0..7)
0.5 0.5 0.5 0.5 0.5 0.5 0.5 0.5 
##$DPOFFS= (0..7)
0 0 0 0 0 0 0 0 
##$DQDMODE= 0
##$DR= 18
##$DS= 0
##$DSLIST= <SSSSSSSSSSSSSSS>
$$ [...]
##$SUBNAM2= <"">
##$SUBNAM3= <"">
##$SUBNAM4= <"">
##$SUBNAM5= <"">
##$SUBNAM6= <"">
##$SUBNAM7= <"">
##$SUBNAM8= <"">
##$SUBNAM9= <"">
##$SW= 18.05172834244
##$SWIBOX= (0..15)
0 0 2 0 0 0 0 0 0 0 0 0 0 0 0 0 
##$SW_h= 3612.71676300578
##$TD= 16384
##$TD0= 1
##$TE= 0
##$TE2= 300
##$TE3= 300
##$TEG= 300
##$TL= (0..7)
0 120 120 120 120 120 120 120 
##$TP= (0..7)
150 150 150 150 150 150 150 150 
##$TP07= 0
##$TPNAME0= <>
##$TPNAME1= <>
##$TPNAME2= <>
##$TPNAME3= <>
##$TPNAME4= <>
##$TPNAME5= <>
##$TPNAME6= <>
##$TPNAME7= <>
##$TPOAL= (0..7)
0.5 0.5 0.5 0.5 0.5 0.5 0.5 0.5 
##$TPOFFS= (0..7)
0 0 0 0 0 0 0 0 
##$TUNHIN= 0
##$TUNHOUT= 0
##$TUNXOUT= 0
##$USERA1= <user>
##$USERA2= <user>
##$USERA3= <user>
##$USERA4= <user>
##$USERA5= <user>
##$V9= 5
##$VALIST= <valist>
##$VCLIST= <CCCCCCCCCCCCCCC>
##$VD= 0
##$VDLIST= <DDDDDDDDDDDDDDD>
##$VPLIST= <PPPPPPPPPPPPPPP>
##$VTLIST= <TTTTTTTTTTTTTTT>
##$WBST= 1024
##$WBSW= 4
##$XGAIN= (0..3)
0 0 0 0 
##$XL= 0
##$YL= 0
##$YMAX_a= 176100
##$YMIN_a= -262819
##$ZGOPTNS= <>
##$ZL1= 120
##$ZL2= 120
##$ZL3= 120
##$ZL4= 120
##$ABSF1= 10
##$ABSF2= 0
##$ABSG= 5
##$ABSL= 3
##$ALPHA= 0
##$AQORDER= 0
##$ASSFAC= 0
##$ASSFACI= 0
##$ASSFACX= 0
##$ASSWID= 0
##$AUNMP= <proc_1d>
##$AZFE= 0.1
##$AZFW= 0.1
##$BCFW= 1
##$BC_mod= 2
##$BYTORDP= 1
##$COROFFS= 0
##$CY= 11.3945322036743
##$DATMOD= 1
##$DC= 2
##$DFILT= <>
##$DTYPP= 0
##$F1P= 15.7292609196834
##$F2P= 12.9074282941183
##$FCOR= 0.5
##$FTSIZE= 0
##$FT_mod= 4
##$GAMMA= 1
##$GB= 0.15
##$INTBC= 1
##$INTSCL= 1
##$ISEN= 128
##$LB= 0.24
##$LEV0= 0
##$LPBIN= 0
##$MAXI= 10000
##$MC2= 0
##$MEAN= 0
##$ME_mod= 0
##$MI= 1.114404
##$NCOEF= 0
##$NC_proc= 0
##$NLEV= 6
##$NOISF1= 3.799351
##$NOISF2= 2.8
##$NSP= 1
##$NTH_PI= 0
##$NZP= 0
##$OFFSET= 15.70392
##$PC= 1
##$PHC0= -21053.05
##$PHC1= 22.25272
##$PH_mod= 1
##$PKNL= yes
##$PPARMOD= 0
##$PSCAL= 0
##$PSIGN= 0
##$REVERSE= no
##$SF= 200.130013532006
##$SI= 16384
##$SIGF1= 3
##$SIGF2= 2
##$SINO= 400
##$SIOLD= 16384
##$SREGLST= <1H.CDCl3>
##$SSB= 0
##$STSI= 0
##$STSR= 0
##$SW_p= 3612.71676300578
##$SYMM= 0
##$S_DEV= 0
##$TDeff= 0
##$TDoff= 0
##$TI= <>
##$TILT= no
##$TM1= 0
##$TM2= 0
##$TOPLEV= 0
##$USERP1= <user>
##$USERP2= <user>
##$USERP3= <user>
##$USERP4= <user>
##$USERP5= <user>
##$WDW= 1
##$XDIM= 8192
##$YMAX_p= 0
##$YMIN_p= 0
$$ End of Bruker specific parameters
$$ ---------------------------------
##NTUPLES= NMR FID
##VAR_NAME=  TIME,          FID/REAL,        FID/IMAG
##SYMBOL=    X,             R,               I
##VAR_TYPE=  INDEPENDENT,   DEPENDENT,       DEPENDENT
##VAR_FORM=  AFFN,          ASDF,            ASDF
##VAR_DIM=   8192,          8192,            8192
##UNITS=     SECONDS,       ARBITRARY UNITS, ARBITRARY UNITS
##FACTOR=    0.0002768,     1,               1
##FIRST=     0,             0,               0
##LAST=      2.2672688,     0,               0
##MIN=       0,             -262819,         0
##MAX=       2.2672688,     176100,          0
$$ Real data points
##PAGE= N=1
##DATA TABLE= (X++(R..R)), XYDATA
$$ [...]
$$ plain form
1780 151 38 289 416 -119 -200 -104 -174 -176 104 76 9 82 40 16 -31 -153 -56 -178 -119 -15 13 64 104 -241 -100
1805 -100 -75 226 -80 78 247 -49 131 59 -240 -222 37 79 -152 -138 -68 -221 -295 -164 -87 -10 19 157 -106
1828 -106 -74 -105 -23 -119 -119 -29 -137 -39 1 -167 207 -179 85 77 117 198 -100 95 91 -71 -27 -110 -197 202 -301 -87
1854 -87 89 -127 3 138 -70 64 352 1 -127 110 -55 -7 151 -188 200 -45 -132 157 293 -30 -92
1875 -92 -165 -176 -307 73 64 -158 -205 14 -147 208 58 -138 -157 -36 -108 50 90 162 -61 -47 -278 47 65 213
1899 213 -179 -27 -264 79 95 59 -219 -79 98 177 25 -12 -134 14 197 -3 -62 -111 -161 67 29 -159 -156
1922 -156 -139 -74 -325 -46 -476 -185 -122 -79 -1 25 60 194 117 -140 122 36 -81 165 38 16 1 -145 -321 -135
1946 -135 -319 -43 -165 -142 -59 24 58 131 96 23 59 -200 -15 -65 -107 -32 -56 59 -367 89 102 -9 -94 151 72
$$ packed form
1780A51j13K51J27n35q1R6p0kK80k8o7P3m2k4m7j22R7j22N9J04K8N1M0l45J41
1805a00K5L01l06J58J69k96J80p2k99J8K59M2k31J4P0j53p4J31P7P7K9J38k63
1828a06L2l1Q2r6%R0j08R8M0j68L74l86K64qM0Q1k98J95mj62M4q3q7L99n03K14
1854h7J76k16J30J35k08J34K88l51j28K37j65M8J58l39L88k45q7K89J36l23o2
1875i2p3j1j31L80rk22m7K19j61L55j50j96j9J21p2J58M0P2k23J4k31L25J8J48
1899B13l92J52k37L43J6l6k78J40J77P9j52l7j22J48J83k00n9m9n0K28l8j88L
1922a56J7O5k51K79m30K91O3M3P8K6L5J34p7k57K62q6j17K46j27k2j5j46j76J86
1946a35j84K76j22K3Q3Q3L4P3l5p3L6k59J85n0m2P5k4J15m26M56J3j11q5K45p9
$$ plain form
1971 72 170 51 -54 -96 195 -1 22 216 77 -77 -122 -76 -225 -96 107 59 110 85 126 105 113 -195 86 -13 -349
1996 -349 -80 -108 130 55 140 62 67 50 -25 -20 3 -104 -30 -14 12 182 19 -100 135 -109 96 -191 23 111 397
2021 397 475 53 61 124 14 179 66 -57 50 177 -7 -123 26 5 -57 360 -33 -128 -52 -61 -83 -132 -101 95
2045 95 -63 156 167 248 9 -22 44 56 68 -10 -44 -204 -30 -139 -208 -67 25 -260 157 54 71 28 64 248 -96
2070 -96 -154 165 77 83 239 -118 -12 142 144 0 36 -146 265 28 187 7 -208 -123 111 -12 29 19 200 -198
2094 -198 -4 47 59 -67 31 31 20 193 144 -34 -199 89 34 -19 -195 102 239 176 -223 180 0 -185 -3
2117 -3 24 95 133 196 -137 4 -53 70 -92 56 -13 146 -207 -178 22 -4 -35 -115 -120 -76 -148 -114 23 60 -25 -132
2143 -132 78 73 116 -61 195 74 -131 -204 88 -41 168 133 59 126 -51 -47 -55 -76 -138 218 247 -236 -156 -150 -71 -367
$$ packed form
1971G2R8j19j05m2K91j96K3J94j39j54m5M6j49J29K03m8N1k5M1k1Ql08K81r9l36
1996c49K69k8K38p5Q5p8Nj7p5NK3j07P4J6K6J70j63j19K35k44K05k87K14Q8K86
2021C97P8m22QO3j10J65j13j23J07J27j84j16J49k1o2M17l93r5P6rk2m9L1J96
2045I5j58K19J1Q1k39l1O6J2J2p8l4j60J74j09o9J41R2k85M17j03J7m3L6J84l44
2070i6n8L19q8OJ56l57J06J54Kj44L6j82M11k37J59j80k15Q5K34j23M1j0J81l98
2094a98J94N1J2j26R8%j1J73m9j78j65K88n5n3j76K97J37o3l99M03j80j85J82
2117cK7P1L8O3l33J41n7J23j62J48o9J59l53K9K00k6l1q0nM4p2L4J37L7q5j07
2143a32K10nM3j77K56j21k05p3K92j29K09l5p4O7j77Mqk1o2L56K9m83Q0OP9k96
$$ plain form
2169 -367 -79 45 -274 -200 -138 174 91 -81 127 156 -4 -61 55 23 -15 103 -194 210 -125 88 204 26
2191 26 4 -113 77 -4 -38 32 -214 -73 -174 210 -63 -49 175 126 3 32 10 -70 3 -104 12 193 -164 49
2215 49 -165 124 208 69 -39 -134 -170 -234 -38 245 -158 -22 18 47 8 -153 -270 18 0 6 87 77 43 -119 -289
2240 -289 49 -221 -125 187 -171 -249 221 101 140 101 4 -149 61 -63 380 62 134 -5 96 38 -7 5 367
2263 367 -123 -53 -350 71 -103 261 -94 -25 -85 37 44 4 169 19 -62 -47 97 -236 273 87 64 93 136 12
2287 12 -50 16 102 -36 244 132 -9 -242 -53 -30 56 -24 -260 -87 -55 -138 120 121 6 -99 -142 104 106 -85 75
2312 75 6 -43 86 -77 -150 70 177 26 -106 -102 -132 41 -76 -12 391 65 119 67 -232 -150 -74 -62 9 -72 -68 -44
2338 -44 69 38 76 121 210 -262 -4 134 212 78 -102 -66 91 263 28 -18 -139 -50 -385 -54 217 126 146 1
$$ packed form
2169c67K88J24l19P4O2L12q3j72K08K9j60n7J16l2l8J18k97M04l35K13J16j78
2191B6k2j17J90q1l4P0k46J41j01L84k73J4K24m9j23K9k2q0P3j07J16J81l57K13
2215D9k14K89Q4j39j08r5l6o4J96K83m03J36M0K9l9j61j17K88j8OQ1j0l4j62j70
2240b89L38k70R6L12l58p8M70j20L9l9r7j53K10j24M43l18P2j39J01n8m5J2L62
2263C67m90P0k97M21j74L64l55O9o0J22Pm0J65j50q1J5J44l33N09j86k3K9M3j24
2287A2o2O6Q6j38K80j12j41k33J89K3Q6q0k36J73L2q3K58Jj15j05m3K46Kj91J60
2312G5o9m9J29j63p3K20J07j51j32Ml0J73j17O4M03l26N4n2k99Q2P6J2P1q1MK4
2338d4J13l1L8M5Q9m72K58J38P8j34j80L6J57J72k35m6j21Q9l35L31K71r1K0j45
$$ plain form
2362 1 -142 21 80 -136 170 17 -150 115 -87 -63 -19 -52 170 107 -204 -147 -210 -29 22 -38 171 129 76 25 15
2387 15 -80 -56 35 -79 256 131 -38 -95 44 -125 -210 -219 165 12 37 152 -129 -82 -169 117 -79 -114 -48 27 148
2412 148 -3 -158 -80 99 -111 15 -135 -1 183 167 -59 -99 41 56 -39 -89 10 -232 -121 194 -51 -232
2434 -232 12 13 91 48 194 -150 216 29 -16 108 57 101 88 -108 -13 57 -126 2 -58 62 -65 -61 104 162 -37
2459 -37 4 166 223 -154 58 0 68 322 -273 139 39 251 0 52 156 -159 -70 19 102 94 -107 -107 -84 238 -330
2484 -330 12 19 -61 -181 25 -184 92 202 -185 -34 -86 -15 -7 135 -193 -230 260 59 3 -15 212 -330 19
2507 19 -12 -119 -124 203 67 -136 20 89 -121 185 114 183 13 88 35 -152 -102 1 -36 61 -5 -140 -21 -104 -332
2532 -332 17 173 -241 -267 -20 43 158 42 384 66 -83 26 81 -20 -23 65 -9 99 156 71 -84 124 -9
$$ packed form
2362Aj43J63N9k16L06j53j67K65k02K4M4l3K22o3l11N7o3J81N1o0K09m2n3n1j0
2387A5r5K4R1j14L35j25j69n7J39j69q5rL84j53K5J15k81M7q7K86j96l5O6P5J21
2412A48j51j55P8J79k10J26j50J34J84j6k26m0J40J5r5n0R9k42J11L15k45j81
2434b32K44JP8m3J46l44L66j87m5J24n1M4j3j96R5P0j83J28o0J20j27MJ65N8j99
2459c7M1J62N7l77K12n8O8K54n95M12j00K12k51N2J04l15Q9Q9Q3qk01%K3L22n68
2484c30L42Pq0j20K06k09K76J10l87J51n2P1QJ42l28l7M90k01n6j8K27n42L49
2507A9l1j07nL27j36k03J56O9k10L06p1O9j70P5n3j87N0J03l7R7o6j35J19q3k28
2532c32L49J56m14k6K47O3J15j16L42l18j49J09N5j01lQ8p4J08N7q5j55K08j33
$$ plain form
2555 -9 17 -155 2 -222 -167 58 36 -217 138 95 189 1 -4 263 -97 8 -128 22 143 55 -42 161 75 -54
2579 -54 -188 185 345 139 151 67 20 349 327 224 36 213 22 8 154 34 182 260 84 -105 -136 -27 -69
2602 -69 -47 -70 101 -325 -11 -4 15 206 -170 -266 -113 -15 29 84 52 139 -75 130 102 -45 108 176 149 -243 186
2627 186 76 -109 -143 -6 166 -90 -266 -160 48 -15 126 -95 132 -49 119 70 104 -10 114 -181 -12
2648 -12 16 176 90 -15 142 62 -19 -137 130 -173 -87 -125 -214 -51 -35 216 28 106 184 -17 70 166 -77 16 -120
2673 -120 -2 54 -23 134 -141 -43 117 -76 117 248 136 157 -149 -13 206 -7 244 -52 -129 -203 163 -56
2695 -56 -12 -19 60 92 178 102 -70 25 -19 -73 -9 66 -44 45 -51 -72 -154 -71 56 -136 -62 196 28 -181 -11 77 -49
2722 -49 -327 11 -2 5 -8 -1 56 156 230 -65 -92 195 74 -183 57 104 73 11 -142 40 -43 -238 39 108 -201
$$ packed form
2555iK6j72J57k24N5K25k2k53L55m3R4j88nK67l60J05j36J50J21q8r7K03q6j29
2579e4j34L73J60k06J2q4m7L29k2j03j88J77j91j4J46j20J48P8j76j89l1J09m2
2602f9K2k3J71m26L14PJ9J91l76r6J53R8M4N5l2Q7k14K05k8j47J53O8k7l92M29
2627A86j10j85l4J37J72k56j76J06K08o3J41k21K27j81J68m9L4j14J24k95J69
2648a2K8J60q6j05J57q0q1j18K67l03Q6l8q9J63J6K51j88P8P8k01Q7R6k43R3j36
2673a20J18N6p7J57k75R8J60j93J93J31j12K1l06J36K19k13K51k96p7p4L66k19
2695e6M4pP9L2Q6p6j72R5m4n4O4P5j10Q9r6k1q2Q3J27j92P4K58j68k09J70Q8j26
2722d9k78L38j3Pj3PN7J00P4k95k7K87j21k57K40M7l1o2j53J82q3j95K77O9l09
$$ plain form
2747 -201 113 235 90 -6 80 197 -28 32 -5 318 72 -4 -19 -52 -90 -176 -16 150 -21 128 88 -72 -190
2770 -190 -47 -157 117 92 46 -95 -185 -82 19 -77 -96 -223 158 27 80 -23 -140 23 260 25 -206 -72
2792 -72 -216 98 174 47 56 -67 -19 -103 -162 68 -90 11 28 -24 -74 -102 -75 95 -81 -53 -68 105 -152 -133 -222
2817 -222 6 108 -19 139 39 -136 -115 322 -47 -12 156 121 -42 75 45 -55 0 98 189 -58 49 -1 289
2840 289 -185 -73 114 155 75 -38 -365 6 -110 198 -22 -223 19 77 -134 -30 33 12 -43 369 42 36 -120
2863 -120 -197 -58 -54 150 63 -99 -42 -81 -67 -78 -84 60 -51 -57 -121 -21 135 20 -226 0 181 27 109 73 7
2888 7 71 21 10 -38 -92 69 -26 60 -53 -82 -123 -207 -117 -15 141 1 -43 32 -252 187 -121 82 -25 -149 133
2913 133 -16 135 263 198 45 -166 -16 -119 37 -34 -224 108 15 -117 -103 196 -213 44 48 18 41 -153 -84
$$ packed form
2747b01L14J22j45r6Q6J17k25O0l7L23k46p6j5l3l8q6J60J66j71J49m0j60j18
2770a90J43j10K74k5m6j41r0J03J01r6j9j27L81j31N3j03j17J63K37k35k31J34
2792g2j44L14P6j27Rj23M8q4n9K30j58J01J7n2n0k8K7J70j76K8j5J73k57J9q9
2817b22K28J02j27J58j00j75K1M37l69L5J68l5j63J17l0j00N5R8R1k47J07n0K90
2840B89m74J12J87M1q0j13l27L71j16L08k20k01K42N8k11J04O3k1n5M12l27oj56
2863a20p7J39MK04q7j62N7l9J4j1oJ44j11oo4J00J56j15k46K26J81j54Q2l6o6
2888GO4n0j1m8n4J61r5Q6j13k9m1q4R0J02J56j40m4P5k84M39l08K03j07j24K82
2913A33j49J51J28o5j53k11J50j03J56p1j90L32r3j32J4K99m09K57Ml0K3j94O9
$$ plain form
2936 -84 -86 -84 47 -128 149 -83 -228 153 16 67 29 60 -38 36 -98 -112 -96 -96 26 214 240 104 233 -45 150
2961 150 -131 18 -49 176 199 120 81 -126 394 -108 -93 45 -89 4 303 -8 56 98 47 41 -98 -63 30 133
2985 133 190 -9 58 58 9 68 42 105 -298 48 211 69 18 -89 33 -26 -25 -59 -82 -164 -21 -120 23 -65 -90 154
3011 154 -77 -139 -175 -18 86 -55 -211 140 80 71 118 210 82 -50 72 -73 58 46 119 84 17 -139 167 -183
3035 -183 -92 16 10 16 141 -8 -93 81 56 43 147 31 164 60 -264 -202 72 -242 89 166 -137 -47 86 -62
3059 -62 13 -88 130 73 206 177 -128 113 139 52 117 126 132 116 -235 132 27 -23 39 -68 -132 -145 -275 -27 24 -114
3085 -114 -133 18 79 -36 -2 -10 -54 77 102 220 -324 -34 -115 -289 -78 22 194 218 0 -5 -122 84 167 32
3109 32 319 189 48 98 92 -272 183 -60 -71 -34 -233 -110 -196 -94 -95 -418 -31 -65 87 -81 -148 73 -272 -181
$$ packed form
2936h4kKJ31j75K77k32j45L81j37N1l8L1r8P4j34j4J6%J22J88K6j36J29k78J95
2961A50k81J49o7K25K3p9l9k07N20n02J5J38j34R3K99l11O4M2n1oj39L5R3J03
2985A33N7j99O7%m9N9k6O3m03L46J63j42n1j07J22n9Jl4k3q2J43r9J43q8k5K44
3011A54k31o2l6J57J04j41j56L51o0rM7R2j28j32J22j45J31j2P3l5o7j56L06l50
3035a83R1J08oOJ25j49q5J74k5j3J04j16J33j04l24O2K74l14L31P7l03R0J33j48
3059f2P5j01K18n7J33k9l05K41K6q7O5ROj6l51L67j05n0O2j07o4j3j30K48N1j38
3085a14j9J51O1j15L4qm4J31K5J18n44K90q1j74K11J00J72K4k18nj17K06Q3j35
3109C2K87j30j41N0ol64M55k43j1L7j99J23q6J02jl23L87l4J52j68o7K21l45R1
$$ plain form
3133 -181 -56 -170 -71 48 72 177 -126 130 -176 59 -246 3 150 83 92 138 105 -87 -165 -116 288 88 34
3156 34 -89 9 -61 -30 -216 -44 56 -73 -78 133 64 18 -193 209 55 157 -23 -82 152 146 57 103 111 63 37 -92
3182 -92 -290 58 87 -122 39 112 -40 181 -213 129 -255 -136 36 -66 -25 163 -217 58 33 36 54 -148 212
3205 212 -72 253 -140 -7 -63 28 -194 -173 264 -77 -278 162 171 160 -116 -48 -18 -235 -145 -197 -280 2 361 289
3229 289 -227 -77 154 172 -4 135 398 -40 -43 141 247 -109 44 75 -49 232 6 -139 86 -37 -58 -35
3251 -35 13 -38 270 -115 117 152 -25 -201 159 314 8 -16 32 131 20 -92 -13 98 93 186 149 -27 69 33 87
3276 87 -126 -67 168 45 -169 -12 -12 -16 18 19 -256 87 -185 -90 137 -192 143 80 -96 77 -45 -65 -30 261
3300 261 11 204 228 -194 66 -14 -15 18 53 -13 -21 0 321 -148 132 46 215 -107 353 317 -42 117 108 -50 -22
$$ packed form
3133a81J25j14R9J19K4J05l03K56l06K35l05K49J47o7RM6l3j92p8M9M04k00n4
3156C4j23R8p0L1j86J72J00j29nK11o9m6k11M02j54J02j80n9K34oq9M6Qm8k6j29
3182i2j98L48K9k09J61P3j52K21l94L42l84J19J72j02M1J88l80K75k5LJ8k02L60
3205B12k84L25l93J33n6R1k22K1M37l41k01M40Rj1k76O8L0k17R0n2q3K82L59p2
3229B89n16J50K31J8j76J39K63m38lJ84J06l56J53L1j24K81k26j45K25j23k1K3
3251c5M8n1L08l85K32L5j77j76L60J55l06k4M8R9j11j12P9J11nR3l7j76R6l6N4
3276H7k13N9K35j23k14J57%mL4Jk75L43k72R5K27l29L35o3j76J73j22k0L5K91
3300B61k50J93K4m22K60q0jL3L5o6qK1L21m69K80q6J69l22M60l6l59J59rj58K8
$$ plain form
3325 -22 -247 -247 -68 -193 64 140 -45 -3 153 34 -95 10 -133 -29 -132 -104 342 -62 -131 83 -78 -144 -93
3348 -93 -22 -226 73 -62 -147 -55 44 -117 64 244 -6 -7 -127 -109 104 240 90 -120 -51 105 -202 78 416
3371 416 9 -186 64 -2 -59 -10 65 -38 -65 -96 -62 -19 160 154 -51 18 339 -123 74 -62 -109 11 -232 57
3395 57 136 44 -211 -103 51 91 -115 -110 33 -421 -29 -84 56 -120 40 -120 132 47 33 -84 103 -101 181
3418 181 -41 38 10 -170 17 -86 -52 80 64 46 185 106 -71 -41 -51 0 135 -102 -19 34 0 73 21 25 73 -172
3444 -172 -59 -248 -14 -48 42 181 -57 72 -27 53 -132 125 116 203 -3 40 11 -61 -180 75 18 -97 114 45
3468 45 110 215 -33 -156 174 -102 56 158 125 110 214 41 230 35 149 -58 -334 -65 187 18 -136
3489 -136 71 38 28 -304 -144 -114 31 226 -106 -19 83 209 -141 -277 -138 -5 -59 -39 116 -97 95 107
$$ packed form
3325b2k25%J79j25K57P6j85M2J56j19j29J05j43J04j03K8M46m04o9K14j61o6N1
3348i3P1k04K99j35q5R2R9j61J81J80k50jj20J8K13J36j50k10O9J56l07K80L38
3371D16m07j95K50o6n7M9P5j03k7l1L4M3J79ok05O9L21m62J97j36m7J20k43K89
3395E7P9r2k55J08J54M0k06NJ43m54L92n5J40j76J60j60K52q5j4j17J87k04K82
3418A81k22P9k8j80J87j03L4J32j6j8J39p9j77L0j0N1J35k37Q3N3l4P3n2MM8k45
3444a72J13j89K34l4R0J39k38J29r9Q0j85K57rQ7k06M3k9p2j19K55n7j15K11o9
3468D5O5J05k48j23L30k76J58J02l3j5J04j73J89j95J14k07k76K69K52j69j54
3489a36K07l3j0l32J60L0J45J95l32Q7J02J26l50j36J39J33n4K0J55k13J92J2
$$ plain form
3511 107 -59 34 125 69 -17 -238 110 -54 117 -103 -43 97 91 -167 -57 73 175 -142 -105 -4 -147 90 159
3534 159 171 -224 -105 113 -32 -69 -98 -83 119 -13 12 110 212 -124 -429 -102 42 -80 -8 16 -238 15 119
3557 119 116 -115 71 -128 30 -67 -32 -73 -93 -53 -123 273 208 106 -166 199 -133 -117 42 81 -173 -148 -233 63
3581 63 -120 286 194 -103 -55 -38 17 36 88 205 124 59 146 66 -59 -19 -32 85 225 114 -7 281 393 -105
3605 -105 21 -82 -70 120 -141 47 -17 -49 -86 -23 61 -257 46 208 30 198 -108 25 -129 -28 -141 -121
3627 -121 125 53 133 146 3 -4 -76 -211 167 53 72 -20 92 111 -49 -36 -76 -104 87 176 69 2 350 42 122
3652 122 -23 21 58 145 -175 99 125 81 -173 -104 -228 -18 125 102 72 -44 -59 -3 -176 -389 192 153 3 -79
3676 -79 96 46 96 27 89 77 -27 -122 -10 13 -99 -16 -236 8 -46 33 126 -94 -21 -152 202 -77 53 -18 -39
$$ packed form
3511A07j66R3R1n6q6k21L48j64J71k20O0J40ok58J10J30J02l17L7J01j43K37O9
3534A59J2l95J19K18j45l7k9J5K02j32K5R8J02l36l05L27J44j22P2K4k54K53J04
3557A19lk31J86j99J58r7L5m1k0M0p0L96o5j02k72L65l32J6J59L9k54K5q5K96
3581F3j83M06r2k97M8J7N5J9N2J17q1o5Q7q0j25M0j3J17J40j11j21K88J12m98
3605a05J26j03J2J90k61J88o4l2l7O3Q4l18L03J62j78J68l06J33j54J01j13K0
3627a21K46p2Q0J3j43pp2j35L78j14J9r2J12J9j60J3m0k8J91Q9j07o7L48l08Q0
3652A22j45M4L7Q7l20K74K6m4k54O9j24K10J43k3l0j16j5N6j73k13N81l9j50q2
3676g9J75n0N0o9O2j2j04r5J12K3j12Q3k20K44n4P9R3k20P3j31L54k79J30p1k1
$$ plain form
3701 -39 -130 -71 304 99 -92 81 81 162 -85 87 -109 47 -54 -113 173 113 -27 52 32 2 -32 -380 -80 -88 26
3726 26 81 -29 -53 109 -145 265 69 52 -69 -265 -19 -314 156 -79 30 -18 80 -70 242 104 125 113 -2
3749 -2 -51 216 11 -151 -188 -21 171 127 -71 -103 280 53 -391 -21 -121 -30 -55 -234 181 -95 155 -7 150
3772 150 -20 90 -213 7 14 -7 105 -279 28 135 109 47 -63 58 -37 64 -279 2 -88 -148 -178 163 -13
3795 -13 140 -39 86 -63 -21 177 111 216 -262 71 35 62 -66 59 -65 239 141 -103 16 89 142 51 -105
3818 -105 -26 -1 -170 101 -5 98 -29 -15 59 -88 215 106 -37 -50 105 -141 18 -277 114 19 132 17
3840 17 -21 107 -73 171 -20 -83 -81 -94 53 198 13 -256 -235 253 -126 -54 -91 143 -137 -10 61 -124 31
3863 31 150 -98 0 3 -218 -46 -246 92 -83 105 93 -35 -445 -163 19 -230 122 -127 -51 3 -240 -248 -140
$$ packed form
3701c9r1N9L75k05j91J73%Q1k47J72j96J56j01n9K86o0j40P9k0l0l4l48L00qJ14
3726B6N5j10k4J62k54M10j96j7j21j96K46k95M70k35J09m8R8j50L12j38K1j2j15
3749bm9K67k05j62l7J67J92m4j98l2L83k27m44L70j00R1k5j79M15k76K50j62J57
3772A50j70J10l03K20Pk1J12l84L07J07k6o2j10J21r5J01l43K81r0o0l0L41j76
3795a3J53j79J25j49M2J98o6J05m78L33l6K7j28J25j24L04r8k44J19P3N3r1j56
3818a05P9K5j69K71j06J03j27J4P4j47L03j09j43j3J55k46J59k95L91r5J13j15
3840A7l8J28j80K44j91o3Kj3J47J45j85k69K1M88l79P2l7K34k80J27P1j85J55
3863C1J19k48R8Lk21J72k00L38j75J88j2j28m10K82J82k49L52k49P6N4k43qJ08
$$ plain form
3886 -140 143 -88 -166 13 -164 0 185 117 -118 -195 -71 37 -87 22 -91 137 -187 -20 -74 255 24
3907 24 -194 133 151 119 -38 -162 255 -212 -40 -100 133 182 26 12 -206 -10 107 155 121 -79 7 42 144
3930 144 91 -33 -278 -55 -219 -182 269 -252 -129 -192 27 153 124 -108 96 48 45 -4 34 116 16 37 -159 35
3954 35 95 152 -90 102 175 135 298 65 -238 72 -86 196 -118 -93 8 -152 -24 35 -232 -152 53 -143 -78
3977 -78 -19 88 19 96 -52 -108 -28 14 -104 -79 189 74 27 39 75 -50 279 237 127 89 0 -54 151 24 8
4002 8 184 -283 -80 -49 149 89 194 -191 -41 96 -42 -27 204 48 80 -78 -100 -219 29 -86 48 104 -99
4025 -99 -154 -44 125 -167 127 -27 184 -92 87 66 81 121 -46 -41 143 61 46 7 31 -74 17 -23 149 -71
4049 -71 -307 -42 7 200 229 -23 -2 49 47 90 -7 -148 66 115 -133 -180 -2 196 37 133 110 10 250 -72
$$ packed form
3886a40K83k31p8J79j77J64J85o8k35p7J24J08j24J09j13K28l24J67n4L29k31
3907B4k18L27J8l2j57j24M17m67J72o0K33M9j56j4k18J96J17M8l4k00Q6L5J02
3930A44n3j24k45K23j64L7M51n21J23o3K19J26k9k32K04m8lm9L8Q2j00K1j96J94
3954C5O0N7k42J92P3m0J63k33l03L10j58K82l14K5J01j60J28N9k67Q0K05j96O5
3977g8N9J07o9P7j48n6Q0M2j18K5K68j15m7J2L6j25L29m2j10l8q9n4K05j27j6
4002HJ76m67K03L1J98o0J05l85J50J37j38J5K31j56L2j58k2j19K48j15J34N6k03
4025i9n5J10J69k92K94j54K11k76J79k1J5M0j67NJ84q2j5l9K4j05R1m0J72k20
4049g1k36K65M9J93K9k52K1N1kM3r7j41K14M9k48m7J78J98j59R6k3j00K40l22
$$ plain form
4073 -72 183 -199 -166 -5 -130 -14 226 60 -252 -29 126 -119 -196 110 -143 388 -63 -133 -62 1 176 -60
4095 -60 199 -111 22 173 8 174 -45 108 -160 53 355 259 79 -60 -262 -1 24 -30 -37 77 -101 -67
4117 -67 172 26 80 -8 -116 -21 60 -201 -204 -60 77 34 -32 222 -140 -72 -25 -212 13 229 356 176 127 -8
4141 -8 220 4 204 -14 198 -127 -128 186 1 -58 21 120 170 30 -61 321 -14 22 -95 -12 138 -198 202 52
4165 52 151 85 254 6 235 115 206 -145 -144 18 -237 -117 -53 43 148 -31 24 -64 43 -171 205 -31 32 28
4189 28 -155 31 -148 -137 -187 197 93 -45 111 -73 -2 202 -216 153 -120 41 -216 -170 48 -75 -112 1
4211 1 -163 298 88 -329 -5 95 -17 -279 -7 77 160 -65 226 -42 -80 31 -79 205 71 168 146 -162
4233 -162 -28 -212 56 15 -62 -33 -57 0 -16 -131 -45 -55 47 51 33 -145 70 154 -36 -114 -42 -185 53 239 -9
$$ packed form
4073g2K55l82L3J61j25J16K40j66l12K23J55k45p7L06k53N31m51p0P1O3J75k36
4095f0K59l10J33J51j65J66k19J53k68K13L02r6j80j39k02K61K5n4pJ14j78L4
4117f7K39j46N4q8j08R5Q1k61lJ44J37m3o6K54l62O8M7j87K25K16J27j80m9j35
4141hK28k16K00k18K12l25jL14j85n9P9R9N0j40r1L82l35L6j17Q3J50l36M00j50
4165E2R9o6J69k48K29j20R1l51JJ62k55J20O4R6J05j79N5q8J07k14L76k36O3m
4189B8j83J86j79J1n0L84j04j38J56j84P1K04m18L69k73J61k57M6K18j23l7J13
4211Aj64M61k10m17L24J00j12k62K72Q4Q3k25K91k68l8J11j10K84j34R7k2l08
4233a62J34j84K68m1p7K9k4N7j6j15Q6j0J02Mj8j78K15Q4j90p8P2j43K38J86k48
$$ plain form
4258 -9 47 -231 -40 -203 -73 39 260 -123 -20 4 127 154 -30 118 -121 -82 -54 -155 -61 -98 -71 -54 265 -109
4282 -109 -121 114 105 57 54 153 31 -96 -186 -214 369 -26 -64 -78 119 87 7 -28 -77 104 -31 176 -175 110 -116
4307 -116 -71 161 -77 225 98 87 -60 196 102 -44 -8 -173 35 17 8 143 199 114 264 -199 -206 -74 -7 40
4331 40 89 0 258 19 -239 -271 22 18 -141 39 111 61 14 191 -64 -116 -169 -124 92 79 53 181 106 -17 123
4356 123 213 -30 86 -59 110 -91 27 -22 -145 53 164 -110 11 31 -61 -34 120 180 131 -137 123 39 -193
4379 -193 93 -116 23 -213 284 281 313 -202 104 76 -77 -216 62 -150 37 -18 108 129 -227 4 -43 31 -57
4402 -57 -23 -112 -212 -91 73 -74 -87 -128 -91 -21 -49 70 104 280 -227 156 -21 29 18 61 150 87 18 -53 38 -70
4428 -70 -13 290 103 54 68 189 -77 3 -249 70 158 -21 -111 -134 -219 163 -21 -165 -228 81 -3 133 -33 141
$$ packed form
4258iN6k78J91j63J30J12K21l83J03K4J23K7j84J48k39L9K8j01R4l7K7J7L19l74
4282a09j2K35rm8lR9j22j27r0k8N83l95l8j4J97l2q0l5m9J81j35K07l51K85k26
4307a16M5K32k38L02j27j1j47K56r4j46L6j65K08j8rJ35N6q5J50m63pJ32O7M7
4331D0M9q9K58k39k58l2K93mj59J80P2n0m7J77k55n2n3M5K16j3k6J28p5j23J40
4356A23R0k43J16j45J69k01J18m9j23J98J11k74J21K0r2K7J54O0m9k68K60q4k32
4379a93K86k09J39k36M97lL2n15L06k8j53j39K78k12J87n5J26K1l56K31m7P4q8
4402e7L4q9j00J21J64j47j3m1L7P0k8J19L4J76n07L83j77N0j1M3Q9o3o9p1R1j08
4428g0N7L03j87m9J4J21k66Q0k52L19Q8j79r0k3q5L82j84j44o3L09q4J36j66J74
$$ plain form
4452 141 129 -71 240 26 -94 -104 123 -155 77 244 26 -228 176 -172 179 140 -50 47 -70 -15 -104 -62
4474 -62 -156 117 4 14 -67 -129 31 88 164 -100 -410 156 -139 -246 -199 -95 -78 23 149 -84 -208 -362 -104
4497 -104 288 207 22 63 -222 -25 221 -271 -151 177 -52 -222 80 -183 -11 -64 76 -90 37 166 -29
4518 -29 20 -48 98 194 31 -196 -78 -18 -16 85 43 -190 57 97 13 -67 43 -211 -107 -300 128 -29 168 215
4542 215 -68 149 147 -40 53 -175 -41 -2 -205 -272 132 149 77 -27 18 100 134 177 -196 45 -168 163 35 -51
4566 -51 37 7 -144 187 -182 43 182 -72 -110 38 119 -34 15 33 -78 13 179 173 -91 78 53 84 -53 125
4590 125 110 124 -60 -80 -5 -6 -16 171 -139 -260 64 192 -115 59 -116 -133 298 12 88 -81 -248 50 136
4613 136 93 181 56 258 197 -78 21 -159 110 -58 -224 59 271 -171 85 -37 63 125 -158 93 -13 -71
$$ packed form
4452A41j2k00L11k14j20j0K27k78K32J67k18k54M04l48L51l9j90R7j17N5q9M2
4474f2r4K73j13J0q1o2J60N7P6k64l10N66k95j07M7J04J7J01J26k33j24j54K58
4497a04L92q1j85M1k85J97K46m92J20L28k29j70L02k63J72n3J40j66J27J29j95
4518b9M9o8J46R6j63k27J18O0KJ01m2k33K47M0q4q0J10k54J04j93M28j57J97M7
4542B15k83K17kj87R3k28J34L9k03o7M04J7p2j04M5Q2L4M3l73K41k13L31j28q6
4566e1Q8l0j51L31l69K25J39k54l8J48Q1j53M9J8j11R1J66ok64J69k5L1j37J78
4590A25j5J4j84k0P5jj0J87l10j21L24J28l07J74j75j7M31k86P6j69j67K98Q6
4613A36m3Q8j25K02o1k75R9j80K69j68j66K83K12m42K56j22J00O2k83K51j06n8
$$ plain form
4635 -71 113 -186 -75 -7 -117 47 -169 -200 -163 37 -42 -51 -210 -7 40 23 -148 146 13 38 -103 -272 94
4658 94 194 220 16 -178 76 137 119 110 157 -49 13 92 -54 -144 -26 -119 -223 -288 -9 -53 147 -91 84 125 109
4683 109 -96 8 94 -18 218 -217 -164 8 35 95 -97 38 -67 254 147 -185 98 17 209 -31 50 -151
4705 -151 -181 13 -248 31 99 24 -16 -52 -68 18 64 127 -63 204 -108 -198 213 -108 -158 368 -10 -165 -34 -96
4729 -96 -88 -135 -104 262 -145 1 51 -107 -129 205 128 -90 99 -196 -138 -145 82 64 73 -18 55 -28 -88 163 -85 225
4755 225 -148 54 127 -13 85 140 86 14 -139 77 -67 23 -38 30 76 41 357 101 128 45 29 -225 -182 85 -36
4780 -36 73 221 116 -68 60 58 17 -62 49 -48 -120 44 43 -9 -111 23 -28 18 15 186 -18 196 -17 -161 -37
4805 -37 18 124 -16 56 76 -83 75 85 -109 19 1 -146 300 -23 -153 173 -92 -19 -283 -115 49 -138
$$ packed form
4635g1J84k99J11O8j10J64k16l1L7K00p9rj59K03M7j7j71K94j33K5j41j69L66
4658I4J00K6k04j94K54O1j8rM7k06O2P9j46r0J18r3j04o5K79m4K00k38J75M1j6
4683A09k05J04Q6j12K36m35N3J72K7O0j92J35j05L21j07l32K83q1J92k40Q1k01
4705a51l0J94k61K79O8p5m0l6j6Q6M6O3j90K67l12r0M11l21n0N26l78j55J31o2
4729i6Qm7L1L66m07J46N0j58k2L34p7k18J89k95N8pK27j8Rr1P3q3o0K51k48L10
4755B25l73K02P3j40R8N5n4p2j53K16j44R0o1O8M6l5L16k56K7q3j6k54M3K67j21
4780c6J09J48j05j84J28km1p9J11r7p2J64jn2j02J34n1M6lJ71k04K14k13j44J24
4805c7N5J06j40P2K0j59J58J0j94J28j8j47M46l23j30L26k65P3k64J68J64j87
$$ plain form
4827 -138 5 -157 100 96 -101 165 165 121 63 116 -230 10 51 -64 -221 134 83 -67 236 -94 273 -129 -106
4850 -106 33 -149 -37 -24 -222 -112 -117 -30 128 88 -193 96 -51 -48 -77 54 -84 68 -209 73 30 -137 -63
4873 -63 123 -163 139 28 76 38 -67 67 -238 -127 -18 140 -31 -38 -34 140 -153 -48 -121 140 -28 150 85
4896 85 101 -52 -79 -73 -102 117 183 176 65 -153 31 23 -125 -168 -14 -33 107 85 45 -154 28 -202 -65 -174 -7
4921 -7 -42 -104 61 -80 -144 -21 -28 -39 -119 -204 155 -10 -34 -128 58 108 180 231 316 147 130 50 -234 32 235 25
4947 25 42 13 -105 148 81 14 -167 -60 -118 -86 -230 -69 -95 -5 12 138 -123 -29 253 172 49 -33 15 -7 -24
4972 -24 -327 -21 97 -172 52 100 -162 47 135 22 154 -163 94 100 -109 19 102 -81 59 -14 33 105 -137
4995 -137 10 -41 -58 -86 -203 68 -186 -281 80 -10 -102 -269 -45 58 -5 69 150 -103 -157 96 -43 -33 0 155
$$ packed form
4827a38J43j62K57mj97K66%m4n8N3l46K40M1j15j57L55n1j50L03l30L67m02K3
4850a06J39j82J12J3j98J10nQ7J58m0k81K89j47Lk9J31j38J52k77K82m3j67P4
4873f3J86k86L02j11M8l8j05J34l05J11J09J58j71pMJ74k93J05p3K61j68J78o5
4896H5J6j53k7Ok9K19O6pj11k18J84qj48m3J54j9J40k2m0j99J82k30J37j09J67
4921gl5o2J65j41o4J23pj1q0q5L59j65k4r4J86N0P2N1Q5j69j7q0k84K66K03k10
4947B5J7k9j18K53o7o7j81J07n8L2j44J61k6R0J7J26k61R4K82q1j23q2M8k2j7
4972b4l03L06J18k69K24M8k62K09Q8j13J32l17K57Ok09J28Q3j83J40p3M7P2k42
4995a37J47n1j7k8j17K71k54r5L61r0r2j67K24J03o3P4Q1k53n4K53j39J0L3J55
$$ plain form
5019 155 63 26 192 111 106 40 -75 135 -28 16 131 15 212 -24 17 1 -286 -4 64 -82 -147 68 87 3
5043 3 -28 -235 -86 41 -173 -99 162 -51 -102 -99 34 6 197 -43 -104 62 -71 -290 175 -123 84 139 -108
5066 -108 67 108 1 154 -56 -37 -103 9 -25 25 -58 -89 -32 7 107 286 -1 -153 130 -10 122 -148 75
5089 75 -103 185 -119 -46 -89 -3 78 -39 45 -60 -34 51 117 -346 71 -55 -6 239 -142 5 29 -63 -119 8
5113 8 -52 86 -233 -126 86 -43 -19 80 213 142 -77 -174 144 287 -209 235 145 17 78 -193 44 50 -78 -140
5137 -140 -108 -149 -178 19 -108 343 -62 65 -95 -233 -38 -66 237 129 -95 87 143 -28 -72 41 -42 89
5159 89 35 237 -192 11 130 46 212 174 -130 -264 -232 -259 20 -49 -288 -37 97 37 91 110 -145 -155 -77 -86 56
5184 56 16 -63 132 171 -189 -98 6 126 203 25 -136 85 -151 107 71 28 -73 -34 91 112 173 2 -31 38
$$ packed form
5019A55r2l7J66q1no6j15K10j63M4J15j16J97k36M1j6k87K82O8j46o5K15J9q4
5043Cl1k07J49J27k14P4K61k13n1LJ33k8J91k40o1J66j33k19M65k98K07N5k47
5066a08J75M1j07J53k10J9o6J12l4N0q3l1N7L9J00J79k87j52K83j40J32k70K23
5089G5j78K88l04P3m3Q6Q1j17Q4j05K6Q5O6m63M17j26M9K45l81J47K4r2n6J27
5113Ho0J38l19J07K12j29K4R9J33p1k19r7L18J43m96M44r0j28O1k71K37Oj28o2
5137a40L2m1k9J97j27M51m05J27j60j38J95k8L03j08k24J82N6j71m4J13q3J31
5159H9n4K02m29K03J19q4J66l8l04j34L2k7K79o9k39K51J34o0N4J9k55j0P8rJ42
5184E6m0p9J95L9l60R1J04J20P7j78j61K21k36K58l6m3j01L9J25K1O1j71l3O9
$$ plain form
5208 38 -57 -34 95 -213 27 11 -211 -184 -290 47 85 -136 -18 70 132 19 -159 50 -103 -23 -112 -18 -23 172
5232 172 208 -22 32 140 -195 -65 -80 0 -89 191 -93 35 19 -110 101 41 -3 -111 76 -283 166 -228 34
5255 34 131 120 96 -18 44 205 60 20 216 -56 -42 72 6 -51 170 81 -50 -85 -112 -180 -68 35 -70 -195
5279 -195 -107 72 -138 89 -6 -56 34 -183 153 130 -126 -98 -131 -104 -267 -72 -39 -132 187 118 109 -86 -236 -115
5303 -115 6 67 -105 5 64 11 -260 -3 77 -25 13 101 -87 -39 -141 -9 262 -62 -120 131 -139 -91 108
5326 108 30 -30 4 -109 -76 138 -112 122 168 -45 93 -175 -8 -198 93 -175 -204 265 -125 124 -57 -33
5348 -33 -28 -318 -136 4 -197 -14 161 55 -13 -32 85 135 -218 3 278 -83 -158 78 83 -8 107 -20 315
5371 315 197 -74 277 -48 289 -123 -81 21 234 224 41 -32 91 136 -77 -307 -31 -263 -78 212 2
$$ packed form
5208C8r5K3J29l08K40j6k22K7j06L37L8k21J18Q8O2j13j78K09j53Q0q9R4nJ95
5232A72L6k30N4J08l35J30j5Q0q9K80k84J28j6j29K11o0m4j08J87l59M49l94K62
5255C4R7j1k4j14O2J61j45m0J96k72J4J14o6n7K21q9j31l5k7o8J12J03j05j25
5279a95Q8J79k10K27r5n0R0k17L36k3k56K8l3K7j63J95L3r3L19o9rj95j50J21
5303a15J21O1j72J10N9n3k71K57Q0j02L8Q8j88M8j02J32K71l24n8K51k70M8J99
5326A08p8o0L4j13L3K14k50K34M6k13J38k68J67j90K91k68k9M69l90K49j81K4
5348c3Nk90J82J40k01J83J75j06o8j9J17N0l53K21K75l61p5K36Nr1J15j27L35
5371C15j18k71L51l25L37m12M2J02K13j0j83p3J23M5k13k30K76k32J85K90k10
$$ plain form
5392 2 -90 64 -79 -2 -28 -22 160 277 -62 -102 -14 107 -204 108 113 284 6 60 -91 -144 -2 64 300 -63 110
5417 110 -198 -214 -119 192 -28 -150 -29 -186 -272 97 57 1 94 129 -145 -237 -22 -27 -72 -216 -72 132 68 254
5441 254 145 -2 -62 195 -156 28 122 -83 41 -172 -10 46 -12 -6 118 -238 217 -169 -40 44 125 -70 -97
5464 -97 91 25 246 -55 -54 -177 12 2 190 64 -178 16 59 -21 -12 267 112 -108 98 76 -30 -20 -125 -4
5488 -4 72 -224 189 229 -171 310 -122 147 75 -146 -82 -52 186 -219 121 61 104 26 -207 -139 155 67 -323 -12
5512 -12 -80 138 7 62 34 -41 -96 -48 72 -90 119 206 9 -162 -126 -106 102 -7 103 -38 -47 13 58 -117 109
5537 109 -107 50 160 22 -8 106 -37 -109 -35 2 26 118 -45 -274 -72 -139 -143 117 -129 -121 -186 45 11 -181
5561 -181 -194 -188 -601 37 -201 -86 120 -11 -321 -101 68 -51 -159 95 -121 -355 -13 -241 93 -200 -18
$$ packed form
5392Br2J54j43P7k6OJ82J17l39m0Q8J21l11L12NJ71k78N4j51n3J42O6K36l63J73
5417A10l08j6R5L11k20j22J21j57q6L69m0n6R3L5k74r2K15nm5j44J44K04o4J86
5441B54j09j47o0K57l51J84R4k05J24k13J62N6n8OJ24l56M55l86J29Q4Q1j95k7
5464i7J88o6K21l01Jj23J89j0J88j26k42J94M3q0RK79j55k20K06k2j06J0j05J21
5488dP6k96M13M0m00M81m32K69p2k21O4L0K38m05L40o0M3p8k33O8K94q8l90L11
5512a2o8K18j31N5k8p5n5M8J20j62K09Q7j97j71L6K0K08j09J10j41rO0M5j75K26
5537A09k16J57J10j38l0J14j43p2P4L7K4R2j63k29K02o7mK60k46Qo5K31l4j92
5561a81j3Om13O38k38J15K06j31l10K20J69j19j08K54k16k34L42k28L34k93J82
$$ plain form
5582 -18 -61 158 129 214 180 -244 -67 12 -166 12 -98 -39 -108 -121 1 -136 194 74 168 165 -191 151 89 65 -181
5607 -181 -188 223 134 79 -67 -116 82 -28 41 306 -116 -168 9 -94 83 -126 -29 -294 -169 39 15 -12 42 61
5631 61 -112 52 -174 187 3 -221 -155 -24 -116 320 -145 27 11 132 -18 75 65 -238 -132 -153 -132 94 102
5654 102 35 -116 -162 22 -231 101 -174 52 -85 -164 74 -107 -168 -41 -8 229 -12 -41 127 -89 -31 44 248
5677 248 101 144 -40 163 130 -66 -24 -79 11 -38 19 -46 -156 43 -261 60 -176 180 67 -40 34 -53 -128 86
5701 86 39 -81 -64 -30 -197 10 116 -179 108 111 91 -226 192 38 -25 77 -61 -55 120 13 48 -31 88 -195
5725 -195 10 88 -27 170 -183 -195 53 -31 49 36 -37 4 -288 -46 -47 -205 75 -88 -87 -45 122 74 259 135
5749 135 -255 105 47 -25 84 227 -75 -27 -183 -8 54 -184 16 -171 -28 -111 -63 126 158 -203 69 -47
$$ packed form
5582a8m3K19k9Q5l4m24J77P9j78J78j10N9o9j3J22j37L30j20R4ll56L42o2k4k46
5607a81pM11q9n5j46m9J98j10O9K65m22n2J77j03J77k09R7k65J25K08k4k7N4J9
5631F1j73J64k26L61j84k24O6J31r2M36m65J72j6J21j50R3j0l03J06k1K1K26Q
5654A02o7j51m6J84k53L32k75K26j37p9K38j81o1J27L3K37k41k9J68k16N8P5K04
5677B48j47M3j84K03l3j96M2n5R0m9N7o5j10J99l04L21k36L56j13j07P4q7p5K14
5701H6m7j20J7L4j67K07J06k95K87Lk0l17M18j54o3J02j38OJ75j07L5p9J19k83
5725a95K05P8j15J97l53j2K48q4Q0j3p3M1k92K42jj58K80j63JM2J67m8J85j24
5749A35l90L60n8p2J09J43l02M8j56J75O2k38K00j87J43q3M8J89L2l61K72j16
$$ plain form
5771 -47 240 145 -119 -82 -10 -18 -150 128 -177 137 -40 160 12 -203 -74 47 28 -87 -6 199 -82 191 -1
5794 -1 117 12 -261 -99 46 -4 -237 -48 -1 153 223 164 13 165 -110 158 74 -94 55 -108 -182 -220 -63
5817 -63 111 102 23 -22 132 -39 152 136 50 78 86 77 211 -160 -94 -11 -150 -18 -2 271 311 -173 103 -68 -166 43
5843 43 52 -75 -78 -29 80 -69 -155 -177 -102 -217 267 -37 -38 109 -31 179 -203 0 42 -48 -53 -236 119 78 70 -32
5869 -32 29 -243 -11 -133 145 -190 14 77 -210 -198 -56 82 -110 -35 -26 139 150 51 64 2 -191 -322 -70 -153
5893 -153 -27 32 103 109 352 -118 110 97 -56 -38 177 82 -82 159 115 367 48 103 4 13 -86 -17 -142 -52 -327
5918 -327 -13 23 -240 24 -35 31 -177 64 95 -9 169 -274 84 120 204 -204 117 -109 -86 -79 -167 107 -71
5941 -71 197 137 58 -229 -100 292 89 -138 -99 139 -27 -266 137 -32 68 92 135 -56 71 -16 167 -109
$$ packed form
5771d7K87r5k64L7P2qj32K78l05L14j77K00j48k15J29J21j9j15Q1K05k81K73j92
5794aJ18j05k73J62J45n0k33J89M7J54P0n9j51J52k75K68q4j68J49j63p4l8J57
5817f3J74rp9m5J54j71J91j6q6K8QrJ34l71O6Q3j39J32J6K73M0m84K76j71r8K09
5843D3Rj27lM9J09j49q6k2P5j15M84l04jJ47j40K10l82K03M2r0nj83L55m1qj02
5869c2O1k72K32j22K78l35K04O3k87J2J42J38j92P5RJ65J1r9J3o2j93j31K52q3
5893a53J26N9P1OK43m70K28j3j53J8K15r5j64K41m4K52l19N5r9Rr9O9j25R0k75
5918c27L14L6k63K64n9O6k08K41L1j04J78m43L58L6Q4m08L21k26K3Pq8K74j78
5941g1K68o0p9k87J29L92k03k27L9K38j66k39M03j69J00K4M3j91J27q7J83k76
$$ plain form
5963 -109 215 -24 -38 0 -113 27 -107 -42 -37 174 -37 -17 109 108 100 -25 258 -33 121 62 -75 2 -91 136
5987 136 72 163 128 -148 59 -121 179 -10 -180 22 -182 160 -178 -87 161 -100 -25 -40 -68 -20 -167 125 -128
6010 -128 231 -204 81 -18 39 -44 -5 36 21 -144 219 261 -169 -63 -176 68 -45 -112 -245 -33 238 -160 209
6033 209 109 1 199 -71 -71 62 40 -4 9 39 57 54 -118 -72 282 73 16 65 -191 -65 176 -235 -84 -258
6057 -258 83 186 -139 -31 -53 39 -209 87 -61 -114 -57 -67 -121 -24 100 -3 -40 114 -52 -81 93 80 132 50
6081 50 -105 -70 -102 97 207 -5 -64 4 -123 -29 73 -127 29 -148 114 130 -111 -196 -183 -213 237 470 128
6104 128 -24 -22 168 132 35 91 117 -371 22 -68 113 152 -120 -94 99 39 14 -215 -12 -8 60 -288 -97 -49 -87
6129 -87 -78 -95 -399 -97 151 3 -92 -152 -64 -116 78 175 224 14 -244 -29 28 -35 -3 159 -25 124 92 56 -170
$$ packed form
5963a09L24k39j4L8j13J40j34O5NK11k11K0J26jqj25K83k91J54n9j37P7r3K27
5987A36o4R1l5k76K07j80L00j89j70K02k04L42l38R1K48k61P5j5k8M8j47K92k53
6010a28L59m35K85r9N7q3L9M1j5j65L63M2m30J06j13K44j13o7j33K12K71l98L69
6033B09j00j08J98k70%J33k2m4J3L0J8lj72M6L54k09n7M9k56J26K41m11J51j74
6057b58L41J03l25J08k2R2k48K96j48n3N7j0n4R7J24j03l7J54j66k9J74j3N2q2
6081E0j55L5l2J99J10k12n9O8j27R4J02k00J56j77K62J6k41q5J3l0M50K33l42
6104A28j52KJ90l6r7N6K6m88L93r0J81L9k72K6J93o0k5k29K03MO8l48J91M8l8
6129h7Rj7l04L02K48j48r5o0Q8n2J94R7M9k10k58K15N7o3L2J62j84J49l2l6k26
$$ plain form
6154 -170 -92 135 -12 -60 182 -226 -16 232 18 -189 135 -51 -240 57 17 -127 -75 266 -240 -139 -197 -48
6176 -48 64 -104 164 -15 -170 41 125 81 110 -20 123 -12 27 256 165 -62 1 135 140 275 9 143 -169
6199 -169 -195 -84 219 38 -103 91 -92 37 8 172 -19 22 129 102 -243 205 -154 112 205 21 -86 -372
6221 -372 174 96 313 -75 -106 -53 -54 -34 124 -2 63 -128 -16 -37 144 142 56 -35 31 128 128 18 -88 165 106 5
6247 5 -171 125 -151 -30 -66 128 -267 -305 42 -40 -210 -42 47 126 -75 293 -139 138 86 -113 79 -2 206
6270 206 7 176 -120 -302 -260 183 20 142 -198 -113 226 272 -259 -91 -67 169 -131 -256 -122 57 -7 113
6292 113 -223 -37 -102 -177 -90 -27 126 -110 -224 -24 -53 304 -72 -101 73 128 -7 -191 184 -65 -28 -42 -222
6315 -222 -403 -31 124 -55 -34 -224 -70 45 53 -30 183 76 152 -144 38 -17 -50 124 173 -168 -105 -40 9 -134
$$ packed form
6154a70P8K27j47m8K42m08K10K48k14k07L24j86j89K97m0j44N2L41n06J01n8J49
6176d8J12j68K68j79j55K11Q4m4K9j30J43j35L9K29r1k27O3J34NJ35k66J34l12
6199a69k6J11L03j81j41J94j83J29k9J64j91M1J07k7l45M48l59K66R3j84j07k86
6221c72N46p8K17l88l1N3jK0J58j26O5j91J12k1J81kq6r1O6R7%j10j06K53n9j01
6247Ej76K96k76J21l6J94l95l8L47q2j70J68Q9P9k01L68m32K77n2j99J92q1K08
6270B06j99J69k96j82M2M43j63J22l40Q5L39M6n31J68K4K36l00j25J34J79o4J20
6292A13l36J86o5p5Q7O3J53k36j14K00k9L57l76k9J74N5j35j84L75k49L7j4j80
6315b22j81L72J55j79K1j90J54J15Qq3K13j07P6k96J82n5l3J74M9l41O3O5M9j43
$$ plain form
6339 -134 363 -46 -137 -2 -42 56 167 -189 109 2 183 50 68 -54 31 147 -153 104 19 197 -21 -79
6361 -79 41 -83 16 -31 -66 275 75 146 89 25 44 194 163 277 -163 -68 -58 -76 234 -51 1 95 -37 -33 90
6386 90 -42 81 -207 162 -160 216 -52 177 46 89 -90 125 33 88 129 -142 131 61 -88 -243 -35 -82
6408 -82 105 -76 -36 -95 153 -100 263 -69 22 -137 11 67 53 -205 -102 58 -139 199 -11 -121 36 -169
6430 -169 -138 119 239 -51 14 81 110 -231 149 -59 -114 50 112 168 -54 -38 -96 153 -36 -22 -291 -90 -32 166
6454 166 -263 185 -117 -154 141 62 -121 35 165 -141 100 -156 72 39 -37 217 71 58 217 128 25 43
6476 43 -41 117 -64 -48 -351 -166 112 -5 -150 38 41 -126 -135 47 -29 -293 -177 -20 273 -32 -68 40 -24
6499 -24 -234 164 32 16 -33 66 74 143 56 12 62 43 72 -210 -26 10 -90 -80 132 182 81 207 -53 35 290
$$ packed form
6339a34M97m09r1J35m0R8J11l56K98j07J81j33J8j22Q5J16l00K57q5J78k18n8
6361g9J20j24R9m7l5L41k00P1n7o4J9J50l1J14m40R5J0j8L10k85N2R4j32MJ23
6386I0j32J23k88L69l22L76k68K29j31M3j79K15r2N5M1k71K73p0j49j55K08m7
6408h2J87j81M0n9K48k53L63l32R1j59J48N6j4k58J03J60j97L38k10j10J57k05
6430a69L1K57J20k90O5O7K9l41L80k08n5J64O2N6k22J6n8K49j89J4k69K01N8J98
6454A66m29M48l02l7K95p9j83J56J30l06K41k56K28l3p6K54j46j3J59q9j03J8
6476D3q4J58j81J6l03J85K78j17j45J88Lj67rJ82p6k64J16J57K93l05l6J08o4
6499b4k10L98j32j6m9R9QO9q7m4N0j9K9k82J84L6j00J0K12N0j01J26k60Q8K55
$$ plain form
6524 290 -9 52 32 -93 26 20 -214 -115 -206 148 44 59 36 152 112 112 -1 -4 12 26 -110 -87 44 72 182 87
6550 87 -90 -148 -28 -189 34 174 228 149 123 90 214 -57 199 -180 30 -139 -219 213 10 -211 -23 -26 -375
6573 -375 79 -13 -139 113 -99 135 -30 -80 104 17 -23 184 23 33 -91 123 -113 -92 -30 -394 -95 16
6595 16 198 -222 -92 -4 97 18 352 -81 -144 -185 -114 70 -45 214 -93 -68 6 131 -176 142 96 -24 -1
6618 -1 -415 38 295 -34 120 -165 -68 -186 -84 155 117 -92 -81 -151 -99 -170 -16 -125 -73 -255 -177 125 206 -66
6642 -66 12 -151 176 105 -81 -168 41 93 -143 -121 -163 15 189 216 177 126 -15 20 212 154 137 148 -27 -27 -49 144
6668 144 16 283 -151 -119 -58 6 -9 270 135 -58 -40 -11 -58 41 -19 15 30 -69 73 -80 -105 83 262 -40
6692 -40 119 -189 -87 -101 130 31 6 -109 18 -146 83 190 109 96 399 -184 -49 -28 -225 -44 203 -237
$$ packed form
6524B90k99O1k0j25J19ok34R9r1L54j04J5k3J16m0%j13lJ6J4j36K3J31K8J10r5
6550H7j77n8J20j61K23J40N4p9k6l3J24k71K56l79K10j69q0M32k03k21J88ll49
6573c75M54r2j26K52k12K34j65n0J84q7m0K07j61J0j24K14k36K1O2l64K99J11
6595A6J82m20J30Q8J01p9L34m33o3m1P1J84j15K59l07K5P4J25l07L18m6j20K3
6618am14M53K57l29J54k85R7j18J02K39l8k09J1p0N2p1J54j09N2j82P8L02Q1k72
6642f6P8j63L27p1j86q7K09N2k36K2m2J78J74K7l9n1j41L5J92n8j7J1j75%k2J93
6668A44j28K67m34L2O1O4j5K79j35j93J8K9m7R9o0L4J5r9J42j53k5J88J79l02
6692d0J59l08J02j4K31r9k5j15J27j64K29J07q1j3L03n83J35K1j97J81K47m40
$$ plain form
6714 -237 -195 -92 -82 -185 -152 -95 4 153 -189 -44 7 -48 -101 1 133 123 80 -21 100 24 -73 38 177 -113
6738 -113 189 381 -70 72 118 25 -19 44 -4 -47 94 -50 81 -62 -92 -161 78 -95 -211 -64 22 -236 -213
6761 -213 -57 80 72 -97 -34 103 1 -88 -124 -199 -3 -11 154 199 130 -104 -119 -126 241 117 146 114 -99 -96 142 -32
6787 -32 -24 -88 -63 409 -156 1 -60 -61 113 94 16 -118 -80 -117 -117 -80 -73 -92 -174 -12 180 315 -78 66 -103 -242
6813 -242 -73 65 -76 -166 -124 51 88 135 75 -256 -69 55 84 -118 -119 -264 -17 132 121 -26 -139 77 40
6836 40 -240 -43 -10 -267 -418 -46 -91 -145 -33 64 64 -98 -148 -132 0 -76 -235 -155 -57 87 -119 -71 -52 -79 -157
6861 -157 37 -194 -28 94 230 89 -102 86 8 -135 54 -90 -1 96 -71 179 -21 62 74 -167 263 -120
6883 -120 -110 52 -43 6 -139 139 90 202 211 -2 -211 60 227 226 -9 -173 -107 204 175 24 -146 -139 156 46
$$ packed form
6714b37M2J03J0j03L3N7R9J49l42J45N1n5n3J02J32j0m3j01J21p6r7J11J39k90
6738a13L02J92m51J42M6r3m4O3m8m3J41j44J31j43l0o9K39j73j16J47Q6k58K3
6761b13J56J37qj69O3J37j02q9l6p5J96qJ65M5o9k34j5pL67j24K9l2k13LK38j74
6787c2Qo4K5M72n65J57o1jJ74j9p8j34L8l7%L7Pj9q2J62J92J35l93J44j69j39
6813b42J69J38j41r0M2J75L7M7o0l31J87J24K9k02jj45K47J49j1j47j13K16l7
6836D0k80J97L3k57j51L72m5n4J12R7%j62n0J6J32p6j59Q0R8J44k06M8J9k7p8
6861a57J94k31J66J22J36j41j91J88p8j43J89j44Q9R7j67K50k00Q3J2k41M30l83
6883a20J0J62r5M9j45K78m9J12Rk13k09K71J67jk35j64O6L11k9j51j70PK95j10
$$ plain form
6907 46 -157 -55 -88 -7 173 -18 -105 -199 108 -147 -202 -260 -49 -147 -19 14 -189 157 63 278 -30 -105 13 -96
6931 -96 47 141 11 77 143 -170 -245 171 -259 19 68 23 -170 -6 -85 -47 75 -143 117 -117 -54 187 -58
6954 -58 87 33 -58 -57 -226 -114 -176 -146 78 -50 -40 67 -103 -272 -75 -137 -144 29 124 -144 205 -35 -22 -58 -33
6979 -33 -83 191 66 -72 101 17 179 61 -191 39 -294 -209 42 -135 -108 -105 5 -93 161 -94 92 142 184
7002 184 77 143 127 -119 -216 -43 163 -103 28 6 85 125 41 -2 93 329 151 -184 -212 -37 36 106 -224 29
7026 29 54 -105 -154 -75 180 228 11 279 112 56 55 10 -53 206 -48 -24 -341 -11 -109 87 58 27 193 190 121 -60
7052 -60 61 119 -176 -162 16 120 82 -246 -89 -98 187 -117 20 43 -15 -127 10 15 -121 -59 56 23 -162 -56
7076 -56 114 -45 -62 -72 135 188 -171 187 -49 165 22 191 -79 -142 -66 74 292 -49 115 -47 -6 72 -137
$$ packed form
6907D6k03J02l3Q1J80j91q7r4L07k55n5n8K11r8J28L3k03L46r4K15l08p5J18j09
6931i6J43R4j30O6O6l13p5M16m30K78M9m5j93J64p9L8J22k18K60k34O3K41k45
6954e8J45n4r1Jj69J12o2L0K24j28J0J07j70j69J97o2pJ73R5k68L49k40J3l6K5
6979c3n0K74j25j38J73q4J62j18k52K30l33Q5K51j77K7LJ10r8K54k55J86N0M2
7002A84j07O6j6k46r7J73K06k66J31k2P9M0q4m3R5K36j78l35k8J75P3P0l30K53
7026B9K5j59m9P9K55M8k17K68j67n6jm5o3K59k54K4l17L30r8J96k9l1J66lo9j81
7052f0J21N8k95J4J78J04l8l28J57rK85l04J37K3n8j12J37Nj36O2J15l3j85J06
7076e6J70j59j7j0K07N3l59L58k36K14j43J69k70o3P6J40K18l41J64j62M1P8k09
$$ plain form
7099 -137 -108 94 150 -83 146 225 177 -107 -208 -15 71 -119 280 -27 -36 41 164 -124 -134 59 70 -87 -261
7122 -261 -26 102 79 -2 -15 -2 -197 279 -64 -188 150 244 -51 -9 41 72 68 -57 192 -186 110 -185 216
7145 216 -117 -146 146 256 145 -329 275 320 78 -11 172 76 42 14 58 20 53 -58 -116 -40 13 77 -63 -168
7169 -168 -132 -196 -89 -178 -140 71 -102 -236 -88 -98 -216 -39 -61 -409 80 85 7 5 32 108 137 -9 54 93 109 -212
7195 -212 134 23 -51 -190 -24 -97 0 -103 162 60 -17 30 34 -209 -102 -44 31 183 267 -239 -116 13 4 15
7219 15 -88 98 -133 233 3 212 -102 -116 -47 -227 22 128 86 -46 -214 -140 -39 76 -84 -336 154 -28
7241 -28 54 50 13 64 -23 -49 137 -29 145 81 -64 -108 -186 136 52 35 143 92 111 27 16 195 -11 23 -90 -81 -258
7268 -258 43 27 12 297 -131 -217 143 7 44 -102 116 -80 -96 -125 34 -43 36 60 -146 -4 -2 -1 86 -37 44
$$ packed form
7099a37K9K02N6k33K29P9m8k84j01J93Q6j90L99l07rP7J23k88j0J93J1j57j74
7122b61K35J28k3q1j3J3j95M76l43j24L38R4k95M2N0L1mj25K49l78K96k95M01
7145B16l33k9K92J10j11m74O04M5k42q9J83r6l4k8M4l8L3j11n8P6N3O4j40j05
7169a68L6o4J07q9L8K11j73j34J48j0j18J77k2l48M89Np8kK7P6K9j46O3L9J6l21
7195b12L46j11p4j39J66p3R7j03K65j02p7M7Mk43J07N8P5J52Q4n06J23J29rJ1
7219A5j03J86k31L66k30K09l14j4O9j80K49J06m2j32j68P4J01J15j60k52M90j82
7241b8Q2ml7N1q7k6J86j66J74o4j45m4p8L22q4j7J08n1J9q4j1J79k06L4j13Rj77
7268b58L01j6j5K85m28q6L60j36L7j46K18j96j6k9J59p7P9K4k06J42KJQ7j23Q1
$$ plain form
7293 44 -213 13 111 126 -33 45 9 0 261 39 -187 138 120 236 -105 -233 -1 37 44 139 4 -90 -15 136 122
7318 122 114 64 -274 -131 -77 -148 66 116 -228 27 59 -11 25 -17 -224 -183 110 -65 106 296 -52 9 91 -62
7342 -62 -91 -218 -127 -83 132 178 -29 -307 -20 105 213 -29 49 39 -194 -169 76 132 107 -83 111 202 139 171
7366 171 -69 201 127 -271 100 17 -19 -135 -104 -130 75 73 -506 150 115 -18 17 -134 -79 223 148 137 242 -134
7390 -134 68 -250 -54 -53 -47 148 10 21 -79 -119 -161 -28 -270 238 86 -36 52 146 152 95 49 -259 -168 -209 0
7415 0 -75 157 -117 26 129 48 87 76 237 -38 252 0 -22 107 -1 -200 102 10 90 -45 -13 -382 -56
7438 -56 93 -98 -32 -140 -2 76 75 159 -78 -90 -219 91 291 16 -109 135 139 -130 79 -85 80 0 14 30
7462 30 202 -63 -122 -303 -102 137 128 115 -143 -10 234 61 105 -171 24 36 -47 -60 -137 166 139 22 151 170
$$ packed form
7293D4k57K26R8J5j59P8l6rK61k22k26L25j8J16l41j28K32L8PR5j35r4P5J51j4
7318A22qn0l38J43N4p1K14N0l44K55L2p0L6m2k07M1K93j75J71J90l48O1Q2j53
7342f2k9j27R1M4K15M6k07k78K87J25J08k42P8j0k33K5K45N6k5j90J94R1o3L2
7366A71k40K70p4l98L71q3l6j16L1k6K05kn79O56l5j33L5j51N5L02p5j1J05l76
7390a34K02l18J96JOJ95j38J1j00m0m2J33k42N08j52j22Q8R4On7m6l08R1m1K09
7415@p5K32k74J43J03q1L9j1J61k75K90k52k2J29j08j99L02r2Q0j35L2l69L26
7438e6J49j91O6j08J38P8jQ4k37j2j29L10K00k75j25K44Mk69K09j64J65q0J4J6
7462C0J72k65n9j81K01K39rj3k58J33K44j73M4k76J95J2q3j3p7L03k7j17J29J9
$$ plain form
7486 170 -21 -37 27 -78 54 99 80 -35 62 12 -13 54 -146 92 126 -108 95 83 -209 109 -53 -14 22 89
7510 89 160 -78 -135 59 -208 -19 373 66 196 205 -52 167 71 111 -31 -1 -66 -243 -73 -86 13 -101 -63 -83
7534 -83 22 -65 44 -100 -150 62 -200 109 22 -196 308 -11 53 -206 -175 51 -12 53 -48 -145 -207 -158 -138 -72
7558 -72 -86 -165 -32 -86 0 -126 29 -10 -140 289 194 196 206 104 -60 -4 25 -73 -46 -100 -9 147 -133 -61 21 -83
7584 -83 50 61 187 -70 160 85 51 -137 -78 29 191 -328 -214 4 -114 77 -100 -61 77 -19 -30 40 161
7607 161 -69 -35 -164 233 -71 286 -338 169 -31 -49 112 106 171 -45 124 185 -30 -103 -38 2 -229 -8 49
7630 49 92 -50 43 82 99 132 112 -116 -99 -174 40 124 139 78 181 53 145 65 -140 84 144 160 188 76 -27 -96
7656 -96 39 -216 -29 86 -186 152 -41 5 141 109 -34 206 -4 -405 -106 -23 -118 -50 8 65 107 33 113 -195
$$ packed form
7486A70j91j6O4j05J32M5j9j15R7n0k5O7k00K38L4k34K03j2k92L18j62L9L6O7
7510H9P1k38n7J94k67J89L92l07J30Rk57K19r6M0j42L0o5j77J70j3R9j14L8k0
7534h3J05q7J09j44n0K12k62L09q7k18N04l19O4k59L1K26o3O5j01r7o2M9K0O6
7558g2j4p9J33n4Q6j26J55l9j30M29r5KJ0j02j64N6K9r8K7n4R1J56k80P2Q2j04
7584h3J33J1J26k57K30p5l4j88N9J07J62n19J14K18j18J91j77L9J38r6j1P0J21
7607A61k30L4j29L97l04L57o24N07k00j8J61oO5k16J69O1k15p3O5M0k31K21N7
7630D9M3j42R3L9J7L3k0k28J7p5K14Q4J5o1J03j28R2q0k05K24O0J6K8j12j03o9
7656i6J35k55J87J15k72L38j93M6J36l2j43K40k10m01K99Q3r5O8N8N7M2p4Q0l08
$$ plain form
7680 -195 184 -106 285 -139 63 15 -80 -106 -81 -17 -69 234 16 3 26 74 10 47 51 100 -292 -126 -16 -48 75
7705 75 211 26 114 -64 33 -180 -232 126 186 -45 -84 89 21 177 -56 124 -34 -55 -90 110 -48 21 172
7728 172 42 -7 44 -244 -53 -27 21 47 306 -60 304 160 73 3 147 -309 -111 -13 -194 365 205 141 -20
7751 -20 -27 18 -146 -157 182 55 95 -50 48 -100 -50 121 71 137 -74 149 221 -100 189 -13 -89 79 202 -308
7775 -308 -24 -340 -110 79 -353 64 11 222 -21 70 32 143 220 411 -241 88 169 -40 169 -149 88 -48
7797 -48 100 -17 -10 126 28 82 126 27 61 144 -180 -30 90 -191 128 -31 -169 18 45 -115 182 -104 -172 -66
7821 -66 171 34 -26 80 68 366 -8 56 82 39 -5 165 31 -75 86 60 248 169 28 138 -55 -171 -61
7844 -61 -31 154 160 -114 -90 -6 410 -163 -119 -166 -139 23 -227 21 10 116 -110 65 3 272 -84 53 8 270
$$ packed form
7680a95L79k90L91m24K02m8r5k6K5O4n2L03k18j3K3M8o4L7MM9l92J66J10l2J23
7705G5J36j85Q8j78R7k13n2L58O0k31l9J73o8J56k33J80j58k1l5K00j58O9J51
7728A72j30m9N1k88J91K6M8K6K59l66L64j44q7p0J44m56J98R8j81N59j60o4j61
7751b0pM5j64j1L39j27M0j45R8j48N0J71n0O6k11K23P2l21K89k02p6J68J23n10
7775c08K84l16K30J89m32M17n3K11k43R1l8J11P7J91o52L29Q1k09K09l18K37j36
7797d8J48j17PJ36r8N4M4r9L4Q3l24J50J20k81L19j59j38J87K7j60K97k86o8J06
7821f6K37j37o0J06j2K98l74O4K6m3m4J70j34j06J61k6J88p9j41J10j93j16J10
7844f1L0J85Ok74K4Q4M16n73M4m7K7J62k50K48j1J06k26J75o2K69l56J37m5K62
$$ plain form
7868 270 -126 -66 -19 126 -46 91 367 249 134 -177 -91 -428 -167 322 -339 277 280 98 44 90 41 195 -19
7891 -19 103 -123 -189 8 30 -5 46 237 104 -73 -187 81 -134 224 -174 -197 103 37 -16 -48 -107 166 66
7914 66 -25 -126 82 91 -59 -25 -173 -243 -149 -180 -197 138 -42 26 -52 53 -250 2 191 -235 -111 -194 13 100
7938 100 81 -61 19 71 -37 -249 -3 -307 57 299 -125 -154 65 335 -47 -207 140 12 169 167 78 182
7960 182 138 -73 -118 -57 93 -132 -61 89 221 112 65 30 117 98 -47 -63 66 -117 144 -44 -69 -147 -48 -151
7984 -151 254 -43 -195 102 17 205 -164 -30 -70 20 -347 -72 151 205 -40 -39 -223 70 -280 -120 -27 266
8006 266 26 19 -91 210 19 -18 -52 -259 -64 -213 145 59 213 87 99 31 -184 -125 29 207 -75 -23 131
8029 131 115 3 21 161 64 -3 -135 -191 144 59 -219 -96 22 275 -318 -26 237 -40 41 -103 -119 189 -243
$$ packed form
7868B70l96O0M7J45j72J37K76j18j15l11Q6l37K61M89o61O16Lj82n4M6m9J54k14
7891a9J22k26o6J97K2l5N1J91j33j77j14K68k15L58l98k3L00o6n3l2n9K73j00
7914F6r1j01K08Rj50L4j48p0R4l1j7L35j80O8p8J05l03K52J89m26J24q3K07Q7
7938A00j9j42Q0N2j08k12K46l04L64K42m24k9K19K70l82j60L47j28J57kq9J04
7960A82m4k11m5O1J50k25P1J50J32j09m7l5Q7j9j45j6J29j83K61j88k5p8R9j03
7984a51M05k97j52K97q5J88l69J34m0R0l67K75K23N4k45Jj84K93l50J60R3K93
8006B66k40pj10L01j91l7l4k07J95j49L58q6J54j26J2o8k15N9J54J78k82N2J54
8029A31j6j12J8J40r7o7j32n6L35q5k78J23J18K53n93K92K63k77Q1j44j6L08m32
$$ plain form
8052 -243 338 26 5 152 -47 -277 124 -201 13 -33 62 84 44 151 -169 184 -23 324 108 345 105 34
8074 34 171 257 -57 -55 102 -104 41 -16 83 15 196 -189 -35 178 49 99 -136 -35 0 50 -226 -58 28 190
8098 190 -46 138 4 27 -135 -44 51 131 15 -66 261 -212 105 -48 -92 -15 286 225 176 -2 -42 89 -331
8121 -331 95 -107 73 62 -229 -124 132 -93 84 81 186 -90 81 175 -71 198 24 54 -162 46 -151 216
8143 216 -74 -65 -101 163 223 103 0 250 274 20 54 86 -64 31 -35 -119 117 213 19 -139 -130 -48 -41 -244 255
8168 255 -88 -34 -177 146 -47 -24 -92 -174 -64 -42 -61 -39 59 175 -263 5 -233 206 -201 -3 -12 197 47
$$ packed form
8052b43N81l12k1J47j99k30M01l25K14m6R5K2m0J07l20L53k07L47k16K37k40p1
8074C4J37Q6l14KJ57k06J45n7R9o8J81l85J54K13j29N0k35J01L5N0k76J68Q6J62
8098A90k36J84j34K3j62R1R5Q0j16q1L27m73L17j53m4P7L01o1m9j78m0J31m20
8121c31M26k02J80j1k91J05K56k25J77lJ05k76J71R4k46K69j74L0k16K08j97L67
8143B16k90Rl6K64O0j20j03K50K4k54L4L2j50R5o6q4K36R6j94j58RQ2Pk03M99
8168B55l43N4j43L23j93K3o8q2J10K2j9K2R8J16m38K68k38M39m07J98rK09j50
8191D7
$$ Imaginary data points
##PAGE= N=2
##DATA TABLE= (X++(I..I)), XYDATA
$$ plain form
0 0 0 0 0 0 0 0 0 0 0 0 0 0 0 0 8 -8 8 -8 8 -16 16 -17 24 -25 32 -38 42 -49 57 -68 76 -86 100 -111 125 -141
36 -141 160 -180 200 -224 249 -279 308 -341 378 -420 461 -510 561 -617 679 -749 825 -911 1006
55 1006 -1113 1232 -1371 1532 -1720 1942 -2214 2555 -2991 3577 -4411 5704 -8009 13453 -56615
70 -56615 -34863 -65347 -116326 4179 -93645 -196713 -102795 -75748 -134554 -68919 -75683 -98104
82 -98104 43225 108858 26378 85311 141871 58029 60246 114550 49209 38611 86125 45692
94 45692 35652 72816 14331 -14257 17234 -51666 -113582 -71786 -86781 -110174 -47118 -39630
106 -39630 -54546 18341 26268 -19121 43650 66306 -11244 12657 68303 31198 47272 91430
118 91430 42825 37281 76798 13609 -31098 1545 -43711 -86341 -34174 -46161 -89853 -25231
$$ packed form
0@%%%%%%%%%%%%%%Qj6J6j6J6k4L2l3M1m9N7p0Q0r1J06j25J44j62J86k11K36k66
36a41L01l40L80m24M73n28N87o49P19p98Q81r71J071j178J296j428J574j736J917
55A006k119K345k603K903l252L662m156M769n546O568p988J0115j3713K1462p0068
70e6615K1752l0484n0979J20505r7824j03068R3918K7047n8806O5635o764k2421
82i8104J41329O5633q2480N8933N6560q3842K217N4304o5341j0598M7514m0433
94D5692j0040L7164n8485k8588L1491o8900o1916M1796j4995k3393O3056P488
106c9630j4916P2887P927m5389O2771K2656p7550K3901N5646l7105J6074M4158
118I1430m8605n544L9517o3189m4707L2643m5256m2630N2167j1987m3692O4622
$$ plain form
130 -25231 6274 -44704 -30322 -3995 -33042 -17146 6229 -24143 -526 50401 32995 35429
142 35429 75709 56704 34865 50151 23014 -9100 5940 -3030 -23335 -4587 -7114 -24422
154 -24422 -5451 -8738 -37774 -27850 -25490 -47411 -29662 -8274 -16996 6840 36214 22966 29720
167 29720 48838 22509 10543 27534 4336 -14458 7899 1863 -15727 4667 953 -27403
179 -27403 -18072 -17090 -46886 -41001 -24146 -36867 -25595 3117 1768 8191 33585 29942 20144 31447
193 31447 27253 15392 24608 26367 18166 25048 27677 15775 11286 4925 -11933 -22031 -30022 -40030
207 -40030 -39934 -35839 -34414 -24882 -16341 -14348 -7631 -2082 -5109 -1263 6251 4865 11980 25927 27718
222 27718 31101 40746 34982 24819 24467 13403 -3970 -6037 -9548 -20456 -18409 -13315 -19766 -18533
$$ packed form
130b5231L1505n0978J4382K6327k9047J5896K3375l0372K3617N0927j7406K434
142C5429M0280j9005k1839J5286k7137l2114J5040q970k0305J8748k527j7308
154b4422J8971l287k9036R924K360k1921J7749K1388q722K3836K9374j3248O754
167B9720J9118k6329j1966J6991k3198j8794K2357o036j7590K0394l714k8356
179b7403R331R82k9796N885J6855j2721J1272K8712j349O423K5394l643r798J1303
193C1447m194j1861R216J759q201O882K629j1902m489o361j6858j0098p991j0008
207d0030R6M095J425R532Q541J993O717N549l027L846P514j386P115J3947J791
222B7718L383R645n764j0163l52j1064j7373k067l511j0908K047N094o451J233
$$ plain form
236 -18533 -12689 -19683 -24173 -18296 -19382 -20068 -9818 -1896 2715 14976 23804 23591 25107 26413 21310
251 21310 15344 12053 7559 4536 4544 3974 1453 -1547 -3171 -7285 -14783 -19802 -21901 -24480 -23665 -17561
267 -17561 -12733 -8216 1848 7856 7548 10316 12517 9049 7877 10806 8748 8529 14051 14148 10871 10683
283 10683 7911 334 -4496 -8360 -15109 -17366 -14447 -13285 -11874 -6427 -3188 -2269 -118 695 -1690
298 -1690 -1781 1403 2700 3169 7415 12147 12407 13120 13347 8536 2638 843 -3272 -9315 -9666 -7300 -7987
315 -7987 -6817 -2699 -3673 -4541 -1733 -3851 -7216 -3975 -1678 -1726 3413 9088 9385 11000 14827 11400
331 11400 6032 5349 2128 -3631 -3964 -3510 -5957 -5105 -2201 -3819 -5832 -5195 -6847 -9785 -8988 -7485
347 -7485 -7087 -3546 2585 4874 6749 10538 11409 9119 8398 6916 3493 2689 3813 2223 1083 2895
$$ packed form
236a8533N844o994m490N877j086o86J0250P922M611J2261Q828k13J516J306n103
251B1310n966l291m494l023Qn70k521l000j624m114p498n019k099k579Q15O104
267a7561M828M517J0064O008l08K768K201l468j172K929k058k19N522R7l277j88
283A0683k772p577m830l864o749k257K919J162J411N447L239R19K151Q13k385
298a690r1L184J297M69M246M732K60P13K27m811n898j795m115o043l51K366o87
315g987J170M118r74q68K808k118l365L241K297m8N139N675K97J615L827l427
331A1400n368o83l221n759l33M54k447Q52K904j618k013O37j652k938P97J503
347g485L98L541O131K289J875L789Q71k290p21j482l423q04J124j590j140J812
$$ plain form
363 2895 2183 -994 -2274 -4354 -8940 -11012 -10343 -11455 -10722 -6432 -3659 -2019 1193 3458 2926 3893
379 3893 4686 3589 3226 5103 6446 6252 7892 9017 6701 4400 3217 -58 -4136 -5372 -6088 -8112
395 -8112 -7147 -4843 -4869 -3831 -920 -1764 -3420 -1214 -1177 -2586 -181 2203 1656 4052 7578 5813 4890
412 4890 6292 3283 81 119 -1250 -3781 -2452 -1049 -2790 -1775 142 -1766 -2475 -1923 -3227 -3987
428 -3987 -2302 -1221 -811 1324 3323 4231 4765 4680 3748 2867 1242 537 -131 -1164 -754 733 -306 -612
446 -612 517 -1658 -3290 -2259 -3351 -5307 -2969 -1774 -2658 418 3278 1653 2831 4689 1749 -44
462 -44 2176 133 -1964 996 1317 -923 1153 1633 -1318 -1555 -677 -3812 -4041 -1992 -3163 -2780 609
479 609 1775 1142 3890 4011 2371 2747 2660 585 1053 1660 967 1577 1913 1521 1008 -93 -1654 -2899
$$ packed form
363B895p12l177j280k080m586k072O69j112P33M290K773J640L212K265n32R67
379C893P93j097l63J877J343j94J640J125k316k301j183l275m078j236p16k024
395h112R65K304k6J038K911q44j656K206L7j409K405K384n47K396L526j765r23
412D890J402l009l202L8j369k531J329J403j741J015J917j908p09N52j304p60
428c987J685J081M10K135J999R08N34q5r32q81j625p05o68j033M10J487j039l06
446f12J129k175j632J031j092j956K338J195q84L076K860j625J178J858k940j793
462d4K220k043k097K960L21k240K076M80k951k37Q78l135k29K049j171L83L389
479F09J166o33K748J21j640L76q7k075M68O07o93O10L36l92n13j101j561j245
$$ plain form
497 -2899 -3833 -5370 -4987 -4290 -4152 -2332 -850 -789 89 1443 342 5 1373 373 746 3251 3432 2737
515 2737 5131 5220 2505 2791 2067 -1487 -1838 -1153 -3469 -3700 -972 -1798 -2786 -276 -268 -2363 -1228 -735
533 -735 -2744 -1410 596 460 1315 3895 3690 3136 3671 2307 531 342 -631 -1620 -1523 -1344 -952 -723 -502
552 -502 -695 -1312 -2013 -2542 -2361 -3043 -2226 -400 364 1585 2956 3468 2607 2959 2440 589 611 966 -338
571 -338 85 1213 402 135 1224 -25 -2108 -1855 -2206 -3854 -3063 -1578 -1993 -790 1969 1606 1251 2272
589 2272 1684 193 483 581 -386 580 1688 732 1279 1995 535 -919 -960 -2226 -3586 -2901 -2597 -2627 -989
608 -989 245 736 965 1574 1283 772 799 780 1026 1290 2007 2660 2742 2446 2522 1208 -132 -1214 -2384 -3932
628 -3932 -3529 -2731 -3073 -2223 -669 -892 -912 -239 -1059 -1742 -369 -24 43 1785 3147 3003 3793 4692 3329
$$ packed form
497b899r34j537L83O97J38J820J482O1Q78J354j101l37J368j000L73K505J81o95
515B737K394Q9k715K86p24l554l51O85k316k31K728q26r88K510Qk095J135M93
533g35k009J334K006j36Q55K580k05n54N35j364j776j89r73r89R7J79L92K29K21
552e02j93o17p01n29J81o82Q17J826P64J221J371N12q61L52n19j851K2L55j304
571c38M23J128q11k67J089j249k083K53l51j648P91J485m15J203K759l63l55J021
589B272n88j491K90R8r67R66J108r56N47P16j460j454m1j266j360O85L04l0J638
608i89J234M91K29O09k91n11K7j9K46K64P17O53Q2k96P6j314j340j082j170j548
628c932M03P98l42Q50J554k23k0O73q20o83J373L45O7J742J362j44P90Q99j363
$$ plain form
647 3329 2087 2426 726 -1438 -903 -1257 -2212 -1135 -455 -1913 -1538 -1119 -2807 -3257 -2608 -3046 -2573 -1108
665 -1108 71 876 2852 3208 3022 2875 3065 1891 1150 1239 608 812 1141 1116 949 0 -541 -1343 -2801
684 -2801 -3651 -3499 -3552 -3304 -2202 -863 -474 946 1575 1068 1080 1672 891 591 1653 1890 2044 2997 3242
703 3242 2136 1888 949 -848 -1710 -1865 -3222 -3116 -2322 -1798 -1872 -741 -267 -944 -358 -359 -1047 -578 518
722 518 508 1349 2756 2978 2973 3174 2369 1217 289 -340 -1186 -1596 -1296 -1224 -1118 -1126 -813 -1090 -1544 -1771 -2061 -2002
744 -2002 -1804 -726 -222 944 2410 2775 2811 3090 2240 1145 752 161 -445 -297 33 -22 -110 147 -685 -1518
764 -1518 -1761 -2452 -2864 -2998 -1934 -1628 -816 987 1411 1781 2628 1899 1554 1220 1210 707 768 1530 1511 1575 1413
785 1413 966 -331 -813 -1579 -2815 -2896 -3004 -2617 -2084 -1218 -401 -67 564 594 117 219 379 745 1168 1960
$$ packed form
647C329j242L39j700k164N35l54r55J077O80j458L75M19j688m50O49m38M73J465
665a108J179Q05J976L56j86j47J90j174p41Q9o31K04L29k5j67r49n41q02j458
684b801q50J52n3K48J102J339L89J420O29n07J2N92p81l00J062K37J54R53K45
703C242j106k48r39j797q62j55j357J06P94N24p4J131M74o77N86jo88M69J096
722E18j0Q41J407K22nK01q05j152r28o29q46m10L00P2J06qL13k77m54k27k90N9
744b002J98J078N04J166J466L65L6K79q50j095l93n91o06J48L30n5q8K57q32q33
764a518k43o91m12j34J064L06Q12J803M24L70Q47p29l45l34j0n03O1P62j9O4j62
785A413m47j297m82p66j236q1j08L87N33Q66Q17L34O31L0m77J02J60L66M23P92
$$ plain form
805 1960 2138 2816 3085 2470 2130 1037 318 -1084 -1793 -2019 -2171 -1985 -1733 -1308 -1369 -1129 -1014 -1324 -1640 -1103
825 -1103 -1096 -905 562 1583 1807 2821 3068 2737 2267 1795 993 117 -120 -406 -765 -355 -209 -553 -890 -987
845 -987 -1649 -2370 -2515 -2159 -2421 -1541 -431 229 1100 1722 2019 1705 1785 1566 815 766 961 876 1084 1445 775
866 775 786 284 -387 -1513 -2050 -2433 -2646 -2587 -1759 -1370 -869 140 544 349 844 584 289 381 879 1261 1464
887 1464 2105 2029 1686 1527 991 279 -653 -1150 -1684 -2365 -1635 -1111 -1392 -830 -302 -613 -355 -535 -769 -773 -169
908 -169 239 834 1578 2024 1877 2030 2001 1125 521 179 -500 -851 -910 -702 -668 -574 -539 -899 -1195 -1418 -1448 -1739
930 -1739 -1501 -707 -369 383 974 1296 1716 2000 1582 1065 1313 692 227 261 188 260 193 331 -103 -823 -1161
951 -1161 -1494 -2000 -2020 -1495 -1456 -813 -308 209 513 1307 854 647 965 887 753 718 814 1149 1331 1154 1083 518
$$ packed form
805A960J78O78K69o15l40j093p19j402p09k26j52J86K52M25o1K40J15l10l16N37
825a103PJ91J467J021K24J014K47l31m70m72q02q76k37k86l59M10J46l44l37r7
845i87o62p21j45L56k62Q80J110O60Q71O22K97l14Q0k19p51m9J95q5K08L61o70
866G75J1n02o71j126n37l83k13N9Q28L89N01J009M04j95M95k60k95R2M98L82K03
887A464O41p6l43j59n36p12r32m97n34o81P30N24k81N62N28l11K58j80k34mO04
908a69M08N95P44M46j47J53k9q76o04l42o79l51n9K08L4R4L5l60k96k23l0k91
930a739K38P94L38P52N91L22M20K84m18n17K48o21m65L4p3P2o7J38m34p20l38
951a161l33n06k0N25L9O43N05N17L04P94m53k07L18p8j34l5R6L35J82j77p1n65
$$ plain form
973 518 47 -661 -1261 -1724 -1839 -1714 -1906 -846 -684 -857 -307 -284 -287 -424 215 214 243 1043 1255 1441 1751 1888
995 1888 1385 1120 469 -30 -527 -800 -659 -1027 -1146 -869 -558 -699 -742 -957 -1230 -1208 -1037 -620 38 265 646
1016 646 1126 1669 1599 1295 1247 896 374 40 85 -105 -179 47 -255 -267 -342 -527 -1183 -1317 -1436 -1381 -1184 -599
1038 -599 -307 24 806 639 892 877 708 292 616 761 547 593 688 926 630 276 64 -378 -707 -1036 -1102
1059 -1102 -1182 -968 -961 -490 -102 37 134 113 229 239 71 461 513 514 721 1186 937 991 598 350 -201 -288 -731
1082 -731 -883 -933 -556 -662 -420 -449 -322 25 -59 -170 -532 -204 -44 291 587 971 1019 1142 1396 716 403
1103 403 56 -187 -432 -245 -339 -459 -351 -303 -394 -292 -767 -594 -664 -654 -438 -361 94 416 525 784 697 749 720
1126 720 521 527 149 166 300 237 252 -184 -114 1 -644 -464 -663 -822 -766 -648 -556 -246 198 52 573 696 563
$$ packed form
973E18m71p08o00m63j15J25j92J060J62j73N50K3lj37O39jK9Q00K12J86L10J37
995A888n03k65o51m99m97k73J41l68j19K77L11j41m3k15k73K2J71M17O58K27L81
1016F46M80N43p0l04m8l51n22l34M5j90p4K26l02j2p5j85o56j34j19N5J97N85
1038e99K92L31P82j67K53j5j69m16L24J45k14M6R5K38k96l54k12m42l29l29o6
1059a102q0K14PM71L88J39R7k1J16J0j68L90N2JK07M65k49N4l93k48n51q7m43
1082g31j52n0L77j06K42k9J27L47q4j11l62L28J60L35K96L84M8J23K54o80l13
1103D03l47k43k45J87r4j20J08M8r1J02m75J73p0J0K16P7M55L22J09K59q7N2k9
1126G20j99Ol78J7J34o3J5m36P0J15o45J80j99j59N6J18R2L10M44j46N21J23j33
$$ plain form
1149 563 340 482 386 295 542 455 591 362 648 501 140 -17 -527 -678 -808 -640 -930 -609 -262 -345 18
1170 18 -140 -75 -82 87 -58 -50 128 27 188 646 682 559 598 634 178 70 -241 -419 -196 -479 -339 -559 -344
1193 -344 -193 -326 -216 -208 -547 -297 -309 53 -137 175 403 483 345 587 607 373 66 68 -62 -22 101 136 34
1216 34 -3 -238 -522 -342 -483 -572 -394 -327 -262 -50 104 393 386 520 316 435 86 27 -37 63 137 238 182 -33
1240 -33 23 -99 -237 -478 -462 -611 -399 -248 -149 -226 346 52 256 272 257 211 12 245 229 247 174 745 449 403
1264 403 279 -118 -53 -571 -719 -325 -183 -271 -121 -70 78 -101 -36 57 -58 152 245 184 323 220 411 510 365
1287 365 220 141 88 -205 -291 -322 -271 -291 -116 -46 57 -295 -153 54 -307 -189 -130 -173 64 109 -61 212 565
1310 565 624 58 174 55 -151 -108 67 30 -210 -24 -177 69 -235 -240 -291 -266 -222 -391 -258 -161 -101 -216 341
$$ packed form
1149E63k23J42r6r1K47q7J36k29K86j47l61j57n10j51j30J68k90L21L47q3L63
1170A8j58O5pJ69j45QJ78j01J61M58L6j23L9L6m56j08l11j78K23k83J40k20K15
1193c44J51j33J10Ql39K50j2L62j90L12K28Q0j38K42K0k34l07Kj30M0J23L5j02
1216C4l7k35k84J80j41q9J78O7O5K12J54K89pJ34k04J19l49n9o4J00P4J01n6k15
1240c3N6j22j38k41J6j49K12J51R9p7N72k94K04J6j5m6j99K33j6J8p3N71k96m6
1264D03j24l97O5n18j48L94J42q8J50N1J48j79O5R3j15K10R3o1J39j03J91R9j45
1287C65j45p9n3k93q6l1N1k0J75P0J03l52J42K07l61J18N9m3K37M5j70K73L53
1310E65N9n66J16j19k06M3J75l7k40J86j53K46l04nn1K5M4j69J33R7O0j15N57
$$ plain form
1333 341 327 257 247 248 386 -51 144 47 89 114 120 -116 149 -208 -299 -108 -29 -275 -578 -255 -234 -1 62 283 96
1358 96 6 231 282 -179 -42 -66 25 136 417 283 90 245 21 -217 -166 72 -618 -413 -22 -241 -283 -140
1380 -140 38 9 -34 124 -89 30 68 -48 5 348 222 349 437 295 -219 78 -114 -127 -97 -293 25 -71 -128
1403 -128 -114 -115 164 95 -328 -281 91 -182 -108 166 136 176 130 283 139 -17 -36 -150 -141 117 13 -187 -54 169
1427 169 73 -39 -476 -227 -56 -282 -144 -193 -359 239 273 286 158 269 188 171 -56 -40 -205 -19 109 -238
1449 -238 404 286 77 -82 -146 -400 -198 55 -93 -124 -95 -4 -197 84 -4 56 121 254 142 285 307 124 229
1472 229 291 213 198 12 -171 -203 -383 -383 -138 -258 -131 -184 -142 -198 -19 104 -149 -99 -296 -289 -69 213 327 335 410
1497 410 163 42 182 36 354 -184 -173 -112 -273 16 -162 6 -157 79 -140 -284 22 -114 121 245 -108
$$ packed form
1333C41j4p0j0JJ38m37J95r7M2K5Ok36K65l57r1J91P9k46l03L23K1K33O3K21j87
1358I6r0K25N1m61J37k4R1J11K81j34j93J55k24k38N1K38o90K05L91k19m2J43
1380a40J78k9m3J58k13J19L8j16N3L43j26J27Q8j42n14K97j92j3L0j96L18r6n7
1403a28J4jK79o9m23M7L72k73P4K74l0M0m6J53j44j56j9j14RK58j04k00J33K23
1427A69r6j12m37K49J71k26J38m9j66N98L4J3j28J11q1j7k27J6j65J86J28l47
1449b38O42j18k09j59o4k54K02K53j48l1K9R1j93K81q8O0O5J33j12J43K2j83J05
1472B29O2p8j5j86j83l2j80%K45j20J27n3M2n6J79J23k53N0j97PK20K82J14QP5
1497D10k47j21J40j46L18n38J1O1j61K89j78J68j63K36k19j44L06j36K35J24l53
$$ plain form
1518 -108 20 182 236 308 222 35 -64 143 144 123 -18 5 73 32 204 1 12 -186 -10 -233 -95 -8 -223 155
1542 155 -52 167 -3 278 128 61 30 17 -96 188 142 137 15 -86 -165 145 -189 194 -42 -313 -95 -74 145
1565 145 74 -4 -26 32 -20 25 -366 171 93 241 6 109 -65 -35 149 82 179 -134 69 -178 -58 -199 -86
1588 -86 -185 -149 46 191 118 -127 -117 -53 -87 161 340 192 256 68 63 281 34 242 21 -68 85 24 -106 22
1612 22 101 -209 -233 67 -215 -306 -329 -40 18 98 -138 125 177 389 262 88 84 42 330 -8 -84 70 217 43
1636 43 -50 15 51 -154 -139 -110 -156 -143 -179 -177 -56 100 297 106 74 -34 -71 -93 -46 197 -6 -123 132 236 150
1661 150 96 -84 233 -91 -54 -189 217 -132 87 -74 -105 172 203 25 -1 267 12 122 98 182 232 62 164
1684 164 -84 196 -40 -167 -16 -61 -257 -107 -149 -83 -75 -168 0 44 158 24 -132 -6 -39 228 101 -206 58
$$ packed form
1518a08J28J62N4P2q6j87r9K07Jk1j41K3O8m1J72k03J1j98J76k23J38Q7k15L78
1542A55k07K19j70K81j50o7l1j3j13K84m6nj22j01p9L10l34L83k36k71K18K1K19
1565A45p1p8k2N8n2M5l91N37p8J48k35J03j74L0J84o7R7l13K03k47J20j41J13
1588h6r9L6J95J45p3k45J0O4l4K48J79j48O4j88nK18k47K08k21q9J53o1j30J28
1612B2P9l10k4L00k82r1k3K89N8Q0k36K63N2K12j27j74mm2K88l38p6J54J47j74
1636D3r3O5L6k05J5K9m6J3l6KJ21J56J97j91l2j08l7k2M7K43k03j17K55J04q6
1661A50n4j80L17l24L7j35M06l49K19j61l1K77L1j78k6K68k55J10k4Q4N0j70J02
1684A64k48K80k36j27J51m5j96J50m2O6Qr3J68M4J14j34j56J26l3K67j27l07K64
$$ plain form
1707 58 63 392 307 41 -224 91 88 376 13 -15 158 -137 -94 -103 5 -116 -156 -264 -49 -28 143 175 -33 30 -73
1732 -73 299 210 21 -153 -193 55 -33 281 196 138 2 -33 -64 -355 -12 -175 -124 75 106 50 177 243 50 120
1756 120 184 -15 117 -405 96 122 163 -138 316 -33 105 146 0 -16 -146 -101 -91 -34 -27 118 -82 144 24
1779 24 -28 -273 16 101 -10 180 -6 17 232 2 70 129 77 29 -90 -162 -215 -23 37 -184 37 14 353 56
1803 56 -186 55 191 156 113 -196 177 192 328 266 -186 -37 152 -216 -93 79 7 -210 67 264 87 -86
1825 -86 -155 0 -286 -161 -252 50 -71 271 206 57 125 -161 -355 -80 -149 97 139 77 -29 -241 29 -54 9
1848 9 134 -22 -42 -331 -52 -292 -7 -58 -38 67 -245 11 171 -103 145 -283 57 227 15 180 150 276
1870 276 -288 151 -89 16 6 -165 -152 105 137 -263 -93 -74 -76 -27 182 29 56 -20 -1 64 149 47 45 70 77 189
$$ packed form
1707E8NL29q5k66k65L15lK88l63k8J73k95M3rJ08j21m0j08K15K1J71L2k08O3j03
1732g3L72q9j89j74m0K48q8L14q5n8j36l5l1k91L43j63N1J99L1n6J27O6j93P0
1756A20O4j99J32n22N01K6M1l01M54l49J38M1j46j6j30M5J0N7PJ45k00K26j20
1779B4n2k45K89Q5j11J90j86K3K15k30O8N9n2m8j19p2n3J92O0k21K21k3L39k97
1803E6k42K41J36l5m3l09L73J5J36o2m52J49J89l68J23J72p2k17K77J97j77j73
1825h6o9J55k86J25r1L02j21L42o5j49O8k86j94K75o9K46M2o2j06k12K70q3O3
1848IJ25j56k0k89K79k40K85n1K0J05l12K56J60k74K48m28L40J70k12J65l0J26
1870B76n64M39k40J05j0j71J3K57L2m00J70J9kM9K09j53K7p6J9O5Q5j02kK5PJ12
$$ plain form
1896 189 91 -77 21 -12 40 -64 -111 177 -87 -55 -48 -40 73 -177 -190 -139 -254 163 26 -96 35 -101 -40 -7 67
1921 67 40 -146 -16 144 109 -153 -190 179 45 -139 -99 -9 -79 -257 -366 67 16 28 62 41 235 157 -8 73
1945 73 -35 -60 -159 -54 274 -89 118 -165 90 7 -56 -302 204 36 -73 4 32 236 -117 -319 -152 28
1967 28 -83 273 -72 109 -6 63 198 46 25 169 405 143 -70 123 -56 -21 -363 154 60 -151 -27 45
1989 45 78 20 -441 -32 7 -55 19 36 -88 -56 -83 -33 59 -162 45 -96 -22 -115 216 52 107 -81 -64 -107 -337
2014 -337 60 -25 9 -137 206 -136 146 371 -30 -379 101 -77 187 99 176 -4 1 83 66 -144 -254 -144 32
2037 32 21 52 -132 110 -53 128 95 -43 -92 147 212 96 102 174 -98 -162 -41 61 56 106 -253 47 -45 -79 -36
2062 -36 7 219 -203 -123 -134 79 50 -126 19 -88 -109 86 68 107 146 79 258 -1 -150 144 -54 48 -174
$$ packed form
1896A89r8j68R8l3N2j04m7K88k64L2PQJ13k50j3N1j15M17j37j22J31j36O1L3P4
1921F7k7j86J30J60l5k62l7L69j34j84M0R0p0j78j09M33n1J2L4k1J94p8j65Q1
1945G3j08k5r9J05L28l63K07k83K55q3o3k46N06j68j09P7K8K04l53k02J67J80
1967B8j11L56l45J81j15O9J35j52k1J44K36k62k13J93j79L5l42N17r4k11J24P2
1989D5L3n8m61M09L9o2P4J7j24L2k7N0R2k21K07j41P4r3L31j64N5j88J7m3k30
2014c37L97q5L4j46L43l42K82K25m01l49M80j78K64q8P7j80NQ2j7k10j10J10J76
2037C2j1L1j84K42j63J81l3j38m9K39O5j16OP2k72o4J21J02nN0l59L00r2l4M3
2062c6M3K12m22Q0j1K13k9j76J45j07k1J95j8L9L9o7J79k59j49K94j98J02k22
$$ plain form
2085 -174 -54 -204 -31 -29 138 -79 34 77 106 86 -229 -124 211 119 -87 247 67 151 -254 85 329 -47
2107 -47 76 184 268 -90 188 86 -132 -142 -87 254 -12 56 90 176 -28 -20 14 193 80 54 -80 142 37 -41
2131 -41 -144 24 -15 130 272 51 -4 -183 -203 -198 -145 -190 -83 48 -147 46 -125 160 -19 -45 25 24 -28 56 -98
2156 -98 -151 -43 -77 75 161 170 -196 -232 -66 25 -48 9 -82 -29 -61 133 -56 149 -13 -17 76 -62 3 -250 229 -9
2182 -9 36 152 -57 182 -42 -62 55 52 107 106 228 100 158 209 -81 5 43 4 -98 117 56 -141 63 68 136 -238
2208 -238 -57 -36 58 111 -80 -104 35 -46 -47 103 0 -157 60 226 255 -87 -45 92 126 60 77 70 -82 32 62
2233 62 108 43 -105 70 -379 -211 158 -227 73 64 74 227 -177 67 52 -52 -77 -353 16 -129 -58 3 235
2256 235 83 -103 -110 91 187 43 -196 -193 30 39 79 11 293 -133 250 -186 91 -85 -143 122 2 26 -5 193
$$ packed form
2085a74J20j50J73KJ67k17J13M3K9k0l15J05L35r2k06L34j80Q4m05L39K44l76
2107d7J23J08Q4l58K78j02k18j0N5L41k66O8L4Q6k04QL4J79j13k6j34K22j05p8
2131d1j03J68l9J45J42k21n5j79k0NN3m5J07J31j95J93j71K85j79k6P0jn2Q4j54
2156i8n3J08l4J52Q6Rl66l6J66R1p3N7r1N3l2J94j89K05j62mR3j38O5k53M79k38
2182iM5J16k09K39k24k0J17lN5jJ22j28N8N1k90Q6L8l9j02K15o1j97K04NO8l74
2208b38J81K1R4N3j91k4J39q1jJ50j03j57K17J66K9l42M2J37L4o6J7pj52J14L0
2233F2M6o5j48J75m49J68L69l85L00rJ0J53m04K44j5j04k5k76L69j45P1O1K32
2256B35j52j86pK01R6j44k39LK23RM0o8K82m26L83m36K77j76n8K65j20K4l1J98
$$ plain form
2280 193 114 6 53 80 115 169 223 103 154 -32 224 -30 -125 30 142 -12 -94 234 -113 -183 -9 180 52
2303 52 -233 28 -127 49 108 354 -172 -14 -98 -307 176 49 11 211 -27 12 -37 74 -99 85 -44 -206
2325 -206 -14 184 272 -208 50 -159 -69 288 171 -73 -24 151 69 321 -50 211 -37 -117 45 -56 42 118
2347 118 -6 74 -5 135 11 -224 -75 29 -13 39 -238 -227 130 92 142 -179 49 -187 71 -119 -148 -178 -57
2370 -57 -95 -37 -299 -108 207 -79 128 278 -47 -90 -69 58 -126 -83 -21 42 -9 -263 -17 154 300 326 -61
2393 -61 -99 -127 -245 -58 69 165 202 -114 -223 62 -159 -156 -269 -107 80 130 -28 -108 151 73 -214 169 277
2416 277 41 43 -40 78 39 14 43 -142 29 -4 76 200 -30 -186 -22 177 -123 124 214 -54 -10 -66 -252 162
2440 162 -88 -108 222 138 -177 -139 -11 50 61 50 -250 41 97 214 65 -123 -129 14 139 -163 38 108 -37
$$ packed form
2280A93p9j08M7K7L5N4N4j20N1j86K56k54r5J55J12j54q2L28l47p0J74J89j28
2303E2k85K61j55J76N9K46n26J58q4k09M83j27l8K00k38L9m9J11j73J84j29j62
2325b06J92J98Q8m80K58k09R0L57j17k44M9J75q2K52l71K61k48q0J62j01R8P6
2347A18j24Q0p9J40j24k35J49J04m2N2k77J1L57l8N0l21K28k36K58j90k9l0J21
2370e7l8N8k62J91L15k86K07J50l25m3K1J27j84M3O2O3n1k54K46J71J46K6l87
2393f1l8k8j18J87J27R6L7l16j09K85k21Lj13J62J87N0j58q0K59p8k87L83J08
2416B77k36Kq3J18l9k5K9j85J71l3Q0J24k30j56J64J99l00K47R0k68M4n6j86M14
2440A62k50k0L30q4l15L8J28O1J1j1l00K91N6J17j49j88oJ43J25l02K01P0j45
$$ plain form
2463 -37 196 177 41 14 121 -103 76 78 40 -48 83 -131 44 318 -86 -30 102 204 137 136 -48 31 105 -31
2487 -31 149 35 89 -140 123 -90 47 60 -306 -31 286 -91 238 -179 -50 44 -62 22 -147 -124 -58 -2 -10
2510 -10 -49 -182 -55 109 -87 49 -101 43 -90 -193 -241 111 165 56 -333 -87 21 25 -4 164 -78 -271
2532 -271 135 -38 -184 -74 161 279 -115 111 -3 -313 157 73 -120 -227 110 0 32 -85 -63 -61 -88 84
2554 84 -46 -48 -231 -355 -26 -13 73 44 102 -116 -72 82 -10 -18 161 -10 25 -42 -31 234 -13 -47 -20 -8 111 76
2580 76 -48 97 -54 -29 70 -33 303 103 260 49 -147 -217 -120 -244 -4 -37 -18 5 19 225 -215 147 -81
2603 -81 89 28 -67 6 77 -135 67 -42 -41 110 -46 45 -61 -36 -106 -245 40 -24 120 -203 167 36 61 -3
2627 -3 -16 -114 14 -135 -127 -107 268 -172 -32 17 -19 27 273 -187 -219 166 50 -55 194 89 -231 125 75 41
$$ packed form
2463c7K33j9j36k7J07k24J79Kl8q8J31k14J75K74m04N6J32J02o7jj84P9P4j36
2487c1J80j14N4k29K63k13J37J3l66K75L17l77L29m17J29R4j06Q4j69K3O6N6q
2510a0l9j33J27J64j96J36j50J44j33j03m8L52N4j09l89K46J08Mk9J68k42j93
2532b71M06j73j46J10K35J18l94K26j14l10M70q4j93j07L37j10L2j17K2Kk7J72
2554H4j30kj83j24L29J3Q6k9N8k18M4J54r2qJ79j71L5o7J1K65k47l4K7J2J19l5
2580G6j24J45j51K5R9j03L36k00J57k11j96p0R7j24K40l3J9K3J4K06m40L62k28
2603h1J70o1r5P3P1k12K02j09JJ51j56R1j06K5p0j39K85o4J44l23L70j31K5o4
2627cj3r8J28j49QK0L75m40J40M9l6M6K46m60l2L85j16j05K49j05l20L56n0l4
$$ plain form
2651 41 41 -72 -154 45 78 -118 -2 73 -90 123 61 38 -195 410 12 -78 -88 -93 1 -18 55 245 -25 -50 -121 -85
2677 -85 95 25 23 -135 -120 74 -275 26 53 80 -65 75 11 -41 115 -16 -11 71 -8 83 -151 11 216 5 -234
2702 -234 -68 230 270 117 123 -86 -194 111 160 -138 92 6 61 -204 83 -13 5 -96 121 -95 18 -25 59
2725 59 -39 -199 -68 -36 -104 -74 -54 156 211 10 143 156 -93 48 6 64 264 44 72 -157 136 -16 136 -176
2749 -176 7 -256 207 111 67 101 125 -214 -148 9 -112 -112 -33 26 -258 -10 -77 40 -84 -53 -102 -105 -118 59 -188
2774 -188 -28 4 -131 64 226 -104 91 210 43 -33 22 185 146 -57 -110 95 -134 288 202 -86 -38 -7 -161
2797 -161 36 -40 -5 -176 68 -115 105 -16 14 44 2 81 -142 31 96 159 -32 -8 -32 70 208 271 -42 108
2821 108 -163 -179 189 58 60 -136 8 -203 189 -121 20 -329 174 58 149 15 26 -7 -195 -207 75 150 158
$$ packed form
2651D1%j13q2J99L3j96J16P5j63K13o2k3k33O05l98r0j0nR4j9P3J90k70k5p1L6
2677h5J80p0kj58J5J94l49L01K7K7j45J40o4n2J56j31NQ2p9R1k34J62K05k11k39
2702b34J66K98M0j53Ok09j08L05M9k98K30q6N5k65K87r6J8j01K17k16J13m3Q4
2725E9r8j60J31L2o8L0K0K10N5k01J33J3k49J41m2N8K00k20K8k29K93j52J52l12
2749a76J83k63M63r6m4L4K4l39O6J57j21%P9N9k84K48o7J17j24L1m9lj3J77k47
2774a88J60L2j35J95J62l30J95J19j67p6N5J63l9k03n3K05k29M22q6k88M8L1j54
2797a61J97p6L5j71K44j83K20j21L0L0m2P9k23J73O5O3j91K4k4J02J38O3l13J50
2821A08k71j6L68j31Kj96J44k11L92l10J41l49N03j16R1j34J1l3j88j2K82P5Q
$$ plain form
2844 158 -207 -148 247 -78 -35 -99 7 61 -72 14 49 41 -256 -104 -162 -53 252 137 166 -147 -253 -10 116
2867 116 90 18 36 30 -93 90 186 125 102 110 151 -36 97 30 -248 -52 26 -61 45 -263 -6 -63 137 -117 114
2892 114 55 -53 -213 -195 -29 -199 70 -10 128 59 -97 39 133 -15 -256 -52 41 203 225 -11 111 118 -305
2915 -305 47 60 51 -9 -85 76 68 51 -243 45 160 112 24 46 151 -161 177 -111 -76 109 -234 -55 -78 164
2939 164 6 43 -100 -69 -103 73 133 -289 -27 93 209 173 159 85 33 -55 -221 36 77 -249 -236 -82 81 -146
2963 -146 -149 202 -152 -183 86 312 -157 50 -94 48 248 83 -19 26 -73 -121 -65 57 -74 -122 10 147 -63
2986 -63 -54 -116 -59 257 -12 -45 -36 203 30 -59 -51 -120 23 -107 -155 -71 -84 -143 116 -66 91 134 5 -135 209 63
3012 63 -123 -319 -72 -103 -3 -70 328 -70 -181 101 -304 -26 -47 109 92 -124 -5 36 49 -108 -219 50
$$ packed form
2844A58l65N9L95l25M3o4J06N4j33Q6L5qk97J52n8J09L05j15K9l13j06K43J26
2867A16k6p2J8oj23J83R6o1k3QM1j87J33o7k78J96P8q7J06l08K57n7K00k54K31
2892A14n9j08j60J8J66j70K69q0J38o9j56J36R4j48k41K04R3J62K2k36J22Pm23
2915c05L52J3ro0p6J61qj7k94K88J15m8q8K2J05l12L38k88L5J85l43J79k3K42
2939A64j58L7j43L1l4J76O0m22K62J20J16l6j4p4n2q8j66K57M1l26J3J54J63k27
2963a46lL51l54l1K69K26m69K07j44J42K00j65j02M5r9m8N6J22j31m8J32J37k10
2986f3Ro2N7L16k69l3RK39j73q9Qo9J43j30m8Q4j3n9K59j82J57M3j29j40L44j46
3012F3j86j96K47l1J00o7L98l98j11K82m05K78k1J56j7k16J19M1J3j57j11K69
$$ plain form
3034 50 -61 -82 -67 114 168 57 168 -156 -137 -119 -248 119 120 87 -155 48 -270 42 14 -35 -50 98 -43 -62
3058 -62 -57 56 59 -59 -4 215 -208 -12 -5 58 -80 -175 217 30 -183 -158 85 -70 244 -53 -88 -203 153 -5
3082 -5 51 75 -51 1 115 266 -130 -115 39 152 44 154 66 -258 -182 11 206 137 61 298 -41 201 -93
3105 -93 82 -102 178 -90 30 95 -67 216 -58 44 71 132 242 62 23 -77 14 84 22 -40 78 -256 173
3128 173 123 -57 12 1 -24 70 39 -305 -232 -241 -22 71 19 68 -41 91 187 -147 -239 -131 -9 -106 -52 7 -1 160
3154 160 129 61 8 -6 -12 51 -100 -14 148 -222 151 48 -28 -150 -118 10 -45 -20 151 -84 -24 -187 140 23
3178 23 0 89 -171 -98 -30 -33 -185 225 -19 39 131 46 42 -136 82 -62 140 96 37 5 -37 -98 -192 253 -170 93
3204 93 144 5 90 139 -53 -13 115 81 166 59 63 -83 60 -36 173 382 -61 104 260 174 -18 48 -6 -33 89
$$ packed form
3034E0j11k1J5J81N4j11J11l24J9J8j29L67Jl3k42K03l18L12k8m9j5J48j41j9
3058f2NJ13Lj18N5K19m23J96PO3j38r5L92j87k13K5K43j55L14k97l5j15L56j58
3082eN6K4j26N2J14J51l96J5J54J13j08J10q8l24P6J93J95o9p6K37l39K42k94
3105i3J75j84K80k68J20O5j62K83k74J02K7O1J10j80l9j00R1P0o2o2J18l34M29
3128A73n0j80O9j1k5R4l1l44P3rK19R3n2M9j09J32R6l34r2J08J22r7N4N9qJ61
3154A60l1o8n3j4oO3j51Q6J62l70L73j03p6j22L2J28n5K5J71k35O0j63L27j17
3178B3k3Q9k60P3O8lj52M10k44N8R2q5mj78K18j44K02m4n9l2m2o1r4M45m23K63
3204I3N1j39Q5M9j92M0J28l4Q5j07Mj46J43r6K09K09m43J65J56q6j92O6n4k7J22
$$ plain form
3229 89 -177 -112 -221 29 209 56 -202 -12 126 -142 -41 -93 -69 27 71 178 -51 67 -97 -21 84 -246
3251 -246 91 183 -10 68 -12 44 38 -126 -130 172 -81 14 -21 -156 160 128 -16 -66 -40 -197 -8 20 -267 -24 67
3276 67 82 -317 -63 -177 -283 275 -28 -86 141 53 -30 172 318 -234 -93 172 -321 54 79 59 166 20
3298 20 -164 60 -18 -51 -125 -175 286 -108 142 57 -93 43 78 -29 55 -90 -40 -150 59 94 -143 -72 43 187
3322 187 3 318 -9 37 -79 -96 -50 -274 -81 -127 -56 93 -180 -31 138 184 140 99 116 -76 -176 -49 177
3345 177 17 -141 -175 -59 149 -16 90 132 -93 -73 -90 243 -8 50 50 99 224 -19 57 -15 79 -100 -220 109
3369 109 203 52 29 44 -105 -166 -94 -190 -29 86 31 -109 0 10 -98 16 -379 102 238 152 -100 -34 -144
3392 -144 109 -19 -69 306 -160 -183 116 -58 130 -69 173 53 -151 45 178 30 280 -348 128 55 -210
$$ packed form
3229H9k66O5j09K50J80j53k58J90J38k68J01n2K4R6M4J07k29J18j64P6J05l30
3251b46L37R2j93P8q0N6oj64mL02k53R5l5j35L16l2j44n0K6j57J89K8k87K43R1
3276F7J5l99K54j14j06N58l03n8K27q8q3K02J46n52J41K65m93L75K5k0J07j46
3298B0j84K24p8l3p4n0M61l94K50q5j50J36L5j07Q4j45N0j10K09L5k37P1J15J44
3322A87j84L15l27M6j16j7M6k24J93m6P1J49k73J49J69M6m4m1J7j92j00J27K26
3345A77j60j58l4J16K08j65J06M2k25K0j7L33k51N8%M9J25k43P6p2R4j79j20L29
3369A09R4j51k3J5j49o1P2r6J61J15n5j40J09J0j08J14l95M81J36q6k52O6j10
3392a44K53j28n0L75m66k3K99j74J88j99K42j20k04J96J33j48K50o28M76p3k65
$$ plain form
3413 -210 57 -126 24 -66 -126 -129 16 36 144 193 101 -228 -22 29 136 -163 127 94 314 69 -114 33 -188
3436 -188 -138 -4 154 -182 -37 -14 -87 165 129 -15 -4 -192 -72 -83 135 -55 -11 21 180 21 93 -20 39
3459 39 15 77 159 22 -218 -176 -169 53 107 -51 38 184 -223 8 -10 -120 107 29 11 -141 270 -48 59 -167
3483 -167 128 54 -107 181 -14 210 138 53 133 -42 -69 -239 73 -156 -121 275 -104 -105 5 -45 95 -53 33
3506 33 -131 -219 412 -85 132 44 -182 -37 -69 65 228 -31 1 200 -81 217 128 164 86 -79 -99 -54 168
3529 168 -34 -61 -253 110 180 -23 -87 -107 67 3 -19 -9 103 -40 -215 50 -52 -19 -60 173 83 -45 173
3552 173 -2 41 -244 -100 -73 257 -120 41 -155 20 -113 12 61 -165 99 4 195 -45 96 41 -8 98
3574 98 -252 -310 -188 -44 118 164 15 227 80 -8 -152 -141 -143 39 -39 -270 100 178 64 55 23 -84 76 194
$$ packed form
3413b10K67j83J50r0o0lJ45K0J08M9r2l29K06N1J07k99K90l3K20k45j83J47k21
3436a88N0J34J58l36J45K3p3K52l6j44J1j88J20j1K18j90M4L2J59j59P2j13N9
3459C9k4O2Q2j37k40M2PK22N4j58Q9J46m07K31j8j10K27p8j8j52M11l18J07k26
3483a67K95p4j61K88j95K24p2q5Q0j75k7j70L12k29L5L96l79jJ10n0J40j48Q6
3506C3j64q8O31m97K17q8k26J45l2J34J63k59L2J99k81K98q9L6p8j65k0M5K22
3529A68k02k7j92L63P0k03o4k0J74o4k2J0J12j43j75K65j02L3m1K33r0j28K18
3552A73j75M3k85J44K7L30l77J61j96J75j33J25M9k26K64r5J91k40J41n5m9J06
3574I8l50n8J22J44J62M6j49K12j47q8j44J1kJ82p8k31L70P8j14rl2j07J60J18
$$ plain form
3598 194 8 89 -105 -191 -67 194 20 74 45 -64 -128 -43 -35 -186 -70 -10 27 -63 -89 53 -84 -92 157 103 34
3623 34 -39 -108 186 135 108 133 -125 0 -114 -133 -110 -231 -107 -333 54 -42 -16 119 120 97 60 201 -43 126 -3
3648 -3 62 44 84 -116 10 327 -204 -68 -261 14 63 90 -92 36 -196 -50 21 -27 -52 0 177 -96 -167 -9
3672 -9 121 -242 107 -206 -12 78 -74 -143 -31 72 -228 179 55 -268 227 52 116 98 -291 118 204 -84
3694 -84 -82 -6 -97 26 -351 -104 146 -174 -173 -200 146 -20 -188 60 83 100 59 -39 2 -84 38 223 59 -36 25
3719 25 87 33 21 -1 -8 -1 -74 -52 -64 -73 85 72 -42 -78 288 243 128 -163 253 7 -108 -299 67 -86 197 -77
3745 -77 -72 -16 139 14 -75 7 -98 -45 -116 -41 3 -197 91 235 -90 34 -104 33 -94 -117 -15 59 4 -191
3769 -191 -11 -55 -9 7 222 -57 -47 85 50 3 319 -17 224 -209 -57 -31 -71 17 -140 113 -199 100 -129
$$ packed form
3598A94j86Q1j94q6J24K61j74N4k9j09o4Q5Qj51J16O0L7r0k6J42j37qK49n4o9
3623C4p3o9K94n1k7K5k58J25j14j9K3j21J24k26L87r6K6J35Jk3l7J41k44J69j29
3648cO5j8M0k00J26L17n31J36j93K75M9K7j82J28k32J46P1m8k5N2J77k73p1J58
3672iJ30l63L49l13J94R0j52o9J12J03l00M07j24l23M95j75O4j8l89M09Q6k88
3694h4KP6r1J23l77K47K50l20Jk7L46j66j68K48K3J7m1r8M1q6J22J85j64r5O1
3719B5O2n4j2k2pPp3K2j2rJ58j3j14l6L66m5j15k91M16k46j15j91L66j53K83k74
3745g7NN6J55j25q9Q2j05N3p1P5M4k00K88J44l25J24j38J37j27k3J02P4n5j95
3769a91J80m4M6J6K15k79J0J32l5m7L16l36K41m33J52K6m0Q8j57K53l12K99k29
$$ plain form
3792 -129 50 28 -92 103 -226 -192 77 148 122 283 -69 -53 -230 -166 15 132 16 -266 -67 238 -39 106
3814 106 47 -116 -169 113 -123 27 69 -183 121 21 -193 -64 57 -63 92 18 23 -41 89 -79 -24 247 -152
3837 -152 136 90 -131 -167 -84 124 -158 71 -24 138 36 -239 -8 118 -84 116 16 -145 -125 -1 -70 -79 -186
3860 -186 208 -152 20 83 34 87 -202 -86 -285 -105 -113 179 13 -137 -187 -47 -114 -12 179 -86 91 106 -46
3883 -46 -91 -11 -189 41 75 142 -11 -50 130 108 -48 -5 68 110 339 -84 -163 25 36 47 132 105 51 186 -185
3908 -185 -45 63 86 -225 -10 251 -39 -111 38 80 -190 71 54 -148 -21 -57 53 -98 -130 -41 -290 39
3930 39 69 -8 33 71 97 187 206 -48 -363 18 -13 224 -165 106 192 -93 -211 -53 -140 8 -158 97 68 6
3954 6 283 -87 35 -126 145 91 -6 -115 -72 -112 -511 171 26 -13 31 -59 71 -10 24 216 39 -281 -32 -20
$$ packed form
3792a29J79k2j20J95l29L4K69P1k6J61l52J6j77O4J81J17j16k82J99L05k77J45
3814A06n9j63n3K82k36J50M2k52L04j00k14J29J21j20J55p4No4J30j68N5K71l99
3837a52K88m6k21l6Q3K08k82K29r5J62j02k75K31J26k02K00j00j61K0J24o9rj07
3860a86L94l60J72O3m9N3k89J16j99J80qK92j66j50n0J40o7J02J91k65J77J5j52
3883d6m5Q0j78K30L4O7j53l9J80k2j56M3P3M2K29m23p9J88J1J1Q5k7n4J35l71
3908a85J40J08K3l11K15K61k90p2J49M2k70K61j7k02J27l6J10j51l2Q9k49L29
3930C9L0p7M1L8K6R0J9k54l15L81l1K37l89K71Q6k85j18J58q7J48j66K55k9o2
3954FK77l70J22j61K71n4r7j09M3m0l99O82j45l9M4r0J30q1L4J92j77l20K49J2
$$ plain form
3978 -20 122 186 0 371 -78 -182 105 -23 213 -58 -65 43 34 8 164 -44 11 -34 75 -52 -125 -122 107 -196
4002 -196 87 164 -204 250 38 175 26 -186 -77 -73 211 -27 63 -39 275 -72 -143 87 114 -147 106 3
4024 3 -178 6 -114 -104 117 20 56 15 -65 -162 125 115 -151 -8 36 36 -122 123 116 113 -87 -121 13 85 109 -150
4050 -150 63 81 177 -48 -26 -203 113 89 -50 -184 8 -94 -188 42 -189 -327 41 -69 -124 230 -153 193
4072 193 -83 221 48 23 -45 -143 167 -27 161 -62 173 -86 -55 -71 43 71 97 -76 136 175 -39 -143 -59
4095 -59 123 86 -52 25 0 -384 -48 -86 2 176 80 -101 -164 -158 -2 91 94 -187 -147 126 16 0 27 150 30
4120 30 -44 -48 -243 175 -157 56 -32 -155 112 -99 -169 173 35 178 -153 -252 68 12 11 -25 -76 -104 -36 69 -134
4145 -134 -119 68 -43 -177 35 -97 92 201 108 285 -121 -27 -65 55 -73 298 163 -235 -53 148 72 203
$$ packed form
3978b0J42O4j86L71m49j04K87j28K36k71pJ08rk6J56k08N5m5J09j27p3LK29l03
4002a96K83P7l68M54k12J37j49k12J09MK84k38R0j02L14l47p1K30K7k61K53j03
4024Cj81J84j20J0K21r7L6m1q0r7K87j0k66J43M4%j58K45plk00l4J34P2K4k59
4050a50K13J8R6k25K2j77L16k4j39j34J92j02r4K30k31j38L68j10n5L54l83L46
4072A93k76L04j73k5o8r8L10j94J88k23K35k59L1j6J14K8K6j73K12L9k14j04Q4
4095e9J82l7j38P7k5l84L36l8Q8J74r6j81o3OJ56R3Lk81M0K73j10j6K7J23j20
4120C0p4mj95M18l32K13q8j23K67k11p0L42j38J43l31r9L20n6jl6n1k8O8J05k03
4145a34J5J87j11j34K12j32J89J09r3J77m06R4l8J20j28L71j35l98J82K01p6J31
$$ plain form
4167 203 -136 -30 37 132 16 127 -217 -131 -64 99 -99 -9 -61 -398 -127 -194 -230 203 -104 -119 -87 -96 50 9
4191 9 -104 165 59 13 9 -166 176 -87 68 24 24 -30 -11 -230 11 143 48 46 293 37 114 101 -90 -277 116
4216 116 -65 99 -201 -157 -71 56 73 -71 149 -74 -47 291 58 -21 -159 98 143 94 -79 -175 -140 36 15
4239 15 15 -82 -111 53 -162 49 234 212 -44 43 203 -44 -64 162 -46 -223 -42 25 -268 135 -278 -13 72
4262 72 70 124 -63 -53 198 -3 250 54 80 129 10 42 11 -201 163 49 -138 288 -126 65 -177 -3 73
4285 73 -53 157 -166 -162 -52 84 -173 -42 -86 111 -70 120 309 -105 52 -74 -41 203 -90 122 -138 -150
4307 -150 -202 0 -120 9 46 -18 -149 -48 170 249 -34 64 89 -270 124 -180 -131 -320 -48 60 101 404 11
4330 11 -55 -200 -81 -47 198 127 40 51 -71 -148 -59 -152 -90 -110 -28 -79 -3 -43 -210 -81 -23 -154 -104 210 104 -78
$$ packed form
4167B03l39J06O7R5j16J11l44Q6O7J63j98R0n2l37K71o7l6M33l07j5L2rJ46m1
4191Ij13K69j06m6mj75L42k63J55m4%n4J9k19K41J32r5kK47k56P7j3j91j87L93
4216A16j81J64l00M4Q6J27J7j44K20k23K7L38k33p9j38K57M5m9j73r6L5J76k1
4239A5%r7k9J64k15K11J85k2k56Q7J60k47k0K26k08j77J81O7k93M03m13K65Q5
4262G2kN4j87J0K51k01K53j96K6M9j19L2l1k12L64j14j87M26m14J91k42J74P6
4285G3j26K10l23MJ10J36k57J31m4J97j81J90J89m14J57j26L3K44k93K12k60j2
4307a50n2K02j20J29L7o4j31J01K18P9k83R8K5l59L94l04M9j89K72J08M1L03l93
4330A1o6j45J19L4K45p1q7J1j22p7Q9r3O2k0Q2n1P6m0j67J29N8j31N0L14j06j82
$$ plain form
4356 -78 63 63 -166 73 -53 24 96 65 -25 19 -318 11 -159 97 112 -99 37 -196 -116 -192 -171 30 185 -17
4380 -17 -68 172 6 227 -20 -14 88 -70 -94 54 -53 13 -164 -211 158 -27 143 -121 6 63 -188 72 59
4403 59 132 9 -23 -162 218 310 146 -45 151 269 117 170 228 -9 -157 166 198 247 189 -210 -104 153 12
4426 12 13 84 117 -57 -104 -83 92 -146 -129 -42 -288 -43 -257 -270 -156 84 47 167 -74 -131 109 -35 1 124
4450 124 70 -91 16 -200 -132 61 -114 220 173 22 -150 -162 -14 -106 164 -283 237 230 32 -163 97 207
4472 207 -38 79 192 -212 57 -145 174 -103 38 16 73 26 24 -105 16 2 -153 131 -186 171 -101 -75
4494 -75 -31 262 -41 -1 73 -35 -78 86 92 93 -65 -110 -14 -29 128 -100 114 -161 182 138 6 55 -89 -55 -33
4519 -33 -115 39 -152 88 -7 123 87 33 77 94 -55 -47 -175 95 159 -10 -163 138 52 -49 -196 -20 44 -105
$$ packed form
4356g8J41%k29K39j26P7P2l1r0M4l37L29j70K56J5k11J36k33Q0p6K1K01J55k02
4380a7n1K40j66K21k47OJ02j58k4J48j07O6j77m7L69j85J70k64J27N7k51K60j3
4403E9P3j23l2j39L80R2j64j91J96J18j52N3N8k37j48L23L2M9n8l99J06K57j41
4426A2JP1L3j74m7K1J75k38J7Q7k46K45k14j3J14K40l7J20k41n7K40j44L6J23
4450A24n4j61J07k16O8J93j75L34m7j51j72j2J48r2K70m47N20pj98j95K60J10
4472B07k45J17J13m04K69k02L19k77J41k2N7m7kj29J21j4j55K84l17L57k72K6
4494g5M4K93l03M0P4j08m3J64OJj58m5R6j5J57k28K14k75L43m4j32M9j44L4K2
4519c3q2J54j91K40r5J30l6n4M4J7j49Qj28K70O4j69j53L01q6j01j47J76O4j49
$$ plain form
4543 -105 -26 88 -2 100 129 76 -120 -128 -58 38 -15 -4 -205 132 150 203 54 -248 39 111 124 -62 126 81 135
4568 135 -4 -77 119 77 -14 69 -160 -65 46 -149 31 -105 139 -40 -71 113 -85 -73 53 73 11 57 266
4591 266 -100 -13 93 -272 -167 -200 -137 214 95 150 106 68 120 -98 -80 -73 -64 -129 -58 -90 198 139 -13 121 -139
4616 -139 -21 3 37 20 189 -127 90 -29 -98 103 -7 17 85 7 -45 182 2 38 52 -190 -85 185 -180
4639 -180 31 113 105 139 -45 74 -17 87 -2 8 114 255 -71 -102 91 148 95 131 -322 -219 27 -242 107 12
4663 12 -41 13 -47 -156 -101 67 -85 255 143 99 -139 -43 -339 236 -298 -152 -134 4 -188 -57 -21 52 -86
4686 -86 -140 195 -65 -177 190 93 -145 21 41 -151 -354 -144 -63 57 -359 24 29 -298 -223 171 272 -240 -6
4709 -6 200 -124 -102 55 -129 -99 -251 -222 -133 117 1 -101 -11 162 -105 -30 -66 -160 7 123 97 65 -137 -144 -76
$$ packed form
4543a05P9J14r0J02K9n3j96qP0R6n3J1k01L37J8N3j49l02K87P2J3j86J88m5N4
4568A35j39p3J96m2r1Q3k29R5J11j95J80j36K44j79l1J84j98J2J26K0o2M6K09
4591B66l66Q7J06l65J05l3O3L51j19N5m4l8N2k18J8PRo5P1l2K88n9j52J34k60
4616a39J18K4L4j7J69l16K17j19o9K01j10K4O8p8n2K27j80L6J4k42J05K70l65
4639a80K11Q2qL4j84J19r1J04q9J0J06J41l26l1J93N7n3L6m53J03K46k69L49r5
4663A2n3N4o0j09N5J68j52L40j12m4k38R6k96N75n34J46J8J38j92J31L6P3j38
4686h6n4L35k60j12L67r7k38J66K0j92k03K10Q1J20m16L83Nl27P5L94J01n12K34
4709fK06l24K2J57j84L0j52K9Q9K50j16j02R0J73k67P5l6r4J67J16k6l2k02pO8
$$ plain form
4734 -76 89 -5 27 -116 -49 59 73 -38 29 19 -30 -63 -102 17 81 115 132 -163 124 0 -174 96 35 38 -116
4759 -116 123 96 -93 7 216 59 1 130 84 -125 -15 163 -9 -203 270 0 -21 95 -8 10 -212 21
4781 21 -60 -6 18 23 107 -7 196 74 -14 -62 -77 180 -155 -237 -297 -75 -156 30 54 131 -72 180 -75 88 136
4806 136 200 -13 179 -85 62 -16 236 214 106 -108 -112 -35 198 27 -47 54 -66 -79 45 212 248 -100 35
4829 35 -206 -77 -127 36 -61 -23 -120 -26 26 187 -189 6 -54 -137 -42 -302 8 14 -161 -135 -32 -29 33 -131 46
4854 46 -43 179 -78 19 195 -41 -22 -64 -123 217 20 -247 -61 223 -17 71 -62 -23 23 122 -27 -208 -277 -111
4878 -111 102 -66 -228 -72 -98 -104 42 -37 -69 234 10 -73 6 -3 138 -66 -115 -68 -150 -208 259 200 197 28 -36 -178
4904 -178 128 207 153 118 -133 109 1 -11 137 -126 -5 205 -164 -92 90 -65 -119 96 53 94 161 200 60
$$ packed form
4734g6J65r4L2j43O7J08J4j11O7j0m9l3l9J19O4L4J7k95K87j24j74K70o1Lj54
4759a16K39k7j89J00K09j57n8J29m6k09J10J78j72j94M73k70k1J16j03J8k22K33
4781B1q1N4K4NQ4j14K03j22q8m8j5K57l35q2o0K22q1J86K4P7k03K52k55J63M8
4806A36O4k13J92k64J47p8K52k2j08k14mP7K33j71p4J01j20j3J24J67L6l48J35
4829C5k41J29n0J63r7L8r7R4N2J61l76J95o0q3R5k60L10Oj75K6J03LO2j64J77
4854D6q9K22k57R7J76k36J9m2n9L40j97k67J86K84k40Q8j33L9M6R9j49j81o9J66
4878a11K13j68j62J56k6oJ46p9l2L03k24q3P9rJ41k04m9M7q2n8M67n9lj69o4j42
4904a78L06P9n4l5k51K42j08j2J48k63J21K10l69P2J82j55n4K15m3M1O7L9j40
$$ plain form
4927 60 -57 33 -54 -265 196 -35 -67 4 82 167 -55 -134 19 -81 357 -61 -57 39 -94 -68 205 38 127 297
4951 297 -89 -142 41 -53 -109 181 -55 245 -5 -71 -29 104 -172 -68 95 139 -142 -144 178 62 -244 -166 24
4974 24 32 134 -179 -6 -73 -118 203 33 -55 77 81 98 -94 -235 -80 -180 81 -7 72 -5 -13 183 -64 -21 153
4999 153 -116 -187 48 -11 -152 103 -46 -59 -274 -50 -75 151 304 -369 -180 94 81 75 36 32 -5 -28 73 125
5023 125 -2 -76 91 -16 22 150 149 -3 64 28 3 -72 128 1 -54 45 63 -92 51 226 -141 166 132 -12
5047 -12 115 5 -95 193 -15 -162 -43 -277 0 85 30 -4 282 362 170 -65 -101 129 14 71 94 305 6
5070 6 185 -194 -235 28 109 108 5 -93 -57 148 62 51 14 -121 -182 -257 43 113 -290 -12 -88 77 -44 -165 227
5095 227 -35 -166 81 66 44 -76 -73 -16 100 -181 72 32 158 -189 251 49 95 123 -164 -193 123 -22 18
$$ packed form
4927F0j17R0q7k11M61k31l2P1P8Q5k22p9J53j00M38m18MR6j33K6K73j67Q9J70
4951B97l86n3J83r4n6K90k36L00k50o6M2J33k76J04J63M4k81kL22j16l06P8J90
4974B4QJ02l13J73o7m5L21j70q8J32MJ7j92j41J55j00K61q8P9p7qJ96k47M3J74
4999A53k69p1K35n9j41K55j49j3k15K24k5K26J53o73J89K74j3ol9ml7k3J01N2
5023A25j27p4J67j07L8J28jj52O7l6k5p5K00j27n5R9J8j55J43J75l67L07l4j44
5047a2J27j10j00K88k08j47J19k34K77Q5n5l4K86Q0j92k35l6K30j15N7K3K11k99
5070FJ79l79m1K63Q1jj03r8L6K05q6j1l7j35o1p5L00P0m03K78p6J65j21j21L92
5095B27k62j31K47j5k2j20LN7J16k81K53m0J26l47M40k02M6K8k87k9L16j45M0
$$ plain form
5118 18 -33 -126 35 177 16 68 107 73 138 106 -29 30 279 147 80 36 -104 -31 -165 -115 120 -45 -46 -52 -248 -206
5144 -206 -110 260 235 -13 337 -42 9 26 -37 70 -7 180 -80 115 66 -38 -228 -9 212 249 -22 -31 -64 345
5168 345 56 -305 -31 40 -64 -205 180 -57 -24 185 158 44 -41 -292 80 71 -190 2 -69 40 -165 -12
5190 -12 14 -53 -44 -155 -118 22 193 -96 -44 73 -180 -187 23 86 -325 148 -60 -48 63 -128 119 21 50 -80
5214 -80 31 -116 -37 105 -76 136 -22 54 18 -109 120 -38 192 -128 -222 -19 59 124 -343 -102 187 254 -322
5237 -322 -13 165 -20 -24 37 -5 -142 34 276 135 15 205 50 -265 19 -269 -58 -90 -51 -116 148 -185
5259 -185 342 52 -71 -33 102 12 -89 -163 26 119 90 -33 13 72 15 89 214 128 -88 16 -200 -121 99 -203
5283 -203 -160 235 103 111 -70 95 3 -89 185 87 -36 66 -133 -95 -171 19 -41 -225 -15 -69 -87 0 390 53
$$ packed form
5118A8n1r3J61J42j61N2L9l4O5l2j35N9K49j32o7m4j40P3j34N0K35j65joj96M2
5144b06R6L70k5k48L50l79N1J7o3J07p7J87k60J95m9j04j90K19K21L7k71rl3M09
5168C45k89l61K74P1j04j41L85k37L3K09k7j14q5k51L72rk61J92p1J09k05J53
5190a2K6o7Rj11L7J40J71k89N2J17k53pK10O3m11M73k08J2J11j91K47r8K9j30
5214h0J11j47P9J42j81K12j58P6l6j27K29j58K30l20r4K03P8O5m67K41K89O7n76
5237c22L09J78j85mO1m2j37J76K42j41j20J90j55l15K84k88K11l2L9o5K64l33
5259a85N27k90j23L8J35r0j01p4J89R3k9j23M6N9n7P4J25q6k16J04k16P9K20l02
5283b03M3L95j32Qj81J65r2r2K74r8j23J02j99L8p6J90o0j84K10n4j8Q7L90l37
$$ plain form
5307 53 86 -271 -125 -73 74 39 -137 313 44 -63 17 7 4 -101 -5 130 68 0 -110 -65 -88 -42 111 214 -20
5332 -20 125 234 -30 -67 141 -168 41 226 -114 -5 -98 -77 -28 -165 222 -141 -165 68 101 -111 -50 -30 -4
5355 -4 -59 122 59 -52 279 -30 237 23 -272 161 28 -168 280 24 177 331 49 101 41 -5 91 -4 9
5378 9 81 -52 -18 -194 -2 51 8 -122 -17 -110 28 -46 -169 -79 -139 250 -17 66 48 131 -91 -56 -102 83 277
5403 277 39 113 -152 51 -13 263 -81 18 -130 242 10 -220 147 -127 276 304 78 136 160 163 -102 160 -63
5426 -63 -32 -172 -27 -69 156 124 118 -25 -112 8 34 -66 119 59 62 -89 105 -57 73 44 34 -27 292 -16 -51
5451 -51 -228 14 -226 27 24 118 9 -39 28 -85 207 141 34 26 86 157 354 -68 -185 324 -120 43 304 250
5475 250 3 -117 60 -144 34 110 -113 -183 -272 -160 -149 -54 47 84 220 198 131 43 -131 80 -294 154 43
$$ packed form
5307E3L3l57J46N2J47l5j76M50k69j07Q0j0lj05R6J35o2o8j10M5k3M6J53J03k34
5332b0J45J09k64l7K08l09K09J85l40J09r3K1M9j37L87l63k4K33L3k12O1K0K6
5355dn5J81o3j11L31l09K67k14k95M33j33j96M48k56J53J54k82N2o0m6R6r5J3
5378IP2j33L4j76J92N3m3j30J05r3J38p4j23R0o0L89k67Q3j8Q3k22L5m6J85J94
5403B77k38P4k65K03o4K76l44R9j48L72k32k30L67k74M03K8k26N8K4Lk65K62k23
5426f3L1j40J45m2K25l2oj43q7J20K6j00J85o0Lj51J94j62J30k9j0o1L19l08l5
5451e1j77K42k40K53lR4j09m8O7j13K92o6j07qO0P1J97m22j17N09m44J63K61n4
5475B50k47j20J77k04J78P6k23p0q9J12J1R5J01L7J36k2o7q8j74K11l74M48j11
$$ plain form
5498 43 -45 50 -220 32 -133 -31 -24 -120 -94 264 206 212 124 103 7 10 63 -91 71 -11 276 -227 54 -44 35 -94
5524 -94 -182 127 -2 110 244 -84 -168 -360 -33 149 -121 -11 -25 -194 -16 -49 -95 220 -182 196 -168 83
5546 83 -11 -137 -126 -36 78 96 104 2 -160 -259 -52 -13 50 -51 49 -84 -56 85 41 50 -116 -51 21 57 -71 15
5572 15 -38 165 -130 -103 -11 2 62 309 -81 -222 280 63 -13 -59 178 280 -268 95 170 129 395 138 -101
5595 -101 20 -81 -126 -98 212 86 -28 -278 -93 71 -28 73 128 134 140 72 218 209 62 -147 -204 -33 -8 -2 -112
5620 -112 -38 -122 2 -125 -18 2 -4 46 28 107 220 21 427 -112 144 50 130 -15 -105 1 53 45 66 226 42
5645 42 149 50 -232 244 186 -58 109 9 -116 -156 260 1 16 96 -51 -252 315 -126 32 60 16 -193 -2
5668 -2 74 -74 115 229 99 -13 -190 60 -9 -65 56 -232 -111 328 -11 -173 96 81 40 3 57 9 -134
$$ packed form
5498D3q8R5k70K52j65J02Pr6K6L58n8Oq8k1r6LN3j54J62q2K87n03K81r8P9j29
5524i4q8L09j29J12J34l28q4j92L27J82k70J10j4j69J78l3m6L15m02L78l64K51
5546H3r4j26J1R0J14J8Qj02j62r9K07L9O3j01J00j33K8J41m4Rj66O5P2L6j28Q6
5572A5n3K03k95K7R2J3O0K47l90j41N02k17p6m6K37J02n48L63P5m1K66k57k39
5595a01J21j01m5K8L10j26j14k50J85J64r9J01N5OOo8J46rj47k09n7J71K5Oj10
5620a12P4q4J24j27J07K0oN0j8P9J13j99M06n39K56r4Q0j45r0J06N2qK1J60j84
5645D2J07r9k82M76n8k44J67j00j25m0M16k59J5Q0j47k01N67m41J58K8m4k09J91
5668bP6j48J89J14j30j12j77K50o9n6J21k88J21M39l39j62K69j5m1l7N4m8j43
$$ plain form
5691 -134 -190 -134 -60 -82 -259 149 60 -44 -138 99 48 -85 75 105 134 137 176 -37 -88 -36 36 -37 -139 -3 14 115
5717 115 -105 115 387 1 -95 -1 -120 113 -39 -79 -89 -150 128 -42 -43 143 -17 -6 14 -59 -24 63 178 -48
5741 -48 -44 17 112 101 41 -46 193 41 -2 54 -83 52 73 -211 -215 -93 -13 54 81 235 -122 -137 -1 -74 -164 -349
5767 -349 54 113 -173 81 167 -135 -319 -208 -31 44 56 43 -144 -68 125 -99 60 -203 -54 -161 79 -44
5789 -44 -143 94 -41 -33 -76 113 112 -123 -67 -147 -131 25 -171 -267 47 -169 82 79 -62 134 -227 -143 -285 49 95
5814 95 219 101 -1 -191 124 -31 -145 -108 101 123 195 -112 -31 123 -92 187 113 22 -11 -137 -358 169 -28
5837 -28 70 265 -301 4 23 -64 -16 -29 -85 -115 200 -202 165 170 -86 -132 -11 202 -92 -177 -38 76 -30 63
5861 63 60 85 -67 -221 91 170 -118 -142 237 96 -7 86 -1 97 -120 -86 96 121 -13 91 109 125 -14 39 -401
$$ packed form
5691a34n6N6P4k2j77M08q9j04r4K37n1j33J60L0K9LL9k13n1N2P2p3j02J36J7J01
5717A15k20K20K72l86r6R4j19K33j52m0j0o1K78j70jJ86j60J1K0p3L5Q7J15k26
5741d8MO1R5j1o0q7K39j52m3N6j37J35K1k84mJ22Q0O7K7J54l57j5J36p3r0j85
5767c49M03N9k86K54Q6l02j84J11J77P5J2j3j87P6J93k24J59k63J49j07K40j23
5789d4r9K37j35Qm3J89jk35N6q0J6J56j96r6L14k16K51lj41J96l61Q4j42L34M6
5814I5J24j18j02j90L15j55j14L7K09K2P2l07Q1J54k15K79p4r1l3j26k21N27j97
5837b8R8J95n66L05J9q7M8j3n6l0L15m02L67Nk56m6J21K13k94q5J39J14j06R3
5861F3lK5j52j54L12P9k88k4L79j41j03R3q7R8k17L4J82K5j34J04J8J6j39N3m40
$$ plain form
5886 -401 -42 301 16 -168 55 23 52 -58 19 153 -14 -87 -66 -196 -7 -50 -49 62 20 -26 -115 99 -158 100
5910 100 -6 -104 -207 55 110 83 131 19 178 -56 104 -110 3 -60 258 -199 197 -156 -151 -8 -178 -68
5932 -68 -98 38 78 -39 19 373 -59 -34 -137 88 -54 147 -142 245 -100 -39 233 -73 184 124 114 45 176
5955 176 154 -19 -143 -215 232 55 68 31 20 232 159 47 -11 123 83 -41 136 -180 7 120 320 -43 6
5978 6 -47 165 164 -25 220 -83 -19 -235 -70 -66 -139 -210 -219 28 -61 -50 144 -80 140 -41 211 -169 -342 23 -104
6003 -104 -68 -155 124 185 -18 133 156 12 7 165 -227 -43 -42 20 -148 102 -26 -60 242 155 46 16 161 67
6027 67 52 72 150 8 -74 -16 189 -40 257 -50 -3 206 8 -57 -52 -110 145 -42 -128 214 -133 -41 1 -356 -206
6052 -206 -218 -82 -22 -62 186 -51 -138 206 52 -198 9 209 -57 -225 26 -1 173 -53 101 251 -186 -34
$$ packed form
5886d01L59L43k85j84K23l2K9j10P7J34j67p3K1j30J89m3JJ11m2m6q9K14k57K58
5910A00j06r8j03K62N5k7M8j12J59k34J60k14J13o3L18m57L96l53NJ43j70J10
5932f8l0J36M0j17N8L54m32K5j03K25j42K01k89L87l45O1K72l06K57o0j0o9J31
5955A76k2j73j24p2M47j77J3l7j1K12p3j12n8J34m0j24J77l16J87J13K00l63M9
5978Fn3K12jj89K45l03O4k16J65Mp3p1rK47q9J1J94k24K20j81K52l80j73L65j27
6003a04L6q7K79O1k03J51K3j44nJ58l92J84JO2j68K50j28l4L02q7j09l0J45r4
6027F7j5K0P8j42q2N8K05k29K97l07M7K09j98o5Nn8K55j87q6L42l47R2M2l57J50
6052b06j2J36O0m0K48k37q7L44j54k50K07K00k66j68K51k7J74k26J54J50m37J52
$$ plain form
6074 -34 151 -89 119 74 29 93 -230 -169 123 23 -10 -191 -190 69 50 34 -174 -180 -148 -9 -55 -46 -69 152 -225 130
6100 130 73 -105 222 11 -23 134 40 -5 -171 61 214 310 -123 -255 5 -23 3 159 67 7 477 124 -273
6123 -273 -92 25 147 -7 1 221 279 135 -37 107 -67 20 56 139 -80 -160 104 -234 25 -270 -15 -66 196
6146 196 105 -122 236 -133 121 226 146 135 -150 -85 156 -170 -44 8 170 -101 -57 106 -20 -120 132 88
6168 88 59 -137 138 56 -133 101 27 19 -27 82 -3 55 -5 -27 -195 -228 50 218 -102 190 44 281 94 129
6192 129 227 120 128 -51 20 -60 182 -41 190 28 147 -61 41 192 51 -29 -86 -59 186 176 134 -4 -244
6215 -244 -238 92 97 22 -306 46 8 49 158 -32 17 -127 264 -26 -229 125 -259 -137 -160 94 51 -198 -47
6238 -47 -48 227 126 229 -57 -354 -91 32 -123 284 -27 -45 11 -120 5 -262 -154 -11 -276 -218 -181 -119 -81
$$ packed form
6074c4J85k40K08m5m5O4l23O1K92j00l3j81JK59j9j6k08oL2J39m6Rk3K21l77L55
6100A30n7j78L27k11l4J57r4m5j66K32J53R6m33j32K60k8K6J56r2o0M70l53l97
6123b73J81J17J22j54QK20N8j44j72J44j74Q7L6Q3k19q0K64l38K59k95K55n1K62
6146A96r1k27L58l69K54J05q0j1k85O5K41l26J26N2J62k71M4J63j26j00K52m4
6168H8k9j96K75q2j89K34p4qm6J09q5N8o0k2j68l3K78J68l20K92j46K37j87L5
6192A29R8j07Qj79P1q0K42k23K31j62J19k08J02J51j41q0n7K7K45j0m2j38k40
6215b44OL30Np5l28L52l8M1J09j90M9j44L91k90k03L54l84J22k3K54m3k49J51
6238d7jK75j01J03k86k97K63J23j55M07l11j8N6j31J25k67J08J43k65N8L7O2L8
$$ plain form
6261 -81 164 4 -25 64 -39 105 -282 69 247 41 -238 -64 230 -211 142 81 104 28 -271 -125 -58 -93 13
6284 13 27 40 -26 -61 -153 86 91 -162 -260 -25 59 -222 3 111 54 -103 -51 90 -124 51 252 101 44 63 17
6309 17 91 -35 56 56 -381 -213 181 155 52 -243 -417 -24 186 -177 111 -149 -155 -345 -106 46 -14 205 -49
6332 -49 -60 56 -77 -32 237 -76 97 196 84 -62 -73 -8 135 342 -236 214 47 -157 104 -121 151 -164
$$ packed form
6261h1K45j60k9Q9j03J44l87L51J78k06k79J74K94m41L53o1K3p6k99J46O7l5J06
6284A3J4J3o6l5r2K39Nk53r8K35Q4k81K25J08n7j57N2J41k14J75K01j51n7J9m6
6309A7P4j26R1%m37J68L94k6j03k95j74L93K10l63K88k60oj90K39J52o0K19k54
6332d9j1J16j33M5K69l13J73R9j12j46j1O5J43K07n78M50j67k04K61k25K72l15
$$ [...]
8191A14
##END NTUPLES=NMR FID
##END=
