##TITLE=1H_SRR167_C2TFA
 CDCl3
 8 sc, 
 5.9.2023
##JCAMPDX= 6.0         $$ Bruker NMR JCAMP-DX V2.0
##DATA TYPE= NMR FID
##DATA CLASS= NTUPLES
##ORIGIN= UXNMR, Bruker Analytische Messtechnik GmbH
##OWNER= root
$$ XWIN-NMR		Version 3.5
$$ Tue Sep  5 14:27:41 2023 Russian Standard Time (UT+4h)  she@DPX200
##.OBSERVE FREQUENCY= 200.13135
##.OBSERVE NUCLEUS= ^1H
##.DELAY= (6, 6)
##.ACQUISITION MODE= SIMULTANEOUS
##.ACQUISITION SCHEME= undefined
##.AVERAGES= 8
##.DIGITISER RES= 18
##SPECTROMETER/DATA SYSTEM= spect
##.PULSE SEQUENCE= zg30
##.SOLVENT NAME= CDCl3
##.SHIFT REFERENCE= (INTERNAL, CDCl3, 0, 15.7039)
##AUDIT TRAIL= $$ (NUMBER, WHEN, WHO, WHERE, WHAT)
$$ ##TITLE= Audit trail, XWIN-NMR		Version 3.5
$$ ##JCAMPDX= 5.01
$$ ##ORIGIN= Bruker BioSpin GmbH
$$ ##OWNER= she
$$ F:/spectra/data/she/nmr/H-F/1/audita.txt
$$ ##AUDIT TRAIL=  $$ (NUMBER, WHEN, WHO, WHERE, WHAT)
(   1,<2023-09-05 14:26:23.93 +0400>,<she>,<DPX200>,
      <created by zg, POWCHK disabled, PULCHK disabled
       configuration hash MD5:
       00 E9 B6 7A A2 85 ED C7 34 08 36 98 17 FE 4E 26
       data hash MD5: 16K
       85 5B DB 8D 6A 32 F8 E4 9E FD 0E 12 6B 20 46 08>)
$$ ##END=
$$ 
$$ hash MD5
$$ 3C A8 53 98 8F 4A 4D BD E2 F7 83 AA 25 63 6F F0
##$RELAX= 
##$RELAX= 
##$RELAX= 
##$RELAX= 
##$RELAX= 
##$RELAX= 
$$ Bruker specific parameters
$$ --------------------------
##$DU= <F:/spectra>
##$EXPNO= 1
##$NAME= <H-F>
##$PROCNO= 1
##$TYPE= <nmr>
##$USER= <she>
##$AMP= (0..31)
100 100 100 100 100 100 100 100 100 100 100 100 100 100 100 100 100 100 
100 100 100 100 100 100 100 100 100 100 100 100 100 100 
##$AQSEQ= 0
##$AQ_mod= 1
##$AUNM= <au_zg>
##$AUTOPOS= <>
##$BF1= 200.13
##$BF2= 200.13
##$BF3= 200.13
##$BF4= 200.13
##$BF5= 200.13
##$BF6= 200.13
##$BF7= 200.13
##$BF8= 200.13
##$BYTORDA= 1
##$CFDGTYP= 0
##$CFRGTYP= 5
##$CHEMSTR= <none>
##$CNST= (0..31)
1 1 145 1 1 1 1 1 1 1 1 1 1 1 1 1 1 1 1 1 1 1 1 1 1 1 1 1 1 1 1 1 
##$CPDPRG= <>
##$CPDPRG1= <>
##$CPDPRG2= <>
##$CPDPRG3= <>
##$CPDPRG4= <mlev>
##$CPDPRG5= <mlev>
##$CPDPRG6= <mlev>
##$CPDPRG7= <mlev>
##$CPDPRG8= <mlev>
##$CPDPRGB= <>
##$CPDPRGT= <>
##$D= (0..31)
0 1.2 0 0 0 0 0 0 0 0.06 0 0.03 0 0 0 0 0.0002 0 0 0 0 0 0 0 0 0 0 0 0 
0 0 0 
##$DATE= 1693909583
##$DBL= (0..7)
120 120 120 120 120 120 120 120 
##$DBP= (0..7)
150 150 150 150 150 150 150 150 
##$DBP07= 0
##$DBPNAM0= <>
##$DBPNAM1= <>
##$DBPNAM2= <>
##$DBPNAM3= <>
##$DBPNAM4= <>
##$DBPNAM5= <>
##$DBPNAM6= <>
##$DBPNAM7= <>
##$DBPOAL= (0..7)
0.5 0.5 0.5 0.5 0.5 0.5 0.5 0.5 
##$DBPOFFS= (0..7)
0 0 0 0 0 0 0 0 
##$DE= 6
##$DECBNUC= <off>
##$DECIM= 32
##$DECNUC= <off>
##$DECSTAT= 4
##$DIGMOD= 1
##$DIGTYP= 9
##$DL= (0..7)
0 120 120 120 120 120 120 120 
##$DP= (0..7)
150 150 150 150 150 150 150 150 
##$DP07= 0
##$DPNAME0= <>
##$DPNAME1= <>
##$DPNAME2= <>
##$DPNAME3= <>
##$DPNAME4= <>
##$DPNAME5= <>
##$DPNAME6= <>
##$DPNAME7= <>
##$DPOAL= (0..7)
0.5 0.5 0.5 0.5 0.5 0.5 0.5 0.5 
##$DPOFFS= (0..7)
0 0 0 0 0 0 0 0 
##$DQDMODE= 0
##$DR= 18
##$DS= 0
##$DSLIST= <SSSSSSSSSSSSSSS>
$$ [...]
##$SUBNAM2= <"">
##$SUBNAM3= <"">
##$SUBNAM4= <"">
##$SUBNAM5= <"">
##$SUBNAM6= <"">
##$SUBNAM7= <"">
##$SUBNAM8= <"">
##$SUBNAM9= <"">
##$SW= 18.05172834244
##$SWIBOX= (0..15)
0 0 2 0 0 0 0 0 0 0 0 0 0 0 0 0 
##$SW_h= 3612.71676300578
##$TD= 16384
##$TD0= 1
##$TE= 0
##$TE2= 300
##$TE3= 300
##$TEG= 300
##$TL= (0..7)
0 120 120 120 120 120 120 120 
##$TP= (0..7)
150 150 150 150 150 150 150 150 
##$TP07= 0
##$TPNAME0= <>
##$TPNAME1= <>
##$TPNAME2= <>
##$TPNAME3= <>
##$TPNAME4= <>
##$TPNAME5= <>
##$TPNAME6= <>
##$TPNAME7= <>
##$TPOAL= (0..7)
0.5 0.5 0.5 0.5 0.5 0.5 0.5 0.5 
##$TPOFFS= (0..7)
0 0 0 0 0 0 0 0 
##$TUNHIN= 0
##$TUNHOUT= 0
##$TUNXOUT= 0
##$USERA1= <user>
##$USERA2= <user>
##$USERA3= <user>
##$USERA4= <user>
##$USERA5= <user>
##$V9= 5
##$VALIST= <valist>
##$VCLIST= <CCCCCCCCCCCCCCC>
##$VD= 0
##$VDLIST= <DDDDDDDDDDDDDDD>
##$VPLIST= <PPPPPPPPPPPPPPP>
##$VTLIST= <TTTTTTTTTTTTTTT>
##$WBST= 1024
##$WBSW= 4
##$XGAIN= (0..3)
0 0 0 0 
##$XL= 0
##$YL= 0
##$YMAX_a= 111612
##$YMIN_a= -179724
##$ZGOPTNS= <>
##$ZL1= 120
##$ZL2= 120
##$ZL3= 120
##$ZL4= 120
##$ABSF1= 10
##$ABSF2= 0
##$ABSG= 5
##$ABSL= 3
##$ALPHA= 0
##$AQORDER= 0
##$ASSFAC= 0
##$ASSFACI= 0
##$ASSFACX= 0
##$ASSWID= 0
##$AUNMP= <proc_1d>
##$AZFE= 0.1
##$AZFW= 0.1
##$BCFW= 1
##$BC_mod= 2
##$BYTORDP= 1
##$COROFFS= 0
##$CY= 11.3945322036743
##$DATMOD= 1
##$DC= 2
##$DFILT= <>
##$DTYPP= 0
##$F1P= 15.7292609196834
##$F2P= 12.9074282941183
##$FCOR= 0.5
##$FTSIZE= 0
##$FT_mod= 4
##$GAMMA= 1
##$GB= 0.15
##$INTBC= 1
##$INTSCL= 1
##$ISEN= 128
##$LB= 0.24
##$LEV0= 0
##$LPBIN= 0
##$MAXI= 10000
##$MC2= 0
##$MEAN= 0
##$ME_mod= 0
##$MI= 1.114404
##$NCOEF= 0
##$NC_proc= 0
##$NLEV= 6
##$NOISF1= 3.799351
##$NOISF2= 2.8
##$NSP= 1
##$NTH_PI= 0
##$NZP= 0
##$OFFSET= 15.70392
##$PC= 1
##$PHC0= -21049.46
##$PHC1= 18.65271
##$PH_mod= 1
##$PKNL= yes
##$PPARMOD= 0
##$PSCAL= 0
##$PSIGN= 0
##$REVERSE= no
##$SF= 200.130013532006
##$SI= 16384
##$SIGF1= 3
##$SIGF2= 2
##$SINO= 400
##$SIOLD= 16384
##$SREGLST= <1H.CDCl3>
##$SSB= 0
##$STSI= 0
##$STSR= 0
##$SW_p= 3612.71676300578
##$SYMM= 0
##$S_DEV= 0
##$TDeff= 0
##$TDoff= 0
##$TI= <>
##$TILT= no
##$TM1= 0
##$TM2= 0
##$TOPLEV= 0
##$USERP1= <user>
##$USERP2= <user>
##$USERP3= <user>
##$USERP4= <user>
##$USERP5= <user>
##$WDW= 1
##$XDIM= 8192
##$YMAX_p= 0
##$YMIN_p= 0
$$ End of Bruker specific parameters
$$ ---------------------------------
##NTUPLES= NMR FID
##VAR_NAME=  TIME,          FID/REAL,        FID/IMAG
##SYMBOL=    X,             R,               I
##VAR_TYPE=  INDEPENDENT,   DEPENDENT,       DEPENDENT
##VAR_FORM=  AFFN,          ASDF,            ASDF
##VAR_DIM=   8192,          8192,            8192
##UNITS=     SECONDS,       ARBITRARY UNITS, ARBITRARY UNITS
##FACTOR=    0.0002768,     1,               1
##FIRST=     0,             0,               0
##LAST=      2.2672688,     0,               0
##MIN=       0,             -179724,         0
##MAX=       2.2672688,     111612,          0
$$ Real data points
##PAGE= N=1
##DATA TABLE= (X++(R..R)), XYDATA
0@%%%%%%%%%%%%Qj6J6j6K4l2L2m0N3o1P2q8J04j20J36j60J86k10K40k78L18l60
$$ 0 0 0 0 0 0 0 0 0 0 0 0 0 8 -8 8 -8 16 -16 16 -24 29 -32 40 -48 56 -64 72 -88 98 -112 128 -150 168 -192
34a92M08m58N14n77O48p25Q05q94R93j100J218j347J487j640J808j993K195k418
$$ -192 216 -242 272 -305 343 -382 423 -471 522 -578 640 -707 780 -860 948 -1045 1150 -1268
52a268K666k941L247l591L982m430M949n558O283p167Q274r697J1609j4336J8565
$$ -1268 1398 -1543 1704 -1887 2095 -2335 2614 -2944 3339 -3828 4446 -5251 6358 -7978 10587
67A0587k6067M3326j56520n1050K22308o4806n687L6709l4724J480J15887r320
$$ 10587 -15480 27846 -128674 -179724 42584 -22222 -27909 8800 -25924 -24444 91443 82123
79H2123k1427K8754m7704o0061O9221J7157k6090M0998q644r7546q173K5540k0560
$$ 82123 60696 89450 41746 -18315 50906 68063 41973 82971 74327 -23219 -31392 -5852 -26412
92b6412p93o230m9092J0084L2861l743K7366L2653l2450o700K2397j8001Q167
$$ -26412 -27205 -33435 -82527 -72443 -39582 -43325 -15959 16694 -15756 -22456 -59 -18060 -9893
105i893L9781j4114J234L6253k2568j3470N2746j1049n6102O845r860l9107K4665
$$ -9893 29888 15774 17008 53261 30693 17223 69969 58920 2818 9663 -197 -39304 -14639
118a4639J0748m0859J7952K7219l7438L968L1385l0559n042L9715k0812j7634
$$ -14639 -3891 -44750 -26798 421 -37017 -33049 -1664 -32223 -37265 2450 -18362 -35996
130c5996N1905J8167j7229K1498N047k0394J3182l49l2157L892J1002k3090m52
$$ -35996 15909 34076 16847 38345 43392 22998 36180 35831 3674 7566 18568 -4522 -4974
143d974J5237j2020l208Q554j5793j2501N020p187k054J1388j198M642J8665J725
$$ -4974 10263 -1757 -4965 3589 -12204 -24705 -19685 -26872 -28926 -17538 -18736 -14094 4571 6296
157F296q7J2545n518r272Q525m939j0009J3039K289j1396J0849L054j9811J558
$$ 6296 6209 18754 13236 3964 12489 7550 -2459 10580 12869 1473 12322 15376 -4435 -2877
171b877N070k1703m690J1107j1284q19K2050j368m402J9812J968j2173J0518M234
$$ -2877 2193 -19510 -24200 -13093 -24377 -25196 -3146 -4514 -8916 10896 12864 691 11209 15443
185A5443j2696O255R971r294L026J1773p718p219L724r997j2414j26n129q750
$$ 15443 2747 9002 18973 9679 12705 24478 16760 9541 13265 3268 -9146 -9272 -14401 -23151
199b3151K958L842k460M361M528k10P60J074L78J638K809M773O592L987N019O387
$$ -23151 -20193 -16351 -18811 -14450 -9922 -10132 -9372 -8298 -7920 -6282 -3473 1300 7892 11879 16898 23285
215B3285q07k746R40m885r642j256k289p648J146K321o615q24L936o971n870M051
$$ 23285 22478 19732 20672 15787 6145 4889 2600 -5048 -3902 -1581 -8196 -9020 -5084 -12055 -17925 -13874
231a3874k786l682P824M742n82R047Q902j666K529N488l676k491K994l218l307
$$ -13874 -16660 -20342 -12518 -7776 -8358 689 9591 7925 10454 15942 12266 9775 12769 9551 6244
246F244L653N91m376j6l27n799m701k213n161l983R74J425j55L215N291K229J249
$$ 6244 9897 10488 6112 6096 5769 -30 -4731 -6944 -12105 -16088 -15114 -13689 -13844 -10629 -5338 -3109 -1860
263a860K990Q32j697K365K839j362J775N424J11r45K498j986n686j185k209o878
$$ -1860 1130 1962 265 2630 5469 4107 5882 11306 11417 10472 12970 10984 5298 4113 1904 -4974
279d974j791J849k959l85L913r23j312L068j98l663J297K729m63J946M873J369
$$ -4974 -6765 -4916 -7875 -8260 -4347 -5270 -6582 -3514 -3712 -7375 -6078 -3349 -3812 -1866 3007 4376
295D376J040M147M72l283n01k95m112k377O38r36j739K241P73l004k57J152k960
$$ 4376 5416 9563 10035 6752 6251 5956 1844 -533 105 -831 -2570 -329 444 -2560 -2817 -1665 -4625
312d625k089J886l69n23M282K758m11L415K962k584p76J326k561l050K099n9l152
$$ -4625 -6714 -4828 -5197 -5720 -1438 1320 909 4324 7286 4702 3926 5252 2691 -359 1740 1681 -1471
329a471K068J910k836m58R06l599k274J343j493j409K883L191m98K292L161o16
$$ -1471 597 2507 -329 -787 119 -3480 -5754 -4411 -5904 -7313 -4430 -1239 -1737 555 3716 3100
345C100l35K205j470j904J273Q34j270N84J944j553r73L21l058l578k85o56k700
$$ 3100 2765 4970 3500 1596 2869 3703 2433 3017 4961 3408 2435 2756 -302 -3880 -4165 -4821 -7521
362g521N09K629n26J194K983J23r70K143M06j506J095K320n15J411K408k43q58
$$ -7521 -7012 -4383 -4909 -3715 -732 -609 -1579 564 970 -536 559 2879 2364 3775 6183 5940 5082
379E082J229r99l296j099m56k543j091J158p28q91J351J83j469J31M58j508K82
$$ 5082 6311 5312 2016 917 461 -2082 -3173 -2015 -2743 -3634 -2283 -2100 -3569 -3438 -2980 -4488 -4206
396d206K078M56KL186J900q08J429J465k176o47R55j888j838J805j42k053J010
$$ -4206 -2128 -1672 -1670 1516 3416 2608 4037 5502 3326 2679 3634 1746 -92 1713 1571 -482 528
413E28N84k549j74M19k316r46J737l02o88K611J363n23J772J374j939J94J041
$$ 528 1112 -1437 -1611 -1192 -3508 -4454 -2717 -3019 -3707 -1096 267 -256 1516 2890 951 1145 2186
430B186j131p95J396Q3n25O52M72r96o99k45j074j453j63j5q86M59J775K74m59
$$ 2186 1055 260 1656 1739 1214 1866 2338 1342 643 398 -676 -2129 -2292 -2307 -3193 -2734 -959 -685 -1144
449a144J327L52j312M22R14j405J42K110n34l73K494l30k066P49P1k856J40R61
$$ -1144 183 535 -777 -355 559 -846 -704 1406 872 499 2993 2663 597 1346 1417 -1439 -1299 -338
467c38j991K54K434m99p81K296k35j747J479O5j897P69J429r19J49K286j011r13
$$ -338 -2329 -2075 359 -140 -921 1375 1140 -607 872 937 -960 -191 1238 319 468 2754 1743 830
485H30J025r97k084K78k7j768M24Q80k12K77J006k59o02J98L21p77R5J237R80
$$ 830 1855 858 -1226 -948 -975 -2743 -2319 -1439 -1651 -1374 -368 -627 -1229 -1031 -710 -1487 -1392 -155 825
504H25L03J017P60J41j05K43r81j696M37k22j608L05Q50r64k63J395j669j057
$$ 825 1128 2145 2905 3046 2941 3184 2203 507 944 722 -886 -581 269 -695 -958 437 -1232 -2289
522b289J052q93j513J563Q13q07J568K202q63M45J502j274p71Q42n81j267J265
$$ -2289 -1237 -2130 -3643 -2080 -1267 -2074 -506 1696 833 1278 2780 1506 735 1577 996 -271 994
539I94N71j074L86Q48j600m68J68j443j310Q54l56n0J171R93J72J25P78m33q7
$$ 994 1565 491 877 1725 125 -343 -175 -1618 -2928 -2074 -2430 -2480 -1309 -316 -144 -19 759 326 239
558B39K48k32j88N36O90O76r2K65o7p03o54m84j100r43O48l72j56R33Q00o68L47
$$ 239 487 255 67 603 1293 1969 1877 2142 2075 1372 718 234 -866 -1809 -1161 -1533 -1689 -756 44 -624 -277
579b77J88j319j39R67o13q2J550P35l32J211N13j194l02K53j587m41R67r43m26
$$ -277 -89 -1408 -1547 -580 -1193 -1275 275 1010 678 1889 2402 1208 906 1159 -428 -869 98 -845 -1271
598a271J444K48n93N81K00j308n60N04p17K34J354K72l02J555L48p29n8o3j389
$$ -1271 173 421 -172 409 609 -699 -1259 -755 -1472 -1238 116 388 86 1641 1989 1260 1202 1139 -250
617b50k90j49m46K02N42M40J46k35j68m72o61q9J1l88M25J109M29O53J025J02
$$ -250 -540 -689 -1135 -933 -391 49 195 -40 -208 -680 -1341 -1430 -1419 -1807 -1382 -273 156 809 1834 1936
637A936o68N8j18p75k5L48l78p4J261p57m40M68p74j861K33j10j054M74J143N2
$$ 1936 1268 1326 1208 433 408 756 378 304 1565 808 368 836 62 -1799 -1566 -1676 -2730 -2256 -1113 -1061
657a061J00J429o2j19M06j23q12Q47J14k28N41R88j52k63M72p63j202l45n95q90
$$ -1061 -961 468 406 287 693 570 -242 605 719 491 1032 2020 1868 1605 2077 1314 112 -233 -828 -1718
677a718j46K60K38L32N95k20k01K77r3m25k79O49O16K48J035R18N1j79L72o86
$$ -1718 -1864 -1604 -1366 -1034 -439 -659 -860 -583 -676 -1101 -1380 -731 -115 133 1168 2086 2137 1958 2330 1644
697A644q70M7p24n44K56K15n65J64M74o19o42P9q36k82M74M94j23J132Q27NN79
$$ 1644 774 821 97 -447 -191 24 -541 -377 97 -522 -1164 -1085 -1921 -2203 -1729 -1235 -1358 -226 601 606 1185
718A185O85p80m90O75n49l96O34J60m05L94K49o05n89l99m99q47K44m50j29R61
$$ 1185 1870 1090 600 1275 726 330 964 1124 719 1113 1362 757 168 -231 -730 -1577 -1333 -1783 -1912 -951
738i51O68J90J43M32m06j1M4j18RK49N50J46J87N47k27k22n03n71r00k24j52k30
$$ -951 -283 -93 50 482 76 65 109 -9 0 249 799 945 1132 1679 1452 1230 727 156 -744 -968 -1120 -1350
760a350J26P68j21J6O81j31k82k72L04j31K9P77K23K37Q25r3m49J41j59j034m28
$$ -1350 -1224 -456 -577 -561 120 -11 -293 -565 -261 -392 -363 414 637 874 1699 1606 1157 1298 1139 105 -323
781c23m7l62j93O26J22k77L23k12m74l0l50j4L07N67M75K09O36N29j65Rj64o53
$$ -323 -370 -732 -925 -299 -177 -454 -131 -343 -817 -847 -1197 -1211 -904 -337 138 347 983 1512 1347 1356 1192 539
803E39M9j69k55j66L85j76lj75l4q00k49j86n81J9O42J58M83N39Q22k96J5L90
$$ 539 588 419 164 -2 383 207 204 29 -5 -805 -1054 -1240 -1821 -1802 -1160 -1002 -519 20 842 546 561 951
825I51k24k87K95O5l74N55J82k4k38l4l99o19j63q78k88l3K60r0M52O83J3P6Q6
$$ 951 727 440 735 800 426 981 1163 1139 901 867 468 -151 -314 -1192 -1480 -1513 -1253 -1343 -891 -208 -195 -119 -33
848c3J20m65j8N78J81L84N96j37L38J75l07q16j51n25m25j3j8K9k19K46j00r4
$$ -33 87 -378 -396 182 363 747 1343 1206 1544 1719 1412 596 445 -80 -505 -518 -536 -507 -726 -480 -580 -674
870f74L8k28k30j4L78j76N00Q48L81K24J97J8l19l51O4n25N7p5J11n8K00l7m58
$$ -674 -636 -864 -1094 -1108 -730 -906 -406 442 823 1047 1244 1262 943 592 656 131 188 113 224 166 366 329 -129
893a29j66l1o17n16N32j22M2Q11J97J33L94j58J51J58j39j63o1K79j93J9L10P2
$$ -129 -295 -326 -943 -1459 -927 -1049 -1007 -196 1 134 528 370 521 679 540 377 316 595 402 421 731 803
915H03k36j64n47k35o26r4J66p3N14J21p2M16K17j07l41R1K1m8K26J91L40q4O62
$$ 803 567 403 -144 -379 -1005 -1099 -933 -1006 -492 -371 -443 -27 190 83 -258 -167 -146 -194 32 223 563 479 1141
938A141l75l20K39o30l05j30j2m69J8N25j26K22J85j66r2j5m4j7R3L88K43J55
$$ 1141 766 446 685 55 -250 -380 -392 -861 -843 -318 -444 -222 -37 -203 -295 -310 -354 -371 -278 110 353 508
960E08Q2L07J46j17j9q79K7n7k97J34J06p8J40k53R8o23rK29k67J17K85L09P4
$$ 508 590 897 1043 926 907 28 55 -2 -299 -165 -59 -137 3 -250 -152 -775 -784 -555 -822 -705 -420 -111 -37
983c7L36L05q1K19R9o46J82M4l8o5j7J09j71o0l7m25j64j60l12j76L55p4J27M03
$$ -37 299 604 523 742 841 195 377 421 383 318 301 410 239 179 142 -283 -447 -607 -919 -1095 -740 -814 -687 -284
1007b84M35k31K87J57m26M09j3k91L85J45O3K85l15j23k2j96j64m76j67j6l4N4
$$ -284 151 -80 207 364 -62 347 334 43 428 573 636 921 606 483 461 265 101 -375 -542 -558 -592 -538
1029e38j92M55K7k71N16n56J49J40K16N1J53J00K68L04j02K77m59l61K19j77k20
$$ -538 -730 -275 -248 -519 -3 -559 -410 -270 -54 -3 150 250 518 822 720 997 538 177 396 219 -1
1050aj6Pj82J5m4m9J84m28J29j21L5j39L85L1l0M56J59M4q9K91l47j55M6N9q9
$$ -1 -17 -10 -192 -177 -221 -270 -86 -514 -385 -506 -471 -610 -225 -194 -224 232 391 435 346 637 290 135 181 240 151
1075A51j57K63k20r2J78K0m19j38q2K25k68M45Q3n6k5K34M9K30k58k7o0J33j29
$$ 151 -6 257 37 -55 123 143 -276 -414 -496 -271 -539 -94 -11 -67 -92 142 191 421 163 136 76 209 80
1098H0M1K66J5j89j31p0kj26j70j6k32J74R1O8J8M05m9j46J59J1p1J13k37K30
$$ 80 121 387 402 213 82 12 10 -116 -286 -302 -534 -360 -269 -201 -183 222 173 27 186 197 126 239 2 232
1122B32K58k1p0r6J19k73r0k26J58k12J5l48M50j03J22j53o2k26J61K09P5%J36
$$ 232 490 469 399 303 422 149 59 -167 -9 -221 -206 -554 -104 -207 -85 -238 -300 -526 -365 -156 -81 -81 55
1145E5J83j26K56J53L2k59o5k5j42o8l5j0J60j32m0l29J23J29k38J00j11lK22
$$ 55 238 112 368 521 553 294 229 204 62 -6 -41 -51 109 -23 -63 -392 -269 -140 -378 -278 -389 -392 -170
1168a70K43Qj26L74k65L32j19k18L36r9q5k46L31j38J85l20r1P2k36p5l22K92
$$ -170 73 81 -45 329 64 396 277 59 395 296 211 -35 296 158 343 23 -68 4 -232 -307 -629 -337
1190c37j0j41M49j21L43j86Q6k53L33J47k17q8J31J60j86J34K15n7r0j72k56R9
$$ -337 -347 -488 -39 -160 183 -3 83 -170 163 310 93 5 136 296 110 244 459 402 312 140 -116 -17
1212a7K01l75Q4O7j35M1K01k14l3r0J58j62K17k2L8K23n1L53o31K65n8Q5j92k6
$$ -17 184 -191 -107 -40 -175 -134 67 -147 -180 -270 -112 -274 -57 -79 -41 182 131 484 -147 118 60 145 -47 -73
1236g3j63m9M1K20J0O3J38l85K46k34K69j14l5K20j62J26K04r3l65K23j79J91
$$ -73 -236 -285 -244 -24 -14 49 187 -198 48 -186 83 -31 -66 154 -8 118 322 229 -136 87 -92 99
1258I9l0R6j94Q1P0r1n1o5K09l31K73r5M3k78K56r9q1L24j28o2L69j99J43k46
$$ 99 69 165 -29 52 122 31 -20 -85 124 -207 66 -29 14 -264 -8 -107 -188 136 8 -54 315 116 259 13
1282A3L44o19M35k39K37k9J33j74m3j12q1l46L6K83j57J39J08Lk01N27j21o9q4
$$ 13 357 -262 173 -66 171 142 275 101 58 -54 -135 -481 -445 -162 -319 -180 -72 -69 -270 257 136 67 -17
1305a7nK79j91J60k49J72J1K7n0j97K32k70m4k12J60K70j94Q8m7O8lL7j57J40
$$ -17 -22 257 66 226 -23 149 160 187 137 -60 172 -98 -142 -354 -194 76 -118 -30 -77 -9 -12 25 -132 8
1329HJ03l13K8K18J80j3p0j53L37p8k59n3J39M9k61J45j89M4N0J28k10k40L50
$$ 8 111 -202 -174 44 224 211 141 -12 325 247 -12 -65 74 123 -138 7 -182 -138 -88 40 -170 -410 -60
1352f0k52K61j28K8O8J6lK76J35j07k05J09l61J40K96q2j39J19j38l37K76J80
$$ -60 -312 -51 -179 -151 -83 -67 -70 206 341 234 29 138 -223 -83 213 131 -8 111 -27 -364 -88 92
1374I2r3o2M8k22J56j6L9J99qq8j14m2J95j99J61o0Q8q5P7j12p3K39k24O9j39
$$ 92 -1 -63 -15 -237 -81 -97 -58 141 133 45 -69 -111 84 -115 46 -14 74 -11 66 -46 -119 120 -104 -35 -174
1399a74K39k83K59n8N7O0j57N3jJ86k88q0K07N7n1k17K74j53J7J54j29J67j05
$$ -174 65 -218 41 -17 40 100 -57 -4 -5 181 -107 -187 20 77 26 -191 83 -70 -53 101 -28 139 34
1422C4J4r8k76N13k90K13j63j12J91lk6k82J23O8K05k6k0oM1j17J83Q1j94n9p0
$$ 34 48 -50 -326 187 -103 110 -53 -165 26 23 -3 -285 -162 -94 111 85 65 59 100 -17 166 247 53 -6 -76
1447g6RJ68j9l4k58K15L5j56J34r9J01p8J53q7J00J04j13J5k7j13j4J30m9j28
$$ -76 -67 101 82 48 -210 5 40 -116 18 -81 20 -58 95 8 108 212 99 114 87 -26 -40 90 41 -87
1471h7K50K43m77j68J33n2J0N9k27J69j65J32Q0J70j85K20P8j18o0K7J47j78j91
$$ -87 163 406 -71 -239 -106 -158 -148 -89 -316 -147 -312 -180 -100 70 -115 105 183 65 5 32 179 1 -190
1494a90J46N8j53K93J9j42L01k64J27k86K4J93m5k48mJ9K39j05k0N0k19M31l51
$$ -190 -44 14 -139 154 173 31 332 68 195 -91 -67 126 81 -167 -171 -152 87 -18 -38 12 -207 224 -127
1517a27K55J3j57j40J22%Q3l34L69j3j47K59m02J0J28L3J51l76K69p2K94k47r6
$$ -127 128 141 -16 -156 -34 -34 49 -285 84 71 -76 183 -219 -209 -81 -48 103 -273 -4 -76 218 -29 -125
1540a25J37j48J89j27N8K65q3o9n8j2J67l45K56j55n1J60O4m1j37K73j49j21K36
$$ -125 12 -136 53 -74 -16 249 166 97 39 27 194 -151 105 -50 -101 59 123 82 -55 218 69 -52 184
1563A84m71J89q3R8J41k00J03n7J50L8k13L34r6k32K13J02LP2k79K06jj77R8j28
$$ 184 -287 -98 -181 -83 58 -142 -39 -96 54 92 -121 213 117 -115 98 200 203 275 -4 202 201 24 122 -6
1587fk17J80n5J51J44K9j86M2Q4j83or5mk4R4J01J18j85j63K48N8k40J09j60J28
$$ -6 -223 -43 -98 53 197 226 40 82 166 -17 -23 -118 -122 -146 -52 49 167 -18 -181 67 125 -115 -6 -166 -38
1612c8q4J28j87J5J93J95k66N9o6K25j88J21j34J85j18J02j6k78L00k31M7n4J30
$$ -38 -122 6 -181 -166 27 222 -44 15 -51 174 -14 107 -27 158 40 142 126 -152 148 -83 -36 -90 40
1635D0j75N9pj36J60P9j0j0j72L04q6j76j04L46k49L05j97j66M29l38J97R0l48
$$ 40 -135 -76 -83 -219 -59 20 10 0 -172 132 46 -130 -234 112 -137 168 -29 -195 234 -104 93 183 -165
1658a65Q7k9JJ09o9P6J03j56M63l35j24j58J63j43O3L11Rj41k76N24l56K23l04
$$ -165 -78 -107 -106 3 -66 10 113 -43 420 85 -39 -197 -34 -177 -114 197 206 65 -211 313 -43 180 -124
1681a24K74k63m5J47J98k89%J13K6O6k45J55k16M03l84K39j78j31L2L11K5k40
$$ -124 150 -113 -158 -11 187 -102 -102 11 37 103 -142 13 -203 200 -184 55 -123 -254 -222 89 114 -126
1703a26P3J59M7N3r3j63K91j97K58m87J40K14l47K74j56K38n4l99N38p8l77K38
$$ -126 -53 106 153 206 113 -50 241 44 302 -185 -45 169 -178 96 -60 178 124 -275 263 185 -192 46
1725D6j6j08k5K16j7p7K36k03K2or4k8R0m5J51o6n9J14j70j33K75J04m2l70J99
$$ 46 30 -78 -103 113 96 19 255 52 74 68 -26 -54 36 -9 142 76 17 131 -39 -172 103 207 165 -205 -6
1750fj7K19m0j71O1M9j33K7J40m4K28j13j45J68j14j27R1j56Q9k4P0K5l27L98
$$ -6 -23 196 156 -15 46 95 -38 -11 129 85 313 200 55 223 109 -18 73 -83 6 -18 52 77 -250 148
1774A48j09p2K32j24q4L19j34j98J19j11J67l49K28k19L19r6J74j55nk73J95J60
$$ 148 39 -33 199 75 -9 310 176 -22 97 -14 153 -196 32 -187 132 36 210 55 50 -223 -28 132
1796A32k21J22k39J49k6j59K79K86l39jK81l50j67L17K9k9r5k7K14L2j43p6R3
$$ 132 -89 33 -206 -57 -83 -242 37 323 -16 -17 264 -86 -253 64 93 64 -31 -58 156 188 45 -31 62
1819F2j78J96k23N8o2J49K70l42lP8q8J31L7J21k60R7L6j27J57PJ52k03K5k38
$$ 62 -116 80 -143 -85 -147 2 272 -70 -73 5 -83 48 85 206 -54 43 79 -48 109 116 268 65 90 -148
1843a48J16j05N2J07p5J57J8m33L79j0k19L15j45k46L29j44l7j00L25k12jK67
$$ -148 -32 -137 -85 22 -53 104 122 -311 68 58 -161 154 9 -237 92 -52 -89 -189 136 -76 -77 190
1865A90j60K89j38l05n2K12N8q7K0O6j11m6JL26k08J09k24J47o0L4P3j30j68L17
$$ 190 30 319 181 -124 -176 36 94 7 27 93 -18 -64 -63 263 55 164 -60 87 27 61 134 4 -164 153
1889A53k01K2J68j21J05J41l2k74J51k6l06K71Q1l27L27j92j83j74J89L58n8J14
$$ 153 -48 -26 142 21 126 267 235 -39 112 86 -220 51 132 -195 132 -60 -243 -417 -228 130 72 186
1911A86l31K57j82L86l77J3P1Q1m2n0O4J91k21j39J07J53k42J13J25k02L77k17
$$ 186 -145 112 -70 316 -61 -48 23 104 62 12 76 267 46 -93 14 167 -75 38 163 -39 338 121
1933A21p2k04M3L0M9J26K30k12j41L3j14J82j2k4j65K86l72L12l62K50j00K36
$$ 121 49 -155 -112 -82 -33 93 323 111 -30 3 -111 71 59 35 -130 156 -216 96 -266 -16 -116 120
1955A20j19p3J15m5J67J8l0j50k3J87k14R4J36J4l50m8L63l33J78j17K80M7k14
$$ 120 1 -72 43 -2 165 183 153 3 -20 167 -47 47 183 197 -153 -201 162 -171 7 -110 170 217 3
1978Ck4J25Jkp8L5k98P2K42l3m00M32J36k21Q1M8N2j71j20J98j51K37j16r0p0
$$ 3 -21 104 105 103 25 60 -238 -166 76 43 -357 75 211 -10 71 119 171 0 -120 78 -73 164 48 -42 -112
2003a12K48j7j95J34o2J0l30J40K25o0j58P1o6J88M5j15j74K06k98L63K23m35
$$ -112 136 119 -76 58 -4 6 -324 -184 41 -19 -177 -106 -172 16 61 -54 -228 -22 -320 43 266 -169
2025a69L21K1k70q2J50pL11l53J35k58K91l55J6K23NJ26k23J94k1Rn7L57k93J22
$$ -169 152 173 -97 -179 -29 -36 275 -78 57 -201 90 -265 -249 -26 -21 105 -118 76 55 64 7 364 71 193
2049A93r8q3J99k46K24k30o0R6r4J0L30k35J96l7n3k6j44Q1k11J37M2Q3k85L68
$$ 193 95 12 211 -35 189 -41 -101 -5 -99 -89 241 6 202 165 112 86 -58 23 -188 -51 -9 74 -211 157
2073A57j03Q0k46K65m61K74J17P2k81K63j92l8r7k2K95j31k2j38K58M3j14l6J45
$$ 157 54 134 -112 153 -308 -34 83 155 -126 137 -55 -93 -190 -212 83 -48 -70 -208 50 93 -21 -57 88
2096H8p0M4N0l1N9j44K16n7J85n21K69j24M2Q1j52L75k64J5j67J14J92k33J05
$$ 88 18 62 112 81 140 -4 212 155 340 -181 88 -36 6 87 -65 310 46 61 -106 8 200 -33 72
2119G2q8J34j8q0Nj17m1Q1Lk2K47k7j01o6j20L67k09k1K1o0L10l44K60n6l3j83
$$ 72 -16 118 100 20 25 -92 -133 -52 -49 -71 176 149 48 -18 -138 229 20 -1 20 -40 270 -74 186 130 97 -86
2145h6o7L30R7k20j69J10M8r0J48Q3%p5Qj7k86M51l63Q3k24K65K19m09k8L02r2
$$ -86 -153 177 274 54 -115 -5 43 -47 101 184 184 109 117 100 -186 265 -98 -15 -239 26 245 -164 -192 110 18
2170A8R2p7k29K52p4k78L79l0l3j23K38j%J65m94J67j8J00k33M7J49k04J49K30
$$ 18 110 33 -196 56 -18 -296 83 53 20 -103 135 134 134 299 -195 -28 -46 54 -179 -132 17 -187 -38 192
2194A92l92L45k63K56M5j16R0l9r5J93j55J30k30j1L14j13j23N0J01l49R7J1L9
$$ 192 -200 145 -118 138 183 67 157 118 23 216 61 191 -39 -50 264 151 28 78 179 -170 -73 -62 -23
2217b3j3j31J01J07o2J52j64j1K9j51K44R2j93j06N9K0J86pJ51m30j41K21J70
$$ -23 -36 -167 -66 41 -21 131 -33 -44 -15 -166 78 170 -23 -129 -70 -50 136 129 280 -150 -291 -70 100
2240A00o5pj14j20K10j47J45j64L50j05j94m6J30j39K66j11LL3J53j33P4j91j6
$$ 100 35 28 -86 -206 4 -143 2 -162 188 83 -111 -157 -27 -166 100 -11 -8 25 178 45 119 -72 -88
2263h8J85m8J37k97K1J71j34J52k32j0L7J00Q8k76M2j09K56m4N0Nk0m3q1K72j43
$$ -88 97 49 186 -111 -90 81 -53 99 -133 -143 -106 -6 82 -194 -152 -261 -5 -49 1 6 -14 -57 -138 134 -9
2288ij16J62R4j57jK7j96K75j28J94qP7j62l04J62P6m0k0J1j8J67o2k7j66L7K05
$$ -9 -125 37 131 -26 -27 0 -196 79 -49 145 137 214 52 -252 -90 -14 -54 -74 -63 -81 86 24 -3 -169 -132 73
2314G3o1M3n4j16K17M8j39q9L5O6k8k56K20R1J23k18k26K08J20k98L55j5n5j09
$$ 73 12 55 1 -115 102 150 11 -78 -43 23 -5 -261 -41 50 173 -45 -271 -63 57 -241 114 99 44 -65
2338f5j04L39q4k14P3Q1K10q1j23J2P6j33R0j22k20K56p2K04l72M12m2j89Q8k1
$$ -65 -169 170 86 -128 -55 26 236 155 32 44 120 -13 77 -45 -265 -9 -81 123 -249 163 121 -68 20 -1
2362ar7L6n8J27p8J73j38Q2L9J18l03j30J51m5l5lK17k84J05pK94r2j90J53J54
$$ -1 -98 -62 -120 7 -71 102 -36 46 85 203 -100 -230 -79 -124 -159 -162 55 -229 -124 -131 163 71 -119 34 188
2387A88k78k15K55K68k7l11Q0l8j3K0J6R0k3k39L10J5jk7Q0j87K4j5j5L3p3J32
$$ 188 -90 -305 -50 218 191 -120 -40 -78 -91 -71 -55 35 12 -227 83 98 97 70 150 -37 -13 -28 -43 -10 -83 49
2413D9j27J67K5j13M5O2j79k19L46j07J44j00q4jR3J59M7j98Q4j92qK0m1J5L4
$$ 49 -78 89 114 1 46 108 -71 -290 56 -51 93 -7 -91 -92 1 160 207 9 93 -99 -107 -87 -128 -113 -79
2438g9J29Ok93K03k78M86K0l2j55j4p4j97K72Rj0k43K64j05J64l05L14KK4j12
$$ -79 50 56 -237 -34 -312 174 194 162 7 -7 -81 -278 -6 3 -7 -250 14 -91 73 -232 82 84 108 -4
2462dK98l16j84P8l4m1J61n0O4rO2L8J31j83Q0j6j48p2J29p7K86j29j71M16k98
$$ -4 294 -22 -206 -128 -162 -203 -42 -92 -28 -37 25 63 194 11 91 75 -73 -145 -16 -93 193 64 -107 309 11
2487A1J2L40m48J56j19O0j16O5J74k16K39j56j22J80k8Q4k15K52m6n18N51l80
$$ 11 23 363 -85 71 -48 12 -104 -39 135 -81 158 2 -120 60 32 116 -99 153 107 -411 140 -240
2509b40oK58n2K83k06J39N9k58K09j30l34K48J08kj00J81l71L28j40J52k07n9
$$ -240 -246 12 -40 243 37 176 235 -23 186 56 -278 -30 78 76 -24 157 -214 114 -26 126 -81 -140
2531a40M5m2J5M2lK78Q4k46k84J48Q6j19j3K50J3M9J0k28J93j21n9L90j60J43
$$ -140 -95 -137 -122 -80 -83 195 279 33 -251 -103 -17 -136 -149 101 114 163 173 -55 138 17 -42 348 188 331
2555C31m95L86k77K92n53K78J70l46L00j05J45n4k06K37R5k04O2j42L10o4p1N
$$ 331 -164 222 -55 237 -316 -38 132 -214 86 -19 126 72 -134 103 198 -6 56 -86 224 160 89 94
2577I4J48l36L2J46k86K67J35k40J31p3q2K60m05K49r8p6K64M5r3j75J33J3r0
$$ 94 242 -94 -62 84 -202 65 200 -40 91 18 -64 196 -209 40 -58 -134 130 175 82 -93 40 53 -37
2600c7P5q6K44j06m9O9q4J60k31L44l49K58k85J9K1K01p2j86K52k61n3L08q3J03
$$ -37 38 -48 196 90 41 110 26 186 -45 299 -50 208 -77 -58 -37 164 92 -94 158 -103 -156 152 69 172
2624A72o4l15J21O0L06k77k5r3J54j46L2q2K95o5m4J22j44m2r0K09p7J40j51P
$$ 172 108 -207 -86 -26 280 3 -22 -115 39 -107 -75 -157 138 73 29 151 7 -35 -125 84 7 147 -4 3
2648Ck9L00l44j66K46o1k45M22q6j73J83J69j31P4k1J57j92j99J25P8l45m8K84
$$ 3 -26 274 -70 -236 10 -51 -296 126 40 -133 50 219 88 162 141 298 106 -93 32 110 -235 -283 1
2671Ak06L88l07J93l1j05r8K3J12O1J45k21J43Q1j21M3k0j06k1k86L08K1rMJ04
$$ 1 -205 183 -124 69 38 -67 -165 -142 -30 31 176 -45 98 179 58 101 81 -25 -46 -332 -24 -3 -12 -8 96
2696I6j56k6O5K96j26j90L7K17Q4q7j21N5Ll59M19k21j93L96rm24K58N1l7n4k22
$$ 96 -60 -86 -21 275 149 -41 -4 213 297 210 89 144 147 -212 207 -14 -207 189 180 -244 14 65 28 -26 -248
2721b48J51J62J3j72q1L18j31l1K3m6k1J83Q3l78L4J31o8J20l8M5k09J64l30M91
$$ -248 -97 65 78 -94 -175 143 12 -19 4 -42 -63 120 203 -175 -141 -10 -78 42 4 49 -160 4 -326 165
2745A65j44J3J55j45j10J58j98J18M9j97K42k86Q5j3J71q3R6L3q0J33l31J28K3
$$ 165 21 34 189 44 -66 92 -106 12 61 -136 106 -180 -95 -108 63 -20 76 109 29 162 -169 -41 -18
2768a8J58N8m18L84m60K51N4r8n8J27J72k98m9K37o6o9N3l2J98K38l98J84j42
$$ -18 140 198 -220 164 -296 -45 9 -89 -147 -20 152 -146 -195 42 -24 -93 -40 -72 126 364 -34 150 8
2791HK7n2O7J65q7J8p8j76N2J73pk88M57j73k75Q1J28J7l18J55K09k17l5K48k9
$$ 8 35 -17 50 215 128 146 68 -108 -56 117 110 -178 279 106 -169 -88 40 57 -261 -106 103 -114 -149 99 70
2816G0k02J84J35q5l63J51p6L03k98K08j81J80j63N5P0j5p5P0J25j38K08k89J54
$$ 70 -132 52 187 102 -261 -110 -186 117 -181 27 -154 26 -137 -82 -12 -27 -102 -32 93 -45 163 -126 28
2839B8k00K24k51J10o3K13L8j6k7k76L14k00L31l71L62j72L7L5l64K31O6j14m83
$$ 28 -172 52 -199 -89 -152 61 99 83 56 -220 94 -106 225 -146 216 44 81 116 -248 -17 49 -65 -548
2862e48O49l8j52K37k27N9J25l9Q6o2j45J69m8J63l90R6J49R0l33L03p6K52j30
$$ -548 101 63 -89 148 -79 -20 105 66 152 90 -55 114 66 229 -161 -65 84 174 -159 144 68 320 190
2885A90l6k99O6K24j02o8k60K12J49l22J26J4K09k06K02l41Q2K41p8k5j63L86
$$ 190 154 -145 -79 145 43 -25 -285 -73 76 -246 -120 -106 103 -103 99 -242 -160 81 3 -22 -185 201
2907B01m27J08J71J23j11o0K18l89O1K1J90J28k32J34j08l3k30J16m9J73K09j63
$$ 201 -226 -118 53 176 65 5 223 -166 -105 -84 106 234 2 136 28 -5 -235 -119 -168 5 214 51
2929E1r4J99o1J2L3k40J57l90L49p0j70J01L26k48M5J31J32l87K05l20n6K02l2
$$ 51 -43 156 95 107 140 -100 57 -333 16 -54 -224 -123 203 -45 0 131 263 -124 81 -239 -295 -93 -125
2952a25J93k59J56o5L17m05J55O8KK5q4k6nJ45j55j65J38R2J96j74m3j3j7k42
$$ -125 68 -191 -35 -100 217 -188 -33 35 37 62 -22 -48 -53 92 -63 -228 -90 2 198 24 -19 -32 -49 -291
2976b91N00j79k35K92j66J70j38m9L03R4k37l66K15K77J2j07J0l9J43k38K35j40
$$ -291 209 30 -205 87 -79 91 -47 -96 207 301 64 -302 -87 190 202 95 105 66 209 -29 206 66
2998F6q1K1mo5L4J02k7Jp7Kj41L61q8k08r6K94K8l25K77j86K10l4J45k26j18J48
$$ 66 -15 6 2 -63 -29 73 46 47 -30 -28 -169 192 104 -104 -200 94 122 -203 74 -112 98 64 209 -17 -135 13
3024A3O9q3k24K83N4k32K27j16n5l1n4Q0p0J60l1J14j32O3p6O4j93J77J64m3j41
$$ 13 82 -1 -225 58 112 -120 107 -9 -64 -95 -149 -69 -139 21 -10 104 -28 35 -41 23 -170 7 171 128 -13
3049a3J6k09K48J78n17L51l20K72q9LJ31n3p1K15j63K03l04K09j12Q8j18qpjp4
$$ -13 3 -206 42 220 -297 54 -266 6 -83 -80 51 -2 -73 142 -21 182 -122 87 -25 63 -55 -63 -70 -71 -145
3074a45P1Q5j17j84O15l66J60j13J31k28J28K7Mj16M8K6k14K46Q6L8l32J86p7
$$ -145 -74 11 -106 -290 325 -41 119 6 137 -91 37 64 68 -48 0 26 -188 58 144 182 -150 36 -41
3097d1j03J29J89r9K3Qj82J93k49j2J50j99J88o9K2k13L15N9l49N3J58K00p6l6
$$ -41 -144 -15 174 75 98 106 -76 117 -132 -144 6 -193 -5 -74 -52 -265 50 109 -240 -187 -29 171 95 59
3121E9K4k20j3M18k80K76k52q6J88j52Pj50K55J31P6pl41J14Pj00K6P7j48N5J63
$$ 59 83 -137 -150 268 -12 264 12 -74 114 -38 -31 -181 74 205 281 274 -67 47 54 -46 -20 57 -91 -36 127
3146A27k32n5j6K69k44J47K98k27J04j52Q3j50K5o2J69j64k03M29j57r3o3K4L02
$$ 127 -105 -160 -176 93 -151 -4 294 67 171 19 102 -48 -23 -85 84 -80 -283 146 -11 -104 -167 -143 159
3169A59j54J67l64K22J42q7p3r2K24l35K18j94J5L77k18j27J62J45k10o2J80j96
$$ 159 5 172 -192 30 172 85 12 -80 144 -191 27 -167 -152 225 7 -120 42 187 -23 -85 95 -101
3191a01j35K00k53J29K24k13J87j50j67J00K73P4l86M2K42j16L14k94J76j82N8
$$ -101 -236 -36 -289 -160 64 -149 38 -112 -279 -179 94 168 -218 -176 66 -50 264 -30 146 -36 22
3212B2on1J24m1j43N7M8j27l2J90R3k63L3k4J54N1l1O0l91M02n0j87O3L86k89
$$ 22 16 -35 89 48 -95 -38 10 -117 -149 41 134 -129 -96 -120 34 85 54 114 -277 125 75 -112 -49 337 48
3237D8k6j23j78K98k03L15j28K2l25K19J45o5O8O5j11p7j5K26M9k38n1L10j42
$$ 48 22 -101 -279 19 -184 131 3 25 -300 -81 64 -1 67 132 21 -56 -71 155 204 -34 -85 225 83
3260H3j41K29n2p2K34j21r7l09N9J11K49j29j16r6N9N32l39k41K01p4J8%L8q8
$$ 83 -58 171 119 47 281 160 63 -246 -187 -76 173 44 -72 -168 -109 423 84 -157 44 -30 -12 -12 26 -62
3284f2Q5j01k6j07J83j77J68Q8j59n3J75O3l31L16K4k79L52j06L8M7j77K3n5J32
$$ -62 23 -78 -104 -211 -28 -205 -37 51 -108 -161 14 77 -254 62 86 -193 159 53 91 138 -39 -16 -71 61
3308F1j0J09j88jk71K11J15k5o9O0Q5k04m4j48L14n3R4J58k99J77m8K14k61q5
$$ 61 51 160 -28 -29 -300 -89 26 1 -68 -8 77 -127 -171 -319 -5 -58 36 194 -105 72 24 238 -23 -108
3332a08K00l0Q4l26K38O6l06Q6J39L1m2J10K3l92K18J1k25L87M4k23J38j18n5
$$ -108 92 62 146 -180 58 124 -182 -96 43 74 32 142 165 -227 -9 2 -223 164 208 -15 123 5 -50
3355e0P5j3R2p5k69K60J85k12k1R7j15M7J01l51L07k36L42r0N5k51J67J90j74
$$ -50 25 12 104 29 -240 20 205 -7 -28 69 -46 1 102 -249 58 -178 164 74 129 -122 45 235 61
3378F1M9l2k74rK40L0J78pk36o1L60j99J54l53K68l57L95l9n6o5J2j25L63j07
$$ 61 110 78 -196 -205 35 65 243 236 0 -61 299 100 254 -99 169 -188 207 168 112 47 59 -66 297 190
3402A90j72j70K39j70Q6Lk6k42L73j47M3k8K57l61L37k02J55k85J40l5J80m00
$$ 190 18 -152 87 -83 3 6 -20 -262 111 -36 7 -21 236 -125 212 10 165 -120 20 -15 165 -235
3424b35L53J7k84J52p6J32j60P5p7J93J51j56k12j9M3L42j00J04k72K11j53K2
$$ -235 118 135 -149 3 -73 59 -101 -26 -103 90 241 85 -127 -146 -103 239 139 243 -29 182 29 51
3446E1q7j94J93Q5j91J28Qm3R8m0J40l82L57o2j0Nq4K7Q7K23l6j98k30K04j97
$$ 51 -36 -230 -37 48 -143 -15 -7 -50 48 8 148 -234 123 61 51 56 -28 -1 86 309 273 75 -155 49 -148
3471a48K72J22m23O8J94k86J09L6k25K77r5QK16j31J08k02J34l7q7j30M37J19
$$ -148 124 246 -177 -109 85 -201 -92 -56 -281 -4 -99 -91 125 -6 102 -100 34 -3 -90 -220 217 336
3493C36m51j49J94%J38j98J37J27p0j1M4j63O6k4k95K30K7J21K3M6j96L08k93
$$ 336 -115 -264 -70 -70 68 -130 7 134 64 53 97 -66 0 -24 -319 -89 -62 59 82 128 -68 240 -53
3516e3J30J4j12r5R2o7j43K61j28J05J50j79j01k8N7K1J14n6K4q1K96l85%K96
$$ -53 77 91 -21 -116 -24 -91 -234 27 -101 4 154 -25 -126 -154 -97 -76 38 -18 6 -75 221 -164 -164 132
3540A32k07m1j25J12J16Kr3J54J11j87k26K12k4L1L8k2m43O64m6j37k1K0n0K45
$$ 132 -75 -116 -241 -129 -13 -11 -104 50 161 -26 -252 -40 -64 -33 5 -17 -460 204 158 21 0 20 -30 215
3564B15k34j71L07N6k45K01k27NJ63k2j0k30r6M02k40R5j20O8J49r2On1j5L2o7
$$ 215 -19 -190 117 173 -72 129 -98 -93 70 48 38 -192 -288 114 -126 -31 -151 -83 66 -26 -20 -71 -86 -54 -121
3589a21L18k22j38J25j08J59J08P4n1k38J20L6j94J52J11j37j0Q8j36K15j37K6
$$ -121 197 -25 -163 -38 -146 13 121 195 144 -94 26 62 -132 20 131 -6 -16 72 -64 151 14 40
3611D0R9k14O6k9p3J37RJ2K00l28P6J77l08J53l12M28k32K40R7j97j47J51m8r5
$$ 40 139 -75 -9 -38 -111 26 35 47 247 -81 -5 172 -136 17 -295 133 -99 141 238 41 -106 45 -3 -98
3635i8m2J17Nk71J92J72p5k55M11m32L99J12k20n3J92l02j78J85K36k96K48Q2
$$ -98 -140 -23 -18 -289 -97 75 0 -255 156 -276 123 235 15 -38 154 -148 -326 -141 95 -201 47 129
3657A29j89J18k7J4j87K17j57L3k28L24j67K55j21j93L2K55k66K0K76p2j00J54
$$ 129 -60 58 31 45 -142 75 -82 -49 -277 47 -120 135 14 -179 -147 108 -158 -138 138 66 -34 120
3679A20J45n32J88O6K26l50J47J33r3R9j07j21j2m7K43l20K77j52Oj39J69K45
$$ 120 265 -267 -79 -13 213 -137 10 143 50 149 42 -79 -91 -138 105 -215 62 -90 -84 -223 -54 191
3701A91L0k55k3K8K2J03R1j03l14L15j16J85k99L46m17J15K27l3o1k43Q1J59j68
$$ 191 221 -34 -57 -29 -7 96 187 84 -230 85 -31 154 -145 201 -216 -101 126 93 32 -211 -130 29 -139
3724a39K84j15p4R4K7Mj8J22j32n9J44j34M8l61J88K9K34j7p1K36l70O5K82l29
$$ -139 145 30 -44 50 77 81 63 185 53 -6 138 4 52 -309 -121 -92 142 125 54 290 -80 -15 267 -62
3748f2Q1j63LL87l57K76J55l7l06Mj47J05j56L45M6k93K37j9j06J42o5%L3j13
$$ -62 19 -144 -141 246 -111 165 320 283 -23 -19 -166 -61 -217 128 174 -119 118 99 -7 135 70 70 103 -10
3772a0q5L7L55l57K05j47K02j14k5r6K68k41k61K74m18L81L53k53P5q2on3j65
$$ -10 -95 -58 297 -60 145 -2 200 86 61 -35 233 -8 -269 5 -413 -32 321 68 143 61 55 2 -163
3795a63M31k51M8p0P2k7o5J09N0p1p2J29j68j4K19kj40j98K97k14Q7j2J10m9N3
$$ -163 268 17 65 -5 67 40 -25 84 134 63 -9 120 -48 -62 157 155 15 -183 114 -100 -13 -25 85 36 89
3820H9J9k07P6J44m9j56L12j52P8k43l6l9L21l26R4n8L9J80j21L06j03n04M78
$$ 89 108 -99 -23 121 72 -84 228 76 154 -89 -125 -164 157 -169 -75 -133 -94 86 -35 271 168 -336 142
3843A42n8o2J66R0k08o4J48k89j11J49Q9Q9j48mO8K41k39l30O1M07j14k01K04
$$ 142 84 22 188 278 70 6 154 -135 -246 -97 -8 81 -67 -71 -3 238 -1 -331 -270 137 23 -178 26
3866B6p2k3o0L03j51J22q1K44j40l54K38n1q2j46M10l2r1k44o7L88l50J94J7k4
$$ 26 -46 -69 -129 174 23 145 64 308 168 -186 52 1 -81 -227 183 151 60 -184 -251 137 -213 -19 -2 -26
3890b6pJ65k01K98k02k2qm9Q8K6j67q8K73J10j17o6J93j63j99L15n8o6k10M34
$$ -26 -33 132 -69 229 27 5 -3 -52 36 62 -105 -193 80 190 73 7 200 37 -162 153 95 29 -181 253
3914B53k57j28j0J7m7J48k3K14m21K90o0mj5j61L18M0k69J45m5P0j22J36j48Q1
$$ 253 -4 -132 -142 -125 -172 -24 -47 167 -254 36 -24 -28 -43 -204 114 154 -115 30 -15 55 -67 69 -79 2
3938BJ63m20L32k12K54J5k71J18L4k6k22K28K79p0n6l92K05M2J04k5n1o9QM6O7
$$ 2 165 -255 77 -135 119 134 -137 -19 15 -11 -233 -5 274 204 148 -244 -39 3 107 82 31 -38 -30 16 83
3963H3k35K08l50J96kL4K67l78K85j19K%M6Q0j61J2R8j34l3L2k0K46k62N8Rj46
$$ 83 -152 56 -294 -98 -100 -66 201 -177 108 -11 -9 -9 37 117 -44 -32 66 -68 -101 -69 -89 157 -105 -47 -38 -184
3989a84K98q8J46j47j19k6QJ78J36k62K3J86j36k89J90m9L11j38j00Q7J26k12
$$ -184 114 26 172 25 -94 -120 -112 66 202 -60 -37 149 13 -276 -86 -135 176 38 -62 25 151 -61
4011f1K36l6l71J34K7J03O6o4q9K41j52O2j2Pj62K4j70K73n0L7l6r6L06l66K00
$$ -61 175 139 -232 -98 -71 32 98 34 -55 186 34 96 84 91 -71 -47 -217 56 6 43 7 -89 217 -149 51
4036E1J24l07L1l2pK34N4Nk47j14O5K25k33K60L5l2p4k14L91k81J3J28k7J7L2
$$ 51 175 -132 -101 -133 -140 94 148 153 -94 -208 -143 82 -151 109 144 112 38 -176 215 -66 -53 75 48 65 97
4061I7k84K48j15J18k62L35j64K41P1k77l7j65L96l7l74J01J36j74J42k30lK73
$$ 97 -187 61 -54 64 -198 137 -27 214 285 8 -29 -194 202 165 -209 -108 28 -146 -4 -234 -237 36
4083C6k31L34j54K9K3j80q4J04L22k68q3Q2M1k75L26j70L91j97J18m6j37J27j94
$$ 36 -195 139 -15 14 37 -143 -227 -123 199 -69 -152 -70 -29 -304 22 -148 243 46 164 118 -19 108 -86
4106h6Q2ql1j03j31M01J3k93Q5k3M56n76L09J5j36o4k2R9p0KJ00j88k7M04l81
$$ -86 -4 -12 -43 -146 -277 124 137 -156 -71 -94 362 -214 95 110 -26 -90 -112 -13 -83 -81 19 -169 -196 208 -173
4131a73J35K19k02K22l42J36J35k00K71j07J30m46L69k47L3k0k49M72j98K08R3
$$ -173 -38 181 -21 201 -141 -5 130 -70 201 94 224 -222 147 -100 -67 -87 -336 136 -62 146 239
4152B39j99l3K16p0m3l1j29N9K1J5k0J2j97N0O0J21j26L1R2k2m7J56j68m6L40
$$ 239 40 7 223 153 110 79 -50 9 30 45 25 37 -160 -110 -50 71 -55 -24 68 46 -1 155 -13 -59 281
4177B81l45M3j19M4J69j55j68J29J25r3J58q3k5K31m74K42N4j15K56j13l9K07
$$ 281 -64 -21 -140 -96 73 -82 -250 -121 4 -89 69 -14 -39 192 -282 -40 14 -101 155 42 3 210
4199B10j8j92Q7j33J42n4k19M27j25J6j68J70m3n2Q4m0o3J59j15o3j88R0K46l22
$$ 210 192 0 87 -46 96 42 -177 250 125 141 -27 143 100 48 132 92 29 188 73 10 -178 -88 158 -164
4223a64K29q4L1N1m03K70J67J28j06j75K3j70M35k73j30K69L6j31j43J37J93l94
$$ -164 65 -19 12 63 -340 -70 97 225 119 -56 -33 -203 232 -41 -171 98 134 3 -140 -3 190 -204
4245b04M19J7l51K19k82L62P0l69P1J06j84L04j73J80p0O9l09K33j53J20r6j32
$$ -204 215 232 -119 100 -182 180 250 -119 -48 58 -126 178 5 185 115 184 -125 108 -45 75 -21 -153
4267a53J41J74j52j66L7M1j0j47J27L6J52j78n6L4J43L1N1Nj09o5J0n8K53j79
$$ -153 -12 162 10 -156 -119 -78 -88 -235 -108 -72 80 -98 -154 -120 23 54 105 110 1 -64 -54 -112 141 -38
4291c8lJ07j33J21k4r9mk71M66k00MJ46j70kL47l33n1Q3O1R4j36J53K08m49j0
$$ -38 -41 66 -67 54 30 -69 -73 -344 122 -78 -74 72 -98 -100 247 -86 -137 -54 7 101 -35 118 326 -123 -133
4316a33J49r8L20l46L0J18n1J6rJ96j40l8M9Jqk01K12p2P8k09J40r1m4R1K12m79
$$ -133 16 -82 238 -108 -78 40 -11 5 -4 192 52 14 63 64 56 -145 67 -5 73 -136 4 -87 -131 -40 172 -307
4342c07L48m5j63J41o7K06j83K94j05l38K70O3j64N6r9J58k27J6K83J55q8K20
$$ -307 41 -4 -167 -26 -93 113 -70 224 119 -219 51 114 -50 6 -93 65 -162 -146 137 292 204 424
4364D24j83m50J39L59j98j78K00k16Q5k05J84j11J31J53j65R0k17J15R5j80J13
$$ 424 241 -209 -70 289 91 -87 113 -103 -18 -223 -39 -150 -19 134 -31 59 -158 -43 52 -128 -15
4385a5O5L76k43k48J3R1K28j13j84L3r9J49j10J72n3k41L94l88K95o4j40j47K51
$$ -15 50 426 183 -65 -52 39 267 154 -30 3 -96 53 -57 115 62 -179 215 -173 122 58 -82 -229 22
4408B2J86K4m48J02N9K01k65J71Q7k45p4K29q5K13j14q5p6mJ98K5k25L05k90J63
$$ 22 208 232 -216 -114 -55 146 -119 52 139 -106 -180 49 -36 177 63 -22 -98 -102 96 121 -104 201 -89 74
4432G4Qkk30j32K06j57K09j0j2j13M54k83J21n8j63O7J44l86K26n3K26p6M2k22
$$ 74 82 80 -150 -282 -76 -233 -24 -34 -46 -159 295 12 133 75 -88 -21 123 -263 -37 -90 136 60 102 -120
4456a20K93j23j10P4p9K8q0O3R8j2j05J88N3l70K78R9k59J04R8o0j47j16O3K35
$$ -120 173 50 -60 14 -65 -37 -117 -54 44 32 -73 115 168 -202 76 175 -84 20 118 58 -89 -205 -142 93
4480I3Q5j11l01J16N7O3j22Q8N0J79l63M06l3k09L21o77M56k82K30j74J69L1l53
$$ 93 178 67 -234 -118 -61 2 -120 -32 18 197 -166 240 207 -2 319 -358 98 -184 46 -128 41 72 -281
4503b81K90j90L87k6p6m9j57K77n1j19l8J3M6n7j67K7m9J46q0M3L24l26K18j22
$$ -281 9 -181 206 180 104 55 -102 175 124 5 -33 -20 26 -31 -198 -171 -220 -74 -154 -111 213 -113 105 -17
4527a7j01L15m82M78k05J91K7k01n2j18j0K78k80J24J21O9K4K7q5m0R2k85K47
$$ -17 -118 197 -285 193 -12 179 206 5 -47 -165 -175 103 -177 -53 68 137 161 188 103 63 155 -130 117
4550A17k19J57R7j63K0o2p1J58K92l42R0PJ1j85j2R9J46k44K29k58j19L24j25
$$ 117 -102 55 152 -11 9 -53 -124 34 326 -16 74 81 92 -93 -105 -6 140 -104 125 -133 -252 72 -53
4573e3J13j46L07m72L60p1j64L77r9N8q1j69j25K64j3q0n4P9K9k91L30k3J16j80
$$ -53 60 -86 221 -251 109 38 -126 251 152 210 129 -40 -165 99 86 6 -48 31 60 -231 99 76 192 12
4597A2j5j9kN7J74j54N1k09J89M7k63J68K35l01J73R6m83MK04n3Q6J00k90Q3K68
$$ 12 -3 -22 -24 33 207 53 104 -105 84 131 -132 36 271 -30 143 239 -244 -240 -36 -89 -3 97 -193 -110 158
4622A58k72J4J45r7j53K64L78m31n8p5L62k18k52J66J61j54Q7n8J54k34m8J4M25
$$ 158 -114 -100 45 -52 -205 59 437 6 -52 -127 235 17 -235 -69 92 -62 25 -33 121 -113 -161 -147 278
4645B78k00J2k7j41JJ4Q3j76J65j0n9N5jk7j67M19l11J15n8M5m9K47j91k75L72
$$ 278 78 90 63 -78 -77 -63 20 -156 9 -1 -60 -5 -6 -33 -200 219 -92 23 -35 10 -39 208 17 -258 114
4670A14l0J6k27J47j16K42k67K51j47n6J69l4j54Q3J60k3j03p1lO0O7j43R6M7
$$ 114 84 100 -127 20 -96 146 -121 130 -17 -73 96 62 -92 -9 151 128 25 -46 -49 11 78 -65 31 78
4694G8l24k7L52M4q2j38r4l0J22P9K36k22j09j49J26N4j51K73k79M02l01N2m4
$$ 78 -246 -273 79 123 41 -97 -191 -221 -99 -20 216 -6 -115 -264 -138 -84 -235 38 -241 161 -140 -88 -132
4717a32L9J06q3m9K64p4q4p6j33N55m17K72j59j81J38Lj41N6K09k09LJ07k79L09
$$ -132 -93 13 -70 -119 145 71 -13 -89 -222 333 -84 188 29 -152 -14 -11 -152 -96 113 -96 -93 14 -265 44
4741D4Q4l08K36J74l47r2O22o44jM09j40j80K24m4k01RK10j51l0M7MK64j00q4
$$ 44 128 -180 56 230 -117 -209 413 -231 -232 177 37 -143 81 37 -164 -155 55 -96 -126 -79 -75 189 89 5
4765ERQk20J81J52k40N3K73m57K86j75J94r3k3J01M9k0J15l56L36j38K0J90k03
$$ 5 14 22 -198 -17 135 -105 -52 221 -236 50 -125 69 -24 -47 54 103 83 198 -158 178 40 60 250 47
4789D7q5M3k07K10j65N5J87J2k61p4K28n2J43J13k26p7J82j82m3R4J73j88O6K67
$$ 47 -38 5 -202 8 -157 -102 85 97 -164 -238 -10 -62 81 194 -32 -109 73 -109 -152 -58 115 -73 -7 260
4813B60l46Q0j77K67L0k32NJ34r2K32k8k98J19J2l8J28O2k91N0M54n07j5L1M1
$$ 260 -86 -6 -183 84 114 -118 -113 21 -71 161 133 -165 -46 -34 -72 56 118 -173 -123 331 -176 -191 -160 -119
4837a19J66j19J90l53L49J1k96L95j55l87L37K16m89K18mp0k1J51J92k42P9q0
$$ -119 47 -72 118 -235 114 125 -171 224 69 -318 19 235 -254 -36 -40 -110 -131 20 212 -30 49 -31
4859c1J44l72M80l17J65j0j4j4k0p7J77n9j96K39Ll16j40K06J67n2j41n4K32K01
$$ -31 113 -259 221 -96 69 59 45 31 11 -66 111 52 -144 95 98 -218 -358 -152 15 -37 -178 -232 0 201
4883B01k46K95l29L7OJ4J28j09k34K4J73J66k30P1j06J87N1l69L44k12q0K75k90
$$ 201 -45 250 -79 -42 -36 -22 106 -3 -237 -213 -40 126 -104 -33 -139 48 99 -270 74 -138 -218 57 -233
4906b33P4P9nJ16N6r7K23k47j7J02J07j24r3l3K70k94M44m03n5P3k57O39k50k5
$$ -233 -159 -80 -85 31 87 -10 213 -34 -51 51 158 34 -59 -92 178 -116 328 -75 -130 -57 -314 325 75 50
4930E0n8J82k43Q1M2j64k8LJ28kJ28l85K48K36l45P6J89k36J30Q3j70o1j07J21
$$ 50 -8 174 -69 12 54 -110 -138 -135 -7 -9 119 -266 -18 218 -127 -51 138 -98 32 115 -55 -116 -223 -102
4954a02J43m6n4K24r6r1p4J25J78p1j71J03QL5k67R4K97J9k43J94p1l83K68K41
$$ -102 41 -5 -59 165 69 -22 -96 29 207 136 -35 68 76 111 -156 -62 235 254 11 205 134 -249 19 260
4978B60m19J87o8J14P9j6M8q3k19J42r1J86j90%j1j12J65K4Jj97J65j9M1j96J45
$$ 260 -159 28 -40 74 153 137 185 102 -117 25 -66 120 -70 -70 -81 -193 -28 -4 -3 -200 -35 -54 -13 -209 -64
5003f4j11jK06j51R2QO8n6o2n6R6O9q6j90J11lL07k66j35N61l77j70P6K39j65
$$ -64 -175 -176 30 -121 -29 -21 47 -9 -71 -127 -31 38 -48 -238 -127 -130 177 -89 -224 337 -40 -210 -134 105 -60
5028f0J19j76KL46k35J28k72j77L86j0k2n7j2J45L3l33L62Rr6k63L56o8j58j21
$$ -60 59 -117 -115 231 -4 124 -148 -325 61 51 29 -28 -40 105 138 -195 167 176 80 -183 173 105 -53 -174
5052a74K87j71K03K6q4j14l33K92J5N3K13j72J2j19R6M7n5p0K76j21j72J60K39
$$ -174 113 -58 145 171 87 -27 -360 -68 -53 0 213 41 53 -66 30 77 22 -48 228 107 -65 95 334
5075C34m49J53p8Q0J45q1J5k07q4L80j54O2q4k6L06k74O1j08l5o5j07K02J73j05
$$ 334 -115 38 -40 40 185 104 119 -88 -172 208 54 116 32 6 312 38 99 -9 -44 -109 -216 -14 159 54
5099E4J4J1k59J54j05J2M1J69k00k9J11J8q9L41k59k20P3L77k51L7K78m60K61
$$ 54 68 79 -180 -26 -131 -119 -78 91 -109 -138 -27 -9 -98 243 -16 -236 -163 214 -37 0 278 -182 79
5122G9Q9k8j76j1J45k5J0M1k18J34L1j13M1j76lK90l11M29k75J57k1j34J46k73
$$ 79 168 140 -36 -47 98 73 83 124 -94 40 71 -42 -1 -177 -180 110 -201 228 -47 110 89 -45 101 -172
5146a72j0K82M1j92r4J79k72L78k20N8l7k41L02N6%j29k4K60j9j58l7m7J81k94
$$ -172 -182 100 141 -51 -145 34 -238 140 -80 -22 -59 -300 2 58 58 -71 -95 165 146 -12 -49 -96 85 -209
5170b09J98K04m05J05Q7J07K8J02k03k2j18O0R3l48L44J44l68j56J13J99m1Q4
$$ -209 -11 193 -212 -107 -20 87 115 217 14 -8 -126 -66 27 -321 23 167 -201 -357 -244 -45 -86 -2
5192bR6M4l28K60j02j1n8L3k64M74k1K1l6J53r9k52J17k93J29J13j7L1K17j9k03
$$ -2 94 138 -190 70 -32 -43 -101 -68 -332 142 121 142 106 259 160 -92 25 -268 -139 -26 -43 -12 205 186 -17
5217a7J71j45n5Q0rk4O9j6j4J66n76L35L1r9J27K0J4q2J28k21J0J70k01L9J36
$$ -17 154 9 -46 34 25 1 70 54 40 206 -370 -35 -4 -103 24 44 58 -24 104 -117 -107 63 -138 -99 37
5242C7j23r6L02m00L57j76J34J08o8J27j29j1k2p2N3K1O0j60k8O8n2J45m4L4r4
$$ 37 -86 -182 120 -280 77 -99 35 143 75 202 73 62 40 -32 21 42 102 -58 -86 -18 -70 75 31 65 -29
5267b9n6K19lJo9k00J70l7J37j13j19K19k85L89k46n0R0j83J68K3QJ22q8p0J22
$$ -29 -85 134 131 132 63 -137 33 -4 133 20 -99 120 -165 224 -22 -72 18 -165 3 26 34 156 68 -2 120
5292A20k20K22l8j18j8j35J89K18j2k33o0J01J51k35%Q5m0J04k67N05l70p5K03
$$ 120 -100 122 84 -34 -52 -187 2 220 208 -25 -85 16 167 -68 -68 17 -23 81 -186 319 -51 -126 77
5315G7M1p1o4M4O0R2j37k41J11L10m04J39j44R5J00j21j35Q2J91rK56k37J6n5
$$ 77 118 47 -17 27 87 179 42 -199 -88 222 -182 -43 -187 -92 8 -113 -248 -166 25 16 272 35 51 -4
5339dj00K84k05R4j49K3j9j35M12l83J21K12Mk29J37r1K20j96N6j17n5J22q6J9
$$ -4 -104 180 -25 69 -80 -57 -76 -211 201 -182 -61 151 155 -74 63 -28 192 -4 52 -65 -120 2 -84 -65
5363f5j34L37K6J5p6j69l3P2Q1j80J41M0M1N8j09k52L62k44J10M7J68k58k80N32
$$ -65 -199 138 164 179 103 -66 -99 -27 54 -126 15 55 96 154 45 -207 155 -89 21 68 236 -22 -302 230
5387B30l53j01J98j53J90j98Q9J06J09j75j14K43M6j83J5M2K9R2j03R7p2k39K20
$$ 230 -123 -224 -26 -179 11 -187 -98 8 117 -58 -172 71 117 -66 -51 -9 20 112 9 106 34 -205 15
5410A5J94rl21Lk40N23l2J92k65M9P2l67J73M3J03r3k08J45j33K86nm7k05R6J60
$$ 15 209 200 -121 -118 -358 165 133 325 60 109 181 -186 -13 30 133 40 -168 -23 -156 130 125 78 -127 -31 129
5435A29m28L14J49k12Kn8j11J45k68L21k11J97j51J98j16N2J06j42R9m8K9Q2p6
$$ 129 -299 15 164 -48 -46 -104 -215 -70 -338 -17 -228 -31 -182 16 -100 -48 58 -84 15 -33 -4 78 2
5458Br6K3j54K02j25K8j61R9J34o7K45j96j58O0K18j5j9j89J87M8qk54K41j50
$$ 2 -94 -71 -225 -23 -148 -120 -281 -182 -48 -115 130 -66 -224 -164 54 39 20 -169 18 66 58 -196 45 -105
5482a05Q7O4l2J05M7m03L17m0p9m5j09K92j83M7j02lJ37P9q5p8m8lK93M6k37N1
$$ -105 -18 46 14 119 166 -237 80 40 -39 -84 -193 99 -84 -37 -139 -142 -5 74 -11 -89 -137 -140 153 199 -38 13
5508A3J4O3o3j22R2J53j34l0L67l46j1J31k44K32k61J19K7K34k28R3k83K31k36
$$ 13 27 90 27 -95 -3 150 16 -14 353 7 -4 127 -117 115 -146 -27 0 234 6 99 -184 47 -189
5531a89L81l51RJ09K7Qm1K27k25O4J8oq6K6J07M9k86K50k07J98j85L30l07k7J95
$$ -189 192 -159 -150 -41 -14 -6 -47 180 -45 19 37 31 -55 -29 78 127 -159 91 -116 82 -103 227 -80 -107 88
5556H8l99L27k7L0j44K71m7l50M86j42k72J5K71j3L7j71L66k91J30j21j39K68
$$ 88 -311 16 -11 19 -125 146 99 -251 235 93 -179 -164 107 94 131 -40 326 35 165 44 -95 173
5578A73k74k60L00J05J36o0j89j46L01j35j53N5N0k78O49k51R0l01N9K9J3J31
$$ 173 -101 -361 -61 44 180 120 -69 -215 86 -49 -202 -147 -97 -375 274 23 113 -188 -129 -100 -87 44
5600D4j79P3RJ00k57L08k45K19j26P5K89k82O9j75Q5R6pk06J0O1R9j57J74J0j56
$$ 44 -135 -62 -53 47 -210 98 -147 72 -54 21 310 28 97 -78 7 103 96 -110 -100 -39 60 -97 77 87 -69
5625f9L50j57j9L9l24K52J6j55j39K27j56J8J64m2L2N1j80M0K35l16J62q0J05
$$ -69 281 124 105 144 -180 72 88 -67 -206 21 -135 -117 47 5 37 88 -92 -52 183 -133 29 -51 54
5648E4l9j67J36o6J80Lj48J84j14k6N7J03l16L48k22l4O8j22J49kj49J91k7m49
$$ 54 15 -152 -16 -82 98 101 -47 137 23 -3 54 157 -159 189 -33 -67 1 -121 28 26 -123 68 41 -408
5672d08N86j44l1J84k25k4j6P0J35m2lL5j74P7j25M9J34K0j5k87K13J00Nk35J59
$$ -408 178 34 3 187 -38 -62 -78 -8 127 85 82 117 -57 20 -105 -56 78 98 83 -204 9 109 114 -121 38
5697C8j23r5N3J72J1j5nj4n4J48j03r1j02K77J12m37K85J22r4O5k81J26j46l9
$$ 38 -85 -180 -127 45 56 41 36 22 -32 116 13 -78 -180 97 209 -228 57 179 85 150 -131 -5 -151 -190
5721a90K32jj39K48q5Pn5r4n1K48Q5k00L0j86P5n7L17k67M1N3O6k3l16J58J83
$$ -190 42 41 -98 150 65 72 17 -77 -128 120 205 5 35 -151 -76 -133 184 -83 -42 11 77 54 -262 -104 79
5746G9N0k15L9ln6L71m34K2P5o9j18L19Q2j65r7M7j4J8J73j07J81l33K64j94J19
$$ 79 129 -86 -47 -50 -106 265 -169 -147 -72 -141 -259 60 142 -23 -120 -73 -87 -69 104 -3 178 -155 109 -85 34
5771C4J95q9l3Pk40J8l6J59K37k68J97k87J01J48m1l3r2j13J39k3R9n6m1o6J89
$$ 34 229 140 107 114 -126 -108 -144 15 252 -16 181 -106 -5 143 102 69 -23 -136 3 -20 79 23 -18 -84 105
5796A05m1k58L29j49k99L91m93K90P9P6l1k09L11l66J8L51j05J9J14j96J0P9J9
$$ 105 64 -194 135 -14 -313 78 -415 -125 -46 30 -1 -210 101 -265 -247 104 -1 18 132 -64 -54 25 44
5819D4J2m8j59K80j78l9R4p8m8L08j89nk4r9k0j34K39j9O1j65J56J12j60J48O
$$ 44 56 8 -151 129 -49 -88 6 -72 -120 188 -1 -6 -30 -129 -149 -283 -44 -63 -2 -167 -11 101 -59 89 95
5844I5k11J53j25M0q8n4M6K01j28M4P1M3j88L75l24m1K7J30O2K3l64N2K46q5K75
$$ 95 -116 37 -88 -48 -136 -190 -144 57 -71 -27 44 87 -101 274 -50 -91 -64 66 128 151 -213 -161 85 0 275
5869B75l8k51j31K0K62m34J64R2m1n4J03j06j60J21J28q7j4J07Rl9L7K52j62j44
$$ 275 237 -14 -145 -125 137 -297 -133 -41 -82 -136 -33 -139 -299 -178 -50 -137 -151 -44 -35 -74 -37 215 53 -91
5893i1K01Nj72J1J97j49P8jl1RN4m62M84j44l3q8K43j44kN5p6K08k11J42j7j13
$$ -91 110 115 -57 -46 151 2 80 79 48 57 111 -351 133 -11 -44 -132 111 -33 -35 20 -56 152 -59 83 66 -47
5919d7m5K02j47L2j17N9j41J70j29M48k47J04k24MR7J4J31l12K91M6l3j10N5k75
$$ -47 -92 110 -37 -5 -122 -63 -204 -34 -163 285 38 142 -82 -78 19 33 164 -148 143 189 156 46 101 -174
5943a74J25m4K02k05L01k64j1k1p4J12n6L05l16J90k2m2R9l3k40O7QJ93j21k18
$$ -174 -49 -93 109 -96 205 -59 -70 -91 -165 -53 -109 196 -120 70 48 6 105 72 -168 -101 -93 100 -21 -239
5967b39L50Q4j05j01j47L85l80L87l7l03k59M35j6J63p1j72j52N4Q7J09L5j62
$$ -239 111 195 90 -11 -158 227 -153 234 197 -106 -365 70 54 217 146 -26 -178 -124 -37 72 107 -55
5989e5j18K84j07j29J30k8P7q2j67L20l46J86p4K26m3j63Q4J32l04L56k44K19
$$ -55 -173 111 4 -125 5 -23 54 -28 -195 125 -221 -35 -109 117 74 -89 -5 127 -177 179 -65 154
6011A54l32J30K23j69J81r2k37q0K66j40J61r1K22o6k33Q2Q8r1j8J88k94J54L03
$$ 154 -178 -48 175 6 187 95 -142 -222 44 -96 65 -26 196 130 -103 -21 67 -24 -42 146 -148 6 309
6034C09l05J4R2O9o3j46J35K1k56N9K31j06K12j71Ml15J36J04j31K04j78j4J28
$$ 309 4 18 110 179 116 -30 105 126 -130 -71 160 54 266 95 99 -216 -80 24 -107 97 -81 -95 33
6057C3J64j12r8p7QL73l61J47M5j26K16K0k13J70k68J99k15P5L4J60j90K6Q0j46
$$ 33 197 85 -13 -90 -82 291 -70 77 122 -4 212 232 19 189 -79 120 -95 -20 14 174 -16 10 90 -56
6081e6K5R2q3O7J38l97K59j09J68j28P7m04M21m44L86k26K40n0r4K4J95L1k22
$$ -56 -31 61 -22 45 183 -214 45 -64 104 -24 53 -351 70 -374 12 -214 26 -24 -118 -94 101 132 -90
6104i0O6J53nl11K75K1j04p6K3j70N7P9o7J73Q8J02j03J08n31L99J22k95J11q
$$ -90 -24 129 124 -187 88 109 5 -71 -48 -218 -161 -82 -149 24 112 214 111 219 -312 87 209 -86 25 17
6128A7J41m21J56J20j15J36q7k0q3K19M8q2m8p4K90q6L3j09q4L88k16O2k53m5
$$ 17 158 -263 -107 13 -102 34 -53 -73 -156 63 111 29 -19 -93 197 111 144 35 -49 339 123 185 -68 -113
6152a13j12J14j12m4J51K03k64J24K80l49J52l2oR6o4k93K42j02r4L38j64k38
$$ -113 -225 -111 -223 -267 -116 87 -177 -53 227 -122 30 -2 -8 88 24 -269 -27 -129 -223 115 -49 -287
6174b87L79j1m4j97J40J7j13J92k78K49l4k1K8j32j27K57j84P7J19k06K42q6J54
$$ -287 92 81 37 -160 -20 -3 -116 76 -202 47 13 -8 20 -112 -239 18 -166 -89 30 -176 66 -20 134
6197A34q1r9J62q3J9J29l39L43k24J7r3J40rL63m07J28q7n4J19n5K3m3J28j27
$$ 134 53 -46 116 33 52 181 -158 185 -39 -22 -115 25 16 379 -28 100 13 -41 78 23 46 3 131 4
6221DK03j15pk65J57O2R5j4j1O8J22k66j82N3L1J42O4k59K04o8k4K38j64p1R6
$$ 4 207 92 85 -180 -23 39 134 120 109 177 299 33 -149 -96 -65 77 141 -118 86 18 -6 232 68 -3 93
6246I3m64J24K01l1K25p1j50Q0J01j50J58M6j83pj24L14j49j8j35K1K85m43J85
$$ 93 -371 -247 -46 -77 148 77 -73 7 108 -42 116 162 -21 -28 -152 162 13 -5 -140 -119 166 -277 -92
6269i2J66l05K6K86kJ86l59N0J09J19P1k65J27O6j50k4j67J17J02j26J65m39M65
$$ -92 74 -231 -205 81 79 265 -94 -44 65 184 255 -10 117 183 33 9 -158 -41 61 -65 100 -339 126
6292A26k10K31j23o3k1OK45m2j52k60K03j84J93n9K7R1Q0q2Q3k35N2o6M19k10
$$ 126 -84 147 24 -39 -60 -54 191 149 -3 -263 -60 -244 -51 -110 -83 8 88 6 89 -146 -94 -160 259 49
6316D9j60J65k67L23k22nk1MJ25J72k96K07J4R2m01J21Q1J66j47J09k72L01j57
$$ 49 -111 54 -213 110 -112 -117 -138 -134 -9 163 -133 74 88 180 -221 -100 -19 147 0 109 -163 138 -19
6339a9K6R3l07K20J41m00J60O1J40q4j2R3rL5j13J55j52k24qN1J05l07L66k2N2
$$ -19 7 100 -207 13 154 -246 -86 -25 115 31 19 112 103 138 25 180 28 -196 -204 -153 -48 -355 11 -11 41
6364D1j0J20k11N9o9L75m65J66r0Q4J66l04P5j39O3L71p9k43K28o5j22j25L89
$$ 41 31 151 -60 -1 -70 305 -160 6 -84 0 166 -138 -63 -202 -139 232 153 -90 138 73 -49 -174 215
6387B15j62P6j30N4P5r0J11k3R7j45l3k7n3j55L92j10L1n1k3q4kL1j39L33l0n20
$$ 215 53 129 -1 53 128 38 149 126 223 78 45 18 -35 -190 202 92 123 72 49 -35 -37 -6 -145 188 158 -362
6413c62M48j0L3K00m58J60o8q0K22J79l22o2L3R9L3Q1j79K63j42K8j8o0J72k51
$$ -362 86 76 109 309 -149 11 -57 -137 85 264 -58 -120 -87 12 45 126 -53 210 68 96 78 18 190 -61
6437f1N2N0K8m82M54Jj5k69J86k14J60R5J31l84K32J75j90n0k3j7QJ24N0j54J0
$$ -61 -9 41 69 -413 41 42 27 -242 -56 -270 -110 -15 116 -268 -36 139 -51 -101 -124 -141 -133 -9 41 -113 -103
6462a03lJ19n4J97m0j53J54k49p9J57m3Q5J31J1j17LQ6j84P2J28k74J06Q1R4j07
$$ -103 -106 13 -41 156 116 -37 117 -132 -211 -54 -97 -12 119 130 13 16 102 -82 -10 118 -156 -50 31 125 18
6487A8j31N2J24j31M1Q2J22l37N8J06J75k44K21l28M7K98k07j28KJ41j06J84k62
$$ 18 -113 -61 63 -68 -27 55 177 -160 -102 4 179 -65 156 -172 -125 173 -34 -162 -160 -19 -125 59 -203
6510b03N15k82p2L4k5q5k5M2p1L0J72k34j52N35l88L12k01J29mj01P7j43J39j38
$$ -203 312 30 -42 -8 -33 -118 -143 -101 -172 -142 30 -204 -356 179 -209 103 -98 31 27 -74 3 -140 -1 -139
6534a39K30j2J58O5k34J51k76M4l1P5k5n0K33l04J87l7q8L11j08L6j70Q2R8j37
$$ -139 91 79 237 302 68 219 -57 -13 -44 31 6 -44 189 -115 72 35 -53 258 150 186 16 98 196 59
6558E9K8j52N5l4M7K26l07j10M93k14N0j49N9j20J45J55k74P3q7o8J84j3j37j46
$$ 59 87 -65 -10 -44 3 229 -78 -188 305 91 141 -8 51 -69 76 231 -43 30 -57 -125 59 46 -91 -237
6582b37J88Lp0L20j88O5k45K04L0k75NJ34J07l3J63j35k84L03j9M2n6R8j41K20
$$ -237 -49 -46 -116 204 16 81 -164 40 70 -205 -200 -66 41 8 171 36 -248 55 36 78 22 120 -21 199
6606A99j55qj27n5n9K52j10Q0J99k78K74l66j5K49q7k19J81J76k8l17m4P3K94
$$ 199 44 36 -91 -146 -205 47 -63 17 216 -62 212 -154 -169 80 -7 -226 -45 131 103 -214 -258 -185 109
6629A09p4p7N8ok9K9m2k2k2j08M02l42J38j04J91m1l02J26K85O8k07j55Q7J73
$$ 109 35 -42 16 10 -19 10 -32 -54 -76 -184 218 -124 14 -90 101 60 -242 -116 169 237 30 -125 -38 135
6653A35l9m7P3j45N3j0Q9j71k4R7m8J74j46PJ94k07k76K28P3J33k00K66j35L2
$$ 135 96 49 122 -23 30 20 109 -62 -86 11 -37 137 -9 -2 192 -15 -291 -63 10 143 -57 209 74 106
6677A06k86M82k13m7M2J45m25QJ52l8M8J47j92R4R5J4j05J42j90k7l6r7R6K03
$$ 106 -180 302 89 42 84 229 -196 -188 -36 -74 -26 121 -71 23 118 132 27 169 -21 -48 -84 -181 -85 118
6701A18k03k10J31K06j22n0J20o3P1j6j35Q7n5K61k23N8J2K81k38J78k96p7K96
$$ 118 -85 -295 -164 42 -80 -130 -10 -73 -2 -18 -153 -66 -121 140 -83 -25 -13 268 30 208 -88 -165 131
6724A31k75K95j41M4j23nJ3J58l7J17j77q8O3o1J40K7j69M7j68K14k4J15p1J25
$$ 131 -144 151 10 54 -69 -74 -61 97 60 177 0 -88 -25 -86 54 81 -88 -41 -209 5 -19 96 25 150
6748A50n36N16m24N42j31J81k23l29J65J05N5j35LL2j3k4J24m6o5k3K67n3j83
$$ 150 -386 130 -294 248 117 298 75 -254 -89 16 71 -64 -61 -29 -42 -66 58 12 -53 -76 191 138 -45
6771d5P3K07l95M2M6Q8M9j37K12q6J3k19K7n3L13k64K51o1O9j57J86K9m27M75
$$ -45 28 235 -160 -118 -72 16 65 -72 140 54 67 -152 -125 -178 135 -129 122 61 130 -27 159 188 -239 236
6795B36l45o5Q9l8N4L63l72K49k48Q6K40m49K17J4R2j40mn0j79L96J2j29K7j55
$$ 236 -109 -174 -85 -123 -69 294 -78 171 -77 9 249 -200 17 31 123 -17 -21 -71 -250 146 158 29 56 -99
6819i9J45q7J01j31K80l08Lo2K27k81K24p1J8L99m62K47j72r3L10L7p9m0Q4k5
$$ -99 46 -41 60 -71 209 -99 -96 -158 69 -212 12 -59 -41 358 -104 143 -29 -122 188 225 146 106 190 165
6843A65k10l6N9j11R9R1J22k88J97j14N9M8L5k98J50M5j2m7K7R6M2k06R9j39O0
$$ 165 -45 -81 -22 -133 -34 57 179 -109 88 -26 33 81 116 -182 -32 13 1 -46 -19 77 119 -87 12 -127 -67
6868f7K36o5m68L05L65k10J24k6k67l6J14J2J92k13j7j81L42k54MLn8J96r2j02
$$ -67 169 104 -364 -59 306 96 220 194 -73 -109 5 17 209 -4 -21 -202 140 -114 -110 -107 -165 31 -61 -163
6892a63J66O0%O0R0k33O4J64k63k6l2J2m3R5J94n4j80N9J6j47M4L1J22N4J5J06
$$ -163 3 63 63 123 213 -20 44 208 -55 -81 -113 -101 -144 -49 145 91 -89 -30 -14 -161 -117 -86 36 90 105 211
6918B11k98k1K7p1L5K95m03J6L02n7o2P9j10N7k39J91j01K18k3k4J62k32j17O21
$$ 211 -87 -108 -81 -152 -117 178 -225 -209 93 36 -26 53 -57 0 -239 -48 -149 69 46 22 184 -48 -165 456
6942D56n81J88J1j74P7J91K1k82N2J23o9L5j40m4P7K39j05l93K92N5L7j40O4r0
$$ 456 -125 63 74 -100 -23 168 189 -93 -41 82 13 48 -92 -136 -59 180 75 -318 -26 29 66 -74 -10 -100
6966a00P9J8KK1qP3j83j3P4P3l5J44k36J16J47k34j07L60k3j5k05LK63j00L0l54
$$ -100 -21 -3 -1 20 12 85 -98 -111 -37 36 1 145 -91 25 172 -62 -169 191 168 153 -52 -49 214 114 144 -210
6992b10L08j49J9K46l02K11l8oj13J04Nj11N4l58K91J43P8m8m22L56k5Ko9k2J26
$$ -210 98 -51 -32 214 -88 123 85 79 -34 70 75 -36 18 -340 -49 94 172 124 -298 58 33 35 -34 -56 70
7017G0J7J27l60R9q7J52o9Moj7N6P8r3L3N7J37k01j86K02n9j62L41k55J19r9k77
$$ 70 87 214 -146 -47 -134 18 -51 -47 -53 -70 -14 64 -29 4 61 198 -3 -189 13 -46 -208 133 -122 -3 -102 -379
7043c79L56J52k92L48kl02J15L5J1J7Q2j24j12L2p2J43j12j10K65J72j85n9J38
$$ -379 -23 129 -163 185 183 -119 -4 31 42 59 141 17 -95 -63 -135 8 -104 -214 51 223 38 -21 117
7066A17p0j36n9L11Rk73K16m46N44l87J17jj44R3M1O9Q5j64l4K30p8j18L4Q1k46
$$ 117 47 -89 -148 163 172 -101 115 -331 213 -174 -57 -58 -202 -109 -68 1 86 -78 -112 118 40 -78 -44 37 -209
7091b09K38J04j28j15L2j60J45J16l1PK17k24M1k31J51o2J03J68j6m0j98P1j08
$$ -209 29 133 5 -110 -78 -238 -93 23 -8 -1 216 -8 33 -198 -47 -109 -6 162 146 106 -92 -21 -129
7114a29K29j86K28j53K3j61K01k25L1J84j47O3k63Q5L24M5l62J54j22O1L18k78
$$ -129 100 -86 142 -11 12 -149 52 -173 -142 42 -105 -42 -305 -220 104 149 -213 -59 -181 -120 198 -80
7136h0j70O15n41L96k34k89L82m8J29k29o8J32J03j24m08O08k41L5J64q6k05K73
$$ -80 -250 365 -176 220 -14 -303 79 31 160 -69 -137 -5 98 -26 -434 174 -67 -32 132 46 -159 114
7158A14k1l00Rp3L12NK68o57J93L92j40k76p7J66K12m74J53K36l9ql0o5MJ05J8
$$ 114 93 -207 -198 -271 41 46 314 -343 -150 242 102 -174 -251 -85 127 -347 -194 42 3 -5 -35 -100 -96 9 27
7183B7P0k35K69k31j0J84j81L16nj21j71n7K99k84K26k19N9Q3J42k65J51Q7k35
$$ 27 97 -138 131 -100 -110 74 -107 209 204 83 -88 -145 154 -130 96 -123 -64 19 161 -104 47 134 -101
7206a01J04K72l76J79J10l83K79q9l2K66j98Q8l18Q8J9K27j10l16J62k1J6j3J36
$$ -101 3 275 -101 78 188 -195 84 -5 -37 229 31 119 -199 -111 -92 135 25 -291 -129 -150 -134 -147 -11
7229a1o6L24k95NL1L11m53Q6K04r2Oq4J06lRk9j17K57k77k04L73j02q5r7L69l81
$$ -11 -77 247 -48 -43 -12 299 -154 -68 136 44 50 -34 72 69 78 49 -68 189 -88 -292 81 -21 -106 -203 166 -215
7255b15K39K4K13l50J12l9O4J7J1j04P5m41M03M2O3j95J84q9L0N8k4j37J64M0
$$ -215 24 48 261 -89 23 -16 48 65 76 -28 47 -394 9 51 114 -81 103 14 44 102 78 -59 105 145
7279A45k88K68p5N7M0l30K14p9J01mj56K84j74M10n16J55L8j59mj01K93l22J05
$$ 145 -143 125 50 107 147 -183 31 -48 53 49 -107 177 3 413 -103 52 90 -69 -73 -174 119 -203 -98
7302i8r2J56l2J20p9J22R8k48j37J68q9N9N5jJ05Kq6J29j44J52j64Rk1o7jk0M4
$$ -98 -190 -34 -66 54 -25 97 195 -53 -190 -22 -111 -52 3 2 107 109 23 152 8 160 -4 5 -16 -83 -84 -104 -60
7329f0R4p5j6j48R8J37O9n9JR9l09L3l2N7L72j59l64L56j05l22L62J69l06K57
$$ -60 34 -41 -57 -205 -107 30 99 40 41 140 -169 -136 -168 -111 261 102 -262 94 -11 -333 29 198 -108 149
7353A49l37K12l4k33L15n9J32o5k71J69K46k10O9M2m26R4L7J27L09j34j44l7L00
$$ 149 -188 24 -10 -243 72 13 145 80 -191 -22 224 14 83 125 -301 -207 -170 -43 266 132 -12 -49 251
7376B51l19Op2N6K8r5K21k21K22J20k98K24k39J07q9j4J0k05K32M2n8J08k37L83
$$ 251 -68 -62 -134 -78 -50 -145 76 -145 77 197 -101 123 -116 -9 -98 -112 -102 -307 -75 -33 -91 17 -220 163
7400A63o4n4r6j41l7O2J89K84l96J19k9K60k48m5K61r1l07q2N75k39q0j4O9j72
$$ 163 99 45 -51 -192 -229 -167 22 306 -90 29 0 260 12 -33 228 137 -170 -252 323 84 4 -10 59 -113
7424a13J19Lj55J74j44N8M5j6J48j63J66m4k52J33K0j85J53P3J97k72K07j35k9
$$ -113 6 9 -146 28 -116 -58 -13 -29 119 -44 122 78 -174 -41 -21 -206 -53 20 217 -55 152 17 -12
7447a2Q5n2M9j03r6J78k3J64m50m1N19l31K71j02k22K3J78j15N9K50j31k42J90
$$ -12 73 21 70 -33 -129 49 26 190 -260 -301 218 -113 158 56 -166 -143 35 -80 -21 229 98 -144 46
7470D6oJ6k11J27J13k68J75KL10j71Pj03p0j07pK04p1K77j92n2J1K11n7j20r1
$$ 46 40 56 -155 -28 85 -183 -8 -6 304 133 140 37 -33 -140 -147 57 -14 263 71 19 30 241 184 64 -27
7495b7M0J36q7J43k77O3O0J37j60K2J18n3j32j08N8J4j48N00k71J9q2N0N1P0O5
$$ -27 13 149 62 205 -72 -9 51 188 28 50 168 115 -17 -125 -67 -53 -201 299 28 47 -35 15 66 136 201
7520B01m52K90J89l09K69l37j66L6M31j99K14k47LJ93j63j29J08L68l06K87m17
$$ 201 -251 39 228 -81 188 -149 -315 -279 152 -47 167 -80 -77 116 -47 -176 -68 300 -6 281 -136
7541a36K39l0o7K25l76K33j00k4K41m38n4M77R0l96J85j93J88j52J31J27r5k01
$$ -136 103 73 6 231 -145 88 -12 -36 205 -233 -287 190 280 -116 69 -124 64 -88 43 170 75 -126
7563a26K15o2k1J3j1M6j05M24m26L13l12j25N3K65k67J48L7Q4j40l7R8q9j49q1
$$ -126 89 27 6 19 8 54 -51 373 -53 260 -52 -177 -124 141 -126 22 59 143 3 -34 64 -25 -174 -255
7587b55K38k55M47k90K43K4k79J32l81O41j31k67R1j08J36k7r9R5q3J32K60l81
$$ -255 -17 -272 175 -115 128 152 -127 5 -376 265 134 -133 -42 -150 -14 -41 -140 -45 -128 4 264 -117
7609a17K4J45k87J18L23l86j03K15oJ65q1j13N0k32Q8J67j50J24J8K25j07j75
$$ -117 -93 52 -235 -117 206 -180 -283 -68 -74 91 10 -103 -53 -285 -197 -30 -180 -56 -38 187 80 -95
7631i5p4LR5m2K40p3j67P7K18l22J99j31K28k02j60L55j46j63J33K55l6j14k30
$$ -95 -169 -166 -71 -113 127 54 -113 -36 182 -140 59 -72 156 -46 -206 149 3 -160 -27 228 192 78 -152
7654a52L9J3L6M5J00q2q0K70l32J6J18Rj03qK44L4j09r2q4K37j23J53m03K2J62
$$ -152 -113 -100 -64 -19 81 -1 -81 189 -143 -127 -9 0 -103 -111 133 167 58 -34 -118 119 -4 149 -254 -232 -70
7679g0K90m61L37l08J93Q6k44K47J19j33N9k43J48k3k69M06m24N53j51n5J24J23
$$ -70 220 -241 96 -212 -19 67 -177 70 189 56 115 -128 20 -3 -272 134 -290 263 112 57 181 304
7701C04l62m7J37j06N9n2J27j59K2R4r1n0M4n4L77j35J67k25k45L44r1J28K1l96
$$ 304 -58 -105 32 -74 -15 -67 60 -99 -77 17 -74 -124 -80 -134 243 108 275 50 -195 149 58 186 207 -189
7725a89M84l27Q3O5M6l15K17O4k03J85j18L07l65O2n6J65M1k18o0J56J16k20M2
$$ -189 295 -32 51 116 162 -153 64 128 -75 110 -8 299 -66 -4 -60 105 146 -72 -132 24 140 -80 -38
7748c8j1R0q7j87J77K67p6k83K02j66j5L26l32J65J02J4k32K4k02N54j24m44K02
$$ -38 -49 41 -46 -233 -56 211 135 -148 54 -112 -127 199 -133 32 134 148 -84 -60 -262 292 168 -276 -74
7771g4K41j94M7j27l6O0NK24l56J06K2P7j48K30R4l69K89r7R3j21J53j03j61J61
$$ -74 167 -27 20 -107 -143 -83 -78 146 -210 -104 -82 -5 -153 77 171 -198 91 -6 87 -34 119 16 -145 16
7795A6j02J78l01K53K20k44O4k83L16J2r6q1m2K37m03L19R7m19L05JJ65k83l5
$$ 16 -86 92 -209 44 264 20 84 -199 117 129 33 -48 -90 147 -256 63 160 -259 46 47 212 -71 -106
7818a06K81k92J05k48M6L4K93k92J35j37K63k5k71L01J81o5o5Q4n6j31J62M3j88
$$ -106 175 -117 -12 -260 -214 -180 113 -179 -44 -181 82 57 -214 87 268 203 138 222 166 35 197 240 52
7841E2J41l57PL0K12k7k09J34J38J84k19m4L2l39L30l45J05J04lK37l41K01J4
$$ 52 193 -164 -157 -127 85 58 -151 -17 121 305 86 42 74 -265 65 -280 -175 -71 -74 163 -178 23 37
7864C7l2l35J35M69k14l8P7k06J40mk7k47L43l01J78l5J09j00J17L9r4M6K5p1
$$ 37 5 -330 -195 274 60 22 99 -107 33 29 2 -245 98 -203 -25 -60 49 -51 66 105 11 57 82 11
7888A1J30N6k30P8J1j8l6M4k2j38P4K2K30k14R9o4oM8j12Kj39L47l2q2j96O0N0
$$ 11 141 197 -33 45 56 38 2 46 24 -114 -40 -18 212 -2 97 33 27 75 -37 -35 -174 173 141 59 -137 -77 -27
7915b7j65m4J65k6J19M2K06k14r2M7K9on5K28k69L1J98Kl5m38K57n0L56k34L7
$$ -27 -192 -236 -71 -97 22 64 270 56 -36 11 40 34 -21 207 -62 -31 167 169 134 -304 -47 -97 259 25 62
7940F2j17j50Qn6J36J26L0k4o9K25n3k44j08K32J48j61J52j39K1j30K28j8l54
$$ 62 -55 -205 -197 -253 -117 9 39 15 -54 171 118 -126 -234 -2 146 -15 137 -2 19 -111 117 99 -255
7963b55J49J51j64J69k05J11O0L7K64k29J55l80k1m1J8L22j94J69j71k1L0J64
$$ -255 -106 45 -119 50 -155 -44 16 53 317 88 243 -137 -158 -199 -181 141 -53 116 -55 -76 -46 118
7985A18j27j49K29Q6j43q4k1l1M20l07L0j79J29j08L71k11k6j80K84O0j39o0J35
$$ 118 -9 -158 71 157 14 -70 -91 -122 298 -9 21 -158 -29 -137 234 23 -3 -183 101 161 22 -38 97
8008I7j22P3j63k11J88K31j82j31J17J97j2l13O1J66O7M2l6j93J27J52R8k87J56
$$ 97 -25 48 -115 -326 -138 93 -89 -220 -103 94 82 -231 -170 -4 63 105 69 -124 3 155 253 -34 122
8031A22k03J58L0j71p9J82LK13l17p9n0L53j71j02M2P9j21j06L19j38J1N5N4q1
$$ 122 -81 77 107 -64 -143 39 42 255 -62 -141 -191 162 -9 -111 -69 10 -111 -217 102 -36 -25 30 84 3
8055Ck3J91k74J00J03k94M37j8l81Q7k16J53J92n5P5K0L5k33J02J0J13K01m30
$$ 3 -20 171 -103 -3 100 -194 243 225 -156 -69 -285 -132 60 5 80 100 135 -98 4 14 127 328 -102
8078a02J80j89R1q8J41l1J16O9j57j14J73n4k4R7j8j85L3r2Q8P7p7J93l38O5o0
$$ -102 78 -111 -20 -108 33 2 118 187 30 -84 89 35 11 108 90 -95 -62 -154 -66 11 -66 127 -211 -146 -206
8103b06J86m1R7j5m00M04N1k93J57J32j57M1kM5j13j11K84j46j36K96JR6j90Q
$$ -206 -20 -61 36 21 -379 25 76 -217 -60 72 -85 -44 -46 -1 -114 -225 59 -87 -223 73 74 170 -20 -12
8127a2p4J77J09k38L4K3k0J28%j46Q0q2K62k05J66k55J78j42R5k37L10j05j21
$$ -12 -86 91 200 -38 -4 19 -1 127 127 -19 61 -21 241 36 202 -53 125 -17 78 -159 151 46 -75
8150g5p9L15j92q0j1L0j6Q8O8k40J88m5J37k82K68k57M22k07p4l8j22K36Q7j99
$$ -75 -154 161 -31 -111 -122 -92 -108 -20 48 -192 -4 -49 88 -194 74 -183 239 32 -42 -80 -202 34 121 -78
8174g8J53P0m78K98O8J93m55J66K12o2j16P6r1qJ48l4J7
$$ -78 75 145 -333 -35 33 226 -229 -63 149 87 -29 47 -44 -52 96 62 79
8191G9
$$ Imaginary data points
##PAGE= N=2
##DATA TABLE= (X++(I..I)), XYDATA
0@%%%%%%%%%%%%%%%%Qj6J6j6J6k3L1l2L8m6N4o2P1q4R5j08J24j41J59j79K01k26
$$ 0 0 0 0 0 0 0 0 0 0 0 0 0 0 0 0 0 8 -8 8 -8 8 -15 16 -16 22 -24 30 -32 39 -45 50 -58 66 -75 84 -95 106 -120
38a20K54k83L16l52L91m33M79n31N85o44P12p87Q66r54J052j160J279j412J564
$$ -120 134 -149 167 -185 206 -227 252 -279 306 -338 374 -413 453 -501 551 -609 670 -742 822
57H22j738J937k167K440k770L179l695M371n311O721r094J4195m8042J3326m4868
$$ 822 -916 1021 -1146 1294 -1476 1703 -1992 2379 -2932 3789 -5305 8890 -39152 -25826 -70694
72g0694l6522J28509k0050q0721P015k8009l1197J04009M3195l9599L3459J9153
$$ -70694 -107216 21293 1243 -79478 -72463 -100472 -131669 -27660 15535 -24064 9395 28548
84B8548l9511O3454N9121n5409k0192K5758l7584j0708L0812r982Q66J4620m6550
$$ 28548 -10963 52491 111612 56203 36011 61769 24185 13477 44289 34307 35173 49793 3243
97C243k6945J7180k4832j8647K0582k5276j9685L7827R707L935M6005p245l0174
$$ 3243 -23702 -6522 -31354 -50001 -29419 -54695 -74380 -36553 -26846 -22911 23094 15849 -14325
110a4325M0008R123m4790K3155L0081k8783J2725K3597l5595N156L3008m1988
$$ -14325 25683 34806 -9984 13171 43252 14469 27194 50791 15196 20352 53360 11372
122A1372k9303K0726l0073k4464L8373q516l1900L7894J9109l3623R460J8499
$$ 11372 -17931 2795 -27278 -51742 -13369 -21885 -53785 -15891 3218 -30405 -20945 -2446
134b446j8777Q366J5081j8926J1643L3333o231l9K1546q800j3653P472j2455j7840
$$ -2446 -21223 -12857 2224 -16702 -5059 28274 22043 22004 43550 34750 21097 28569 16114 -1726
148a726M490m623j0008P078j519n708R464m189j2982N277k124r517J2558Q062
$$ -1726 2764 -1859 -11867 -4789 -6308 -12016 -2552 -6741 -19723 -14446 -16570 -26087 -13529 -5467
162e467m299J5590J2532q372P891R160j8037m216J0108j5907q624J5367n981q903
$$ -5467 -9766 5824 18356 9984 17875 27035 8998 4782 14890 -1017 -9641 5726 -255 -9158
176i158J4672l692j7461Q286P88j9141L858J0011r687O545J7725k519K406J6093
$$ -9158 5514 1822 -15639 -7353 -6565 -25706 -21848 -11837 -21524 -14979 2746 227 2633 18726
190A8726j845p350Q005r23q555N388L253n965K627L310o304m899k491q564q391
$$ 18726 16881 9531 17536 16613 8058 13446 16699 10734 13361 16671 10367 5468 2977 -5587 -13978
205a3978l973l667j454J153L237M525L436K910M655P66j326M544K707j715N956
$$ -13978 -17951 -21618 -23072 -21919 -18682 -14157 -10721 -7811 -3156 -2390 -3716 828 3535 1820 7776
220G776P488l81L325N732n230m457J551q109j0310J090k909p847L047K876o124
$$ 7776 15264 14883 18208 23940 18710 14253 15804 7695 -2615 -1525 -4434 -12281 -9234 -6358 -12482
235a2482J253M279n986l044N120j475j142P659M121J403Q384O120j512J366K578
$$ -12482 -11229 -6950 -12936 -15980 -10860 -12335 -13477 -5818 -1697 -294 8090 14210 12698 14064 16642
250A6642l829l873Jk560l282Q49O33l264j742J59l830n013j869j840l164J721
$$ 16642 12813 8940 8941 6381 3099 3948 4581 1317 -425 -266 -4096 -9109 -10978 -12818 -15982 -14261
266a4261M013M25L061P090K171n52L397J091k923J500K535k500N65M719r70k415
$$ -14261 -10248 -9823 -6762 328 2499 1947 5344 6435 3512 5012 7547 5047 5612 10331 9361 6946
282F946J758k687n362j526k088n492j070K640j031j05M306R06r21K556L77k719
$$ 6946 8704 6017 655 -871 -2959 -8451 -9521 -6881 -7912 -8017 -3711 -2805 -3726 -1170 -793 -3512
298c512J091K745k65O59L931J767j52J893M06m045k103J28l207l666R90L83j455
$$ -3512 -2421 324 59 718 4649 6416 6264 8157 8563 4518 2415 2543 -664 -4330 -3340 -2957 -4412
315d412K078J538k315N48J748k942j611K925L97q20M398L330j766K482K905l127
$$ -4412 -2334 -796 -3111 -2563 -815 -3757 -5368 -2443 -2046 -2866 1532 4862 3096 5578 8483 5356
331E356k181J099k723l235J081l02k415J692J734k459q17J041j807j952J318M52
$$ 5356 3175 4274 1551 -1684 -603 -905 -3320 -1628 106 -2353 -3170 -2129 -3936 -5888 -4570 -4118
347d118j131L015L325M48J846K421m45r75P67p68k860N64J302j875j19J896j487
$$ -4118 -5249 -2234 1091 1539 3385 5806 5361 4386 5153 4385 1525 2089 3391 1516 1397 3293 1806
364A806k109L11k144l485K4j38j933J252K417K52J301L065K13n42J813N69j539
$$ 1806 -303 8 -2136 -5621 -5597 -5735 -7668 -6416 -3999 -3747 -2446 619 832 290 2103 2672 1133
381A133J123J565j41P7K221m72j383l81o03l006j594j95k054j031J398N52j138
$$ 1133 2256 3821 3680 3757 5978 5506 4123 3742 3139 133 -1461 -1656 -3710 -4741 -3343 -2791 -3929
398c929J852Q17j766M48J655j274n31K232P12q1L095J480j643Q56J258k625j657
$$ -3929 -2077 -1260 -3026 -2578 -923 -2197 -2728 -496 216 135 3230 4710 3067 3923 5181 2556 899
415H99J335k015j544J692k99j770J251M75k246nP51k158l42K091k57J37K150J432
$$ 899 2234 219 -1325 367 68 -1702 -451 24 -2222 -2227 -1476 -3634 -3976 -1885 -2142 -2005 145 1577
433A577l76J235N90o83q72L20n20p93L0Q38n74j88Q40o03j583j36n8j788N6J056
$$ 1577 1201 2436 3026 2343 1471 1791 1271 478 508 1346 772 584 1424 821 -762 -898 -956 -2744 -2688 -1632
453a632o86L71K072M77j036J723J99j921M12J195j858k12K589j277o21K447n16
$$ -1632 -2318 -1947 125 602 -434 1289 1488 -433 -21 1174 -684 -896 1693 416 -205 2242 1726
470A726k235J246o47k343O58P43j502O25K219m78m8K227m31j347J304k90j730
$$ 1726 -509 737 90 -2253 -1595 -852 -2354 -1729 490 12 -36 2191 1760 413 1717 1427 -303
487c03P40J204p72L34O91k81o76k1p37j564o72m53m10J57O54O42K87M56O68j87
$$ -303 437 1641 869 1203 1894 1613 937 916 179 -1385 -2057 -2510 -2920 -2763 -2109 -1467 -1180 -724 -56 -243
507b43n10J057j81n57R15J159l41R22J494q55q11O81j111k216O28l37j667Q88
$$ -243 -753 304 123 -434 481 1640 1299 2221 3715 2860 2049 2730 1619 -597 31 -306 -1973 -1085
525a085J013j413R8J405j359p80J218j014r32K090K58n42J745J778p02L4J190
$$ -1085 -72 -1485 -1387 18 -1341 -2121 -903 -1917 -2849 -759 -501 -1043 702 2480 1778 1812 3002
542C002j471p59M00n34j079P29M48p24J85M74r80r89J04o89j004N20N13k0P19
$$ 3002 1531 772 1172 638 -441 288 736 12 197 671 -309 -1298 -1194 -1883 -2887 -2367 -1854 -1874 -1155
561a155J377P56k51O84L8q28r7J34l38J83R44K64m06M02L58j889j72k34j522l23
$$ -1155 222 978 727 1411 1449 621 524 658 320 503 1447 1711 1305 1707 2065 176 4 -230 -1752 -2075
581b075O44j64j54J301N87m22K49N38j262k84J041o89l49J779N85q13J278N50
$$ -2075 -1431 -1595 -1749 -448 139 -283 -34 504 -758 -1042 -1 -690 -1039 740 1325 512 1790 2340
599B340j812k69K56j337o64P10l86J70J121K98p01M81M90j263j9M49o26L46R64
$$ 2340 528 259 515 -822 -1486 -776 -1162 -992 129 427 -274 207 697 -566 -585 -136 -762 -416 548
618E48M48P9Q27J62p09m91k07r25r13R5Q7j58M32M65k14k66K97j25p39j09K28
$$ 548 996 1075 1902 2064 1355 864 657 -268 -1181 -1086 -999 -1157 -725 -260 -474 -740 -443 -568 -1307 -1416 -1188
639a188j22R19J223K8M15R97P5q66J22m58j185M7N37j023L22P50m27n01N35r69
$$ -1188 -1310 -391 832 860 1275 2272 2347 1481 1603 1145 -40 7 544 -479 -157 593 166 -335 200 -769
659g69j234J26j57o28J067R36J87K52J495k17l65P54j93j028M18O93m38J62O56
$$ -769 -2003 -1877 -2034 -2662 -1595 -659 -472 -220 1275 1058 693 1447 1254 226 644 1337 899 1061 1717
678A717M3n29J71q09j176m36m08o81p5M91L18J28O92P45o35j94L91l42r2R74M66
$$ 1717 1760 1231 1402 593 -583 -1019 -1427 -2108 -2183 -1692 -1374 -1246 -554 191 -444 -638 -247 -589 -681 293 759
699G59N6R40M42p4kJ7r57j025Q8n62p02J38J96n04Q08J98q57J2O4l06n67P58L89
$$ 759 815 1755 2197 2123 2121 2138 1181 156 244 -318 -1020 -882 -686 -1190 -382 -184 -1041 -1029 -965 -1271 -1838 -1080 -691
722f91K05O05J097j08M82J84p46k23j5l76n45M60K71l70n2N94p17n68Qp33n64
$$ -691 -486 119 1216 1108 1590 1774 1028 805 790 414 -131 329 600 230 178 772 55 -513 -505 -1238 -1802
743a802K62K16k41Q00J274j92N46K12j85n63L42k86l88L81L37K4J64K42l64p48
$$ -1802 -1540 -1324 -1565 -765 509 317 863 1075 890 327 669 383 -5 376 713 737 901 1143 779 31
763C1j23m95q86k56N30k12K23R49J74j21M76K46p18K27K37m06J34R92j63J29M62
$$ 31 -92 -587 -1473 -1729 -1199 -1411 -1188 -239 -65 -186 290 536 -182 45 282 -124 10 1002 839 968 1430
784A430nl52l83n66q98j68J03m23J16P40P8r1K34j09j68R5o7l66K90P08O99K70
$$ 1430 1425 1073 690 124 -774 -942 -839 -1262 -1146 -406 -328 -419 -185 -294 -462 -367 -434 -800 -510 198 897 1167
806A167K35L98l50j04k70p30l12j47l22j89L07J5k54R6K6m17o47Q1o4j14N32P17
$$ 1167 1402 1800 1450 1346 1076 346 34 -113 -435 -624 -317 -302 -556 -460 -434 -851 -1498 -1417 -1481 -1595 -1063 -346
828c46K96N41M82L3p3J26j25n00J66jj89L10L13m98M2l66l42r58R6l57k88K3Q37
$$ -346 -50 491 973 1006 933 1059 934 434 600 599 410 720 1033 535 577 211 -131 -1089 -993 -1350 -1638 -1615 -778
851g78j24K66R26pk97L66p9k03K29L9J07L92O20k14j66L47p19n78j59l93m41k91
$$ -778 -902 -636 290 283 -14 352 273 70 299 338 445 837 1457 1243 1077 1424 705 127 -32 -425 -866 -1157
873a157N96k98R3M3K99mj4m8l44M7M89J16K99Q71M41k34R1J1n04m45O3k16m42
$$ -1157 -561 -859 -766 -723 -424 -428 -442 -490 -834 -787 -298 -182 117 988 1429 1195 1286 1297 793 348 411 195 -247
896b47K34k85K03J59j72M8o94L68m59m55L43K21K28N19J00K60L09K50l05k45K3
$$ -247 -13 -298 -95 64 -108 -60 -754 -386 -845 -1300 -957 -736 -508 11 111 371 680 930 625 380 403
917D03m45K40J1M59n58K76Q0l51o19J01j45l05j70R1J55K38L10J62J90N72j56
$$ 403 -42 198 209 668 110 386 466 115 -504 -403 -548 -853 -1023 -932 -777 -539 -229 -67 123 695 539
938E39n23K23O9k7L22j3n9L26j27j48n48J65l94m98l5P2k49j80N70R9m8N38l40
$$ 539 16 239 308 281 603 590 531 857 730 582 34 199 -195 -693 -728 -656 -905 -1085 -515 -416 -464 74 -266
961b66J55nR1p1L66L8M6L71L40k39j25J5j94l52l34M7k54j04N9k0k67L37j67j9
$$ -266 -111 -116 -25 -96 270 308 354 725 1065 826 701 716 522 170 -164 -117 -371 -475 -416 -436 -703 -366 -533 -552
985e52j88K16j03M5L98M59j66N95L8J8p8J05l73j53K3j82K2K86k53k98P0Q7l85
$$ -552 -740 -524 -627 -582 -184 275 109 704 742 760 682 787 414 261 284 102 124 410 157 -141 -71 16 -369
1008c69j95P8m83M6K95J47p5N47L70J5j08J10N5k17L01j24k10J18L95j17j36n5
$$ -369 -564 -486 -969 -923 -628 -481 -556 -9 361 376 268 378 433 216 517 393 183 301 696 579 443 388
1030C88j02l54m38q5j49N8l0J61P4K42k7j23M54k38j14K49J73n8K65J3M71k86
$$ 388 286 -68 -506 -591 -740 -682 -712 -551 -477 -235 -262 -385 69 -169 -283 -34 139 81 346 359 830 544
1052E44K01l11l06Q9l69l50K26j88K78k29K22J28n0k68K85k40m5J32L00p2L33
$$ 544 745 434 128 217 -152 -502 -276 -464 -186 -415 -193 -65 -115 -383 -98 -338 -383 -251 49 -23 310
1073C10J21J8Q9j21J00k1j79k07j60P9l06J05J70o3J36j20o0j80P5n8j04K54l4
$$ 310 431 449 538 417 517 496 317 110 -50 29 -277 -172 -2 -65 71 -49 -109 -289 -214 -272 -376 -122 -156
1096a56N4L40j9nmpj90K16o7l01K24p6M5R8k5j51R7k44k87K17k92K14j66R1K52
$$ -156 -102 238 219 214 210 203 13 229 162 -139 85 9 54 152 127 -24 73 -171 -458 -241 -533 -319 -485 -394 -142
1121a42j6L23k22K75j05k04l2K59Q0j87J56L89k65J5j9l77j95L5J66l27J39P0
$$ -142 -158 165 -57 218 113 -91 -123 136 216 29 185 574 309 324 305 -72 -267 -232 -66 -393 -254 -184
1143a84n0n3L86j03l9P1kk76nM35j00J27K08j90OJ32q8k30J28n7k20oj10K1k53
$$ -184 -234 -287 99 -4 -43 28 26 -250 -255 180 80 207 415 225 231 363 275 45 173 116 -104 -110 -220 -199 -452
1168d52J63K7K29m4j12j51q9M59k42L64J2n6K56j95J3K21m7j37j96p9J18P6K50
$$ -452 -289 -262 -33 -77 -189 -340 -429 30 -212 152 164 108 364 169 182 403 356 219 23 -56 62 138 388
1191C88j92p2j22j5m8j63k2j1L88k35O5n0J95l1j73K85M9l9j00j98J87M3n4L29
$$ 388 196 124 2 -13 -61 -224 -246 -257 131 -104 -39 -89 106 75 -98 187 236 197 97 -101 86 129 75 404
1215D04o5n89L36O6m1m28K69j4k15K53k13J87J17K98m27p9M9j47J78J52M3J44
$$ 404 339 -250 86 152 111 -317 -48 -62 -277 -24 -237 -50 67 365 -62 -141 -92 -239 -61 91 134 278
1237B78r7N9K9k85J96p4l89K07N6l16K26r9JK14l44K90k31K10J77l56M04k42J99
$$ 278 181 240 269 -16 180 106 -283 -76 -20 -336 -110 -209 -208 6 -338 -48 -279 -69 108 -248 156 -86 113
1260A13l7j17K52m3j56rqk53J48J80j11J89J0j07p9J19m8Q0m63K46j88M78j63
$$ 113 76 -41 211 168 12 3 -5 -258 -110 70 -41 148 158 51 -28 91 43 123 -340 -94 -282 196 33
1283C3j0M20mm09O4k58J49J44l10N0J79Q8o2k50K08j9p6l27m5M63k24j3pJ13N9
$$ 33 23 443 439 30 94 -164 -15 129 -181 -131 48 136 74 -176 32 13 -63 -390 -435 28 -196 -209 -216 -103 -44
1308d4J46J51m62L71k54J44J21q2m8o5J26P2j98r1J24j25Q9j34K5j12K25k10n9
$$ -44 102 253 -209 162 -92 52 173 91 43 -22 104 176 -22 -113 11 -114 -25 -159 -134 -246 -21 -231 -290
1331b90L90k45J26j94L64j91K8K0q0k29J60l5M52j53m9m5O5P1mk17L0OJ40l50
$$ -290 100 -145 -19 -213 151 -40 -12 8 -72 -301 -141 -176 276 123 74 29 94 165 161 -56 -26 -20 120 -230
1355b30K71j24k76M72j9m28Q2K5K86j39L5L76l48J68l07K28j16Q9j15M0l2J42
$$ -230 41 -83 -359 113 94 -334 -252 -227 59 -80 -45 331 -17 151 -156 72 -44 45 -70 -30 -62 80
1377H0O5j39k27L68l28K31k79j11J67K45j10j50P6L47k20L7kK72n38p9K98Q0Q2
$$ 80 145 6 -221 147 -181 50 -229 -340 -173 72 -38 -188 -112 235 15 52 50 322 -216 -295 3 83 165
1400A65L0j62j30j21J16J59j53K7J1Jn3J39m2K68l77M2N9M1J02k5M7j84k93K42
$$ 165 195 33 -97 -218 -102 57 -96 -69 -58 -57 -110 29 -13 255 -122 -80 -21 20 122 97 144 -40 -333 -91
1424i1P4KK98l34O5q9O3j12Q2l7K7J00j53J46M6j96L91k33j87R3J46k31j37K48
$$ -91 -17 -15 283 -51 14 -75 -12 -124 -42 -79 -52 48 -105 41 87 -109 282 49 -138 -45 101 -130 -267 -19
1448a9K33n0j06j66J17M5M6n6K6j25J45j87nJ60L5j78N5j2k51K73o0P5m2Q9j1
$$ -19 214 164 58 -108 9 54 100 44 70 -55 90 -97 -102 58 93 -85 -30 -42 -293 -20 -80 -5 -47 42 31
1473C1R6o0m0pk46J68L5q3r8K51K19j88K2J32k83K9k03j74N88l89L25k37J87N5
$$ 31 127 67 27 20 -226 -58 -23 -106 -204 47 266 78 100 232 -51 -22 -225 -399 189 -200 125 -112 75 130
1497A30Q2m22K74j95K77m8l03L01j08J33n5k3k38N00l92J66l02J1K04k28J95l0
$$ 130 212 -210 64 -131 146 98 -205 96 -12 121 66 43 -195 305 -87 79 -223 -212 -8 -236 -41 -71
1519g1p3R9Q3J29m69K14J55l34M44j73K53l30J68q7j6n1J66J1Q1o6q0k68L53L6
$$ -71 -144 -45 38 167 -302 -88 67 -267 177 4 257 -73 95 8 -8 -59 107 118 199 133 53 -215 138 174
1543A74l60J39J93M4k49k7j36J28J7L37l93K16J2k2k33J1j08L82j32j44L09l05
$$ 174 -186 -47 146 190 -59 -86 -222 -94 -77 260 -133 83 95 73 -160 -149 -257 125 -7 -151 158 -147
1565a47K56j63K6K10j62j47P6m6L89l50l9K81R8k09n9NK8k68J87O1q9j36Q8J17
$$ -147 109 -54 -28 182 20 -127 -51 -97 292 -58 -97 184 282 73 14 19 47 -221 -34 27 -62 -198 -110 7
1589Gl59K81K51l64J13L17l80J45n7K54j98J68j49k31J65K2j51M01j68j0j34j71
$$ 7 -352 -71 180 -184 -71 246 -134 11 -46 208 10 178 29 -202 -37 -15 -166 235 67 57 -77 -248
1611b48K72O3Q4j77J88J0k09j82k3O9K09L6o3q7r9L58k43K2M8O1NJ20k48k8J14
$$ -248 24 87 171 -6 182 192 -17 -199 -222 -153 56 92 29 -58 -157 201 -42 -20 28 89 94 214 -34 -62 52
1636E2r6O6j39Q4J11Lj88J80j53J03l7j16K67k15J98M7k74K99j93K7K67k91N9
$$ 52 -44 22 -117 -33 78 81 -107 73 -80 23 -14 -130 137 -78 120 167 -107 192 -1 26 293 2 61
1659F1J93k91M49l87J2J54j63K5O9k10j8Q5J57j60k32J88n4J2J14j04J65j16o0
$$ 61 254 -37 412 25 37 191 28 53 122 -88 -106 -21 136 -24 -256 -68 -122 -110 4 -100 65 -51 -111
1682a11J33l5K80j46K35n19K20K4m50M79M3j72K9l27L92m5J1KJ33J28m35L35j90
$$ -111 22 -13 267 121 356 -163 57 81 -369 110 153 -19 10 -317 75 30 41 43 176 304 -131 204 14
1705A4q4LR0J43j48j05N6j56M77k32k38K51j73j5K06j04jk8J85k74J99k23N8m3
$$ 14 -70 -67 23 166 18 -87 -31 -187 290 58 -180 71 -102 -117 89 -15 -16 -44 141 -133 66 -157 -99 -142
1729a42J5m0K69l1m6J41l84L74r3M5k65N7k3K29l7M3j17o2L4J52j34J58j72K87
$$ -142 -127 -167 102 71 25 166 -218 156 63 108 -157 -100 -123 106 69 112 -5 -67 -33 119 -15 143 -29 258
1753B58j05l55J14L69l90L22j77l11K08K48k94K15j62K9M7jK16l03k49N37l27
$$ 258 153 -202 -88 281 -109 213 36 -275 -67 181 -113 102 -60 -31 16 15 231 -72 -321 216 -111
1774a11j32L44L4p4n6k2L04j8o57M60J35o6j04K6p9k3J46M3k12K72j24qj85j4
$$ -111 -243 101 135 61 5 -17 287 269 -388 72 207 141 37 63 -16 -39 107 150 -62 210 86 78 -107 -121
1798a21L9N9L2k03K02J21j31p5M0J72O3k12J19r9J62k72K17M3l03K50j66o9O4
$$ -121 -82 -23 9 -194 8 129 -2 -77 -37 135 198 -14 105 6 168 -104 113 156 -147 103 -63 -132 -68
1821f8R9M6j25o3J64l34O5K02n2J76j0k2j42L9m5J31q3Q4j09J71J31m49M33k27
$$ -68 31 77 -48 -111 53 -281 -216 -14 -66 110 100 78 -64 -25 -70 61 -22 62 -47 124 255 -194 239 12
1845A2j11L21l08J50q9K03j14Q0kk09J28j69K25k45j05M0L37j58o2K07l41K54
$$ 12 -99 222 -86 64 -25 178 64 144 142 -67 61 -108 117 -128 -233 -193 144 -14 -76 131 -210 44
1867D4o2j33J11M8J39n0j01K56k05k19l6K16q4k4J40k28N46Ql35r2j25J21j94
$$ 44 -18 -151 -40 8 147 97 -4 252 47 -172 -208 8 -76 -100 40 -188 358 366 31 -61 -186 -65 -259
1890b59K94nL21m45J72j65j77M20m48K80j03L57j21l43K70q2P3Mk11Q3J1J73j69
$$ -259 35 30 351 -94 78 -87 -264 156 -292 -12 -115 242 121 -222 48 -34 39 43 -168 -85 -74 99 -70
1913g0K37j42j05J07J80j14n5K5j17K44k46L33l37L06l91J77l1R8mj41O5k68L45
$$ -70 167 25 -80 27 207 93 38 63 -54 190 -56 277 -60 246 -145 32 1 99 95 -46 19 -249 96
1936I6l30O1K00J0Q3kj34K11m44L71J04l60J77j65M4L78k81J68j5o3j30J01l2
$$ 96 -234 -173 27 37 120 118 -16 195 -249 122 226 -134 43 -122 -78 300 19 187 172 109 -21 80 48
1959D8p9Q7j86R4J19l9j31J27n1n1J9j10K39n5j25K40k30J59j42K00j52k87L03
$$ 48 -31 56 -130 -36 83 44 -87 40 -11 -62 -43 -153 86 31 -94 146 -84 75 -67 133 -19 -306 -3
1982cj55J40J94j38k68K10j14J5K97j08k00K37K8j03k1l7j12J39Q0k2j83O8L6
$$ -3 -158 -18 176 38 -230 -20 -134 -119 178 70 -130 107 135 32 11 -26 -138 1 81 59 -124 -56 -20
2005b0J81j65j8K4J9j07J53KM2k60J02PK41l69K90j32o6N0J77j39L9K39m66J59
$$ -20 161 -4 -22 2 21 -86 67 69 111 -149 -47 -40 201 -168 122 -10 -76 -26 151 12 51 290 -176 -17
2029a7J37j60j41J40o4J01k03M82n2m75L19j11j46J77k21K80rj7j13R2J10l13
$$ -17 120 -40 -181 -41 -105 -4 -207 275 223 -252 67 -44 -190 -13 -234 46 37 20 -93 -1 109 -204
2051b04P1l2L19m15L32j22On5j51L63j17N4O7m11K12J89l21K14j91K51p7M0J79
$$ -204 -133 -165 154 -261 71 -51 -45 -100 -251 112 -5 49 116 -295 -83 106 -215 -1 -192 59 -18 22 201
2074B01k77J52l21J9J49q2R2k2l7J17m7K35j34Q6l50K13j94J02r8L16j73q3k9
$$ 201 -76 76 -245 -226 -77 -159 -67 -89 -126 -9 -56 179 45 131 -219 -6 -200 -98 -196 120 -53 -136 -165
2097a65N3j07J19J50O0m40O53l55k5K01r7k29K17k69M09k03R9M9j03o6P8J91k65
$$ -165 -112 -219 -100 50 110 -330 323 -32 -57 144 47 -182 35 -234 175 -28 71 120 17 -49 29 220 -45
2120d5j38K89j0k51J96o8j78K55j76K03k35M64k20k06j05J95J86j04j15r3K27
$$ -45 -183 106 96 -155 41 -27 -205 50 -126 77 -158 306 86 -120 -225 -30 156 52 -63 -156 71
2141G1j23K48l38K94n44M54j14L8j34p5K43o1j83J29J16j85K76j72J7K48j95m2
$$ 71 -52 196 -142 152 -392 62 -52 -14 -148 -223 20 -41 -224 -95 21 -164 112 -60 -43 205 10 -32
2163c2J9n5j47J07r4K92p2j67J49L21k92l3O6l08L08l3m5K2J12J13n01L86nj45
$$ -32 -13 -68 -215 -108 -202 90 18 -149 0 321 29 -4 62 -246 62 29 -16 6 118 231 -270 116 111 -34
2187c4P4J72k06n4kO5r0j27K96J61j75K6k47K15o4k57O9J19Q7j22J84k39L22l3
$$ -34 40 212 6 -48 -50 15 -75 -202 94 255 80 106 -141 74 10 -247 -178 -59 28 -94 90 -149 173 140
2211A40R0mp9j44j56%L9n7L51l63J84k98J21J27P4p8J04j99qK18j14n7K2K06p8
$$ 140 230 226 147 3 -153 -153 -114 -171 180 -183 1 -297 -176 -49 25 -53 51 -148 -156 62 -52 -109 -87 119 41
2236D1M5l32M4K21J16k68J59J46q0j32P0J27j38J7P0k95L36m97O03k09k93N03
$$ 41 86 -246 -202 19 135 -133 26 172 92 -40 30 157 19 36 106 -189 147 -350 253 44 -249 254
2258B54l94J14J16j20R9J7j64J01q6j25L05r4K32n05K74J42j63p2L17j77l8K97
$$ 254 -140 -26 90 -30 69 86 -78 23 -63 -188 117 23 255 -250 24 166 3 -69 248 71 33 330
2280C30l57J67j89Q4o7P1j43K02l9k12J25J64J27r3j85J1K9j37K75p7kk01n5L22
$$ 330 -27 140 -49 35 -32 39 -104 98 59 -153 -28 136 263 170 -15 -4 25 -112 163 86 84 -117 -172 150
2304A50P1j22j50q9K54nj24J00m1k49j4L91k33J25j24J00K37l95J58k2p9o0L4
$$ 150 221 99 -51 -140 114 109 -15 85 44 -205 -219 172 -61 64 -60 40 277 -118 40 18 -61 -121 -87
2327h7L0L6j17J25n8l1p5J11o9L16m6j68r5K49M4R4m08J71K7j2l23L48rj08J43
$$ -87 -57 -21 -138 -13 -71 -102 -177 -66 -135 181 135 -33 -128 121 165 259 -149 22 49 37 -286 62 53 -55 88
2352H8j61R1l6K14l9P9l3j29J16k64j20K60k23L65k66j81J91J43Q9j39P6k29J13
$$ 88 -73 18 -18 196 157 236 203 74 190 -74 -194 66 -157 208 -58 -239 -48 95 184 45 121 -108 5
2375Ep7K05l7m2O9N4j69J10j15J14j24j88K59k05K32j89L8K06k28K0p7K62l10
$$ 5 -72 133 96 54 123 177 8 118 3 117 -7 -195 64 -141 91 -98 -60 146 -82 -62 -139 123 -187
2398a87J26j0MM5j08K0k5K64j33K1Q3k02K47j9p5J6J02j38J26j17k34K17J3K00
$$ -187 -61 -71 -67 -22 -130 -110 -135 129 -4 17 100 -102 145 126 51 67 169 31 157 40 -194 23 36 236
2422B36m48M53j64l1k11MK06qj2Lp8p2L11j49jQj54oK3K5K58j18n5J7k79M2M03
$$ 236 -212 241 77 46 -165 -161 45 37 25 28 -50 -122 189 40 39 47 -107 -113 -90 -65 193 75 20 37 -242 -200 203
2449B03j67K00k67Lk24J43p6K52l40K40J8p7k25L06J97j10n1J44R6k28J19l29
$$ 203 36 236 -31 -28 -252 -109 -185 67 -273 -33 -15 -92 -317 -11 186 76 25 169 265 37 156 -173
2471a73J02N0R3j61L8J10q4l3j46J96j2O1no1R7jO3l08J15oK31m05K67K12j38
$$ -173 -71 -21 72 -89 -51 59 -25 -58 -204 -8 -20 41 36 -25 72 71 134 -174 -59 -65 166 -239 28 240 102
2496A02k23L02j21j6k14J72J4J67n2r8j35K34J8k78J86k29N9K24l4k67J48J34
$$ 102 -121 181 60 44 -170 2 16 183 131 33 -102 132 150 -128 58 -171 -112 112 78 -189 -41 93
2518I3j31N5J3j28K41l6l21K58J01j54K40l23J67K53l17j62L13j26n6J51j74J63
$$ 93 -38 17 30 -98 143 107 -214 44 145 -9 231 -92 75 328 11 -151 162 36 -20 131 -43 120
2540A20j12L7j29J17k4P8M4j55R3j09K33j99O8k5Lj94K77L3j90k4o1K31Jj32M2
$$ 120 8 45 -84 33 9 87 131 -24 69 -40 193 -6 62 37 40 -154 123 156 -34 -58 -119 112 113 -19 23
2565B3q1P9q6LL98l33n9K7K0J81l25J71q9j82K16N9K0P8k40N8M1J33j02j63N6
$$ 23 -58 21 -65 -62 336 3 -56 -29 -9 172 -153 18 -71 -253 -37 22 42 120 -120 -62 -21 112 10 -153 -97
2590i7M8P8k39L35K9j83j6qNRK10k80r5M50k67J32k57J18O3R4l7P8J57k20k77
$$ -97 -49 29 -210 125 154 -29 -45 -53 -48 -39 171 -109 -204 246 -21 111 -146 -28 35 129 92 170 327 107 -170
2615a70M88k90n6R3o1m4j36Q8n7k4p0L41j95J0N1J3j49K20j6j8L22j43m71N02
$$ -170 318 28 -28 65 4 -40 -176 -88 -145 -169 -239 102 -93 -83 -32 -19 -168 52 36 18 340 197 -274 228
2639B28j41j04K91k49J98k53M8K4Lp4P7m3J45k06q6J87K71l45j23J42qr0K36j41
$$ 228 87 -17 274 25 223 -30 18 42 45 -29 48 5 150 -56 -142 45 316 -29 -152 -10 -18 -108 128 -13
2663a3K53l54O2K2l9J11qK79k38j2n5k19J56j34L13j16R7N0l9K3n1m1j43q4K45
$$ -13 240 -114 -52 -30 -69 42 34 313 75 63 8 -211 -55 -189 124 8 105 155 116 139 88 47 -96 -180 65
2688F5L6j90J79J73k53J19J66l78K19n1k69J17J89k0n5p6j87J39L04m44L42n1
$$ 65 101 -89 90 263 10 129 295 -83 136 85 -184 -67 122 102 47 -29 -216 -77 227 -217 125 74
2710G4K2J5J63l85J20j38J46P7k03L28j41j26m6K03J12m26J20O8k0j02L37n27
$$ 74 96 111 274 -111 9 -129 17 94 -109 219 78 -48 -94 109 221 -205 -85 -17 -37 -139 198 -329
2732c29N23k01L9l68J56R7J58P1j42k2p3K66k31j91L37k13m8K21k09M4K83k64
$$ -329 194 -7 32 -336 -180 -83 75 146 4 -18 -91 175 -56 -247 90 -123 -171 50 -159 -115 168 -96
2754i6L46l37j64M20j48m15M23M9n3Q8k20j7k4K94l85N00n87L87L3M6J1o0k14
$$ -96 250 -87 -251 169 21 -394 29 78 25 113 -107 -124 -148 146 -239 261 -326 61 94 140 151 91 -123
2777a23K83l38j24J23l9N9J37O1o8l39J68O0Q9J96k12J32j42J65j45j23L67j16
$$ -123 160 -178 -302 -179 -218 -159 -22 39 -29 -368 -200 -140 -51 145 -67 65 -77 88 -57 -180 187 71
2799G1j33k02L80l7j36R8q2J46k33K94j13k11K34J53k60J67K44o15Q4K37k15J17
$$ 71 -62 -264 116 79 -57 41 -41 105 -128 166 53 -158 76 229 -31 136 380 -235 -151 86 -129 -12
2821a2K98m00J31j87J73r3o9K55l52K37rL6QJ37q8K52l04L0J49k64K54j69k27
$$ -12 286 -114 17 -170 3 -90 -159 96 -256 -19 -28 8 16 153 65 317 13 43 192 -72 182 13 -214
2844b14K42J02j07q5K17j81K58k84N9j30J23M2J19n9j49J28q4n1P9J06k50J78
$$ -214 28 130 23 -62 155 -26 232 -52 7 -123 0 42 161 102 -47 81 -3 -54 25 131 -119 59
2866E9l38L71jL6n6k16J11Q3J09q3m5l21L38k5R4l11J36M7J48j61J39m43M04q4
$$ 59 -279 92 91 127 71 -145 -34 49 158 75 30 -291 47 22 116 -195 -59 -12 136 -25 114 -329 75 -9
2890ipj39j25K35J41m1k18K00M1M0j7j12NJ19k22K76j73r8P7J7J13j60o3k4R5
$$ -9 -16 -155 -280 -45 96 55 -163 37 78 118 101 -11 -6 113 -109 167 -6 -104 -27 -10 103 -57 -120 -144 -49
2915d9n1j79K77qj4P4j11J24m6Jl23N59l28N8q6rK41K4p8j04jK74n26L70K2j78
$$ -49 -100 -279 -2 -10 -24 50 -61 63 17 18 -305 254 -74 -16 -102 -111 130 154 76 -28 -29 245 -281 89 111 -67
2941f7K1r1K94j51J68j77p8R9p5J09J10j79J84r7j26K27q6j03k4O7R0j83K43q2
$$ -67 -46 -137 157 6 174 -3 -81 18 -57 52 162 -17 167 70 -56 171 85 -18 -42 25 115 -68 175 93
2965I3J57l10J89j52o0K36J42m31J23r0J8k6N3N2Lm7Q3N4o1pM3N5l00J44K51k45
$$ 93 250 -60 129 -23 -83 153 295 -136 -13 -103 -85 -111 -58 -6 -3 -50 33 87 26 19 62 117 -183 -39 212 -33
2991c3j55K71j04r3J90j81M12k10MO0k56J81j84L2L25k46K2J02j04J67j37n5p6
$$ -33 -188 83 -21 -114 76 -105 307 97 101 161 -95 86 -98 -66 259 13 35 137 33 200 63 8 -68
3014f8J58k37l5J85K43k39N2l18L29o4N4j94k0K88j53m3K62l34J04O5n5k1J28
$$ -68 90 -147 -182 3 246 7 59 -259 70 6 60 -134 -154 134 -19 -62 200 -134 -30 35 -20 -41 87
3037H7k53K65J33m18K58M9j27M9j72J04K2K67j33l01m7K49J82k08j30J6K41k48
$$ 87 -166 99 232 -186 72 121 -6 43 -129 -25 -3 264 131 -170 -217 32 214 6 -124 -108 133 -115
3059a15K95k44j13J28k55M66j61M7J98l65K70j10Q4L0j36R7l59N28l31J22K0j2
$$ -115 180 -64 -177 -49 -304 162 1 48 246 -119 151 41 125 155 19 116 -243 285 -46 76 96 84
3081H4J38j76J88k10j87K80k61M9L05j17o9j6m50P36p8l25O9K44l07K71l11R0
$$ 84 222 46 234 24 -163 117 -144 -95 210 93 24 8 -442 294 216 -109 -40 204 -103 168 -143 -53
3103e3J90l33L22Qk56K89j34N1m2j44J72J62l97K08j09K4L18l59P2J24j79k99
$$ -53 137 -196 126 134 -122 167 33 84 42 -102 70 232 -165 43 -66 -42 276 -83 -11 113 -66 -365
3125c65N34j08P9N6j82O5j28N6L5j85l2J40j31M78k35p8L8Lj32OL6p5M0pJ2J32
$$ -365 169 61 140 196 14 79 -49 7 42 -143 -175 -35 -166 312 77 -1 37 40 -92 -86 -50 -125 -85 -92 -80 52
3151E2l6O5j38j2j5N8J9K63k38j64Jj2P4N5r9J78j39J57K15m70J24K41l41J98
$$ 52 16 81 -57 -69 -84 -26 -7 256 18 -146 -145 -157 -83 -28 -127 51 -88 69 284 -186 -62 179 -162 36
3175C6j48K22k33J33J55k76J44J37k21J33r4j76L95j85M2l90K70L38l54L72j56
$$ 36 -112 110 -123 10 165 -111 33 170 -51 82 -12 -188 207 22 64 -326 -56 282 -72 300 144
3196A44j00r1J32q4j01O6R1Q7j27J10j5J0J6l47L77k07j3p8J36r6J59r2Q7j43
$$ 144 44 -47 85 1 -100 -34 57 144 17 127 112 122 138 -209 168 -39 -52 -130 6 -90 69 -23 64 -79
3220g9RK83k41K23j79R4k07J48j47L05j70K41j10k58N8J55j06P1j36J80j45N1
$$ -79 -70 213 -28 195 16 110 -97 51 -96 209 39 280 170 -88 -30 125 19 90 -46 134 -11 40
3242D0k77P05l73j75K68j72r0L03l33J53P8j13L9j83j0O1o2l9K23J06j83J17J40
$$ 40 -237 468 95 -80 188 16 -74 229 -104 49 127 14 53 -130 -140 -79 -141 -180 43 149 -34 83 223
3265B23j45p5J68k38n5o0J64j79L36k14k50L41Q4j09J77j05k61L29j2l31K86p4
$$ 223 78 3 171 -67 -122 -182 -18 -197 139 -75 -325 16 100 -9 168 63 -198 131 119 -212 74 0
3287@Jj20J5J18o5K17k46k2J15L4M7p6j36J22l9r7J54J07j62J57k81L32j32k14
$$ 0 1 -119 -104 14 -51 166 -80 -102 13 47 94 18 -118 4 -35 -132 22 129 -33 124 -157 175 43 -171
3311a71K78j33K00k91J26o6j38M14j78j13P4K9Kl5J55j14O2o0M7j57K36l2j28
$$ -171 107 -26 174 -117 9 -57 -195 219 41 -72 2 31 33 -2 153 39 101 41 88 -69 167 135 7
3334GJ41j14L2Oj45pK76l1m4n3Q8j51k89M4K63N6J82k70Q0j14L7j04J75l23L03
$$ 7 148 34 66 72 -73 -80 196 165 121 68 156 5 -284 -240 23 79 261 -9 71 -43 -6 -110 65 -258 45
3359D5p0J04Q7J4k91p8K24lj08J52J08J58l75J20j53K26l23J78Kj05J93k89J12
$$ 45 -25 79 166 180 -111 -189 35 32 -76 76 184 342 -33 87 -66 160 -163 15 17 -88 105 -184 -72
3382g2r4K84k40J27l9l6L8q9o8K32p4P4j0j72K84r6k88J75K6L4k13L83j97n8J8
$$ -72 -166 118 -122 5 -34 -70 -32 -121 -189 43 -31 43 33 -139 145 49 -239 -64 -38 -4 -217 166 -31 -89 -71
3407g1P7J38N1J6m55R3l0J63m5j6M4K14k95N7j29J61L57k18k03N1J42j08J00k81
$$ -71 6 144 195 211 -244 -151 -181 -18 -63 -79 -35 179 -116 -59 -188 -27 330 112 -91 -40 102 -6 94 -187
3431a87J37o2Ln9L32k34j42N6N18m14J44p6J3N9j58Q5J49n4m09K95J82j47K14
$$ -187 -50 -112 -109 -168 164 -70 -212 -156 362 -52 92 16 29 88 -70 15 164 110 -299 -4 178 31 245
3454B45m12J04k1r3P3J22j43J89O8k73K87k10n4J5J41o8K3L0k9L8k48Q8K80k1
$$ 245 -167 -63 -84 -177 -104 18 -125 64 132 -141 146 -64 -118 -103 38 -30 -7 23 -6 32 -216 -128 152 131
3478A31k24J40p1P2L9O5j40P0k67P8J79k06R7L7J44m0J72k64J76k45N3K07n5k9
$$ 131 -93 47 -24 48 87 152 12 82 -185 -107 72 -134 -37 0 144 104 276 12 188 -57 -4 203 148 119
3502A19m11J59J62q2J5J7l1j2P2j11r3n6J16Q8r8J14J26j16L0Mo0N0n4K7k3M4
$$ 119 -292 -133 29 -53 -38 -21 -52 -64 8 -103 -196 -252 -136 -48 -146 -32 94 -22 8 12 -48 2 -52 -25 -48 -4
3528dk79L85j74J37M6j8l3l6J6k17K51k63K05ql6J89l9l25J37J29l78J86l0L29
$$ -4 -283 102 -72 65 111 93 60 24 40 -177 74 -189 16 8 -28 161 122 -203 -66 63 -315 -129 -159 170
3552A70Q5m05R1P5j32L60j19l00L03j02n9k12K70P5POj35J76Nk01J48p6r7l1M6
$$ 170 255 -150 -59 16 -116 244 125 -175 128 26 -33 -245 25 100 107 113 -22 154 159 -42 106 30 -67 -98 -52
3577e2K53l43J47k9J50j90N3OJ44j20N6j03k64L63K6k83J8P9N0J85j26j25P9K8
$$ -52 201 -142 5 -24 126 -64 -11 -5 139 19 75 -28 -292 71 97 -186 -168 -89 -39 146 20 -105 -26 2
3601BO0L1J26k39q0J35K07p0j73r9J87J41m78J74J32k25K05p6J92j35o0K44o82
$$ 2 62 93 219 -20 -100 35 242 172 -1 -100 87 228 -250 -76 56 -169 36 -40 152 17 -43 201 -481
3624d81L14K12j45M11l81R8O3J68k73J15l8j86K25m6R4k30K62k09q2J46j76N2
$$ -481 -167 45 -100 311 -70 28 91 259 -14 101 63 -123 102 56 150 -80 182 -27 -109 37 -139 -87
3646h7j12K71p0m7J2O1q0q1j18J13J40Q9j38l7JJ23k85K16k0j58R4K06j2j40P8
$$ -87 -199 72 2 -45 -33 28 -52 -133 -251 -138 2 91 -47 -84 -83 40 -245 -29 -49 -207 -113 93 81 -59 19
3671A9Q3J54l54K30p5KO5r7j63J23J27l7J9j68m5J18J10k94L20l01L0L2J22k30
$$ 19 102 256 -98 132 57 59 124 27 -136 -13 114 77 96 -72 -117 1 111 -183 137 -164 -134 -102 20 -210
3695b10J82J16l0q1l0J66n8k3j38Q2mK3K06m58L97k19J08R1j62j98L56j41O1N4
$$ -210 -28 88 58 -23 -53 113 55 32 -106 -24 -28 -5 201 -257 140 -79 29 120 -42 -240 116 -25 36 90
3719I0P2jp2k74K27j16j43L71l5k72J0O4j20L09jN9k84qj6K8L6N6J51r3J37m1
$$ 90 162 161 89 -185 42 -74 -217 154 119 -153 -143 -79 -199 110 109 168 -116 -124 -140 -112 -76 -20 131 38 175 134
3745A34k46K14n0j3q5K35j33K6K32l25L9J53J6k04R7r1L8k55K40M8m8k33J67j35
$$ 134 -112 102 52 39 -46 189 56 82 314 -11 28 181 197 -7 90 -1 37 -218 22 70 22 -211 -44 -179
3769a79L24k41J11J88k55J34O4k8l65L35l49o4M59l00J37j31K12q4J47J02o46
$$ -179 145 -96 15 203 -52 82 146 118 -247 88 -261 -325 134 -166 -29 -160 52 -32 115 217 -429
3790d29K08J91M9p3J50J27l47O6L67l61n6J5Q5J1j2J80k77%L12l56J88J6P3j40
$$ -429 -221 -30 19 -54 96 223 -124 -58 309 -52 -108 -93 -8 3 -9 171 -106 -106 206 -150 38 54 127 -13
3814a3n5N3npRo7J27k25n0O7R3J76M1j46m9J30j81L48l8Pj24l98M20j71m6J60
$$ -13 -68 -15 -20 -27 -18 -85 42 -183 -233 -166 -73 103 144 -2 -51 79 -102 246 208 215 91 -307 113 -58 -104 56
3840E6r2K28j49l00K24qm1J04J43k06L08j68r1K28j78j40q6J53k5J29K4j81o3
$$ 56 -36 192 43 -257 -33 -41 -82 22 165 -41 267 99 8 236 58 -82 -168 -15 -40 89 113 -68 -131
3863a31J43J00k86J14pJ19J55k64K73k02j66J77j3J5o8O9q0J75k47J62k35N2J32
$$ -131 12 112 -174 -60 -67 52 207 -57 216 14 -152 25 12 27 -41 28 -52 123 -124 38 -197 -145 -13
3886a3j7J14J00k34J1K07k25K91k76K5j20M1J9J25q3o7O1k5Q8q2ok25M38l13M0
$$ -13 -30 84 184 -50 -39 168 -57 234 -42 -17 -137 -96 -77 48 -35 -102 -41 -66 22 -60 -66 -291 147 -166 -126
3911a26J60m0K36m39L30k08J10Q3j85J42r0J58k53P5K8O8l8%k63L9L47J7k33J70
$$ -126 34 -6 230 -209 121 -87 23 106 -79 63 -27 131 -122 -47 -19 49 11 11 -252 -213 134 151 -82 88
3935H8k47K72K5k66j06M51q6l13J30J62l5j94lJ56K6j70J85m1k43J70M7j80M51
$$ 88 -159 113 138 -128 -234 217 131 -182 -52 110 75 -119 -122 34 60 -110 75 34 -209 -39 8 -172 279
3958B79l21N7k19j3K4J39K46o2p6n28N00J50j27p5J20l08J23J18K7O0k43k7J2
$$ 279 -42 15 -204 -217 -193 -54 192 130 54 -474 26 176 49 -26 94 -214 -91 27 54 114 -129 -156 -144
3981a44J09J70N9j98k10M32l93L81k29j6r0K10j66o5Q7o1P5k4J26j09K9L4K60
$$ -144 -35 135 194 -4 -214 218 -175 206 -23 -39 -129 81 -85 -150 -63 -124 -49 -73 53 -56 -27 7 267
4004B67l85J21lk05J97l5j30R8J34J0Ok39R0j6j59N46J21k90k17L29j22P8l75
$$ 267 -118 3 0 -205 -8 -43 -173 -75 59 69 75 -164 -74 -90 -249 297 418 128 -89 240 118 196 -179
4027a79K61k9r1K52k41P7k60K61j00L9k08PJ75j49K31O7o9j97K1L58m8l29J79
$$ -179 82 53 -38 214 -27 50 -210 51 -49 -10 -218 -211 -36 -185 46 113 44 -153 -132 226 178 -151 28
4050B8n0j96M58j10m89M96J68l16k29K05K80n50K13j65jM84l0j70P3J65k31r1
$$ 28 -22 -218 240 130 -359 137 305 -11 -240 -35 245 -305 -92 -257 -258 226 196 26 99 264 33 -58
4072e8Q7J27o5k62j15K56J42r3L13k94Mk31M4R8J97J06q3k00j00j40L25J1k07
$$ -58 29 156 91 -171 -286 -30 112 19 332 38 42 -189 -145 -47 150 256 173 -27 -127 -267 58 69 -138
4095a38J56R1R2k50j84j40N54p3lj3n5J02k17j94L65l14J01J03j7j00M4M81n04
$$ -138 18 109 201 -49 -233 -373 181 108 105 92 37 139 -78 -272 93 -221 -120 -17 -34 -134 -90 391 -113
4118a13J44K03L7k56o1j33J12m1J5R9J23n5k94J94j61K28q1r4J11Q0k0j17j9Q3
$$ -113 31 234 271 15 -46 -179 -67 -108 -93 6 129 74 -220 -26 -187 41 -40 -134 -23 57 37 -80 -99 -16
4142a6J84M8j53p9l6k04J26L36j15K6J9N6j65R4j78O3j94J66K96j57j96j01K40
$$ -16 168 216 63 -16 -52 -256 -130 206 91 117 136 192 27 121 -57 6 -188 -22 274 117 -79 -180 60
4165F0j38P4QQ3Kj23p8J68j1p6K94k18J93j88k28j35L22K9r9K18k36m2p3M85k75
$$ 60 -78 -4 4 87 89 -34 -112 56 45 -31 263 45 238 50 -178 -313 9 38 -61 157 -79 -121 -194 291 16
4190A6J56J38j87J10l16K32N0q2j48q1J83j21K7Q0r0k03K65o8p2P9K56k89K61
$$ 16 172 310 123 233 -83 149 199 117 -31 -112 71 -50 -23 57 -33 -236 29 -39 -111 -32 224 -65 196
4213A96l07J81j04n8m0J74r4j3j62L34r1j67J20j74K54J01l52MM36m06J32j44
$$ 196 -111 70 -34 -92 -132 42 -52 -65 -227 107 16 -151 -31 -205 49 150 -202 -198 238 -168 -36 -180
4235a80M12k06q8L3P7O5j95O4J88k89J14j29J60n6Q0jj12l48M33l0L7J01k19J34
$$ -180 232 26 -62 -29 48 113 -82 -18 170 -119 -5 -134 26 -30 50 49 -63 -411 22 -8 29 130 -89 45
4259D5m7j03k7K1J34j5N9R5k59K4J17q3J33P5j29j07L7J7p0L2M4L21l84K36j21
$$ 45 -2 -105 -132 -111 23 8 67 162 -97 -73 44 -39 94 169 40 -67 -30 -13 -83 -51 -7 314 -70 166 45
4284D5lk40J17j17J29L29l51j19K02j4j99L15m0P0j62R3j28j4L41j8l22J82K82
$$ 45 42 -198 -81 -198 -69 260 -91 -210 -8 -22 -221 94 54 124 -38 55 -73 -87 254 236 -86 96 378
$$ [...]
8191c7
##END NTUPLES=NMR FID
##END=
