##TITLE=1H_SRR167_A
 CDCl3
 8 sc, 
 4.9.2023
##JCAMPDX= 6.0         $$ Bruker NMR JCAMP-DX V2.0
##DATA TYPE= NMR FID
##DATA CLASS= NTUPLES
##ORIGIN= UXNMR, Bruker Analytische Messtechnik GmbH
##OWNER= root
$$ XWIN-NMR		Version 3.5
$$ Mon Sep  4 14:31:53 2023 Russian Standard Time (UT+4h)  she@DPX200
##.OBSERVE FREQUENCY= 200.13135
##.OBSERVE NUCLEUS= ^1H
##.DELAY= (6, 6)
##.ACQUISITION MODE= SIMULTANEOUS
##.ACQUISITION SCHEME= undefined
##.AVERAGES= 8
##.DIGITISER RES= 18
##SPECTROMETER/DATA SYSTEM= spect
##.PULSE SEQUENCE= zg30
##.SOLVENT NAME= CDCl3
##.SHIFT REFERENCE= (INTERNAL, CDCl3, 0, 15.7039)
##AUDIT TRAIL= $$ (NUMBER, WHEN, WHO, WHERE, WHAT)
$$ ##TITLE= Audit trail, XWIN-NMR		Version 3.5
$$ ##JCAMPDX= 5.01
$$ ##ORIGIN= Bruker BioSpin GmbH
$$ ##OWNER= she
$$ F:/spectra/data/she/nmr/H-F/1/audita.txt
$$ ##AUDIT TRAIL=  $$ (NUMBER, WHEN, WHO, WHERE, WHAT)
(   1,<2023-09-04 14:30:51.95 +0400>,<she>,<DPX200>,
      <created by zg, POWCHK disabled, PULCHK disabled
       configuration hash MD5:
       00 E9 B6 7A A2 85 ED C7 34 08 36 98 17 FE 4E 26
       data hash MD5: 16K
       3A 51 93 5D A8 39 C3 F1 4D 18 2C D7 49 FA 54 42>)
$$ ##END=
$$ 
$$ hash MD5
$$ 33 CC 86 F6 ED 03 82 79 A2 9A 70 2E F7 79 0D 80
##$RELAX= 
##$RELAX= 
##$RELAX= 
##$RELAX= 
##$RELAX= 
##$RELAX= 
$$ Bruker specific parameters
$$ --------------------------
##$DU= <F:/spectra>
##$EXPNO= 1
##$NAME= <H-F>
##$PROCNO= 1
##$TYPE= <nmr>
##$USER= <she>
##$AMP= (0..31)
100 100 100 100 100 100 100 100 100 100 100 100 100 100 100 100 100 100 
100 100 100 100 100 100 100 100 100 100 100 100 100 100 
##$AQSEQ= 0
##$AQ_mod= 1
##$AUNM= <au_zg>
##$AUTOPOS= <>
##$BF1= 200.13
##$BF2= 200.13
##$BF3= 200.13
##$BF4= 200.13
##$BF5= 200.13
##$BF6= 200.13
##$BF7= 200.13
##$BF8= 200.13
##$BYTORDA= 1
##$CFDGTYP= 0
##$CFRGTYP= 5
##$CHEMSTR= <none>
##$CNST= (0..31)
1 1 145 1 1 1 1 1 1 1 1 1 1 1 1 1 1 1 1 1 1 1 1 1 1 1 1 1 1 1 1 1 
##$CPDPRG= <>
##$CPDPRG1= <>
##$CPDPRG2= <>
##$CPDPRG3= <>
##$CPDPRG4= <mlev>
##$CPDPRG5= <mlev>
##$CPDPRG6= <mlev>
##$CPDPRG7= <mlev>
##$CPDPRG8= <mlev>
##$CPDPRGB= <>
##$CPDPRGT= <>
##$D= (0..31)
0 1.2 0 0 0 0 0 0 0 0.06 0 0.03 0 0 0 0 0.0002 0 0 0 0 0 0 0 0 0 0 0 0 
0 0 0 
##$DATE= 1693823451
##$DBL= (0..7)
120 120 120 120 120 120 120 120 
##$DBP= (0..7)
150 150 150 150 150 150 150 150 
##$DBP07= 0
##$DBPNAM0= <>
##$DBPNAM1= <>
##$DBPNAM2= <>
##$DBPNAM3= <>
##$DBPNAM4= <>
##$DBPNAM5= <>
##$DBPNAM6= <>
##$DBPNAM7= <>
##$DBPOAL= (0..7)
0.5 0.5 0.5 0.5 0.5 0.5 0.5 0.5 
##$DBPOFFS= (0..7)
0 0 0 0 0 0 0 0 
##$DE= 6
##$DECBNUC= <off>
##$DECIM= 32
##$DECNUC= <off>
##$DECSTAT= 4
##$DIGMOD= 1
##$DIGTYP= 9
##$DL= (0..7)
0 120 120 120 120 120 120 120 
##$DP= (0..7)
150 150 150 150 150 150 150 150 
##$DP07= 0
##$DPNAME0= <>
##$DPNAME1= <>
##$DPNAME2= <>
##$DPNAME3= <>
##$DPNAME4= <>
##$DPNAME5= <>
##$DPNAME6= <>
##$DPNAME7= <>
##$DPOAL= (0..7)
0.5 0.5 0.5 0.5 0.5 0.5 0.5 0.5 
##$DPOFFS= (0..7)
0 0 0 0 0 0 0 0 
##$DQDMODE= 0
##$DR= 18
##$DS= 0
##$DSLIST= <SSSSSSSSSSSSSSS>
$$ [...]
##$SUBNAM2= <"">
##$SUBNAM3= <"">
##$SUBNAM4= <"">
##$SUBNAM5= <"">
##$SUBNAM6= <"">
##$SUBNAM7= <"">
##$SUBNAM8= <"">
##$SUBNAM9= <"">
##$SW= 18.05172834244
##$SWIBOX= (0..15)
0 0 2 0 0 0 0 0 0 0 0 0 0 0 0 0 
##$SW_h= 3612.71676300578
##$TD= 16384
##$TD0= 1
##$TE= 0
##$TE2= 300
##$TE3= 300
##$TEG= 300
##$TL= (0..7)
0 120 120 120 120 120 120 120 
##$TP= (0..7)
150 150 150 150 150 150 150 150 
##$TP07= 0
##$TPNAME0= <>
##$TPNAME1= <>
##$TPNAME2= <>
##$TPNAME3= <>
##$TPNAME4= <>
##$TPNAME5= <>
##$TPNAME6= <>
##$TPNAME7= <>
##$TPOAL= (0..7)
0.5 0.5 0.5 0.5 0.5 0.5 0.5 0.5 
##$TPOFFS= (0..7)
0 0 0 0 0 0 0 0 
##$TUNHIN= 0
##$TUNHOUT= 0
##$TUNXOUT= 0
##$USERA1= <user>
##$USERA2= <user>
##$USERA3= <user>
##$USERA4= <user>
##$USERA5= <user>
##$V9= 5
##$VALIST= <valist>
##$VCLIST= <CCCCCCCCCCCCCCC>
##$VD= 0
##$VDLIST= <DDDDDDDDDDDDDDD>
##$VPLIST= <PPPPPPPPPPPPPPP>
##$VTLIST= <TTTTTTTTTTTTTTT>
##$WBST= 1024
##$WBSW= 4
##$XGAIN= (0..3)
0 0 0 0 
##$XL= 0
##$YL= 0
##$YMAX_a= 62146
##$YMIN_a= -87993
##$ZGOPTNS= <>
##$ZL1= 120
##$ZL2= 120
##$ZL3= 120
##$ZL4= 120
##$ABSF1= 10
##$ABSF2= 0
##$ABSG= 5
##$ABSL= 3
##$ALPHA= 0
##$AQORDER= 0
##$ASSFAC= 0
##$ASSFACI= 0
##$ASSFACX= 0
##$ASSWID= 0
##$AUNMP= <proc_1d>
##$AZFE= 0.1
##$AZFW= 0.1
##$BCFW= 1
##$BC_mod= 2
##$BYTORDP= 1
##$COROFFS= 0
##$CY= 11.3945322036743
##$DATMOD= 1
##$DC= 2
##$DFILT= <>
##$DTYPP= 0
##$F1P= 15.7292609196834
##$F2P= 12.9074282941183
##$FCOR= 0.5
##$FTSIZE= 0
##$FT_mod= 4
##$GAMMA= 1
##$GB= 0.15
##$INTBC= 1
##$INTSCL= 1
##$ISEN= 128
##$LB= 0.24
##$LEV0= 0
##$LPBIN= 0
##$MAXI= 10000
##$MC2= 0
##$MEAN= 0
##$ME_mod= 0
##$MI= 1.114404
##$NCOEF= 0
##$NC_proc= 0
##$NLEV= 6
##$NOISF1= 3.799351
##$NOISF2= 2.8
##$NSP= 1
##$NTH_PI= 0
##$NZP= 0
##$OFFSET= 15.70392
##$PC= 1
##$PHC0= -21051.39
##$PHC1= 19.85272
##$PH_mod= 1
##$PKNL= yes
##$PPARMOD= 0
##$PSCAL= 0
##$PSIGN= 0
##$REVERSE= no
##$SF= 200.130013532006
##$SI= 16384
##$SIGF1= 3
##$SIGF2= 2
##$SINO= 400
##$SIOLD= 16384
##$SREGLST= <1H.CDCl3>
##$SSB= 0
##$STSI= 0
##$STSR= 0
##$SW_p= 3612.71676300578
##$SYMM= 0
##$S_DEV= 0
##$TDeff= 0
##$TDoff= 0
##$TI= <>
##$TILT= no
##$TM1= 0
##$TM2= 0
##$TOPLEV= 0
##$USERP1= <user>
##$USERP2= <user>
##$USERP3= <user>
##$USERP4= <user>
##$USERP5= <user>
##$WDW= 1
##$XDIM= 8192
##$YMAX_p= 0
##$YMIN_p= 0
$$ End of Bruker specific parameters
$$ ---------------------------------
##NTUPLES= NMR FID
##VAR_NAME=  TIME,          FID/REAL,        FID/IMAG
##SYMBOL=    X,             R,               I
##VAR_TYPE=  INDEPENDENT,   DEPENDENT,       DEPENDENT
##VAR_FORM=  AFFN,          ASDF,            ASDF
##VAR_DIM=   8192,          8192,            8192
##UNITS=     SECONDS,       ARBITRARY UNITS, ARBITRARY UNITS
##FACTOR=    0.0002768,     1,               1
##FIRST=     0,             0,               0
##LAST=      2.2672688,     0,               0
##MIN=       0,             -87993,          0
##MAX=       2.2672688,     62146,           0
$$ Real data points
##PAGE= N=1
##DATA TABLE= (X++(R..R)), XYDATA
$$ [...]
1797d77M47J33l45L20j10K48m63j25J93l74L05J69J91R9R5J35k89Q7M5k10oO5
1819A33k66L11K2k25O9M5Q4m47j22n3K6K89j64J32M12L9J40p3k63j92m0K31j3
1842G5J00j45P6r8J59k80L38l54j4j63k15K47J51J1k4K72L25j46j68J64l45J39
1864A05k59N6p9K39J2J22J30o8J9k65m20p4k00J61L44lJ87k63K39m5L41k56J9
1887D2q3N4ok7O29l67J50K87k83k33k61j17k39Q0N0K09j80L40N4k13j94K44l67
1910d31m9M33l99J79L59n7R8N20p9m7k33N0l29RJ22m9J27j05j94j13L75k20m95
1933e28L4K95k99j8N22q1n4N31l08k34M56mo76L53K12L0k52L48pj97L26k96k68
1956a15m1j44k19M0L89k46N08Kj52k01K82m15k20M48Q5m21N29K3J27k98N02k00
$$ plain form
1797 -477 -30 103 -242 78 -32 216 -247 -372 -179 -553 -248 -79 112 211 306 441 152 239 284 74 68 133
1819 133 -133 178 200 -25 44 89 173 -274 -396 -449 -423 -134 -298 -166 246 285 425 352 89 -103 -143 88 75
1842 75 175 30 106 8 167 -113 225 -129 -143 -306 -521 -274 -123 -112 -136 136 461 315 147 311 -34 105
1864 105 -154 -98 -177 62 74 196 326 258 277 12 -408 -482 -682 -521 -177 -180 7 -256 -17 -62 279 23 42
1887 42 -41 13 7 -20 609 242 392 679 396 163 -98 -215 -454 -374 -324 -115 -295 45 99 -114 -308 -64 -431
1910 -431 -480 -47 -446 -267 92 35 133 653 574 527 294 344 15 24 146 97 224 119 -75 -188 187 -33 -528
1933 -528 -494 -199 -498 -516 6 -75 -129 402 94 -140 316 312 -364 -11 201 231 -21 327 320 123 449 153 -115
1956 -115 -156 -300 -519 -479 -90 -336 172 174 22 -179 103 -312 -532 -84 1 -420 109 132 259 -39 463 263
1978B63j98l5K29q85N76J46m32K23M02j05m61L06j29l16M76N3m24J99M25k62J18
1999A69M48k12m29L45l37j24q2J22LJ20L66j84j52L31l01j78J97k47k41M59k3
2020E0j63J39P87p19r7M11j36m57J74J67m82N47On20J14N58m48q8K30l21n4Q5
2042b17K14l88L23M49m26Q8M51m43l57O91j53l40r0M53j97JK91m95l19M18j60
2063b06m93M12K43k99L29J28m70M01K6k92j81N35p9m67O61K37o41M42L41m20p9
2084A28J87l83k10M51k97l73O60l24j29l3L43l37K62L66n41j49M59J28k78K21
2104A51N46p05L90J5m88o3M44k87j58L06J75p12K26J86k75k3M12o37j20O51m2
2125hl30L47J77k41J31M31p88L55O1j80k60N98r3k83M95k30m01l2M24k89J91j7
$$ plain form
1978 263 65 30 259 -626 -50 96 -336 -113 289 184 -277 29 -100 -416 60 113 -311 -112 313 51 169
1999 169 617 405 -24 321 -16 -140 -222 -100 -97 23 389 205 53 384 83 -95 102 -145 -386 73 50
2020 50 -113 26 813 94 -3 408 272 -185 -11 156 -326 221 227 -293 -179 379 -69 -157 73 -248 -302 -217
2042 -217 -3 -391 -68 381 -45 43 494 51 -306 385 232 -108 -198 255 58 59 350 -145 -464 -46 -206
2063 -206 -699 -287 -44 -343 -14 114 -356 45 71 -221 -402 133 54 -413 248 485 -156 286 627 207 128
2084 128 315 -68 -278 173 -124 -497 163 -161 -290 -323 20 -317 -55 311 -230 -379 80 208 -70 151
2104 151 697 -8 382 397 -91 -154 290 3 -155 151 326 -386 -160 26 -249 -272 140 -497 -617 34 -8
2125 -8 -338 9 186 -55 76 507 -281 74 135 -45 -305 293 200 -83 412 182 -219 -251 173 -116 75 58
2147E8l80J89L91j19k61M49j0k79M6j82M6j72L01m11L97K88k02k57J28n7j41j50
2169c28K83j43k6L19R4k09j4N32o70J13M04n35J49L36k47j60L43k8l03K52J21
2190B83m36J3L88o74L50K69m39l8M20o6j94J88l26J18L7L52l75o0N95o1j82J06
2212B68M5k75K18M2l79M4J60l0j51J97j05k16J42M7m45K80J90l04J14M08k34j04
2234h8L68k64J8j49J30J60j40L55n29Q5K96J9l24J32J37m41k2O4j3PQ4j85J50
2257a50J55M6k27M94k41l82M22l24P4n6N05j39j81K28J27l33q1rj54K02j40J05
2279e9J02K19l52J8J93j32N1P8j46l00P2L03J24J30Qj64j65Q2p4j04R7J33l77
2302b63J77K56L1jQ3o29L6K60k13J87K05k13K46j20J99k45O3Pl7p7j89K85j74
$$ plain form
2147 58 -322 -133 258 139 -122 327 317 38 84 -98 -52 -224 77 -334 63 351 149 -108 20 -37 -178 -328
2169 -328 -45 -188 -214 105 199 -10 -24 508 -162 -49 355 -180 -31 305 58 -102 241 213 -90 162 283
2190 283 -153 -140 248 -426 -76 193 -246 -284 136 70 -124 64 -262 -144 -107 245 -130 -190 405 344 162 268
2212 268 313 38 256 298 -81 -37 123 93 -58 139 34 -182 -40 7 -438 -158 32 -272 -158 250 16 -88
2234 -88 280 16 34 -115 15 175 35 390 -139 -54 242 261 -63 69 206 -235 -257 -193 -206 -199 -115 -300 -150
2257 -150 5 51 -176 318 77 -305 117 -207 -133 -189 316 177 -4 224 351 18 -63 -72 -226 -24 -164 -59
2279 -59 43 262 -90 -72 121 -11 40 118 -28 -328 -256 47 171 301 309 145 -20 62 -12 -116 -19 114 -263
2302 -263 -86 170 201 200 283 -346 -310 -50 -263 -76 129 -84 162 42 241 -4 59 66 29 -48 -237 48 -126
2325a26R8MJ3J47j43m9l45J88K86k47M14l03n5M09o7l66K24J10J10l30K07lJ06
2348B82j55lJ02k42L36j71j01j27k30J87j37j15L88j7j75P0J30K37l54J87j05
2369a3K05m72L50L2j1L42k69j74k6J75k81k8j47K2O27l88k11M84l97J48l3qR9
2392B6j40K7j51K56K21k10L55j48j54j3O9j07J92l14M7L0K34j73j37l8K29l26
2414b25J81R0j40j66R6K60j78J49M7k43J75k00M4J90k92P9J61K01Rk77j26N7J20
2437A2j0k43J11K0k73M79j21J31j47J40j65J68j91p0L23j42L8j69K06j38N5R5
2459A09O8l10k2K99j71j31J71p1J02N2l08l5K97j16J9p6P2K1N2l6J46j1J69m96
2483b06l9P9J1J56K84k88r8j25Q8Q6J65l7k03J57r8K52k06o5J24j0K50r7r2J61
$$ plain form
2325 -126 -28 -24 -11 136 -7 -56 -401 -213 73 -174 240 -63 -118 291 224 -142 82 192 302 -28 179 176 282
2348 282 127 124 226 -16 320 149 48 -79 -309 -122 -259 -374 14 -3 -178 -108 22 259 -95 92 -13
2369 -13 192 -280 70 102 91 433 164 -10 -36 139 -142 -170 -317 -295 332 -56 -267 217 -180 -32 -65 -73 26
2392 26 -114 -87 -238 18 239 29 384 236 82 69 138 31 223 -91 -44 -14 220 47 -90 -128 101 -225
2414 -225 -44 46 -94 -260 -164 96 -82 67 114 -129 46 -154 -110 80 -212 -133 28 229 238 -39 -165 -108 12
2437 12 2 -241 -130 -110 -383 96 -25 106 -41 99 -66 102 -89 -159 164 22 60 -109 97 -41 14 109
2459 109 177 -133 -155 144 -27 -158 13 -58 44 96 -212 -247 50 -66 -47 -123 -51 -30 22 -14 132 121 290 -206
2483 -206 -245 -166 -155 1 285 -3 -101 -226 -138 -52 113 76 -127 30 -68 184 -22 -87 37 27 277 180 88 249
2507B49l81k7K09J43n2m3j90J67j80R5kj41J2J4j97J44J85R4N9l8R2k83K09k9
2531A09J2mQ7j53M1k45L47j08N2j61o2q0J6k9q4K38k10L8K10K8m7K06k44J07q2
2556a8J10j13k03L19L8l7o5K30l41Q5o9%M5L1j58k25M19Q5k78O9K12k51j19L93
2580A59j42J9r3J50m8k1J02Oj12J28k49l37N34J16l99L78j02R4j71J79j68P1j68
2603g4J83k43K63K55n09J06J37l41J96Rj73J63K28j93q1J94j44J08l27K94k70
2624b19K95j59K1l73M33Ll8n8O6j09M17j57m37O2M12q6j27L16q7j13Q3L4l20o
2648a47J99k55O5j65L42J31j95O0k35M78j22j23JK18l66K35J66n4l93M22l9l54
2670a31M66m00p4k06J60j70K10k2J53j74K70o9j62K47J23l93K87j57m5m0M84k63
$$ plain form
2507 249 -132 -159 50 193 141 98 -92 75 -105 -10 -12 -153 -141 -127 -324 -180 5 99 158 120 212 -71 138 109
2531 109 121 117 204 51 92 -153 194 86 138 -23 -85 -165 -149 -178 -262 -24 -234 -196 14 42 -5 201 -43 64 -18
2556 -18 92 -21 -224 95 133 96 31 261 -80 5 -64 -64 -19 12 -146 -371 48 133 -145 -76 136 -115 -234 159
2580 159 17 36 -57 93 45 24 126 132 20 148 -101 -438 96 212 -187 191 89 183 12 191 23 94 -74
2603 -74 109 -134 129 384 -125 -19 118 -223 -27 -18 -191 -28 200 7 -74 120 -24 84 -243 51 -219
2624 -219 76 -83 -62 -435 -2 1 -37 -95 -29 -138 279 122 -315 -253 159 73 -54 262 175 62 145 179 -141 -147
2648 -147 52 -203 -138 -303 39 170 -25 35 -200 278 156 33 34 252 -114 121 287 233 -160 262 223 -131
2670 -131 335 -65 -139 -345 -185 -355 -145 -167 -14 -188 82 13 -149 98 221 -172 115 -42 -87 -127 357 94
2692I4j55P4k05M7J57L25m21O4O8m8qJ28q2k89K99J06l79L84j47k64M29k64N1
2715c6K77J09k54j10k15L67k21j42L79L2j26NK8l7r4K53k59Q2L1j62nJ05n6n9
2739a08J95p0Q1K42m21lR1N2K15j90K1l32JK03L2k19P0M0k0O2MJ56o4n5m7j39
2765b03J12j10p4K22jJ15m5J5J50k06J80Nn00K42L3j38K63l11K76m1J37J34l55
2788a00J18J23k04J9J75j54q0k4K79k33L01o1l62L11j34K08j2J4l77L0J40o2k51
2811c36M11k02J30ok79K13J19k5j74J26J62q5N2j19L61m97L27j94J3K26k98J34
2833E9k82K16m21L43K42l28N7J53lj9R4N3k74Q3L9q7J91m5nj86K62k53l5K04J20
2858A78j17RK17k55q5K23j85m4l5o1m9K06Nk7Q1j99K10j87J64k00K72k11K91k22
$$ plain form
2692 94 -61 13 -192 -145 12 337 -84 -20 48 0 -8 120 38 -251 48 154 -225 159 12 -252 177 -87 -36
2715 -36 241 350 96 -14 -229 138 -83 -225 154 186 60 65 93 56 -38 215 -44 38 69 -93 -98 7 -49 -108
2739 -108 87 17 98 340 -81 -84 7 59 274 84 105 -227 -226 -23 9 -210 -140 -100 -120 -58 -54 102 38 -17 -64 -203
2765 -203 -91 -201 -275 -53 -54 61 16 31 181 -25 155 160 -340 -98 -65 -203 60 -251 25 -16 121 255 -100
2788 -100 18 141 -63 -44 131 -23 -103 -127 152 -81 220 159 -203 108 -26 182 170 184 -193 -163 -23 -85 -336
2811 -336 75 -127 3 -3 -282 -69 50 25 -149 -23 139 54 106 -13 348 -149 178 -16 -3 223 -75 59
2833 59 -223 -7 -428 -85 157 -171 -114 39 36 17 111 164 -110 -27 12 -75 116 71 66 -120 142 -111 -146 58 178
2858 178 61 70 287 32 -53 170 -15 -59 -94 -155 -204 2 7 -20 61 -138 72 -115 49 -151 121 -90 201 -21
2882b1J6j73P2m8J58OJ35l53L07k23L41k53j72L58J70n26J37k13K65q5M3L25j06
2905A60k24L5%r4J04R0J58k00J18r5j77n1K79l35K43k1J20l67M07k46R9K24j66
2928F1j80J00q2K2J13N2j19K07m35K61K15l93l6K65j00rn1j5M9J22L0j28N4J35
2952A38j75K30k63Q9N5j4j17j67K55j44J72k05J48j52Q8l18N26j01j42M23l44
2973a8J38r5j67K18%Jj22k9K7N1j2j76K70p4j94L51j77R6j31K1J20k61N16l09
2997D4j63L6K70J2m33K19N5Q6j43Rm7N2Oj09J11K01m53K72l5l1L5J4Qr8K35j64
3023a1j80K4j61M76j72J65k84J43q7J12j41O8j1P6j15J11j22J20P9K16l77J45
3045G4K34o82K87L40l02n6j10N47l18q6k6j89J05J35n3L0K34j80o2oL11n39M24
$$ plain form
2882 -21 -5 -178 -106 -154 4 10 145 -208 99 -124 217 -36 -208 150 320 -206 -69 -282 -17 -102 -59 266 160
2905 160 -64 -29 -29 -123 -19 71 229 29 147 52 -125 -176 103 -232 11 -10 110 -257 150 -96 3 227 61
2928 61 -119 -19 -101 -79 34 86 -33 174 -261 0 215 -178 -214 51 -49 -58 -109 -124 -75 47 77 -51 3 138
2952 138 -37 193 -70 19 74 60 -57 -224 31 -113 59 -146 2 -150 -62 -380 146 45 -97 326 -18
2973 -18 120 25 -142 76 76 77 -45 -74 -47 4 -8 -184 86 12 -182 169 -8 88 -43 -22 98 -163 353 44
2997 44 -119 -83 187 199 -234 -15 40 126 -17 -8 -55 -3 3 -106 5 206 -247 25 -10 -41 -6 8 16 -82 153 -11
3023 -11 -191 -167 -328 148 -24 141 -143 0 -87 25 -116 -48 -59 17 -98 13 -109 11 90 306 -71 74
3045 74 308 -374 -87 253 -49 -105 -215 332 14 -72 -98 -287 -182 -47 -100 -70 164 -16 -78 -84 227 -312 112
3068A12j00O2k2k42q7K9M47k82M7j36L48l33K41J61k78QK38j43l06K48K51j67
3090I6Q6j13j49j22n0M05l91L59k64P1L02k50k04J06J9N5qPJ57jJ31l16r2J96
3114C0P8k83L29k07j00J40L44k78q3J87j18p1j8j26O3L35n3J3m41M55m24P0k9
3137a87J32j61L04l8k04J14K07r4M0O3p2j22J52Q8k94j03R9J79k1J90m20P9K16
3160A47l6p5k38J38L4J13o3r5J01j30K69k21J69L10n57J34L39m12O9J19L7j43
3182IJ13k03K5J24k3l80K69J40j06JL27n87L62O8l7K1j10k14M52k36Q1M1k73P73
3206F37m76j38Q2K52m74J80k25J17L4K21k42J69J59k10K9m09K58K66l23K3q3L0
3228a23J59N6l4m2K25l67J74Q6mj20L4R4k12K15j57L3J12k60PJ68M07l55j07l5
$$ plain form
3068 112 12 74 52 -190 -277 -248 199 -83 -36 -172 176 -157 84 245 -33 -25 213 70 -236 12 263 96
3090 96 182 69 -80 -202 -252 153 -238 121 -143 -72 230 -20 -224 -118 -99 -44 -52 -45 112 111 242 -74 -166 30
3114 30 108 -175 154 -53 -153 -13 331 53 -30 157 39 -32 -50 -176 -113 222 169 182 -259 196 -228 -158 -187
3137 -187 -55 -216 88 50 -154 -40 167 73 113 176 104 -18 134 222 -72 -175 -76 103 82 272 -148 -69 147
3160 147 111 36 -202 -64 -30 83 20 -75 26 -104 165 -56 113 423 -134 0 339 -73 -4 115 152 9
3182 9 122 -81 -56 68 45 -335 -66 74 -32 -31 296 -291 71 139 102 123 13 -201 251 15 96 137 -136 637
3206 637 161 23 105 357 -117 63 -162 -45 -11 210 -32 137 296 86 115 -294 -36 230 -93 -70 -153 -123
3228 -123 36 92 58 16 241 -126 48 134 130 10 44 138 -74 141 -16 17 129 -131 -124 44 451 96 -11 -46
3252d6K72k12l9J25j45L25k27j52K04n1J7k6k59j60L41L6L12k14j44R8k14J91
3274C2k6q2R9p6k44J20N0j0P7L27j16k56J25r9l6L37j49Nj59M9J98n9j35L3J04
3299A09j51O5q6j6n3LJ1J57P8j05l5p0l1J52j47J75J65l53K22j78J1J90r2J18
3323A39j98j16K65K15k73m5J4j10l4K0J64j02O6J19k04L56l98Q5l29M13m28L72
3345ik23L04PL8J6k45K04M2j90J46k13J15j56J59M3k87O9qK37n8M2j15M2K8j5
3370b7P5j35n3L29j74j13Q4J16r9J44m2J57j94k5P7j04l32K20L62l89N8Ql9l1
3394a27R8O7j86M6P9j26J9K7N6Q6o7q9o6K62K9j28J5k1j40L63k29Lk50L80j7J2
3420I6k25J61J83p5j02j00J47Rp2r6Q7J54j25J32l56K02q6J80l2oJ5j81l6P3J70
$$ plain form
3252 -46 226 14 -25 100 -45 280 53 -99 105 54 71 45 -214 -374 -33 3 315 101 -43 55 -159 32
3274 32 6 -76 23 -53 -297 -177 -127 -137 -60 267 151 -105 20 -79 -115 222 73 78 -81 -32 166 107 -28 5 109
3299 109 -42 23 -63 -79 -132 -129 -118 39 117 12 -23 -93 -124 28 -119 56 221 -132 90 -88 -77 113 21 139
3323 139 -59 -175 90 305 32 -13 1 -109 -143 -123 41 -61 5 124 -80 276 -122 -37 -366 47 -381 -9
3345 -9 -232 72 79 117 133 -112 92 134 -56 90 -123 -8 -164 -5 38 -249 -180 -188 49 -9 33 -82 -40 -12 -27
3370 -27 48 -87 -140 189 15 -98 -14 102 3 147 105 262 68 43 120 16 -316 -96 266 -123 -65 -57 -96 -127
3394 -127 -29 38 -148 -102 -23 -149 -130 -103 -47 39 -28 -117 -183 79 108 -20 -5 -26 -166 197 -32 -29 -279 101 84 96
3420 96 -129 32 215 140 38 -62 85 94 22 -74 13 167 42 174 -182 20 -66 114 82 76 91 -90 -126 -53 117
3445A17J54O7j54m05J38n2n9R7q8K23j46J50k14K67j07M7j7j17Q8K0N3q8j11K09
3469G2k5j10P8j66Q5m5J60j79K32j74Q7j52R3L68k89k98M97j95o9J64l74K81J05
3492A46n7M7M0r5L0j52J70k94J42K0J63m28M71j85J19k7j38K84m86L03j51k29
3514c07L40J19k21N6o7L04Rk61n0K40M2k62J09k06p3J99J11j58j47L75q4j37K27
3537A58q2j86P4k05K99Q3p2n6P3l07L57l52L40j54M0M4j98J4J91j81R1j55J01
3560h3P3K0l2J84Q5k91K96l42K04k27l7K76k9j70K23k20L5J38q2r7L1j84N7K92
3584A20k46K61l49NJ53J54j48J57m03K97J54J00k59LJ74j14m7J6P4K5k20j61L37
3607H3j31J69n4k5p7p8p9L29j14q1O4m9j89K42k9J29m03L50L4p6l01L45J10j31
$$ plain form
3445 117 271 338 184 -221 -83 -135 -194 -97 -185 38 -108 42 -172 95 -12 35 18 -99 -11 9 62 -26 -137 72
3469 72 47 -63 15 -151 -66 -111 49 -130 102 -72 15 -137 -44 324 35 -263 234 39 -30 134 -240 41 146
3492 146 89 136 176 81 111 -41 129 -165 -23 -3 160 -268 203 18 137 110 -28 256 -230 73 -78 -307
3514 -307 33 152 -69 -13 -80 224 233 -28 -78 162 204 -58 51 -155 -228 -29 82 -76 -223 152 68 -69 158
3537 158 76 -110 -36 -241 58 141 69 13 86 -221 136 -216 124 -30 10 54 -144 -130 61 -120 -29 -184 -83
3560 -83 -10 10 -22 162 247 -44 252 -90 114 -113 -150 126 97 -73 150 -70 -35 103 21 -76 -45 -229 -172 120
3584 120 -126 135 -214 -209 -56 98 -50 107 -296 1 155 255 -4 -1 173 59 12 28 102 127 -93 -254 83
3607 83 -48 121 67 42 -35 -113 -192 137 23 -58 6 -43 -232 10 -19 110 -293 57 91 15 -286 59 169 38
3631C8O9o6m5k42K03J95j01M6K20j98l92M19k9l11J71q0p1J83r7n3J77k90K94
3654D0O6k48L72l40K73p5jm2l81K50MJ95j20lmJ15j69Q7j56K07k5m32M33l4M2
3679E4L4P4J8J3j67k13lM1K10q7K7l7pJ93N5j71J16m9J04n03J73M1J77l77J50
3704a34O2N2r3M47n47J30R7Qq2K9N1j30N0L09j75p1N1j97Q1R4j1O8l10L03j03
3729b1K33l20K24j37R3j1j86k7L48O1k33L6k18r2K1J99J50j35n4K8L1q7M21k21
3753A03k46L16k57K43P2k36K02k05LJ24j57J06n0J29j75m2QO6l5j65J90Lr6J4
3777h5m0oK02j18J7m9J55j61J77O0j11l5O8L3k15L06j07k46L5K03j92K67l27k2
3801a91P1j6K75p5n7j10K12l40J76j04K70l00K43j41J58k73J72J72m53J86J54
$$ plain form
3631 38 107 41 -4 -246 -43 152 51 97 317 119 -273 146 117 -194 -23 -103 -174 9 -88 -141 36 -254 40
3654 40 106 -142 230 -110 163 88 87 45 -336 -86 -82 113 -7 -10 -14 101 -68 19 -137 70 45 -387 46 12 54
3679 54 88 162 180 193 26 -187 -190 -149 61 -26 1 -36 -43 150 205 34 150 101 205 -298 -125 -84 93 -284 -134
3704 -134 -72 -20 -113 334 -213 -83 14 22 -60 -31 20 -110 -60 249 74 3 54 -143 -62 32 21 89 -221 82 -21
3729 -21 212 -108 116 -21 72 61 -125 -152 196 257 24 60 -158 -250 -229 -30 120 -15 -69 -41 -10 -97 324 103
3753 103 -143 173 -84 159 231 -5 197 -8 -5 119 -38 68 18 147 -28 -70 -62 4 -31 -196 -6 -3 -99 -85
3777 -85 -125 -131 71 -47 -30 -79 76 -85 92 152 41 6 74 107 -108 198 91 -155 -120 83 -109 158 -169 -191
3801 -191 -120 -136 139 64 7 -103 109 -231 -55 -159 111 -189 54 -87 71 -202 -30 142 -311 -125 29
3822B9k40K99J88k10j60K23j72Q3j08J29L3j15n2J26l0J1K33k21KJj58P6l5r8
3846a66J81n5P8j45m3J29J14j3m54K57J58l5N0J50Jr2Q4j36Q1k33K16j42m6J00
3870C9J03R0l39q7L5l0L17J76r1j11M9j96J1J85m30M49l10K72p6K4M7l60L32K34
3894C33k80j21J18O4j71Q5j48J74l4J05j65q3J69K57m04J21m9n8O0J19k65K32
3916E9k0m0j00L11k89m4K0j4J53K02l04L5Jn7J45N2l18P5K79pk37J38O7j9p8j83
3942a73N0J46j67l4K06j71J18m1O0l09K11K4J62k53J09J80k42j77J82R2k4R1k69
3965b29J51L04m36L10m5L4n7j1L9k21J5K08j04L69j96k30JM0J69j30J89k32J31
3988F9j15L41l89K59j01k76J95j7J35j06J49k30K81r6o3Lrk35J95J0j00j1J58
$$ plain form
3822 29 -211 88 276 66 -94 129 -43 40 -68 61 94 -21 -73 53 23 34 267 46 48 49 -109 -33 -68 -166
3846 -166 15 -40 38 -107 -150 -21 93 80 -374 -117 41 6 56 206 207 115 199 63 144 -89 127 -15 -61 39
3870 39 142 232 -107 -194 -159 -189 128 304 213 102 151 -45 -34 151 -279 170 -140 132 56 80 127 -233 99 333
3894 333 53 -68 50 114 -57 28 -120 54 20 125 -40 -123 46 303 -101 20 -29 -87 -27 92 -173 59
3916 59 39 -1 -101 210 -79 -123 -103 -117 36 238 -66 -31 -30 -87 58 110 -208 -133 146 139 -98 40 107 88 10 -173
3942 -173 -123 23 -144 -178 28 -143 -25 -66 -6 -315 -104 -80 82 -171 -62 118 -124 -301 -119 -27 -51 40 -229
3965 -229 -78 226 -210 100 55 89 32 21 60 -161 -146 62 -42 327 131 -99 -98 -58 111 -19 170 -62 69
3988 69 -46 295 -94 165 64 -212 -17 -34 101 -5 144 -86 195 99 36 39 30 -205 -10 0 -100 -111 47
4011D7J30J20m11J65p7J7q8J38J42k42J97k00j38J58N3R8j40J6J83k00J07j91
4033a16J17J3j01p6N4J87j27l62K70J84o1j75o7K92JK6N3k52J51L9j73NJ27k6
4057a7M9k49K16K3l97N22J10k65J35k69j26K32o6K44l11J14J76o6l9o1OK87l08
4080f0K46j71k1j02J71J14Kl62M4r2L12l07J40q4J2J84j77Q3J27J24k65m1J65
4103D2j72K76n7j15O7j03M6L7n7M7n0J07J10j09q3J2j9M0K3k61J84J82k36J59
4127G0p5j7l1J00k45L7L7K28r7k58L72j93J29M8m9n0M5k1RQJ70k69J97k50R0Q5
4153G0P2l31L1o1L01j48k2J67Mm5K40k29j0k02K83j55o9J06Ql9J90j29j08L0M1
4178eM8L1k35K7kM9r1L50M8j95k19M35O4k86J94j68L0j83K39N8k9m1r7l7K46L2
$$ plain form
4011 47 177 297 -114 51 -26 -9 -97 41 183 -59 138 -62 -200 -42 11 109 -31 -15 168 -32 75 -116
4033 -116 1 14 -87 -163 -109 78 -49 -411 -141 43 -18 -193 -260 32 33 59 112 -140 11 50 -123 -118 9 -17
4057 -17 32 -217 -1 22 -375 147 257 -8 127 -142 -268 -36 -102 142 -169 -55 121 55 16 -45 -39 248 -60
4080 -60 186 15 -6 -108 63 177 179 -183 -139 -231 81 -226 -86 -170 -158 26 -151 -68 59 183 -82 -123 42
4103 42 -130 146 89 -26 41 -62 -16 21 -36 11 -39 68 178 69 -14 -2 -21 19 42 -219 -35 147 -89 70
4127 70 -5 -22 -53 47 -198 -161 -124 104 7 -251 121 -72 57 105 56 6 51 30 39 47 217 -52 145 -105 -15 70
4153 70 142 -189 -158 -219 82 -66 -88 79 83 38 278 49 39 -163 120 -35 -104 2 10 -29 161 32 -76 -46 -5
4178 -5 43 74 -161 -134 -136 -87 -178 172 220 25 -194 241 305 19 213 45 75 -108 131 189 160 119 22 -15 231 263
4204B63j63j87jK73j00o2r6K67l12P4k23J15L64l52J30N4k3k2J69j5j73N9l60
4227c21L09J23k09J75m7j14O3J56l67L18j92J2j81K80j35K15J21j26J15p3k35
4248a13L9K4J74l28K75J7n5M9r9o8MJ11O8j55m8l0J34jJ44j76J36j58j67o7L29
4273C9j15K81Ml23j38L78q1j10qJ25R7j04p1o6j8j31J81j55L35j1j03m3K55j93
4297B5l7o8N0j90J36K07j85J1Q5k9L07m32M1N3K2K98l29K5q3m0Q8N7J66j18j90
4322a30o8K71k41J52K23j33r3J53q4Q1k34R5J14j50J43m9J21l01K40n9J37j04
4344H4l38L77o1j59J07kJ06q1L7O7l2j15j02K33m11O0P3L63l05K66p7k65j9K08
4368A4K88k72j45J9J44p4L12o06M56k13n6K21k12j3J08m4L92o12M85N7k65O8j65
$$ plain form
4204 263 100 -87 -88 185 85 23 -73 194 -118 -44 -267 -152 212 -140 -10 44 21 -1 168 153 -20 39 -321
4227 -321 -12 111 -98 77 30 -84 -21 135 -232 86 -106 -94 -275 5 -130 85 206 80 195 122 -113
4248 -113 -74 -50 124 -204 71 88 33 82 -17 -85 -81 30 98 -57 -105 -135 -1 -2 142 -34 102 -56 -223 -290 39
4273 39 -76 205 209 -114 -252 126 45 -65 -73 52 149 45 -26 -92 -110 -241 -60 -215 120 109 6 -37 218 25
4297 25 -12 -80 -30 -220 -84 123 -62 -51 34 5 312 -120 -79 -26 -4 294 -35 -10 -93 -133 -45 12 178 60 -130
4322 -130 -198 73 -168 -16 207 74 -19 134 50 131 -103 -8 106 -44 99 50 171 -130 110 51 188 84
4344 84 -254 123 62 -97 10 8 114 33 70 137 105 -10 -112 121 -290 -230 -157 206 -99 167 90 -175 -194 14
4368 14 302 30 -115 -96 48 -26 286 -320 136 -77 -133 88 -124 -137 -29 -73 319 -293 192 249 -16 52 -113
4391a13K37k09J23rj01J22r8j5J53j51o5J95jL0k00J3j36J13J74m1K62k96P9j76
4415a10MM3J30j90K27k43J11J3K03k75J25mpQ7j83K02j56N7m1r2O7r5J4K39nl97
4441b76O8J02R4J86l59J70q4j15L78j85J16k35j88K11o2K00j44J09K03k94L61
4462B56k76m3J22j39J54qJ43k05K52k13j22N17m63k38J84m6K07j41R2K7J37j90
4484GM2Q3n1K15j19l48J7K33j10oO4o9M5R5j49K07j72J06lO7k1k63l5K10P7j50
4510b8j10J9R1m1O0j49K64j17j89O7Q4J67k85k1K16J58k21J8J23o0j83M90m39
4533h6P2p2o9L69j36J74l05p6L48k96O7J96m0k49K97l26K10j91J74j20o4K36j53
4556d0r0k8J85j62K56j98q0l2K45k26J11j09K87J25l91o4K44j06Q4j13m9k9L37
$$ plain form
4391 -113 124 -85 38 29 -72 50 -48 -63 90 -61 -126 69 68 98 -102 -89 -225 -112 62 21 283 -13 66 -110
4415 -110 -106 -63 67 -123 104 -139 -28 -15 188 -87 38 34 27 114 -69 133 -23 34 -7 -99 -32 -127 -113 126 121 -276
4441 -276 -208 -106 -12 174 -185 -15 -99 -214 164 -21 95 -140 -328 -117 -179 21 -123 -14 189 -105 256
4462 256 -20 -63 59 -80 74 66 209 4 256 43 -79 438 -25 -263 -79 -125 82 -59 33 60 197 7
4484 7 49 132 81 296 177 -171 -154 79 -31 -37 27 -42 3 98 -51 156 -16 90 87 154 133 -130 -165 45 122 -28
4510 -28 -138 -119 -28 -69 -9 -158 106 -11 -200 -133 -49 118 -167 -188 28 186 -35 -17 106 46 -137 353 -86
4533 -86 -14 -86 -155 214 78 252 -53 -129 219 -77 -10 186 146 -103 194 -132 78 -113 61 -59 -123 113 -40
4556 -40 -130 -158 27 -135 121 -77 -157 -189 56 -170 -59 -168 119 244 -147 -211 33 -73 11 -102 -151 -180 157
4579A57j61o4k0J84j26j75K64o5O8O6l3%k74qJ25L7O4k03J52J48jo0j31J8k8m5
4605a11o4K2R5K34k39J79k95J36K68k35J71j02p8R0k58M6L26j95J25k53J80m0
4627Bl9lR8K6k50J15J38k55J90n3j50Q9J04r5n0L08qo9n1m4R5j86Q7J20M4j89
4653b6r5J71N1J2n3j73K44j18k30M07j54kj5J03j34j69K96j11r2O9k8O3j03JJ81
4678I5L4j06J90l98J97K62n46K08k9L41k79J69k08J78j71L50j99j28J42j86J56
4699G2j02J51k21K21j05J09j88J04Pr0p0K60J07J63m39j52K79j02r1K54k06N4
4721A5J5K1Oj48J31n9j10L06l11J95k71L07L3k30J73k86M27n2j09j88J66j01J15
4744D5n8K25N4l74L4L2m0PK79k96J20K26k11K11k53J15k59J39M8k44j2l7J14K06
$$ plain form
4579 157 -4 -68 -88 96 -30 -205 59 -6 62 128 95 95 -179 -187 -62 -25 39 -164 -12 136 135 75 -56 -38 -66 -111
4605 -111 -175 -153 -58 176 -63 116 -179 -43 225 -10 161 59 -19 71 -187 -141 185 -10 115 -138 42 2
4627 2 -37 -40 58 84 -166 -51 87 -168 22 -31 -181 -92 12 -83 -133 175 167 98 47 3 98 -88 -1 119 163 -26
4653 -26 -121 50 101 113 60 -113 131 13 -217 190 36 34 19 122 -12 -181 115 4 -88 -19 -47 16 -87 -86 95
4678 95 129 23 213 -185 12 274 -272 -64 -93 248 -31 138 -70 108 -63 287 88 -40 102 -84 72
4699 72 -30 121 -100 121 16 125 -63 41 48 -42 -112 148 255 418 -21 -173 106 4 -87 167 -39 15
4721 15 30 51 57 -91 40 -19 -129 177 -134 61 -210 97 130 -100 73 -213 214 162 53 -135 31 -70 45
4744 45 -13 212 266 -108 -74 -42 -82 -75 204 -92 28 254 43 254 1 116 -143 -4 44 -200 -212 -249 -135 71
4768G1m7O1J2PM9j06J11j35Mj29K2K61j82q6Q4J32o2j63K61k90J54J52k29M7J00
4793I9j40K34k88N8J57Q1m37M5K69nj60R6K1j08K44k38K97k34j4Q8j34K33j05
4816E9j1j8J35k08L0r6J31j81j27J39J17J46k11MJ74J42m18M92l93K31j90L5L
4839a5M8k52L55n6j6j95K9J65k4J6j96J01J94l49K95J63k61R6l2J61l68K64k07
4862h4L18l37P3K08l27J32o3pQ7Q6q8qj65L36j90j3N1pj11K57n1J46j92r1J11
4887G1k19R9L4J0k9NJ1j38K3J78k24J18J30J02p7m10L47J22O9k20J11NM8l24L25
4912A67k91R0q5K91l14K80P3k29J70r9j82O1l2rK25o9j03k03Q2M27k35j21P4m6
4936g8K29j91j07K13k17J65j38J15m8p0L95m52J59P5j59R1m6j62R2K01j89M1o
$$ plain form
4768 71 24 85 97 104 153 47 158 23 27 -102 -80 181 -1 -87 -3 129 67 -96 165 -125 29 181 -48 -1 99
4793 99 -41 193 -95 -37 120 201 -236 -191 78 73 -87 9 30 -78 166 -72 225 -9 -23 65 -69 164 59
4816 59 48 30 165 -43 -13 -109 22 -159 -286 -147 -30 116 -95 -91 83 225 -193 299 -94 137 -53 -18 -15
4839 -15 33 -219 136 80 64 -131 -102 63 39 55 -141 -40 154 -195 100 263 2 98 66 227 -141 123 -84
4862 -84 234 -103 -30 178 -149 -17 -80 -87 0 86 -2 -10 -175 161 -29 -42 9 2 -109 148 97 243 51 -40 71
4887 71 -148 -49 -15 -5 -34 -29 -18 -156 -133 45 -179 -61 69 171 94 -316 31 153 222 2 113 118 166 -158 167
4912 167 -124 -34 -119 172 -142 138 211 -18 152 53 -129 -68 -100 -109 116 47 -56 -259 -177 250 15 -106 -32 -78
4936 -78 151 -40 -147 66 -151 14 -124 -9 -57 -127 268 -184 -25 50 -109 -18 -64 -226 -134 67 -122 -81 -87
4959h7J40n2j3R0K7N0O9j44kO1j78P3N9l19L21j75K5j38K69J44k26K07j30j75
4983a04j72K85j81pL10j03j16J79k9j81K17k4O0j8l74K91K4j40J76R4j91O4l9
5006B1j18j06J95j17L27l56P7K6j03K2j99L59L48m72Q8j85J16K40k35k9J34Q7
5028A20j29j49M4L73k13K0p1o8o9M86o52J75L02o6j35M5j12R7O7J83k05kq2QJ5
5053a8j12m1j3O9J45n0N1L0O7r2j00J82j00j92J44K8m9J36o9J70j70j85K6O8p7
5078a52J01K42k80l3k5j17L32J42j89k64K90l87K32L7K04j14M5l9j0K73l16K24
5100A96k37j32K14J10J95l97K61l1k86Q5L9j17q3J84J47j13L4j05J26j44L32k55
5122B3k0J24k20J00k79M76k96J72P5k47Q9k43M31j56Pn5M6j48p7L84l69P4j22
$$ plain form
4959 -87 53 1 -12 78 105 155 224 80 78 139 -39 34 93 -226 95 -80 -55 -193 76 220 -6 201 71 -104
4983 -104 -276 9 -172 -179 131 28 -88 91 62 -119 98 74 134 116 -258 33 57 -83 93 187 -4 60 21
5006 21 -97 -203 -8 -125 202 -154 -77 -51 -154 -132 -331 28 376 -96 -8 -193 -77 163 -72 -101 33 120
5028 120 -9 -158 -114 259 46 66 -5 -73 -142 344 -308 -133 169 103 -32 13 -99 -2 65 248 43 41 -41 -33 -18
5053 -18 -130 -171 -184 -115 30 -20 31 61 128 36 -64 118 18 -174 -30 -2 -51 85 16 186 16 -169 -143 -75 -152
5078 -152 -51 191 -89 -122 -147 -264 68 210 21 -243 47 -340 -108 -71 133 19 64 25 15 288 -28 196
5100 196 -41 -173 41 151 346 -51 210 179 -107 -22 17 -100 -183 1 148 35 69 -36 90 -54 278 23
5122 23 3 127 -93 7 -272 204 -92 80 155 -92 -3 -246 185 29 36 -19 27 -121 -198 186 -183 -109 -231
5145b31K46jl0M9J6m0k59M2J76N9j02K56M7m53J92J3K41m91M1L09OQ2j25L1n0
5170B4o5J77k71l8L05j29n8K01m10K94oj32J72j07J06JP6k04l6J20k44K02J02
5193H0k44M03l59P9k46J74m8K57j5n4O7J19l88L23j50k43M94k51K48l70L27n13
5215c10K93J41nj70l3J83l05O2L67j96L8p7N6j7O4lJ24p5j62o1Q1K05r0j33J53
5240A30k13R4J97k20p2K79k06J5m3J22j71J05j68J94j34j4j93M88j40p4K2k7J18
5263H9j87P4J09j67J61m9j0j2q1J59j69N0j1O3j08K26n6Nj35r6N3N8M1l16K25
5288h4K60l21J53N8J23j81N9Q8l13R4M6J27m7K30k43M0k61K74k74K58k66K89j06
5311CK72l15K67m58J12K43j58M5r1rO4J00j79K11j97q6K54Q0k04P6k9P4j78m2
$$ plain form
5145 -231 15 14 -16 33 49 9 -250 -208 -32 27 -75 181 228 -225 -33 -20 221 -270 -229 80 86 168 43 74 24
5170 24 -41 136 -135 -173 132 3 -55 146 -264 30 24 -108 64 -43 63 64 140 -64 -100 20 -224 -22 80
5193 80 -164 239 -120 -41 -287 -113 -161 96 81 27 94 213 -175 148 -2 -245 249 -2 246 -124 203 -310
5215 -310 -17 124 119 -51 -84 99 -206 -144 223 27 65 -12 44 27 91 88 212 137 -25 -86 -5 200 110 -23 130
5240 130 -83 11 208 -12 -84 195 -11 4 -39 83 -88 17 -151 43 -91 -105 -298 190 50 -24 -2 -29 89
5263 89 -98 -24 85 -82 79 30 20 8 -73 86 -83 -33 -44 19 -89 137 81 86 -49 -145 -92 -34 7 -309 -84
5288 -84 176 -145 8 66 189 8 67 155 -158 -64 -18 109 62 292 49 89 -172 102 -172 86 -180 109 3
5311 3 275 -40 227 -231 -119 124 -34 11 -80 -89 -25 75 -104 107 -90 -176 78 158 -46 30 1 75 -103 -145
5335a45L92l0k73J41L5N1k15J29j49M0K0j54J72p3J08k48K88R8l0j99n6P3qm9
5359h2R4r2j8J66j56J60r0L9J77k89K39O6j87J17j63m9Q2j33k18J38j9L49l21
5382a90J47P4m9p1O0K3l1K9J05O0j97q9K88k6J3j45L7j00J31J64k36Lq8J32M1
5407H5j03Q0l55M96l20J34L8m20K59k4K56k23K39k70r7L39k08J35O3q2J1j50Q5
5430c2L3M0j40L83k55J94j53k91K70j52K11k09Kn9L5m5J11j46K73n0K03j71o7
5453a5J33R4k57j49L3Q1Mk1J22j03j2j82L45K01m22J44N5Q6j16o3J78j82J18j21
5477d9J28n2l1j36M35l32J39j84J10j26p3K20k40R0O2j10K9K80m34K19p5J9J75
5500F4K15k12j75L50j04j80R8r2r2J89M1R7j25L2r8j83R7M2j07L39j94L7o6K31
$$ plain form
5335 -145 247 217 -56 85 120 171 -44 85 -64 -24 -4 -158 14 -59 49 -199 89 187 157 -42 -98 -25 -33 -82
5359 -82 12 -80 -98 68 -88 72 -18 21 198 -91 148 214 27 144 -19 -68 14 -119 -337 -199 -218 131 -190
5382 -190 -43 31 -18 -89 -29 -6 -37 -8 97 157 -40 -129 159 133 146 1 38 -62 69 233 -3 0 -88 44 85
5407 85 -18 62 -293 203 -117 17 55 -365 -106 -130 126 -97 142 -128 -225 114 -94 41 104 22 33 -117 -32
5430 -32 1 41 -99 284 29 223 70 -221 49 -103 108 -101 -99 -158 -123 -168 -57 -203 70 20 223 52 -15
5453 -15 118 212 -45 -194 -161 -80 -76 -97 25 -78 -90 -272 73 274 -148 -4 51 137 21 -42 136 -46 72 -49
5477 -49 79 27 -4 -140 295 -37 102 -82 28 -98 -171 49 -191 -101 -39 -149 -120 160 -274 -55 -130 -111 64
5500 64 279 67 -108 242 138 -42 56 -36 -128 61 102 199 74 106 8 -175 -78 -36 -143 196 2 39 -27 204
5524B04l42J14l4K61k80K55k09P8J00k49J45RJ37k79J20J98j62q1r2J01P0p6j1
5547b3O9J05j08m3R9j50Oj41J67q4J19J73k42N9j5O5l0o2J39J5j75K53j08m1k
5572D5J7P6j48M1J48o3o2k69%J15n4K80l41K16J07j79J74m3j56j51K97j10k3k26
5596c09K84j07m1K22l35K99K6J31R5l89N7J82q7j01K20k97J34J63m01L02p0K1
5618ak17K49k37O8K86J81m01l01M14n9o0q9J74k07J88jr2Q6N6Rp5O3j71l8K09
5643C4OL1J23k07l0J40q9k1N8O5k88J7K70k37J26n3p5m4P0K9J04q0J01k55J85
5668b0R2R8j54j56K97j76l18L51J07j19K16k51K01Rj23k09M0kj3K58m39K40l1
5691a02oJ82q9J91o9j88Nj37L67k17J58n7J0o1J76l6j49K5K95l18J2O5J09k62
$$ plain form
5524 204 -138 -24 -58 203 -77 178 -31 47 147 -102 43 52 189 -90 30 228 66 -15 -107 -6 64 -12 -23
5547 -23 46 151 43 0 99 -51 -45 -186 -19 -103 16 189 -53 6 -9 56 26 -36 103 118 -57 196 88 47 45
5572 45 62 138 -10 31 179 116 54 -215 -215 -100 -154 126 -215 1 108 -71 103 60 -96 -247 50 -60 -83 -309
5596 -309 -25 -132 -173 49 -286 13 39 170 265 -124 -67 115 28 -73 147 -150 -16 147 -254 48 -22 -1
5618 -1 -218 31 -206 -138 148 329 -72 -373 41 -18 -78 -167 7 -200 -12 -13 -105 -19 37 46 -29 34 -137 -175 34
5643 34 40 71 194 -13 -43 97 8 -13 45 110 -178 -161 109 -128 -2 -55 -130 -174 -104 -75 29 -51 50 -205 -20
5668 -20 72 170 16 -140 157 -19 -337 14 121 2 218 -33 168 177 54 -155 -115 -117 -130 128 -311 -71 -102
5691 -102 -108 74 -15 176 107 -81 -76 -213 154 -63 95 38 48 -13 163 127 -22 3 298 -20 -8 57 166 -96
5715i6k1J61j31N48n69K23l49M00m82K28J96j23j1j28K79r3r7J37J64l86J15o2
5737i7M7m9j6P1jK15o0J00l32L75j29j70j27o4K52q6j0Q2n3o8K13Ln1M7m09N33
5763B16q1p6m9l0J5j79o9L29j00p3K53k05J68K6j19J23n0J42l16k31L21j3l39
5786c37K55j20J83J55l72K02j2J85n2q6N5k18K46j33K39k20J23l5j36K94k04J18
5808A30k63J48j8l03p2L46O7Po6j93o3K79q7M95l44l05K65Mm8L8K9O9n9j73K64
5833A47k89o9K48o8j82L96j51O4k76r4N17ql22K36k64l5M11k07j29J54n9k53J66
5856f7o1K19P9k55J67j0p9k09K34l2J93j53J18j81K02J02k01q4j17K46r3n4L13
5879B77m01J66J6l59K06K40k23J55j62j77L16l7%P2q9J36j87J82j14j71J30j86
$$ plain form
5715 -96 -117 44 -87 461 -108 115 -234 166 -316 -88 108 -15 -26 -154 125 32 -65 72 236 -150 -35 -97
5737 -97 -50 -99 -115 -44 -45 170 110 210 -122 253 124 -46 -173 -237 15 -71 -81 1 -52 -120 93 96 45 92 -317 216
5763 216 135 59 10 -20 -5 -184 -253 76 -24 -97 156 -49 119 145 26 149 99 241 -75 -306 15 2 -337
5786 -337 -82 -202 -19 136 -236 -34 -46 139 87 1 56 -162 84 -49 190 -30 93 58 -78 216 12 130
5808 130 -133 15 -3 -306 -378 -32 35 42 -24 -217 -280 -1 -88 407 63 -242 23 27 -21 17 46 115 56 -117 147
5833 147 -142 -211 37 -31 -213 183 32 96 -180 -274 243 235 -87 149 -115 -150 261 54 -75 79 20 -233 -67
5856 -67 -128 91 170 -85 82 72 -7 -216 18 -14 179 26 144 -37 165 267 66 -18 -135 111 18 -36 277
5879 277 -124 42 58 -301 -95 145 -78 77 -85 -262 54 17 17 89 0 136 -51 131 17 -154 -24 -210
5901b10R1K72m30K85Pr9o4K44j27j59K45l59L75j2k08J18K20l43J49o1k1o6L12
5924A59k44j81K40J59j56J0K4P3k53K86K7k47M2j0J52j26J16j66jJ59j04J63M9
5947A71k19M4j75P8Q9K44k68k38M31l42jK19m2N9l0M4o7k2J12l1j25J58J10r9
5971A00j06j21J34j0Q7m2J00q5l4J78j99L18j60o5K7k79J97j01J30j22L9J32J20
5994B38o9k04l3J73j68K23j77n5J94J8j68r2K44j75j57K76J48k61J39o8k61K08
6016b7N3Lk9k84K49m5o1K86j55k33J93K44j63J27k75n1P7q7J47M0N8N3j89K04
6040A35N9p4m60K34P3n5J48k76J82k4q8K54J8k7K30n09K4O0j62O1J34M2L8J27
6064A44l30R5J59J6j27j24j33K78N1J05k8N6m4j32j82M0K5L42j71K14j89k93R8
$$ plain form
5901 -210 -119 153 -277 8 15 -84 -148 96 -31 -190 55 -304 71 59 -149 -31 189 -154 -5 -66 -87 -153 159
5924 159 -85 -266 -26 133 -23 -13 11 84 -169 117 144 -103 -61 -71 81 -45 71 -95 -96 63 -41 122 171
5947 171 -48 -4 -179 -101 -12 232 -36 -274 157 -185 -186 33 -9 50 20 64 -3 -25 87 56 -69 89 199 100
5971 100 -6 -127 7 -3 84 42 142 57 23 201 2 320 160 95 122 -157 40 -61 69 -53 -14 118 238
5994 238 169 -35 -68 105 -63 160 -17 -72 122 140 -28 -120 124 -51 -208 68 216 -45 94 26 -235 -27
6016 -27 26 29 0 -284 -35 -80 -141 145 -10 -243 -50 194 31 158 -117 -168 -91 -178 -31 9 67 120 -69 135
6040 135 194 120 -340 -106 -33 -88 60 -216 -34 -58 -146 108 126 99 329 -180 -156 -96 -258 -197 -63 -21 17 144
6064 144 -186 -91 68 84 -43 -167 -300 -22 29 134 106 162 118 -14 -196 -156 -131 211 40 254 65 -228 -130
6087a30M9K8jO5k56J97r8K17l7k12P8K51j40J66k74JJ11j46J27K06l06J67Rk83
6111b11rJ52k2j31L89J83m01K26k20q1J78j96M67l62L0j29o7j0O6qK59Q7k40Q
6135d2J19K1r2r3J8%O3j45J12K43k72q4M6L4K36j68m2O9J58l98J71K99l24K50
6159A79j76K18j53K21n6k67k6j70K68K89l54n5j77K55L8J15q7k89K60k10K04j1
6181A6o8j07R5p0j53L66j39M6j68K39m1r9j15J34p4Q1J67k92J4J60l1J98j15J13
6205A57j41r7J8K33J51m07J87L4r6P1k85M70k30K2j30j05K35m1Q7J46k78k03K55
6228E3k87PK18j63K47P9m88J16K31M6j05J07qp2J69N0q6knJ09j7j68Q4J04l40
6253a21J26K04N6j89k15L15j87K1mn7R2K3p2m7J56j06Oj53K40qk16K14j69P2J0
$$ plain form
6087 -130 -81 -53 -54 11 -245 -48 -146 71 34 -178 -100 151 11 177 -97 -96 15 -131 -4 202 -104 63 72 -211
6111 -211 -220 -68 -90 -221 168 351 -50 176 -44 -125 53 -143 324 -38 -8 -137 -204 -214 -148 -156 103 190 -50 -42
6135 -42 77 98 6 -87 -69 -69 -6 -151 -39 204 -68 -152 -106 -72 164 -4 -46 23 181 -217 -46 253 -71 179
6159 179 3 221 68 289 233 -34 -60 -230 38 327 -27 -82 -259 -4 34 149 62 -227 33 -177 27 16
6181 16 -52 -159 -64 -134 -287 79 -60 -14 -182 57 16 -83 -198 -64 -138 -57 110 -182 -168 -8 -39 159 44 157
6205 157 16 -81 -63 170 321 -86 101 135 39 110 -175 295 65 87 -43 -148 87 46 133 279 1 -202 53
6228 53 -234 -227 -9 -172 75 154 -334 -218 13 59 -46 61 53 -19 150 200 114 112 107 216 199 31 115 219 -121
6253 -121 5 209 265 76 -139 176 -11 10 6 -51 41 64 -8 -55 101 -5 1 -152 88 80 -136 78 -91 -19 -9
6278il30L70j39R3q1j2L1K85k97P0j22Q3Q4K9p7m7LP7j18J31J69k50K18k63Q5
6303a7l5K57k96J55m4o6j69J73P2l9K54l62p8K25q7lj1jL59j77j10Q6j93J58j20
6328f9%M1NN2J7K41n38K92j32K22r3p3R5o2M8m8%K16j30j5K38j34M5l02J53n9
6354A0P3j71j17J82r8J7J85j49P7m5q1j73M45j55j88K49L79n49K27P8j7j20K1
6377H0j95R1K5p7q3L38P0m58K59k18L2J2K57L2n0j56q2J2K18k38K45o0l8M9n8
6402Gj30J01J30j56j11O7J07o5qM9n3P7k6K68j34k41M1N5k14J51K44j77J73k49
6426i4j82K75Q2j40j55L01o6k41M52l16j0L7N6N7k71K40J42r8J7j60K00j02J0
6449C4q3K60j55j57o4o8K65N5p0J76j8k77j8J91j59N3pR3o5L6k9j8M3J5q8P3J21
$$ plain form
6278 -9 -339 31 -108 -15 -96 -108 -77 208 -89 -19 -141 -58 26 55 -22 -69 -66 11 -107 24 193 -57 161 -102 -17
6303 -17 -52 205 -91 64 20 -46 -215 -42 30 -9 245 -117 -195 30 -57 -60 -71 -72 287 110 0 86 -107 51 -69
6328 -69 -69 -28 -23 29 46 287 -251 41 -91 131 38 -35 60 -2 46 -2 -2 214 84 69 307 173 218 -84 69 10
6354 10 83 -88 -205 -23 -121 -104 81 -68 9 -36 -117 -290 155 0 -188 61 440 -109 118 196 179 59 80
6377 80 -115 -24 1 -76 -159 179 249 -209 50 -168 -136 -124 133 165 115 -41 -123 -111 107 -131 114 54 16 65 7
6402 7 -123 -22 108 -48 -159 -92 15 -50 -58 -9 -62 15 -11 257 123 -118 -77 -22 -236 -85 159 -18 155 -94
6426 -94 -276 -1 81 -59 -214 87 21 -220 232 -84 -94 -57 -1 56 -215 25 167 69 86 -74 126 24 34
6449 34 -49 211 56 -101 -165 -233 32 87 17 193 175 -102 -120 71 -88 -35 -42 51 -14 22 -7 -25 18 33 -55 18 139
6476A39l11O4j8L7J15N0q2j47J22PK62l22Q9j72L39m61K15l2J91j03O8P5j26r2
6500i3J08r1K30M4r8J5k3j37K39j87j7r7K35K4m9k32K3O2k68J13l9M13pk46J99
6525A21k53j9O3o2L34m73J28q1L32l2k43O8O5O7N9J41k94M0K25l06J63l9n7J78
6549A25k58J62o3J1l1p9P7n1j51L03nn1j2k6L32n5m58K11j31j2R1J28p5j7k3J28
6575G0k64L70K8n9N7q9R4j72Q4j66K33j17q5K9q5r0L45m07M28k86j29J58K74k43
6599b2Q2j76j2J01j04K00n9J42k06r0N7R8j50O4m9n2P7L0J1J27p5k2j47J94L7
6624E6n3n5K70l20kO8MJ90l45K68J41l24L9J0j40M00k25l3j73N61k67J53j63j42
6648h2O6K01k11J6Q1J27j55j96K99r6j12l34M96k23K93m27K06O8R4R4k73om1J77
$$ plain form
6476 139 -172 -108 -126 -89 26 76 -6 -153 -31 -24 238 -84 5 -167 172 -289 -74 -106 85 -18 50 125 -1 -93
6500 -93 15 -76 154 198 100 115 92 -45 194 7 -10 -107 128 152 103 -129 -106 -44 -312 -199 -238 175 168 -78 121
6525 121 -132 -151 -88 -150 184 -289 -161 -242 90 58 -185 -117 -52 15 74 215 -79 -39 186 -120 43 4 -53 125
6549 125 -133 29 -34 -23 -54 -133 -56 -107 -258 45 40 -11 -23 -49 283 228 -230 -19 -150 -162 -71 57 -18 -35 -58 70
6575 70 -194 176 204 145 202 113 207 35 119 -47 186 69 -16 13 -72 -162 183 -224 204 -82 -211 -53 221 -22
6599 -22 60 -116 -128 -27 -131 69 10 152 -54 -144 -87 11 -139 -75 -124 -176 -99 -69 -58 69 -6 -28 -175 19 56
6624 56 3 -52 218 -102 -104 -36 -32 158 -187 81 222 -102 -63 -53 -193 207 -18 -51 -224 337 70 223 60 -82
6648 -82 -16 185 -26 -10 71 198 43 -153 146 50 -62 -396 100 -123 170 -257 -51 17 111 205 -68 -74 -115 62
6672F2p0j03K50m0j%k0k33L20j15J53j99L0J1lLj73L22J24l88kM5N5nP1k26N5
6699g7L30j71J56l55M1p6J82Q0k42J32J45m03J68J58P8j09J23k85K92k14k14K11
6721e0j56J31J93j20J87k42Q6m4k1R1k01K13P3j90m5J86k18K14L4j76pJ92k65
6744a35K81q5k73L11Q9k76J13j07J47L31l93k54K35RM0j24J09j22L80l55k61N46
6766B06l15M3j1o9R6J67J8j14k0K9L24k53P4k29J06J36k94K56j24j38Km2l3K96
6790A11j13j81L0K31k7L7O7j41R9j12j89L08L3o4k78N2M69l92L41k40m2j87J22
6813f6j37R4m4K65k71J86j1j80O6J7m0L10q9j35K55k77J18j45J51p5j28K96k99
6836a39J09l9n0J47Q8N1j96J0K27j77J6p7q1K13r9R4j05j05J29J4j44J32p1Q3
$$ plain form
6672 62 -8 -111 139 99 98 98 78 -155 165 50 203 4 34 45 42 45 -128 194 318 -70 -72 -27 28 23 94 -132 -77
6699 -77 253 82 238 -117 -76 -152 30 110 -132 0 145 -258 -90 68 146 37 160 -125 167 -47 -261 -50
6721 -50 -206 -75 118 -2 185 -57 29 -15 -36 55 -146 67 140 -50 -95 91 -127 87 121 -55 -62 130 -135
6744 -135 146 61 -212 99 188 -88 25 -82 65 396 3 -251 -16 -7 33 -91 18 -104 276 -79 -340 206
6766 206 -109 -66 -77 -146 -50 117 135 21 1 30 354 101 175 -54 52 188 -106 150 26 -112 -110 -152 -185 111
6790 111 -2 -183 -153 78 51 88 155 14 113 1 -188 120 153 89 -189 -137 332 -60 281 41 -1 -188 -66
6813 -66 -203 -109 -153 112 -159 27 16 -164 -98 -81 -121 189 100 -35 220 -57 61 -84 67 -8 -136 160 -139
6836 -139 -30 -69 -119 28 116 167 -29 -19 208 31 47 -30 -111 102 3 97 -8 -113 16 30 -114 18 -53 30
6860C0p2Rrn1P1J93j92K63k02k50m0J58J13j22J48J07k42J10J23l69L23l38J33
6883a06J1K35j46j48K74j70O3o9K14r8o9J13R0k15J11K3k71L30O5l11J29j44r6
6906a85oK82p5p6K10l55N02k69J66o07L53O7l1j63K18Q7q1N%J07k78Q8k36L42
6930F5J20N3k41L7o0J06NJ2q8N1k57J68K31m49L39k3j63J3j65K39q6r2R9N7J10
6955H1k20%Q8O2K2j31J06J0j22J9N1j19j0K11j4K5Pj58O0N3P8j85N5Q7nQ7k95
6982a57K22l21N26j06j57J38j25j56kK50O0o2k8Pq2J23k80n8K90L0L0j91q9K33
7006I5j82J14j78R4r6K00j17n0K05J2J6P4j95L4m1K48l26l4l6K49M6Q4l58R6J44
7031I8m40M76lj60j43M2N2j03J42J71j51J37J65n19O52l98n7K08l6l28P7Q9L6
$$ plain form
6860 30 -42 -33 -42 -93 -22 171 -21 242 40 -210 -250 -92 21 -101 47 154 -88 22 145 -224 99 -239 -106
6883 -106 -95 140 -6 -154 120 -50 13 -56 158 60 -9 104 194 -21 90 113 -158 172 237 -74 55 -89 -185
6906 -185 -191 91 16 -60 150 -205 297 28 194 -413 -60 7 -24 -187 31 118 37 42 42 149 -129 -41 -277 65
6930 65 185 238 -3 34 -26 80 85 97 9 60 -197 -29 202 -247 92 69 -94 -81 -246 -7 -93 -185 -86 -29 81
6955 81 -139 -139 -51 11 33 -98 8 18 -104 -85 -34 -153 -163 48 34 59 66 -92 -32 21 99 -86 -31 56 51 138 -157
6982 -157 65 -256 270 164 7 145 20 -136 -138 112 172 110 82 89 7 130 -150 -208 82 112 142 -49 -138 95
7006 95 -87 27 -151 -57 -153 47 -70 -120 85 97 113 187 -8 26 -15 233 -93 -127 -163 86 132 216 -142 -46 98
7031 98 -342 134 131 -29 -172 -130 -78 -181 -39 132 -19 118 283 -236 416 18 -39 169 133 -195 -118 -29 7
7054GK65m41J7m4K79r1Q0j85J86p1J62j42j60O3n4k1k3J39K92m91K04k21M44j38
7078E6J53j15k51J66o4K11j44r1l0K55m26K81N2l26L23j60J71j09Q8J85n6k30
7100f1Q9q5K7j80K07R8j15p6J06j49R0n0J06q8K58l03J0L08k98q2J81J52k16N0
7124b1j07M7k69M34q2j6j63K74q1j95J17O1M6j0J2Nj17K32J50k43l42M12j17k00
7148a73N9J65l1Rq6jM13m46J33P0k12J14p6J17j49J43k55K98j5K21j84j83j5L4
7172e0k5j10K61j25J88j62l1o2N9J42j08o7P6l5k5J28q9J96l58L23j5ok65J14
7196d6J71r4K26j88l04K78J41l32N8M3K3k76L91J8j87r9K01K49j23k45J79j08
7218b4Q4j6lj83K02k9j07J02P3l40J90l4nJ98j90O9N9j41L27l48Q1J97k80j15
$$ plain form
7054 7 272 -169 -152 -196 83 -8 72 -113 73 2 164 22 -138 -75 -129 -150 -173 -34 258 -233 -29 -250 194 56
7078 56 209 94 -157 9 -55 156 12 -79 -109 146 -280 1 53 -273 50 -110 61 -48 40 225 169 -61
7100 -61 28 -57 -30 -210 -3 95 -20 -96 10 -139 -49 -99 7 -81 177 -126 -116 192 -106 -188 -7 145 -71 -21
7124 -21 -128 -81 -350 84 2 -14 -177 97 16 -179 -62 -1 45 35 47 52 -65 167 317 74 -268 144 27 -173
7148 -173 -114 51 20 29 -57 -58 355 -91 42 112 -100 14 -62 55 -94 49 -206 92 77 298 114 -69 -84 -50
7172 -50 -75 -185 76 -49 139 -23 -54 -116 -57 85 -23 -90 -14 -49 -74 54 -35 161 -197 126 111 105 -160 -46
7196 -46 125 31 257 69 -235 43 184 -148 -90 -47 -24 -300 91 109 -78 -177 24 273 150 -95 84 -24
7218 -24 60 44 41 -142 60 31 -76 26 99 -241 -51 -85 -90 108 -82 -13 46 -95 232 -116 -35 162 -118 -233
7242b33L22r9O1k5k32M62j74k15j5J96R4J5j7m02J49N7P2J6K16Lk06o4kp2r3J10
7268g6N1p6K50j79j73K63k3j02J31n2J39k03M2J0j33K94k19J59o1K4j66QQ4k25
7292b33L35R0q7l14J85L8k7k13J45R6j72o2J78j13n5L06j86J17N5J74l65N6j3
7315f5k81M39k1q7j28J27J02k66K14J73k58M0J00n2l41N18K6m91K74N4pl75L76
7338G1j56K9o1l5K71J24o5j83j75j1K43k27L27k47j18K24m0J70nk66K55k11M7
7361c9J69k04N5nj24O9Q4j20O2k8j08K84M2l46J67P7N2k08J69n7Q4j6PQ3k56M8
7387e9J54p6j00J6M6J43O7l52L00k15j83L46r6o6K06k31J38j37J86j89p2L05M
7410A35J82l56J84m07R2J02N1J96k29K04k67J29m3L52m35J30j07L08p9j26j5K7
$$ plain form
7242 -233 89 -10 51 26 -206 256 82 -133 -148 48 142 157 140 -262 -113 -56 16 32 248 251 45 -19 -21 -93 -186 -76
7268 -76 -25 -101 149 -30 -203 60 37 -65 66 14 153 -50 -8 2 -131 163 -56 103 42 66 -100 -92 -8 -233
7292 -233 102 192 105 -209 -24 14 -13 -226 -81 15 -157 -219 -41 -154 -209 97 -89 28 83 257 -108 -52 -65
7315 -65 -346 93 72 -15 -143 -16 86 -180 34 207 -51 -11 89 37 -304 214 240 -251 23 77 70 -305 71
7338 71 -85 -56 -117 -152 119 243 178 -5 -180 -191 52 -175 152 -95 -213 11 -29 141 136 -130 125 -86 -39
7361 -39 130 -74 -19 -24 -148 -79 5 -115 -53 -81 -189 95 137 -209 -42 35 87 -121 48 -9 75 59 66 149 -107 -59
7387 -59 95 19 -81 -65 -19 124 191 -161 139 -76 -259 87 -9 -75 131 -100 38 -99 87 -102 -174 131 135
7410 135 317 -39 145 -262 -170 -68 -17 179 -50 154 -113 16 -27 325 -110 20 -87 221 142 16 1 28
7432B8k32K93j10K3J78j65l5J45j46%K1k74J60J37j97L25j47N0J25n8M8j51j65
7455a47K43k74l3P6N3J14J1J1k7r0n0K13J63k39k31J68J94j59m03M08kK3j59n3
7479a90K47j30J33J13k01K8lK55k82%J01k45L36k66J50J15k32R0p0J13J5l0j26
7502g9L30j07j36k0n7L38k77P2k08J57k2N7j03J02j02p5J72K70l59J60k08j38
7524b33K80Qn6J49q3k64J38L20j77j54m4K14m7r3j20J07j2J31q9J29Pp2J3j35
7548h3QJ45q0l6kN6J31k18mk4N0n1j6K3N4K74J1l44L2J98r8L0K45j87j43j72K65
7575F4r3J20j08q5M33l95NJ54n3j65k6J03J58k27j0R7K3N5k07P4j59J47j51K85
7599C9l43L08O8l1p5R3j78O0q8J21q1J71q7R0l8Q2j37P7L15m55K48k91J89N1j15
$$ plain form
7432 28 -204 89 -21 2 180 15 -20 125 -21 -21 0 -274 -114 23 -174 151 4 54 179 121 169 18 -147
7455 -147 96 -178 -211 -135 -82 32 43 54 27 -63 -113 100 263 24 -207 -39 155 -4 -407 1 -1 22 -137 -190
7479 -190 57 -73 60 173 -28 0 -3 252 -30 -30 71 -174 162 -104 46 161 -71 19 -51 62 77 47 -79
7502 -79 251 144 8 -12 -69 269 -8 64 -144 13 -9 48 -55 47 -55 -130 42 312 -47 113 -95 -233
7524 -233 47 55 -1 148 65 -199 -61 259 82 -72 -116 98 51 -42 -162 -55 -67 64 -25 104 111 39 52 -83
7548 -83 -75 70 -10 -46 -48 8 139 -79 -83 -107 -57 -108 -124 -101 -47 227 238 -106 -74 124 26 56 301 114 -29 -201 64
7575 64 -29 91 -17 -102 331 -64 -59 95 42 -123 -149 -46 112 -115 -125 -28 -5 50 -157 -83 -242 -95 -246 39
7599 39 -304 4 72 41 -34 59 -119 -59 -147 -26 -107 64 -23 67 29 111 -26 51 366 -89 159 -132 57 108 -7
7624gm0n3J42J10j43j1L5q7j36J02J24N0l04K72k36K97j60p1J16J9j33K77l56
7647a93M12j61O4k10J65L39m36J97j78j24L70k52L8k01L38l55J15J29j92K12K7
7668A04j24N5L8k90J28j6Q6J17q3P1N0j06J7K9j97Q2j39K82j20l9O7Q6N2k90r9
7693b39J21KN3q2K24N8j48K03Lk14j87K38k06K26l1J70o5r1M1Q3k13J41l3j11
7717e7K88k61k19J24j95M24k25K28q3l75M97m84M19m3j5P9p0J41m82K21j88J10
7739a66K15k7o3p5n4K36j36J14P6k18o0K86k62K48j60P0Q4j83J52Q7Mj13j50J83
7763H8j12Ml57L42J16k78O7J53r2L14l85Rk3M68l20L5J33k33J44k33L03P2o4l64
7787b13K88P6j64l3j3N0J65K3j73l11J96J61j80N45l62k30K02ooj70J28M04m98
$$ plain form
7624 -7 -47 -100 42 152 9 -2 33 -54 -190 -88 36 86 -218 54 -182 115 -45 -116 0 19 -114 163 -193
7647 -193 219 58 122 -88 77 416 -20 177 -1 -125 245 -7 31 -170 168 -187 -72 57 -135 77 104
7668 104 -20 35 73 -217 -89 -105 -19 98 15 86 136 30 47 76 -121 -39 -178 104 -16 -55 12 98 150 -140 -239
7693 -239 -118 -116 -63 -145 79 137 -11 192 195 -19 -206 32 -174 52 21 191 126 35 76 159 -54 87 54 -57
7717 -57 231 -30 -249 -125 -320 104 -121 107 24 -351 146 -338 81 38 23 102 32 173 -309 -88 -276 -166
7739 -166 49 22 -41 -116 -170 66 -70 44 120 -98 -158 128 -134 114 -46 24 108 -75 77 164 168 55 -95 88
7763 88 -24 -20 -377 -35 81 -197 -130 23 -69 245 -140 -131 -154 314 -6 29 162 -71 73 -160 143 215 151 -213
7787 -213 75 151 -13 -46 -59 -9 156 179 6 -305 -109 52 -128 417 55 -175 27 21 15 -155 -27 377 -121
7810a21o0o2R8n5K39L8P1j33n5J99j69k77J04K80j25R7r9K6k95J45J94O7p9J02
7834A30M1j93j81K73M0k35R5j78R8K35k92J83J7J69k76J88j62K71l72j53M64j53
7856IR7l0J8j12L0J6M8j57K2L12n02L59o2p7J3k0K53k43j14K1K61m07M38l64Q1
7881a10L50k00j39M8j90K50K5kj67L42p7j64m1j83K79J24k0k31m2J49R0p0J26
7904A47j28j87K18j5l0J0K2O0j59J04j58J23O1J01k46n2O0j20q2J87J09K51j39
7927A37J7j81p4q9J29O7r9o1J51K35m37m7J36R9l9J90o5M1r7m6M8jq9K40k10J30
7953H5rk34J61j73J10K15M2O1j5m45Q7R8k7K07k34JqJ04r8l8J86j96J8K2j26K79
7979G3j4j82J53M4m4j44L9o3K09L1l09K7L13j1j86j24J72r3J03R9j9k40L21k20
$$ plain form
7810 -121 -181 -243 -145 -200 39 77 148 15 -40 159 -10 -287 -183 97 -28 69 -30 -4 -299 -154 40 107 28 130
7834 130 171 -22 -203 70 110 -125 -30 -208 -110 125 -167 16 33 202 -74 114 -48 223 -149 -302 162 9
7856 9 106 76 94 -18 12 28 76 -81 -59 253 -249 110 48 -29 -16 -36 217 -26 -140 -119 142 -265 173 -191 -110
7881 -110 240 40 -99 -51 -241 9 34 32 -135 207 130 -34 -75 -258 21 145 125 -106 -148 1 91 21 147
7904 147 19 -168 50 35 5 15 37 97 -62 42 -116 7 68 169 -77 -129 -69 -189 -271 -84 25 276 137
7927 137 154 -27 -101 -190 -61 6 -93 -154 -3 232 -205 -252 -116 -17 -56 134 69 110 13 -33 15 14 -75 165 -45 85
7953 85 76 -158 3 -170 -60 155 197 258 243 -202 -115 -17 -44 163 -71 -70 -78 26 -72 -110 76 -120 -102 -80 -206 73
7979 73 59 -123 30 74 30 -114 -75 -138 71 102 -207 -180 133 122 -64 -188 -16 -109 -6 93 74 -166 155 -65
8003f5L28k60O6P7k86L02k37J26j56j6r0L18j15J11n5J60m30J01J41J77j50k18
8025a71J5j01M09l08M3k3p0K85%q9L0R8m39M41j1k28m2j4J49N9m0K33j96MkRk7
8052A4J77n9qj94M13n33K59o7j75K81J93j93n2Q5L3j50k35K34M6j39Rj58L27j40
8076c2q4l9l8L13J26k68KR3j43j13K16O1m8m4L4j74J5K74J03n20K63J44L7p6j49
8101d7M4j99K19Q3r0J05N3l61K64k29K23M7k09Q7q2q3j78L67Q4K4K7r7k31L32
8125A53l12M30n05L32J93k56J21k06P7j02j58L98l4K0j25j93L34j41j0K42j20
8146A38l05L09k59L1J46J28l98J44o7K90oj88p1K22%j15n3K24j11O2r8mJ76j85
8170A0j80J73o2l5J54j46kN4N4K09K9k69j93L17k18O2N6p2j75J89j69
$$ plain form
8003 -65 263 3 69 146 -140 162 -75 51 -105 -121 -211 107 -8 103 48 208 -222 -121 20 197 47 -171
8025 -171 -156 -257 152 -156 -113 -136 -206 79 79 -10 20 118 -321 120 109 -119 -161 -175 -26 33 -7 226 30 34 32 41 14
8052 14 191 132 124 -70 343 -190 69 2 -173 108 301 108 56 141 174 24 -211 23 69 -70 -61 -219 108 -32
8076 -32 -116 -155 -193 120 246 -22 -20 73 -70 -183 33 94 46 2 36 -138 -123 151 254 -266 -3 141 178 102 -47
8101 -47 -3 -202 17 100 10 115 168 -193 71 -158 65 112 -97 -10 -92 -175 -353 14 98 122 149 52 -179 153
8125 153 -159 271 -234 98 291 35 156 -50 27 -75 -233 165 131 151 26 -167 167 26 16 258 138
8146 138 -167 142 -117 -86 60 188 -210 -66 -133 157 151 -37 -108 114 114 -1 -54 170 59 121 23 19 195 10
8170 10 -170 3 -59 -94 60 -86 -88 -34 20 229 258 -11 -204 113 -105 -43 13 -59 -234 -45 -214
8191b14
$$ Imaginary data points
##PAGE= N=2
##DATA TABLE= (X++(I..I)), XYDATA
0@%%%%%%%%%%%%%%%%%lJ1j6J6j6J6j8K6l2L2l9M7n2O0o8P6q8J00j11J26j42J59
39H4j76J98k22K46k71K98l32L67m04M45m89N40n95O55p24P99q83R78j088J217
59F43j364J538j752K017k356K808l447M429o145J0031l6515j0438K5965L238J2770
74A422n6541j1898O4219q550p2344L6213O5919j5700j4890L5001J7735J2942L146
87E6674l2415p846K9367j8000l5034J8922J7427k4988r246R271p970r797p294
100b0929k3184p376J9909m54j3683K2997L1626n497n262K4109R743j4683k197
113A5119N524p819K619J3209p474o946J2816o865k2249J169j081k5214r232P841
127b8583l133K439J2913L4L552J6322k383q512J4208L564j3994J0220J5025o272
$$ plain form
0 0 0 0 0 0 0 0 0 0 0 0 0 0 0 0 0 0 0 -3 8 -8 8 -8 8 -10 16 -16 16 -23 24 -28 32 -36 40 -48 52 -59 67 -75 84
39 84 -92 106 -116 130 -141 157 -175 192 -212 233 -256 284 -311 344 -380 419 -464 514 -574 643
59 643 -721 817 -935 1082 -1274 1534 -1913 2516 -3629 6402 -30113 -40551 -14586 -11348 1422
74 1422 -55119 -67017 -2798 -11348 -83692 -47479 18440 2740 -12150 22851 40586 53528 56674
87 56674 24259 16413 45780 27780 -7254 11668 29095 4107 -5139 4132 -3838 -13635 -20929
100 -20929 -44113 -51489 -31580 -32034 -45717 -22720 8906 3409 -1853 22256 31999 17316 15119
113 15119 20643 12824 15443 28652 21178 14232 27048 20183 -2066 -897 -1978 -27192 -36424 -28583
127 -28583 -31716 -29277 -16364 -16330 -12778 3544 1161 -7351 6857 10421 -3573 6647 21672 15400
141A5400O911J5490j3864j0251J1791j1239k4065K657o9j9736L431J4383p716
154a6877l03J2652o888o032J2516j391r041J0839Q136k744J1991J3255n024J712
168B2801N053j3622p057N519j1575j3081P878l81j0034Q031N330j2548k338O575
182i449q443m434J0507J727k401J2576J0675L00O731N837o376l435K337n389n378
197E385K433j997n181K801J414p003l489k189j0293n189M800k083k134J0675O348
212e702j122R371J0560n147j689P087l891m940Q740K139o376N101L983q131k184
227G799R14j1970r275O27n121m485O633K121k301P080M941k988M018L369n995
242d633J345Q518MJ585J0520J428m588M202L08j0048m178j813r153m493M034p13
$$ plain form
141 15400 22311 37801 23937 13686 25477 14238 -9827 -7170 -7239 -26975 -23544 -9161 -16877
154 -16877 -17180 -4528 -11416 -17448 -4932 -6323 -15364 -4525 3611 867 12858 26113 21089 22801
168 22801 27854 14232 7175 12694 1119 -11962 -4084 -4465 -14499 -6468 -1138 -13686 -16024 -9449
182 -9449 -17892 -22326 -11819 -10092 -12493 83 10758 11058 17789 23626 17250 13815 16152 10763 5385
197 5385 7818 5821 640 3441 4855 -2148 -5637 -7826 -18119 -23308 -18508 -20591 -22725 -12050 -5702
212 -5702 -6824 2547 13107 7960 6271 13358 9467 4527 13267 15406 9030 14131 18114 9983 7799
227 7799 8713 -3257 -12532 -11905 -17026 -21511 -14878 -12757 -15058 -7978 -3037 -6025 -2007 1362 -4633
242 -4633 -3288 5230 5234 6819 17339 18767 14179 18381 18689 8641 4463 2650 -6503 -10996 -6962 -7675
258g675k809L792J431m389P97J668l472j670L289K353L145Q138N458J892L011
273A4959J258l197j746k010n845l302N02j482o72L174r13m576r00j090n687j939
289a3466J798k325R08P550N204K207N907L338k583o19J771l094k940R43m83j063
305C053K353K210k651k582k618n188m317j535j807j080K449L183L874M658L819
320C821N32P0l38q51j9Q46N04R71J935J869P95n55k556m553m707l874k842k375
338a1327k18J576P34K262M039K053o10P6j3j347J239L537J504J849M477K135j60
355A1806J253j187n922m435j826m324k619J505J80j947J685K234j944p36O76k772
371h373j320L549K541J694N455M194K04K701K690k871k714q80l973k713J545l95
$$ plain form
258 -7675 -10484 -6692 -5261 -9650 -8853 -7185 -10657 -12327 -9038 -6685 -3540 4598 10056 11948 14959
273 14959 16217 13020 11274 9264 3419 117 619 -863 -1535 1639 726 -3850 -4750 -5840 -11527 -13466
289 -13466 -11668 -13993 -13085 -5535 -331 1876 7783 11121 8538 7919 9690 6596 3656 4599 4116 3053
305 3053 5406 7616 4965 2383 -235 -5423 -9740 -11275 -13082 -14162 -11713 -8530 -4656 2 3821
320 3821 4353 4423 4085 3234 3215 4061 4565 5536 7471 9340 10135 9580 7024 2471 -2236 -6110 -8952 -11327
338 -11327 -11545 -9969 -9235 -6973 -2934 -881 -1491 -1415 -1428 -2775 -1536 2001 3505 5354 9831 11966 11806
355 11806 13059 11872 5950 1515 -311 -4635 -7254 -5749 -5569 -7516 -5831 -3597 -5541 -6277 -5601 -8373
371 -8373 -9693 -6144 -3603 -1909 3546 7740 7944 10645 13335 10464 7750 6870 2897 184 1729 1334
387A334k320J642j78m137k74K38n820k393K454j185j15P033L820q44N154L552
403G961l296Q50L003m541k374M227l49k406M433Q84n518r10J20n864l572Q76l213
420i689k143M592K027P9M467K401l124J570K555k980m66M245n35o53N686J662
436I694l607J617o3o982k291J295n148l244M250l07k476N360K512m886P00K819
452g57l799n88N371n07j184P132K385j964L363R31o397j730J330n647j975L783
468b53k727k200M809P50n317K866J98o031K21M331k570J175P091J75p07O672R55
485I438n097J302J180o674r71M391l167j476M139j268l756K537j196p297M26J860
501e629m318J349O142M0J33O614Q51l048L440N95n602R25L782l063K56N181k548
$$ plain form
387 1334 -986 656 478 -3659 -3933 -3695 -9515 -11908 -9454 -10639 -10754 -3721 99 -745 4409 7961
403 7961 4665 5515 8518 3977 1603 5830 5481 3075 7508 8392 2874 1964 2084 -3780 -7352 -6476 -9689
420 -9689 -11832 -7240 -5213 -5134 -667 1734 -1390 180 2735 -245 -711 3534 2999 2346 8032 9694
436 9694 6087 7704 7641 659 -1632 -337 -5485 -8729 -4479 -4786 -7262 -1902 610 -4276 -3576 -757
452 -757 -4556 -5144 227 -280 -1464 5668 8053 6089 9452 10383 3986 2256 3586 -2061 -4036 -253
468 -253 -2980 -5180 -371 379 -4938 -2072 -1874 -7905 -7684 -3353 -5923 -4748 2343 2518 1811 8483 9438
485 9438 4341 5643 6823 149 -822 3569 402 -1074 3065 1797 -1959 578 -618 -7915 -7489 -5629
501 -5629 -9947 -8598 -2456 -2416 -2283 4331 5182 2134 5574 6169 567 1492 5274 2211 2467 7648 5100
518E100k690L195k301o929N73l6o760k02N233j307k23O074n08k088M450M12n000
535c007K591L601m049J812P478j481j575M402k229n386J549j481p485Q07K904
550a549n088P52O406k579l230N012j675n185L693J871m750L638O483j958J011
565B852O540j838m055L008j617o007K042J077n717K127M844l706k060M203l273
580a580m866K778n79m327L962L633l221L635O881k353k150M606k301m699K738
595B157J449m856K240M332m241q13M507l419n245K135j316m572K057K625k892
610e852K756N060j832m74M713j756m137L293M82l232L198K783l455J438L833m589
626B229k965L207l426n724K962J338m168K868M437l387K96M948k531l418M026
$$ plain form
518 5100 2410 5605 3304 -3625 -3052 -3088 -9848 -10050 -4817 -6124 -6347 -273 -781 -2869 1581 1993 -3007
535 -3007 -416 3185 -864 948 8426 6945 5370 9772 7543 2157 3706 2225 -5260 -4453 -1549
550 -1549 -6637 -5885 521 -2058 -5288 -276 -1951 -7136 -3443 -1572 -6322 -2684 3799 1841 2852
565 2852 9392 7554 3499 6507 4890 -1117 925 2002 -3715 -1588 3256 -450 -2510 1693 -1580
580 -1580 -6446 -3668 -4247 -8574 -4612 -979 -4200 -565 6316 3963 1813 6419 4118 -581 2157
595 2157 3606 -1250 990 5322 1081 268 4775 1356 -3889 -1754 -3070 -7642 -5585 -2960 -5852
610 -5852 -3096 1964 132 -342 4371 2615 -1522 1771 2253 -979 2219 5002 1547 2985 6818 2229
626 2229 -736 2471 -955 -6679 -3717 -2379 -6547 -3679 758 -2629 -2333 2615 84 -3334 692
641F92J87m105L911L646k518J701M245l490j708K701l781m400K048o04l592K973
657b094J871l357J515K208l534q00L287k291k438M607J764j762L931L337k753
672C491J42K866l358k702K442j491l417K475J646k931L88K094l417k011J204j648
688d227k256K363J013r91L236K956j266J206K226k524o27K350j916j808L146Q13
704C694k243K022J252l865j523J274l444k524K393r59k057L479K169j706J554
719d84K336k251j197K404r90q68K594J090o59K216J270k124l52j19l107j384O13
736a012j802q27K134J04j042K094O40k053k72R90j487l84K715L52k53K864J706
753D467j680J037N89k850j450N38j627p30J241K07r09J212M25j561n1l88k004
$$ plain form
641 692 879 -3226 685 4331 1813 3514 7759 4269 2561 5262 1481 -2919 -871 -1475 -5067 -2094
657 -2094 -223 -3580 -2065 143 -3391 -4191 -904 -3195 -5633 -1026 738 -1024 2907 6244 3491
672 3491 3633 6499 3141 439 2881 1390 -2027 448 2094 -837 -449 1645 -1772 -3783 -2579 -4227
688 -4227 -6483 -4120 -3107 -4098 -862 2094 828 2034 4260 1736 1109 3459 1543 -265 2881 3694
704 3694 1451 3473 4725 860 -663 611 -2833 -5357 -2964 -3923 -5980 -2501 -332 -2038 -484
719 -484 1852 -399 -1596 808 -182 -1050 1544 2634 1975 4191 5461 3337 2985 2866 -241 -1625 -1012
736 -1012 -2814 -3641 -1507 -1403 -2445 -351 289 -1764 -2036 -1046 -2533 -2917 -202 150 -103 2761 4467
753 4467 2787 3824 4413 1563 113 651 -976 -1706 -465 -258 -1167 45 470 -1091 -1142 -1530 -3534
770c534m9J085K03Q43K771Q20k43J273O32j842m6l52j887q2J328l12o55J495l16
789A132j321m28l51j955j071P16l66N73J735J305O01J392L85m99k1l90q34P7N99
808A279J52O84Q80l25o61n18j352j738p33p06r19l04J550M41L98J508O55l86M4
827e1L78l84m26P49R16P37J137J003op51n84j103j411j286o36p88p6L00P75j54
847a661M73p5l98o71l59L14K27P68J179J447J200Q94K56L30p72r15q41l60j016
866B0O8M90k51p71N81k34j308o61n0j293n03J401L07L75J453J736j11P64N33q14
886A732o71L78o67l91J298m0m55O22M7j514k77o86j862p61P37j49k32J917M91
905d83k05J281N79r96q5Q13j102nJ930j95k60J362M53j850J81N8k523r12Q04r92
$$ plain form
770 -3534 -3583 -2498 -2295 -1452 1319 2139 1896 3169 3801 1959 1913 1561 -326 -408 920 608 -47 1448 1132
789 1132 -189 -617 -968 -2923 -3994 -3278 -3644 -3071 -1336 -31 570 1962 2347 1848 1827 1437 603 680 1279
808 1279 1431 2115 2995 2670 2009 1491 139 -1599 -2332 -3038 -3957 -4261 -2711 -2270 -1872 -364 291 -95 -51
827 -51 327 -57 -483 266 1182 1919 3056 4059 4053 3302 2718 1615 204 -1082 -1718 -2506 -2582 -2282 -1507 -1661
847 -1661 -1188 -1263 -1661 -2332 -2691 -2377 -2150 -1382 -203 1244 2444 3338 3594 3924 3152 2237 1396 1036 20
866 20 88 578 327 -444 137 -97 -1405 -2066 -2116 -3409 -3912 -2511 -2204 -1829 -376 1360 1249 2013 2546 1732
886 1732 1061 1439 772 381 1679 1639 1184 1806 1853 339 62 -624 -2486 -3247 -2510 -2659 -2891 -974 -483
905 -483 -688 593 1172 176 91 904 -198 -203 1727 1532 1272 2634 3087 1237 1418 1476 -1047 -1959 -1155 -2147
925b147o69J724N59q52J002O32j627O46R89j535O3K003P3l19K438M86j649N81
943B398K35k607j04L39j852p34K001n03q14J950l20k161P40Q81k245L42J951l93
961h96K9L037L59j056J644K51k457K77N46k134l78K092r95r32J809n26k519R74
979h75k86k398K56J615j386L37K994Nm04K528j03j769R75P21k097J19J937j323
997H46l4K043r57j452J053j036l107L57O91k275P59K337o89n27K611N7j556J285
1015D06M15j978P36J929q50L63K317n64j205J707j024k901O84J05k356Q7J808
1032c21j582j3K519j019j794J868m25j905J220J257j170R41K933j079m99K570
1048C501p50k404J130j61k798J038J095j485r1K498j505j421J343p16k119J112
$$ plain form
925 -2147 -2816 -1092 -533 -1385 -383 249 -1378 -732 257 -1278 -1215 788 861 542 2980 3466 1817 2398
943 2398 2633 26 -78 261 -1591 -2325 -324 -827 -1641 309 -11 -2172 -1432 -551 -2796 -2454 -503 -896
961 -896 -867 2170 2529 1473 3117 3368 911 1188 1734 -400 -778 1314 319 -613 1196 670 -1849 -875
979 -875 -1161 -3559 -3303 -1688 -3074 -2737 257 262 -142 2386 2283 514 1489 2210 113 232 2169 846
997 846 812 2855 1898 446 1499 463 -2644 -2287 -1596 -3871 -3112 -775 -1464 -1991 620 677 -879 406
1015 406 821 -1157 -421 1508 658 1021 3338 2774 1569 3276 2252 -649 35 140 -2216 -2129 -321
1032 -321 -1903 -1916 603 -416 -2210 -342 -767 -2672 -1452 -195 -1365 -424 2509 1430 931 3501
1048 3501 2751 347 1477 1316 -1482 -444 651 -834 -925 1573 68 -1353 -10 -726 -2845 -1733
1064a733P33j734J403K519j018J32K430r42j401J516o73k297J511Q85j964O63
1080C0J936j546j163J728j139k164R85J06j933J444J779j374R41K217j068p20
1096E9J780p66j811J552L65j712J378J471j568m11J804j888j687J243r60k127
1112c278J614R30j474J103J876j287m25J846p02j359J715M30j559J791J311j462
1128A070O75J221j812j214J086j354j946J356M25j696J170J374j580K8J336j341
1144a202q06J634l88p30J704J337j134J195J619j787k91J048j437j675J764k24
1160F27j726J245P10j879J41J245k076n07J142o39r64J748Q74j114J841J389j440
1177F17J86J259j416q48J519n27j015J602M08j457N01O50k159m99R14j321j164
$$ plain form
1064 -1733 -1000 -2734 -1331 1188 170 302 2732 1790 389 1905 1232 -1065 446 1331 -633 30
1080 30 1966 420 -743 985 -154 -2318 -1333 -1227 -3160 -1716 63 -1311 -370 1847 779 59
1096 59 1839 1073 -738 814 1179 -533 845 2316 748 337 2141 253 -1434 -191 -1151 -3278
1112 -3278 -1664 -734 -2208 -1105 771 -516 -941 905 203 -1156 559 989 -570 1221 2532 1070
1128 1070 1745 2966 1154 -60 1026 -328 -2274 -918 -493 -2189 -1019 355 -1225 -1197 139 -1202
1144 -1202 -2008 -374 -762 -1492 212 1549 415 1610 3229 1442 1151 2199 762 -913 851 627
1160 627 -1099 146 856 -1023 -882 363 -1713 -2220 -1078 -1717 -2681 -933 -59 -1173 668 2057 617
1177 617 803 2062 646 -202 1317 790 -225 1377 1785 328 829 1479 -680 -1179 -265 -1586 -2750
1194b750J521J21o49J657Q70j297O33R35j319l08J202l89o78J690M30j155J327
1211A841M51j819l80N04j465q49J169n80o22J837J29q98P63L13j195M6O42o14
1229g27J38J044N91n89J082P73j233m05M60j663m19R32p96n02J411m25n55P30
1247a53L09j144RO59r79L95R34J44mJ288N30j003L18J57j300k77O47q18k44O51
1267A19m74j95P60J09j215q3K89r62j00R88Q5j16J218N36k83O67J84q72j21L94
1287I28q41J10O75k28j05K49p8p89n3m57q66j4K05n39N50P42K85j29P20L8l84
1308A9J75Or9L12K68M9N41L28j5o07j0n30p65n44r4k65J07K10M02j22L96k75j47
1331f60K9L5j57K09K75M97N42J62K22J53j75J30o85l20p8o63J93J90L8lj54M21
$$ plain form
1194 -2750 -1229 -1108 -1757 -100 770 -527 106 1041 -278 -586 616 227 -451 1239 1669 514 1841
1211 1841 2292 473 93 597 -868 -1717 -548 -1128 -1750 87 216 -682 81 394 -801 -755 -113 -727
1229 -727 -589 455 1046 457 1539 2312 1079 674 1134 -529 -948 -16 -812 -1314 97 -328 -883 -153
1247 -153 156 -988 -979 -320 -1299 -904 30 174 170 1458 1988 985 1303 1460 160 -117 530 -288 -532 119
1267 119 -355 -550 210 319 -896 -979 -690 -1652 -1752 -764 -679 -795 423 959 676 1343 1527 655 534 928
1287 928 87 197 872 644 539 788 710 -79 -132 -589 -1455 -1469 -1264 -1803 -1253 -511 -226 -355 365 403 19
1308 19 194 200 101 413 681 730 1271 1599 1584 977 967 437 -328 -872 -966 -1231 -1124 -914 -512 -634 -238 -513 -660
1331 -660 -631 -596 -753 -544 -269 228 770 932 1154 1307 1132 1262 577 257 179 -484 -291 -101 -63 -66 -220 201
1353B01m81n40o1k54J99J76K31M11P44J36K77k17m2j54k30j42m50K07q0L44LJ2
1375B90j41J80n13m49J2m18k5M28m6J52P76K26qK7q7k38l62J20K33k08N71J88
1397G08j75J87j30n72j26n11j55n20N86j73k2P42M64m11L87J86p39J24K91k43
1417a02L83N92r0l47Q59j88q44J99j84r21l85N12l57j92P85l6m73Q10n1o96L33
1438c93N9n09J76J169k98K56P68P7n50K40p0r40N6J23p31r7J014l48l83O95m79
1459a65p20J07o9o33M37M67J56O9R91J18k67N90k65o44K41L4m36P9O31l28j24
1480B69Q94q95p07L23k88j186L37M12j12p3J237k02k26P62J6q92N39J62r55P30
1500A45N47l12K48P06n40o37O18o12j264N24N11r87M30P42n62j1P72m29n70O66
$$ plain form
1353 201 -280 -820 -881 -1135 -936 -760 -529 -118 626 762 1039 822 780 626 396 254 -196 11 -69 275 278 290
1375 290 149 329 -184 -633 -621 -1039 -1064 -636 -682 -530 246 472 464 491 404 166 -196 -76 157 -51 520 708
1397 708 533 720 590 18 -108 -619 -774 -1294 -708 -881 -903 -161 303 -108 279 465 -274 -150 141 -102
1417 -102 281 873 783 436 1295 1107 263 462 278 -643 -1028 -516 -873 -1065 -280 -316 -789 21 -30 -726 -393
1438 -393 -334 -843 -667 502 204 460 1228 1305 755 995 925 -15 41 164 -567 -664 350 2 -381 314 -165
1459 -165 -885 -778 -847 -1480 -1043 -576 -420 -351 640 758 491 1081 816 172 413 447 11 90 721 393 269
1480 269 1163 268 -439 -116 -404 -1590 -1253 -841 -953 -1026 211 9 -217 545 561 -331 208 370 -585 145
1500 145 692 380 628 1334 794 157 775 163 -1101 -577 -66 -1053 -623 119 -443 -454 318 -111 -681 -15
1520a5K54j082N83P22p17L95Q67k81m64N45k12j091O11j36j127Q67N57p48l6J318
1540H10j004m61Q15m36q52N95O84p55P56Q69m44j65O18n56o44N59j51r72L78Q22
1560D66q36L12O70q86k30Q12o67q55Q35J32o97R87P18o81M8J202r99k83R39p51
1580B36q25R19M14j106M97Q53r87k42P36r14q86P86j13p08J188M83p52L84R43
1599I06r06n9M30m94j78P93J91q66P66N69r08J28O51j177k91N07n97n80Q16J50
1619a49q11O48P32j079J51O53o19o77J386pl98P19M64n55M29K51q66k62M81o63
1639a72n17Q80j07p06N07N23q08L2O50j127J27P24q17j36J065M65p96P47M12p72
1659A74J67L56q12l72J000j72q44O61M25p91M73k8r95m9P73m27o14J269j40l64
$$ plain form
1520 -15 239 -843 -260 462 -255 140 1007 726 262 807 595 -496 115 -21 -1148 -281 276 -472 -508 810
1540 810 -194 -655 160 -276 -1128 -533 151 -604 152 1021 577 412 1030 474 -170 389 238 -734 -356 466
1560 466 -370 -58 612 -274 -504 308 -359 -1214 -379 -247 -944 43 761 80 128 1330 331 48 987 236
1580 236 -589 330 744 -362 135 988 1 -241 495 -419 -1305 -519 -632 -1340 -152 331 -421 -37 906
1599 906 0 -59 371 -123 -301 492 683 -183 583 1152 244 372 1023 -154 -445 62 -535 -1115 -299 -149
1619 -149 -960 -312 420 -659 -508 145 -474 -1151 235 228 -170 549 1013 458 887 1138 272 10 491 -172
1639 -172 -689 191 84 -622 -115 408 -400 -368 282 -845 -718 6 -811 -947 118 583 -213 534 946 174
1659 174 341 697 -115 -487 513 341 -503 158 583 -208 265 237 -758 -807 -34 -461 -1075 194 54 -310
1679c10O24M61j019L25N62r99j5O45j2o91J384n46o39O64j85r08J75M00m20m94
1699i98Q99j05j03O68P9m23kK63n76M2O51k92J1K19K27k97N22n0j024J15P4q41
1721i41J71N64m32k59J177k02n54L57K93m19j31P14o59J57O07N9j61M41m9o19
1741A14k67L47m70p9M48l62j27M36jl46L81k72l00j36L05l40J05O10k34K92M95
1762E99j53l10O42n84j24O0J40n28M19J47j94k81L37j2p26L29J2l40j5K30N5j29
1784d26O97k27j95K12J60m10J01L09j87J31M72k72q6L40j87j76j11m11j0n9L5
1805c00J7J36J27j13o3J17j23m32L07K85k60J37K86p3L77J99l34j20K90l76k61
1826a77L8r2J33j72L66o5M9Kj87n6j60k17K38M29L7k23J97M03j2k56lk1m25J57
$$ plain form
1679 -310 314 775 -244 81 643 -356 -371 274 262 -429 955 409 -230 434 249 -659 -484 -84 -504 -998
1699 -998 -99 -204 -307 361 440 17 15 278 -298 -256 395 103 114 333 560 263 785 735 -289 -174 -100 -941
1721 -941 -770 -206 -638 -897 280 78 -476 -119 174 -245 -376 338 -321 -164 443 502 341 782 733 114
1741 114 -153 194 -276 -355 93 -269 -396 40 39 -307 74 -198 -498 -634 -329 -669 -564 46 -188 104 599
1762 599 446 136 778 194 70 130 270 -258 161 308 114 -167 170 158 -568 -239 -227 -567 -582 -352 -297 -426
1784 -426 271 44 -151 61 221 -189 -88 221 34 165 637 365 279 619 432 256 145 -266 -276 -335 -300
1805 -300 -283 -147 -20 -133 -196 -79 -202 -634 -327 -42 -302 -165 121 48 425 624 290 170 460 84 -177
1826 -177 -139 -231 -98 -270 96 31 80 82 -105 -161 -321 -538 -300 129 166 -57 140 543 531 275 272 251 -174 -17
1850a7k78J35Q0j31M44j85j28J44n6k40J61o17N41J72j53K39K9N55n29J54l5r4
1872A91k63J66j97J98n6O0R9k62K89j86k80k27J48m9K02j94J96L00l3j43J55J6
1894A30M02o22O6Q1K9J32J37L0p6N3k15k20j72P6m17J76K09j71L6L83j03j80O
1917b30L02l03J4K81r7p1O16k72j80O83k36l15J24l61j85Q2L59m41J02J86pj34
1939h3N2l45k5J10K2j98o2N32l69M99L40k60j90K98l34J45j70K77l96MM39j10
1961A76l8K33n04k49M29l55j24L1L56k50J60N29k85n1M00n97o0L53l8l34L51N27
1983F60l93k52N15l63j72J06m22J07J0L83m43J35L07j08q4M26j19o02P03k49m81
2004c36L72L08m10K93J12m58l8M73m97l25J85O6l87N12L18l95K58K28l59O5j31
$$ plain form
1850 -17 -295 -160 -80 -211 233 48 -80 64 8 -232 -71 -688 -147 25 -128 111 140 695 166 320 285 191
1872 191 -72 94 -103 95 39 99 198 -64 225 39 -241 -468 -320 -369 -167 -361 -165 135 102 -41 114 130
1894 130 532 -90 -24 57 86 218 355 385 309 362 147 -73 -245 -169 -586 -410 -201 -372 -336 47 -56 -236 -230
1917 -230 72 -231 -217 64 -33 -104 512 240 60 743 507 192 316 -45 -230 -148 211 -230 -128 58 51 -83
1939 -83 -31 -376 -401 -291 -269 -467 -529 3 -366 133 473 213 23 321 -13 132 -38 239 -157 -153 286 176
1961 176 138 371 -133 -382 47 -308 -432 -401 -45 -295 -135 394 109 58 458 -139 -199 154 116 -218 133 660
1983 660 267 15 530 167 -5 101 -321 -214 -204 179 -264 -129 178 70 -14 412 293 -309 394 145 -336
2004 -336 36 344 -66 227 339 -119 -157 316 -181 -506 -321 -255 -642 -130 188 -207 51 279 -80 -15 -146
2025a46j22n2L00L19m82K9O95q10L68K49k86k99K05K32n03%J88j09K53J97l47
2046a21l40K77L2l44N66j41k06N48K57m38J66L04n64R3J71J05n33K77J57m53Q0
2067a07L43o32J08L04n09j57O76j87m25P11L35l93J65K40n35N1N15m27l04N34
2087C06R3j98K04k5n08O5K91o23j37N07K5n64N93M8n23L25N18q38L04K63k11j92
2109b77K98K51m52N66Pl57%O21p90J1J26p0l97N57l1l25L54j10l22J24L81l07
2131a42k62K83J56k28L38J37l39R6N75q23j57O31j23n73N79l41oK85P3j86k24
2152b51L67m45j31P10k52k49L12L1k9J50K0k49q4K73l39j82N96k97j82K43J77
2173A89l14J2K29m63j65P10o58L3L08j16J77J20L10l92J44j07j03j52O25m12r1
$$ plain form
2025 -146 -268 -320 -20 299 -183 -154 541 -269 99 348 62 -237 -32 200 -303 -303 -115 -224 29 226 -121
2046 -121 -461 -184 -152 -496 70 -71 -277 271 528 90 256 560 -4 89 260 365 -168 109 266 -187 -107
2067 -107 236 -396 -288 16 -493 -650 26 -161 -586 125 460 67 232 472 -63 -12 503 76 -228 306
2087 306 399 201 405 380 -128 -63 228 -395 -532 -25 0 -564 29 77 -446 -121 397 -441 -137 126 -85 -277
2109 -277 21 272 -180 386 393 36 36 657 -133 -122 4 -66 -463 94 63 -262 92 -18 -340 -216 165 -142
2131 -142 -404 -121 35 -193 145 282 -57 39 614 -209 -366 265 142 -431 148 -193 -199 86 159 -27 -251
2152 -251 116 -329 -460 250 -2 -251 61 92 63 213 233 -16 -100 173 -166 -348 248 -49 -231 12 189
2173 189 -125 -113 116 -347 -512 198 -460 -427 -119 -235 -58 62 372 -20 124 17 -86 -238 387 -25 -116
2194a16L44L9l61L59l4n15q5L90k76j06K36qk8K42K7n61L37L41l92J76K07k18
2216bJ9N01m40K13j12j03O1j70J07j95j23K38n2j84L27k14j61J53Jq0o9J34k45
2239c96L24J48K17k93K78j37k27K95J12m74L04J71m70K23M8Jl54K32K4j46n7Q0
2261i7Km80K30K31J04J9J09j05R1J8k00K74m7J3j6K02j18j19j73J42k81Q0Q8o2
2285i5o9J3J65r7J18J68l26J88L3m08K33K69l69N5L86j48J27j32l16Q2L24l70
2307a69o5L24j77J81q8OM8j15J6k74K80J60j21n7n4K23O4q4K7P4j15pN1j00m5
2332a7Kn28M69m1N1r1J92M5l31j67M65l24K41r3K36p3JR4p3l31M43l12m8K30N1
2357I1j70K50l76K76L0k29J41j21L9j83MK82j04PJ35k2j9J16j54K32l2j78J41
$$ plain form
2194 -116 228 267 -94 265 231 -284 -369 21 -255 -361 -125 -133 -161 81 108 -453 -116 225 -167 9 216 -2
2216 -2 17 518 78 291 179 76 137 -33 74 -121 -244 -6 -58 -242 85 -129 -290 -137 -136 -216 -285 -151 -396
2239 -396 -72 76 293 0 278 141 -86 209 321 -153 151 322 -148 75 123 124 -230 2 26 -120 -177 -97
2261 -97 -95 -575 -345 -114 -10 9 118 13 104 122 -78 196 149 162 146 348 230 111 -62 80 -201 -121 -33 -95
2285 -95 -164 -151 14 -83 35 203 -123 65 98 -310 -77 192 -177 -122 264 116 243 111 -205 -123 201 -169
2307 -169 -234 90 -87 94 6 12 60 -55 -39 -313 -33 127 6 -51 -105 118 182 98 125 199 84 77 128 28 -17
2332 -17 -15 -543 -74 -115 -64 -155 37 82 -249 -416 49 -275 -34 -127 109 36 37 131 58 -273 170 -142 -190 40 91
2357 91 -79 171 -205 71 101 -128 13 -108 -69 -252 -248 34 -70 -63 72 50 31 147 -7 225 193 15 156
2380A56p3L6l5M4k63K31l18q8K90m3K85l18n1J17p7n0J10j36K41L4m4l68M02k5
2404E7L2J81M8k83P1J74k66O0j25n2J64j98J13j1K2N8k62Q6Qq1K85l03L42k21
2428a01O3K28k6P3j07n1k0J4m1J49R8k60o3M34m94N4J96N9k89j11J12J40M2r6
2452Cq8J60j39j37L31k2Q8k42M2J61l98O20n41M02l29K15k86J1L3n2k03K16J05
2475e0j20J98K19k6j00N2j53o2O1K4k79K79l3L8m5J96k82J24o7M3j6P2l49J40
2499a36J56j24R0J03O5m57J46m7L42l12J39K51k07R9J55j95k5K6m6q7P4J62j69
2522Cj47K86l18J11P7k29J73J31j52l11K89Q5j32K21J63l40M6K94k68j78K58m
2544E8l57M16j84nL10k58j76K74J79m93p7L73k71M4K08k3j89K82J26k02j40QK31
$$ plain form
2380 156 83 119 84 128 -135 96 -222 -310 -20 -63 222 -96 -147 -30 -107 -157 -47 -183 58 92 48 -320 82 57
2404 57 89 270 318 35 106 280 14 74 -51 -103 61 -137 -24 -35 -13 45 -217 -131 -123 -204 81 -222 120 -101
2428 -101 -38 190 164 237 130 79 59 73 32 181 279 19 -44 390 -104 -50 146 205 -84 -195 -83 57 99 3
2452 3 -85 75 -64 -201 130 108 196 -46 -4 157 -241 379 -162 240 -89 126 -160 -149 -116 -168 -371 -155 -50
2475 -50 -170 28 247 221 121 173 20 -42 19 43 -236 43 10 48 3 199 -83 41 -26 17 1 73 -276 -136
2499 -136 20 -104 -14 89 154 -303 -157 -204 138 -174 -35 216 9 108 263 68 43 69 23 -64 10 172 3
2522 3 -144 142 -176 -65 12 -217 -44 87 -65 -376 -87 -2 -134 87 250 -90 -44 250 -18 -196 62 58
2544 58 -299 117 -67 -72 238 -20 -196 78 257 -236 -313 60 -211 -167 41 18 -171 111 237 35 -105 -97 134
2567A34j48K78l37p9J03L98k88j61M0P7j66j6J96k78K29L18o62M50Q3m57K97n8
2589d7J68k73L03j93j36L39J96l82J74J13m10j87L54o0J56L0J67r0l34K57l30
2610a85K74m1K6j1J40J15n20L98j98p9q0K43l57O5N06k93K84l47Q9j64j50M19
2632A34j02k37L56k93j34M04j46o7K10M9j67o0K34k69J82j29o0K51j43K03l2j71
2654A3P5k99L11l45kK15K52k15j17L79k18l27L06M28m67M1J12q5J29J71l42j28
2676a13K58k24L9L9j68p6J84K28l20K11P6k94l3M25m09J25k4J1N3J5K51m21J01
2699f6J0N7k5L8K7k62K28K92l76J49mr0N5O1J38n31M15k42J2m2L19M0k16J31k41
2724a23Q9M7J24K0p8M9l60J79J84qj10P4j55L7J18j86J24r2Q2j60K25j39L5J09
$$ plain form
2567 134 -14 264 -73 -152 -49 349 61 -100 -60 17 -149 -165 31 -247 -18 300 -362 88 171 -286 11 -47
2589 -47 121 -152 151 -42 -178 161 357 -25 149 262 -148 -335 19 -41 115 145 312 222 -112 145 -185
2610 -185 89 48 74 63 203 318 -202 196 -2 -81 -161 82 -275 -210 296 3 287 -60 29 -135 -285 134
2632 134 32 -205 151 -142 -276 128 -18 -85 125 174 7 -53 181 -88 94 -35 -95 156 13 216 184 13
2654 13 88 -211 100 -245 -247 -32 220 5 -112 267 49 -278 28 456 -11 30 142 57 186 357 15 -113
2676 -113 145 -79 -40 -1 -169 -245 -61 167 -153 58 134 -160 -193 232 -177 -52 -76 -65 -12 3 254 -167 -66
2699 -66 -56 1 -24 14 41 -221 7 299 -77 72 68 -22 33 94 232 -299 116 -126 -114 -156 163 203 -13 118 -123
2724 -123 -34 13 137 157 79 128 -232 -53 131 123 13 87 -68 -31 87 -99 25 -67 15 -145 80 -59 -24 85
2748H5m9k05Q5K7l8N2PJ10j4l6M2J03K6n0j39j21r3J61j17r1M05j03l0K02q8J75
2774C06o03L47k13J51K31m95M00k2J38m09L70j01k19Q6j21n9L83j09k57K40j55
2795a11j60J70n0L69j15o7J8j84J49j3M4j70J3J26j45J3J33j29J30K22m45M2L22
2818A62k24K63k07J26k07Q6J21j97K05P5j43k53L26p7p3R2j20k54L09J32R0l58
2840a26K50k3k07K25k21N2J9j54n7J29K38l0k65n7P2L19l0j41M2L7q7N7k4M8k5
2865D1J88l01J21n9j91pK22O8m05L20J09J44n03M00k15L33j45j49J97j97O4PK1
2888F3j27QK86j83K38m96L09j70J62k34K9m4J08K12k92J39k56N6O2J08R8j53P0
2911gJ14p3j57J71N5j43J53n6N6k69J32M4K05p2j10J80k13l4n0K17R8k62M6J18
$$ plain form
2748 85 36 -169 -84 -57 -95 -43 -36 74 60 24 66 169 195 145 6 -115 -208 -47 -164 -255 150 47 17 219 131 306
2774 306 -297 50 -163 -12 219 -276 124 102 240 -169 201 100 -119 -33 -154 -213 170 61 -196 44 -111
2795 -111 -271 -101 -151 218 103 36 54 -130 19 6 50 -120 -107 19 -126 -113 20 -109 21 243 -202 -160 162
2818 162 -62 201 -6 120 -87 -1 120 -77 128 203 60 -193 133 56 -17 75 -45 -299 10 142 232 -126
2840 -126 124 101 -106 119 -102 -50 -31 -185 -242 -113 125 95 -170 -227 -155 164 134 -7 35 72 -15 42 18 66 41
2865 41 229 -72 49 -10 -201 -208 14 82 -323 -3 106 250 -253 147 -68 265 120 -29 168 -29 35 42 63
2888 63 -64 -56 230 47 285 -211 98 -72 90 -144 -115 -159 -51 161 -131 8 -248 -192 -130 -22 76 -77 -7
2911 -7 107 34 -123 48 103 -40 113 57 113 -156 -24 20 225 153 43 223 10 -24 -74 143 241 -21 25 143
2935A43r5P8j88J18J34k45J90j69J31r2j34K61k7l13J40j50rL20j71R0L0k7k4
2958iJ00o1NR0k05P7L0j62P2k3j61L12j2j89M80l22o1J86n36L50J3L06k17j46
2982h3J27m4k0l0j03J7L09K0k62J57L3J27k12J66R5l00J91k4k67K09Q3k92K2K67
3006A86n01K77J25L7m35J85j85J51K18M4N8j26l2J93L9o1o8j6N0k7J01k98M8Q0
3030D3p9n3k79L57r2j74J12N1K37l18M0K10J3j59L7L8J64j57J31j62L8P4k47M44
3054B69k56k11K33j58j36j1K98L7j16K15k14k07L98m03L62m70M24j73J28P3l6
3075D6k12J99j29J37K4j78j36K74j8J18k69J89J42m83M99M1l68J50m2k7qm6J88
3098I1J0k0L7j03k80L85k11q1L49m38J08J99J0o7J48j15j08Jm4O9K92m43J05o2
$$ plain form
2935 143 48 126 -62 56 190 -55 135 -34 97 5 -129 132 105 -208 -68 -218 -227 93 -78 12 42 15 -9
2958 -9 91 30 35 125 -80 -3 27 -135 -63 -86 -247 65 53 -136 344 22 -39 147 -389 -39 -26 280 63 -83
2982 -83 44 0 -20 -50 -153 -136 173 193 -69 88 121 248 36 202 297 -3 188 164 -103 106 189 -103 -81 186
3006 186 -315 -38 87 124 -311 -126 -311 -160 58 102 160 34 2 195 234 173 105 89 139 112 213 -85 -37 43
3030 43 -36 -89 -368 -11 -103 -277 -165 -114 123 -195 -155 55 68 -91 -54 -16 148 -9 122 -40 -2 72 -175 269
3054 269 13 -198 35 -123 -259 -270 28 65 -51 164 -50 -257 141 -262 100 -370 54 -119 9 82 46
3075 46 -166 33 -96 41 65 -113 -249 25 7 125 -144 45 187 -296 203 244 -124 26 -16 -43 -51 -97 91
3098 91 101 81 118 15 -265 120 -91 -172 177 -261 -153 46 56 -11 137 22 -86 -85 -129 -60 232 -211 -106 -168
3122a68o3M26k44l2J55R5l74L83m18K84J93j62Ol30R8K20j78L1M7o7l1j68K04
3145i3L21j88p7K3j8j12j2J67Lk53J61L68m76K72Q9k68J84Ok06j53K51j08J52
3168C3j53M00j44J74j67j71j20K56j70k0r3J62j56M9J76J83j29r9r1p5M24l23
3190e4R4J19j56p1O0n6n8lk5J58M5j02J49j04j02K30m3n3l4m3K21k43N2j8J89
3215A52j23J29J30l20J10N8l3j20j57j7L40k96L79l07P8K81m24q9J07K90j14m3
3237A1J17q3lO3k90K40Nm1q7L1Q0j56M5oJ90k2Rj34rn5j44K02l4j16L8M7k1K28
3265A05l30J55K29l81nK06J1o8nn7N6J44j81nj30M18q5O2q5k28J40K4j88K53j2
3290D3m6k01J18J93j6j32L3Q9k73L15j61Pj01L07m51K63Q8k46K34J62n4k46l3
$$ plain form
3122 -168 -231 195 -49 -81 74 169 -205 178 -240 44 237 75 81 -249 -151 69 -109 -78 -31 -98 -129 -297 -93
3145 -93 228 40 -37 -14 -32 -144 -156 11 14 -239 -78 290 -186 86 175 -93 91 97 -109 -262 -11 -119 33
3168 33 -120 280 136 310 143 -28 -148 108 -62 -82 -175 -13 -169 -120 56 239 110 11 -80 -155 269 -54
3190 -54 40 159 3 -68 -8 -64 -122 -125 -150 8 53 -49 100 -4 -106 124 81 28 -6 -49 172 -71 -19 -37 152
3215 152 29 158 288 -32 78 136 103 -17 -174 -191 149 -147 232 -75 3 284 -140 -229 -122 168 54 11
3237 11 128 45 42 105 -185 55 60 19 -68 -37 43 -113 -68 -74 116 94 103 -31 -40 -95 -239 -37 -71 -187 -149 -102 -123 105
3265 105 -225 -70 159 -222 -227 -21 -10 -78 -83 -140 -84 60 -121 -126 -256 162 77 139 54 -174 -34 -10 -198 55 43
3290 43 -3 -204 -86 107 91 -41 -8 81 -192 123 -38 -31 -132 175 -276 -13 75 -171 63 225 171 -75 -108
3313a08J72k38K99j25k09K28L2l1j05k1j26K57j97M48k24J21l82P9J44k00L60
3334A74Rj19j60L11j8j94J78m3j37r4M7O9J07k31K71l72Q5J44o3j00J51m8L6n5
3358e2MJK8Q9j28m7J28j4q5K07j87J55j93J37R9j71J47j04K7o9j39J34k28J93
3382f8N6N2k16K09J45j03n9pj6j37R4j5m8K37o9%o4R9p2n5j4j06K24q5K3p8J21
3409D8N2j74O6k6j51J70J97k21r2o5K49l2j89M94j66j19j93L4m7K04K1j63p3J23
3433e3j5kJ51q0j14R0M4Q1L04l04K7q8p7J97j4k59L9K17n8j50m33N65q0k45J82
3458g5J53k14J20l1j29L03m10M91n8k08O7r1J08n2J2l44L63j57P7N3k69m4M01
3481F6J0P1J23m32J59O4k70O0J51k90O0K0L10k20J4J96j11j56L79l34J06J58m7
$$ plain form
3313 -108 64 -174 125 0 -209 19 51 20 -85 -106 -232 25 -172 276 52 173 -209 -130 14 -186 174
3334 174 183 64 -96 215 197 3 181 138 1 -93 -46 23 130 -101 170 -202 -117 27 -36 -136 15 -33 3 -52
3358 -52 -48 -47 -19 70 -58 -105 23 9 -76 131 -56 99 -94 43 142 -29 118 14 41 -28 -167 -33 -261 -68
3382 -68 -12 40 -176 33 178 75 16 9 -7 -144 -50 -65 -113 124 55 55 -9 90 18 -37 -51 -157 67 -18 5 -73 48
3409 48 100 -74 -8 -34 -185 -15 182 -39 -131 -196 53 21 -168 326 160 41 -152 -118 -165 39 60 -103 -176 -53
3433 -53 -68 -70 81 1 -113 -23 21 102 406 102 129 41 -36 161 147 -112 -73 144 86 -64 -497 68 -12 -257 -75
3458 -75 78 -136 -16 -47 -176 127 -283 208 150 -58 9 -82 26 -26 -14 -358 5 -152 -75 -22 -291 -335 66
3481 66 76 147 270 -162 -3 61 -209 -149 2 -288 -228 -208 102 -118 -104 92 -19 -175 204 -130 -24 134 87
3504H7P5j26r7j50K07O3J14j87K56l6j49r8J36k1q7K20k29J50m41R1J26L4J52
3527I0R6J59m08J3J76j00n1Mj71J86l5j1p8Q6J88l85M60n1M0k82K43j90K11k36
3551d6m4J46%J18q1j64o7L4M3k46K67n9j58J31k4J44j51K05Q9k77NK1J88J41k73
3576e8J29k31L80k93L3j80K6K21n8l3J69o3k9k4k27O1L48j16q2l0j88L71J57k48
3600C5k50M09m1J56k21p2l3K5J81J96l74j39oK2J32r5J66j39rmJ2j1M1j13J83
3625E1k51M0J43k73L21p8K5n3J00q1j07M86m16k24N64j91j19j43J79J29q3j22
3647a03q2K59k51K49l17K62k01r0L81k06j8M7P4O2N7j3r5m5K3N4j77J60j78J73
3671B5q8N1K8lp5J78J0k77J14J03P7j17j12J14j44l4N4L0J88j54R7QJ2Q7j15j75
$$ plain form
3504 87 162 36 -61 -211 -4 59 173 -14 242 206 57 -41 95 74 -13 207 -22 128 -313 -222 -96 -62 90
3527 90 186 345 -63 -50 126 26 -25 -21 -192 -6 -41 -52 -130 -44 144 -241 219 168 208 -74 169 -21 190 -46
3551 -46 -90 56 56 174 93 -71 -138 -104 -61 -307 -40 -99 -257 -126 -150 -6 -157 48 137 -140 -135 -114 74 215 -58
3576 -58 71 -160 220 -73 -40 -220 -194 27 -31 -64 105 42 13 -11 -238 -177 171 55 -27 -57 -245 126 283 35
3600 35 -215 194 153 309 88 16 -17 8 189 385 11 -128 -134 -112 20 -75 91 -48 -57 -61 -49 -60 -19 -132 51
3625 51 -200 -160 -17 -290 31 -47 -22 -75 25 -56 -163 323 -93 -317 247 56 -63 -206 -27 102 19 -103
3647 -103 -185 74 -177 72 -245 17 -184 -274 107 -99 -117 -70 4 66 123 110 15 -30 -7 47 -130 30 -148 25
3671 25 -63 -12 16 13 -62 116 126 -151 -37 66 143 26 -86 28 -116 -150 -96 -66 122 -32 65 73 85 172 57 -118
3697a18J49Q7qN4l30P5O5J21K57l48k30J64K80m68M13j04o2p2K82k57PJ51m8o3
3721cm1j63J19O5J69j12km8on9O1L8j06J29K79k77l26L76j22J9P7j74J99m7l1
3746A4q6L49l49K86k28k43M10O8k05J56l10j12K99p8j99J11M6J91k32j21L37j57
3768e3P5R1q0n1k94K29k94M12j1p2j25M8M58j04l48J18%n4J98o2J90l12K39m12
3792b14J17l3J86j01J35j47K30K00k22l16N33m0m12M8K75m23KL55k76J22n3j66
3814b00j76M65J17j99j14l3L01l51j59K17J83j15J92J57l71J10J92j16M0mm9j06
3836a9J27L3Q4m34k4R6R2L66j74k06j4N1k42K01J6J69k61NL47l09J14K2k30L04
3860A14k46j40N70j26k19K4k6J36N4l71j0K71l7N2O7j32P9L6k6j03p9K30q0m1
$$ plain form
3697 -118 31 118 110 164 -166 -91 -26 95 352 4 -226 -62 218 -250 163 59 -3 -75 207 -50 -43 108 60 -3
3721 -3 -44 -207 -88 -23 146 34 32 -16 -22 -81 -20 18 -88 41 320 43 -283 93 -29 -10 67 -107 92 45 14
3746 14 -72 277 -72 214 -14 -257 153 221 16 172 -138 -250 49 -29 -228 -117 -71 120 -112 -233 104 -53
3768 -53 22 113 33 -18 -312 -83 -377 35 24 -48 -173 -125 333 229 -119 -1 -1 -55 143 81 271 -41 198 -214
3792 -214 -97 -130 56 -45 90 -57 173 373 151 -165 368 328 -84 -36 239 -184 -182 173 -103 19 -34 -200
3814 -200 -376 89 206 7 -107 -140 161 -190 -349 -132 51 -64 128 285 -86 24 216 100 140 136 87 -19
3836 -19 108 141 225 -209 -233 -137 -45 321 147 -59 -73 -22 -264 -63 -47 122 -139 -134 213 -96 18 40 -190 114
3860 114 -132 -272 298 172 -47 -23 -49 87 141 -230 -240 31 -6 46 113 -19 60 96 70 -33 -112 118 38 -3
3884cJ19J19k40j28J94j7K97l62kJ47j86n1j33N04l03L9qj32J74n8K08l27J03
3907d6J70q8k58J95l1K8P1j16NP4k7J91j23k11K19k57J85j28J83J25o4j02o9J31
3931E7j31q2K33r7L3J12J09l06J50j17K52k89J28J25%j48r8J06j92R9J04J19j10
3954E7m5j71R6j39K26J22m3j64ll07K59J61k4j38Q2m3o7J12l8O0O4l1n0o9P9L16
3980C02m49q7J16J92l2k12J78J11k10R4J00j68j7K79r3k64L2J91p8j60J83m8K16
4003A76j76J06j88JO5J04K4q8O2L32l95j78K13J78q8r2j93L20o9k15J8j84M75
4026B08l13N9j85J16K6k0K68l41K75j00j1J40j54k75N04L7k15M8j9N6j19j16j09
4049b40K40K39j01k27P0J10N7k71J56j18K63q5l4rk83M8J85mJ03j18L7j81K49
$$ plain form
3884 -3 116 235 -5 -133 61 44 341 -21 -23 124 -62 -113 -246 258 -45 -6 -14 -146 28 -30 178 -149 -46
3907 -46 124 36 -222 -27 -58 -30 41 -75 -70 4 -23 168 45 -166 53 -204 -19 -147 36 161 97 -5 -74 57
3931 57 -74 -156 77 -20 13 125 234 -72 78 -39 213 -76 52 177 177 29 -69 37 -155 -56 48 167 57
3954 57 12 -159 -63 -202 24 146 103 -61 -64 -371 -112 49 25 -113 -31 -74 -141 -29 -67 -7 57 26 -24 -93 -14 302
3980 302 -147 -234 -118 74 42 -170 8 119 -91 3 103 -65 -82 197 104 -160 -128 63 -15 -175 8 -40 176
4003 176 0 106 -82 -81 -16 88 112 24 86 418 23 -155 58 236 148 56 -137 183 114 -101 -83 -267 208
4026 208 -105 -46 -231 -115 -89 -109 159 -182 93 -7 -18 122 -32 -307 197 234 19 67 48 104 -15 -131 -240
4049 -240 0 239 138 -89 -19 91 148 -123 33 -85 178 93 59 50 -233 -185 0 -4 99 -19 18 -163 86
4072H6j42K64m73L87j17M7j36J29QR1j8j47N6K0J44j4j71P9m1k10J51J12K2j43
4096a6j16P8K66l90L99j23n5o2J44j02M1k59NO9J39%l4J65K7K1j91n9K9k1p5K52
4122A32k05LJ20n5R4j6J20l58J70J40q1P4j6p7oO6J74l14N2J05J65j45k59P2L2
4147a3k69M01j15rJ37k78J26l65N26k42n5J98K1j73l7J90j81j43L48j24J39J30
4169B12n7n4j21K35k37k5k04K99m9LJ65j91J70k43j19K44J44Nj83J14k06J22J75
4192A99r8k09J00J41j71j31L99l44J57k76L51q9N4p3j43K00k0J09qn2j23Jm6j08
4216a80L14j08m9k6Q6l1J8k25K49K07l06P8n7R5j73J47l14M08J02m47J43J06j13
4239g6K22k67J90k52K50j12J98j64K1PP5p9L8Q5j56L3j27J56qj0J0J1J4j01J88
$$ plain form
4072 86 -56 208 -265 122 5 52 -84 45 53 144 126 -21 35 55 199 185 14 93 52 -158 -7 105 127 -16
4096 -16 -132 -54 212 -178 221 98 43 -19 125 23 64 -195 -190 -121 18 18 -16 149 176 197 6 -53 -24 -45 -120 132
4122 132 -73 -70 50 -5 89 73 193 -165 5 145 64 138 122 45 39 105 279 -35 17 122 287 142 -117 -45 -13
4147 -13 -282 119 4 -5 132 -146 -20 -385 141 -101 -156 42 63 -110 -147 43 -138 -281 67 -57 82 212
4169 212 155 101 -20 215 -22 -47 -251 48 -1 2 167 -24 146 -97 -216 28 172 177 -6 108 -98 24 199
4192 199 101 -108 -8 133 -38 -169 230 -114 43 -233 118 29 83 10 -133 67 47 156 148 96 -27 -26 -72 -180
4216 -180 134 26 -23 -49 37 6 24 -201 48 255 -51 27 -30 65 -108 39 -275 133 235 -212 -69 37 -76
4239 -76 146 -121 69 -183 67 -45 153 -11 10 17 92 13 51 136 -20 13 -114 42 34 24 34 45 59 -42 146
4264A46m8j8j91p7R3pK17nk85K1j15L38P8j68J07j72J00j04J48k1j64r5J38R1
4288Gr9J80j38k11J47J6KL77l17J13j32J7R1LK02l32k3K0jn7L10l38l1Pp5K04
4314e8k13K71j20J27o7q8l3J57M0Q2j52K9j84L12j71J99j25K2n8k5l2J03M5K06
4338B67n03K65J65j88M0J8q9r9J40J21k89J76k23J49Jm6K09j48J13R3M7k24N7
4361E2K2j39j05PNk7L46o9k1N6j87K11j87k22J67n1J81K62k32p9P3n1j55J20o9
4386i2n8O6l0J89n7j56k60M78k18J02r4N2r0J45n6K44P6k05k6m4N6J49j71l39
4410c39J76O9N3K07L9j37l6j82L98l31K50k98qO8M8K22l76K65j96K48j7k04K39
4433A58Rk05j46Q1K91k34o4K5m3J57J21k92K1J59q8J72j97q8LJ83R4j64j1J00
$$ plain form
4264 146 98 80 -111 -188 -95 -102 115 110 -175 -154 -269 69 147 -21 86 -86 14 -90 58 37 -127 -222 -84 7
4288 7 -92 88 -50 -261 -114 -98 -96 281 -36 77 -55 -38 53 56 258 -74 -97 -77 -78 -135 175 -163 -194 -187 -262 -58
4314 -58 -271 0 -120 7 -60 -148 -181 -24 16 98 -54 -25 -209 103 -68 131 6 28 -30 -55 -87 16 61 267
4338 267 -236 29 194 6 46 64 -25 -124 16 137 -152 24 -199 -50 -49 -95 114 -34 79 172 219 -5 52
4361 52 74 -65 -170 -163 -158 -185 161 92 71 127 -60 151 -36 -258 -91 -142 39 301 69 -10 63 12 -143 -23 -92
4386 -92 -150 -84 -114 75 18 -138 -398 80 -138 -36 -130 -78 -168 -23 -79 165 241 36 10 -34 22 171 0 -339
4410 -339 -163 -94 -41 166 205 68 32 -150 248 -83 167 -131 -139 -71 -23 199 -177 88 -108 140 123 -81 158
4433 158 167 -38 -184 -103 188 -46 -110 -85 -128 29 150 -142 -121 38 -50 122 -75 -163 -160 23 117 -47 -58 42
4457D2j14j00l5M0oJ75O0j11k6m6L04j57r2m2K35m86N55j96j63J11j55J84J3o3
4481g3j60K27L1j69M4K76j46j05M0M80j84M9j81l73L20l3j7L7m5j51J68q6R7J43
4505A89l33J17r1K30no6J8n6o9P3N2k0j13K18k72J53j34J32K38l27k9L00j87n0
4529c2k6J02n7j80J65J7J9j09P7q2R1R7L1j57l2J58j12R8J54m03J39j1r1K44L3
4554A33k84M8J47J57j69j09J75J01l70K51J61l09K7j08K67j69J36j79J09lj22
4575a10R3Ll7K6j38R5N7K59j79k84K20P2j64l6K72l94Q6J78J44l54L68p4k25Q8
4599c4J80l11M47m84N2K55Q7k58nm2M1J82M6l00q0L11o4R3j7j02P8J3L0j42K7
4624CO7R6k01J04Q2j31m5k32K38Q3k65M43k17j12J48j73K70P8m81R1K29r0K2j21
$$ plain form
4457 42 -72 -172 -207 -167 -173 2 62 -49 -75 -121 183 26 -66 -108 127 -359 196 0 -163 -52 -207 -23 -10 -73
4481 -73 -233 -6 25 -144 -100 176 30 -75 -35 445 261 310 129 -244 76 43 26 63 18 -133 35 -51 46 189
4505 189 -144 -27 -118 112 107 41 59 3 -66 7 59 39 -74 144 -128 25 -109 23 261 -66 -95 205 18 -32
4529 -32 -58 44 -13 -193 -28 -11 8 -101 -24 -106 -15 82 113 -44 -76 82 -30 68 222 -181 -42 -53 -144 100 133
4554 133 -151 -103 44 201 32 -77 98 199 -171 80 241 -68 -41 -149 118 -51 85 -94 15 12 -110
4575 -110 -17 -14 -51 -25 -163 -68 -11 248 69 -215 5 77 -87 -123 149 -245 -159 19 163 -191 177 103 -122 -34
4599 -34 146 -165 282 -202 -150 105 192 -66 -71 -113 -72 110 156 -144 -224 87 23 116 99 -3 75 88 118 -24 3
4624 3 70 166 -35 69 151 20 -25 -257 -19 64 -201 242 25 -87 61 -112 158 236 -245 -154 75 -15 7 -114
4648a14R9J6J31k95K94k02L0o6j81M25j67m3j95J79q8J20J23l21K48R9l01J56
4670e3J14j79R4l4J25R6k08L9J30l31K79j82J27N7P1k61m6J93J54r8O2k42k9o
4694a28r4J96l4K79k13k0pK55j47n7k9m2K84q8l21m3L05q8m8K18j32mP5k92K34
4719E9m8K42k20M8j65K67j10r6j42L9J76L7J2j77L23l99O8K90k62O2%N1P5m60
4743c30K00J64k20K42j36Q0n3J64O2k33O6r8O9J1L6L2j56N3Q0j23j9M9J9O6L3
4768E8m7j33N2P5j11J03j91N6q3L27q8KL4r0J30j42m8k2J35N3L1k67K5K46j17
4793a2o1j7K26J2k42L02k78J03K4j02J86o3j65j09J25J08nn1k2j29k4J15j55L06
4817G2on7K25j18L24k39j39p0n1L6m3j04L8M11l44k6J17O8l08M23p1Q1l01lK25
$$ plain form
4648 -114 -15 1 132 -163 131 -71 -41 -107 -288 137 -30 -73 -268 -89 -177 -57 66 -255 -7 92 -209 -53
4670 -53 61 -118 -24 -58 67 163 -45 -6 124 -207 72 -110 17 74 145 -116 -162 31 185 87 149 -93 -122 -128
4694 -128 -222 -26 -60 219 6 -14 -21 234 87 30 1 -41 243 155 -166 -209 96 8 -40 178 46 42 117 -175 59
4719 59 11 253 33 81 -84 183 73 -23 -165 -126 50 87 99 -78 245 -154 -86 204 -58 4 4 55 130 -330
4743 -330 -130 34 -186 56 -80 0 -53 111 173 -60 6 -92 -23 -12 24 56 -100 -47 33 -90 -109 -60 -41 25 58
4768 58 11 -122 -70 5 -106 -3 -194 -138 -221 106 18 20 54 -36 94 -48 -96 -118 17 70 101 -166 -141 105 -12
4793 -12 -73 -90 136 148 -94 208 -70 33 57 -45 141 78 -87 -196 -71 37 32 -19 -41 -170 -194 -79 -234 72
4817 72 66 9 234 116 440 201 62 -8 -59 -23 -66 -170 -132 279 -65 -91 26 94 -214 209 138 219 -82 -85 140
4842A40K7k71K20j45n6pk72M46N1m0o4q5J70k4R8l13N4q5K23qr5Q6J0l19M45j90
4868dmJ60j91R7j23Q2P5k76K06J33k28M3qJ76j16J33k07r3J04L39k19l35L05l14
4892b65K36P5j51J03k20K14m2R9j08K6J19j67q7n4N31j42k82k30L11l3J12O7r
4915A03j22K29j89O5r4l4l01M41M6n9l72L68j0j36J53j58j5J80l3l8k00J34O6
4938B4j84K68J18k16R9j83K24j36P8J07J71l75K75k88K5j88K5K29m43L66J06M2
4960A44j40k70M35k6P1K1k85K23Ol21L92l25Q7O6k97J40N1j44K12K5R8l00k4P2
4984h9KQ1l5j65J85m6J67q9j44L10kk09k2J37o8M2Kj26j2N0J24n2K38m59J13p2
5010a39J68N5j71R3J22j27l99L65p2J46k05K8K25N1q9K0J20k87J15k72L65O7l05
$$ plain form
4842 140 167 -104 116 -29 -85 -92 -364 82 133 93 29 -56 114 90 188 -125 -71 -156 67 59 -36 50 60 -259 186 -4
4868 -4 -8 152 -39 58 -65 17 92 -184 22 155 -73 -30 -38 138 22 155 -52 -145 -41 298 79 -256 49 -265
4892 -265 -29 46 -105 -2 -222 -8 -50 49 -59 -33 86 -81 -168 -222 309 167 -115 -345 -34 -67 45 112 103
4915 103 -19 210 21 86 -8 -42 -343 98 144 85 -287 81 71 -65 88 -70 -85 95 62 24 -176 -42 24
4938 24 -160 108 226 10 109 -74 150 14 92 199 370 -5 270 -18 7 -181 -156 73 -370 -4 102 144
4960 144 4 -266 169 143 214 235 -50 173 179 -142 250 -75 12 78 -219 -79 -28 -172 40 65 163 -137 -161 -89
4984 -89 -87 -6 -41 -206 -21 -67 100 11 -133 177 175 -34 -56 81 13 55 57 -69 -81 -31 93 41 279 -180 -67 -139
5010 -139 29 84 -87 6 128 1 -398 -33 -105 41 -164 -136 89 140 51 71 191 -96 19 -253 112 179 -126
5033a26J19R7j19n2K01k28R7J53j52j14J55J32j87j09K81j60J38p6N9q0Q8k50
5055a33L7j36K70k19J42l1J56n7P3q1J1M7r6J61k48K13k80J80M2K1j66M1J46k27
5079a34J28j98OM84l41q4L02m51M1L66m9r0J09J43k96J1O5R3J2N1l86K54k05M7
5103a22K98r1j61K65J3k82km2K79k63j75M13J12k64o1K2r6K55r3J8j0m9L3J09
5127A06j12M6l18J94J58j86K08r3J11j30Q5QK7l04K8O6K88p6q4K3k85K32o4L12
5151B40m59K58j3p4N3j58O9j02L07lj78j43L27l45K72k93J37J36j02K24j19q8
5173e4P1J7L2k27l2L54l32J94J66l42J86j50K11j43K4L5N9J11l67K31j27J21R9
5196A37j30l0j6N3PL1J12l56J22R9Q7j41J0K5j33K39k35K51j70j57K43o1J59j21
$$ plain form
5033 -126 -7 90 -29 -81 120 -108 -11 142 -10 -124 31 163 -24 -133 148 -12 126 50 109 29 117 -133
5055 -133 -96 -232 38 -181 -39 -70 86 29 102 21 32 79 -17 144 -104 109 -171 9 51 72 -94 -53 93 -134
5079 -134 -6 -204 -198 286 -55 -139 163 -288 -247 119 70 -20 89 232 -64 -53 12 105 117 168 -218 36 -169 -122
5103 -122 176 85 -76 189 202 -80 -82 -124 155 -108 -283 130 242 -22 -83 -61 -157 98 5 23 13 -36 -3 106
5127 106 -6 40 -278 -84 74 -112 96 3 114 -16 69 77 104 -200 -172 -106 182 106 22 45 -240 -8 -72 240
5151 240 -219 39 26 -48 5 -153 -84 -186 121 118 -60 -203 124 -221 51 -242 -105 31 -71 153 34 -54
5173 -54 17 34 66 -161 -193 161 -171 23 189 -153 33 -117 94 -49 -25 10 69 180 -187 44 -83 38 137
5196 137 7 -23 -39 14 21 52 164 -192 -70 29 116 -25 -15 10 -123 116 -119 132 -38 -195 48 -13 146 25
5220B5J38m2P6k38k3O9l0K91j53q8l50K41K03k63K44P4l30J31M3r6J77Rk7k16
5244a35K25k43l1L04j46K6j01R3P4k02J96L6j34J07o8J5j04J70k6q7%j25LJ43
5268a0j57K79j30O8j80R7ml55K72J0J15L23n52R6J42N8O0q6j38K05k26J2J51Q8
5292A38j21J3j1k19M11j4j45r7RJ54j10r3K84O9k68p1Pj98J53L1J35N1j86K42
5316A64m7j46j98L37j1J9j25K2k14K60j13J20k35K57r7J02q7K22k63J41k12J49
5338D5r8J51n6O8k10k28J45L85l01%J89j00J12j94r9K21Jk0nj46K83L3k54L06
5362B28k43K38j73j99L57l19N2n5K37l27J92Pr4K14k98J65p8M25k73j56M9k6J12
5385C5j92K82j21j1O5k28jJ18l8J68l2P7j45j9nP7M7pk35J27Q2n9m5K29k54K17
$$ plain form
5220 25 163 121 197 -41 -64 5 -25 266 113 25 -325 -84 119 -144 100 174 -156 -25 18 -78 99 108 81 -135
5244 -135 90 -153 -184 120 -26 0 -101 -8 66 -136 60 96 -38 69 1 16 -88 82 56 -31 -31 -156 -153 -10
5268 -10 -167 112 -18 50 -130 -33 -37 -392 -120 -110 5 328 -224 -128 14 72 132 46 -92 113 -113 -101 50 138
5292 138 17 30 19 -200 211 197 52 -45 -36 118 8 -85 199 268 0 -71 -64 -262 -109 -78 57 108 -78 164
5316 164 117 -29 -227 110 99 118 -7 15 -199 61 -52 68 -167 90 -7 95 8 230 -33 108 -104 45
5338 45 -53 98 42 110 -100 -328 -183 202 -99 -99 90 -10 102 -92 -191 30 31 11 6 -140 143 176 -78 228
5362 228 -15 223 50 -149 208 -111 -59 -114 123 -204 -12 -5 -99 115 -183 -18 -96 329 56 -100 -51 -77 35
5385 35 -157 125 4 -7 58 -170 -171 -53 -91 77 45 122 -23 -42 -47 30 77 70 -165 -38 44 -15 -60 169 -85 132
5411A32n0nJ31q9k4k36J87j09N2p6K29j56J64k61K21R3j34p4n1J8J86j89R3%J25
5436A77J54k16m2k7K1K5j19K15j3j95O0j0k1NJ53l32K00LQ5q0J03m9l16J19K17
5461A17m2J54k02R8l07K61M3j45J34l49P8L34k16k0K4K25q4j0k80R1J52k41J72
5484a3l62N62k98m0M1l7J64O9L4j91rm6K63j27NP7k66J55J92Pk08J4J40k7j36
5509c7J2N4K12m20K38o7M9Qo9l1l86L78QJ4K49j03m10L16m3N1K9k4q5J45o6k04
5535a82K08j30N2K4J34n6j86J66k50N5O2N10k53M0k16r4L5J64j28Q4K33k88j75
5558a91J76J53l77K57J84k61M0l0R2O3p3P0j94M22l14j8m5l2P5J72m09J53P9n1
5582e9J00o5R2O9J1j55J86k16Q5K00l85J32r0l00M52J05j01j94j78K08Q7Q5k30
$$ plain form
5411 132 82 77 208 119 95 -141 46 -63 -11 -87 142 -14 150 -111 110 203 69 -5 -56 -38 148 -41 52 52 177
5436 177 331 115 73 46 67 92 -27 188 175 -20 40 30 9 14 167 -165 35 38 123 43 146 97 -219 -100 117
5461 117 75 229 27 125 -182 79 122 -23 111 -238 -160 174 -42 -62 -38 187 103 93 -187 -96 56 -185 -13
5484 -13 -375 187 -111 -151 -110 -147 17 86 120 -71 -80 -126 137 10 15 92 -174 -19 173 180 -28 -14 126 99 -37
5509 -37 -25 29 241 -179 59 -8 41 49 -20 -51 -437 -59 -51 -37 212 109 -301 15 -28 23 52 28 -57 88 22 -182
5535 -182 26 -104 -52 -28 106 50 -136 30 -220 -165 -103 407 154 194 -22 -116 -81 83 -45 39 272 -16 -191
5558 -191 -15 138 -239 18 202 -59 -19 -49 43 106 33 103 -91 331 17 -1 -46 -78 -3 169 -240 -87 -8 -59
5582 -59 41 -24 68 137 148 -7 179 -37 48 248 -137 -5 -95 -395 57 162 61 -133 -311 -103 -16 69 -161
5605a61R1M7p5K63pL1k99J69K03l34o9K09l1j46K68k51O0j39J64K93m00K75k95
5628a34M86m94P0J2O6o1Q5M0qn0Ok86K61O9r7p4j09K08O0l23J70K17j87J08J93
5653B28k38M3OKk46J21P1q2J46J78j31k33l5J99J78l10qJ81J03j24o1n0N6L09
5677C03l27rJ4j53K43o3J20R7j90J41R1j29l74L02r6j33k16N06p7j17J16O3k24
5700a12J49j03q4K19j70j32K67k21K08J08j87K07K8L7j64j13RK21j47K9j37M0
5722d8J14K5Ql21L36M7j66j55j51L43j35j58L29k0Q5ok92J73jk72K11L02j16q9
5746D3o4J31m6k39J76j06J16Q4k43J36J12M4j48M1L1lJ7r3K49m78k2L20j44J62
5770G6n2K18n10n8K38J61r3j20K23r1J28j94j7J98j80K31k19L3j29J94j18K30
$$ plain form
5605 -161 -70 -23 -98 165 158 189 -110 59 262 -72 -141 68 37 -109 159 -92 -32 -171 -7 286 -114 161 -134
5628 -134 352 -142 -72 -60 6 -55 30 70 62 12 18 -268 -7 62 -35 -109 -218 -10 50 -273 -103 114 -73 35 228
5653 228 -10 33 39 41 -205 -84 -13 -95 51 229 98 -135 -170 29 207 -103 -111 70 173 49 -12 -62 -6 303
5677 303 -24 -33 -19 -172 71 8 128 225 35 176 267 138 -236 66 -30 -163 -379 127 50 -67 49 112 -112
5700 -112 37 -66 -150 69 -101 -233 34 -187 21 129 -58 149 177 214 50 -63 -54 167 20 49 -88 -48
5722 -48 66 91 99 -222 114 161 -5 -160 -311 32 -103 -261 68 48 133 127 -165 8 7 -265 -54 248 132 43
5746 43 -21 110 64 -175 1 -105 11 95 -148 -12 100 144 -4 37 68 65 82 -11 238 -240 -262 58 -86 76
5770 76 24 242 -268 -326 -88 73 -20 -140 83 -8 120 -74 -91 107 -73 158 -61 -28 -157 37 -81 149
5792A49N2j07k25OL34j40J6J11l54K67k37J26o3J4QP9p6O8MJ0Kk64K34n7Nk23
5818b61M63k32N3N4m7K40l85R9L9j07N9K2O2O1j08j79m1L45k89J76j57L00j01
5841F6j10J59j5k2N6j93J18m6J9p6R3K41k32O7l30J95J08k5M3o5j05K23l74J79
5865b6J3L26l98J11K1R3l13P2J80q9m8J29K2q9l9l15K95M4K06l3j73J8J43m15
5889b65L94j8l46J40K68r1k03K25j42O3P5k09J18q0J34l4J54l14K4K46k17M6J66
5912A34o5J5m07N04r6l22K70j66K79l44L22l21J14K05j99K2R4Pk61L48k13Q2o2
5935f0r7j1J75K17j72q9J14l07J09j59J72K23j32K99p8j05j71J07j81K71no0Q1
5958A41k38j63O8P8J12L2l87N26m28L71j42K8M1J4j21J53j51L34p2N4k16k46p6
$$ plain form
5792 149 201 94 -131 -125 209 69 85 196 -158 109 -128 -2 -65 -51 -43 36 -40 28 32 42 44 -220 14 -43 -38 -261
5818 -261 202 -30 23 77 30 270 -115 -16 23 -84 -25 -3 59 120 12 -167 -208 137 -152 24 -133 167 66
5841 66 -44 115 100 78 134 -59 59 13 32 -44 49 290 58 125 -205 -10 98 73 116 51 -54 169 -205 -26
5865 -26 -13 313 -85 26 47 140 -173 -101 79 -10 -58 71 93 4 -35 -350 -55 -11 195 162 -11 7 150 -265
5889 -265 129 111 -235 -95 173 82 -121 104 -38 25 100 -109 9 -71 63 29 183 -131 -107 139 -78 -32 134
5912 134 69 84 -323 181 85 -237 33 -133 146 -198 124 -197 -83 122 -77 -55 39 46 -215 133 -80 2 -60
5935 -60 -157 -168 7 224 52 -37 77 -230 -121 -280 -108 115 -17 282 204 99 -72 35 -146 125 120 60 141
5958 141 -97 -260 -192 -114 -2 30 -357 169 -259 112 -30 -2 39 53 -68 85 -66 268 196 250 34 -212 -288
5981b88M02j39K4N9j89K15l30K56K54j98q1K99l27j19K55k87Q2Q6K55k56L5J82
6003A90m22K40K4o1K60k59J5J11L3j26L2O0O5o9j48o5J58j8R1l1j09n1J50j35
6027f5R2k21K86J82o04K47k6P4L3J40k9q1k2Q1m4J28j36j14j45N11m7k42R0n0
6051C8l8K3j52J62j16J25k72K62j5j66J55o4R2k08R1k5J47o1J66k10k8K45l4k38
6075a21M38m22k32K52P1M6q9L36l04J0J71l39K86j13K10k99L4K62o8k3k22J11
$$ plain form
5981 -288 114 -25 -1 58 -131 84 -246 10 264 66 -15 284 -43 -162 93 -194 -112 -26 229 -27 8 190
6003 190 -232 8 32 -29 231 -28 -13 98 131 5 37 97 162 93 -55 -120 38 20 111 80 -29 -80 70 -65
6027 -65 27 -194 92 274 -330 -83 -109 -35 -2 138 109 28 6 87 43 171 35 -79 -224 287 240 -2 88 38
6051 38 0 23 -129 33 -83 42 -230 32 17 -149 6 -58 34 -174 -83 -108 39 -22 144 -66 -94 151 117 -121
6075 -121 317 -105 -337 -85 -14 32 -57 279 -25 -15 156 -183 103 -10 200 -99 -65 197 129 106 -116 -5
$$ [...]
8191A63
##END NTUPLES=NMR FID
##END=
