##TITLE=1H_SRPR_1
 CDCl3,8 sc, 
 9.02.2021
##JCAMPDX= 6.0         $$ Bruker NMR JCAMP-DX V2.0
##DATA TYPE= NMR FID
##DATA CLASS= NTUPLES
##ORIGIN= UXNMR, Bruker Analytische Messtechnik GmbH
##OWNER= root
$$ XWIN-NMR		Version 3.5
$$ Tue Feb  9 10:18:43 2021 Russian Standard Time (UT+4h)  she@DPX200
##.OBSERVE FREQUENCY= 200.1315066352
##.OBSERVE NUCLEUS= ^1H
##.DELAY= (6, 6)
##.ACQUISITION MODE= SIMULTANEOUS
##.ACQUISITION SCHEME= undefined
##.AVERAGES= 8
##.DIGITISER RES= 18
##SPECTROMETER/DATA SYSTEM= spect
##.PULSE SEQUENCE= zg30
##.SOLVENT NAME= CDCl3
##.SHIFT REFERENCE= (INTERNAL, CDCl3, 0, 15.7039)
##AUDIT TRAIL= $$ (NUMBER, WHEN, WHO, WHERE, WHAT)
$$ ##TITLE= Audit trail, XWIN-NMR		Version 3.5
$$ ##JCAMPDX= 5.01
$$ ##ORIGIN= Bruker BioSpin GmbH
$$ ##OWNER= she
$$ F:/spectra/data/she/nmr/H-F/1/audita.txt
$$ ##AUDIT TRAIL=  $$ (NUMBER, WHEN, WHO, WHERE, WHAT)
(   1,<2021-02-09 10:17:33.98 +0400>,<she>,<DPX200>,
      <created by zg, POWCHK disabled, PULCHK disabled
       configuration hash MD5:
       00 E9 B6 7A A2 85 ED C7 34 08 36 98 17 FE 4E 26
       data hash MD5: 16K
       C9 7B 34 A6 E3 61 F6 44 AE CA AD B9 2A 93 18 10>)
$$ ##END=
$$ 
$$ hash MD5
$$ BA A7 93 61 A0 70 44 74 AC B4 7C E8 B9 5F E1 A8
##$RELAX= 
##$RELAX= 
##$RELAX= 
##$RELAX= 
##$RELAX= 
##$RELAX= 
$$ Bruker specific parameters
$$ --------------------------
##$DU= <F:/spectra>
##$EXPNO= 1
##$NAME= <H-F>
##$PROCNO= 1
##$TYPE= <nmr>
##$USER= <she>
##$AMP= (0..31)
100 100 100 100 100 100 100 100 100 100 100 100 100 100 100 100 100 100 
100 100 100 100 100 100 100 100 100 100 100 100 100 100 
##$AQSEQ= 0
##$AQ_mod= 1
##$AUNM= <au_zg>
##$AUTOPOS= <>
##$BF1= 200.13
##$BF2= 200.13
##$BF3= 200.13
##$BF4= 200.13
##$BF5= 200.13
##$BF6= 200.13
##$BF7= 200.13
##$BF8= 200.13
##$BYTORDA= 1
##$CFDGTYP= 0
##$CFRGTYP= 5
##$CHEMSTR= <none>
##$CNST= (0..31)
1 1 145 1 1 1 1 1 1 1 1 1 1 1 1 1 1 1 1 1 1 1 1 1 1 1 1 1 1 1 1 1 
##$CPDPRG= <>
##$CPDPRG1= <>
##$CPDPRG2= <>
##$CPDPRG3= <>
##$CPDPRG4= <mlev>
##$CPDPRG5= <mlev>
##$CPDPRG6= <mlev>
##$CPDPRG7= <mlev>
##$CPDPRG8= <mlev>
##$CPDPRGB= <>
##$CPDPRGT= <>
##$D= (0..31)
0 1.2 0 0 0 0 0 0 0 0.06 0 0.03 0 0 0 0 0.0002 0 0 0 0 0 0 0 0 0 0 0 0 
0 0 0 
##$DATE= 1612851453
##$DBL= (0..7)
120 120 120 120 120 120 120 120 
##$DBP= (0..7)
150 150 150 150 150 150 150 150 
##$DBP07= 0
##$DBPNAM0= <>
##$DBPNAM1= <>
##$DBPNAM2= <>
##$DBPNAM3= <>
##$DBPNAM4= <>
##$DBPNAM5= <>
##$DBPNAM6= <>
##$DBPNAM7= <>
##$DBPOAL= (0..7)
0.5 0.5 0.5 0.5 0.5 0.5 0.5 0.5 
##$DBPOFFS= (0..7)
0 0 0 0 0 0 0 0 
##$DE= 6
##$DECBNUC= <off>
##$DECIM= 32
##$DECNUC= <off>
##$DECSTAT= 4
##$DIGMOD= 1
##$DIGTYP= 9
##$DL= (0..7)
0 120 120 120 120 120 120 120 
##$DP= (0..7)
150 150 150 150 150 150 150 150 
##$DP07= 0
##$DPNAME0= <>
##$DPNAME1= <>
##$DPNAME2= <>
##$DPNAME3= <>
##$DPNAME4= <>
##$DPNAME5= <>
##$DPNAME6= <>
##$DPNAME7= <>
##$DPOAL= (0..7)
0.5 0.5 0.5 0.5 0.5 0.5 0.5 0.5 
##$DPOFFS= (0..7)
0 0 0 0 0 0 0 0 
##$DQDMODE= 0
##$DR= 18
##$DS= 0
##$DSLIST= <SSSSSSSSSSSSSSS>
$$ [...]
##$SUBNAM2= <"">
##$SUBNAM3= <"">
##$SUBNAM4= <"">
##$SUBNAM5= <"">
##$SUBNAM6= <"">
##$SUBNAM7= <"">
##$SUBNAM8= <"">
##$SUBNAM9= <"">
##$SW= 16.9725356469052
##$SWIBOX= (0..15)
0 0 2 0 0 0 0 0 0 0 0 0 0 0 0 0 
##$SW_h= 3396.73913043478
##$TD= 16384
##$TD0= 1
##$TE= 0
##$TE2= 300
##$TE3= 300
##$TEG= 300
##$TL= (0..7)
0 120 120 120 120 120 120 120 
##$TP= (0..7)
150 150 150 150 150 150 150 150 
##$TP07= 0
##$TPNAME0= <>
##$TPNAME1= <>
##$TPNAME2= <>
##$TPNAME3= <>
##$TPNAME4= <>
##$TPNAME5= <>
##$TPNAME6= <>
##$TPNAME7= <>
##$TPOAL= (0..7)
0.5 0.5 0.5 0.5 0.5 0.5 0.5 0.5 
##$TPOFFS= (0..7)
0 0 0 0 0 0 0 0 
##$TUNHIN= 0
##$TUNHOUT= 0
##$TUNXOUT= 0
##$USERA1= <user>
##$USERA2= <user>
##$USERA3= <user>
##$USERA4= <user>
##$USERA5= <user>
##$V9= 5
##$VALIST= <valist>
##$VCLIST= <CCCCCCCCCCCCCCC>
##$VD= 0
##$VDLIST= <DDDDDDDDDDDDDDD>
##$VPLIST= <PPPPPPPPPPPPPPP>
##$VTLIST= <TTTTTTTTTTTTTTT>
##$WBST= 1024
##$WBSW= 4
##$XGAIN= (0..3)
0 0 0 0 
##$XL= 0
##$YL= 0
##$YMAX_a= 31859
##$YMIN_a= -22076
##$ZGOPTNS= <>
##$ZL1= 120
##$ZL2= 120
##$ZL3= 120
##$ZL4= 120
##$ABSF1= 10
##$ABSF2= 0
##$ABSG= 5
##$ABSL= 3
##$ALPHA= 0
##$AQORDER= 0
##$ASSFAC= 0
##$ASSFACI= 0
##$ASSFACX= 0
##$ASSWID= 0
##$AUNMP= <proc_1d>
##$AZFE= 0.1
##$AZFW= 0.1
##$BCFW= 1
##$BC_mod= 2
##$BYTORDP= 1
##$COROFFS= 0
##$CY= 11.3945322036743
##$DATMOD= 1
##$DC= 2
##$DFILT= <>
##$DTYPP= 0
##$F1P= 15.9154993809931
##$F2P= -4.1035820241983
##$FCOR= 0.5
##$FTSIZE= 0
##$FT_mod= 4
##$GAMMA= 1
##$GB= 0.15
##$INTBC= 1
##$INTSCL= 1
##$ISEN= 128
##$LB= 0.24
##$LEV0= 0
##$LPBIN= 0
##$MAXI= 10000
##$MC2= 0
##$MEAN= 0
##$ME_mod= 0
##$MI= 1.114404
##$NCOEF= 0
##$NC_proc= 0
##$NLEV= 6
##$NOISF1= 3.799351
##$NOISF2= 2.8
##$NSP= 1
##$NTH_PI= 0
##$NZP= 0
##$OFFSET= 15.70392
##$PC= 1
##$PHC0= -10750.62
##$PHC1= 4.800936
##$PH_mod= 1
##$PKNL= yes
##$PPARMOD= 0
##$PSCAL= 0
##$PSIGN= 0
##$REVERSE= no
##$SF= 200.130013532006
##$SI= 16384
##$SIGF1= 3
##$SIGF2= 2
##$SINO= 400
##$SIOLD= 16384
##$SREGLST= <1H.CDCl3>
##$SSB= 0
##$STSI= 0
##$STSR= 0
##$SW_p= 3612.71676300578
##$SYMM= 0
##$S_DEV= 0
##$TDeff= 0
##$TDoff= 0
##$TI= <>
##$TILT= no
##$TM1= 0
##$TM2= 0
##$TOPLEV= 0
##$USERP1= <user>
##$USERP2= <user>
##$USERP3= <user>
##$USERP4= <user>
##$USERP5= <user>
##$WDW= 1
##$XDIM= 8192
##$YMAX_p= 0
##$YMIN_p= 0
$$ End of Bruker specific parameters
$$ ---------------------------------
##NTUPLES= NMR FID
##VAR_NAME=  TIME,          FID/REAL,        FID/IMAG
##SYMBOL=    X,             R,               I
##VAR_TYPE=  INDEPENDENT,   DEPENDENT,       DEPENDENT
##VAR_FORM=  AFFN,          ASDF,            ASDF
##VAR_DIM=   8192,          8192,            8192
##UNITS=     SECONDS,       ARBITRARY UNITS, ARBITRARY UNITS
##FACTOR=    0.0002944,     1,               1
##FIRST=     0,             0,               0
##LAST=      2.4114304,     0,               0
##MIN=       0,             -22076,          0
##MAX=       2.4114304,     31859,           0
$$ Real data points
##PAGE= N=1
##DATA TABLE= (X++(R..R)), XYDATA
0@%%%%%%%%%%%%%%%%%%%%%Lj1J6j6J6j6J6j9K7l2L2l7M5m9N4o1O9p7Q5r5J05j16
43f1J29j43J58j76J95k12K33k58K84l14L47l82M23m70N22n83O56p43Q47r78J149
64F23j381J714k231L156n311J8133J6404k0419Q900j4297p468J6633J594K559
78A8609J3250j6464n602M690q034J0237J0361r766L711l711j1833R466L446l701
92A4659R682p979r744O380m086J708J1227p368m691J081j0759L433R248l570L960
107A3181k896j2373J325M81j265J0490r56p639R78q937k019R376j844K539K286
122B727j0883j992K734l985P605K979o968J664m612m204O876R83l01L211o940
137a1106k983L545k496N323L899n493k91j999l779N764L276p36K815m598m477
$$ plain form
0 0 0 0 0 0 0 0 0 0 0 0 0 0 0 0 0 0 0 0 0 0 0 3 -8 8 -8 8 -8 8 -11 16 -16 16 -21 24 -25 29 -32 37 -40 45 -50 55 -61
43 -61 68 -75 83 -93 102 -110 123 -135 149 -165 182 -200 223 -247 275 -308 348 -395 452 -526 623
64 623 -758 956 -1275 1881 -3430 14703 31107 10688 19588 5291 -2177 14456 16050 18609
78 18609 31859 15395 9793 14483 6449 16686 27047 17281 20992 17281 5448 14914 18360 14659
92 14659 24341 16362 6618 12998 8912 10620 21847 14479 9788 10869 110 3543 12791 9221 13181
107 13181 10285 -2088 -763 -282 -1547 8943 7987 348 1326 -7611 -9630 -254 -2098 441 2727
122 2727 -8156 -10148 -7414 -11399 -3794 -815 -7783 -6119 -10731 -14935 -8059 -7076 -7377 -4166 -11106
137 -11106 -14089 -10544 -13040 -7717 -3818 -9311 -9602 -11601 -15380 -9616 -6340 -7076 -4261 -8859 -13336
152a3336L150RL016N079k908j758j216l566L359M882k72K443k418m289J798L32
168e695K082N120j767k300K05l421K333M727m51K264j055m814R34J679J130M813
184E784m09l025J2l108J133M917L12J678m20m774J20J496L57M947P05l627J77
201F275k971l58M639J369M80N96m401j563J671j07L917J304k726n96k689j412
217C428L698J663l28J124m028l047J876k84K240K415k471k226j388k481K337K428
233D956o74M74k602m032P12L55J065K779j447l177j408k483J101L107j98n5j376
250b903l465r41J221k06L176J47l963o94j424k42K761J078j37J87l603p55J851
267g912l15L313m4k133l28j662m27L269J571j9M56k680j385J812J241K600J550
$$ plain form
152 -13336 -10186 -10177 -7161 -2082 -4990 -6748 -7964 -11530 -8171 -3289 -3561 -1118 -3536 -7825 -6027 -5695
168 -5695 -3613 1507 -260 -2560 -2355 -5776 -3443 1284 833 3097 2042 -2772 -1838 -159 971 5784
184 5784 5375 2350 2362 -746 387 5304 5616 7294 6874 2100 2220 3716 4073 9020 9725 6098 6275
201 6275 3304 2946 7585 8954 9434 10030 5629 4066 5737 5630 9547 10851 8125 7529 4840 3428
217 3428 7126 8789 8461 9585 5557 2510 4386 4102 6342 8757 6286 4060 2672 191 2528 4956
233 4956 4282 4756 2154 -1878 -1166 -811 254 3033 1586 -1591 -2999 -5482 -4381 -1274 -1472 -1527 -2903
250 -2903 -6368 -7309 -6088 -6294 -3118 -2971 -6934 -7628 -9052 -9294 -6533 -5455 -5592 -5405 -9008 -9763 -7912
267 -7912 -8227 -4914 -4958 -7091 -7419 -9081 -9508 -6239 -4668 -4687 -4231 -6911 -8296 -6484 -5243 -2643 -1093
284a093j819j194p82j87K503K779M96j4j892j607R91J861K138J890q36j830o49
301G55m64J944K965N00j48j378k071N45J382J838J621j51k194j298l35Q16K405
318F732Q70j50j256j933j138J364J521J326Q9k133j553j316O63J936J013l09j533
335D193j942j069M14J642J084q7j404k144j247Q09R64J322M39j787j640j264R6
352a621J036J872m48o75k014j457N08J042J550M22j134k143p45m36J600J411n3
369a285m66j506j268J73R60J626P87q85k147q55n70J147K222L00p33q37j354n16
387e207J741P82M77Q19k846L20p13KK730K77q4j153p81j111J551J379P32Q21j441
406a705j679Q03j70J438J458n66j021j26j216J623J328O85J014j305j478J06K59
$$ plain form
284 -1093 -2912 -4106 -4888 -5075 -2572 207 703 689 -1203 -2810 -1819 42 2180 4070 3234 1404 755
301 755 291 2235 5200 5700 5552 4174 2103 2648 4030 5868 7489 7338 5144 3846 3511 4327 6732
318 6732 7602 7452 6196 4263 3125 4489 6010 7336 7425 5292 3739 2423 3086 5022 6035 5726 4193
335 4193 2251 1182 1596 3238 4322 4235 2831 687 -560 249 1213 2535 2974 1187 -453 -1717 -1621
352 -1621 -585 1287 839 164 -1850 -3307 -2799 -1757 -207 215 -919 -3062 -3807 -4243 -2643 -1232 -1285
369 -1285 -1751 -3257 -4525 -4352 -3392 -1766 -979 -1864 -4011 -4866 -5436 -4289 -2067 -1767 -2500 -3337 -4691 -5207
387 -5207 -3466 -2684 -2207 -1388 -4234 -3914 -4627 -4625 -1895 -1618 -1702 -2855 -3636 -4747 -3196 -1817 -1085 -264 -1705
406 -1705 -3384 -2581 -2751 -1313 145 -421 -1442 -1568 -2784 -1161 167 852 1866 561 -917 -811 -552
423e52J870J856n12k07j025j524J475P88N67J337j36k125j28J28J532J499k83
440D560k63r2j819L33J562P3J273n86j376j412J006o0J579N74j177k43j563m06
458A963J271N53M05k74j828q48m1j26J155O16j053o40j286j238J670K28R7K58
476H82j983j287N6o4J040P17r37p90o60j448J082Q11k29K86p76j333ro7O99J324
496b686o60n87m38q80M85J340r9M63k82j302M13L03K34J630J79j175k10n50N87
515c235J722L43L44J41j176j84Q84L08J664K60j067N4m90j42J858L03K97L15j592
534F07j98Q31l8J507L36q11l83l25m19J589L22K47L07j171j004M23N68L93J191
553C972j069m77n48r86J074J119l4K21r23j391K72O24M77M12j21j053l36j235
$$ plain form
423 -552 1318 3174 2662 2455 1430 -94 1381 2169 2736 4073 3937 1812 1684 1812 3344 4843 4560
440 4560 4297 4205 2386 2719 4281 4354 5627 5041 3665 2253 3259 3199 4778 5352 4175 3932 2369 1963
458 1963 3234 3787 4192 3918 2090 1242 1201 1075 2230 2846 1793 1153 -133 -1371 299 527 624 882
476 882 -1101 -2388 -2332 -2396 -1356 -639 -1576 -2366 -3026 -4474 -3392 -2581 -2810 -2524 -3300 -4633 -4642 -4709 -4010 -2686
496 -2686 -3346 -3933 -4371 -5251 -4766 -3426 -3525 -3062 -3344 -4646 -4233 -3930 -3696 -2066 -1887 -3062 -3272 -3822 -3235
515 -3235 -1513 -1170 -826 -685 -1861 -2045 -1161 -853 811 1071 4 58 -432 -574 1284 1587 1884 2199 607
534 607 409 1240 1202 2709 3045 2234 1851 1526 1107 2696 3018 3265 3572 2401 1397 1820 2388 2781 3972
553 3972 2903 2426 1878 892 1966 3085 3051 3272 2349 958 1230 1854 2331 2743 2622 1569 1233 -2
571bL32J311K25N7n45j576m0P86L3J308l18j317m30m94n1J448L89n68P1j612l00
592a293P71l4J073K22j124n60n88m23J635L78n11K31j530m83N97L07P73M37j284
611a406m02l53o30J203L90j95K29j094p27M81J33N89J006j049q94L3m32P01J181
630a236m07J13k2j662J66R72K84Q77l9j188n8j71M95J092L15k2j47r07K2R17M17
651a89R44J23r37k94j8Q6J281N27k4j21n84r2Q10J44L90P06p51k04j91r8J050
672B558Q00q6l04q01m60P65K55M70N00p92q07R5n17R02O27j28m59m62q43j4N31
693A830K88M61o02r56l07l39M93N31k40m45o43q19R4O72m9L96o63o94m43j49J77
714a407M24K49o99o0j018J90L86L33L01k09q40j19j09j04R54L10m13Rq90k39O90
$$ plain form
571 -2 330 1641 1866 1923 1378 -198 -238 548 581 1889 1571 254 -176 -670 -721 727 1116 548 619 -993 -1293
592 -1293 -522 -556 517 739 -385 -945 -1533 -1956 -321 57 -454 -223 -1753 -2236 -1639 -1332 -559 -122 -1406
611 -1406 -1808 -2161 -2791 -1588 -1198 -1393 -1164 -2258 -2985 -2504 -2371 -1782 -776 -1825 -2719 -2686 -3118 -2417 -1236
630 -1236 -1643 -1530 -1552 -3214 -3048 -2076 -1792 -915 -954 -2142 -2200 -2371 -1876 -784 -469 -491 -638 -1545 -1523 -606 -189
651 -189 755 878 -59 -353 -371 -285 996 1523 1499 1378 794 702 1512 1656 2046 2752 2001 1797 1606 1508 2558
672 2558 3358 3272 2968 2167 1707 2472 2727 3197 3697 2905 2098 2193 1676 2578 3205 3077 2618 2156 1313 1299 1830
693 1830 2118 2579 1977 1021 714 375 868 1399 1159 714 71 -748 -654 18 -31 365 -298 -992 -1435 -1584 -1407
714 -1407 -983 -734 -1433 -1493 -2511 -2321 -1935 -1602 -1301 -1510 -2350 -2469 -2578 -2682 -1728 -1418 -1831 -1822 -2712 -2951 -2261
735b261N88K20K38p12m43J45M38M96L85Rl77l13k23M05O85K96L92m42m43M8J37
756g32N58O15L6k7o70m27M67N46L12R6J6o20j29J65L45Q62q5l06l91m27K31L93
778H28K77L03k26l70l50k2L75N27M06n06m57l57R0N10L98J51p2o52k93j69N04
799H95L62M98l11n16m32q9O02K38J76lm23m09K1L4O47L47o26j41k07l57K43O38
821A187q8K9k94m30n69J97O55J57m3k98n89m58M83Q2P10l96k22j040j65K70J86
842f36M45j00l50n14l09j67L21O38j22o44j83m66l4M54K01m4k15l42l11J14K54
863b010P53lk13m55j86j60N55K68L76j92l02k9n9J10O63K80L06n26j70M3K89M68
885a94M07M05m44n79J88M35L94L48k8M8j38k15L36O04l1M89o10n12K79M97M9K82
$$ plain form
735 -2261 -1673 -1453 -1215 -1927 -2370 -2225 -1787 -1291 -906 -897 -1274 -1587 -1810 -1405 -720 -424 -32 -474 -917 -869 -732
756 -732 -174 441 477 450 -220 -647 -180 366 678 774 790 170 41 206 551 1413 1328 1022 631 204 435 828
778 828 1105 1408 1182 812 462 440 815 1342 1748 1242 785 428 518 1028 1426 1577 1505 853 560 391 895
799 895 1257 1755 1444 928 496 407 1009 1247 1423 1420 997 588 609 643 1290 1637 1011 870 663 306 549 1187
821 1187 1099 1128 834 404 -165 32 687 844 801 503 -86 -544 -61 21 731 335 113 -927 -1092 -822 -636
842 -636 -191 -291 -641 -1155 -1464 -1631 -1310 -672 -794 -1438 -1621 -2087 -2121 -1667 -1466 -1510 -1725 -2067 -2378 -2264 -2010
863 -2010 -1257 -1260 -1473 -1928 -2114 -2274 -1719 -1451 -1075 -1267 -1569 -1598 -1657 -1547 -884 -604 -298 -824 -994 -951 -662 -194
885 -194 213 618 174 -405 -217 218 612 960 932 980 842 627 963 1567 1536 2025 1415 903 1182 1679 1728 2010
907B010J24o44J16p64P63O14m47P80p68k20n56K46N13j45R5k87O6j34J6j09l65
928I04K67N80j259m44J99N13m1K77o12k60p00k07M72L45L0l77k05l77k00K51J32
949g12L38k35l93M0n04K60L65j4J74j01n87rL21K11p0L17l56k99J47RM12J30j4
972e70j11m05j77M18j49O59J78n98k4l04J18O11K95l31J83l02p7K17K3L47J06
993A07m86J03l11J13K92K51n9L7n57J8k8L05M44R7k24m51J5j40K87M14R9j48q
1016A70l27o8L10L23J96j21m12M5l37N76O42n66L90P6o17L9J59K4N36Q1m94p9
1038E46O2K26J62Q1P2k66k16k82K72L25N69k20m32J13k05J86M90o26K51k37j69
1059G02m83k40N92J72j64O8k27r43L00M81Q6m03K78n69pK97l0q71J2P25k47l31
$$ plain form
907 2010 2134 1490 1606 842 1605 2219 1772 2552 1784 1564 1008 1254 1767 1622 1717 1430 1496 1362 1378 1269 904
928 904 1171 1751 492 48 247 760 719 996 384 124 -576 -783 -311 34 64 -313 -518 -895 -1095 -844 -712
949 -712 -374 -609 -1002 -962 -1466 -1206 -841 -855 -681 -782 -1369 -1378 -1057 -846 -916 -599 -955 -1254 -1107 -1098 -686 -556 -570
972 -570 -681 -1086 -1263 -845 -994 -335 -157 -755 -779 -1083 -965 -354 -59 -390 -207 -509 -586 -369 -346 1 107
993 107 -379 -276 -587 -474 -182 69 10 47 -510 -492 -520 -215 229 326 102 -349 -334 -474 -187 227 326 178 170
1016 170 -157 -225 85 408 604 483 71 116 -221 355 997 431 821 897 280 319 478 502 1038 1119 625 546
1038 546 608 834 996 1077 1149 883 667 385 657 982 1551 1331 899 1012 807 993 1483 857 1108 871 702
1059 702 219 -21 571 743 579 647 420 -523 -223 258 344 -59 219 -350 -357 -60 -90 -961 -949 -224 -471 -802
1081h02o9K50k2k86J9n03k27q9M26J69m05J27j51r4l03M70P12J60n07k40k1k37
1103a623N85J62R0q6m77%J30L19O67k98o3J7P8L75n74R51j3O9o3j24J04L28j41
1126D13M23j35k53p4o4M68l49L15L64j78K08l28j22Q05q27J38oN4j90K27J19j30
1148H78rR5j56n73N29l09N13j61K96l48k48k39L75k08k95M20J61j046L77k01L20
1169A71J5Nj52j9n07N77m90M21K66n89l34J99k1K30J94j35Q1k32j19l09P78r2
1191f2J56p51J41L41k56K60K17j17k49m2j32Q6J49%J73l27R5R6k86M0M71l10M9
1214b58k07p0k62K90K19j57Q5j32k28O4J97oj0j29K1L5j5mJ71NQ6j38j17j43K66
1239d37L00k7k90K1r0J28J76N4K29J23j63m12K65M12j3j45O8l0J8O8N64k36nM6
$$ plain form
1081 -802 -871 -621 -643 -929 -910 -1413 -1640 -1729 -1303 -1134 -1539 -1412 -1563 -1657 -1960 -1490 -778 -618 -1125 -1365 -1386 -1623
1103 -1623 -1038 -876 -786 -872 -1349 -1349 -1219 -900 -233 -531 -594 -577 -499 -124 -698 253 240 309 246 122 226 554 413
1126 413 836 701 448 374 310 778 429 744 1108 930 1138 810 688 1493 666 804 798 852 662 889 1008 878
1148 878 869 964 808 235 764 455 968 807 1103 755 507 268 643 435 140 560 721 -325 52 -149 171
1169 171 186 191 39 20 -487 90 -400 21 287 -302 -636 -437 -458 -228 -34 -169 -88 -320 -439 -748 30 -62
1191 -62 94 -657 -516 -175 -431 -171 46 -71 -320 -362 -494 -408 -259 -259 -86 -413 -318 -222 -508 -468 3 -307 -258
1214 -258 -465 -535 -797 -507 -288 -445 -360 -492 -720 -656 -459 -465 -475 -604 -583 -548 -563 -567 -396 -391 -305 -443 -560 -703 -437
1239 -437 -137 -164 -454 -433 -523 -395 -219 -165 64 187 24 -388 -123 289 276 131 199 169 187 255 819 583 578 624
1263F24l18R7o1M61q7J44m8j39K62j67L93l17J51J6L03m34o9j6K05K49m91K0R5
1286H73p4p1K65j21j2o0l54j76K62k23J06j15m9k63K5m4o5l0j71K98l30k97Q0
1309e46J06j83p6J28k69j14K16M5j12j28J88m24N9J43J81J40kk45ro9K0K44j55
1332h62K19j35N5j66O6J9K93j28J07QR4Q1K10m4K28n2j15J82n2J14k2K98%J11
1356E09k79j92L46L3M3K27l16N4R9l98K07L13K2j63J97k17j19L51l49K61O5l05
1378C89m8o6K37J13k36L5qN7l74J96O3n6Oj28p8J05mj86K6J32o4m3m9j56K52N8
1404A73j25J9l5j20K88k13J40K24k14Q3m5J7j84J00o6pP4j75M2J67L33m09J21
1427A88j57M8j62lK58O5k43j97K68k40K05M5l28M7j15q3K44l15J2PK04k94l6p7
$$ plain form
1263 624 306 403 342 803 716 860 812 673 935 768 1161 844 995 1011 1314 880 811 795 1000 1249 758 778 873
1286 873 799 728 993 872 860 800 446 270 532 309 415 300 251 -12 13 -31 -96 -126 -297 1 -329 -626 -546
1309 -546 -440 -623 -699 -571 -840 -954 -738 -693 -805 -933 -745 -1169 -1110 -967 -786 -646 -648 -893 -902 -971 -951 -707 -862
1332 -862 -643 -778 -723 -889 -823 -804 -511 -639 -532 -524 -430 -349 -139 -183 45 -7 -122 60 8 122 100 398 398 509
1356 509 230 38 384 417 460 687 371 425 524 126 333 646 668 505 702 485 366 717 368 629 694 389
1378 389 341 275 512 625 389 424 416 473 99 295 358 302 308 180 102 207 203 17 43 175 111 68 19 -137 115 173
1404 173 48 67 32 -88 200 -13 127 351 137 220 175 192 8 108 42 35 109 -66 -24 143 476 67 188
1427 188 31 79 -83 -86 172 237 -6 -203 65 -175 30 75 -253 -206 -321 -404 -160 -475 -463 -456 -252 -546 -582 -659
1451f59kP6K18j60k47P3q9nJ30%J30k09r8J21l0K5P5J5j34K12j25L14P6j15J09
1476b99p2Q7nk22K96J60q0N7kK77k31K48n3K73j00k30K61j28M02j59O6R9J12J31
1500H88q9Oo1J43m3R0l06N6M35j14N1l45J71K0L4j28R4j76k01J93j18P8r3k13
1524C72J68j62j09p9J41j3l50J04j24M1j14O6n9l74J24J15m3k60j55M35l57K08
1546d25j84J5J1m7k15K10J37j54j07J10J65j81J2J47N3n0p6J0n9L05k09L0K71
1569b31J23k03k5k8M8K11j49j24J93J62o0r1J86K8mj9K9j54M65l69M9J21j98J55
1593A15J0k39J77nj22K23L0n5j32J21n8JL0J29K0N4p4l34K64j91M34l25k8J94
1617B39m0j40M29n07J28J22J50l86M67k28O5k27L06K40k72j8J07j92L3O9j23K74
$$ plain form
1451 -659 -661 -585 -367 -527 -774 -701 -790 -795 -665 -665 -535 -744 -842 -721 -751 -726 -651 -636 -770 -558 -683 -369 -293 -408 -299
1476 -299 -371 -284 -289 -511 -215 -55 -135 -78 -80 197 -34 214 161 434 334 104 365 237 639 480 546 645 757 888
1500 888 799 805 744 887 844 934 628 684 1119 1005 1056 711 882 902 936 808 902 726 525 718 600 678 585 372
1524 372 540 378 269 190 331 318 -32 72 -52 -11 -125 -59 -118 -492 -368 -253 -296 -556 -711 -276 -633 -425
1546 -425 -609 -594 -583 -630 -845 -635 -498 -652 -759 -649 -484 -665 -653 -506 -453 -503 -579 -569 -628 -323 -532 -502 -231
1569 -231 -108 -311 -336 -364 -316 -105 -254 -378 -185 -23 -83 -174 12 40 36 17 46 -108 357 -12 37 158 -40 115
1593 115 125 -114 63 58 -64 159 189 134 2 123 65 66 96 225 245 299 225 -109 155 -36 398 73 45 239
1617 239 199 59 488 -19 109 231 381 -5 462 234 299 72 378 618 346 328 435 243 276 345 222 496
1639D96N4k34O1k4Q8J36l56J35j3j5o7R7k18M1K35K01m39M6J66m09J22K15l67
1662d9l7P5p0j12O5p8J44l19lr9J12K53k60q0r0J94k22J99j38k77k3K3K26Kr6
1687f60r7J23p2o8J4k3K73j30k0J53k56K3L80n8l42K57K21O8k26N7J34P2nJ60
1711b2m3K85k82J41L72k58j21N7Q5K54O3j86L3J18P6J94j24M3k11K41j39P7N7
1734G10o5k3J59Rj0k41J30Rk69J89l0l3P8P6m26K58N6k02q9J61k57Q3N0j53J27
1759B97p0k45q0K52k01k45L24l01J51k30P6q7K47R0l47n6l2J62p5q3K60j82O7
1782c08k15O2rM97p45J37M99l78O5M5K48Nj13r8R0j48NK73L5j20k5j35J26m1o
1807b54K48Q7k59N0J53l5r8R0j5j92Ol05K97K18j78p7J36K14j0k08j16K75j07
$$ plain form
1639 496 550 316 377 353 441 577 221 356 343 328 261 358 140 181 416 617 178 224 390 -19 103 318 -49
1662 -49 -86 -11 -81 -193 -128 -206 -62 -381 -384 -483 -371 -118 -378 -458 -548 -354 -576 -377 -515 -792 -815 -792 -566 -564 -660
1687 -660 -757 -634 -706 -774 -760 -783 -510 -640 -660 -507 -763 -740 -360 -418 -760 -503 -282 -214 -440 -383 -249 -177 -182 -22
1711 -22 -65 220 -62 79 451 193 72 129 214 468 531 345 378 496 572 766 642 685 474 715 576 653 710
1734 710 645 622 781 790 780 539 669 678 409 598 568 535 613 689 263 521 577 375 286 447 190 273 323 170 297
1759 297 227 -18 -98 154 -47 -292 32 -269 -118 -348 -272 -359 -112 -22 -369 -425 -457 -295 -370 -453 -193 -375 -308
1782 -308 -523 -461 -470 27 -718 -581 -82 -460 -395 -350 -102 -97 -210 -308 -218 -366 -361 -88 -53 -173 -198 -333 -207 -248 -254
1807 -254 -6 81 -178 -128 25 -10 -108 -18 -33 -225 -219 -524 -227 -9 -187 -264 -128 86 76 -132 -248 27 -80
1830h0K46k37r8R9O0j30P8j07J38j78M6O2M7J02o1k34K95K49l10R3K99l89K13
1853B03qo4J69p1R5j72J85J0K34l49o3J83K36q8j77lJ4m1K89j88L1L28j45m35
1877A73L42p5q3o5J98j59j90J81O2j7j13k42K00k18J95j2L6l32j27M55l05j8k19
1900c33m5J14r2k30p6J94J20J72k98j6J37j04K23k16p5k07L70k53Pj3q3j38K40
1923f02p0l20M41K1K09k28J12j26R3OQ4K49l59K65LlP0o0n4L2L80lj59P0K37M1
1949C29N2j1q2n3l7N6K26j02J54j02m3o8K01l43J36L31p9m03L78M7j06p7pL5J01
1974E33k15m3J48k53L0K35j13k46L65m33j3p9J41k88J81k1K73l27O9J03o7K37
1996B17k64l28K43j70L86k55K5L43j086J178l19l65M91j63j24J31P83o91l66m98
$$ plain form
1830 -80 166 -71 -169 -70 -10 -140 -62 -169 -31 -209 -163 -101 -54 48 -13 -247 48 297 -13 80 379 -10 203
1853 203 195 131 300 229 324 152 337 347 581 232 169 352 588 500 323 320 334 293 582 394 425 753 608 173
1877 173 515 440 357 292 490 331 141 322 384 367 254 12 212 -6 189 177 213 -119 -246 209 -96 -114 -333
1900 -333 -378 -264 -356 -586 -662 -468 -348 -176 -474 -490 -353 -457 -234 -450 -525 -732 -362 -615 -608 -621 -704 -842 -602
1923 -602 -672 -992 -551 -530 -321 -549 -437 -563 -470 -464 -380 -131 -490 -225 -222 -225 -155 -215 -269 -237 143 140 -19 51 288 329
1949 329 381 370 288 235 198 254 480 378 532 430 387 319 520 177 313 644 565 162 540 587 481 404 397 432 533
1974 533 318 275 423 170 200 435 322 76 441 8 -5 -84 57 -231 -50 -71 202 -125 -56 47 -20 217
1996 217 -47 -375 -132 -302 84 -171 -146 197 -889 289 -30 -395 96 -67 -191 -60 723 32 -334 -832
2016h32L34J432q38Jn24Q58r62M33n4J298r4j042j029L08Q33l43P16o91j22O20
2036C02o2n17j75O55q25R88l11j47P0l76m6J99l7l73K15j20m0Q68M88n37p67K75
2058b73J25p6K28m70p3M80Q4lk16r2K48RR6j69J22r7K72k61J96j62K12p1R2q1
2082A20n8O6O2n6L20Lq6K78m03M54j68o0Jj53k1J79K20k06K22j10j72r7M9J90
2106E74k13J04L3j26R5J16q7k68j94M34j31l01j59J18J12K4l4J39l14k33K16r2
2128a87L6R2j81Pmk05K11j86j66K03r4J22J78k77N3j79J50J55j96n8n5K37J07
2151b37j05J02k7r2k7Q3J08j53L19p1m16K53kk0K7K14j60L2K73M6p5Q6J5k40J27
2176F0O4n6j9J89K4P6l88K41J12n3L9k7q6j67K55J49j16qJ35m7l81L14J7o8p4
$$ plain form
2016 -832 -498 934 96 97 -427 431 -531 -98 -152 1146 1052 10 -1019 -711 122 -221 495 -196 -318 302
2036 302 240 -277 -452 203 -622 366 55 -92 -22 -398 -444 -245 -282 -655 -440 -560 -600 268 756 219 -548 -273
2058 -273 -148 -224 4 -466 -539 -59 25 22 -194 -286 -38 -29 67 -102 20 -77 195 -66 130 -32 180 109 201 120
2082 120 62 128 190 134 454 457 371 649 246 700 532 472 473 320 299 478 698 492 714 604 432 335 384 574
2106 574 361 465 498 372 467 583 496 228 34 468 337 36 -123 -5 107 131 97 236 -78 -311 -95 -187
2128 -187 -151 -59 -240 -233 -237 -442 -231 -417 -583 -380 -474 -352 -174 -451 -398 -577 -427 -272 -468 -526 -581 -344 -237
2151 -237 -342 -240 -267 -359 -386 -303 -195 -348 -29 -100 -516 -263 -265 -285 -258 -44 -204 -172 101 147 72 158 173 -67 60
2176 60 124 68 49 238 262 338 -50 191 303 250 289 262 176 9 264 413 297 289 424 377 -4 310 327 259 185
2201A85l10K69j01K61j21l67L32m2mK46k55m9j11J06K90l32J41j01j81J14m0J23
2223E3n4j41K40J82m96L16k02j35J15J59j44M25k94K82k38j23J10J19j74RR4Q1
2245A84mLj72l4K53k51K74l81L06p1j02K75k03j90M2r5Q2J80j52l1n2K80l8J09
2269B12p30K15M21l11l72J394j311J23J11kj69R1K87m05L32k6p0J15m46K57r6
2290c80L78l07p8K74j2l2M0M9p2Jq1K58j45L74k88J17j11K16j94J25P0K5j0jj73
2315D3l1L80n9o0Q3o6J51k60j47K1m0J16L64k61K33K01N84o23n52M07j04m50P95
2338G25p23L48q5J05o15N87O7n09K1K21Ol37L13k06Nj99O9j36N42j68j67L1j63
2361b68J68p7j01K28j48l86N77l70J0j95K18Q4q8m4J44O7r6J57j02k02QJ98L51
$$ plain form
2201 185 -125 144 43 304 183 -184 148 106 102 348 93 44 -67 39 329 -3 138 37 -144 -30 -70 53
2223 53 -1 -142 98 280 -216 100 -102 -237 -122 37 -107 318 24 306 68 -55 55 174 0 9 103 184
2245 184 180 183 11 -23 230 -21 253 -128 178 107 5 280 77 -113 -71 -166 -84 96 -56 -87 -139 141 103 212
2269 212 -518 -303 118 -193 -565 829 -482 -359 -248 -250 -419 -328 -41 -446 -114 -140 -210 -95 -541 -284 -380
2290 -380 -2 -309 -387 -113 -125 -157 -117 -68 -140 -139 -220 38 -107 267 -21 96 -15 201 7 132 202 227 217 216 43
2315 43 12 392 333 273 356 290 441 181 34 55 15 131 495 234 467 668 1252 629 77 484 380 -70 725
2338 725 2 350 265 370 -245 342 409 -100 -79 142 148 -189 124 -82 -77 -276 -207 -343 199 31 -136 -105 -268
2361 -268 -100 -177 -278 -50 -198 -584 -7 -377 -367 -562 -344 -260 -348 -392 -248 -181 -277 -120 -222 -424 -416 -218 133
2384A33o55R05n25m15M79L19m28K02L21o54R39n41K81l8n05O38q71M6N91j05q4
2405C3K55l53J78j11o0N9L51j33q6j0L63j29l49p5L17m40J31M86k2j44j36L24
2427D49k28k11J46o6p4oP8k73o5m2J79K67q8j89K32j44K68k62j08k5MM49j87o1
2451D3M2P0K6j67J71m74M9o3K34M17%m6j55K1p3K75l08k43L00k50K68J12m47K79
2475H1M04k23jo2p4J8l55K69l31N29q7m35L76m49J05n5L69k38K21k32j22M23m45
2498c14L30j5l66r3M03j19K70m63N69l51R5m66K04O5j41J11j72Q4K81l03L21j74
2520b44J83m16K18j1K24l40Q1L35n3m08K77j40K13J40j94rk6j23J44O74m58N60
2542F27m95N08q81kQ93p18J68J26L41k44N87k22n2k64l37l6L26R8K23n06k82K59
$$ plain form
2384 133 -522 383 -142 -557 -78 241 -187 15 336 -318 621 80 361 323 -182 456 -415 -369 222 117 33
2405 33 288 -65 113 2 -58 1 352 219 133 123 486 357 8 -67 250 -190 -59 427 405 261 125 449
2427 449 221 10 156 90 16 10 88 -185 -250 -292 -113 154 66 -123 109 -35 233 -29 -137 -162 -158 291 104 43
2451 43 85 155 181 14 185 -289 -240 -303 -69 348 348 302 147 168 95 370 62 -181 119 -131 137 249 -198 81
2475 81 485 262 261 199 125 143 -212 57 -274 255 168 -267 109 -340 -235 -290 79 -159 62 -170 -292 131 -314
2498 -314 16 1 -365 -458 -55 -174 96 -367 202 -149 -54 -520 -316 -251 -392 -281 -453 -369 -88 -391 -70 -244
2520 -244 -61 -477 -259 -270 -46 -386 -305 30 -23 -431 -154 -294 -81 59 -135 -144 -170 -293 -149 525 67 627
2542 627 132 640 -241 -243 650 -68 100 226 567 323 910 688 636 372 35 -1 325 423 646 140 -142 117
2564A17J63O3m75J636p74p07l74N2L67l25j80J22L38j32j8j48K13m98K72K86n27
2585e29K60O55p49J07k48M02l43J55m11P12j56j56M49m26nQ00j085L12l0k29R41
2606D26m46N51o94m00L97L10m44M9K25l42m3P51k54k58M83n64k11N50k50R46o68
2627A14L18l30J6m09L82J31j56k11J339k266P43J598m86j060L34K2k60J04N4l72
2647c95N39k00N70p73L71R71j943J009k62M48n21N7N19m0j269R91o64M4j99O90
2667e7k58N30n0m89o71R20N61k33n37p7n15J334p03k85R26n34k71Q42l89o14K39
2688c31o6J250j121l8q62J713q85N47J67p00J721p46m58Pm23L42J045j391l20
2707e49Q22R7J69j22l12o63O66l09N23Q3n9k68p12Q12o22P32j065O91j86M7K29
$$ plain form
2564 117 280 343 -132 1504 730 23 -351 -299 68 -257 -437 -315 23 -109 -127 -275 -62 -560 -288 -2 -529
2585 -529 -269 386 -363 -256 -504 -102 -445 -290 -701 11 -145 -301 148 -278 -283 517 -568 -256 -286 -515 426
2606 426 -20 531 -163 -563 -166 144 -300 -251 -26 -368 -411 340 86 -172 311 -253 -464 86 -164 782 114
2627 114 432 102 118 -291 91 222 66 -145 1194 -1072 -329 1269 783 -277 57 79 -181 -77 -23 -395
2647 -395 144 -56 514 -259 112 1083 -860 149 -113 335 -186 -129 390 350 -919 72 -592 -548 -747 -57
2667 -57 -315 215 165 -324 -995 -75 486 253 -284 -361 -876 458 -245 -530 396 -138 -409 433 44 -570 -331
2688 -331 -397 853 -268 -306 -1168 545 -340 207 374 -326 1395 649 191 198 -225 117 1162 -229 -549
2707 -549 273 370 539 417 105 -558 108 -201 322 405 346 78 -634 178 -444 288 -777 -86 -272 -225 4
2728Dk24J15o68P48r7l96K4j39M72n43J90L14L8m1n4n69P66K26q92L34p6N84l73
2751b57n37R22K62k89o4l45N21m75M92K91l26m21K24J72l81P23n28K14l90J98
2771FJ41L1j6O16k71q22Q5J35N15J79n30K74k28N9K85J39k20J23p08q4R39n86
2793F2m4q2j96J80K26m0O2j64l20O19k05k63P04J21q02K59n50N7j38P51j20l49
2815b32O1j65K49k54J72K48m2n06K32j23M3M58j87J18l11M57l53N8j4J2r5J39
2837c5%r0l58j46L70N40m48N19l53J24J88k85O4k18N3j23M32j22p37N28M75J2
2859C90n29L05K90m97j06O78k30j77j43Q2J43J24n11M11l13P35j633r9J193l66
2879b53K31n13M86r7j07o18K36J043j092O45N64r59Q4N54L02p08Q30n63K54p98
$$ plain form
2728 4 -220 -105 -773 -25 -122 -518 -494 -633 -161 -704 -514 -200 -162 -203 -257 -826 -60 166 -726 -392 -468 116 -257
2751 -257 -794 128 390 101 37 -308 213 -262 230 521 195 -226 -2 170 -211 512 -16 198 -192 6
2771 6 147 178 162 778 507 -315 -230 -95 420 599 69 343 115 174 459 598 378 501 -207 -291 648 62
2793 62 18 -64 -260 -80 146 106 168 4 -316 303 98 -165 539 660 -142 117 -433 -376 -514 237 117 -232
2815 -232 -171 -336 -87 -341 -169 79 37 -469 -237 -360 -317 141 -46 72 -239 218 -135 -77 -91 -79 -174 -35
2837 -35 -35 -125 -483 -629 -259 281 -167 352 -1 123 311 26 90 -128 -75 -198 234 112 -625 -97 378 390
2859 390 -139 166 456 -41 -147 531 301 124 -19 63 206 330 -181 230 -83 652 -981 -1080 113 -253
2879 -253 -22 -535 -49 -146 -253 -871 -635 408 -684 -39 525 -434 -350 204 506 -202 628 65 319 -479
2899d79j43n4n8P47n65L99L35n59K94J78K09l93J93J62l55L19k11J088j520N94
2919A81n66K57J12J12k34R7R7N77l49q26R39k78n79N00J20M94j01n48R79j213
2939b29K69o42J504j380P4J345k25j422L49j95L93M25L81m00K1k62N0O8M7o84
2959e13K09R13j643J136p30N05J08o23N39P60j438O00J71n41K88o25M40Q36l14
2978G8R8m30q9j87J92J69J88J40n70L07J41K32l50K58j94K39k55j07L83p1l24
2999a52K52o2P1j15O5l48O4N9M4J94L42k87L88n54M8l7L15n04Q09n57J54k69J66
3022H6o8J55n65N56M4k83J21n07J100q68%M03m58M41k11o1K5R6l0l84L78J1n16
3045e35L18J76J46n6j09J38m6j25j44M69m29J06l7K44j79n8k05J62L20l56L47
$$ plain form
2899 -479 -622 -676 -734 13 -552 -153 182 -377 -83 95 304 -89 104 266 -89 230 19 1107 -413 181
2919 181 -385 -128 -16 96 -138 -41 56 633 284 -542 397 119 -460 40 160 654 553 5 984 -229
2939 -229 40 -602 902 -478 -404 941 716 -706 -357 -552 -159 266 647 247 268 6 56 124 171 -513
2959 -513 -304 609 -1034 102 -628 -123 -15 -638 -99 661 -777 -177 -6 -547 -259 -884 -444 392 78
2978 78 176 -254 -343 -530 -338 -169 19 159 -411 -104 37 269 -81 177 -17 222 -33 -140 243 172 -152
2999 -152 100 38 109 -6 59 -289 -225 -166 -122 72 414 127 515 -39 9 -28 287 -217 592 35 189 -80 86
3022 86 18 173 -392 164 208 -75 46 -461 639 -229 -229 174 -284 157 -54 -115 -90 6 -24 -408 -30 -19 -535
3045 -535 -217 -41 105 49 -60 78 32 -93 -237 232 -197 -91 -128 116 -63 -121 -326 -164 156 -200 147
3066A47j13L88l72j95K51R2qj66K9j78%K78O6k64K6K45k06k5J84k21K0K3j17P5
3090d1K8n5J25j48n9N7K66m57rL97l42J59R5q2j44K85k82k0J51k46K23L17k31
3113a3n32P28j61l76L17l5k47n4M84j8m29K07K46k52J51J08m33K76k03M39j073
3134h70O01N87k30j47M09k12J91p46M67L50qn85M38k19K41k37k22Q48j059Q84
3154D81n14m84N03K53J7J39p11N93n96P36m10q9L12p85N55o0M51k56L23k93o06
3175d41q1K81N27n14M08J2j21P4q51M64j17n50J210j61L49j190L47m19L51J039
3195F17l79j78K85l20m05L61R2l72K3P8J66l7k69J97k1k64M15l93J3L03k99P62
3217C75j13l94M21k77J5m2l6J11o5m1J03k2m0j45K37k15J38j57J28Q1j68J24J15
$$ plain form
3066 147 34 422 50 -145 106 198 190 24 53 -125 -125 153 219 -45 -19 226 20 -5 179 -42 -22 1 -116 -41
3090 -41 -13 -68 57 -91 -150 -93 173 -284 -293 104 -238 -79 16 -66 -210 75 -207 -227 -76 -322 -99 218 -13
3113 -13 -545 183 22 -354 -37 -72 -319 -373 111 93 -336 -129 117 -135 16 124 -309 -33 -236 203 -870
3134 -870 -269 318 88 -59 350 138 329 -417 50 400 392 -193 245 26 267 30 -192 656 -403 481
3154 481 -33 -517 -14 239 256 395 -316 277 -319 417 7 -82 230 -555 0 -60 391 135 458 165 -441
3175 -441 -522 -241 286 -228 180 192 71 145 -706 -242 -359 -909 301 140 489 -701 -354 -773 -422 617
3195 617 238 60 345 25 -380 -19 73 -299 -276 -198 -32 -69 -338 -141 -162 -426 -11 -404 -391 -88 -387 375
3217 375 262 -132 289 12 27 -15 -51 60 -5 -46 57 35 -5 -150 87 -128 10 -147 -19 62 -106 18 133
3240A33m5K45m14k77K79LJ99K03n47M52j60k66J02m3J72Mr7o4p9L0J62M34n84
3263a58J58J03J06l35Lp1l32J42J90K68o1p32K01J247p50M88p03N01q12N38l05
3284c14L18j78M57k45n89R54J33o31q8L91O33o13O22j158J79K37k07M60kk85k06
3305a32P1J16r8k17O82j49q12M11J47M69m01m61M91n40M44q9L32l13m4j84J92
3326h5pp5O7J21j59J43l65R7L59j56K65l43K3l35J93J88j28M5l79K87J52M3o8
3349a17K17j79j44j52J90q7mO2L36l14r3L50ppK2n1P0j48J18J57r6j13R5n9pl3
3375FM6K95j15j36q4K34r3J0J8k26Q0R2Qp5J61J98j66j40R1J70j25o7j18J8mp
3401G1k20M02k04lj15J69m42M73l2j09K53m46J95r8K36k28K56l79J75J43Lr8%
$$ plain form
3240 133 88 333 -81 -358 -79 -76 123 326 -221 231 71 -195 -93 -136 36 40 -57 -121 -200 -170 -8 426 -158
3263 -158 0 103 209 -126 -123 -194 -526 -384 -194 74 13 -719 -518 729 -21 467 -236 265 -547 -9 -314
3284 -314 4 -174 283 38 -551 403 536 -95 -183 208 841 228 850 -308 -129 108 -99 361 359 74 -132
3305 -132 -61 55 -43 -260 422 273 -539 -128 19 488 87 -374 117 -423 21 -68 264 -49 -93 -277 -85
3326 -85 -92 -167 -100 21 -138 5 -360 -263 96 -60 205 -138 -115 -450 -257 -69 -197 -152 -531 -244 -92 -49 -117
3349 -117 100 -79 -223 -375 -185 -272 -276 -214 122 -192 -285 65 58 51 73 22 92 -56 62 219 123 10 105 46 39 6
3375 6 52 347 232 96 12 246 153 163 181 -45 35 127 135 60 221 419 253 113 204 374 249 182 64 82 78 71
3401 71 -149 253 49 46 -69 100 -342 131 99 -10 243 -203 -8 -106 130 -98 158 -221 -46 97 100 2 2
3424Bj12M2J47k9j0L5j25J88j23J9q1M1k91K75k3J54j05Pl10K23L8J78n0j8P9
3449A51n3k48K38k0j20J31kL35l39j64L1K83m58M34m04K54j00J1j32J95j65J20
3471b2j15N9O7n9j02K05K62j0m01K83l00J5j91P05o78R9M03j34j92M20m77Q7o80
3494g56m90K69O76J596j155Jp5p19N25O54j571P02J70Q34j197J13K08O48J66m92
3514A07o25N30K39J47r0m72K09J00J70j02K71n22R4j72m7K6K82k01j39L18M0N0
3536B13k49j11Q2L70l5j72l9q6J94q9l1q5K06o19Q19k12K5l68K84J77n55m2k76
3559e99M50j43l78O37N1M4lm2o0J95k01j61j26J43L89l37q0L78o08K39j29M56
3581A15m81Q07K8j316R05l99N30J78o36L63k29j2N40m66L09j17r6P6l53L03o4
$$ plain form
3424 2 -110 -68 79 50 40 75 -50 138 15 34 -47 -6 -297 -22 -45 109 4 11 -299 -76 -38 140 90 72 151
3449 151 98 -150 88 68 -52 79 77 412 73 -91 -60 223 -235 199 -205 49 -51 -40 -172 23 -142 -22
3471 -22 -137 -78 -11 -70 -172 33 295 285 -116 167 -133 -118 -309 396 -282 -183 220 86 -106 314 -163 -76 -756
3494 -756 -1246 -977 -301 1295 140 141 66 -653 -128 526 -1045 -343 -173 661 -536 -423 -215 433 599 107
3514 107 -518 12 251 398 308 -164 45 145 315 213 484 -38 56 -116 -163 -137 145 -56 -195 123 163 213
3536 213 -36 -147 -65 305 270 98 59 -27 167 78 47 -38 168 -451 368 156 181 -187 97 274 -281 -323 -599
3559 -599 -149 -292 -670 -33 18 62 59 17 -43 152 -49 -210 -336 -193 196 -141 -221 157 -451 -212 -341 115
3581 115 -366 441 469 -847 58 -341 189 367 -269 94 -135 -147 393 -73 236 119 23 99 -254 49 -15
3602a5n9Q00o90K38l17NJ63K16j4k25j57k1M55l28n6J20l80N30l99m1J15r2j91
3625c43Q25p45L5k59N23j57n2J002n34j48l10k68n4P08L90N31j035o49P15J6l50
3646a59N15P6m12o5L48m88K56j53J91k45K38l9j55J17j29J59k9J75m21K88Q7l0
3668A25j4l20J72J23o0r8j07K28j34k07K06K45L6k31lK04l99K49j1l5r1j8j8j44
3692c02K43J53j23L3o7L2p6J21J01m31K87m06L00K32j30M0p6k96L8K66L5j83P6
3715a33K32j83p6pL26k09J44o7m51L65%m5J00K7M2k70J85o1q8K55L5J64k49P3
3739A09n6k02K23K2q0K22j53R6n14O81k13J3r5j7J17j17J29p2M06l19Q1j15j20
3762B6J4K21j61R0qM3k08O5J7j79J14L0j31K8L0k5kQ6M1k87R4Q3j44J6MQ8n2j15
$$ plain form
3602 -15 -74 726 36 274 -43 -38 125 341 327 102 -55 -76 379 51 -5 115 -265 265 -134 -175 -60 -152 -343
3625 -343 482 -263 -228 -487 36 -121 -173 829 295 147 -163 -431 -485 223 613 1144 109 -540 175 191 -159
3646 -159 356 432 20 -45 303 -185 71 -82 109 -136 102 63 -92 25 -104 55 26 201 -220 68 155 125
3668 125 111 -209 -37 86 26 -72 -179 49 -85 -292 -86 159 195 -36 -39 165 -234 15 4 -31 -122 -140 -158 -302
3692 -302 -59 94 -29 4 -63 -31 -107 14 115 -316 -29 -435 -135 97 -33 7 -69 -365 -327 -61 -26 -209 -133
3715 -133 99 -84 -160 -167 159 -50 94 27 -424 -59 -59 -104 -4 23 65 -205 -20 -81 -169 86 121 285 36 109
3739 109 53 -149 74 96 16 238 85 181 -333 348 135 148 53 36 153 36 165 93 499 180 261 146 26
3762 26 40 261 100 190 182 225 17 82 99 -80 34 64 -67 -39 -9 -34 -36 50 91 -196 -102 -19 -163 -147 -143 -55 -107 -222
3790b22O5m1L06j8k87q3J35n7K22L0mk72J51o6k9J6J9q7J11N7L8m0j0L40j88J03
3816A89k11l8K0n4R8J46j93P2J34j82l8J31J26k00N1L5N9k25K21m6j1p2J22j06
3840B8m3L08l08R6M1LJ58J37l87K64j12l20l1J45k9L0J57o0k36Q2K57l03k2j27
3864b72J47M6K95j60j00M6J17r2j16L3Q2n0Q2k3j06L43l30m8L18j70k16J87R5
3887A08l09Q4L04j17j54J3J14N9M1L8O6l8q5q1L84m47R1q7J93j14n3J9j74N0r2
3912a87L06k55N0k8K2J57o5n3J39M5j84P0K40j91L2p8j08l6k09L00J7j43K26m54
3936c87J82P1M3k28L15K47l50o70Q25P1N7m30k0J86M34ql97N09p77k51N85j12
3958a05K05J25J53J10m21J15k34M43J99l22m49J00J32jl17L24j56n00J70J60l35
$$ plain form
3790 -222 -157 -198 108 90 -197 -280 -145 -202 20 50 46 -226 -75 -141 -170 -154 -135 -222 -111 -54 -16 -56 -66 274 86 189
3816 189 -22 -60 -40 -94 4 150 -43 29 163 -19 -57 74 200 0 51 86 145 -80 141 95 84 12 134 28
3840 28 -15 293 -15 81 122 125 283 420 33 297 185 -135 -166 -21 -50 -20 137 77 -159 -77 180 -123 -145 -272
3864 -272 -125 -79 216 56 -44 2 119 27 -89 -56 26 -24 58 35 -71 272 -58 -106 212 42 -174 13 108
3887 108 -201 -117 187 70 -84 -71 43 102 143 181 247 209 124 43 427 -20 71 -16 177 63 10 29 -145 -95 -187
3912 -187 119 -136 -86 -114 -92 65 0 -53 86 131 -53 17 257 66 98 20 -88 -124 -333 -33 -16 -159 67 -387
3936 -387 -205 -134 -91 -319 -4 243 -107 -777 48 119 176 -254 -274 -88 346 338 -59 450 -327 -578 7 -105
3958 -105 100 225 378 488 67 182 -52 391 590 268 -181 -81 51 50 -267 57 -99 -599 -429 -269 -604
3979f04O47n34N88kk79Q12p26l7K03PJ54O8p7k35m2l02J28K76L21j28j62j13L7
4002@l55O42J63l13r3M9K15k37m68Q92p42MK17M76m91K70q97M80K35q2M47r1p33
4025d12m31R55L29k29J62l76p09N00N53l48k06m38R52n53N09l28j95O12m01O2
4045Ho2j15L5k7L9p3K69Q0l28N32n99K58K64L2m03M4M53j085N05K94J49n84M07
4068I3m89Q25n87r7J75j69m09J198q81K48O10k15r97q5J188j10q72Q28k93k03
4088b42K85K38p09K64j4n5l31K79J03P87p9o37j02L3J15p4M23q73L7k05Q95q16
4110f78L01K03J75R30p19j558J776k91q17K48N23r29R91k97J053n69k17l71L75
4129A29j306J712q33N24O70o05j11j30k43k24N30j42j86L75J90l6r53j30Q06P84
$$ plain form
3979 -604 43 -491 97 95 -184 628 -98 -135 68 75 229 297 220 -15 -57 -359 -231 45 366 238 76 -37 0
4002 0 -355 287 450 137 44 93 308 71 -397 495 -247 -243 -26 450 -41 229 -668 -188 47 -35 412 321 -412
4025 -412 -843 112 441 212 374 -2 -711 -211 342 -6 -212 -650 302 -251 258 -70 -265 347 -54 8
4045 8 -54 -169 -134 -161 -122 -195 74 154 -174 358 -241 17 281 313 -90 -46 407 -678 -173 121 270 -314 93
4068 93 -396 429 -158 -255 -80 -249 -658 540 -341 -93 517 302 -695 -780 408 298 -574 254 -39 -242
4088 -242 43 281 -428 -164 -178 -233 -564 -285 -182 605 526 -111 -213 -180 -65 -139 284 -589 -552 -757 138 -678
4110 -678 -377 -174 1 931 212 -1346 430 139 -678 -430 93 -836 155 -142 911 342 125 -246 129
4129 129 -1177 535 -298 226 896 291 180 50 -193 -417 113 -29 -215 160 350 314 -639 -769 37 821
4149H21j214m6L89p53J608m91n07M8M17Q7l21q66J191q38K87j34N04n61jN77N01
4170F98r95O15r33M21L24k3k32O2O2j64J89m28N49N9j92j59K32j0K64j37p21J18
4192d01Q25o57J53k40j2N45k51j05J32K22Q3k35J82j91m96K15k15N51n56O74m9
4213A74K70p58L47m9j89K39n24K84KJ43j04M4M33j55k94J10O15p40K15l08L59
4234A14m52L35j55m8m23M22j28O74o31L49q72J46M80J93L01q63O13j11p32L14
4254d74l32R22J50o05l55L66M01o95J050K11o5J85j079O68L84n39l41R75K85r23
4274A89K29r45L78O35l78m11Q4P31j66l71R0m12K27J05k34J069n63M81o18n50
4294d30R07j91K8R4k26k17N3R8l77Q9J29K19k30n07M34l3N59j97p5k30J73j31
$$ plain form
4149 821 -393 -439 -50 -803 805 314 -193 -145 272 359 38 -828 363 -475 -188 -322 182 -379 -380 197 698
4170 698 -297 318 -615 -194 130 107 -125 -63 -1 -165 24 -404 145 204 12 -147 85 75 339 202 -519 -401
4192 -401 424 -233 -80 -320 -332 213 -38 -143 -11 211 294 59 241 50 -446 -231 -446 105 -451 223 174
4213 174 444 -314 33 -16 -205 34 -490 -206 -204 -61 -165 -121 312 157 -137 -27 588 -152 63 -245 114
4234 114 -338 -3 -158 -206 -629 -207 -335 339 -292 57 -815 -669 -189 4 305 -558 55 -56 -788 -474
4254 -474 -806 116 266 -339 -694 -328 73 -622 428 639 574 759 -320 348 732 193 -148 827 1112 189
4274 189 418 -527 -149 486 108 -303 -219 512 346 -25 65 -347 -120 -15 -249 820 257 738 120 -430
4294 -430 477 286 314 408 182 -35 18 116 -261 -172 -43 176 -54 -561 -127 -160 399 202 127 -103 70 -61
4316f1P05n84k03L51l70n25O54m29O39J42q00Q95p62M42jj33p6J33k54m98L95
4337c40Q99m97k45L31p08J76M94l18L06l25L55P9l59r2M43k72M53J18k57j17o6
4358E8n9j26O68l13p7l6J13k54j33K96l24P29p09N54m88K08J34j14J09k64j70
4379a98L67l19J76o0j32j39J05K07J1m04L26j97J09l63P08k51J87j79J93R4k54
4400a3j60j09K14K21k39l8K33j01K25o51L26l0l65Q09k70O4k34j1N1P0l4M88l70
4423G6k81N4J74rP3o68M71L60ko07L88K23m14N29k31k49M80l84k18K44K49r8k49
4446h9n2j52K71p38J041l14K25m74O87l45q8J68m4n1kk76K13J91o08pP8J73n47
4469g40Q16o00k9P61O23o28o27P20p32K27K61j81R7P9l87J137q01M46q58J267
$$ plain form
4316 -61 644 60 -143 208 -162 -687 -33 -462 177 319 -481 414 -348 94 93 -40 -116 17 -237 -735 -340
4337 -340 559 62 -183 148 -560 -384 110 -208 98 -227 128 207 -152 -244 199 -73 380 498 241 124 58
4358 58 -1 -127 541 228 151 115 228 -26 -159 137 -187 542 -167 387 -101 107 241 127 236 -28 -198
4379 -198 169 -150 26 -34 -166 -305 -200 7 18 -386 -60 -257 -148 -511 197 -54 133 -46 147 241 -13
4400 -13 -173 -282 -68 153 -86 -124 109 8 233 -418 -92 -122 -487 322 52 116 -118 -129 -78 -8 -42 446 76
4423 76 -205 -151 23 14 87 -581 -110 250 248 -359 29 252 -162 367 136 -113 367 -17 -235 9 258 160 -89
4446 -89 -141 -293 -22 -760 281 -33 192 -282 405 60 -28 140 96 45 43 -233 -20 171 -437 -444 -366 -193 -740
4469 -740 76 -524 -553 208 831 203 -424 296 -436 -209 52 -129 -32 47 -340 797 -4 442 -416 851
4489H51j06l77k43q57R65l01L78q40j07R99l48J15M73j398J225L37j080J55N88
4508D29jr3q2k75L6k84R8M59j58k22M92l16L69r76M96L21o52p77J195J08J75q14
4530d72K12M96l36J32q06P09J60M67l52j80j20L46K02j464P82L36l36J668j987
4549e43Q85j45R1n66K75P9M87p70J08L05m27K39j326K162j474O10K4n31J089j08
4569D64p53o01Q57l21L4J092j153K1Q70l82m72k85l34J232J47k52n19r3L18j90
4589c20Q00k16j332J319K44o60K43P8l23M51m54N88m23j63K72l7n86N8n55O45
4609c71J010j018L00q3K33n88R18n48L8k03J91j33O1l0j10n6K92K13k2K56o4n8
4631B28l68P9J01k27M02j84P5j01J02K87k37m84M88k30mr4M80m76J89Nj69K33
$$ plain form
4489 851 745 368 125 -732 233 -68 310 -530 -637 362 14 129 602 -796 429 766 -314 -159 429
4508 429 428 335 253 -22 14 -270 -172 287 129 -93 399 83 452 -524 -28 293 -359 -1136 59 167 342 -472
4530 -472 -260 236 -100 32 -774 -65 95 562 210 30 -90 256 458 -1006 -224 112 -224 1444 -543
4549 -543 342 197 288 -278 -3 76 563 -207 -99 206 -221 18 -1308 854 -620 -10 14 -517 572 464
4569 464 -289 -890 -33 -354 -320 772 -381 -360 510 128 -344 -629 -963 269 416 164 -355 -448 -130 -320
4589 -320 480 264 -1068 251 495 -165 78 156 -167 284 -170 418 -5 -168 104 67 -519 -461 -1016 -371
4609 -371 639 -379 -79 -162 71 -517 401 -147 -109 -312 -121 -254 -193 -223 -333 -389 -97 116 94 350 286 228
4631 228 -140 -61 40 -187 215 31 106 5 107 394 157 -327 161 -69 -73 -167 313 -163 26 31 -138 95
4653I5N7l50K44L56m3k16l80J13J92m5l84M07J13N4k19K42k46k17L44l0k07l1
4675a51K57r9kr2l7L44k51J03k06M6j04j2Q4k8M4Q0P6r4q9K26j61J19k13K29J92
4700B61k93J63J1k47M10m56KP99l46K78p75K42K77k57P7O4Q9l76L4n6K67N9r5
4723A32j68J05L1L1k31P3J54r2J20M5j62q3J17n8q2j5J52j7j80J68k67J56K22
4746A51Pj32k6KJ61l01J08j21l0J50J57j42j92K64L18l91j52Q1J19j81J02k46
4768b94J83M4K5l2j0k15J69o1M70l34K8P6k76L54k49J67j12P7J35j28p6J67P7
4791A85K5p7J01l49L57k14q8K29k07J49Q4j73J45lj05r0J80M4j32J37l53K64l20
4814b11J54J87P0k48r0j26K01J93J51k67Q9j26K5o0%j3r3K93j88k08K63m4j4k47
$$ plain form
4653 95 152 -198 46 402 359 143 -237 -124 68 23 -361 46 159 213 -6 236 -10 -227 117 87 -120 -151
4675 -151 106 7 5 -87 -124 220 -31 72 -134 -88 -192 -204 -120 -148 -104 -24 52 -42 -131 95 -66 53 -160 69 261
4700 261 -32 131 142 -105 305 -151 -149 650 304 582 -193 49 326 69 146 210 299 -77 -43 -99 168 227 132
4723 132 -36 69 100 131 -100 -27 127 35 155 200 38 -45 72 14 -68 -83 69 52 -128 40 -227 -71 151
4746 151 158 26 0 2 163 -138 -30 -151 -181 -31 126 -16 -208 56 374 -17 -169 -88 31 -150 -48 -294
4768 -294 -111 -67 -42 -74 -84 -299 -130 -191 279 -55 -27 49 -227 127 -122 45 -67 10 145 17 -59 108 185
4791 185 210 133 234 -115 242 28 -60 169 -38 111 195 22 167 164 59 -31 149 193 61 198 -155 109 -211
4814 -211 -57 130 200 -48 -138 -264 -63 130 281 14 103 -23 2 -58 -58 -71 -164 129 -59 -267 -4 -48 -62 -309
4838c09M15j32k16N4J71l73N92l51K10Nj62K3O8pL2N3j25J62k51O6P9o4j92K73
4862B1N2Q2j41O7l3J32j95K07j21k1LJ9p9K7oL2k56M87l84o4K43P2j29q7K1K46
4888A95j43k9J11M1k6k06j23p3L13N4l2j13J7j74L0P5J74j35l2O7K19k59Q1j54
4912a22o9L37oJ04k34j24j85L16K8j81J9M9r3j3R2Pq3K78n0o9j51L81j96l07M21
4937A49l25n1J24Q3QM1j64l0J85J63L7j2k64j2J37j90K89k58K07o7M3L5qP0k35
4962d5P5O4R8k37l9M8K22k41l9j8J49J25p4k79K7K05r1o0K44o9j0j82M82n45L6
4987a54J90k85K55k24M35l02j87J51K2j1P7j4k12K91j13J23R0j09r9J24j19O5
5009fJ30J46m30O3R2m8j06J43R3j01j0L21l30k3K09k49LJ96pj33j54M92k15Q8
$$ plain form
4838 -309 106 -26 -242 -188 -17 -390 202 -149 61 66 -96 -73 -5 -12 20 73 -52 110 -141 -75 4 -60 -252 21
4862 21 73 155 14 81 48 180 -15 192 71 50 53 72 -7 20 14 46 -210 277 -107 -171 72 144 15 -72 -51 195
4888 195 52 23 134 175 149 -57 -180 -253 60 114 82 -31 -14 -188 -158 -83 91 -44 -76 -9 210 -49 32 -122
4912 -122 -191 146 140 244 10 -114 -299 17 45 -136 -117 -68 -161 -174 -82 -75 -158 120 70 1 -150 231 35 -272 149
4937 149 -176 -227 -103 -20 -12 29 -135 -165 20 183 220 208 -56 -68 69 -121 168 -90 117 50 93 128 120 190 -45
4962 -45 30 94 192 -45 -84 -36 186 -55 -94 -112 37 162 88 -191 -164 41 -50 -110 134 65 55 -127 355 -190 -154
4987 -154 36 -249 6 -218 217 -85 -272 -121 -99 -110 -33 -47 -259 32 -81 42 132 23 -76 48 -71 -6
5009 -6 124 270 -160 -97 -5 -53 -159 -16 77 -24 -34 287 -43 -66 143 -106 -103 93 86 -47 -201 291 76 164
5033A64j42o3M0k6J64r4j52J73j6j49R8J42k53j5J17j89N3J81m7J23k81J8J50
5056dq6j18K92j66J1J68j23M2j36l4N4JrM4p1j5o2J81o0j10R5K05j66M6j26L64
5082B17n83M02k79K19l13O27m48J41k77N02M8l95J67j72M48l99K0L3NL3J93j79
5104A0K25L0n74L16J16o87K39M02p2J5Ok98J56R7q4j94L88L70j104J144m56k29
5126a84L4l39L59J63m0k46m08J67P29o08j35P75O2p45N7N05k93K09k54k33N07
5147H2k39k73K06M33m52P28j88o13P51q27M00L67p4o3Kl86K03j05J80j58l22K39
5169a09K90Q7k40k57L63kj80J06j38l6o3J92J10l2j03M2j88K64m7J6k16K87l47
5192b01J65k80M23j5k54n8J51J06j87J68j48N0j03J15M63l94N1O1j6k37J9J27
$$ plain form
5033 164 22 -41 -1 -27 137 43 -109 64 48 -101 -3 139 -114 -129 -12 -201 -148 33 -14 109 -172 -154 -4
5056 -4 -90 -208 84 -82 -71 97 -26 16 -120 -154 -100 -99 -108 -64 -135 -150 -212 -31 -91 -201 -106 99 -67 -21 -147 217
5082 217 -366 36 -243 -24 -337 290 -158 -17 -294 208 256 -139 28 -144 304 -95 -75 -42 -37 -4 189 10
5104 10 235 265 -309 7 123 -564 -325 77 5 20 26 -272 -116 -19 -103 -297 91 461 -643 501 45 -184
5126 -184 -150 -489 -130 33 -7 -253 -661 -494 235 -373 -508 267 329 -416 -359 146 -147 62 -192 -425 82
5147 82 -157 -430 -224 209 -243 485 297 -316 435 -392 8 375 301 238 240 -146 57 -48 132 -26 -348 -109
5169 -109 181 268 28 -229 134 132 -48 58 -80 -116 -179 13 123 91 -12 30 -158 106 59 75 -141 146 -201
5192 -201 -36 -316 107 92 -162 -220 -69 37 -150 18 -130 -80 -183 -68 395 1 52 113 97 -140 -121 6
5214Fm9Q5N7l52K64p9J8J07j54p8J80j44R2k55O8N06m79J94O8j41J0r4J99K19
5238B48j99j09j80k61K93J93K02l95MN21j25L1o09N96J12m83L08j18L73k23l31
5259a52K61n31J07M72k67l28N97j75K55k00J3R8n24J99J18L8J13j55n0M1K08j07
5281C1M66n99J12J1l52O84Pn75P68l73k52r8m92N11k74j71N37r7Q7R9j54O13Q7
5304E76p50k22M78L20K39M4q41L00n73Q60L10j142L41L77n57m58Q59p4p53R42
5324B76j9l68J41K00q21O51k57K30M14o49r1L57K76j053R62m3j55m4L38l62m73
5345d90N90L9J14n10Q37l59n94L83j36o35K61Q92n17N68o75l3l51O52l42m76J207
5366D25n73K51j19J44on59M37k60L66o90R77p01%P40k11n92K7N83j422J005l41
$$ plain form
5214 6 -43 42 99 -253 11 -68 -50 57 -97 -175 5 -139 -47 -302 -234 272 -207 -13 55 -86 -76 -170 29 248
5238 248 49 -60 -240 -501 -208 -15 187 -208 -204 317 192 223 -386 210 322 -161 147 29 402 179 -152
5259 -152 109 -422 -315 157 -110 -438 159 -16 239 39 52 150 -374 -175 -57 -19 94 -61 -111 -70 138 31
5281 31 497 -102 10 21 -331 353 360 -215 553 180 -72 -170 -662 -151 -425 -596 -59 -156 -69 30 -124 489 576
5304 576 -174 -396 82 402 641 685 -156 144 -429 431 741 -401 -60 317 -240 -698 161 87 -666 276
5324 276 257 -111 30 230 -591 60 -197 33 447 -202 -293 64 340 -713 249 206 51 7 345 -17 -490
5345 -490 100 139 253 -257 580 221 -373 10 -126 -761 -500 392 -125 443 -232 -265 -616 36 -306 -782 425
5366 425 -148 103 -16 128 122 -437 0 -260 106 -584 393 -308 -308 432 221 -371 -344 239 -1183 -178 -519
5387e19R15j94P0l94J92P32n21q9j28l65N59j00j67L18n94K41K04k70L41n93J91
5408a71l2K26k25N42k51r8J57j1o64O64k89K47M96j000O94J44m95M7j46j76K33
5429a08l05L40k17k7J22K55j70j1m37L50J79K93m34nj19Q53o22j17M86j01k18
5450a3N3K4k14J46j52q9j7L76K37j91n19M48j51K13K52l67k78K63J65K2k88K55
5472A75n5k49o5K20J28l3m38o5L63j05M73m87J1J05J79p4l17J67j09r7J18L60
5494B05j02k49K28K52k50K8J7l13P0Nj35K11J93k21L24k12Rj0q1Q7m1O7j12n6
5518h6J43k82K79K07l75k89N47k90K02Rj09j11J35k45L53nq8r1kJ99L6k42K24
5541A19p6o2N7Q6j38N9M59l99k15O5%J80L9kl07L3K45Q0k20N8j1j04M7J11j2j43
$$ plain form
5387 -519 396 202 272 -122 70 802 281 192 64 -301 258 158 -9 309 -285 -44 160 -110 231 -362 -171
5408 -171 -203 23 -202 340 89 -9 148 137 -527 137 -152 95 591 -409 285 429 -66 -19 -165 -341 -108
5429 -108 -413 -73 -290 -317 -195 60 -110 -121 -558 -208 -29 264 -170 -175 -294 559 -63 -180 306 205 -13
5450 -13 40 64 -150 -4 -156 -245 -262 114 351 160 -359 89 -62 151 403 36 -242 21 186 208 -80 175
5472 175 120 -129 -194 26 154 121 -317 -382 -19 -124 349 -138 -127 -22 157 83 -234 -67 -176 -273 -155 205
5494 205 103 -146 82 334 84 112 129 -184 -114 -109 -244 -33 160 -61 263 51 60 50 -31 56 15 82 -30 -86
5518 -86 57 -225 54 261 -114 -403 144 -146 56 65 -44 -155 -20 -265 88 83 -5 -96 -98 101 137 -105 119
5541 119 43 -19 38 124 -14 45 504 105 -110 -45 -45 135 174 172 -135 -102 143 223 3 61 50 -54 -7 104 92 -51
5567e1N0N1Qk2N3J10l49K04J68k90M4L1l06K02K20k2O5j16j84R2O2J21P5k18q1
5592h3R5q1K08k00j17K57n1j77J09N2j85m6K37j56M9R7Q4j49N3r3K0J26P9j60
5616c2K63k43L37l74J82j7M79p78M73l89J44j02j94J55K60m22J93R56l89p1K23
5637F54m30k53Q1m96P80k92J10m66J57R1J92j79J10q4j72J19J5j11R0Q0j0j02
5659a16N0L01p5k17J70P0j71lR5k30P6P1j13o6M03k4l72M90k38k01J15K30j85
5682F0L94n02J57l96J48K23k2o6n19R21M63m77p96O77q6n20n70J008j012K56R43
5703B84q39P86lN54n59O46k13j101L80k40K25Q20n15r37K57J6M25K96n10J22j39
5724b45J45P0n8k40M01Nk54K97K2n55O17m48M4K67j20j20J35P2O8p5k26J44Qj98
$$ plain form
5567 -51 -1 50 58 36 89 199 -150 54 222 -68 -24 7 -299 -97 123 101 166 50 -134 -42 20 141 216 -2 -83
5592 -83 12 -69 139 -61 -178 79 28 -149 -40 12 -173 -219 18 -138 -89 8 92 -57 -4 -97 -77 49 128 -32
5616 -32 231 -12 325 -49 133 116 595 -183 290 -99 45 -57 -251 -96 164 -258 -65 891 502 431 654
5637 654 224 -29 52 -444 336 44 154 -312 -155 -64 128 -51 59 -25 -197 -78 -63 -174 -84 -4 -14 -116
5659 -116 -66 235 160 -57 113 183 12 9 104 -126 -50 21 -92 -158 245 221 -151 339 101 -100 15 245 60
5682 60 454 -48 109 -287 -139 84 62 -4 -523 398 861 384 -412 265 179 -341 -911 97 -915 -659 284
5703 284 -555 231 228 782 223 869 656 -445 -65 -305 -80 740 225 -712 -455 -439 -14 282 -228 -106 -245
5724 -245 -100 -30 -88 -328 73 78 -176 121 143 -412 205 -243 -199 68 -52 -172 -37 35 103 28 -198 -54 -46 -244
5748b44K4K45k40K08n8Q5q7P3m2j11J48J49l1n18O85j65p1J00k31j44K03J99k10
5771c3l00K00MK10j19J14j86L69Q5rM3p08L83K2j14l9K39j19j28j17K97j72J83
5794A05K5l04K50qJ09j42J12k72J1J90l25L64r4o3n4LJ17m5j16J26j30R3M05l75
5818a8K06k34J51n1N6j54J55k66p4L30P0j09k00J86k35K68j33j73L88K0j42L0
5840G1k73O3N6L89k51k78L05j66J94j50R1r5m11J010l47K46m41m32N76k20l54
5861d17K86M21m94K86L8j41R7n3Q4m1k40K35j03J13oJ06j35Ok80J73J0l4J11j5
5885Gkm8M4j92J5J20K87j55r2j57N6Q4K87j41K01l76l7L1J26j37L06k00n9J16
5909H4l96L91J39j68J11q3k65J34k95L79J99j62p2n4N0J31k49K29l37M80l36K29
$$ plain form
5748 -244 -220 25 -215 -7 -65 20 -67 6 -36 -147 1 150 119 -399 286 121 50 150 -81 -225 -22 177 -33
5771 -33 -333 -133 -129 81 -38 76 -110 259 344 335 378 -330 53 75 -39 -78 161 42 -86 -203 94 -78 105
5794 105 130 -174 76 68 177 35 147 -125 -114 76 -249 115 21 -42 -96 -93 24 -21 -137 -11 -141 -48 357 -18
5818 -18 188 -46 105 54 110 -44 111 -155 -229 101 171 62 -138 48 -187 81 -52 -225 163 183 41 71
5840 71 -202 -139 -83 306 55 -223 82 -84 110 -40 51 -44 -455 555 208 454 13 -419 157 -63 -417
5861 -417 -131 290 -204 82 120 -21 76 23 107 66 -174 61 -42 71 65 171 36 42 -238 -65 -55 -89 22 7
5885 7 5 -43 1 -191 -176 -56 231 76 -16 -173 -117 -33 254 113 314 -62 -99 -68 58 -79 227 27 -32 84
5909 84 -312 79 218 50 161 78 -187 -53 -348 31 230 68 -4 -58 -8 123 -126 103 -234 246 -90 139
5931A39j42j94L30k35N2O2O0j76r8M58k23K2k05K98J61m96o3K97NL8N2k64J39
5954A7J06j09j40L08k83l5j5N9j06K33K0j54J58j32k2J22j21j63L89j61l4QJ09
5977E4K4J97l72J79K6N9J01o4k46k40J39N8M7J55k17K55l16j5J67j51J36L2o4
6000e6M8K13l61J94j7J2J2K8k02J54j51L06l34J60J89j14l0J01l58J99q7K83k02
6023a3Q0j6p6Q6k82L18m8j42pO6p0J4j6l9K44j98n3K84j54m0J11J43k42J73l53
6048b30J38J89N6j8k15K26j66K28q6k10K42r6R6k20R1m4K33q6k2O6l89N61l72
6071b8k2j79M7K24L9k36L1o4J74k4j92K13J80l21J18J86j11K4k09L59mj94Q3l81
6095b87N9L93k48j46K08J28r2k13J68k3J84J57l12K28k40kM8J95N4n18L69o4j09
$$ plain form
5931 139 -3 -197 133 -102 -50 12 72 -104 -202 256 33 55 -150 148 309 -187 -250 47 52 90 142 -122 17
5954 17 123 14 -126 182 -101 -136 -151 -92 -198 35 55 -99 59 -73 -95 27 -94 -257 132 -29 -63 -55 54
5977 54 78 275 -97 82 108 167 268 204 -42 -282 -143 -85 -38 117 -100 155 -161 -176 -9 -160 -24 8 -56
6000 -56 -8 205 -156 38 21 33 45 73 -129 25 -126 180 -154 6 195 81 51 152 -206 -7 -94 189 -13
6023 -13 67 51 -25 61 -221 97 49 -93 -100 -34 -104 -90 -106 -145 99 -99 -152 132 -22 -62 49 192 -50 123 -230
6048 -230 -92 97 153 135 -80 146 -20 208 122 -88 154 58 154 -66 25 -19 214 128 106 172 -217 344 -28
6071 -28 -50 -229 -182 42 81 -155 -124 -188 -14 -38 -230 -17 163 -158 -40 146 35 59 -150 209 205 11 94 -287
6095 -287 -228 165 -83 -229 -21 107 15 -198 -30 -53 131 288 -24 204 -36 -38 10 205 259 -259 110 46 -63
6118f3R1l22L57k61JJ40q8J12K49m47K26j64j1K56K9l55K95j28J78L3m8k20K95
6141A55j6j80L31k64J72j82P9j12k03L21j4j7K91l77MR7p9j08J03L16l49J54j11
6164A1o4J29O8k00M7l7J7Q1O7k13J44r5O4m9K04j49q8K5Q3K7k30K95j9j47O6j14
6190g7K1J43j84K31j56q1J05r7R3j74L29j59O6k0k56K36K36j40j87q3J90M7M7
6213A30j44J62O2l00J31P2j71L36k47J4l6J07p9k66L68%o7K23l44j26K06j39J50
6236D2j46J88Q1n1Jk34J73j56J47p1K24Q2l09J27P4j93J15M0k43J75k31m3J63
6259d5l1j05l1P3K23k84J11j12OJ41O4o0J58p2j67%K17k41R5K1K3l8Q5r8J56J19
6285B08j30j58m6K48l5p7K07k80m2J37j52J5L04m3kL0j39L6J62n00M04q6j25K69
$$ plain form
6118 -63 28 -294 63 -198 -197 -57 -145 -33 216 -231 -5 -169 -180 76 105 -250 45 -83 95 128 80 -140 155
6141 155 139 -41 290 26 198 16 95 -17 -220 101 87 70 361 -16 -12 85 6 -102 1 317 -32 122 11
6164 11 -53 76 144 -56 -9 -46 -29 52 119 -94 50 -45 19 -30 174 25 -63 -38 45 72 -158 137 118 -29 37 -77
6190 -77 -56 87 -97 134 -22 -103 2 -95 -2 -176 153 -6 60 40 -216 20 256 116 -71 -154 36 83 130
6213 130 -14 148 210 -90 41 113 -58 278 31 45 9 116 37 -229 139 139 72 295 -49 -175 31 -108 42
6236 42 -104 84 165 114 115 -119 54 -102 45 -26 198 280 -29 98 172 -21 94 134 -109 66 -165 -208 -45
6259 -45 -76 -181 -212 -139 84 -200 -89 -201 -195 -54 10 -50 108 36 -131 -131 86 -155 -60 -39 -16 -54 31 -67 89 208
6285 208 78 -80 -126 122 87 10 217 -63 -105 32 -120 -105 199 156 154 184 45 81 243 -257 147 61 -64 205
6309B05l19J90j81J66q8k9P1K11j32j42M03j61k10P1m7L3j09L0o9Q2J2j27J66
6332B6P5j03j20K41p0k83L72q6p4J69J44k28j31J50k21J75j06J27L9k3j09j48
6354a84K68K3o8j08K6j44J21j16j63L53Q1j9n7K3r8j29K07j33J9J98r3J46k29
6377g6K33j69J04mk58m4R7j00J73K20R2j59n8l32K41n0J95o0L0l18L52%q0j87
6401a58RL80l62L5K38k10o6J56J4j32L40k56o6J89k11R7NK54m36J13N0k1l8O1
6425a5K9k6K11k96K09p1m4J58l1j63K67j02r4Q3r1L02k93M6j19l3j9P8J52k51
6449a13K48p7j83K6J59J16k56K25l7K8k90L34k3n7J05k20j61J74j26J51r4J78
6471A07j99J15k03L3J12j00O8j06K14o2k07j36K34J26k6J05j66o7J81m1kK06j80
$$ plain form
6309 205 -114 76 -105 61 -27 -56 15 226 94 -48 355 194 -16 55 8 41 -68 -38 -107 -25 -13 -140 26
6332 26 101 -2 -122 119 49 -234 138 52 -22 147 291 63 -68 82 -139 36 -70 57 96 73 -36 -184
6354 -184 84 107 39 -69 -43 -187 -66 -182 -345 8 89 70 13 36 -62 -191 16 -117 -98 100 7 153 -76
6377 -76 157 -12 92 88 -170 -214 -117 -217 -44 176 268 109 51 -281 -40 -90 105 45 75 -243 109 109 29 -158
6401 -158 -149 231 -131 -96 142 -68 -134 22 36 -96 244 -12 -78 111 -100 -3 2 256 -180 -67 -17 -38 -76 -15
6425 -15 14 -12 199 -97 112 41 -3 155 124 -39 228 126 32 115 24 326 33 79 -40 -73 -92 -14 138 -113
6449 -113 135 58 -125 -99 60 176 -80 145 108 136 -154 180 157 100 205 -15 -176 -2 -128 23 -71 107
6471 107 -92 23 -180 -147 -35 -135 -67 -173 41 -21 -228 -364 -130 -4 -30 75 -91 -158 23 -18 -20 186 6
6494FK10l68N63m26m0L33l20M7p7L14j25%k85K25j77r5N4L77k39M6J16J31j50
6517A20Rj65J45l5J6k37M37j7k75J91l65J94j5lM4P9pj20Pk40M08l38M43l36j94
6542b54L70k72L91l59Q4K4n2l8J3J5m7K82l90L17r9k64J94M9j14J80q0n1J04L07
6566C10l30J83j7j25n9q4L5P8k24N18p4k65J30j24J35J81Rm79J95P0n9n7J16o2
6590AM9l9P8m46K97K86l35p0M66l77O3N65L51j222r1O28l29o0L27l46J14K21k58
6613a27L43j64M9Rj29RQ5j68L3L4nj4nM4jj50K88P2k00K0k17P7j3O9L6j36K34
6640G3J4Q4k71K53l62J08K6Qr0N1J21j3M1n2J86k75J78r7j93M81q2k49J28k5o5
6665b2J37r5L1J4r2j31L7j64N10r8l31L50j67R1m5L02k70j99L24J19k84p5N1J32
$$ plain form
6494 6 216 -152 411 -15 -55 278 -42 5 -72 242 117 117 -168 57 -120 -215 -161 216 -23 23 139 270 120
6517 120 129 -36 109 74 90 -147 290 273 -2 189 -176 18 3 0 44 123 116 -4 3 -237 171 -167 276 -60 -254
6542 -254 116 -156 235 -124 -40 -16 -68 -106 -93 -78 -125 157 -233 84 -15 -279 -85 -36 -150 30 -50 -101 3 310
6566 310 -20 163 146 21 -38 -122 -87 -9 -233 285 211 -54 76 -48 87 268 277 -202 -7 63 4 -53 63 1
6590 1 50 11 89 -357 -60 226 -109 -179 287 -90 -27 538 889 -333 -424 204 -125 -185 142 -204 -90 131 -127
6613 -127 216 52 101 110 -19 -10 75 -93 -60 -26 -31 -45 -50 -6 -7 -157 131 203 3 23 -194 -117 -130 -61 -25 -161 73
6640 73 87 171 -100 153 -209 -101 -75 -67 -157 -106 15 2 43 -9 177 -98 80 -17 -210 271 189 -60 68 43 -22
6665 -22 115 20 51 65 -27 -158 -121 -285 225 127 -204 146 -21 70 25 327 57 -142 182 301 17 -58 -7 125
6689A25m09L8J09n3p4J78K1j9n5K12k65K28OO8k80p7M80k99l8K73j08K8j03j97
6713b11J20L10K1l93K66k22J54l93M04kJ23l21M75l37K36j80j68J2J22K08j29
6734I5j81q1M41Q5l36K33m80P21n83l3L0j55l44P48j29j73J12k53K13j14K45K1
6756H2J23j75L71m64O6J5M1K06k3k62J83j35J39k69J98j93nm3J26R4j83J81k15
6779a42J20J38j37j80M94k92k38M37k46k70L28m8K2pj07j07J68J20j83j0J81p3
6801c2J04K06l0j76j40J19n6k09K81o9pN0o4j67K57O2n1j57J9p4M03M8l68L9j27
6826a39j20L66q7J86P7j97j1O9N7J3j67P4j64k8K11l5j69Q9j27J29p6J46j15J29
6850A11j26j09J29j36L5L4K8j49K18p5q4J80J47j57q9JM8k8nO6jJ50m33L04J1
$$ plain form
6689 125 -284 -246 -137 -190 -264 -86 -65 -84 -139 73 -192 36 42 110 -170 -247 233 -66 -104 169 61 89 -14 -211
6713 -211 -91 219 240 -153 113 -109 45 -348 56 54 177 -144 331 -6 230 50 -118 -106 16 224 95
6734 95 -86 -167 274 359 23 256 -224 497 -86 -119 -89 -244 -588 160 31 -142 -30 -283 -70 -184 61 82
6756 82 205 30 401 -63 3 18 59 265 242 -20 163 28 167 -102 96 -97 -102 -145 -19 75 -108 73 -142
6779 -142 -22 116 -21 -201 293 1 -237 200 -46 -316 12 -36 -14 -21 -128 -235 -67 53 -130 -140 41 -32
6801 -32 72 278 248 72 -68 51 -5 -214 67 -2 -9 41 -23 -190 67 129 78 -79 -60 -134 269 317 -51 -12 -139
6826 -139 -259 107 20 206 283 86 75 144 201 214 47 121 -43 -71 140 105 -64 25 -102 27 -49 97 -18 111
6850 111 -15 -124 5 -131 -96 -62 -34 -183 35 -40 -124 56 203 46 -43 -42 6 -22 -27 39 38 188 -245 59 70
6875G0N2j86N6J56l02j96L92j55rJ37j11L19j39p4J19Qj5Qj58q0r6K63Pk19Q4
6900f9O0M3j78J49j54J12J97j91J7Q3j39q9K08j67J85p7%Pj16J53O1k86K67k71
6924a95L33qj36N8L1j01j14K76k05N7J19Q2M1j74Q0k99%J93j11K8J04jK9j59J22
6949E0K5j33J53j36J88j29k43K24J95r6j97J56k5J36j52J36m2J51k69%M4j8mJ26
6973A40j27J29m41J80J73m7N8k12L3L64k81J0j34NR2P8L1j33o0J26j50R4L50m26
6997a48J21P0k46L22j25r7J53l61K59K27j24J11k21qk68N1L02J17k61K53l9m0
7019D8K21l51l9R9P3J06j92J21j29Kl1qJ52O5mq3k78LL22m4L88n08r0J43P8J22
7045A86p8Jl8k0J89k46o3j76J70M7r0J62N4k99J15L07k02P8M1j31K49n38L29J2
$$ plain form
6875 70 122 -64 -8 148 -154 -350 42 -113 -122 15 -96 223 84 10 129 137 122 130 -28 -108 -204 59 66 -153 -69
6900 -69 -9 34 -144 5 -149 -37 160 -31 -14 69 -70 -159 49 -118 67 -10 -10 -3 -119 34 95 -191 76 -195
6924 -195 138 130 -6 52 83 -18 -132 144 -61 -4 115 197 238 64 144 -155 -155 38 -73 -45 59 58 87 -72 50
6949 50 75 -58 95 -41 147 18 -225 -1 194 98 -99 57 32 168 16 152 110 261 -8 -8 36 18 14 140
6973 140 13 142 -299 -119 54 7 65 -147 -114 250 -31 -21 -155 -150 -58 20 51 -82 -142 -16 -166 -72 278 -148
6997 -148 -27 43 -203 119 -6 -103 50 -311 -52 175 51 162 -59 -67 -335 -284 18 135 -126 127 88 48
7019 48 269 -82 -121 -22 51 157 -35 86 -43 -41 -72 -80 72 137 133 50 -228 -225 97 53 441 -67 -157 -14 64 186
7045 186 108 109 71 51 240 -6 -69 -245 -75 -28 -118 44 98 -201 -86 221 19 97 138 7 256 -282 47 59
7069E9k96K40q8O4R0P2L8J8k83P6n4J49j80P1J5j8O8j36J19l9j04l9K5J82r0K23
7095A82m3L6j43N5%P7l36K00j44K52k77J07k23K46k5M7L7j7j30K48j59j9N9k0
7119A0j20pJ50R5k16j88J83P5K03p5j91j22M03j06k15j4L3J3J42r6j59K95k13
7142a20k15K75l9M1q9L89l64J8J46k9J31j96q3R3j29K64j24j09J62O0l4O8Q7k64
7166f1J13k58J98J57j44j31K35j34J18m3P6l78L88o9Nk1Q6j70Q2j57j78N7K07
7189b2k13O8J81J04R7m02L40n5J59j75j4k80L22q3m8l2K8k0j98J66J11J6o6rk5
7214e0L6L0k2J34k3k38O9q1J5K70k05J00j80K65j25R9k58j0L06j22J50k48K4J2
7238e2J2q8n2L60p1Rj17P8j67K30k26J51qN0j37o6J21j14q6K02p4N7l0K3k6Mj66
$$ plain form
7069 59 -237 3 -85 -21 69 141 179 197 -86 -10 -64 85 -95 -24 -9 -27 41 -95 24 -15 -119 -158 -133 49 -41 182
7095 182 139 175 32 87 87 164 -172 28 -116 136 -141 -34 -257 -11 -36 11 48 31 -99 149 -10 -29 30 10
7119 10 -110 -117 33 128 -88 -276 -93 -18 185 110 -81 -203 200 94 -121 -135 -102 -89 53 -43 -202 93 -120
7142 -120 -335 -60 -99 -58 -147 242 -122 -104 42 13 144 -52 -135 -42 -171 93 -31 -140 22 82 48 116 203 -61
7166 -61 52 -206 -8 149 5 -126 109 -25 93 50 126 -252 136 67 72 51 137 -33 49 -108 -286 -229 -22
7189 -22 -235 -167 14 118 215 -187 153 98 257 82 68 -212 110 27 -21 -53 -25 -45 -243 -77 34 50 -16 -25 -50
7214 -50 -14 16 -6 128 105 -133 -64 -145 -130 140 -65 35 -145 120 -5 94 -164 -174 132 10 160 -88 -64 -52
7238 -52 -40 -128 -180 180 109 118 1 79 -88 142 -84 67 59 109 -28 -94 27 -87 -173 29 -45 12 -18 5 -21 -17 -183
7265a83K55j06k4Q0j1j43L76k14J1K0j31l1P9l8J36j76Q0j85J71j9p3K67j72J47
7289A16j50J9N3J8q9M2k62L01L0Q7L3N4l74m5m2J84K3J7Q7k13J92q9qJ54J37k19
7315E6j9J9J63Q9k24o1K05l17L40l85R2Q1J7j37K27l8k67K84m8l73K61KJ05n2
7339B0j11J63j98J94J29k79j5p5L91l27K61r5q4p0R9L01l78K69r2R9j47m0J5j04
7363g4J41j04Q0O5mk47L31l18p8N0O2K68k61m5J29J11j0j57J71l15L32LlQ4l01
7388i0P8K02k22J5j80J10J59j76K50j80J39j48J33k16K90Ok84Q8q1K76p5p1J9
7411D2j3o4K02k03Q1j89j60M43k47J00K53j35k10J1R1J51r7O9Nr6j8j70R2R0m1
7436a3q5j00J56j36Q5r4J19KJ6P5r2K09l00Pj4r6L01J76l39N6K10m4o3p6J7P7
$$ plain form
7265 -183 72 -34 -58 22 11 -132 244 30 41 61 -70 -101 -22 -60 76 -100 -20 -205 -34 -53 -126 141 -31 116
7289 116 -34 -15 38 56 -33 9 -253 48 78 165 198 252 -122 -167 -209 -25 -2 15 102 -111 81 -8 -16 138 275 56
7315 56 37 56 219 308 84 23 228 -89 251 -134 -42 39 56 -81 146 108 -159 125 77 -296 -35 -33 72 20
7339 20 -91 72 -126 68 197 -82 -97 -172 219 -108 153 58 -26 -96 3 304 -74 195 103 202 55 15 30 -74
7363 -74 67 -37 43 108 104 -143 188 -130 -208 -158 -96 172 -89 -134 -5 106 96 -61 110 -205 127 130 127 211 -90
7388 -90 -12 190 -32 -17 -197 -87 72 -104 146 -34 105 -43 90 -126 164 170 -114 -26 -107 169 94 23 42
7411 42 29 -35 167 -36 45 -144 -304 139 -108 -8 245 110 -100 -89 2 153 56 125 130 34 16 -154 -62 28 -13
7436 -13 -98 -198 -42 -178 -93 -187 -68 -66 -50 25 -67 142 -158 -151 -165 -261 40 216 -123 -67 143 99 36 -40 -23 54
7462E4j65k4J99j84N9O1%n6n7J91j79L36q0j13K79m20K94j55K53m15J9J27q2P0
7486A2m9J44J94n45J72k04J30J10j3k4L27j76kj76J06j28L37k4L2n47K90l3M8
7509a9P4k53K57l35L32k51l5j00J84m0K80k5k32q7L34N37o10l97N91k32m00K46
7531a81O78l91l92L84L43m09J63j78o4o3R6N41q75L84l10l4J30J72K9o38L35K80
7553@q2K17p1k57k00K94r9N16n09M29j76K77j01k40j4j69K52l50J96K04k88N64
7575C93o92J39L81p3r73J097j90K15o00R10J24p28n69J78k60P24M68p87L23n36
7595d56O25m85j11K04L03k79k61R17p88O14j25n04K04J84J70j29n7j10K9l18M78
7616A05k32N71l73k59M25k58O0n14n9K88J60N3J23K96k01j63J0j82Q6J90K17l2
$$ plain form
7462 54 -111 -135 64 -120 -61 0 0 -56 -113 78 -101 235 155 42 321 -99 195 40 293 -122 -103 24 -58 12
7486 12 -37 107 301 -244 -72 -276 -146 -36 -49 -73 254 78 76 -100 6 -122 215 191 223 -324 -34 -67 -19
7509 -19 55 -198 59 -276 56 -195 -230 -330 -146 -186 94 69 -163 -250 84 621 11 -386 205 -27 -427 -181
7531 -181 497 106 -286 98 441 32 195 17 -47 -110 -14 527 -348 36 -274 -308 -178 -6 23 -615 -280 0
7553 0 -82 135 64 -193 -393 -99 -198 318 -191 238 62 339 238 -2 -16 -185 67 -283 -87 117 -171 393
7575 393 -299 -160 221 148 -825 272 82 297 -303 607 731 3 -566 -388 -648 76 544 -243 80 -456
7595 -456 169 -316 -427 -223 80 -199 -460 457 -331 283 158 -346 -142 42 212 83 26 -84 -55 -373 105
7616 105 -127 444 71 -188 237 -21 39 -475 -534 -246 -86 -33 90 386 185 22 32 -150 -64 126 343 311
7638C11K94n99J8m51O37q5k42L04k55M53r18L08R4k42N11l80O46r40L29P88p82
7659b01O13n48k02O67j60K07n1j93j84K82r42N14L91J98j188R16q68J076p08L08
7679g3O27J42m36p61L21j12J37K28o9q00O98j75k52M20O62o48M83m69m4l4o2L40
7701A23j7j00k2n24N22L52J35m40n37P49n12J86l1J47l14Q7K32M36k03k7l93L40
7723A89k49l18M45k16j1J37l5Q4J18j18m9M3l49J96K15J86l70M56n72m06J20R26
7745D22r89L93N8k6n54M65r5M39M51n80k11K29k12Q1O0M46m37j7K30k96O31j048
7767e60O53j36M27m43J82j02n4J99j74O2j26p5j10N51j8Q4m21P2l72O32l2k48
7789io81Q25M03m01k45K57P4m21m84P47J87N91o31j82l82l63N9J87L98l42O93
$$ plain form
7638 311 605 6 24 -427 210 125 -117 187 -68 385 -533 -225 -131 -373 138 -242 404 -536 -207 581 -201
7659 -201 412 -136 -338 329 169 376 325 132 -52 230 -712 -198 193 391 -797 119 -749 327 -381 -73
7679 -73 554 696 260 -501 -180 -292 -155 73 4 -796 -98 -273 -525 -105 557 -91 392 -77 -121 -155 -217 123
7701 123 106 6 -16 -540 -18 334 469 29 -508 241 -271 -85 -116 31 -283 -196 36 472 269 242 -151 189
7723 189 -60 -378 67 -149 -160 -23 -58 26 144 26 -23 20 -329 -133 82 268 -102 354 -218 -624 -504 422
7745 422 -567 -174 -116 -142 -696 -231 -326 113 564 -16 -227 2 -210 -129 -69 377 -60 -77 153 -143 488 -560
7767 -560 93 -43 384 -59 123 21 -33 166 -8 54 -72 -147 -257 294 276 360 -61 11 -361 271 239 -9
7789 -9 -690 135 538 137 -108 149 223 -198 -682 65 252 843 212 30 -352 -715 -656 -469 -71 -413 280
7810B80n39R36o89J65Lm15M99l91N46j38n88J74L9k78R57p26j2N07o88N05k42
7831i5J83j79K82n4k21L07m62M07q9K9j48k2Q8p8L93j84n56K44M69rj39l14J39
7854ij92L76j6pJ0m43j57J54k51K98J60N43oq99M07m26L66j55P56n39m7k8Q06
7877G01j016M33j12k7m1P96q23o4L84o09J06L92j33q00J26R06l31J67M19q15K75
7898f6n22P59l36N6l55J06J35j9N07l27n24M67O64q24k40O56L3N7L08q7n82K23
7920H9j04j5M76p38k03J40K2P14k33R8m01K86q5l89K3m97R33J24n49L67k26J12
7942e6K63k5Mm79p8M59K93m46L7M17J2n66o01O55K53m41N0R89j046N06N08p96
7964h8j55l27M20K48O6kO25r34O02j24q5n55K57p4j39r4N24J04m0n55K57k85n0
$$ plain form
7810 280 -259 677 -12 153 156 -259 240 -151 395 257 -331 -157 -118 -396 561 -165 -177 330 -358 147 -95
7831 -95 88 -91 191 137 -84 223 -239 168 79 108 -40 -62 26 -52 341 157 -399 -155 314 305 166 -148 -9
7854 -9 -201 175 159 152 162 -281 -438 -284 -535 -237 -77 466 460 -439 -32 -458 -92 -247 509 -30 -77 -105 701
7877 701 -315 118 6 -21 -62 734 -89 -153 231 -378 -272 120 -13 -813 -687 219 -112 55 474 -341 -66
7898 -66 -588 171 -165 -109 -464 -358 -223 -242 265 -62 -586 -119 545 -279 -519 137 170 227 535 448 -134 89
7920 89 -15 -30 446 -292 -495 -355 -333 381 148 246 -155 131 46 -343 -320 -817 116 240 -309 58 -168 -56
7942 -56 207 182 186 -293 -371 88 381 -65 -28 389 401 -165 -766 -111 142 -299 -249 740 -306 200 708 -88
7964 -88 -243 -570 -150 98 164 162 787 -147 455 331 246 -309 -52 -126 -265 -359 165 269 229 -326 -69 -354 -404
7987d04J21k44L23p63O03M73K95n21k52k09J74l3Q57q11M19j055J377p46J63j44
8007c77l0M19m21N73k02J79p33O56K9k00N13q34l7N39K01j502J107R65r85Q1K55
8028A96q3k66M62n23N47n40J40k84K56J85K85m19J48j24M78q42M38l41M44o90
8048e33L23N88l0q65J4Q83j082Q47p64R67p91n15Q69p83J267J35m51nJ54m07L14
8069A35j60K01l66K12r0m59P85J19n31K18k90n99P56p6M43j036N70l3j04j41O21
8090A75q6j08j65P96j299O18N20k9o58q0k63l65O20l33k72J060k30M02l65m61
8110e23J31j14Q35o27J88j33p9m35R41m01L97k07l61l08L03P63o14k99M97l22
8130c68K20Q69j208l39O58N19k65O19k88J17j65q87L36O49m41L90r21K57j46N49
$$ plain form
7987 -404 -283 -527 -204 -967 -364 109 404 -117 -369 -578 -404 -437 420 -391 28 -1027 350 -396 -233 -377
8007 -377 -407 12 -409 164 -38 141 -592 64 93 -107 406 -428 -465 74 275 -1227 -120 845 -140 -59 196
8028 196 113 -153 309 -214 333 -207 -67 -351 -95 90 375 -44 104 -20 458 -384 54 -287 157 -533
8048 -533 -210 378 348 -517 -503 380 -702 145 -619 348 -443 -958 -89 -872 395 530 79 74 228 -179 135
8069 135 -25 176 -190 22 -68 -527 258 377 -154 64 -226 -825 -69 -145 298 -738 -168 -201 -305 -446 175
8090 175 89 -19 -184 612 -687 -69 451 422 -236 -316 -579 -944 -324 -657 -929 131 -99 303 -62 -523
8110 -523 -392 -506 329 -298 -110 -243 -322 -757 184 -217 180 -27 -388 -696 -393 370 -244 -543 -46 -368
8130 -368 -148 721 -487 -826 -168 351 86 705 417 534 369 -518 -182 467 26 416 -505 -248 -394 155
8150A55J87n40J21m36O19o9l41L67J06l28n75J159m71o49O07o43Q29n15P73k57
8170I9l52M99k39k74J2L16q7l69J168j104N91m44j37K28J93N0j13J13o47J40L03
$$ plain form
8150 155 342 -198 -77 -513 106 37 -304 63 169 -159 -734 425 -46 -695 -88 -731 98 -417 356 99
8170 99 -253 246 7 -267 -255 61 -26 -395 773 -331 260 -184 -321 -93 100 150 37 150 -497 -357 -54
8191e4
$$ Imaginary data points
##PAGE= N=2
##DATA TABLE= (X++(I..I)), XYDATA
0@%%%%%%%%%%%%%%%%%%%%qJ6j6J6j6J6k1K9l2L3m1M8n2O0o7P5q5R6j08J19j31
41f9J46j63J82k02K25k49K74l01L30l63M01m44M90n41N99o62P33q17R17j036J178
62F28j351J574j872K289k920M006o431K5139p406r016M655j3197K1407L150p589
77A3066N286j1808j4221J2819l462L914J0496j2837n711L161j1110P397Q376q598
91c232K827k991j3071Q575J936k772Q941o777j0548N008m608J960J2042n053l299
106a1062J04j1118K270Q689j551O238J45j1425J409j102j841J2019N40l894K620
121g959q182k326Q407o26M203M504q934k25J570k919P910L332l808J774l488l420
137a0187O941J030J407M570o499j932K156j246N207M907l886M16j901m825N339
$$ plain form
0 0 0 0 0 0 0 0 0 0 0 0 0 0 0 0 0 0 0 0 0 0 -8 8 -8 8 -8 8 -13 16 -16 17 -24 24 -28 32 -35 40 -45 51 -57 62 -69
41 -69 77 -86 96 -106 119 -130 144 -157 173 -190 211 -233 257 -284 315 -347 386 -431 486 -550 628
62 628 -723 851 -1021 1268 -1652 2354 -4077 21062 13656 4640 9295 -3902 17505 20655 13066
77 13066 18352 6544 -7677 5142 1680 5594 16090 3253 -2458 703 -10407 -3010 5366 -3232
91 -3232 -405 -3396 -16467 -7892 -5956 -8728 213 -6564 -17112 -12104 -16712 -14752 -2710 -7763 -11062
106 -11062 -10958 -22076 -19806 -11117 -12668 -6430 -6285 -17710 -16301 -17403 -19244 -7225 -6685 -10579 -7959
121 -7959 -16141 -18467 -10060 -10686 -6483 -1979 -10913 -11138 -9568 -12487 -4577 -1245 -5053 -3279 -6767 -10187
137 -10187 -3246 -2216 -809 3761 -2738 -4670 -2514 -3760 1447 6354 2468 2884 983 -3842 1497
152A497L020P72L826l554m300J443n52K867N321j981j053j454m433L209L240K17
168H085L084k100m837R58k24R05N580j499k165k51m309J355L709K09J623o83n090
185D350J1P2L66N070l26k510q04m020k59L837J61J755O2n663p21p7m48M535P88
204F179k698r29l474k057L820L98J256P27n001j866j03l84L431J707k659j468
220c121k246k634K822J778J60J293l521k954N34o76K219L128j919j609j618k942
236a1306K003K586O07J354j879l710L42P58J044M013m69k134l5l030J055L746
252e055R18R63M25m092q1J151O15M754L54r98q56k308Q5M602Q61J870m54k576
270A78p72P76O87L492J215r36o71j864k70K921K148M92O42k449j866N79J347K042
$$ plain form
152 1497 4517 5289 9115 5561 1261 2704 2152 5019 10340 8359 7306 5852 1419 4628 7868 8085
168 8085 11169 9069 4232 5190 4966 5871 11451 9952 7787 7536 3227 4582 8291 8500 10123 9440 4350
185 4350 4361 4433 4799 9869 9543 7033 6229 2209 1950 5787 5948 7703 7765 2102 1381 1304 856 5391 6179
204 6179 3481 2552 -922 -2979 841 1239 2495 3222 -1779 -3645 -3748 -4132 -701 1006 -1653 -3121
220 -3121 -5367 -8001 -5179 -3401 -3241 -1948 -5469 -8423 -7889 -8565 -6346 -3218 -5137 -6746 -8364 -11306
236 -11306 -9303 -6717 -6110 -4756 -6635 -10345 -10003 -9245 -8201 -4188 -4657 -6791 -6826 -9856 -8801 -5055
252 -5055 -4137 -3174 -2749 -6841 -6922 -5771 -5156 -402 -48 -1046 -1902 -4210 -4125 477 1338 3208 2754 178
270 178 -594 182 869 4361 5576 4640 3969 2105 1835 4756 6904 7396 8038 5589 3723 4302 5649 7691
288G691J941j067j729j732j065K189J947Q56l94j767k284n13J266J433J469p15
304G526k237j666j494Q22K189R46m52j633k517j316J217P37J808o92j581k330
320f73j206L66J589J193m37j172k481j006J68J388J657P8j458j873j394j8J658
337c621J891j28j015j987r72j32J649J586N17p77k041j351N59J293J823R26r92
354b772j801p12n22J720J674Q35o7j881j356J31J261J653J340n20j914q75J78
371c628J036J915O72l69o3j595p44J245J172J352N35j542j780m5P26K552J001
388B440m13j116j745J4Q39J455O38J050j326p64l73j91J966J380m32m94j784k54
406H90J451J89J835O89j512j015o31l71J655J792m26J1j219j778J045R25J032
$$ plain form
288 7691 9632 8565 6836 5104 4039 6228 8175 9031 8637 6870 4586 4073 5339 6772 8241 7526
304 7526 5289 3623 2129 2951 5140 6086 5634 4001 1484 168 1385 2122 3930 3238 1657 -673
320 -673 -1879 -1513 76 1269 832 -340 -2821 -3827 -3659 -2271 -614 -536 -1994 -3867 -5261 -5279 -3621
337 -3621 -1730 -1858 -2873 -4860 -5832 -5964 -4315 -2729 -2212 -2989 -5030 -6381 -5822 -4529 -2706 -1780 -2772
354 -2772 -4573 -5285 -5807 -4087 -2413 -1578 -1645 -3526 -4882 -4751 -3490 -1837 -497 -1017 -2931 -3806 -3628
371 -3628 -2592 -677 -5 -374 -437 -2032 -2776 -1531 -359 993 1528 -14 -1794 -1839 -1113 1439 2440
388 2440 2027 911 -834 -820 19 1474 2112 3162 1836 1072 699 508 2474 3854 3422 2928 1144 890
406 890 2341 2530 4365 5054 3542 2527 1896 1525 3180 4972 4546 4557 3338 1560 2605 3530 4562
423D562O89o68k102N3j58M60J477J81p04r26k402K28J674N86O66j05k331n78o55
442e3R45R26J8j501N72k144j209K445q31R00p2j871j068J68p56J744N03j018o17
461b919j157q52Q93M03N98L37j573o63k75k50J502J309j036J03j170j156J480
478d426O83P21P71j228r22J79j84J379J158l48K44o67j025R45J137O14J262o98
496d05j149N89M4O03J870Q6o16K00j329O22J411K95R73j25j560M55n3K26J872
515D009L3r09K13j163R9J316J00Q06K7j596n05O19k55J310N85j428n3j154n98
534A456J392R1L26L85j873q29K97l26J537P0p67l52j199p94J095M57J63M37j464
553A02j158N98k45L28J251r09o46m04j159L89J480j87P33j305j121j78R10l53
$$ plain form
423 4562 5251 4583 2481 2534 2376 2836 4313 4494 3790 2864 462 690 2364 2950 3616 3511 1180 602 -53
442 -53 892 1818 1836 335 907 -1237 -2446 -1 -832 68 -4 -1875 -2943 -2775 -3531 -1787 -1284 -2302 -2919
461 -2919 -4076 -4928 -4035 -3632 -3034 -2697 -4270 -4933 -5208 -5458 -3956 -2647 -3683 -3580 -4750 -5906 -4426
478 -4426 -3743 -3022 -2251 -3479 -4401 -4222 -4406 -3027 -1869 -2217 -1973 -2640 -3665 -2720 -1583 -969 293 -405
496 -405 -1554 -965 -921 -318 1552 1638 1022 1222 -107 515 1926 2221 3194 3069 1509 1964 1911 2137 4009
515 4009 4042 3133 3346 2183 2282 3598 3698 4504 4531 2935 2430 3049 2794 4104 4689 3261 3208 2054 1456
534 1456 2848 2939 3265 3650 1777 948 1245 919 2456 2526 1759 1407 208 -586 509 966 1129 1566 102
553 102 -1056 -458 -703 -375 876 -33 -679 -1083 -2242 -1853 -373 -560 173 -1132 -2253 -2431 -1521 -1874
571a874J610m02r98r8j333N07J472M8J63j35j843L93J20MJ742Rj125n2j101p6
591b969J749J38K52j42j212m93M12N6J475N33j179k77p07k62J069Q89J61L20j107
610a294q75M23J47J079P85n89l63o73m21R54Q19K07L35p59p55O4N68J053R67k31
630A441o72m68l43J86J844m2O3j14j167K87N86K68R49O0j050j5n06M72J013L31
650C123K47k70j310j45N68oQ25K21o87k48n87M6M57N12K6l54q23l77O2J03L80
671A763M90j103k28r13m14J147j43j0j70p05j059O53l58N98M79o48r20l25l33
690b199J55Q46m00Kn32r07j29M27N76N20n21o31j21m32M83P97j31L92p24m45k58
711c232Q76L38N73Po52k05j76K28R27M98K2j49n58L8M05M35P58p7m20oM7j35R97
$$ plain form
571 -1874 -264 -666 -1664 -1762 -3095 -2588 -1116 -1068 -905 -1040 -2883 -2490 -2370 -2366 -624 -615 -1740 -1792 -2893 -2969
591 -2969 -1220 -1082 -830 -972 -2184 -2677 -2265 -2209 -734 -201 -1380 -1657 -2364 -2626 -1557 -668 -507 -187 -1294
610 -1294 -2169 -1746 -1599 -520 265 -324 -687 -1360 -1781 -827 -8 199 534 -225 -980 -916 -348 705 1672 1441
630 1441 769 301 -42 144 1988 1946 2009 1895 728 1015 1601 1869 2818 2878 1828 1813 1307 1779 2792 3123
650 3123 3370 3100 1790 1645 2213 2207 3032 3253 2566 2318 1731 1777 2234 2746 2772 2418 1595 1218 1280 1383 1763
671 1763 2253 1150 922 9 -405 742 599 589 419 -286 -1345 -692 -1050 -452 27 -621 -1541 -1866 -2199
690 -2199 -2044 -1198 -1598 -1596 -2128 -3035 -3164 -2737 -2161 -1641 -2162 -2793 -2914 -3346 -2863 -2066 -2197 -1805 -2529 -2974 -3232
711 -3232 -2356 -2018 -1445 -1438 -2090 -2295 -2471 -2243 -1316 -818 -796 -945 -1503 -1465 -1060 -625 133 56 -364 -370 -323 -458 539
734E39P21m21Q3o27j25N92J08N14N87l76l23n09Q0Q84L26k18M6l82n24J60M20
755A555O08K05p41k18m83J13L83O60j47k33o38l60O2M47M14k3l2p33k37r4J94
776G02N07J66k38l12o74k49N81M83N9k03l93m37k07J77P31J4k5l68l35l36P1O76
798C90L13k74l01n07l67N8Q02N6k71o8m50m40O17Pm3M58m35n17k17J05J80M85
820d19P4n40n39k19K9K61O41L4m81n26l18J33L13M91n2p5m50o28L88L37J05O28
842h13j69m54m37K99J96N38J29j27j59n01J92K09P97P4j78k85K40j76L71M50M15
863F11K36o47j03NM69O51L35L0k55n29k5M67L19M20J23l29j84l59M67K07O35k94
885B250k65l59N6p1M48K71j79l74l21k31J94L35K25l51q9p34j88L3N38O1l08K55
$$ plain form
734 539 1260 839 922 295 170 762 870 1384 1971 1595 1272 763 843 1727 2053 1835 1881 1499 975 1135 1555
755 1555 2163 2368 1627 1409 926 1039 1422 2082 1935 1702 1064 704 766 1213 1627 1604 1572 839 602 508 702
776 702 1209 1375 1137 825 151 -98 483 966 1025 822 429 -8 -215 -38 693 707 682 314 -21 -357 -286 390
798 390 703 429 128 -379 -746 -688 114 170 -101 -169 -619 -1059 -442 -435 -478 -20 -455 -972 -1189 -1084 -904 -419
820 -419 -345 -885 -1424 -1643 -1614 -1353 -712 -678 -1159 -1685 -2003 -1870 -1557 -1066 -1118 -1193 -1643 -2271 -1883 -1546 -1441 -813
842 -813 -982 -1436 -1873 -1574 -1378 -840 -711 -838 -997 -1498 -1306 -1097 -300 -226 -404 -689 -449 -625 -254 196 611
863 611 847 200 97 102 571 1222 1557 1587 1332 803 778 1245 1564 1984 2107 1778 1594 1235 1702 1909 2544 2250
885 2250 1985 1626 1682 1611 2059 2330 2151 1777 1456 1225 1419 1754 1979 1628 1539 805 617 650 1188 1249 941 1196
907A196j044J84k33l7O18m72n51J72j096N52L25k06J12k68j64q92M80K72m21K98
927a175K10j030K84N4J21l38J145r49L6p2M18n75O34L20j22l97l01q4M77M75K0
948h49J42j25k89j18K30L59M27K6l60j26j43M90J10J57L10l10k89k11K54J30P79
969E94l60K79m07k63J36N15K47k23K36q11NN7L48N08j59m0m83j25J78M23L5L78
991A068k49n00j41j6K01L09L36j97l51k36qL54M0J44L5j80j75O9J57J06j1J73
1013I28j96Pk70L25O9p9K71j22n94k29M24J35M92m53k97L34k86LL56K42p20K53
1035E93p25M6K95L54l3K96p89J60m41k78K51J050j71n11n52o13K56N50L12o59
1055f09m42N44p9p92J339r39L78J04n54k90k16M20j84K46n08J08j05n34M37L18
$$ plain form
907 1196 152 336 103 66 684 212 -339 -167 -1263 -711 -386 -592 -480 -748 -912 -1804 -1324 -1052 -1473 -1175
927 -1175 -965 -1995 -1711 -1657 -1536 -1874 -729 -1678 -1642 -1714 -1296 -1871 -1237 -917 -1039 -1436 -1737 -1821 -1344 -869 -849
948 -849 -707 -832 -1121 -1239 -1009 -650 -223 -197 -557 -683 -826 -336 -226 -69 241 -69 -358 -569 -315 -185 594
969 594 234 513 106 -157 -21 494 741 518 754 -57 -52 5 353 861 702 662 179 54 232 655 690 1068
991 1068 819 319 178 162 363 672 1008 811 460 224 216 570 610 754 789 609 434 503 660 766 755 928
1013 928 732 739 469 794 863 784 1055 933 339 110 534 669 1161 708 411 745 459 462 818 1060 340 593
1035 593 -132 -86 209 563 530 826 37 197 -244 -522 -271 779 608 97 -455 -1068 -812 -262 50 -609
1055 -609 -1051 -507 -586 -1378 -39 -978 -600 -496 -1050 -1340 -1556 -1136 -1320 -1074 -1582 -1474 -1579 -2113 -1676 -1358
1075a358J14rM81o92j93l2P04N18N17j208J21n7N0N08Q11l99q84M63k12J047o93
1096d03O82K33M5l11J06k23P59K72j79J4k32K72m84M56L84j36L11n59l30N36J79
1117A392L97l76J76m77j87P9J37P0M0N9m16k1j16M07j67J12p3n23j33k22N66j29
1139E95l96l17M89o42oN00K8j24l24k29K96m38k45O67R4J03o26m61kM38p2P1M84
1162a17l36k03k29L16NQ8L45o98n2N2N9O58J24l65L3o8k95j04L99oM43m71j98
1185f20m9J54R03q28K29J30k25l18N21l20M32o2n9M5m90J04J21M94l09J0j59r9
1207c95j01L60K3qK02j70J8k49L47J07j26k39J90j66J56K56J7J49j58k15K36j48
1229H6m0M53k3p9M6k33j3r1M66L86j40l48m7MJ67K82n1J3JJ41n94L47J33n9K26
$$ plain form
1075 -1358 -1244 -1253 -772 -1464 -1657 -1689 -985 -467 50 -1158 -1037 -1094 -1044 -536 275 -124 -1008 -545 -757 290 -403
1096 -403 279 512 557 246 352 129 888 1160 981 995 763 1035 551 1007 1391 1255 1566 1007 677 1213 1392
1117 1392 1789 1413 1589 1112 925 1004 1141 1211 1251 1310 894 873 757 1164 997 1109 1036 513 380 158 724 595
1139 595 199 -118 371 -271 -277 223 251 127 -197 -426 -130 -568 -813 -146 -52 51 -575 -1036 -1038 -600 -672 -601 -117
1162 -117 -453 -656 -885 -569 -564 -476 -131 -829 -881 -829 -770 -112 12 -353 -320 -388 -683 -787 -388 -394 49 -422 -620
1185 -620 -669 -515 388 -440 -211 -81 -306 -624 -103 -423 9 -53 -112 -67 -557 -453 -332 162 -147 -137 -296 -395
1207 -395 -496 -136 -113 -121 81 -89 -71 -320 27 134 8 -231 -41 -207 -51 205 222 371 213 -2 234 86
1229 86 46 499 476 397 443 210 197 106 572 958 818 470 423 427 594 876 825 838 839 980 386 733 866 807 1033
1254A033l6k98k27K11N3K74j55j58l8k35L09n8j88K47l71L3j14j29J6j26L05k46
1276A02j06m61J58Q0K24m1m29L10n18n9J03K4J08l08m4l23J22M13m84J46J3j58
1298a128r9Q9L17r3M0J22j91k69J70J9K03j01J85m8J1J45o6L6J41J94Q6k10J48
1321b99J46k8K15P9l26K45J63m69N72N1R5m3o6r4J47K95n0J6m5j22J96R3J64j19
1345H16j5L5k67L21j47N8r3J08j46J15r3j95J26m6k50K24k51P9m9J36k70J43J00
1368D39l54J72K8j36p9q0J80k16n4p3J15J22j88J17J66l88L3k2P6j83K53k00L4
1391b38K17LNn3J80m30K13K51m37J17J26q4j0q5K18n5j78R8j21J32k40P0Q2J75
1415d4j2jq3q2J43j70m7K37k08Q0k25L03r5l9J23k87m2J10k44M8L17o5R8j64m7
$$ plain form
1254 1033 997 699 472 683 736 1010 855 697 659 424 733 675 487 734 363 396 282 153 169 43 348 102
1276 102 -4 -465 -307 -227 -3 -44 -473 -163 -681 -740 -637 -613 -505 -813 -857 -1180 -1058 -645 -1129 -983 -970 -1128
1298 -1128 -1227 -1138 -821 -914 -874 -752 -943 -1212 -1042 -1023 -820 -921 -736 -784 -773 -628 -694 -658 -517 -323 -237 -447 -299
1321 -299 -153 -181 34 113 -213 32 195 -274 298 349 444 401 335 241 388 683 633 649 604 482 678 771 935 816
1345 816 801 836 569 890 743 801 708 816 670 785 692 497 623 577 327 551 300 379 330 466 196 339 439
1368 439 85 257 285 149 70 -10 170 -46 -100 -173 -58 64 -124 -7 159 -229 -196 -218 -142 -325 -72 -272 -238
1391 -238 -21 -18 -13 -66 114 -316 -103 148 -289 -172 -46 -130 -140 -225 -7 -62 -240 -142 -263 -131 -371 -301 -219 -44
1415 -44 -56 -57 -140 -222 -79 -249 -296 -59 -267 -187 -412 -109 -204 -243 -120 -407 -449 -339 -583 -535 -218 -283 -185 -349 -396
1440c96k42N7O8q1J40J48j46P8J2n1M12q5k27K31k93P3L92j44K22j26r1K7L58
1463C36P4j15N4L11l07J55N1m7k3J52r9J22jp5o7L47N0K2k25J30L7l28R8J69k0
1488H01k52K16K19k19J96l25J68p4l62K33q3M5q5o2M7k94p0P3j44r6J91l22K21
1511B2l12J1j80r8L06j33k15N4O3r0l6r1P2k94Q4m2k0J51L0j70j74K7M28j49J02
1536f54j16R3K1j84K80j99K90q3j50P63p80M82J6q9J36MP1J5k76K21Q7R9K72k20
1560I9k8J24j58J95J06k41K79q8k4j00J27J69J79k26K8l2P0O6k43K3J30K9o4K51
1584F71j51k39K00r2R1j58L5j18K28k04p0l2K85k26k60J80M06r2k61j53Q3J60
1606B83J24k48R3q1m7M0l9J4j59J80qj89J82j40J27L63l04r9J53p1m9p4R4K37
$$ plain form
1440 -396 -638 -581 -513 -594 -454 -306 -452 -374 -362 -413 -1 -86 -313 -82 -375 -302 90 -54 168 42 -49 -22 336
1463 336 410 295 349 660 353 508 559 512 489 641 542 664 663 588 521 868 918 940 715 845 882 554 652 821 801
1488 801 549 765 984 765 961 636 804 730 368 601 518 563 478 416 463 169 99 172 28 -68 123 -199 22
1511 22 -290 -279 -459 -557 -251 -384 -599 -545 -482 -572 -608 -699 -627 -921 -837 -879 -899 -748 -718 -888 -1062 -1035 -607 -756 -654
1536 -654 -770 -677 -656 -840 -560 -759 -469 -552 -702 61 -719 -237 -221 -310 -174 -170 -99 -84 -360 -139 -52 47 319 99
1560 99 71 195 37 232 338 97 376 288 264 164 291 460 639 413 441 409 479 545 302 325 455 484 420 671
1584 671 520 281 481 389 480 322 357 239 467 263 193 161 446 220 -40 140 546 454 193 40 123 283
1606 283 407 159 252 171 124 164 125 139 -20 160 152 -37 145 5 132 495 191 92 245 174 125 51 145 382
1630C82m08m2K11l15K91j74m4K1N3q4j65N46l47p4j00q2J12j89n4L05r2m7o2J13
1654b45k6k31j02J20l58M61j98k26K45J72j28R0%j92J9K3J22k45J18J8K4j88J35
1677e92K30M1Q3m71K15K90l27M61o2J06j90K19k0K0J27j52M93k87J54J1l1J35
1699D53m6j87M79k52P1J18O0m4J64j11L6k62K16Q7j8j67K11k32O6Q0l9j14P1j65
1723D75L8J85k78J18n1Ol47J20Q0Lr2r0j16Ko8j14L39k69k25j23P1K12k98K55
1747a67l09J04k05J84Lj40J32r5K46k75k4P3L4L2j09J1J18p9J15k52Q8l5K33o0
1771c77K76k17j01O4L20l46J31J38j81K65J1j90O2J91l62M57m9lj74n5L13k70
1793i7K08k40K91J67k03l12M14j62J95k80J20KK01k01jm2J50k10N5L0j7q7J02
$$ plain form
1630 382 -26 -68 143 -172 119 -55 -99 -78 -25 -109 -274 272 -75 -149 -249 -331 -219 -408 -462 -157 -249 -296 -358 -245
1654 -245 -271 -502 -604 -484 -842 -381 -579 -805 -560 -388 -516 -426 -426 -618 -599 -576 -454 -699 -581 -563 -539 -727 -592
1677 -592 -362 -321 -238 -709 -494 -204 -531 -70 -132 -26 -216 3 -17 3 130 -22 471 184 338 349 318 453
1699 453 407 220 699 447 518 636 696 652 816 705 741 479 695 782 764 597 808 576 642 722 683 569 640 475
1723 475 513 698 420 538 487 493 146 266 346 349 257 167 51 53 -15 -129 210 -59 -284 -407 -336 -124 -422 -167
1747 -167 -476 -372 -577 -393 -390 -530 -398 -493 -247 -522 -546 -473 -439 -407 -516 -505 -387 -466 -351 -603 -515 -550 -317 -377
1771 -377 -101 -318 -419 -355 -35 -381 -250 -112 -293 -28 -17 -207 -145 46 -316 141 92 89 -85 -140 173 -97
1793 -97 111 -129 162 329 126 -186 228 66 261 -19 101 103 304 103 102 60 210 0 55 85 68 -19 83
1816H3J28r2J1J23j62qk3j07K46k73K11%j43J7K11j94J1R8j47J97K6m8J51K9o4
1841B81l88N06k81K05ll64O26k74J48r9n8J13l54K58NK6j59J09k70J58J17q7q9
1864A26J20m00K52J63k97O8J0l35K72p7j33K64k94j82K67k52J39o4M8j26k4J86
1886b69k02Q0ol09jK32j39J84q3k03K19m1J35j66J31k49N5K37M1k65K23R2l38
1909f42K83k73M25jn3P4pl0L00r0K97k67J25N5J34k90M9J98L8J21k25J75R2%J89
1934F77j26K09l9j58m0K15m20M78k50j29J81km5k0M63o31J4M5j71P9K6k2k24K08
1958C18q2j97K57lp3j52N9l4m4k42J52K25m43J06j76L63m22J33K16j00k66K6R6
1981b83j27L47n09M00j52j23j4K89m27O11j81N8K0r9K37j59k80O23l22L7m46L40
$$ plain form
1816 83 211 119 130 253 91 83 60 -47 199 -74 137 137 -6 11 222 28 39 137 -10 187 213 165 316 345 281
1841 281 -107 399 118 323 320 -44 582 308 456 357 299 412 58 316 321 347 188 297 27 185 302 215 126
1864 126 246 -154 98 261 -36 32 42 -293 -21 -98 -231 33 -261 -443 -176 -428 -289 -353 -305 -431 -455 -269
1886 -269 -471 -391 -397 -706 -707 -475 -614 -430 -513 -716 -497 -538 -403 -569 -438 -687 -632 -395 -354 -619 -396 -304 -642
1909 -642 -359 -632 -207 -208 -261 -187 -194 -224 76 -14 283 16 141 196 330 40 89 287 325 446 221 396 488 488 677
1934 677 551 760 721 563 523 738 318 796 546 417 598 596 551 531 994 363 377 422 251 330 356 334 110 318
1958 318 236 39 296 293 220 68 127 93 49 -193 -41 184 -259 -153 -329 34 -388 -255 -39 -139 -405 -379 -283
1981 -283 -410 -63 -572 -172 -324 -447 -461 -172 -599 12 -169 -111 -91 -190 47 -112 -392 231 -91 -54 -500 -160
2003a60j33q3P32m17l89P86j371J145M02k36M68r97J30o48M47l93J699p19n21
2022b58K67K35N24j920N13J247j408P48K84j46Q7k29J12p22N20N64l77K5o61M99
2042i6J99k47J81k29M64l59J03k28K47L6M11q43j24Q24n35M97p70J034j86M55
2062H34j012L0P14m27P2j0J86M6k15J42j15K2N2r3K59J41m91J74k1R2n3j88L31
2085D70Mk16M6j02K9K50k26k13J40P7k45P1J6k2lp5J54l26on7O8k02J39j36l8
2110d03l9O8j67J63n6m1J76l2j67k8j00Q5m1M04m46J5rp2L73k60K07k32K60n3
2134c95j45J73J80j69PJ11k02j6N99l15J60j39K24Q0j43rK83l42J74M7J03N6k36
2157H6O1J22J79K7j23l25L32p3K02k03L16o4l11L59l47mL18l1k50l04M02P4k39
$$ plain form
2003 -160 -293 -376 356 -61 -450 336 -1035 110 512 276 744 -253 -123 -771 -324 -717 982 263 -258
2022 -258 9 244 768 -1152 -639 608 -800 -52 232 86 173 -56 56 -666 -146 418 41 66 -595 -96
2042 -96 103 -144 37 -192 272 -87 16 -212 35 71 482 -361 -485 339 -196 301 -469 565 379 834
2062 834 -178 -148 566 139 211 201 387 433 218 360 245 267 319 226 485 626 135 309 288 380 327 139 470
2085 470 474 258 304 202 231 481 255 42 182 259 14 85 101 79 76 1 155 -171 -177 -234 -166 -368 -229 -365 -403
2110 -403 -442 -374 -541 -378 -434 -475 -299 -331 -498 -526 -626 -541 -582 -178 -624 -609 -618 -690 -317 -577 -370 -602 -342 -395
2134 -395 -540 -367 -187 -356 -349 -238 -440 -456 143 -172 -12 -151 73 153 10 1 284 -58 116 163 266 322 86
2157 86 147 269 448 475 352 27 359 286 488 285 601 537 226 585 238 234 552 521 271 -33 369 443 204
2180B04O0j66j17L07J10Lm8j09j22m2Qm7j36n4J89r3K68m18P9m7J35r3p5j33L48
2205A1J71j43m87L44m2k1J60n6k51K49l2p7L89l19j96K10M5p7k9R0n2L0m2L7J05
2230A7j62J39r8K05j65K11k93J10J50j36J92j04m0r3j94L00j26P7pk15J27l1L18
2253A82l44rq0L4L10J6l97M19k22M2j2J5j45R6J79l21p00O19K20j32m37L49K01
2276a17L87j69n48O48l70L74j96J35K5k19K6P1p2L86j72j24P3m8J34R9j57J67
2298C33J32l19K29j51Q7n9J66o8k54K69j45o5K02j81J97Q1j22J08k42j41K96o0
2320B93l04m3J6l78M20k99P1M66o70P92j52l0m04np86O37L0J86m79L18Jq7n0J12
2344c45K85m52L98k40R5K8O6k79n2J06J92j03J30k56K76k28K75l46J15LPJJ25
$$ plain form
2180 204 264 98 -19 288 398 401 353 244 122 80 88 41 -95 -149 40 -53 215 -203 -124 -171 -36 -129 -204 -337 11
2205 11 182 39 -448 -104 -146 -167 -7 -63 -314 -65 -97 -174 215 -104 -300 -90 -45 -122 -151 -61 -113 -83 -125 -88 17
2230 17 -145 -6 -104 101 -64 147 -146 -36 114 -22 170 66 26 -67 -261 39 -87 -10 -17 -232 -105 -136 182
2253 182 -162 -171 -251 -217 93 109 -288 131 -91 -49 -61 -46 -191 -95 84 -237 -937 -318 -98 -230 -667 -318 -117
2276 -117 270 101 -447 201 -169 205 9 144 169 -50 -24 47 -25 361 189 65 138 90 224 323 166 333
2298 333 465 146 375 224 311 252 418 350 96 365 220 155 357 176 373 454 332 440 198 57 353 293
2320 293 -11 -54 -38 -416 4 -295 -224 242 -428 364 212 182 -222 -227 -1013 -376 -346 -160 -639 -321 -320 -407 -457 -345
2344 -345 -60 -512 -114 -354 -259 -231 -165 -444 -496 -390 -198 -301 -171 -427 -151 -379 -104 -450 -335 -332 -325 -324 -199
2367a99j02K38p6mR1j05K12j43L7K10j13L03n03J4N21k81K75m53P90k74j98J59
2389C99l87K46q6p2k49O50n14L75p01Q12N5J36m98l16N07k04J55K95j97n15L70
2410B61m40M34m89O4J85L12k63K68n65J20k12L65M4J40m04l0j28K43L3o8K20k74
2432a84L34j45q5l43K42k36N63N3m16N24j78k20l9R8j35J25j57K54N0k46L1N8
2454e2j62K07Q7K75o32L76P8J98l76j61J4K31k47K29l40L39j99l6j19L99k34r9
2476b24p0K31j92M83j51J14m09J49L10o78M00l24J82j71K55n04M52oP5o5p1L5
2498a79l5r3J29J63j69K40j42j61J54P6o21O06P19o93o5K99j33J22l85J02K19
2519A53q1r2J36R2J79k23K44j44M06nl54l01J29qJ7L68l45O21k09l00m44L09J37
$$ plain form
2367 -199 -301 -63 -139 -143 -52 -157 55 -88 -51 159 46 349 -154 -140 381 100 375 -78 712 438 240 399
2389 399 12 258 172 100 -149 501 -13 362 -339 473 528 664 166 -150 357 153 308 603 406 -109 261
2410 261 -179 255 -234 -170 15 327 64 332 -233 -113 -325 40 84 224 -180 -210 -338 -95 -62 -130 90 -184
2432 -184 150 5 -80 -423 -181 -417 146 199 -217 307 129 -91 -130 -32 -167 -42 -199 55 105 -141 -110 -52
2454 -52 -214 -7 80 355 -277 99 177 375 -1 -162 -148 83 -164 65 -275 64 -135 -171 -290 109 -125 -224
2476 -224 -294 -63 -255 228 77 191 -218 -69 241 -437 -37 -361 -179 -350 -95 -599 -147 -153 -78 -143 -214 -179
2498 -179 -214 -307 -178 -15 -184 56 -86 -247 -93 -17 -638 -32 687 -6 -71 228 95 217 -168 -66 153
2519 153 72 -20 116 208 387 164 408 264 670 665 311 10 139 131 148 516 171 792 583 283 -161 148 285
2542B85K33R6o01Q4o7j39O96k00J20k51n5K88q88J29K97L47q88J35M38n90L51
2563a80J022r36J08J34r94j14R13n79O40o6J43l00P0j21j59kJ150j076m7J6pO01
2585B16m76M20j69K39o81P60r3K59n01L10l64p50M88K47L48m87J84K24j74m26
2605d26J91K49l47M30o23K57L81l95K09k78K36J577p48o61J29L43j39o89N50p
2625B39L58p43k70K80K70O5k23J12k26J95L69Q2r68P90M43j070L03r2m44R29j64
2646B35j744J107mJ19N66o13O2R2L60l15K55l44l14J069q22L40qn13O82m59n09
2667g58O7J079l28p5Q94m92o68K54l36N10K44n77O39n32P12r88J99M56j05n50
2687c55J248p97r9n26J468N5j417J02P14n9j595J591M3m52P38r57K3K6j60L0P24
$$ plain form
2542 285 518 614 13 97 30 -109 587 387 507 256 201 489 -399 -270 27 374 -514 -379 59 -531 -180
2563 -180 842 -94 14 148 -846 -960 -47 -626 14 -52 91 -209 -139 -260 -419 -421 729 -347 -394 -378 -385 216
2585 216 -260 160 -9 230 -451 309 216 475 -26 284 -80 -830 -342 -95 253 -234 -50 174 0 -426
2605 -426 -235 14 -333 97 -526 -269 112 -283 -74 -352 -116 1461 713 52 181 524 385 -304 246 239
2625 239 597 -146 -416 -136 134 199 -24 88 -138 57 426 508 -460 330 773 -297 6 -86 -530 399 235
2646 235 -1509 -402 -406 -287 279 -334 -272 -180 180 -135 120 -224 -538 531 -291 49 41 -472 210 -249 -758
2667 -758 -691 388 60 -15 879 387 -281 -27 -363 147 391 -186 453 -79 633 -355 -156 300 195 -355
2687 -355 893 96 -3 -529 939 994 -423 -321 393 334 -1261 330 373 -79 659 -298 -275 -249 -409 -379 345
2708C45j206L32P70k05q05N55R1l27J22L71k5n88N45L2l86N06p96m3Q9J042l56
2729F3ml12J0L49n43K54J10K88j08j41l04N47K60K35q34K15J65m76L80M42K69
2750H65r90M73J2j46j9L05n7L41j83j07J07o88O92O8j113Q08n99L64l72J52M53
2771C66J47o74j71k7L98m41Q24k74l47K72l48K56M4o21M84j87o3j02P00k90l13
2792c67p5L79j9Om11L11L54p21N90k68L2K51l8l72J95K20j043K31M29J84l64L59
2814a37R7J75m91J68l22KQ81n17L03p43O49l25K84o85M84K32L36J29o62L73k01
2835C0K02m96J61q8nL07q4k69O66o3M77q37l66P67m79n78M19J86j55m05L69P01
2857D60k17m24J48l41L61j33m43Q96q10k06O04R25q59j40N39j043J69L04k1l4
$$ plain form
2708 345 -861 -529 241 36 -769 -214 -123 -450 -328 43 18 -570 -25 7 -379 127 -669 -712 -623 419 63
2729 63 59 -253 -243 106 -437 -183 -73 215 107 -34 -338 209 469 704 -130 85 250 -226 154 596 865
2750 865 -125 348 360 214 195 500 443 784 601 494 601 -87 605 673 -440 368 -231 133 -239 -87 366
2771 366 513 -161 -332 -359 39 -402 422 148 -199 73 -275 -19 25 -596 -112 -299 -362 -464 236 -54 -367
2792 -367 -442 -63 -82 -76 -487 -176 178 -543 47 -221 -189 62 24 -348 -153 67 -976 -745 -316 -132 -496 -137
2814 -137 -40 135 -356 -188 -510 -508 373 -144 159 -584 65 -260 24 -661 -177 55 391 520 -142 231 30
2835 30 232 -264 -103 -191 -196 111 27 -242 424 361 838 1 -365 402 -77 -655 -236 -50 -205 -610 -241 460
2857 460 243 -181 -33 -374 -13 -146 -589 307 -503 -709 -105 820 -39 -179 360 -683 -514 -210 -231 -265
2877b65R16r42j04M5O31l95n94P13q53N79M14j72j45K85q27J139p81M98k2k49
2897a29L60j06n48L91J71J19l5l69M99L52n27o98J073n68m9O49o60P38m47p9Q73
2918A010j308P94j141L14Q92k13r34Q47k53M86q28l1J04j7N23K62q30J70K47k68
2938a74O69q54J44L43K56o66K76P4j297J355j48n58N25Q1M48o18n5M65r41O75
2958@k79m46P58o10L76K69J85j040J99M27J08m60RK40P7J59J01j14J71R7q6M40
2980E81m92k63N51m32M85n44L71k53o3J32K9P6L98l42j32L99j56k36N22k40l55
3001C6l56N71j54n7M96o94O22k48l44J93J58l00M45K04q06K19j81K22k07J7L23
3022A59K5n55j62L88L2K02m05j86O81o81M82k55M97l59J15n3L15n89J41K63J1
$$ plain form
2877 -265 651 -291 -395 -350 281 -114 -708 5 -848 -269 145 -27 -172 113 -714 425 -356 142 120 -129
2897 -129 231 125 -423 -32 139 258 223 -146 353 705 178 -520 553 -15 -64 585 -75 663 216 137 1010
2918 1010 -298 496 -645 -331 561 348 -586 261 8 494 -334 -365 -261 -278 245 507 -323 -153 94 -174
2938 -174 495 -359 -215 128 384 -282 -6 68 -1229 126 -22 -580 -55 26 474 -144 -199 266 -675 0
2958 0 -279 -725 33 -577 -201 68 253 -787 -588 -161 -53 -513 -504 -264 -187 -28 73 -41 130 227 141 581
2980 581 89 -174 377 -55 430 -114 257 4 -59 73 102 178 576 234 102 501 345 109 631 391 36
3001 36 -320 251 97 40 536 -158 464 216 -128 65 223 -77 368 572 -234 -15 -196 26 -181 -164 159
3022 159 184 -371 -533 -145 -113 89 -316 -502 179 -502 -20 -275 222 -137 -22 -75 240 -349 -208 55 66
3043F6k24J34k6L1M36n75P6J99p5J54k88%J29J52K6k05M9M1l73L85rk45J15L30
3067C03l17J85j31r1M00l71k57O0M07k27J23j82L26l69K98j71L60k54k34J9J30
3088GL7k57K4j60K40k8m2j6J51L0K0j0j92J04l38J71K44l94N33k70K67j43K73
3111B51n34J08L67k4M9j81J02O8K02k21J78j37j83k7M63j39J10n38K32M73m93
3132A26n2K80M1l92n4l9P56p51j81L02p3K32k25M04p56L69O1L10l91O72j088j3
3154d62L66l35Q35n30J93J85j19j63k57O14k72J3P2J57n50l40K68N2j75M35l53
3175c66R22j159k36O94J98K33K00m36K52j303N96J192j360M31j39O97n44l32R9
3194c61N20k83L23Kk18o45L68J50J83K83l46K80k54L1K79l8j64j90M96j68l3j8
$$ plain form
3043 66 -158 -24 -50 -19 417 -158 -82 117 42 196 -92 -92 37 189 215 10 59 100 -273 112 103 -142 -27 303
3067 303 -14 171 40 -51 349 -22 -279 -219 188 -39 84 -98 228 -141 157 -14 346 92 -142 -123 7
3088 7 44 -213 -189 -349 -109 -137 -179 -195 -44 -14 6 -4 -196 -92 -430 -259 -15 -409 124 -146 121 -22 251
3111 251 -283 -175 192 168 217 36 138 206 408 187 365 228 45 18 481 342 452 -86 146 619 126
3132 126 74 354 395 3 -51 -90 666 -85 -266 36 -37 195 -30 374 -382 -13 48 358 -33 639 -449 -462
3154 -462 -96 -431 404 -126 67 252 133 -30 -287 327 55 68 140 297 -253 -593 -325 -273 -448 -13 -366
3175 -366 556 -603 -839 -145 53 286 486 50 302 -1001 -405 787 -573 -142 -281 416 -128 -460 -361
3194 -361 159 -124 199 201 -17 -662 -294 -144 39 322 -24 256 2 33 312 274 110 -80 416 248 215 197
3216A97J57k44L04j79j31k53L07K92l87J55K9o59M75Qm51O08k61L72j41o5j76
3237d3K02l50M00m09N3j30K91o9K5j79K77j91K65j79l8NO04o40J81k45M45k92
3259a7k96K75J32M25p81l08L91O83o60Q4m1O45p51O40n28o19K27N46J28n78j85
3280e88J55K55j4P5K66N3k71J91r3K13m43o99N78O82o16J26Q8K79p7k71k74J36
3302b49N81j97n16K06Q8J95k31N05q85M37m32L56K3j88K64l36P0K55K4j84J08
3323a06L5l8q2J19o9k4j18K53O5j9L0j09J23k42N1o3R1M9N6O3l3K7k81K38j29
3348a13K78j02j13NK87j83K3J43J01mj86o3M7M3J41j10qN7Lr6j44J38Qj02J04
3373A54Q2j52Q2J65l62J04Pk36J38M6j01M3J2M5r3o8K47j45k60K54k13l6P9J36
$$ plain form
3216 197 354 110 414 235 104 -149 158 450 63 218 247 -412 63 71 -380 228 -33 339 198 133 -43
3237 -43 159 -191 209 -200 -147 -277 14 -55 -30 -209 68 -123 142 -37 -75 -70 534 -106 75 -170 275 -17
3259 -17 -313 -38 94 519 -262 -570 -179 504 -156 -72 -113 532 -219 421 -107 -726 -499 47 175 -403 -588
3280 -588 -433 -178 -192 -117 149 202 -69 122 29 242 -201 -900 -322 360 -256 -130 -42 237 160 -111 -385 -249
3302 -249 332 135 -381 -175 -87 108 -123 382 -503 -66 -498 -142 -119 -307 -43 -379 -309 -54 -30 -214 -106
3323 -106 -71 -109 -191 -72 -141 -165 -283 -30 35 16 46 -63 60 -182 -131 -194 -103 -54 2 65 32 59 -222 16 -113
3348 -113 165 63 -50 -45 242 59 82 225 326 322 136 73 120 163 304 194 186 243 246 150 6 144 152 50 154
3373 154 236 84 166 331 -31 73 80 -156 -18 28 -73 -30 -18 27 -66 -134 113 -32 -292 -38 -251 -287 -208 -72
3397g2J24j98j78K05J14M9n2J6l4j44J25J08j29j96K96j55L7k2j9l20L84J17j47
3420i1j77j13J67K28Q8l93K58L6o8J42k40K30O5k7kl8j40J51J3l4O4m7j23K33
3444A82j4l75J38L60l99K3J52k2k37N7K65j23q2j45J90j48J95k23O5J60k10K48
3466E7o7Mk24J99k13L19j23j99L11J71k47l1J09J25m61M93l65M38j00o27R07r11
3488d35J83K21k01j89L48l76k96J345o03K83o55L59L06K36j135O20K73P6J20o39
3508a59O25r26N2K41N78J26k45n25J06M01m66J2M21lKj165N56L65j85Q09n65l89
3530c34K24LP9J52k8k82J65j11OL4k04J72k84M63l29J88J55k92L12k0m53O80l80
3553h4j42K6o9J44N15q33N77m17Q5j2p9k00J38M61J8J19l93J22J32p42O30K06
$$ plain form
3397 -72 52 -146 -324 -119 -5 44 -8 8 -26 -170 -45 63 -66 -262 34 -121 -84 -106 -125 -445 -61 56 -91
3420 -91 -268 -381 -214 14 102 -291 -33 3 -65 77 -163 67 132 105 103 65 -75 76 89 55 119 72 -51 182
3444 182 168 -207 -69 291 -108 -85 67 45 -192 -135 130 7 -75 -220 -30 -178 17 -206 -141 19 -191 57
3466 57 -10 -6 -230 -31 -244 75 -48 -247 64 235 -12 -43 66 191 -270 223 -142 296 196 -431 476 -435
3488 -435 -252 -31 -232 -421 -73 -449 -745 600 -3 280 -375 -16 290 526 -609 11 284 360 480 -159
3508 -159 466 -460 -408 -167 411 537 292 -233 -127 274 -192 -180 241 238 240 -925 -369 -4 -189 620 55 -334
3530 -334 -110 -107 -28 124 96 -186 -21 -132 -126 -92 -296 -124 -408 55 -274 -86 69 -223 89 69 -384 296 -84
3553 -84 -226 -200 -269 -125 390 -443 134 -283 -198 -210 -289 -489 -351 110 128 247 -146 -24 108 -634 -4 202
3575B02m56P82k82j98r2J059j085L74l16l07J08L29j76J28O67o37J72ok85jO9
3596D9ol2J54k09J70J12m69L09l1R8jj98O5j41L20k59K02l05K71k41j06N88r7
3619B43m02k73p4L97J14M6l75N72k29m23K96K84o32p7K56J23P74m98N1m83P7J17
3641a16m88P78j2l79qk03P38n54J8J79j21M62n02M28Q4J3n08J52p2K67m0q2K5
3664E9q8L4l6j40L33k12J34j55K89l76J15M2J18k47J78J90j0k35kq3K09j17m03
3687d03L38R5r8J4N3l6np7J20k09K33o9K3o7p7O8r3K78J78n00J72L58n47N17j98
3712F8N6Q5j28p2Q7Rj91J13rQ1L1j15L86k76j71K59j1j14R1o0M0J14k85J74j03
3737E9J63l07Q5K66o4P9j69p1K44k59J8J28K8K8r7L4j51l9o8J19j0q2O1rK9r9
$$ plain form
3575 202 -254 528 246 48 -44 1015 -70 304 -12 -319 -211 118 -58 70 737 100 272 266 -19 -20 49
3596 49 43 11 165 -44 126 238 -231 78 47 145 144 -54 11 -130 190 -69 133 -172 99 -142 -248 340 243
3619 243 -159 -432 -506 -109 5 51 -324 248 19 -404 -108 176 -456 -533 -277 -154 620 122 173 -310 -233 -116
3641 -116 -604 174 162 -217 -225 -428 310 -244 -226 -47 -168 294 -208 220 304 317 -191 -39 -111 156 116 34 59
3664 59 -29 5 -31 -171 162 -50 84 -71 218 -158 -43 -1 117 -130 48 238 228 -7 -9 -92 117 0 -403
3687 -403 -65 30 -68 -54 -1 -37 -42 -119 1 -208 25 -44 -21 -88 -165 -97 -190 88 266 -234 -62 296 -251 266 68
3712 68 124 209 81 9 96 105 -86 27 18 99 130 15 401 125 -46 213 202 88 179 119 159 273 -12 162 59
3737 59 222 -85 0 266 202 281 112 41 285 26 44 172 200 228 131 165 14 -25 -93 26 16 -66 -5 -14 15 -84
$$ [...]
8191b81
##END NTUPLES=NMR FID
##END=
