##TITLE=1H_SRM-164.K.TFA
 CDCl3
 24 sc, 
 11.5.2023
##JCAMPDX= 6.0         $$ Bruker NMR JCAMP-DX V2.0
##DATA TYPE= NMR FID
##DATA CLASS= NTUPLES
##ORIGIN= UXNMR, Bruker Analytische Messtechnik GmbH
##OWNER= root
$$ XWIN-NMR		Version 3.5
$$ Thu May 11 14:30:32 2023 Russian Standard Time (UT+4h)  she@DPX200
##.OBSERVE FREQUENCY= 200.13135
##.OBSERVE NUCLEUS= ^1H
##.DELAY= (6, 6)
##.ACQUISITION MODE= SIMULTANEOUS
##.ACQUISITION SCHEME= undefined
##.AVERAGES= 24
##.DIGITISER RES= 18
##SPECTROMETER/DATA SYSTEM= spect
##.PULSE SEQUENCE= zg30
##.SOLVENT NAME= CDCl3
##.SHIFT REFERENCE= (INTERNAL, CDCl3, 0, 15.7039)
##AUDIT TRAIL= $$ (NUMBER, WHEN, WHO, WHERE, WHAT)
$$ ##TITLE= Audit trail, XWIN-NMR		Version 3.5
$$ ##JCAMPDX= 5.01
$$ ##ORIGIN= Bruker BioSpin GmbH
$$ ##OWNER= she
$$ F:/spectra/data/she/nmr/H-F/1/audita.txt
$$ ##AUDIT TRAIL=  $$ (NUMBER, WHEN, WHO, WHERE, WHAT)
(   1,<2023-05-11 14:29:25.10 +0400>,<she>,<DPX200>,
      <continue with go, POWCHK disabled, PULCHK disabled
       configuration hash MD5:
       00 E9 B6 7A A2 85 ED C7 34 08 36 98 17 FE 4E 26
       data hash MD5: 16K
       F6 D4 65 1E 76 E5 2C D7 37 69 E0 3C AF D7 AA CE>)
$$ ##END=
$$ 
$$ hash MD5
$$ 3D 6D 54 50 D9 AB 2A 4F A6 59 E8 A7 A1 50 56 86
##$RELAX= 
##$RELAX= 
##$RELAX= 
##$RELAX= 
##$RELAX= 
##$RELAX= 
$$ Bruker specific parameters
$$ --------------------------
##$DU= <F:/spectra>
##$EXPNO= 1
##$NAME= <H-F>
##$PROCNO= 1
##$TYPE= <nmr>
##$USER= <she>
##$AMP= (0..31)
100 100 100 100 100 100 100 100 100 100 100 100 100 100 100 100 100 100 
100 100 100 100 100 100 100 100 100 100 100 100 100 100 
##$AQSEQ= 0
##$AQ_mod= 1
##$AUNM= <au_zg>
##$AUTOPOS= <>
##$BF1= 200.13
##$BF2= 200.13
##$BF3= 200.13
##$BF4= 200.13
##$BF5= 200.13
##$BF6= 200.13
##$BF7= 200.13
##$BF8= 200.13
##$BYTORDA= 1
##$CFDGTYP= 0
##$CFRGTYP= 5
##$CHEMSTR= <none>
##$CNST= (0..31)
1 1 145 1 1 1 1 1 1 1 1 1 1 1 1 1 1 1 1 1 1 1 1 1 1 1 1 1 1 1 1 1 
##$CPDPRG= <>
##$CPDPRG1= <>
##$CPDPRG2= <>
##$CPDPRG3= <>
##$CPDPRG4= <mlev>
##$CPDPRG5= <mlev>
##$CPDPRG6= <mlev>
##$CPDPRG7= <mlev>
##$CPDPRG8= <mlev>
##$CPDPRGB= <>
##$CPDPRGT= <>
##$D= (0..31)
0 1.2 0 0 0 0 0 0 0 0.06 0 0.03 0 0 0 0 0.0002 0 0 0 0 0 0 0 0 0 0 0 0 
0 0 0 
##$DATE= 1683800871
##$DBL= (0..7)
120 120 120 120 120 120 120 120 
##$DBP= (0..7)
150 150 150 150 150 150 150 150 
##$DBP07= 0
##$DBPNAM0= <>
##$DBPNAM1= <>
##$DBPNAM2= <>
##$DBPNAM3= <>
##$DBPNAM4= <>
##$DBPNAM5= <>
##$DBPNAM6= <>
##$DBPNAM7= <>
##$DBPOAL= (0..7)
0.5 0.5 0.5 0.5 0.5 0.5 0.5 0.5 
##$DBPOFFS= (0..7)
0 0 0 0 0 0 0 0 
##$DE= 6
##$DECBNUC= <off>
##$DECIM= 32
##$DECNUC= <off>
##$DECSTAT= 4
##$DIGMOD= 1
##$DIGTYP= 9
##$DL= (0..7)
0 120 120 120 120 120 120 120 
##$DP= (0..7)
150 150 150 150 150 150 150 150 
##$DP07= 0
##$DPNAME0= <>
##$DPNAME1= <>
##$DPNAME2= <>
##$DPNAME3= <>
##$DPNAME4= <>
##$DPNAME5= <>
##$DPNAME6= <>
##$DPNAME7= <>
##$DPOAL= (0..7)
0.5 0.5 0.5 0.5 0.5 0.5 0.5 0.5 
##$DPOFFS= (0..7)
0 0 0 0 0 0 0 0 
##$DQDMODE= 0
##$DR= 18
##$DS= 0
$$ [...]
##$SUBNAM2= <"">
##$SUBNAM3= <"">
##$SUBNAM4= <"">
##$SUBNAM5= <"">
##$SUBNAM6= <"">
##$SUBNAM7= <"">
##$SUBNAM8= <"">
##$SUBNAM9= <"">
##$SW= 18.05172834244
##$SWIBOX= (0..15)
0 0 2 0 0 0 0 0 0 0 0 0 0 0 0 0 
##$SW_h= 3612.71676300578
##$TD= 16384
##$TD0= 1
##$TE= 0
##$TE2= 300
##$TE3= 300
##$TEG= 300
##$TL= (0..7)
0 120 120 120 120 120 120 120 
##$TP= (0..7)
150 150 150 150 150 150 150 150 
##$TP07= 0
##$TPNAME0= <>
##$TPNAME1= <>
##$TPNAME2= <>
##$TPNAME3= <>
##$TPNAME4= <>
##$TPNAME5= <>
##$TPNAME6= <>
##$TPNAME7= <>
##$TPOAL= (0..7)
0.5 0.5 0.5 0.5 0.5 0.5 0.5 0.5 
##$TPOFFS= (0..7)
0 0 0 0 0 0 0 0 
##$TUNHIN= 0
##$TUNHOUT= 0
##$TUNXOUT= 0
##$USERA1= <user>
##$USERA2= <user>
##$USERA3= <user>
##$USERA4= <user>
##$USERA5= <user>
##$V9= 5
##$VALIST= <valist>
##$VCLIST= <CCCCCCCCCCCCCCC>
##$VD= 0
##$VDLIST= <DDDDDDDDDDDDDDD>
##$VPLIST= <PPPPPPPPPPPPPPP>
##$VTLIST= <TTTTTTTTTTTTTTT>
##$WBST= 1024
##$WBSW= 4
##$XGAIN= (0..3)
0 0 0 0 
##$XL= 0
##$YL= 0
##$YMAX_a= 309034
##$YMIN_a= -192777
##$ZGOPTNS= <>
##$ZL1= 120
##$ZL2= 120
##$ZL3= 120
##$ZL4= 120
##$ABSF1= 10
##$ABSF2= 0
##$ABSG= 5
##$ABSL= 3
##$ALPHA= 0
##$AQORDER= 0
##$ASSFAC= 0
##$ASSFACI= 0
##$ASSFACX= 0
##$ASSWID= 0
##$AUNMP= <proc_1d>
##$AZFE= 0.1
##$AZFW= 0.1
##$BCFW= 1
##$BC_mod= 2
##$BYTORDP= 1
##$COROFFS= 0
##$CY= 11.3945322036743
##$DATMOD= 1
##$DC= 2
##$DFILT= <>
##$DTYPP= 0
##$F1P= 15.7292609196834
##$F2P= 12.9074282941183
##$FCOR= 0.5
##$FTSIZE= 0
##$FT_mod= 4
##$GAMMA= 1
##$GB= 0.15
##$INTBC= 1
##$INTSCL= 1
##$ISEN= 128
##$LB= 0.24
##$LEV0= 0
##$LPBIN= 0
##$MAXI= 10000
##$MC2= 0
##$MEAN= 0
##$ME_mod= 0
##$MI= 1.114404
##$NCOEF= 0
##$NC_proc= 0
##$NLEV= 6
##$NOISF1= 3.799351
##$NOISF2= 2.8
##$NSP= 1
##$NTH_PI= 0
##$NZP= 0
##$OFFSET= 15.70392
##$PC= 1
##$PHC0= -19822.87
##$PHC1= 4.600801
##$PH_mod= 1
##$PKNL= yes
##$PPARMOD= 0
##$PSCAL= 0
##$PSIGN= 0
##$REVERSE= no
##$SF= 200.130013532006
##$SI= 16384
##$SIGF1= 3
##$SIGF2= 2
##$SINO= 400
##$SIOLD= 16384
##$SREGLST= <1H.CDCl3>
##$SSB= 0
##$STSI= 0
##$STSR= 0
##$SW_p= 3612.71676300578
##$SYMM= 0
##$S_DEV= 0
##$TDeff= 0
##$TDoff= 0
##$TI= <>
##$TILT= no
##$TM1= 0
##$TM2= 0
##$TOPLEV= 0
##$USERP1= <user>
##$USERP2= <user>
##$USERP3= <user>
##$USERP4= <user>
##$USERP5= <user>
##$WDW= 1
##$XDIM= 8192
##$YMAX_p= 0
##$YMIN_p= 0
$$ End of Bruker specific parameters
$$ ---------------------------------
##NTUPLES= NMR FID
##VAR_NAME=  TIME,          FID/REAL,        FID/IMAG
##SYMBOL=    X,             R,               I
##VAR_TYPE=  INDEPENDENT,   DEPENDENT,       DEPENDENT
##VAR_FORM=  AFFN,          ASDF,            ASDF
##VAR_DIM=   8192,          8192,            8192
##UNITS=     SECONDS,       ARBITRARY UNITS, ARBITRARY UNITS
##FACTOR=    0.0002768,     1,               1
##FIRST=     0,             0,               0
##LAST=      2.2672688,     0,               0
##MIN=       0,             -192777,         0
##MAX=       2.2672688,     309034,          0
$$ Real data points
##PAGE= N=1
##DATA TABLE= (X++(R..R)), XYDATA
$$ plain form
0 0 0 0 0 0 0 0 0 0 0 0 0 0 0 24 -24 24 -24 24 -48 48 -48 72 -73 96 -120 126 -145 169 -198 239 -265 308 -341
33 -341 386 -438 497 -557 624 -697 778 -869 964 -1066 1183 -1308 1446 -1594 1759 -1937
49 -1937 2137 -2351 2593 -2859 3152 -3484 3858 -4282 4770 -5337 6007 -6812 7803 -9047
63 -9047 10676 -12908 16158 -21374 31112 -55619 261169 309034 -130409 63322 281398 211269
75 211269 -48575 -31017 110766 150995 -26037 -131261 -64273 31279 -70932 -192777 -160692
86 -160692 -41121 -46735 -127431 -143228 -37441 30656 -31772 -111936 -35379 67261 17511 -68754
98 -68754 18490 144697 108348 7999 29733 103320 95019 28959 10186 45884 61299 10756
110 10756 -30777 3213 36874 -15427 -75807 -55689 -13453 -21319 -52249 -59299 -28253 13248
$$ packed form
0@%%%%%%%%%%%%%K4m8M8m8M8p2R6r6J20j45J69k16K46k71L14l67M37n04N73o49
33c41P27q24R35j054J181j321J475j647J833k030K249k491K754l040L353l696
49a937M074m488M944n452O011o636P342q140R052j0107J1344j2819J4615j6850
63i047J9723k3584K9066l7532N2486q6731L16788M7865m39443J93731K18076p0129
75B11269k59844J7558J41783M0229j77032j05224O6988R5552j02211j21845L2085
86a60692J19571n614q0696j5797J05787O8097o2428q0164P6557J02640m9750q6265
98f8754Q7244J26207l6349j00349K1734P3587q301o6060j8773L5698J5415n0543
110A0756m1533L3990L3661n2301o0380K0118M2236p866l0930p050L1046M1501
$$ plain form
122 13248 9811 -30072 -19552 32629 26287 -24846 -12652 43096 45717 5129 -3467 21078 31424
135 31424 8185 -18084 -10365 10651 -5066 -30506 -11600 15877 -3884 -32601 -20541 859
147 859 -868 -12899 -20350 -14867 5213 13905 3711 8082 27920 23474 2487 4610 21070 20807
161 20807 10519 8945 13284 19907 16898 826 -5949 1141 -7950 -25122 -18807 -2677 -9717 -20804
175 -20804 -14761 -7028 -8340 -11935 -16045 -18344 -9784 -3840 -4871 477 12448 10289 2406 6815 11596
190 11596 7563 4951 4717 4097 9363 14931 10180 5275 8148 4201 -6908 -5872 645 -2905 -6408
205 -6408 -3316 79 749 1547 -2360 -7315 -6550 -5322 -8487 -6697 -930 -1066 -3074 -226 1249 -1983
221 -1983 -3946 -4615 -6395 -3212 2517 4320 4025 7180 6542 2255 3454 5817 4525 2228 3232 3369
$$ packed form
122A3248l437l9883J0520N2181o342n1133J2194N5748K621m0588q596K4545J0346
135C1424k3239k6269P719K1016j5717k5440J8906K7477j9761k8717J2060K1400
147H59j727j2031p451N483K0080Q692j0194M371J9838m446k0987K123J6460k63
161B0807j0288j574M339O623l009j6072o775P090r091j7172O315J6130p040j1087
175b0804O043P733j312l595m110k299Q560N944j031N348J1971k159p883M409M781
190A1596m033k612k34o20N266N568m751m905K873l947j1109J036O517l550l503
205f408L092L395O70P98l907m955P65J228l165J790N767j36k008K848J475l232
221a983j963o69j780L183N729J803k95L155o38m287J199K363j292k297J004J37
$$ plain form
237 3369 4602 7755 6206 2509 1662 1253 -2362 -3736 -2467 -4087 -6126 -4460 -2975 -4508 -4906 -6803
253 -6803 -9074 -9543 -7198 -6233 -4273 -878 841 1496 3737 5659 5965 5691 5985 5609 6572 9691 9683 8213
271 8213 7105 4951 2188 1159 -828 -2873 -5022 -5365 -5729 -5496 -5126 -5915 -7942 -8240 -7141 -6832 -5704
288 -5704 -4192 -3272 -2097 -926 1465 3166 4735 5726 5225 5322 7003 6818 6996 7267 7359 6391 5815 4733
306 4733 3041 -21 -3430 -4807 -4935 -4701 -5787 -6708 -6286 -6768 -7570 -7040 -6410 -5352 -5181 -3341 -1190
323 -1190 1293 3718 4595 4111 4805 5488 5458 5025 4696 4702 5151 6092 6058 5046 3173 375 -1972 -3019 -3106
342 -3106 -3775 -4007 -4327 -4644 -4162 -4138 -4902 -5594 -6356 -5553 -4072 -1989 283 1907 2626 3679 4277 4048 4408
361 4408 4533 4261 3814 4810 5334 5779 4843 2543 -267 -1205 -1639 -2297 -3317 -3360 -3083 -4149 -4180 -3388 -3748
$$ packed form
237C369J233L153j549l697q47m09l615j374J269j620k039J666J485j533l98j897
253f803k271m69K345R65J960L395J719O55K241J922L06k74K94l76R63L119qj470
271H213j108k154k763j029j987k045k149l43l64K33L70p89k027k98J099L09J128
288e704J512R20J175J171K391J701J569R91n01R7J681j85J78K71R2r68n76j082
306D733j692l062l409j377j28K34j086r21M22m82q02N30O30J058J71J840K151
323a190K483K425Q77m84O94O83l0m33l29OM49R41l4j012j873k798k347j047q7
342c106o69k32l20l17M82K4p64o92p62Q03J481K083K272J624P19J053N98k29L60
361D408J25k72m47R96N24M45r36k300k810r38m34o58j020m3K77j066l1P92l60
$$ plain form
380 -3748 -4764 -3792 -3773 -3425 -1540 -266 -64 652 2192 2794 3136 3796 3272 2541 3724 3675 3767 4022 4487
399 4487 2252 898 906 -150 -1407 -1532 -2373 -3932 -3242 -2721 -3364 -3101 -3148 -3476 -3673 -2395 -1191 -1804 -1037
418 -1037 248 397 1743 3564 4123 2274 2633 3469 1759 2525 3188 1635 1321 2577 2073 533 447 -324
436 -324 -2903 -2476 -1238 -2507 -3057 -1983 -2502 -2744 -1058 -894 -2418 -2320 -2150 -1693 -537 2424 2000 515
454 515 1947 2357 940 1398 2757 748 662 2864 2365 1404 2053 1408 -1566 -900 695 -614 -1271 -311
472 -311 -1636 -2794 -527 358 -1601 -2128 -1375 -2898 -1661 761 -343 -1239 448 1060 -247 1581 2463
489 2463 -584 -614 2161 2284 1374 3338 2471 -650 437 2016 -201 -332 1097 -1565 -2305 938 857
506 857 -2189 -1292 -922 -2839 -2024 644 -827 -2968 -535 -24 -507 1742 3109 -606 -695 1418 945
$$ packed form
380c748j016R72J9L48J885J274K02P16J540O02L42O60n24p31J183m9R2K55M65
399D487k235j354Qj056j257j25q41j559O90N21o43K63m7l28j97J278J204o13P67
418a037J285J49J346J821N59j849L59Q36j710P66O63j553l14J256n04j540q6p71
436c24k579M27J238j269n50J074n19k42J686J64j524R8J70M57J156K961m24j485
454E15J432M10j417M58J359k009q6K202m99r61O49o45k974O66J595j309o57R60
472c11j325j158K267Q85j959n27P53j523J237K422j104q96J687O12j307J828Q82
489B463l047l0K775J23r10J964q67l121J087J579k217j31J429k662p40L243q1
506H57l046Q97L70j917Q15K668j471k141K433N11m83K249J367l715q9K113m73
$$ plain form
523 945 718 3264 1653 -464 1164 2619 452 541 1599 -1425 -2149 270 27 -1938 -896 -876 -2960
540 -2960 -1579 947 -1642 -2901 -924 -532 -1021 1791 2352 -244 -343 2339 1060 904 3227 1740 -1168
557 -1168 1144 3289 638 1141 1737 -781 -1960 1021 451 -2118 -1235 -1292 -3070 -1235 1367 -1176 -2188
574 -2188 -849 -1667 -2118 928 1328 -1032 -181 1908 640 556 2909 1151 -1047 1391 2292 890 1551
591 1551 2175 -822 -627 1424 467 -1482 -659 -1296 -2628 -388 1399 -679 -1312 -491 -1189 -2805 -222
608 -222 158 -2083 -670 995 29 415 2272 796 -556 701 1393 -73 980 2065 -711 -267 2682
625 2682 1139 -257 381 -610 -2001 -30 1277 -323 -767 -72 -923 -1359 580 -201 -2382 -1690 -124
642 -124 -969 -133 1567 -157 -1178 56 599 -247 752 1258 -277 -47 1975 1252 -80 977 159 -1016
$$ packed form
523I45k27K546j611k117J628J455k167Q9J058l024p24K419k43j965J042K0k084
540b960J381K526k589j259J977L92m89K812N61k596r9K682j279j56K323j487k908
557a168K312K145k651N03N96k518j179K981n70k569Q83n7j778J835K602k543j012
574b188J339q18m51L046M00k360Q51K089j268q4K353j758k198K438R01j402O61
591A551O24k997J95K051r57j949Q23o37j332K240J787k078o33Q21o98j616K583
608b22L80k241J413J665r66L86J857j476j352J257O92j466J053J085k776M44K949
625B682j543j396O38r91j391J971J307j600m44O95q51m36J939p81k181O92J566
642a24q45Q36J700j724j021J234N43q46R99N06j535K30K022p23j332J057q18j175
$$ plain form
660 -1016 559 1026 -374 -546 349 -956 -780 1086 -77 -1311 -1274 -628 -1348 -1044 -66 -552 -1174 330
678 330 -129 -704 799 1148 -874 173 1243 675 700 1240 935 629 1271 1315 -208 -131 401 -262 -643 259
698 259 -32 -1523 -842 -556 -1454 -1185 -489 -1517 -1101 -424 66 -461 516 1052 -310 456 860 588 516 1670
718 1670 1105 1209 1829 1423 901 722 624 -74 70 535 84 -693 -515 -401 -1304 -1101 -1028 -1775 -1733 -812 -1073
739 -1073 -1112 -258 -38 -342 -228 726 421 656 1200 1059 907 1593 1371 940 949 1173 272 242 384 -374 -256
760 -256 -514 -455 -940 -796 -618 -917 -1154 -877 -1132 -875 -1346 -216 -349 -14 536 102 257 308 1463 817
780 817 1197 1537 1341 1190 1201 606 561 520 155 -282 -304 -317 -499 -511 -797 -1137 -961 -1282 -1317 -796 -964 -470 -596
803 -596 -155 113 74 286 467 210 713 991 334 434 1072 1382 641 562 631 -2 290 -281 271 -209 -395
$$ packed form
660a016J575M67j400j72Q95j305J76J866j163j234L7O46p20L04R78m86o22J504
678C30m59n75J503L49k022J047J070n68K5N40l05l06O42M4j523P7N32o63l81R02
698B59k91j491O81K86q98K69O96j028M16O77M90n27R77N36j362P66M04k72p2J154
718A670n65J04O20m06n22j79r8o98J44M65m51p77J78J14r03K03P3p47M2R21k61
739a073l9Q54K20l04J14R54l05K35N44j41j52O86k22m31RK24r01l0J42p58J18
760b56k58N9m85J44J78k99k37K77k55K57m71J130j33L35N50m34J55N1J155o46
780H17L80L40j96j51J1n95m5m1l65m37k2j3j82j2k86l40J76l21l5N21j68M94j26
803e96M41K68l9K12J81k57N03K78o57J00O38L10p41p9O9o33K92n71N52m80j86
$$ plain form
824 -395 -385 -1023 -690 -877 -535 -1208 -829 -1525 -1025 -293 -309 33 232 192 161 492 436 456 861 530 345 754
846 754 1023 1294 511 1236 345 358 -55 -211 -115 -581 -1099 -301 -108 -540 -860 -1209 -916 -650 -606 -801 -400
867 -400 -640 -171 -264 163 560 540 521 338 855 1119 1337 878 621 899 836 685 569 423 -81 -47 11 -478
889 -478 -981 -675 -898 -1035 -1099 -724 -1089 -1056 -865 -149 187 31 -93 50 356 335 718 999 881 915 1202 1000
911 1000 1078 605 772 743 132 -151 338 -281 -714 -390 -775 -893 -712 -783 -1320 -1082 -945 -803 -873 -353 -528
932 -528 -479 30 -177 434 713 903 378 808 1194 751 951 919 767 208 605 649 -288 313 71 -744 -969
953 -969 -547 -545 -1258 -1030 -1009 -949 -54 -783 -731 -1191 -218 75 -218 683 383 214 -18 1586 305 729 1358
974 1358 881 459 1289 1422 -113 152 545 -834 -378 -66 -622 -1545 -522 -971 -1670 -788 -215 -1422 -804
$$ packed form
824c95J0o38L33j87L42o73L79o96N00P32j6L42J99m0l1L31n6K0M05l31j85M09
846G54K69K71p83P25q91J3m13j56R6m66n18P98J93m32l20l49K93K66M4j95M01
867d00k40M69r3M27L97k0j9j83N17K64K18m59k57K78o3j51j16j46n04L4N8m89
889d78n03L06k23j37o4L75l65L3J91P16L36j56j24J43L06k1L83K81j18L4K87k02
911A000P8m73J67k9o11k83M89o19m33L24l85j18J81p1n37K38J37J42p0N20j75
932e28M9N09k07O11K79J90n25M30L86m43K00l2j52n59L97M4r37O01k42q15k25
953i69M22Kp13K28K1O0Q95p29N2m60R73K93k93R01l00j69k32J604j281M24O29
974A358m77m22Q30J33j535K65L93j379M56L12n56r23J023m49o99Q82N73j207O18
$$ plain form
993 -804 -324 -368 50 937 25 -300 239 1252 675 632 1194 -56 48 992 801 57 710 264 -533 74
1013 74 728 -146 -1107 -125 -695 -1082 -510 105 -988 -960 -618 -549 -357 238 -68 -1257 -19 740 206 67
1033 67 450 -84 31 1471 1203 569 1125 760 -425 326 1044 126 -415 490 -614 -647 295 -53 -1078
1052 -1078 -1098 -59 -259 -613 -74 -655 -1758 -265 16 -449 250 795 -657 -370 1077 607 -392 722
1070 722 459 -56 338 1253 756 52 460 312 -365 754 544 -877 -831 -420 -692 -519 94 -796 -1607 -820
1090 -820 -218 -926 39 177 -723 -613 431 685 -270 679 102 -275 854 1477 699 382 179 203 268 1211
1110 1211 722 -573 149 -110 -224 -195 804 -916 -1376 -758 -536 -964 -358 -190 -737 -1148 370 -236 -377
1129 -377 894 73 133 815 1115 507 562 1438 8 315 1163 893 -432 -116 99 -724 -24 461 -888
$$ packed form
993h04M80m4M18Q87r12l25N39J013n77m3N62j250J04R44j91p44O53m46p97O07
1013G4O54q74r61R82n70l87N72O15j093K8L42O9J92N95l06j189J238P59n34j39
1033F7L83n34J15J440k68o34N56l65j185P51P18r18n41R05j104l3R42l48j025
1052a078k0J039k00l54N39n81j103J493K81m65O99N45j452K87J447m70r99J114
1070G22k63n15L94R15m97p04M08j48o77J119k10j421M6M11k72J73O13q90q11P87
1090h20O02p08R65J38r00J10J044K54r55R49n77l77J129O23p78l17k03K4O5R43
1110A211m89j295P22k59j14K9R99j720m60O18K22m28O06J68n47m11J518o06j41
1129c77J271q21O0O82L00o08N5Q76j430L07Q48k70j325L16K15q23P00M85j349
$$ plain form
1148 -888 -1017 89 -571 -486 -45 -406 -1280 -616 403 26 -82 -90 -94 -422 926 1038 579 237 886 -278
1168 -278 392 959 925 256 509 565 -490 251 384 -288 -906 -69 -607 -501 -384 -753 -1411 -905 -124 -497
1188 -497 -536 -235 -316 -473 404 171 428 815 729 148 71 1201 907 552 315 248 267 358 513 81 -849 -156
1210 -156 -491 -497 -237 1 -1153 -712 19 -723 -549 -534 -850 -546 -249 54 135 135 339 30 1069 927 815
1231 815 524 759 450 -95 790 134 273 226 213 96 136 -626 -621 -1038 -570 -456 -438 -823 -793 -609 -632 82 151
1254 151 113 293 410 259 768 657 746 241 683 901 -10 281 996 327 54 144 -110 -169 -25 -137 -345
1275 -345 -142 -592 -695 -411 -182 -523 -691 -260 -189 -253 -149 -237 -151 -14 18 306 366 668 370 -50 1034 471
1297 471 466 432 101 327 435 -436 138 168 -340 225 -109 -688 -490 -325 -377 -629 16 -154 -724 -202 -331 -46
$$ packed form
1148h88j29J106o60Q5M41l61q74O64J019l77j08qml28J348J12m59l42O49j164
1168b78O70N67l4o69K53N6j055P41J33o72o18Q37n38J06J17l69o58N06P81l73
1188d97l9L01q1j57Q77k33K57L87q6n81p7J130k94l55k37o7J9R1J55m32r30O93
1210a56l35oK60K38j154M41P31p42J74J5l16L04K97L03Q1%K04l09J039j42j12
1231H15k91K35l09n45Q85o56J39m7j3j17M0p62Nm17M68J14J8l85L0J84k3P14O9
1254A51l8J80J17j51N09j11Q9n05M42K18r11K91P15o69k73R0k54n9J44j12k08
1275c45K03m50j03K84K29l41j68M31P1o4J04q8Q6J37L2K88O0L02k98m20J084n63
1297D71nl4l31K26J08q71N74L0n08N65l34n79J98J65n2k52O45j70n70N22j29K85
$$ plain form
1319 -46 -4 -61 -336 231 233 0 491 158 854 449 276 19 606 187 414 -59 123 -44 -137 -145 -355 14 -225
1342 -225 -262 -519 -69 -690 -576 -594 -344 -209 122 -98 122 150 264 570 -34 410 787 229 513 531 325
1363 325 214 234 428 64 67 -45 7 -239 394 286 -98 -340 -416 -611 -571 -630 -120 -73 -895 -232 -443 -130 -184
1386 -184 -55 452 332 358 758 638 606 395 132 604 398 220 431 366 -76 -324 -166 28 -272 -261 -280 -355
1408 -355 -473 -433 -776 -504 -341 -73 -167 -278 38 -390 194 -265 241 239 98 332 675 712 318 546 167 213
1430 213 350 112 165 -41 -68 191 137 -650 185 -197 19 -166 178 -428 -460 -233 -309 -681 93 263 -295 -210
1452 -210 -90 285 123 365 323 145 551 115 278 508 500 587 97 -90 74 -593 110 -451 -647 -98 -14 -477
1474 -477 -809 -185 -560 -577 -780 -28 187 258 84 -103 302 486 114 -135 257 55 261 666 150 -103 191
$$ packed form
1319d6M2n7k75N67Kk33M91l33O96m05j73k57N87m19K27m73J82j67r3qk10L69k39
1342b25l7k57M50o21J14j8K50J35L31k20K20K8J14L06o04M44L77n58K84J8k06
1363C25j11K0J94l64Lj12N2k46O33j08l84k42p6j95M0n9N10M7q22O63k11L13n4
1386a84J29N07j20K6M00j20l2k11k63M72k06j78K11o5m42k48J58J94l00J1j9p5
1408c55j18M0l43K72J63K68r4j11L16m28N84m59N06kj41K34L43L7l94K28l79M6
1430B13J37k38N3k06k7K59n4p87Q35l82K16j85L44o06l2K27p6l72P74J70n58Q5
1452b10J20L75j62K42m2j78M06m36J63K30qQ7m90j87J64o67P03n61j96N49Q4m63
1474d77l32O24l75j7k03P52K15P1j74j87M05J84l72k49L92k02K06M05n16k53K94
$$ plain form
1495 191 363 -38 312 -397 106 -598 -287 -400 -420 21 -207 -525 -301 201 -368 -174 -280 -203 -205 141 265
1516 265 437 -41 710 433 513 332 215 -125 329 193 164 300 281 537 -354 291 227 -162 342 314 -887
1537 -887 -966 -281 -169 -471 150 -310 -311 -135 318 -366 -15 -80 -609 -147 935 544 129 27 456 224 232 825
1559 825 15 -148 17 52 143 520 173 -297 -898 407 -481 -605 -104 -387 -879 59 -168 -458 -365 -287 -339
1580 -339 -83 759 988 312 171 392 -69 655 556 293 37 581 491 -30 397 44 96 -93 41 -226 -419
1601 -419 95 -572 -691 -554 230 -364 -222 274 -576 -153 705 -160 -234 366 342 -6 163 991 428 -10 379
1622 379 32 306 475 -88 -19 -21 -122 -183 -361 -30 -648 -652 32 -212 -931 -39 -244 -539 -406 46 128 -711
1644 -711 96 694 -53 590 859 394 41 635 555 323 685 307 -603 181 443 -114 68 87 -271 -522 -156
$$ packed form
1495A91J72m01L50p09N03p04L11j13k0M41k28l18K24N02n69J94j06P7kL46J24
1516B65J72m78P51k77Q0j81j17l40M54j36k9J36j9K56q91O45o4l89N04k8j201
1537h87p9O85J12l02O21m60jJ76M53o84L51o5n29M62J082l91m15j02M29k32QN93
1559H25q10j63J65L5R1L77l47m70o01J305q88j24N01k83m92R38k27k90R3P8n2
1580c39K56Q42K29o76j41K21m61P24r9k63k56N44r0n21M27l53N2j89J34k67j93
1601d19N14o67j19J37P84n94J42M96q50M23Q58q65p4O00k4l48J69Q28n63m38L89
1622C79l47K74J69n63O9kj01o1j78L31o18mO84k44p19Q92k05k95J33M52Q2q39
1644g11Q07N98p47O43K69m65l53N94q0k32L62l78r10P84K62n57J82J9l58k51L66
$$ plain form
1665 -156 42 -439 -208 -224 -519 -367 -23 266 -179 -75 99 392 427 280 -105 86 301 50 434 1031 144
1686 144 -301 207 267 -12 278 126 140 -175 137 -117 -10 6 -363 -332 -172 -137 -263 -146 -23 -596 197 237
1708 237 620 397 127 637 -24 -90 443 557 494 -15 666 1 87 581 -157 -106 -31 -137 -213 -175 81 -685
1730 -685 -611 -56 -454 -113 -308 -140 -566 478 235 89 -81 311 197 159 216 339 -127 591 504 226 542
1751 542 384 136 -175 343 -144 270 280 -152 -50 -208 -412 -336 195 -301 -318 -349 -47 -165 -218 -422 136 -36
1773 -36 -55 147 -102 195 307 231 226 428 481 540 358 261 -144 267 142 36 -207 224 49 -186 -466 -138 69
1796 69 -101 -461 -482 -421 -362 -556 112 -217 229 -10 -176 -142 438 24 302 770 361 431 -122 303 -192 304
1818 304 411 -60 234 364 -371 -241 179 -73 -345 -416 -545 -266 -24 56 -290 295 -313 89 -168 -235 -398
$$ packed form
1665a56J98m81K31j6k95J52L44K89m45J04J74K93L5j47l85J91K15k51L84N97q87
1686A44m45N08O0k79K90j52J4l15L12k54J07J6l69L1J60L5j26J17J23n73P93M0
1708B37L83k23k70N10o61o6N33J14o3n09O81o65Q6M94p38N1P5j06p6L8K56p66
1730f85P4N55l98L41j95J68m26J044k43j46j70L92j14l8N7J23m66P18q7k78L16
1751E42j58k48l11N18m87M14J0m32J02j58k04P6N31m96j7l1L02j18n3k04N58j72
1773c6j9K02k49K97J12p6nK02N3N9j82r7m05M11j25j06k43M31j75k35k80L28K07
1796F9j70l60k1O1N9j94O68l29M46k39j66L4N80m14K78M68m09P0n53M25m95M96
1818C04J07m71K94J30p35J30M20k52k72p1j29K79K42Q0l46N85o08M02k57o7j63
$$ plain form
1839 -398 -2 123 -121 252 84 -111 -157 108 512 94 256 21 315 -158 -129 -11 201 -600 400 -204
1859 -204 -422 -224 -410 -115 21 -294 -81 -482 -265 -230 -200 48 55 43 -7 84 342 278 110 140 302 78 123
1882 123 504 207 224 183 246 245 -204 -200 -204 -132 150 -110 -486 -210 -285 -50 51 75 -317 30 -286 553 365 -23
1906 -23 790 275 -204 687 169 321 277 143 387 368 -93 123 171 -229 -124 -228 -344 -427 -246 -177 -45 34
1928 34 -387 -70 83 -207 21 -111 -16 152 236 92 241 342 384 195 81 184 10 190 552 146 311
1949 311 94 13 -74 -256 -244 -242 -73 68 300 -279 -11 -73 -248 -163 234 130 -303 -330 -78 43 40 -151 132
1972 132 285 11 191 -281 -207 350 645 -123 -111 266 -448 -41 341 232 -109 -10 -773 -182 1 -346 -482
1993 -482 -240 -44 -768 -363 66 -104 -347 192 197 233 66 -123 -26 38 578 67 226 456 -36 -165 175 61
$$ packed form
1839c98L96J25k44L73j68j95m6K65M04m18J62k35K94m73K9J18K12q01J000o04
1859b04k18J98j86K95J36l15K13m01K17L5L0K48Pj2n0R1K58o4j68L0J62k24M5
1882A23L81k97J7m1O3jm49MmP2K82k60l76K76p5K35J01K4l92L47l16Q39j88l88
1906b3Q13n15m79Q91n18J52m4j34K44j9m61K16M8m00J05j04j16q3J81O9J32P9
1928C4m21L17J53k90K28j32R5J68Q4j44J49J01M2j89j14J03j74J80L62m06J65
1949C11k17q1q7j82J2KJ69J41K32n79K68o2j75Q5L97j04m33k7K52J21lj91K83
1972A32J53k74J80m72P4N57K95p68J2L77p14M07L82j09l41R9p63N91J83l47j36
1993d82K42J96p24M05M29j70k43N39NL6j67j89R7O4N40n11J59K30m92j29L40j14
$$ plain form
2015 61 -167 -208 -49 -68 93 17 -133 -182 171 -142 140 -202 3 -424 210 -28 -213 -42 -190 -51 69 481
2037 481 385 430 88 342 -183 109 299 -60 -706 124 -289 -275 -360 210 -721 213 168 47 36 -321 -243 -222 -597
2060 -597 93 25 -501 -329 -186 199 -436 631 -733 95 376 172 -126 318 -506 -124 572 11 415 291
2080 291 -6 -401 -116 34 44 -4 -77 -32 -647 -212 202 -312 -884 -315 29 -15 127 49 618 24 553 325
2102 325 474 89 245 74 277 294 203 -227 105 -5 -24 552 -117 -523 72 -415 -484 40 -69 -116 46 105
2124 105 -66 -98 165 194 -432 36 -29 217 218 -150 81 182 366 207 -137 7 583 278 -294 24 57 237
2146 237 -236 499 -198 -329 -155 -94 -212 101 -343 -354 323 240 -166 -75 352 -449 256 378 -66 250 -137
2167 -137 251 266 -2 -53 -230 -8 -54 167 -28 111 100 124 -53 -294 -276 -678 -276 -88 -331 141 -10 -111
$$ packed form
2015F1k28m1J59j9J61p6j50m9L53l13K82l42K05m27O34k38j85J71j48J39J20M12
2037D81r6M5l42K54n25K92J90l59o46Q30m13J4q5N70r31R34m5j21j1l57P8K1l75
2060e97O90o8n26J72J43L85o35J067j364Q28K81k04k98M44q24L82O96n61M04j24
2080B91k97l95K85J50J0m8p3M5o15M35M14n14n72N69L44m4J42p8N69n94N29k28
2102C25J49l85J56j71K03J7r1m30L32j10j9N76o69m06N95m87o9N24j09m7J62N9
2124A05j71l2K63K9o26M68o5K46Jl68K31J01J84j59l44J44N76l05n72L18L3J80
2146B37m73P35o97j31J74O1j18L13m44j1O77q3m06R1M27q01P05J22m44L16l87
2167a37L88J5k68n1j77K22m6K21j95J39j1K4j77k41J8m02M02J88k43M72j51j01
$$ plain form
2189 -111 -161 412 -459 106 96 -108 -186 229 88 181 214 305 25 118 67 196 -307 248 22 -231 66 417 -219
2212 -219 -216 45 -43 91 -325 385 -419 -114 -20 -136 44 105 -526 -339 -141 233 12 296 354 -133 221 522
2234 522 -109 180 59 -102 -18 345 239 33 29 -281 6 -357 -177 122 -144 -352 -230 -502 -316 -196 253
2255 253 -82 279 -114 221 97 570 115 -170 274 -17 291 -299 -47 -5 46 27 243 107 -253 221 25
2276 25 23 -458 -158 -294 -535 -793 -175 -113 -229 -176 -44 -229 -285 636 -7 461 -289 334 -38 164 -171 352
2298 352 81 549 524 17 -41 185 -404 70 17 -340 -256 -45 11 -477 -87 -72 209 9 -100 -261 -193 -601
2320 -601 -108 149 373 75 -123 278 -91 302 183 240 107 9 439 36 48 -135 117 -182 -226 94 -379
2341 -379 -319 -220 -176 144 -236 -42 -197 -227 -234 -157 290 235 -239 291 -95 122 351 -164 -166 295 23 -46 111 -21
$$ packed form
2189a11n0N73q71N65j0k04p8M15j41R3L3R1k80R3n1J29n03N55k26k53K97L51o36
2212b19LK61q8J34m16P10q04L05R4j16J80O1o31J87J98L74k21K84N8m87L54L01
2234E22o31K89j21j61Q4L63j06k06ml10K87l63J80K99k66k08J22k72J86J20M49
2255B53l35L61l93L35j24M73m55k85M44k91L08n90K52M2N1j9K16j36l60M74j96
2276B5km81L00j36k41k58O18O2j16N3J32j85n6R21o43M68p50O23l72K02l35N23
2298C52k71M68k5n07n8K26n89M74n3l57Q4K11N6m88L90J5K81k00j09j61O8m08
2320f01M93K57K24k98j98M01l69L93j19N7j33r8M30m03J2j83K52k99m4L20m73
2341c79O0R9M4L20l80J94j55l0pP7M47n5m74N30l86K17K29n15kM61k72o9J57j32
$$ plain form
2365 -21 28 -221 104 -77 -128 -67 145 -381 -16 19 72 -177 107 -174 257 -265 128 -18 -127 243 -13 199
2387 199 183 189 -139 -48 308 171 -136 153 -77 287 -244 397 -46 -293 -485 172 -27 13 236 -95 66 -174
2409 -174 450 -72 -78 -276 -53 -266 -294 -62 97 -88 -132 115 -467 32 213 145 622 365 104 72 7 -86 -47
2432 -47 -178 296 -73 88 373 85 -271 69 221 150 -46 241 26 -80 -145 67 165 -67 -27 399 138 66
2454 66 -175 199 18 -78 70 -333 135 272 40 498 -274 265 -225 417 -24 -348 -230 209 -454 -204 -368
2475 -368 -478 325 131 -12 -111 -90 -92 -35 -363 -135 -183 270 334 147 -264 451 63 646 315 -38 16 -121 -57
2498 -57 119 146 56 -147 285 -605 -219 -475 -120 -525 -93 -261 149 -413 -273 -229 65 216 87 382 -42
2519 -42 -273 -182 412 336 353 -438 -103 458 -139 2 93 -189 -181 -249 -555 -511 34 92 -360 -465 326 -393 -185
$$ packed form
2365b1M9k49L25j81n1O1K12n26L65L5N3k49K84k81M31n22L93j46j09L70k56K12
2387A99j6Ol28R1L56j37l07K89k30L64n31O41m43k47j92O57j99M0K23l31J61k40
2409a74O24n22oj98K23k13k8K32J59j85m4K47n82M99J81o8M77k57k61l2o5r3L9
2432d7j31M74l69J61K85k88l56L40J52p1j96K87k15j06o5K12R8k32M0M26k61p2
2454F6k41L74j81r6J48m03M68J37k32M58p72N39m90O42m41l24J18M39o63K50j64
2475c68j10Q03j94j43r9K1kN7l28K28m8M53O4j87m11P15l88N83l31l53N4j37O4
2498e7J76K7r0k03M32q90L86k56L55m05M32j68M10n62J40M4K94J51j29K95m24
2519d2k31R1N94p6J7p91L35N61n97J41R1k82Qo8l06M4N45N8m52j05P91p19K08
$$ plain form
2542 -185 -15 -187 -30 476 37 120 -245 -199 194 853 -209 66 210 437 -101 -39 248 -265 -37 56 195
2563 195 -261 110 -308 -106 -503 -584 321 -156 112 200 -477 155 350 14 -168 248 -150 -52 338 383 192
2584 192 288 230 300 -180 384 169 440 -123 -126 -433 109 -114 166 604 -217 98 -478 -233 -206 146 -298 393
2606 393 -169 -638 118 -176 108 80 -165 21 136 136 1 223 -310 -8 48 286 228 88 7 -355 -165 200
2628 200 -339 176 67 -183 -224 384 -1 -280 150 -290 -223 278 -6 -373 -34 69 46 262 351 -395 255
2649 255 287 161 -95 -28 -182 -106 -112 137 227 -78 342 121 689 -274 99 441 26 -124 -512 -313 219 -72
2671 -72 -2 248 -503 -425 177 -430 208 348 263 147 -44 188 22 -448 121 192 269 -262 16 206 -231 409
2693 409 -27 110 203 191 -378 3 -102 303 11 -9 161 45 -252 482 -104 -330 -111 238 12 37 181
$$ packed form
2542a85J70j72J57N06m39Q3l65M6L93O59j062K75J44K27n38O2K87n13K28R3J39
2563A95m56L71m18K02l97q1R05m77K68Q8o77O32J95l36j82M16l98R8L90M5j91
2584A92R6n8P0m80N64k15K71n63ll07N42k23K80M38q21L15n76K45K7L52m44O91
2606C93n62m69P56k94K84k8k45J86J15%j35K22n33L02N6K38n8j40q1l62J90L65
2628B00n39N15j09k50m1O08l85k79M30m40O7N01k84l67L39J03k3K16Q9p46O50
2649B55L2j26k56O7j54P6oK49R0l05M20k21N68r63L73L42m15j50l88J99N32k91
2671g2P0K50p51P8O02o07O38J40q5j16j91K32j66m70N69P1P7n31K78J90m37O40
2693D09m36J37R3j2n69L81j05M05k92k0J70j16k97P34n86k26K19L49k26K5J44
$$ plain form
2714 181 248 281 202 -133 -60 80 -17 -73 0 234 108 -144 81 22 -183 -336 213 -180 -103 -58 -420 -101 -82 97
2738 97 471 73 180 -464 -246 97 244 600 134 -38 -167 384 441 12 -141 345 621 -463 -237 -138 -192
2759 -192 -62 -182 169 164 -181 -224 -204 -211 -555 -83 -347 -128 425 108 -122 93 174 129 440 -146 267 -202 -465
2782 -465 385 221 -284 94 -180 165 65 -485 233 152 -78 -216 169 -485 171 43 252 109 -336 102
2802 102 -265 -40 41 85 -300 -33 65 -43 184 -302 -102 192 386 -91 329 -82 37 239 235 -124 -587 -129
2824 -129 79 -22 -71 44 123 -126 33 -184 -98 -267 230 198 268 107 52 442 262 287 277 339 159 455 -7
2847 -7 42 -273 143 -123 -78 -114 104 -28 120 -265 -290 -320 -13 173 -113 -127 239 -40 19 145 -338 283 186
2870 186 327 -300 -180 387 -242 -337 69 63 406 -105 266 358 -205 -217 354 -589 -69 109 -31 -290 -191 -357
$$ packed form
2714A81O7L3p9l35P3J40r7n6P3K34j26k52K25n9k05j53N49l93P7M5l62L19J9J79
2738I7L74l98J07o44K18L43J47L56m66j72j29N51N7m29j53M86K76j084K26R9n4
2759a92J30j20L51nl45m3K0pl44M72k64K19N53l17k30K15Q1m5L11n86M13m69k63
2782d65Q50j64n05L78k74L45j00n50P18q1k30j38L85o54O56j28K09j43m45M38
2802A02l67K25Q1M4l85K67R8j08K27m86K00K94J94m77M20m11J19K02ml59m63M58
2824a29K08j01m9J15P9k49J59k17Q6j69M97l2P0j61n5L90j80K5j0O2j80K96m62
2847gM9l15M16k66M5l6K18j32J48l85k5l0L07J86k86j4L66k79N9J26m83O21r7
2870A86J41o27J20N67o29r5M06oL43n11L71R2n63j2N71r43N20J78j40k59R9j66
$$ plain form
2892 -357 -82 -461 -4 -168 -243 -197 -516 212 -250 -393 91 -6 -36 147 42 -172 -185 22 -112 354 -36 105
2914 105 -203 278 474 258 -260 -295 -86 95 -103 241 -63 -107 19 -57 34 -208 29 -307 149 313 -148
2935 -148 5 -220 -220 122 -116 25 274 219 790 -189 -124 144 -399 73 -13 -171 258 776 -540 -417 -145
2956 -145 77 -97 -176 15 -311 -340 -311 74 -296 298 414 66 -23 -294 -42 113 -75 -206 -373 38 437
2977 437 361 445 -51 -513 22 562 -301 -138 129 57 -126 -508 -337 -127 -122 107 176 -79 181 -303 224 284
2999 284 -245 196 -64 117 -114 -66 188 95 -73 200 96 39 436 34 451 -342 160 -84 -36 -110 -163 93
3021 93 561 -263 73 -17 -241 172 -162 132 -113 98 86 -128 -381 193 114 329 169 306 535 303 -108
3042 -108 -117 175 73 225 242 275 -262 -184 -37 92 17 -170 -211 -260 61 -216 -149 100 294 49 -59 15 282
$$ packed form
2892c57K75l79M57j64p5M6l19P28m62j43M84r7l0J83j05k14j3K07j34M66l90J41
2914A05l08M81J96k16n18l5K09J81j98L44l04m4J26p6R1k42K37l36M56J64m61
2935a48J53k25%L42k38J41K49n5N71r79O5K68n43M72q6j58M29N18j316J23K72
2956a45K22j74p9J91l26k9K9L85l70N94J16l48q9k71K52J55j88j31j67M11L99
2977D37p6Q4m96m62N35N40q63J63K67p2j83l82J71K10NK29O9k55K60m84N27O0
2999B84n29M41k60J81k31M8K54r3j68K73j04n7L97m02M17p93N02k44M8p4n3K56
3021I3M68q24L36r0k24M13l34K94k45K11j2k14k53N74p9K15j60J37K29k32m11
3042a08rK92j02J52J7L3n37P8J47J29p5j87m1m9L21k77O7K49J94k45j08P4K67
$$ plain form
3065 282 86 36 -157 116 229 -152 -221 101 57 96 397 -14 386 -66 520 -156 70 -20 -23 249 -8 415
3087 415 -476 88 509 -375 -131 -90 109 474 71 -169 118 -108 122 -149 132 41 -206 -164 224 460 -233
3108 -233 -60 -614 304 -187 -342 13 -280 235 -91 -254 -338 156 132 77 228 10 60 179 -155 189 -9
3129 -9 -220 -161 7 239 234 185 320 104 3 203 285 -254 -183 32 609 -385 -159 14 -44 150 122 -447 -126
3152 -126 -209 90 52 -487 174 138 180 358 362 3 149 168 -196 -179 115 4 -22 -23 31 -236 147 124 -410 129
3176 129 422 516 -360 -18 -182 49 224 36 -412 -190 -117 436 77 -402 -71 -297 -101 60 39 262 143
3197 143 90 34 -458 -152 -126 217 -200 311 234 171 -159 -23 -178 -325 -12 149 -125 327 -158 -373 -162 -2
3219 -2 -192 326 104 102 189 -203 616 -215 421 -111 135 211 -68 117 -801 -545 49 135 134 32 -430 48 -319
$$ packed form
3065B82j96n0j93K73J13l81o9L22m4L9L01m11M00m52N86o76K26r0lK72k57M23
3087D15q91N64M21q84K44M1J99L65m03k40K87k26K30k71K81r1k47M2L88K36o93
3108b33J73n54R18m91j55L55k93N15l26j63q4M94k4n5J51k18N0J19l34L44j98
3129ik11N9J68K32nm9J35k16j01K00Q2n39P1K15N77r94K26J73n8J94k8n69L21
3152a26q3K99l8n39O61l6M2J78Ml59J46J9l64J7K94j11k6jN4k67L83k3n34N39
3176A29K93R4q76L42j64K31J75j88m48K22P3N53l59m79L31k26J96J61k1K23j19
3197A43n3n6m92L06K6L43m17N11p7o3l30J36j55j47L13J61k74M52m85k15K11J60
3219bj90N18k22kQ7l92Q19q31O36n32K46P6k79J85r18K56N94Q6jj02m62M78l67
$$ plain form
3242 -319 41 417 -216 65 -210 75 36 378 -43 -114 14 32 -252 -149 109 207 53 -186 -395 -314 -265 -376
3264 -376 195 553 -409 -365 275 -77 -83 62 -276 -303 208 -363 -375 -8 76 272 18 -165 -162 -194 296 -230 237
3287 237 -105 -588 554 -24 -447 281 318 -29 147 441 -19 -460 445 128 -22 -124 -21 9 536 266
3307 266 471 646 187 -17 -190 -92 -166 9 -27 -163 -292 -277 118 -374 80 -58 34 423 -298 -3 149 352
3329 352 54 -102 237 130 -81 -95 -141 -223 -350 656 43 -302 128 333 -50 -51 -78 -13 -184 388 23 182
3351 182 352 49 -259 -351 429 -405 -139 -193 -146 174 14 -2 16 68 131 -273 -306 91 -53 248 149 466 46
3374 46 -15 21 341 -24 -30 70 34 164 -93 -184 194 163 65 -353 -113 261 -34 14 149 546 -57 68 36 -208
3398 -208 -322 422 -150 -91 -81 -117 188 26 53 -219 -337 -89 -128 417 -293 -354 -6 220 149 -257 -11 303
$$ packed form
3242c19L60L76o33K81k75K85l9L42m21p1J28J8k84J03K58R8j54k39k09Q1M9j11
3264c76N71L58r62M4O40l52oJ45l38k7N11n71j2L67Q4J96k54j83Ll2M90n26M67
3287B37l42m83J142n78m23P28L7l47J76K94m60m41R05l17j50j02J03L0N27k70
3307B66K05J75m59k04j73R8p4J75l6j36j29J5L95m92M54j38R2L89p21K95J52K03
3329C52k98j56L39j07k11j4m6q2j27J006o13l45M30K05l83jk7O5j71N72l65J59
3351A82J70l03l08r2P80q34K66n4M7L20j60j6J8N2O3m04l3L97j44L01r9L17m20
3374D6o1L6L20l65oJ00l6J30k57r1L78l1r8m18K40L74k95M8J35L97o03J25l2k44
3398b08j14P44n72N9J0l6L05j62K7k72j18K48l9N45p10o1L48K26p1m06K46L14
$$ plain form
3420 303 -23 57 -17 -228 -260 128 425 -118 76 -366 293 215 120 344 256 -139 199 -99 -34 433 -121 -37 -12
3443 -12 -392 119 40 -201 33 2 250 -28 540 204 203 173 -175 99 132 -169 284 -152 149 58 -120 -252 -10
3466 -10 0 385 -13 97 399 113 247 -662 205 28 494 -39 187 72 -109 79 -29 -225 68 545 397
3487 397 -210 167 -37 -326 96 -152 -139 318 518 253 210 332 186 -475 -88 91 -263 52 -287 -313 203
3508 203 83 119 -527 -145 303 28 -46 62 -382 231 515 195 285 -314 105 318 -13 -230 -119 325 -559
3529 -559 -405 239 -81 209 -181 -551 69 209 217 -239 -354 28 27 -167 -102 98 30 -201 -365 -350 -22 408
3551 408 122 -109 175 141 381 140 205 -14 -99 -165 -317 187 -48 175 -36 256 -18 402 -75 140 -207
3572 -207 -90 -62 -90 -217 359 -264 -524 101 282 237 56 -183 126 118 -98 314 -232 -69 -67 -79 -116 -228 348
$$ packed form
3420C03l26Q0p4k11l2L88K97n43J94m42O59p8r5K24q8l95L38k98O5M67n54Q4K5
3443a2l80N11p9k41K34l1K48k78N68l36jl0l48K74L3l01M53m36L01r1j78j32K42
3466a0J0L85l98J10L02k86J34r09Q67j77M66n33K26j15j81J88j08j96K93M77j48
3487C97o07L77k04k89M22k48J3M57K00k65m3J22j46o61L87J79l54L15l39k6N16
3508B03j20L6o46L82M48k75p4J08m44O13K84l20R0n99M19K13l31k17J11M44q84
3529e59J54O44l20K90l90l70O20J40Qm56j15L82jj94O5K00o8k31j64J5L28M30
3551D08k86k31K84l4K40k41O5k19q5o6j52N04k35K23k11K92k74M20m77K15l47
3572b07J17K8k8j27N76o23k60O25J81m5j81k39L09qk16M12n46J63Kj2l7j12N76
$$ plain form
3595 348 -219 333 118 71 49 -322 -88 389 -78 -87 -531 -53 -250 41 -210 -75 -104 -258 -124 59 -87 -325
3617 -325 108 -9 -73 -155 -171 -122 14 -109 -115 120 -11 -98 -179 177 -112 56 435 -76 80 91 75 80 -207 364
3641 364 553 46 99 245 95 -191 -168 -455 78 -57 -79 96 98 -158 -62 -91 -130 90 -346 168 -192 102 -205
3664 -205 -336 20 64 -221 103 170 4 -94 -33 -132 -356 42 -65 -214 89 -35 537 281 166 -110 518 -411
3686 -411 -115 252 -202 177 -155 177 -161 145 369 196 -41 5 -70 110 -14 -53 -232 466 -322 -212 -317
3707 -317 314 81 -242 -604 323 100 -210 373 -63 175 -347 85 83 119 -61 242 423 -170 -90 -151 144 44
3729 44 105 -284 210 -304 -81 -323 3 -42 -428 232 383 244 -205 -82 101 213 -529 -162 316 -55 -393
3750 -393 -21 51 8 164 20 194 105 78 167 -372 -98 235 -464 -309 103 313 -252 110 165 88 -230 -52
$$ packed form
3595C48n67N52k15m7k2l71K34M77m67rm44M78j97K91k51J35k9j54J34J83j46k38
3617c25M33j17o4q2j6M9J36j23oK35j31q7q1L56k89J68L79n11J56J1j6Nk87N71
3641C64J89n07N3J46j50k86K3k87N33j35k2J75Kk56R6k9l9K20m36N14l60K94l07
3664b05j31L56M4k85L24O7j66r8O1r9k24L98j07j49L03j24N72k56j15k76O28r29
3686d11K96L67m54L79l32L32l38L06K24j73k37M6p5J80j24l9j79O98p88J10j05
3707c17O31k33l23l62R27k23l10N83m36K38n22M32kL6j80L03J81n93Q0o1K95j00
3729D4O1l89M94n14K23k42L26m5l86O60J51j39m49J23J83J12p42L67M78l71l38
3750c93L72P2m3J56j44J74q9k7Q9n39K74L33o99J55M12K10n65L62N5p7l18J78
$$ plain form
3772 -52 -38 -26 158 451 135 -176 445 -172 192 184 122 -213 -374 233 -98 814 89 -353 166 1 -355 232
3794 232 -58 177 37 -9 -247 138 75 131 -98 3 360 -174 233 840 -213 400 -474 346 97 277 91
3815 91 108 -182 223 39 -37 -292 -22 170 -505 200 -146 -96 -114 197 72 179 -254 220 250 -41 -92 296
3837 296 255 120 139 -498 86 -210 -236 332 5 -113 -92 40 -331 40 -298 -41 -274 168 221 31 -359 162
3859 162 -142 26 -67 157 -76 -206 310 -347 -66 379 80 253 -52 -29 142 -335 -339 -155 165 163 -461 -322
3881 -322 -37 95 568 -199 148 -37 -181 132 -113 43 -259 13 28 -7 289 177 -168 -213 444 98 311
3902 311 -234 -79 -637 -425 -106 -15 252 -294 -184 -13 -156 -180 -41 -177 -201 329 -298 21 161 -237 151
3923 151 195 220 -132 -243 -123 134 154 -159 -296 -1 120 208 -54 199 11 81 -153 11 -133 -58 274 -44
$$ packed form
3772e2J4J2J84K93l16l11O21o17L64qo2l35j61O07l31R12p25m42N19j65l56N87
3794B32k90K35j40m6k38L85o3N6k29J01L57n34M07O07j053O13q74Q20k49J80j86
3815I1J7k90M05j84p6k55K70J92o75P05l46N0j8L11j25J07m33M74L0k91n1L88
3837B96m1j35J9o37N84k96k6N68l27j18K1J32l71L71l38K57k33M42N3j90l90N21
3859A62l04J68r3K24k33j30N16o57K81M45k99J73l05K3J71m77mJ84L20ko24J39
3881c22K85J32M73p67L47j85j44L13k45J56l02K72J5l5K96j12l45m5O57l46K13
3902C11n45J55n58K12L19R1K67n46J10J71j43k4J39j36k4N30o27L19J40l98L88
3923A51M4K5l52j11J20K57K0l13j37K95J21Q8k62K53j88P0k34J64j44P5L32l18
$$ plain form
3945 -44 -174 139 170 -380 68 -111 -454 -131 30 204 -55 -47 11 -75 -196 -56 88 107 -62 -153 221 8 -74
3968 -74 130 406 390 -125 115 -154 -698 391 87 -167 164 -250 -320 172 157 172 103 147 407 23 -203 171
3990 171 -537 114 -151 155 262 3 -471 -117 -37 77 215 -363 76 36 -17 -16 -106 304 94 -243 144 331
4012 331 -40 -38 -321 -130 130 -199 -407 -259 45 -222 -232 -310 344 131 179 127 49 145 146 42 66 266 71 39
4036 39 -119 -132 -206 -47 -166 -146 -424 48 -73 -88 33 171 -30 -15 299 430 -169 307 -210 75 -25 -337
4058 -337 -170 103 -11 -288 -38 -43 50 60 94 319 132 -423 100 -632 -230 -53 519 -5 -201 -413 288 -320
4080 -320 -176 80 -145 31 -142 164 -66 -45 -6 118 130 -57 -744 137 487 186 -163 -12 -329 247 -84
4101 -84 276 -322 27 -202 484 -217 -114 100 426 -93 -243 -37 291 -140 186 239 -210 457 -187 -60 -64
$$ packed form
3945d4j30L13L1n50M48j79l43L23J61J74k59QN8q6j21J40J44J9j69r1L74k13q2
3968g4K04K76j6n15K40k69n44J089l04k54L31m14p0M92j5J5o9M4K60l84k26L74
3990A71p08O51k65L06J07k59m74L54Q0J14J38n78M39m0n3Jr0M10k10l37L87J87
4012C31l71Kk83J91K60l29k08J48L04k67j0p8O54k13M8n2p8R6Jj04K4K00j95l2
4036C9j58j3p4J59j19K0k78M72j21j5J21J38k01J5L14J31n99M76n17K85j00l12
4058c37J67K73j14k77K50nR3J0L4K25j87n55N23p32M02J77N72n24j96k12P01o08
4080c20J44K56k25J76j73L06k30K1L9J24J2j87o87Q81L50l01l49J51l17N76l31
4101h4L60n98L49k29O86p01J03K14L26n19j50K06L28m31L26N3m49O67o44J27m
$$ plain form
4122 -64 1 456 -35 144 391 51 45 212 81 -157 136 98 358 351 -124 -245 115 267 105 60 -35 -32 324 136
4146 136 -26 -10 -316 -92 -575 129 -48 63 -165 -121 -254 -10 -99 80 6 -61 253 178 -368 127 -274 473
4168 473 130 118 -74 -69 214 116 133 -50 55 71 441 10 491 286 -146 -160 406 115 -76 -184 204 169 -302
4191 -302 -205 147 149 140 -393 87 285 145 -179 73 421 5 -97 337 -284 -6 -106 -319 -90 -272 112 -184
4213 -184 -141 126 97 -121 -15 -409 308 -238 -107 112 -190 34 -150 -404 141 365 -18 -314 269 136 -147
4234 -147 -236 -66 -43 -271 -9 -433 20 -128 -76 -60 316 -189 -48 -78 -143 -154 405 -5 157 240 374 -123 -11
4257 -11 -173 319 347 -113 165 -54 -32 103 70 -125 20 -915 -76 -542 130 -445 -388 -216 41 -217 -201 424
4279 424 82 281 21 -166 231 226 234 -137 468 134 -225 -363 -286 -65 3 -44 358 102 -245 10 218 -74
$$ packed form
4122f4O5M55m91J79K47l40oJ67j31k38K93l8K60pm75j21L60J52j62m5r5LL56j88
4146A36j62J6l06K24m83P04j77J11k28M4j33K44q9J79p4o7L14p5n46M95m01P47
4168D73l43j2j92NK83r8J7j83J05J6L70m31M81k05m32j4N66k91j91j08L88l5m71
4191c02R7L52Krn33M80J98j40l24K52L48m16j02M34o21K78j00k13K29j82L84k96
4213a84M3K67k9k18J06l94P17n46J31K19l02K24j84k54N45K24l83k96N83j33k83
4234a47q9J70K3k28K62m24M53j48N2J6L76n05J41l0o5j1N59m10J62Q3J34m97J12
4257a1j62M92K8m60K78k19K2J35l3j95J45r35Q39m66O72n75N7J72K57k58J6O25
4279D24l42J99k60j87L97nQl71O05l34l59j38P7K21O8m7M02k56l47K55K08k92
$$ plain form
4301 -74 -155 -227 -109 -269 153 260 313 -179 54 -263 319 -158 203 299 -95 -111 -425 70 244 -331 -363 -249
4323 -249 479 422 154 -128 111 -562 270 -52 -5 118 -39 154 -100 43 20 118 -30 -53 -88 -91 -25 -3 -299
4346 -299 -153 498 130 -22 93 273 460 9 -51 -39 -48 226 -199 103 32 -349 268 336 338 212 284 7 -164
4369 -164 -179 275 -246 1 515 -182 -180 243 108 -142 217 -271 117 227 -162 -116 211 -401 -83 36 148
4390 148 -516 94 -127 186 145 -102 -4 -63 20 -252 121 -62 -231 -110 -361 151 15 -171 244 -133 -139 -514
4412 -514 -45 33 229 107 -135 -83 110 -93 -277 18 -191 -36 24 326 237 -314 86 -140 185 157 198 159
4434 159 118 -70 -385 182 -177 170 16 271 -252 -489 19 -45 263 -199 -82 215 279 -200 117 1 94
4455 94 -320 -48 176 -168 210 -300 167 20 -123 -419 -33 -29 52 -202 -102 -12 -211 -11 261 183 -203 13
$$ packed form
4301g4q1p2J18j60M22J07N3m92K33l17N82m77L61R6l94j6l14M95J74n75l2J14
4323b49P28n7k68k82K39o73Q32l22M7J23j57J93k54J43k3R8j48k3l5lO6K2k96
4346b99J46O51l68j52J15J80J87m51o0J2rK74m25L02p1l81O17O8Kj26P2k77j71
4369a64j5M54n21K47N14o97KM23j35k50L59m88L88J10l89M6L27o12L18J19J12
4390A48o64O10k21L13m1k47R8n9Q3k72L73j83j69J21k51N12j36j86M15l77ol75
4412e14M69P8J96j22k42N2J93k03j84K95k09J55O0L02q9n51M00k26L25k8M1l9
4434A59m1j88l15N67l59L47j54K55n23k37N08o4L08m62J17K97O4m79L17j16R3
4455I4m14K72K24l44L78n10M67j47j43k96L86MQ1k54J00R0j99K00K72p8l86K16
$$ plain form
4477 13 -58 302 -63 263 -195 -109 70 -145 3 -4 -93 87 -289 -552 -47 78 -300 -466 -291 -898 140 -169
4499 -169 170 -56 -255 -282 -106 -213 127 232 492 155 186 -305 94 -364 190 81 -28 -64 -335 -399 260
4520 260 399 32 300 -54 -120 -32 350 -257 33 202 -528 105 -263 -262 63 -27 56 110 -374 87 108 -247 -149
4543 -149 -250 266 -106 -200 19 -119 57 237 170 278 -251 265 38 -146 168 443 -28 -315 144 282 158
4564 158 -3 -134 -59 232 -223 -391 13 76 -11 -49 -120 -111 17 293 -448 467 -442 -151 95 411 197 -531
4586 -531 -166 -368 273 99 63 -583 88 -433 -327 -83 228 -40 257 361 491 227 141 -9 137 -276 -422
4607 -422 238 -9 -134 -19 -343 162 38 -248 -48 267 -369 -160 90 -121 -144 43 108 69 -278 40 -43
4628 -43 0 23 194 -88 -98 -130 451 304 69 456 182 -229 116 86 -106 -308 66 420 -250 153 17 -12
$$ packed form
4477A3p1L60l65L26m58Q6J79k15J48pq9J80l76k63N05J25l78j66J75o07J038l09
4499a69L39k26j99k7J76j07L40J05K60l37L1m91L99m58N54j09j09l6k71o4O59
4520B60J39l67K68l54o6Q8L82o07K90J69p30O33l68JL25r0Q3N4m84M61K1l55R8
4543a49j01N16l72r4K19j38J76J80o7J08n29N16k27j84L14K75m71k87M59J38j24
4564A58j61j31P5K91m55j68M04O3q7l8p1RJ28K76p41R15r09K91K46L16k14p28
4586e31L65k02O41j74l6o46O71n21J06K44L11k68K97J04J30k64q6j50J46m13j46
4607d22O60k47j25J15l24N05j24k86K00L15o36K09K50k11k3J87O5l9l47L18q3
4628d3M3K3J71k82j0l2N81j47k35L87k74m11L45l0j92k02L74L54o70M03j36k9
$$ plain form
4650 -12 186 -49 198 -360 77 79 -218 362 -177 -247 -121 223 116 -102 411 -599 27 183 300 -372 -194
4671 -194 -26 -426 -427 252 -49 203 125 184 -207 102 -395 -568 264 447 13 -501 454 104 -181 96 -88
4692 -88 -199 -237 133 227 53 -65 -397 -53 -241 -152 -100 209 246 -359 -554 -37 74 284 71 407 -46 177
4714 177 -213 52 -161 -134 161 -229 284 -327 -261 127 124 -331 158 -45 269 287 199 287 -123 -134 59 117 -165
4737 -165 -73 7 -26 -242 250 31 17 -200 104 -137 40 -229 257 -138 69 -231 66 -79 38 -239 -197 -190
4759 -190 -295 25 17 -206 333 -81 -207 -78 -21 -123 -78 277 126 239 415 -386 246 5 224 -41 -58 -169
4781 -169 -338 22 -137 -19 -31 191 26 -261 -257 -67 -343 224 -411 131 320 -82 212 228 -342 -73 9 303
4803 303 194 169 0 -80 -173 -62 68 -150 -237 187 137 -90 293 -312 204 -348 -184 -98 167 141 334 -52
$$ packed form
4650a2J98k35K47n58M37Kk97N80n39p0J26L44j07k18N13j010O26J56J17o72J78
4671a94J68m00jO79l01K52p8N9l91L09m97j73Q32J83m34n14R55l50k85K77j84
4692h8j11l8L70R4j74j18l32L44j88Q9N2L09L7o05j95N17J11K10k13L36m53K23
4714A77l90K65k13K7K95l90N13o11O6L88lm55M89k03L14J8q8Q8m10j1J93N8k82
4737a65R2Q0l3k16M92k19j4k17L04k41J77k69M86l95K07l00K97j45J17k77M2P
4759a90j05L20qk23N39m14j26J29N7j02M5L55j51J13J76q01O32k41K19k65j7j11
4781a69j69L60j59J18j2K22j65k87MJ90k76N67o35N42J89m02K94J6n70K69Q2K94
4803C03j09k5j69q0r3J11J30k18q7M24n0k27L83o05N16n52J64Q6K65k6J93l86
$$ plain form
4825 -52 -63 217 -475 -95 -446 285 -76 -127 183 175 -113 -59 -580 155 27 -232 -154 -197 -313 251 268 113 235
4848 235 -30 -237 337 54 -123 336 -243 141 -55 -112 -162 -359 -120 137 -6 86 -7 -23 40 -296 -387 384
4870 384 -219 58 -170 -94 -276 80 -102 -70 -221 138 3 344 -571 -74 406 -197 242 -384 -407 -340 325
4891 325 -30 51 -179 -280 143 13 -84 -15 483 78 289 48 360 163 -127 -44 80 -168 -22 278 -264
4912 -264 362 73 -118 -40 -36 61 -476 -105 -40 74 88 -149 -70 311 -779 16 568 -335 -380 27 189 346
4934 346 78 247 -138 -129 104 59 320 241 60 91 249 -359 201 -38 146 -12 82 -95 -223 37 310 -574
4956 -574 -148 -103 -47 10 -259 -215 -34 139 68 367 -76 1 -240 155 -14 -284 -6 328 -116 -113 276 -127 -113
4979 -113 68 -280 -127 30 -46 -175 -75 248 47 174 254 174 113 171 -77 -4 -327 -284 -266 -192 -57 210 -156
$$ packed form
4825e2j1K80o92L80l51P31l61n1L10qk88N4n21P35j28k59P8m3j16N64J7j55J22
4848B35k65k07N74k83j77M59n79L84j96n7n0j97K39K57j43R2r3j6O3l36r1P71
4870C84o03K77k28P6j82L56j82L2j51L59j35L41r15M97M80o03M39o26k3O7O65
4891C25l55Q1k30j01M23j30r7O9M98m05K11k41L12j97k90Q3J24k48J46L00n42
4912b64O26k89j91P8MR7n37L71O5J14J4k37P9L81j090P95N52r03m5M07J62J57
4934C46k68J69l85RK33m5K61p9j81L1J58o08N60k39J84j58R4j77j28K60K73q84
4956e74M26M5N6N7k69M4J81J73p1K99m43P7k41L95j69k70K78L34m44LL89m03J4
4979a13J81l48J53J57p6j29J00L23k01J27Q0q0o1N8k48P3l23M3J8P4J35K67l66
$$ plain form
5002 -156 81 -161 -33 -460 237 26 -112 21 -40 -238 -139 -109 232 123 298 -162 332 86 168 277 136
5023 136 -245 -155 127 7 -226 -151 -252 -79 118 136 100 -119 287 -483 399 125 -129 -83 380 -19 -416 107
5045 107 -272 -235 -158 -5 -88 -52 311 92 -128 -11 50 -293 -373 205 200 254 -298 218 -237 606 101 368 1
5068 1 383 -96 259 -269 87 -107 -113 15 -156 191 89 -269 54 3 -95 -83 366 -254 -123 -153 258 -619 105
5091 105 -53 -308 272 -5 473 -430 -75 362 125 210 -409 -132 668 110 -34 162 -79 296 -77 48
5111 48 103 297 -96 -68 -260 293 274 30 368 -156 -346 -77 -136 144 26 -42 70 -33 47 -63 -32 3 -140
5134 -140 -137 -330 -66 180 209 271 50 -79 59 11 -209 184 -205 -252 14 -20 107 -101 -216 310 65 -35
5156 -35 -337 -106 -211 272 77 39 483 1 -60 123 -339 207 -220 -44 -155 -308 125 81 -439 26 117 -111
$$ packed form
5002a56K37k42J28m27O97k11j38J33o1j98R9L0L41j09J75m60M94k46Q2J09j41
5023A36l81R0K82j20k33P5j01J73J97J8l6k19M06p70Q82k74k54M6M63l99l97N23
5045A07l79L7P7J53q3L6L63k19k20J17O1l43q0N78nN4n52N16m55Q43n05K67l67
5068AL82m79L55n28L56j94oJ28j71L47j02l58L23n1r8J2M49o20J31l0M11q77P24
5091A05j58k55N80k77M78r03L55M37k37Q5o19K77Q00n58j44J96k41L75l73J25
5111D8N5J94l93K8j92N53j9k44L38n24j90K69n9K80j18o8J12j03Q0j10L1L5j43
5134a40Lj93K64K46K9O2k21j29J38m8k20L93l89m7K66l4J27k08j15N26k45j00
5156c5l02K31j05M83j95l8M44m82o1J83m62N46m27J76j11j53M33m4n20M65R1k28
$$ plain form
5178 -111 -476 -167 209 -237 475 177 -21 103 219 -389 191 -93 -158 193 -90 83 -84 60 385 132
5198 132 -327 -107 -134 -321 119 543 82 -532 -262 -145 181 392 -49 72 -220 -202 -366 -382 -104 -3 278
5219 278 201 -207 -179 -16 303 89 286 -155 191 -178 -73 -102 -235 289 -1 185 302 387 211 302 532 -29
5241 -29 -105 -328 -228 -385 -24 -37 -348 13 87 69 117 36 -254 131 -185 -301 -49 182 664 -460 -69 -256
5263 -256 267 253 -55 70 83 -10 -114 38 -122 132 -126 113 -350 -114 132 115 -70 -168 30 154 -83 42
5285 42 -99 -33 -11 167 241 -30 93 278 -232 167 -98 119 -339 344 21 -203 -13 -28 160 -20 -380 -313
5307 -313 -50 250 -204 237 212 -88 -171 -358 -27 222 99 -94 52 241 -90 338 -190 -153 -222 338 -23
5328 -23 -219 52 -149 -248 75 59 405 -422 -160 -794 39 11 93 446 -132 -176 -252 100 -359 6 -594 210
$$ packed form
5178a11l65L09L76m46P12k98j98J24J16o08N80k84o5L51k83J73j67J44L25k53
5198A32m59K20k7j87M40M24m61o14K70J17L26K11m41J21k92J8j64j6K78J01K81
5219B78p7m08K8J63L19k14J97m41L46l69J05k9j33N24k90J86J17Q5j76R1K30n61
5241b9p6k23J00j57L61j3l11L61P4j8M8q1k90L85l16j16K52K31M82j124L91j87
5263b56N23j4l08J25J3r3j04J52j60K54k58K39m63K36K46j7j85r8J98J24k37J25
5285D2j41O6K2J78P4k71J23J85n10L99k65K17m58O83l23k24J90j5J88j80l60O7
5307c13K63L00m54M41k5l00q3j87L31K49j23j93J46J89l31M28n28L7o9N60l61
5328b3j96K71k01r9L23j6L46q27K62o34Q33k8Q2L53n78m4p6L52m59L65o00Q04
$$ plain form
5350 210 18 -71 -145 61 -145 96 -123 185 -48 -242 112 -317 11 -26 -77 129 -432 155 48 -351 -263 -60
5372 -60 46 -144 75 55 305 43 -431 -70 -165 223 -87 -125 181 430 121 439 -56 162 144 -194 -149 -93
5394 -93 43 -67 83 53 -203 -167 398 -30 49 -270 194 263 311 514 308 -144 -106 104 -600 90 -123 254
5416 254 -239 -37 -144 -9 289 85 -173 -157 378 -202 157 68 206 203 -549 -111 110 363 12 226 370
5437 370 5 108 -102 318 56 -192 307 -72 116 -9 174 282 -98 25 -121 -77 145 -85 -304 -80
5457 -80 230 389 -241 234 108 -404 -71 245 -180 -103 -184 -401 94 -10 127 29 -135 449 -252 59 183
5478 183 -40 137 -133 -297 63 -178 -538 -213 -390 435 153 371 -114 -50 99 -525 -177 -111 -266 245 456
5499 456 74 -58 35 350 522 68 155 124 -457 193 -160 -314 25 3 101 56 -155 45 -1 -241 91 -28
$$ packed form
5350B10j92q9p4K06k06K41k19L08k33j94L54m29L28l7n1K06n61N87j07l99Q8K03
5372f0J06j90K19k0K50k62m74L61r5L88l10l8L06K49l09L18m95K18j8l38M5N6
5394i3J36j10J50l0k56L6N65m28P9l19M64O9M8K03k06m52L8K10p04O90k13L77
5416B54m93K02j07J35K98k04k58J6N35n80L59q9J38lp52M38K21K53l51K14J44
5437C70l65J03k10M20k62k48M99l79J88j25J83J08l80J23j46M4K22k30k19K24
5457h0L10J59o30M75j26n12L33L16m25P7q1k17M95j04J37r8j64N84p01L11J24
5478A83k23J77k70j64L60k41l60L25j77Q25k82K18m85O4J49o24L48O6j55N11K11
5499D56l82j32R3L15J72m54Q7l1n81O50l53j54L39k2R8m5k11K00m6k40L32j19
$$ plain form
5521 -28 10 -160 318 -232 33 80 116 267 -495 316 -187 218 259 308 -93 -314 10 -159 278 -134 -83 236
5543 236 -565 289 -144 350 -175 -82 249 230 114 -195 146 79 152 139 -214 -303 -113 247 180 -530 -127 -220 266
5566 266 -15 -152 -75 733 -232 -52 -371 71 139 125 281 130 193 -28 99 312 -53 -107 -53 -245 99 -475
5588 -475 22 -149 598 -133 -29 -272 -63 -157 530 100 239 119 40 184 -398 -279 -109 -67 -143 70 71 -63
5610 -63 -22 -7 186 10 -89 -343 483 112 347 235 -112 275 137 -210 -3 13 -10 164 204 -36 18 -92 220
5633 220 -113 -173 -200 23 -99 346 258 212 533 25 -284 29 95 371 -68 30 -709 339 413 -274 75 -165
5655 -165 -26 108 332 180 -246 216 81 217 -8 16 -238 -375 -336 -162 83 130 -150 359 302 355 -206 73
5677 73 -340 154 -124 109 164 -25 -381 -41 49 92 411 -83 -102 -291 -150 -156 -330 -186 13 -47 -109 -291 -223
$$ packed form
5521b8L8j70M78n50K65M7L6J51p62Q11n03M05M1M9m01k21L24j69M37m12N1L19
5543B36q01Q54m33M94n25R3L31j9j16l09L41o7P3j3l53q9J90L60o7p10M03r3M86
5566B66k81j37P7Q08r65J80l19M42O8j4J56j51O3k21J27K13l65n4N4j92L44n74
5588d75M97j71P47p31J04k43K09r4O87m30J39j20p9J44n82J19J70M2p6K13Jj34
5610f3M1J5J93j76r9k54Q26l71K35j12l47L87j38l47K07J6k3J74M0k40N4j10L12
5633B20l33o0k7K23j22M45q8m6L21n08l09L13O6K76m39R8p39J048P4o87L49k40
5655a65J39J34K24j52m26M62j35J36k25K4k54j37L9J74K45M7k80N09n7N3n61K79
5677G3m13M94k78K33N5j89l56L40R0M3L19m94j9j89J41oj74J44J99o0o2j82O8
$$ plain form
5700 -223 -259 429 480 267 -159 393 20 272 183 163 249 127 -293 -71 325 192 -346 -122 -17 92 306 -439
5722 -439 90 48 -54 66 71 221 215 221 -156 212 -376 129 25 -503 206 -415 -117 55 -6 -65 -128 307 -373
5745 -373 -36 -14 160 -242 354 24 -136 48 56 -250 93 97 100 36 280 -259 -69 256 -24 140 125 -374 -52
5768 -52 -5 272 -1 -53 -158 22 -315 -215 -504 -103 56 -295 -142 -192 104 -100 -166 -29 -1 -189 80 -115
5790 -115 -16 201 80 -287 117 -62 51 -43 246 104 229 119 91 -38 49 -492 191 51 -53 -129 239 -229
5812 -229 219 -196 24 25 -77 -264 -725 -185 -175 -245 365 257 134 -174 -328 153 -304 164 -181 103 -212
5833 -212 -25 -67 105 187 -384 -87 25 -134 25 196 -2 276 -100 138 265 1 233 -116 48 193 -176
5854 -176 229 6 103 84 -192 150 -123 217 110 -114 -533 -64 -72 135 8 -41 -25 101 -314 -202 148 419
$$ packed form
5700b23l6O88N1k13m26N52l73K52q9k0Q6j22m20K22L96j33n38K24J05J09K14p45
5722d39N29m2j02J20NJ50oOl77L68n88N05j04n28P09o21K98J72o1n9o3M35o80
5745c73L37K2J74m02N96l30j60J84Ql06L43MLo4K44n39J90L25k80J64j5m99L22
5768e2M7K77k73n2j05J80l37J00k89M01J59l51J53n0K96k04o6J37K8j88K69j95
5790a15R9K17j21l67M04j79J13r4K89j42J25j10k8j29Q7n41O83j40j04p6L68m68
5812b29M48m15K20Jj02j87m61N40J0p0O10j08j23l08j54M81m57M68l45K84l15
5833b12J87m2J72Q2n71K97J12j59J59J71j98K78l76K38J27k64K32l49J64J45l69
5854a76M05k23R7j9k76L42k73L40j07k24m19M69qK07j27m9J6J26m15J12L50K71
$$ plain form
5876 419 -276 286 -2 42 271 -423 654 -360 9 400 210 -43 -82 -25 -46 80 -37 -33 199 -10 -95 -79
5898 -79 -165 -106 -76 110 256 -202 -223 23 11 -280 -333 199 191 -273 -230 -274 621 -157 2 -149 -260 -128 -283 -383
5922 -383 284 -21 380 16 -194 288 97 -84 -63 -256 109 180 131 13 -362 -396 -233 359 102 144 15 -49
5944 -49 -21 -162 -526 87 -68 410 290 -7 58 -94 98 167 -164 -47 -412 243 -169 -117 -3 -21 347 146
5966 146 -72 -150 -392 39 222 95 -199 -604 -86 -180 -167 -230 -253 -59 33 75 -563 93 255 249 162 112 302 209
5990 209 -271 -6 -148 -264 96 -326 205 47 -269 236 45 4 332 75 493 63 -239 4 81 -397 -201
6011 -201 153 -44 -322 -239 173 -76 70 -84 -190 -342 60 -380 -85 -121 530 30 78 36 -129 -109 -235 -46
6033 -46 330 298 146 -14 -187 -20 105 -19 -252 -73 214 -122 312 105 113 45 -98 -373 210 394 -11 175
$$ packed form
5876D19o95N62k88M4K29o94J077j014L69L91j90k53l9N7k1J26j17MK32k09q5J6
5898g9q6N9L0J86J46m58k1K46j2k91n3N32qm64M3m4Q95p78J59j51j11J32j55j00
5922c83O67l05M01l64k10M82j91j81K1j93L65P1m9j18l75l4J63N92k57M2j29o4
5944d9K8j41l64O13j55M78j20k97O5j52J92O9l31J17l65O55m12N2J14j8L68k01
5966A46k18p8k42M31J83j27k94m05N18r4J3o3k3J94R2M2o38O56J62oq7n0J90r3
5990B09m80K65j42j16L60m22N31j58l16N05j91m1L28k57M18m30l02K43P7m78J96
6011b01L54j97k78Q3M12k49J46j54j06j52M02m40K95l6O51n00M8m2j65K0j26J89
6033d6L76l2j52j60j73J67J25j24k33J79K87l36M34k07Qo8j43k75N83J84m05J86
$$ plain form
6055 175 47 1 -74 102 -195 26 19 -68 -128 -203 126 -159 -231 -483 4 67 66 -192 -262 84 -188 164 -64 111
6079 111 -70 -246 -29 -344 -235 484 -313 -244 28 -517 8 153 -53 -258 132 373 -4 -113 177 -102
6099 -102 -17 -215 64 -20 -418 -195 -116 -198 74 -60 -112 477 -81 308 631 81 63 7 -307 104 -129 54
6121 54 159 -174 227 -117 -28 190 -272 8 209 -142 447 458 -9 210 252 -120 -242 -346 -229 63 56 462
6143 462 -117 -35 229 -4 -232 132 -155 107 151 83 -126 -197 -139 101 -87 81 236 -407 -199 -59 91 -523
6165 -523 93 37 -241 -284 287 230 145 26 -99 115 -158 -372 -346 277 -336 -340 -57 -86 296 90 -165 -4 58
6188 58 117 -190 95 40 33 246 193 290 173 248 220 75 85 -32 31 151 -308 -160 97 53 -494 64 484 192
6212 192 293 348 235 -311 -250 -352 -25 -324 123 -299 -280 -369 125 260 216 250 -61 65 -95 276 23 87
$$ packed form
6055A75j28m6p5J76k97K21pq7o0p5L29k85p2k52M87O3jk58p0L46k72L52k28J75
6079A11j81j76K17l15J09P19p97O9K72n45N25J45k06k05L90K41l77j09K90k79
6099a02Q5j98K79q4l98K23P9q2K72j34n2N89n58L89L23n50j8n6l14M11k33J83
6121E4J05l33M01l44Q9K18m62K80K01l51N89J1m67K19M2l72j22j04J17K92pM06
6143D62n79Q2K64k33k28L64k87K62M4o8k09p1N8K40j88J68J55o43K08J40J50o14
6165e23O16n6k78m3N71n7q5j19j25K14k73k14K6O23o13mK83k9L82k06k55J61O2
6188E8N9l07K85n5pK13n3R7j17P5k8j45J0j17O3J20m59J48K57m4n47N58M20k92
6212A92J01N5j13n46O1j02L27k99M47m22J9q9M94J35m4L4l11J26j60L71k53O4
$$ plain form
6234 87 -87 9 -67 119 170 -94 -430 141 207 163 -194 -375 38 364 81 251 -51 294 -117 -368 -477 -86
6256 -86 -15 144 -155 -289 57 -289 118 182 -26 -316 33 -13 -63 138 186 -173 1 322 385 -65 -74 145 -94
6279 -94 -287 -170 -128 -242 -349 -180 50 120 -135 112 313 302 26 -24 62 99 -6 167 28 30 -168 -324 283
6302 283 192 56 -228 -59 451 340 267 65 211 180 51 133 -159 177 -21 198 199 -9 29 -252 -403 -226
6324 -226 130 -436 207 2 8 -117 200 180 182 -206 87 321 -144 140 -7 195 -71 -122 347 155 -48 -420
6346 -420 43 -182 -171 -76 -40 235 -138 172 433 185 -277 87 228 263 321 -131 -194 30 158 117 -578 -163
6368 -163 -303 408 -9 223 -1 -190 -92 -72 -292 100 -34 0 391 -469 -131 -255 57 -371 4 -224 -73
6389 -73 -63 73 115 -44 5 416 113 263 91 280 202 -10 -357 -230 -323 243 -210 -255 -183 240 -231 -538 -42
$$ packed form
6234H7j74R6p6J86N1k64l36N71O6m4l57j81M13L26k83J70l02L45m11k51j09L91
6256h6P1J59k99j34L46l46M07O4k08k90L49m6n0K01M8l59J74L21O3m50rK19k39
6279i4j93J17M2j14j07J69K30P0k55K47K01j1k76n0Q6L7j05J73j39Kj98j56O07
6302B83r1j36k84J69N10j11p3k02J46l1j29Q2k92L36j98K19Jk08L8k81j51J77
6324b26L56n66O43k05Oj25L17k0Kl88K93K34m65K84j47K02k66n1M69j92k03l72
6346d20M63k25J1R5L6K75l73L10K61k48m62L64J41L5N8m52o3K24J28m1o95M15
6368a63j40P11m17K32k24j89R8K0k20L92j34L4L91q60L38j24L12m28L75k28J51
6389g3J0J36M2j59M9M11l03J50j72J89p8k12l47J27r3N66m53m5P2M23m71l07M96
$$ plain form
6412 -42 -268 -80 -103 394 -145 -112 -124 -80 61 282 -240 52 -294 -168 205 539 -17 -161 111 45 -174 172
6434 172 171 -62 70 -138 92 282 113 -77 -309 -161 -79 -26 -85 368 84 27 246 91 129 -443 -103 -28 -79
6457 -79 -165 -41 -125 -485 -220 -117 -139 114 96 -22 -138 134 -124 217 -69 -3 -638 270 -419 -121 -205 389
6479 389 345 431 161 -13 390 457 -30 147 338 216 76 61 179 -196 156 -185 -187 -82 329 -109 -342 -235
6501 -235 65 -44 295 -302 32 393 -502 -737 -78 39 151 63 -183 172 174 11 -107 12 59 -28 364 -106
6523 -106 -52 -250 -28 500 259 -350 110 -67 191 375 294 74 -119 293 -66 309 -110 10 66 -120 -86
6544 -86 227 -374 -380 -45 117 185 -355 140 -114 -153 -41 2 -112 -169 -75 105 -107 -93 176 46 356 116 -202
6567 -202 -249 48 148 -2 79 276 4 260 262 -52 -259 -98 171 -235 273 -202 193 119 120 103 70 314 -28
$$ packed form
6412d2k26J88k3M97n39L3j2M4J41K21n22K92l46J26L73L34n56j44K72o6k19L46
6434A72jk33J32k08K30J90j69j90k32J48Q2N3n9M53k84n7K19j55L8n72L40P5n1
6457g9q6J24q4l60K65J03k2K53j8j18j16K72k58L41k86O6o35R08o89K98q4N94
6479C89m4Q6k70j74M03O7m87J77J91j22j40j5J18l75L52l41kJ05M11m38k33J07
6501b35L00j09L39n97L34L61q95k35O59J17J12q8k46L55Kj63j18J19M7q7L92m70
6523a06N4j98K22N28k41o09M60j77K58J84q1k20j93M12l59L75m19J20N6j86L4
6544h6L13o01oL35J62O8n40M95k54l9J12M3j14n7R4J80k12J4K69j30L10k40l18
6567b02m7K97J00j50Q1J97k72K56Kl14k07J61K69m06N08m75L95p4Jj7l3K44l42
$$ plain form
6590 -28 -494 41 110 189 21 75 406 -496 -54 381 -121 -399 77 108 219 154 117 236 -395 15 404 67
6612 67 -43 21 -96 98 565 240 131 -169 137 189 191 -202 -385 -210 -23 436 -19 -222 -221 -169 -174 -139 145 -332
6636 -332 -392 180 13 136 -319 -260 364 -89 -286 -250 -338 -336 -32 -448 111 342 -228 29 -234 75 -171 550
6658 550 -137 54 -247 -164 -297 -347 -61 -138 -69 -78 48 11 138 -317 256 -86 152 78 -90 -104 100 -54 250
6681 250 -309 170 146 358 120 -232 273 -329 33 304 162 185 110 369 -272 476 168 143 -98 264 332 -78
6703 -78 -165 376 131 3 401 -75 -211 353 -270 -118 -379 -527 -150 -10 584 229 261 0 350 -133 -26
6724 -26 -137 -152 99 33 -33 -138 -28 52 4 39 -143 333 319 -177 -47 -142 -7 80 12 -463 122 150 69 -87
6748 -87 -135 24 169 -370 -417 -244 259 -156 -96 -240 417 280 -218 -84 263 -193 241 -149 336 173 -253
$$ packed form
6590b8m66N35O9P9j68N4L31r02M42M35n02k78M76L1J11o5l7J19o31M10L89l37
6612F7j10O4j17J94M67l25j09l00L06N2Kl93j83J75J87M59m55k03JN2nL5K84m77
6636c32o0N72j67J23m55N9O24m53j97L6q8KL04m16N59K31n70K57k63L09k46P21
6658E50o87J91l01Q3j33n0K86p7O9rJ26l7J27m55N73l42K38p4j68j4K04j54L04
6681B50n59M79k4K12k38l52N05o02L62K71j42K3p5K59o41P48l08k5k41L62O8m10
6703g8q7N41k45j28L98m76j36N64o23J52k61j48L77J40N94l55L2k61L50m83J07
6724b6j11j5K51o6o6j05J10Q0m8L5j82M76j4m96J30r5J35Q7o8m75N85K8q1j56
6748h7m8J59J45n39m7J73N03m15O0j44O57j37m98J34L47m56M34l90M85j63m26
$$ plain form
6769 -253 -223 213 275 37 145 292 132 245 68 -55 350 -666 95 -93 -292 -328 53 319 222 -160 146
6790 146 29 -90 -348 -167 -60 314 -135 -80 118 89 293 -166 -50 -10 -512 -400 -223 -140 394 17 215
6811 215 208 -117 93 -199 -91 -593 80 249 -284 -145 -244 266 45 -185 -12 -15 -240 -41 -313 -464 207 309
6833 309 249 -73 16 62 295 98 91 318 550 -218 170 477 118 537 624 -183 407 -35 -347 550 -289 93
6855 93 51 62 197 132 -440 28 -488 391 -305 186 -236 -270 -76 428 -297 -337 454 162 -358 -147 -117 201
6877 201 158 -186 434 -154 126 -169 -151 -372 245 604 29 -385 -404 -842 -217 64 -416 -280 -190 -9 356
6898 356 -127 -37 67 -109 -71 -300 91 -153 8 57 -11 -151 78 94 268 272 -78 -275 10 452 442 158 -185
6921 -185 494 289 277 -214 -234 144 -28 68 -302 336 -161 -142 -36 82 -112 -435 123 -82 -123 82 54 -145
$$ packed form
6769b53L0M36O2k38J08J47j60J13j77j23M05j016P61j88j99l6L81K66r7l82L06
6790A46j17j19k58J81J07L74m49N5J98k9K04m59J16M0n02J12J77Q3N34l77J98
6811B15pl25K10k92J08n02O73J69n33J39r9N10k21k30J73lk25J99k72j51O71J02
6833C09o0l22Q9M6K33j97pK27K32p68L88L07l59M19Q7q07N90m42l12Q97q39L82
6855I3m2J1J35o5n72M68n16Q79o96M91m22l4J94N04p25m0P91k92n20K11L0L18
6877B01m3l44O20n88K80k95J8k21O17L59n75m14j9m38O25K81m80J36R0J81L65
6898C56m83R0J04j76L8k29L91k44J61M9o8j40K29J6J74Ml50j97K85M42j0k84l43
6921a85O79k05j2m91k0L78j72R6l70O38m97J9J06J18j94l23N58k05m1K05k8j99
$$ plain form
6943 -145 118 401 348 -72 -67 99 278 182 -177 107 257 -397 -77 -232 88 182 356 -309 -24 -279 -82 37
6965 37 82 -140 172 -439 -11 323 11 -242 -131 -28 -74 -228 -319 714 -151 320 -395 194 22 -241 177
6986 177 327 -162 23 -40 -2 -178 40 42 158 46 69 441 -206 166 -93 -297 214 91 -321 8 -169 26
7008 26 27 156 -115 176 -402 20 125 -91 -25 324 178 -486 483 -78 124 136 19 201 -29 -214 149 -257
7030 -257 -202 320 -258 -138 207 -515 333 145 485 315 -104 -132 -94 -38 1 110 268 214 -74 680 -188 -49
7052 -49 173 120 -377 62 -2 -27 195 268 4 -302 45 25 72 45 -190 79 -361 -242 -172 -166 -198 160 -6 -148
7076 -148 -52 215 -187 -515 577 -370 -195 -111 59 212 43 3 214 -229 -394 158 214 247 4 137 8
7097 8 392 49 -207 193 62 32 13 -105 -172 -119 258 -450 -464 172 206 347 -15 -185 368 164 22 -198 353
$$ packed form
6943a45K63K83n3m20NJ66J79r6l59K84J50o54L20j55L20R4J74o65K85k55J97J19
6965C7M5k22L12o11M28L34l12k53J11J03m6j54r1J033q65M71p15N89j72k63M18
6986A77J50m89J85o3L8j76K18KJ16j12K3L72o47L72k59k04N11j23m12L29j77J95
7008B6JJ29k71K91n78M22J05k16O6L49j46o64R69n61K02J2j17J82k30j85L63m06
7030b57N5N22n78J20L45p22Q48j88L40j70m19k8L8N6L9J09J58n4k88P54q68J39
7052d9K22n3m97M39o4k5K22P3k64l06L47k0M7k7k35K69m40J19P0Ol2L58j66j42
7076a48R6K67m02l28J092r47J75Q4J70J53j69m0K11m43j65N52N6L3k43J33j29
7097HL84l43k56M00j31l0j9j18o7N3L77p08j4O36L4J41l62j70N53k04j42k20N51
$$ plain form
7120 353 256 -131 -166 -317 45 162 72 77 154 -114 -96 -291 199 126 434 531 -366 -221 163 483 417 -228 -106
7143 -106 -644 372 329 -372 -8 398 105 262 114 78 -267 186 -230 266 191 138 -151 115 251 -37 32
7164 32 -222 -54 407 -258 166 -35 202 -65 -455 534 -309 -71 -89 296 -309 -366 -232 -411 -389 138 14
7185 14 12 109 -50 -118 -168 -59 159 -507 11 280 275 -7 223 -134 -137 135 130 -16 -157 224 336 524 -310 39
7209 39 -39 -110 -159 266 4 75 -250 127 406 103 786 -71 -152 -427 501 176 -268 103 -451 -108 -71 127
7231 127 184 37 -28 195 169 -134 151 87 54 61 -80 -254 46 -46 -300 -457 224 404 373 -109 68 -194 -147
7254 -147 -412 -170 -57 220 230 -137 -253 -277 -64 120 -65 179 -156 -527 -114 27 107 -115 183 121 153 71
7276 71 166 54 200 415 133 53 279 125 371 261 93 150 139 52 22 -137 221 -435 -108 -173 -134 -195 -39
$$ packed form
7120C53r7l87l5j51L62J17r0NP7k68J8j95M90p3L08R7q97J45L84L20o6o45J22
7143a06n38J016m3p01L64M06k93J57j48l6l45M53m16M96p5n3k89K66J36k88O9
7164C2k54J68M61o65M24k01K37k67l90R89q43K38j8L85o05n7J34j79K2N27j24
7185A4kR7j59o8n0J09K18o66N18K69nk82K30l57lK72nj46j41L81J12J88q34L49
7209C9p8p1m9M25k62P1l25L77K79l03O83q57q1k75R28l25m44L71n54L43L7J98
7231A27N7j47o5K23k6l03K85o4l3Pj41j74L00r2k54j57O81J80l1m82J77k62M7
7254a47k65K42J13K77J0l67j16k4K13J84j85K44l35l71M13J41Q0k22K98o2L2q2
7276G1R5j12J46K15k82q0K26j54K46j10j68N7j1q7l0j59L58o56L27o5L9o1J56
$$ plain form
7299 -39 102 53 119 -22 116 -153 514 -69 -145 -201 520 -86 -23 70 -171 428 316 605 24 98 -147 84 -32
7322 -32 -277 32 -54 -18 113 49 -74 -170 -125 108 76 -64 -287 -155 22 -107 104 108 -138 -82 22 24 -206 -117
7346 -117 -413 -162 -167 -379 -203 -476 -44 -234 -208 416 463 5 -48 256 354 -72 31 -167 441 195 -168 283
7368 283 -191 -116 -113 211 -177 -342 -17 -176 100 -139 -114 -511 241 -29 184 -288 -327 68 -167 641 -294 -218
7390 -218 -37 -155 -311 -174 148 -68 184 -401 -202 223 -57 -232 -247 -147 -281 256 -89 -163 392 129 69
7411 69 -160 -273 -121 -163 -292 -155 91 -319 12 -113 38 -309 -132 -385 -38 94 -95 -227 -69 220 106
7432 106 -95 -456 -56 -101 -174 423 -337 -119 144 -363 -128 111 -271 -180 -354 -129 -166 286 287 -383 -21 -565
7454 -565 131 -195 -334 -151 557 -11 39 180 -560 406 -170 -90 -490 -233 -227 373 7 -120 251 -65 26 -314
$$ packed form
7299c9J41m9O6j41J38k69O67n83p6n6P21o06O3R3k41N99j12K89n81P4k45K31j16
7322c2k45L09q6L6J31o4j23r6M5K33l2j40k23J32J77j29K11Mk46N6J04Kk30Q9
7346a17k96K51nk12J76k73M32j90K6O24M7m58n3L04R8m26J03j98O08k46l63M51
7368B83m74P5LL24l88j65L25j59K76k39K5l97P52k70K13m72l9L95k35Q08r35P6
7390b18J81j18j56J37L22k16K52n85J99M25k80j75j5J00j34N37l45p4N55k63o0
7411F9k29j13J52m2j29J37K46m10L31j25J51l47J77k53L47J32j89j32J58K89j14
7432A06k01l61M00m5p3N97p60K18K63n07K35K39l82R1j74K25l7M52Jo70L62n44
7454e65O96l26j39J83P08n68N0J41p40R66n76Q0m00K57OO00l66j27L71l16R1l40
$$ plain form
7476 -314 183 -10 39 377 498 170 -337 203 -105 306 -200 -134 -159 -139 13 -190 -300 195 70 214 -61
7497 -61 201 -60 116 15 184 240 -16 -444 45 -283 114 53 -97 175 348 -20 218 192 -263 -15 399
7518 399 224 -5 -182 -77 -38 124 -110 85 77 -223 133 -259 65 210 225 -209 -545 -103 -144 206 155 89
7540 89 25 -44 -49 111 -529 -165 -391 36 331 298 -209 -262 227 360 -93 59 -209 199 252 -50 247 38 -408
7563 -408 281 335 22 -35 -20 100 153 186 152 128 24 -120 252 165 -385 105 -155 71 88 237 270 211 -218 -239
7587 -239 -110 -374 176 44 -258 47 170 -184 -314 180 117 333 -254 12 196 188 -228 -54 210 134 131 185
7609 185 -228 -31 409 -185 629 -128 -32 -44 108 150 -269 135 -148 -212 0 -132 412 302 -141 183 320
7630 320 -157 193 -145 -315 -266 167 -52 -64 -380 289 24 19 258 -517 -344 521 192 26 72 56 45 -344
$$ packed form
7476c14M97j93M9L38J21l28n07N40l08M11n06O6k5K0J52k03j10M95j25J44k75
7497f1K62k61J76j01J69N6k56m28M89l28L97o1j50K72J73l68K38k6m55K48M14
7518C99j75k29j77J05L9J62k34J95ql00L56l92L24J45J5m34l36M42m1L50n1o6
7540H9o4o9nJ60o40L64k26M27K95l3n07n3M89J33m53J52k68M08N3l02K97k09m46
7563d08O89N4l13n7J5J20N3L3l4k4j04j44L72q7n50M90k60K26J7J49L3n9m29k1
7587b39J29k64N50j32l02L05J23l54j30M94o3K16n87K66J84qm16J74K64p6lN4
7609A85m13J97M40n94Q14p57R6j2J52M2m19M04k83o4K12j32N44j10m43L24J37
7630C20m77L50l38j70M9M33k19j2l16O69k65nK39p75J73Q65l29j66M6j6j1l89
$$ plain form
7652 -344 -42 127 393 -29 -50 23 115 -37 -83 -428 -189 -38 -596 50 -223 209 -226 -73 -236 -123 345
7673 345 208 -140 140 -24 -247 -517 -157 42 6 -153 -289 423 -3 116 290 -12 -552 -36 223 48
7693 48 5 115 -24 15 -72 -381 97 -3 -22 -38 42 217 -520 73 226 2 20 99 185 -318 407 -570 85
7716 85 68 -385 74 -83 283 314 16 -75 -50 208 -214 -156 -135 183 -54 137 -36 -133 -123 -510 -28 -240 -141
7739 -141 328 250 64 140 29 36 -79 50 380 237 29 -136 88 -20 319 -125 185 68 597 -169 299
7760 299 183 -58 46 228 235 -91 161 -99 -8 16 157 173 -18 -39 130 59 75 317 262 -239 -225 -47 75
7783 75 151 89 -252 -229 306 -23 -232 -139 176 -91 147 -77 239 55 378 -425 -434 48 -148 143 -46 148
7805 148 -260 -287 -20 -478 99 -22 -105 155 -182 128 -187 -35 -118 116 3 -250 -23 -98 202 203 60 154
$$ packed form
7652c44L02J69K66m22k1P3R2j52m6l45K39J51n58O46k73M32m35J53j63J13M68
7673C45j37l48K80j64k23k70L60J99l6j59j36P12m26J19J74l02n40N16K59j75
7693D8m3J10j39L9q7l09M78j00j9j6Q0J75p37N93J53k24J8P9Q6n03P25r77O55
7716H5j7m53M59j57L66L1k98r1K5K58m22N8K1L18k37J91j73r7J0l87M82k12R9
7739a41M69p8j86P6j11Pj15J29L30j43k08j65K24j08L39m44L10j17N29p66M68
7760B99j16k41J04J82Pl26K52k60R1K4J41J6j91k1J69p1J6K42n5n01J4J78J22
7783G5P6o2l41K3N35l29k09R3L15k67K38k24L16j84L23q03rM82j96K91j89J94
7805A48m08k7K67m58N77j21q3K60l37L10l15J52q3K34j13k53K27p5L00Jj43R4
$$ plain form
7827 154 340 -38 209 -392 501 164 105 159 460 144 -384 75 -226 -306 398 77 361 -199 0 142 -313
7848 -313 -159 95 275 110 -64 -508 -116 -207 245 157 -19 135 227 -353 -18 456 222 -148 270 -13 -162
7869 -162 264 39 -168 -162 -42 79 94 472 -210 -149 -56 125 426 122 49 -164 -67 469 -142 288 -49 -48 140
7892 140 93 156 -221 474 -106 181 -385 -273 -622 -511 -160 254 153 -20 90 224 273 230 207 -55 -91 155
7914 155 -79 121 -184 -349 -108 36 309 -252 -488 118 -4 -117 310 -133 -262 -367 -417 -180 -225 -51 -294
7935 -294 70 664 255 249 200 281 -101 -206 -120 379 -342 379 169 115 326 498 300 -101 236 -77 373 21
7957 21 97 -235 -291 77 -153 190 282 13 -18 -255 129 283 93 -221 93 -6 259 -250 293 -427 305 2
7979 2 171 -438 -235 -250 197 90 -215 164 -286 -215 -93 58 -311 31 157 99 138 167 -68 322 51 -1 607
$$ packed form
7827A54J86l78K47o01Q93l37n9N4L01l16n28M59l01q0P04l21K84n60J99J42m55
7848c13J54K54J80j65j74m44L92r1M52q8j76J54R2n80L35M74k34l70M18k83j49
7869a62M26k25k07OJ20J21J5L78o82O1R3J81L01l04p3k13R7N36o11M30l37JJ88
7892A40m7O3l77O95n80K87n66J12l49J11L51M14j01j73J10J34M9m3k3k62l6K46
7914A55k34K00l05j65K41J44K73n61k36O06j22j13M27m43j29j05n0K37m5J74k43
7935b94L64N94m09om9Q1l82j05Q6M99p21P21k10n4K11J72j98m01L37l13M50l52
7957B1P6l32n6L68k30L43R2k69l1k37L84J54j90l14L14r9K65n09N43p20P32l03
7979BJ69o09K03j5M47j07l05L79m50P1J22J51l69L42J26n8L9K9k35L90k71n2O08
$$ plain form
8002 607 109 -295 389 86 269 -120 -158 101 -364 -221 -9 -273 23 5 161 271 178 -392 591 12 286
8023 286 65 58 -27 88 135 303 -141 -126 -55 -165 -45 258 -55 31 -213 -397 7 -256 183 -41 -348 -143
8045 -143 -285 35 -432 -156 91 277 -16 -185 88 243 54 47 -371 78 1 -315 -408 -347 -382 -325 106 -427
8067 -427 -455 -428 -105 -77 411 149 -214 -316 -51 -2 106 -376 41 -101 78 20 194 44 206 -71 201 391
8089 391 262 -90 -320 160 -322 -12 361 -3 3 0 82 368 -198 -25 16 72 -306 -24 -29 171 319 -117 -119 50
8113 50 -3 -228 2 122 14 -225 -145 452 91 173 -282 35 -244 38 -214 3 -214 27 -518 115 93 193
8135 193 -7 -183 -116 354 694 -331 -72 -375 266 -199 294 243 219 119 -102 346 -237 -99 212 -2 146
8156 146 -514 210 81 15 268 -40 -106 427 250 -26 256 -143 94 0 -88 -90 148 -24 -123 151 81 95 -94
$$ packed form
8002F07m98m04O84l03J83l89l8K59m65J43K12k64K96j8J56J10r3n70R83n79K74
8023B86k21pq5J15M7J68m44J5P1j10J20L03l13Q6k44j84M04k63M39k24l07K05
8045a43j42L20m67K76K47J86k93j69K73J55j89pm18M49p7l16r3O1l5N7M31n33
8067d27k8K7L23K8M88k62l63j02K65M9J08m82M17j42J79n8J74j50J62k77K72J90
8089C91j29l52k30M80m82L10L73l64OlQ2K86n66J73M1N6l78K82nK00J48m36kJ69
8113E0n3k25K30J20j08k39Q0N97l61Q2m55L17k79K82k52K17k17K41n45O33k2J00
8135A93k00j76O7M70L40j025K59l03O41m65M93n1k4j00k21M48n83J38L11k14J48
8156A46o60P24j29o6K53l08o6N33j77k76K82l99K37r4q8kK38j72r9K74p0J4j89
$$ plain form
8179 -94 -44 -135 -258 -166 -102 -6 83 528 -9 88 252 -198
$$ packed form
8179i4N0r1j23R2O4R6Q9M45n37R7J64m50
8191a98
$$ Imaginary data points
##PAGE= N=2
##DATA TABLE= (X++(I..I)), XYDATA
$$ plain form
0 0 0 0 0 0 0 0 0 0 0 0 0 0 0 0 0 0 0 0 0 -24 24 -24 24 -24 24 -37 48 -48 51 -70 72 -83 96 -108 123 -138 153 -172
38 -172 193 -215 239 -265 293 -328 359 -399 440 -484 533 -589 647 -716 788 -869 961 -1063
56 -1063 1183 -1317 1473 -1658 1885 -2160 2509 -2968 3592 -4516 5996 -8781 15814 -68208
70 -68208 -91924 65083 15312 -26834 115061 246494 125860 31944 147917 248076 128161
81 128161 -681 50588 158866 103947 -38860 -44457 73180 62253 -85545 -131468 -41790
92 -41790 -25014 -115241 -154601 -93800 -28965 -22407 -62369 -78929 -27768 16640 -26678 -60479
104 -60479 13279 82975 36822 -17509 29510 99891 86112 18661 -4258 41738 64442 12021
116 12021 -27778 13746 41055 -10431 -43838 -9897 2425 -35357 -54407 -35835 -16466 -8681
$$ packed form
0@%%%%%%%%%%%%%%%%%%%k4M8m8M8m8M8o1Q5r6R9j21J42j55J79k04K31k61K91l25
38a72L65m08M54n04N58o21O87p58Q39r24J017j122J236j363J504j657J830k024
56a063K246k500K790l131L543m045M669n477O560q108J0512j4777K4595q4022
70f8208k3716J57007m9771m2146J41895J31433j20634r3916J15973J00159j19915
81A28161j28842N1269J08278n4919j42807n597J17637j0927j47798m5923Q9678
92d1790J6776r0227l9360O0801O4835O558l9962j6560N1161M4408m3318l3801
104f0479P3758O9696m6153n4331M7019P0381j3779o7451k2919M5996K2704n2421
116A2021l9799M1524K7309n1486l3407L3941J2322l7782j9050J8572J9369P785
$$ plain form
128 -8681 -12816 -19669 -3240 17225 4304 -11512 8956 28743 13898 -4132 3471 23710 32871
141 32871 13207 -13599 -8657 13194 -1742 -30721 -21678 -1599 -14414 -26807 -10715 2268
153 2268 -8475 -20999 -23302 -14721 -384 -1105 -9356 1227 19557 15306 5344 15114 23338 15078
167 15078 6991 6279 11724 21704 21810 6498 3863 15954 10220 -11111 -13392 -5721 -11943 -18524 -11701
182 -11701 -3893 -4379 -9042 -17430 -16419 -6303 -5978 -15333 -10325 2914 3058 126 7239 11535 6958
197 6958 1979 -313 -323 5828 8946 3249 3578 11848 11294 2434 749 2345 -1937 -4848 -1318 1643
213 1643 3856 4068 -813 -2845 1268 833 -7207 -9094 -4474 -5532 -7164 -3058 87 -818 -2246 -4953
229 -4953 -6467 -3851 -1723 -4100 -4194 2459 5170 4819 5628 6173 3436 1283 1507 3501 5792 7373 5817
$$ packed form
128h681m135o853J6429K0465j2921j5816K0468J9787j4845j8030P603K0239R161
141C2871j9664k6806M942K1851j4936k8979R043K0079j2815j2393J6092J2983
153B268j0743j2524k303Q581J4337p21q251J0583J8330m251r962R770Q224q260
167A5078q087p12N445R980J06j5312k635J2091n734k1331k281P671o222o581O823
182a1701P808m86m663q388J011J0116L25r355N008J3239J44k932P113M296m577
197F958m979k292j0O151L118n697L29Q270n54q860j685J596m282k911L530K961
213A643K213K12m881k032M113m35q040j887M620j058j632M106L145r05j428k707
229d953j514K616K128k377r4O653K711l51Q09N45k737k153K24J994K291J581j556
$$ plain form
246 5817 4764 7439 7158 2637 -96 -225 -2227 -4426 -4073 -3901 -3323 -4740 -6610 -7981 -7543 -6783 -8647
263 -8647 -9105 -6015 -3524 -1401 1827 4693 4762 4375 5209 5638 7317 7963 7388 6724 7623 7543 6370 5050
281 5050 3685 1080 -2042 -2656 -4184 -4534 -4606 -5824 -6544 -6053 -5913 -6209 -7706 -7950 -7724 -6091 -3681 -1341
299 -1341 972 1805 2550 2720 5066 6632 6306 6465 6537 7111 7695 7576 6157 5164 4045 1825 -537 -2326
317 -2326 -3963 -5917 -6577 -5934 -4996 -5342 -5342 -6126 -6941 -6261 -5716 -4674 -2354 -478 832 2753 4370 5064
335 5064 4218 4123 4004 4106 4818 5119 5877 5428 5002 4299 2211 1494 -383 -3205 -4559 -3975 -3243 -3348 -3973
354 -3973 -4338 -5590 -5593 -5769 -5031 -4408 -2877 -2001 -678 1329 3204 3649 3598 4033 3643 3866 5199 4923 4662
373 4662 4252 4671 3250 2053 1758 -185 -2341 -3134 -3607 -3365 -2573 -2446 -3567 -4201 -4040 -4162 -3535 -3139
$$ packed form
246E817j053K675k81m521k733j29k002k199L53J72N78j417j870j371M38P60j864
263h647m58L090K491K123L228K866O9l87Q34M29J679O46n75o64Q99q0j173j320
281E050j365k605l122o14j528l50p2j218p20M91J40k96j497k44K26J633K410K340
299a341K313Q33P45J70K346J566l26J59P2N74N84j19j419r93j119k220k362j789
317b326j637j954o60O43R38l46%p84q15O80N45J042K320J876J310J921J617O94
335E064q46r5j19J02P12L01P58m49m26p03k088p17j877k822j354N84P32j05o25
354c973l65j252lj76P38O23J531Q76J323K007J875M45n1M35l90K23J333k76k61
373D662m10M19j421j197k95j943k156p93m73K42P92J27j121o34J61j22O27L96
$$ plain form
391 -3139 -2560 -1916 -456 772 1420 1299 2952 2726 2355 3878 4841 3790 3406 3487 2462 2572 3534 1438
409 1438 -70 -257 -1118 -2555 -2395 -2562 -3761 -4106 -2535 -2537 -2961 -1484 -2035 -3216 -2073 -798 -622 -17
427 -17 1614 1197 1364 3407 3077 2254 2152 2495 896 1658 3787 3067 1485 1522 1145 -776 -105 -549 -2451
446 -2451 -3101 -1798 -2596 -2213 -556 -1452 -3607 -2309 -969 -2367 -1317 -32 -1167 -1120 1758 2713 1851
463 1851 2338 2589 -237 326 3404 2253 774 2935 1962 841 2144 1758 -1054 -1447 -286 -1017 -1014 1073
481 1073 -664 -3188 -1996 -780 -2120 -1592 -861 -2664 -2845 172 643 65 1657 1421 -575 247 2915
498 2915 966 244 2076 1096 412 2813 2806 -134 -895 674 -952 -969 1262 -390 -3250 -889 85 -1000
516 -1000 -485 223 -2770 -3464 -396 -162 -775 1356 312 -1229 852 3420 1105 84 1288 128
$$ packed form
391c139N79O44J460J228O48j21J653k26l71J523R63j051l84Q1j025J10R62k096
409A438j508j87q61j437J60j67j199l45J571km24J477n51j181J143J275J76O05
427a7J631m17J67K043l30q23j02L43j599P62K129p20j582L7l77j921O71m44j902
446b451o50J303p98L83J657q96k155J298J340j398J050J285j135M7K878R55q62
463A851M87K51k826N63L078j151j479K161r73j121J303l86k812l93J161p31LK087
481A073j737k524J192J216j340N28P31j803j81L017M71n78J592k36j996Q22K668
498B915j949p22J832r80o84K401pk940p61J569j626j7K231j652k860K361R74j085
516a000N15P08k993o94L068K34o13K131j044j541K081K568k315j021J204j160
$$ plain form
532 128 75 3011 3462 606 547 862 -774 -233 1712 -625 -3080 -1428 -823 -2402 38 479 -2958 -3104
550 -3104 -183 -805 -1676 143 9 -2232 537 3563 912 962 2427 -68 -308 2877 3339 178 758
567 758 2069 -702 733 2557 -241 -2402 -292 -1137 -1842 -565 281 -2960 -2424 7 -1165 -2102 -160
584 -160 -1352 -2908 222 2386 899 575 1661 -555 -591 3029 2572 -226 777 1481 -546 1418 3195
601 3195 512 -1757 541 -527 -1977 59 116 -2081 -1514 612 -237 -949 333 -1328 -3045 -820
617 -820 745 -271 243 1740 -656 -623 2278 1415 -416 -16 556 -690 643 2676 170 -486 936
634 936 270 -781 1229 779 -1850 -1139 490 -407 -250 1237 -574 -1875 -706 67 -728 -355 166 -892
652 -892 -578 1460 780 -441 835 576 -663 393 2017 320 -48 1472 1007 214 964 960 -1300 -437
$$ packed form
532A28n3K936M51k856n9L15j636N41J945k337k455J652O05j579K440M41l437j46
550c104K921o22q71J819j34k241K769L026k651N0J465k495k40L185M62l161N80
567G58J311k771J435J824k798k161K110q45p05J277Q46l241N36K431j172r37J942
584a60j192j556L130K164j487l24J086k216l6L620m57k798J003P04k027J964J777
601C195k683k269K298j068j450K036N7k197N67K126q49p12J282j661j717K225
617h20J565j016N14J497k396L3K901q63j831M00N72j246J333K033k506o56J422
634I36o66j051K010m50k629P11J629q97J57J487j811j301J169P73p95L73N21j058
652h92L14K038o80j221J276k59j239J056J624j697l68J520m65p93P50mk260Q63
$$ plain form
670 -437 234 -713 133 886 -503 -1343 -235 -30 -1628 -943 -389 -1457 -1154 328 -405 -1635 174 147
688 147 -630 416 1078 71 161 1591 854 839 1834 1843 298 668 604 119 130 564 -402 -925 -332 -519 -912
709 -912 -701 -784 -1712 -953 -197 -772 -1084 428 54 -420 561 555 -143 165 997 1028 942 1155 1605 974 788 1004
731 1004 204 580 446 294 -504 230 -198 -879 -742 -743 -1492 -1444 -1407 -986 -1530 -639 -581 -1099 -297 -289 189 -3
753 -3 848 700 939 1405 1208 1415 1451 1589 885 942 917 -427 114 -147 -266 -256 -441 -564 -1162 -1029 -663 -1606
775 -1606 -1411 -1304 -1083 -252 -496 75 251 253 612 1086 976 943 1363 671 1223 1058 1007 953 538 144 391 53
797 53 -127 -205 -3 -892 -810 -553 -865 -486 -1183 -850 -934 -585 -470 -283 -686 -131 65 154 78 578 662 808 518
820 518 548 801 845 764 665 635 471 375 298 -500 -239 -383 -374 -491 -925 -946 -953 -883 -875 -532 -645 -552 -12 -237 -239 14
$$ packed form
670d37O71r47Q46P53j389q40J108K05j598O85N54j068L03J482p33j230J809k7
688A47p77J046O62j007R0J430p37j5R95Rj545L70o4m85J1M34r66n23N93j87l93
709i12K11q3r28P59P56n75l12J512l74m74R81oo98L08Q32L1q6K13M50o31j86K16
731A004q00L76j34j52p98P34m28o81J37jp49M8L7M21n44Q91N8n18Q02QM78j92
753cQ51j48K39M66j97K07L6J38p04N7k5j344N41k61j19J0j85j23n98J33L66r43
775a606J95J07K21Q31k44N71J76KL59M74j10l3M20o92N52j65n1n4m15l94K47l38
797E3j80p8K02q89Q2K57l12L79o97L33q4L49J15J87m03N55J96Q9p6N00Q4J46k90
820E18L0K53M4q1r9l0j64r6p7p98K61j44Rj17m34k1pP0QL43j13R3N40k25kK53
$$ plain form
846 14 44 350 611 236 656 1062 974 1161 537 965 966 440 487 336 63 203 -170 86 -323 -527 -583 -631 -576
869 -576 -719 -721 -933 -1207 -753 -841 -214 -220 59 -16 355 -86 378 378 1087 666 682 1235 900 977 914 403 182 346
893 346 310 -560 -191 -440 -404 -628 -862 -942 -1239 -1232 -778 -832 -1114 -171 -372 -179 564 186 483 519 528 543 806 918
917 918 161 416 1027 1086 677 784 395 -127 384 31 -744 -794 -549 -915 -1531 -1295 -862 -1025 -1133 -893 -1089
938 -1089 -1199 341 -277 43 167 428 741 1129 1041 342 975 826 672 348 773 474 359 279 -21 -91 7
959 7 -349 -811 -1012 -682 -382 -1150 -990 -956 -1296 -1401 -194 -250 -422 176 55 -75 627 1151 332 584 786
980 786 720 485 1708 148 211 890 956 -21 -202 227 -1082 -897 -112 -396 -1000 -352 -215 -1087 -568 55
1000 55 -597 -843 -40 -775 -784 651 656 241 -7 1228 515 826 1255 413 -325 176 578 503 711 574 -526
$$ packed form
846A4L0L06K61l75M20M06q8J87o24M28Jn26M7j51k73J40l73K56m09k04n6m8N5
869e76j43kk12k74M54q8O27oK79p5L71m41M64%P09m21J6N53l35P7o3n11k21J64
893C46l6q70L69k49L6k24k34q0k97PM54n4k82R43k01J93P43l78K97L6RJ5K63J12
917I18p57K55O11N9m09J07l89n22N11l53p75n0K45l66o16K36M33j63j08K40j96
938a089j10J540o18L20J24K61L13L88q8o99O33j49j54l24M25k99j15q0l00p0R8
959Gl56m62k01L30L00p68J60L4l40j05J207n6j72N98j21j30P02N24q19K52K02
980G86o6k35J223j560O3O79O6r77j81M29j309J85P85k84o04O48J37q72N19O23
1000E5o52k46Q03p35rJ435Nm15k48J235p13L11M29q42p38N01M02p5K08j37j100
$$ plain form
1021 -526 -520 297 1 -455 -235 -635 -1615 -338 452 -311 -584 -470 -1085 -1009 214 568 -553 72 344 -221
1041 -221 188 1823 311 -76 802 835 629 1232 972 -292 -371 48 26 -134 327 -241 -971 -466 277 -643
1061 -643 -750 -116 -1125 -522 6 -192 -933 15 128 -590 -300 1086 -243 -204 513 188 -62 1326 1195
1080 1195 101 21 1300 482 402 929 -386 -1170 -149 485 -337 -278 -13 -946 -1178 113 -805 -802 -587 -591
1100 -591 -1124 -263 823 -514 -768 250 125 -269 1021 1105 -268 383 991 805 487 1417 340 -106
1118 -106 247 803 -3 225 78 -906 -892 156 -90 -1307 -661 -481 -1000 -116 482 -485 -729 52 57 -298
1138 -298 869 940 -493 560 1322 721 978 1218 513 -372 752 507 -219 -153 75 -1207 -564 341 -351
1157 -351 -962 -252 -476 -1377 -547 449 -601 -664 81 -366 -250 889 1043 -95 119 810 279 920 1508
$$ packed form
1021e26OQ17k96m56K20m00r80J277P90p63k73J14o15P6J223L54j121O25K72n65
1041b21M09J635j512l87Q78L3k06O03k60j264p9M19k2j60M61n68p30N05P43r20
1061f43j07O34j009O03N28j98p41R48J13p18K90J386j329L9P17l25k50J388j31
1080A195j094q0J279q18q0N27j315p84J021O34q22N9K65r33k32J291r18LK15m
1100e91n33Q61J086j337k54J018j25l94J290Q4j373O51O08j86l18R30j077m46
1118a06L53N56q06K28j47r84J4J048k46j217O46J80n19Q84N98r67k44P81Nl55
1138b98J167P1j433J053P62o01K57K40p05q85J124k45p26O6K28j282O43R05o92
1157c51o11P10k24r01Q30R96j050o3P45m47J16J139J54j138K14O91n31O41N88
$$ plain form
1176 1508 544 220 638 1034 98 301 338 -383 -217 262 -367 -1069 -975 -985 -1370 -461 125 -528 -771 -283 -551
1197 -551 -684 250 291 138 532 783 547 949 1306 530 377 574 691 773 905 592 -269 -30 52 -309 -554
1218 -554 -423 -558 -880 -857 -502 -1042 -960 -270 -660 -589 -163 -468 -749 -158 118 198 210 827 383 687 725 851
1240 851 684 834 1004 -156 661 426 -2 -335 -70 -553 -451 -655 -441 -432 -715 -824 -811 -710 -548 -314 -151
1261 -151 3 -485 -291 -108 695 -538 329 338 569 565 737 759 298 168 356 92 572 -83 -37 153 95 -68
1283 -68 -534 -780 -283 -1031 -236 -345 -78 -584 -964 -306 -176 -178 89 59 -77 571 326 626 703 626 308 148
1305 148 400 207 348 82 439 -173 -344 -44 -30 -54 6 -397 -190 -636 -474 -616 -918 -424 -425 133 40 200
1327 200 -119 -78 586 -73 341 546 268 361 424 781 642 730 346 389 396 -90 129 325 -72 -600 -669 -692 -540
$$ packed form
1176A508r64l24M18L96r36K03L7p21J66M79o29p02R4j0l85R09N86o53k43M88k68
1197e51j33R34M1j53L94K51k36M02L57p76j53J97J17Q2J32l13q61K39Q2l61k45
1218e54J31j35l22K3L55n40Q2O90l90P1M26l05k81N91K76Q0J2O17m44L04L8J26
1240H51j67J50J70j160Q17k35m28l33K65m83J02k04K14Rk83j09J3J01J62K34J63
1261a51J54m88J94J83Q03j233Q67RK31mJ72K2m61j30J88k64M80o55M6J90n8j63
1283f8m66k46M97p48P95j09K67n06l80O58J30kK67l0j36O48k45L00P7p7l18j60
1305A48K52j93J41k66L57o12j71L00J4k4O0m03K07m46J62j42l02M94jN58r3J60
1327B00l19M1O64o59M14K05k78R3O3L57j39Q8l84M3Pm86K19J96l97n28o9k3J52
$$ plain form
1350 -540 -326 -11 -317 -613 -472 -368 -115 -156 -495 -221 -219 33 -153 238 397 498 503 427 208 266 -17 600
1372 600 -394 557 176 19 143 104 -2 -596 -335 46 -117 -337 -275 -556 -131 -239 -183 57 -117 -6 146
1393 146 -188 13 52 -95 276 156 226 486 197 232 184 476 22 349 154 39 -20 98 -309 -368 44 -272
1415 -272 -416 -600 -389 -386 -520 -706 -250 -506 -227 -92 -269 -99 276 512 70 690 401 637 290 951 378
1436 378 170 704 55 188 -20 111 -43 -432 -290 -613 -1111 -349 -159 -574 -676 -283 -867 -293 -407 -160
1456 -160 -228 -174 398 -278 -14 309 472 410 429 543 329 763 395 -72 118 569 -158 -151 37 -50 -468 -276
1478 -276 -160 -371 -825 121 -612 -457 77 337 -601 70 21 -252 167 187 59 42 91 454 335 931 475
1499 475 -227 420 518 397 242 76 -202 -238 -124 220 -392 -59 -576 -170 -383 203 -505 -580 -276 -310 -14
$$ packed form
1350e40K14L15l06k96J41J04K53m1l39K74KK52j86L91J59J01Np6k19N8k83O17
1372F00r94R51l81j57J24l9j06n94K61L81j63k20O2k81M25j08N6K40j74J11J52
1393A46l34K01L9j47L71j20P0K60k89L5m8K92m54L27j95j15n9J18m07n9M12l16
1415b72j44j84K11Lj34j86M56k56K79J35j77J70L75K36m42O20k89K36l47O61n73
1436C78k08N34o49J33k08J31j54l89J42l23m98P62J90m15j02L93n84N74j14K47
1456a60o8N4N72o76K64L23J63o2J9J14k14M34l68m67J90M51p27PJ88q7m18J92
1478b76J16k11m54R46p33J55N34K60r38O71m9k73M19K0j28j7M9L63j19N96m56
1499D75p02O47R8j21j55j66k78l6J14L44o12L33n17M06k13N86p08p5L04l4K96
$$ plain form
1520 -14 -290 292 -375 -263 597 698 621 696 578 -102 654 1094 -62 -212 666 503 -313 136 -86 -508 -260
1541 -260 -138 -646 -563 366 -631 -704 -633 -247 -723 -58 479 -742 -682 358 331 -5 583 -96 18 606 512
1562 512 417 189 936 -4 -243 707 263 -128 445 178 -524 -51 546 -179 -333 -365 -478 -382 -315 -61 -774
1583 -774 -262 21 -271 75 109 -26 -541 114 141 492 498 122 244 173 901 572 -100 254 -55 -692 209 416
1605 416 -311 -138 -62 -583 -520 -165 100 -803 -742 -422 -526 -243 264 -201 -223 432 225 -144 9 -22 181 -205
1627 -205 360 725 169 301 152 -268 143 311 -216 -26 -1 -272 -247 367 295 -407 -162 -555 -504 -28 308
1648 308 -528 -488 48 262 -386 285 437 -328 80 432 322 229 23 485 -407 349 449 76 419 122 125
1669 125 64 169 -198 -286 -258 -132 -142 -396 -240 -670 -912 32 -408 -86 256 -107 -37 107 1227 233 -150
$$ packed form
1520a4k76N82o67J12Q60J01p7P5j18o80P56M40j156j50Q78j63q16M49k22m22K48
1541b60J22n08Q3R29r97p3P1L86m76O65N37j221O0J040k7l36N88o79J14N88r4
1562E12r5k28P47r40k39R50m44l91N73k67p02M73N97p25j54l2j13R6O7K54p13
1583g74N12K83k92L46L4j35n15O55K7L51Ol76J22p1P28l29o72L54l09o37R01K07
1605D16p27J73P6n21O3L55K65r03O1L20j04K83N07m65k2O55k07l69J53l1K03l86
1627b05N65L65n56J32j49m20M11J68n27J90K5k71K5O14p2p02K45l93N1M76L36
1648C08q36M0N36K14o48O71J52p65M08L52j10r3k06M62q92P56J00l73L43k97L
1669A25o1J05l67q8K8J26j0k54J56m30k42R44m40L22L42l63P0J44J120r94l83
$$ plain form
1690 -150 571 804 51 107 335 -142 696 222 -157 -289 313 54 -740 -461 -76 -625 -698 -204 -199 -373 -367 -416
1712 -416 -259 138 26 -151 -288 818 188 353 447 408 -110 387 596 -153 155 707 -123 3 408 172
1732 172 -83 157 44 -518 23 -137 -356 -296 49 -262 -158 -155 94 -492 -9 148 92 -89 224 171 169 301
1754 301 12 -319 218 277 107 185 595 139 89 9 -189 -16 397 287 -402 -188 -464 -307 -691 -6 -215
1775 -215 -311 64 49 196 -43 79 -313 -48 81 335 -170 -450 319 106 532 341 506 536 512 -45 338
1796 338 -178 -75 -537 -255 -217 -171 -572 -260 -314 -79 202 -491 67 -553 2 27 294 251 211 -38 71 253
1818 253 398 -76 265 238 476 101 484 -353 381 579 270 192 174 -84 -490 -436 -407 -550 -394 -262 -730 -417
1840 -417 -125 198 -69 82 -126 134 -267 -85 283 218 134 152 -50 560 -32 -75 258 75 -222 196 73
$$ packed form
1690a50P21K33p53N6K28m77Q38m74l79j32O02k59p94K79L85n49p3M94Nj74Om9
1712d16J57L97j12j77j37J106o30J65R4l9n18M97K09p49L08N52q30J26M05k36
1732A72k55K40j13n62N41j60k19O0L45l11J04LK49n86M83J57n6j81L13n3kJ32
1754C01k89l31N37N9j70P8M10m56n0q0j98J73M13j10o89K14k76J57l84O85k09
1775b15r6L75j5J47k39J22l92K65J29K54n05k80P69k13M26j91J65L0k4n57L83
1796C38n16J03m62K82L8M6m01L12n4K35K81o93N58o20N55K5K67m3m0k49J09J82
1818B53J45m74L41k7K38l75L83q37P34J98l09p8j8k58m06N4K9j43J56J32m68L13
1840d17K92L23k67J51k08K60m01J82L68o5q4J8k02O10n92m3L33j83k97M18j23
$$ plain form
1861 73 171 185 372 -413 -297 -329 -58 -239 -434 -218 -309 -112 -19 -212 119 -183 236 171 -18 87 -192 223
1883 223 495 148 106 235 398 85 276 -180 407 558 -2 -2 -512 -269 47 -509 -93 133 -47 58 177
1904 177 -472 -167 -114 -34 81 74 -128 195 444 -33 375 76 152 183 -158 206 398 244 0 10 14 1 -436
1927 -436 -79 54 -64 109 -332 -132 -322 -140 -608 91 428 -170 341 -134 6 380 92 -231 57 768
1947 768 185 75 448 217 38 -163 -17 205 -381 245 83 208 -50 -492 -132 -350 -252 22 -250 219
1967 219 -372 111 -301 93 -292 53 119 -106 -470 293 115 264 45 451 431 366 644 222 0 532 293
1988 293 -409 8 87 -331 -64 -186 -185 -301 51 -824 -80 -82 -419 -22 91 50 -66 -293 -147 113 -219 244
2010 244 474 -168 -163 263 269 256 361 -109 384 -59 -50 -175 474 -279 -123 -218 -198 -24 189 -16 -105 -443 -153
$$ packed form
1861G3R8J4J87p85J16l2K71j81j95K16r1J97R3j93L31l02M19o5j89J05k79M15
1883B23K72l47m2J29J63l13J91m56N87J51n60%n10K43L16n56M16K26j80J05J19
1904A77o49L05N3Q0J15pk02L23K49m77M08k99P6L1l41L64J92j54k44J0Mj3m37
1927d36L57J33j18J73m41K00j90J82m68O99L37n98N11m75J40L74k88l23K88P11
1947G68n83j10L73k31j79k01J46K22n86O26j62J25k58m42L60k18R8K74k72M69
1967B19n91M83m12L94l85L45O6k25l64P63j78J49k19M06k0o5K78m22k22N32k39
1988B93p02M17P9m18K67j22Jj16L52q75P44kl37L97J13m1j16k27J46K60l32M63
2010B44K30o42NM26Oj3J05m70M93m43Rj25O49p53J56r5K0J74K13k05q9l38K90
$$ plain form
2033 -153 88 -307 -446 -137 -294 -222 261 91 186 195 130 209 -56 504 96 -294 218 277 101 484 407 -179 91
2056 91 14 416 71 359 -92 -583 69 -238 -148 244 -230 -353 -389 -70 116 -92 -90 415 39 61 286 160
2078 160 -208 313 -289 -35 466 414 33 0 72 117 14 -155 -324 -193 -161 138 -244 225 -473 -238 -273 4
2100 4 -52 -425 -257 119 48 -121 620 337 111 290 197 -260 512 -27 -292 70 296 232 314 408 -180 103 -454
2123 -454 -179 -190 -264 6 -538 -462 -469 -120 0 401 87 190 417 233 -5 75 458 324 -26 360 114 239
2145 239 -205 -82 -82 138 585 -105 3 209 29 -230 -114 262 53 -98 -119 -58 -270 -10 42 -27 273 701
2167 701 260 -270 44 -278 106 71 67 -36 -122 -67 -205 316 758 371 1 -83 -51 -63 513 -166 -360 -181 -97
2190 -97 -309 -437 -207 -378 -392 -160 328 -274 -373 216 -423 110 668 411 -234 115 22 55 649 -110 546 214
$$ packed form
2033a53K41l95j39L09j57P2M83j70R5Ro5P9k65N60m08l90N12N9j76L83p7n86K70
2056I1p7M02l45K88m51m91O52l07R0L92m74j23l6L19J86k08KN05l76K2K25j26
2078A60l68N21o02K54N01n2l81l3P2M5j03j69j69J31L2K99l82M69o98K35l5K77
2100Dn6l73J68L76p1j69P41k83k26J79r3m57P72n39k65L62K26o4Q2R4n88K83n57
2123d54K75j1p4K70n44P6pL49J20M01l14J03K27j84k38Q0L83j34l50L86k46J25
2145B39m44J23%K20M47o90J08K06j80k59J16L76k09j51k1O1k12K60N2o9L00M28
2167G01m41n30L14l22L84l5mj03q6N5j38N21M42l87l70q4L2j2N76o79j94J79Q4
2190i7k12j28K30j71j4K32M88o02r9N89o39N33N58k57o45L49r3L3N94p59O56l32
$$ plain form
2212 214 192 -45 -138 -245 -34 95 -502 -123 -284 115 -46 205 -273 -206 -89 -285 -118 -159 -178 145 29 20
2234 20 597 113 -250 291 60 416 -42 -386 240 479 424 42 321 -546 -381 71 56 49 41 11 -201 -182 -315
2257 -315 30 134 -20 -290 -38 132 -34 -239 90 -125 -192 -123 11 101 146 345 -171 164 549 -141 -8
2278 -8 244 -217 -255 -240 78 -111 -113 -101 -211 -56 80 -456 -143 125 567 -530 204 269 344 -462 -171 642 -73
2301 -73 -350 -469 306 236 -27 -110 237 341 -25 -356 252 214 -77 -24 -221 201 -248 55 -4 -338 -265 -385
2323 -385 -126 -411 -159 215 184 389 -54 289 243 821 -40 131 392 3 -105 382 -177 118 -30 135 5
2344 5 -170 110 -202 78 -188 298 -163 -251 -112 155 -358 517 34 215 334 -119 -319 320 -121 156 281
2365 281 -157 -187 123 97 -310 100 -426 108 307 76 -197 -43 -96 -357 103 -400 -139 -361 -420 -102 -46 -210
$$ packed form
2212B14k2k37r3j07K11J29n97L79j61L99j61K51m78O7J17j96J67m1j9L23j16r
2234B0N77m84l63N41k31L56m58l44O26K39n5l82K79q67J65M52j5pql0k12J9j33
2257c15L45J04j54k70K52J70j66k05L29k15o7O9J34R0M5J99n16L35L85o90J33
2278hK52m61l8J5L18j89kJ2j10J55J36n36L13K68M42j097P34O5P5q06K91Q13p15
2301g3k77j19P75p0k63q3L47J04l66l31O08l8k91N3j97M22m49L03n9l34P3j20
2323c85K59k85K52L74l1K05m43L43m6N78q61J71K61l89j08M87n59K95j48J65j30
2344Ej75K80l12K80k66M86m61q8J39K67n13Q75m83J81J19m53k00O39m41K77J25
2365B81m38l0L10k6m07M10n26N34J99k31k73J54n3k61M60n03K61k22n9L18N6j64
$$ plain form
2387 -210 -121 -252 -39 -395 204 -110 187 288 -273 -282 -63 -480 200 221 -329 -10 -147 248 -215 0 10 -12
2409 -12 -423 -63 221 129 -145 -259 -12 -213 -355 -14 15 -141 314 11 -113 2 160 47 343 180 90
2430 90 242 49 -256 282 -38 83 33 -180 -206 -56 -186 -78 -77 -220 -425 179 -229 -369 -357 33 262 -197
2452 -197 148 -549 -30 -187 223 499 -50 454 -362 -241 160 -91 50 415 -296 152 308 -124 -339 217
2472 217 243 -217 64 17 94 -295 126 20 153 -95 -356 -190 249 139 -171 -89 421 184 -53 -29 0 512
2494 512 -22 -82 277 359 98 -11 190 137 282 -206 201 12 -174 -147 -196 325 -141 350 89 -4 -140 -159
2516 -159 216 312 74 -358 -49 -155 59 -159 554 -233 230 195 144 118 -118 155 -289 -64 -195 111 -266
2537 -266 -324 209 -84 -209 335 -38 -419 490 -266 -459 0 -141 -104 63 371 -156 237 274 149 142 -98 -95
$$ packed form
2387b10Q9j31K13l56N99l14K97J01n61rK19m17O80K1n50L19j37L95m63K15J0k2
2409a2m11L60K84r2k74j14K47k01j42L41K9j56M55l03j24J15J58j13K96j63r0
2430I0J52j93l05N38l20J21n0k13k6J50j30J08Jj43k05O04m08j40J2L90K29m59
2452a97L45o97N19j57M10K76n49N04q16J21M01k51J41L65p11M48J56m32k15N56
2472B17K6m60K81m7P7l89M21j06J33k48k61J66M39j10l10Q2N10k37k37K4K9N12
2494E12n34o0L59Q2k61j09K01n3J45m88M07j89j86K7m9N21m66M91k61r3j36j9
2516a59L75R6k38m32L09j06K14k18P13p87M63l5n1k6k36K73m44K25j31L06l77
2537b66n8N33k93j25N44l73l81R09p56j93M59j41L7J67L08n27L93L7j25pk40L
$$ plain form
2559 -95 -88 -113 192 -197 -151 459 327 140 -387 49 -417 338 -193 -302 83 118 -133 -474 -432 83 236 542
2581 542 114 543 -460 120 114 -718 -202 683 85 -357 409 -273 -101 341 458 -15 264 194 325 -543 -74
2602 -74 3 -255 -445 367 -239 -65 78 0 92 49 -94 -198 46 -516 317 70 -97 115 110 240 267 14 359
2625 359 325 -114 306 336 50 -400 -226 98 -119 -82 79 -3 -31 -160 -240 2 289 -151 8 -25 -160 -144 71
2648 71 -545 -152 -233 2 240 177 185 -48 -20 153 -149 232 65 -127 12 -20 481 338 -98 34 223 466
2670 466 234 -98 -93 -280 -443 -205 -292 76 -65 -210 117 -116 -38 360 -34 360 172 152 365 -335 295 -12
2692 -12 9 76 571 -138 13 40 -448 -2 -431 147 -209 -456 52 248 -315 314 -167 126 -11 -9 -418 176
2714 176 519 -272 -294 -130 -118 -488 -50 -173 220 259 -379 0 -2 -234 -142 -107 -307 -73 -155 -407 -506 -349 -101
$$ packed form
2559i5Pk5L05l89M6O10j32j87n27M36m66P55n31j09L85L5k51l41M2N15J53L06
2581E42m28M29j003N80oq32N16Q85n98m42P66o82J72M42J17m73K79p0J31q68M69
2602g4P7k58j90Q12o06J74J43p8R2m3j43j04K44n62Q33k47j67K12nJ30K7k53L45
2625C59l4m39M20L0k86m50J74L24k17L7J61q2k8j29q0K42K87m40J59l3j35J6K15
2648G1o16L93q1K35K38o3Qk33K8J73l02L81j67j92J39l2N01j43m36J32J89K43
2670D66k32l32Nj87j63K38q7L68j41j45L27k33P8L98l94L94j88k0K13p00O30l07
2692a2K1O7M95p09J51K7m88M46m29N78l56k47N08J96n63O29m81K93j37Km09N94
2714A76L43p91k2J64J2l70M38j23L93L9o38L79kk32R2L5k00K34q2k52r9J57K48
$$ plain form
2737 -101 -264 93 -517 -360 -435 -312 -199 182 -413 -229 -37 -320 288 -256 -582 -63 146 445 -169 144
2757 144 423 505 25 219 -96 -33 -101 28 222 52 -167 -202 503 -72 -227 93 57 49 -327 63 28 -534 -325
2780 -325 -331 -129 488 -168 190 -45 60 162 1 -54 -403 250 438 71 172 107 115 -58 -365 -259 29 132
2802 132 -80 144 -38 -153 -329 342 -244 269 -59 215 18 498 190 225 -24 -78 -117 -138 6 -251 -59
2823 -59 9 538 -516 308 -150 -69 -197 -89 -294 -317 -280 -226 -71 172 -27 -545 -535 -92 232 -65 116 -56
2845 -56 -107 159 319 -25 311 110 102 -202 -242 369 237 -181 731 -45 45 -351 228 -209 141 136 8 -221 111
2868 111 -333 30 -153 223 -321 89 -271 39 381 -146 9 195 -184 227 123 -35 165 -197 124 -84
2888 -84 123 -505 298 -208 -29 -139 -118 179 -141 304 174 -265 -304 -8 354 -160 -70 217 -81 536 6
$$ packed form
2737a01j63L57o10J57p5J23J13L81n95J84J92k83O08n44l26N19K09K99o14L13
2757A44K79Q2m80J94l15O3o8J29J94j70k19l5P05n75j55L20l6ql76L90l5n62K09
2780c25oK02O17o56L58k35J05J02j61n5l49O53J88l67J01o5Qj73l07J06K88J03
2802A32k12K24j82j15j76O71n86N13l28K74j97M80l08L5k49n4l9k1J44k57J92
2823e9O8N29j054Q24m58Q1j28J08k05k3L7N4J55K43j99n18J0M43L24k97J81j72
2845e6n1K66J60l44L36k01ql04m0O11j32m18R12p76R0l96N79m37L50nj28k29L32
2868A11m44L63j83L76n44M10l60L10L42n27J55J86l79M11j04j58K00l62L21k08
2888h4K07o28Q03n06J79j10K1K97l20M45j30m39l9K96L62n14R0K87k98O17n30
$$ plain form
2909 6 -25 90 -114 -170 84 -357 -44 -183 -115 -39 -151 562 -17 -305 225 -309 -50 82 -110 247 -151 194
2931 194 -282 5 -204 -97 -127 96 -27 101 112 -213 203 121 -92 98 -110 276 39 634 408 505 14
2952 14 -94 -144 -210 -80 -200 -43 -381 -699 -145 -70 -163 15 -200 -196 328 -308 -52 -50 -124 313 -227 37 291
2975 291 -51 117 45 2 -105 -57 -251 96 71 -508 120 -424 88 -308 91 414 244 -74 -248 -339 -121 -245
2997 -245 223 -232 -83 -170 -156 -146 -38 -30 -219 -6 205 40 166 23 252 -115 -42 -334 -393 37 63 73 95
3020 95 117 317 -37 313 -349 157 -64 -268 -32 26 526 -328 -53 -193 344 -111 -218 -131 176 22 -67 113
3042 113 286 417 -120 -127 -286 -11 -57 30 51 -266 220 250 -345 -121 182 106 181 102 -103 237 281 -440 285
3065 285 48 40 217 414 7 -134 263 288 199 241 285 139 -37 38 -134 -171 110 -180 244 -249 -64 167 341
$$ packed form
2909Fl1J15k04n6K54m41L13j39O8P6j12P13n79k88N30n34K59J32j92L57l98L45
2931A94m76K87k09J07l0K23j23J28J1l25M16q2k13J90k08L86k37N95k26R7m91
2952A4j08n0o6J30j20J57l38l18N54P5r3J78k15MN24o36K56Kp4M37n40K64K54
2975B91l42J68p2m3j07M8j94L47k5n79O28n44N12l96L99L23j70l18j74r1K18j24
2997b45M68m55J49q7J4J0J08Qj89K13K11j65J26j43K29l67P3k92n9M30K6J0K2
3020I5K2K00l54L50o62N06k21k04K36N8N00q54K75j40N37m55j07Q7L07j54q9J80
3042A13J73J31n37pj59K75m6Q7K1l17M86L0n95K24L03p6P5p9k05L40M4p21P25
3065B85k37qJ77J97m07j41L97K5q9M2M4j46j76P5j72l7K81k90M24m93J85K31J74
$$ plain form
3088 341 159 135 -44 -147 -52 306 -358 -109 27 -580 -443 -186 284 -216 207 89 40 -244 152 260 178
3109 178 324 240 211 -452 -106 181 12 289 -254 -33 405 -152 141 -342 -208 -15 83 296 -297 -253 298
3130 298 -82 -225 -69 166 239 8 -320 217 -18 -130 256 75 -379 -491 -23 410 -117 258 -332 147
3150 147 76 47 41 405 -130 58 145 166 -106 -148 198 71 -303 -138 -160 29 -91 81 -532 -143 77 -402 -31
3173 -31 -132 328 -397 149 61 -226 122 106 -98 -12 -434 36 225 107 -184 -174 412 -56 -54 -98 255 20 243
3196 243 -189 -182 -212 -233 86 -61 -222 -58 307 444 -7 328 92 -212 75 548 -106 349 -224 14 -197
3217 -197 431 -265 114 -119 -3 -103 -309 -92 -62 568 -240 158 -33 -299 83 -170 152 469 -91 165
3237 165 -13 286 441 -246 -210 -183 -277 347 -109 -382 107 300 -108 -71 -333 -444 -253 -453 215 -2 -151
$$ packed form
3088C41j82k4j79j03R5L58o64K49J36o07J37K57M70n00M23j18m9k84L96J08q2
3109A78J46q4k9o63L46K87j69K77n43K21M38n57K93m83J34J93R8K13n93M4N51
3130B98l80j43J56K35P3k31l28N37k35j12L86j81m54j12M68M33n27L75n90M79
3150A47p1k9oL64n35J88Q7K1k72m2L46j27l74J65k2J89j20J72o13L89K20m79L71
3173c1j01M60p25N46q8k87L48j6k04Q6m22M70J89j18k91J0N86m68Km4L53k35K23
3196B43m32Pl0k1L19j47j61J64L65J37m51L35k36l04K87M73o54M55n73K38k11
3217a97O28o96L79k33J16j00k06K17L0O30q08L98j91k66L82k53L22L17n60K56
3237A65j78K99J55o87L6K7r4O24m56k73M89J93m08L7k62j11J91k00O68k17j49
$$ plain form
3258 -151 -413 -91 -41 171 -218 168 -335 -169 142 -403 -398 -122 -98 475 219 357 267 -32 -89 -313 -132 -224
3280 -224 216 -43 373 -58 -105 -25 280 -68 -301 65 -229 229 -88 -176 29 313 -403 -180 -243 -67 -49 434
3302 434 -363 -209 810 -167 -169 307 90 -331 313 -118 -253 133 -341 266 161 99 -236 169 -53 -191 383
3323 383 160 122 -144 -164 74 271 -44 117 156 13 560 -288 84 -60 -325 -452 -535 -607 85 55 447 107
3345 107 -463 -19 -101 -28 -158 -63 -124 -22 -13 48 49 -71 307 -55 -311 123 178 251 -225 454 15 458 -109 -322
3369 -322 37 121 -2 -105 -165 160 184 126 139 15 -57 -16 309 -242 -556 329 13 -91 -219 72 267 203 -46
3392 -46 -30 -65 -16 -52 -243 174 9 -62 -348 -159 -181 -587 348 230 22 183 -216 -278 23 132 -513 129 88
3415 88 -82 -98 156 -398 195 -273 227 -86 21 159 -384 23 -305 116 -586 40 -201 -77 -91 -46 207
$$ packed form
3258a51k62L22N0K12l89L86n03J66L11n45NK76K4N73k56J38r0k99n7k24J81r2
3280b24M40k59M16m31m7Q0L05l48k33L66k94M58l17q8K05K84p16K23o3J76J8M83
3302D34p97J54J019r77kM76k17m21O44m31j35L86m74O07j05o2l35M05k22j38N74
3323C83k23l8k66k0K38J97l15J61L9j43N47q48L72j44k65j27q3p2O92l0L92l40
3345A07n70M44q2P3j30R5o1J02RO1Jj20L78l62k56M34N5P3m76O79m39M43n67k13
3369c22L59Q4j23j03o0L25K4n8J3j24p2M1L25n51l14Q85l16j04j28K91J95o4k49
3392d6J6l5M9l6j91M17j65p1k86J89k2m06R35j18k08J61l99o2L01J09o45O42m1
3415H8j70j6K54n54N93m68N00l13J07J38n43M07l28M21p02O26k41J24j4M5K53
$$ plain form
3436 207 85 -36 383 397 122 38 -86 159 19 -195 -330 52 161 86 -13 -326 -168 62 -305 94 394
3457 394 -110 502 -106 260 412 -205 -140 -70 -276 273 273 231 220 346 -199 -567 291 -76 -43 84 -593 12
3479 12 239 -157 14 -241 153 -241 131 -90 -142 29 79 -55 45 91 92 200 -444 -344 -237 216 181 108 -183
3502 -183 -66 -40 -41 104 -428 47 -430 10 -161 -244 -59 539 188 -248 -121 145 -187 52 -201 154 -156
3523 -156 -82 20 639 -45 -95 123 -18 223 -221 -153 414 16 -299 206 -407 157 100 145 87 -121 -278 122
$$ packed form
3436B07j22j21M19J4k75q4j24K45j40k14j35L82J09p5r9l13J58K30l67L99L00
3457C94n04O12o08L66J52o17O5P0k06N49%m2j1J26n45l68Q58l67L3J27o77O05
3479A2K27l96J71k55L94l94L72k21n2J71N0j34J00M6JJ08o44J00J07M53l5p3k91
3502a83J17K6jJ45n32M75m77M40j71q3J85N98l51m36J27K66l32K39k53L55l10
3523a56P4J02O19o84n0K18j41K41m44O8N67l98l15N05o13N64n7M5n8k08j57M00
$$ [...]
8191E42
##END NTUPLES=NMR FID
##END=
