##TITLE=1H_SRM-1.oil
 CDCl3
 8 sc, 
 11.5.2023
##JCAMPDX= 6.0         $$ Bruker NMR JCAMP-DX V2.0
##DATA TYPE= NMR FID
##DATA CLASS= NTUPLES
##ORIGIN= UXNMR, Bruker Analytische Messtechnik GmbH
##OWNER= root
$$ XWIN-NMR		Version 3.5
$$ Thu May 11 13:51:14 2023 Russian Standard Time (UT+4h)  she@DPX200
##.OBSERVE FREQUENCY= 200.13135
##.OBSERVE NUCLEUS= ^1H
##.DELAY= (6, 6)
##.ACQUISITION MODE= SIMULTANEOUS
##.ACQUISITION SCHEME= undefined
##.AVERAGES= 8
##.DIGITISER RES= 18
##SPECTROMETER/DATA SYSTEM= spect
##.PULSE SEQUENCE= zg30
##.SOLVENT NAME= CDCl3
##.SHIFT REFERENCE= (INTERNAL, CDCl3, 0, 15.7039)
##AUDIT TRAIL= $$ (NUMBER, WHEN, WHO, WHERE, WHAT)
$$ ##TITLE= Audit trail, XWIN-NMR		Version 3.5
$$ ##JCAMPDX= 5.01
$$ ##ORIGIN= Bruker BioSpin GmbH
$$ ##OWNER= she
$$ F:/spectra/data/she/nmr/H-F/1/audita.txt
$$ ##AUDIT TRAIL=  $$ (NUMBER, WHEN, WHO, WHERE, WHAT)
(   1,<2023-05-11 13:50:10.85 +0400>,<she>,<DPX200>,
      <created by zg, POWCHK disabled, PULCHK disabled
       configuration hash MD5:
       00 E9 B6 7A A2 85 ED C7 34 08 36 98 17 FE 4E 26
       data hash MD5: 16K
       87 5A 5E D9 01 74 68 10 A2 8B 2E A2 27 08 DC 72>)
$$ ##END=
$$ 
$$ hash MD5
$$ B1 AE 06 3C 44 DC 5B 26 3C 9F 8C B2 21 FD E1 0B
##$RELAX= 
##$RELAX= 
##$RELAX= 
##$RELAX= 
##$RELAX= 
##$RELAX= 
$$ Bruker specific parameters
$$ --------------------------
##$DU= <F:/spectra>
##$EXPNO= 1
##$NAME= <H-F>
##$PROCNO= 1
##$TYPE= <nmr>
##$USER= <she>
##$AMP= (0..31)
100 100 100 100 100 100 100 100 100 100 100 100 100 100 100 100 100 100 
100 100 100 100 100 100 100 100 100 100 100 100 100 100 
##$AQSEQ= 0
##$AQ_mod= 1
##$AUNM= <au_zg>
##$AUTOPOS= <>
##$BF1= 200.13
##$BF2= 200.13
##$BF3= 200.13
##$BF4= 200.13
##$BF5= 200.13
##$BF6= 200.13
##$BF7= 200.13
##$BF8= 200.13
##$BYTORDA= 1
##$CFDGTYP= 0
##$CFRGTYP= 5
##$CHEMSTR= <none>
##$CNST= (0..31)
1 1 145 1 1 1 1 1 1 1 1 1 1 1 1 1 1 1 1 1 1 1 1 1 1 1 1 1 1 1 1 1 
##$CPDPRG= <>
##$CPDPRG1= <>
##$CPDPRG2= <>
##$CPDPRG3= <>
##$CPDPRG4= <mlev>
##$CPDPRG5= <mlev>
##$CPDPRG6= <mlev>
##$CPDPRG7= <mlev>
##$CPDPRG8= <mlev>
##$CPDPRGB= <>
##$CPDPRGT= <>
##$D= (0..31)
0 1.2 0 0 0 0 0 0 0 0.06 0 0.03 0 0 0 0 0.0002 0 0 0 0 0 0 0 0 0 0 0 0 
0 0 0 
##$DATE= 1683798610
##$DBL= (0..7)
120 120 120 120 120 120 120 120 
##$DBP= (0..7)
150 150 150 150 150 150 150 150 
##$DBP07= 0
##$DBPNAM0= <>
##$DBPNAM1= <>
##$DBPNAM2= <>
##$DBPNAM3= <>
##$DBPNAM4= <>
##$DBPNAM5= <>
##$DBPNAM6= <>
##$DBPNAM7= <>
##$DBPOAL= (0..7)
0.5 0.5 0.5 0.5 0.5 0.5 0.5 0.5 
##$DBPOFFS= (0..7)
0 0 0 0 0 0 0 0 
##$DE= 6
##$DECBNUC= <off>
##$DECIM= 32
##$DECNUC= <off>
##$DECSTAT= 4
##$DIGMOD= 1
##$DIGTYP= 9
##$DL= (0..7)
0 120 120 120 120 120 120 120 
##$DP= (0..7)
150 150 150 150 150 150 150 150 
##$DP07= 0
##$DPNAME0= <>
##$DPNAME1= <>
##$DPNAME2= <>
##$DPNAME3= <>
##$DPNAME4= <>
##$DPNAME5= <>
##$DPNAME6= <>
##$DPNAME7= <>
##$DPOAL= (0..7)
0.5 0.5 0.5 0.5 0.5 0.5 0.5 0.5 
##$DPOFFS= (0..7)
0 0 0 0 0 0 0 0 
##$DQDMODE= 0
##$DR= 18
##$DS= 0
##$DSLIST= <SSSSSSSSSSSSSSS>
$$ [...]
##$SUBNAM2= <"">
##$SUBNAM3= <"">
##$SUBNAM4= <"">
##$SUBNAM5= <"">
##$SUBNAM6= <"">
##$SUBNAM7= <"">
##$SUBNAM8= <"">
##$SUBNAM9= <"">
##$SW= 18.05172834244
##$SWIBOX= (0..15)
0 0 2 0 0 0 0 0 0 0 0 0 0 0 0 0 
##$SW_h= 3612.71676300578
##$TD= 16384
##$TD0= 1
##$TE= 0
##$TE2= 300
##$TE3= 300
##$TEG= 300
##$TL= (0..7)
0 120 120 120 120 120 120 120 
##$TP= (0..7)
150 150 150 150 150 150 150 150 
##$TP07= 0
##$TPNAME0= <>
##$TPNAME1= <>
##$TPNAME2= <>
##$TPNAME3= <>
##$TPNAME4= <>
##$TPNAME5= <>
##$TPNAME6= <>
##$TPNAME7= <>
##$TPOAL= (0..7)
0.5 0.5 0.5 0.5 0.5 0.5 0.5 0.5 
##$TPOFFS= (0..7)
0 0 0 0 0 0 0 0 
##$TUNHIN= 0
##$TUNHOUT= 0
##$TUNXOUT= 0
##$USERA1= <user>
##$USERA2= <user>
##$USERA3= <user>
##$USERA4= <user>
##$USERA5= <user>
##$V9= 5
##$VALIST= <valist>
##$VCLIST= <CCCCCCCCCCCCCCC>
##$VD= 0
##$VDLIST= <DDDDDDDDDDDDDDD>
##$VPLIST= <PPPPPPPPPPPPPPP>
##$VTLIST= <TTTTTTTTTTTTTTT>
##$WBST= 1024
##$WBSW= 4
##$XGAIN= (0..3)
0 0 0 0 
##$XL= 0
##$YL= 0
##$YMAX_a= 127144
##$YMIN_a= -163098
##$ZGOPTNS= <>
##$ZL1= 120
##$ZL2= 120
##$ZL3= 120
##$ZL4= 120
##$ABSF1= 10
##$ABSF2= 0
##$ABSG= 5
##$ABSL= 3
##$ALPHA= 0
##$AQORDER= 0
##$ASSFAC= 0
##$ASSFACI= 0
##$ASSFACX= 0
##$ASSWID= 0
##$AUNMP= <proc_1d>
##$AZFE= 0.1
##$AZFW= 0.1
##$BCFW= 1
##$BC_mod= 2
##$BYTORDP= 1
##$COROFFS= 0
##$CY= 11.3945322036743
##$DATMOD= 1
##$DC= 2
##$DFILT= <>
##$DTYPP= 0
##$F1P= 15.7292609196834
##$F2P= 12.9074282941183
##$FCOR= 0.5
##$FTSIZE= 0
##$FT_mod= 4
##$GAMMA= 1
##$GB= 0.15
##$INTBC= 1
##$INTSCL= 1
##$ISEN= 128
##$LB= 0.24
##$LEV0= 0
##$LPBIN= 0
##$MAXI= 10000
##$MC2= 0
##$MEAN= 0
##$ME_mod= 0
##$MI= 1.114404
##$NCOEF= 0
##$NC_proc= 0
##$NLEV= 6
##$NOISF1= 3.799351
##$NOISF2= 2.8
##$NSP= 1
##$NTH_PI= 0
##$NZP= 0
##$OFFSET= 15.70392
##$PC= 1
##$PHC0= -19821.61
##$PHC1= 7.4008
##$PH_mod= 1
##$PKNL= yes
##$PPARMOD= 0
##$PSCAL= 0
##$PSIGN= 0
##$REVERSE= no
##$SF= 200.130013532006
##$SI= 16384
##$SIGF1= 3
##$SIGF2= 2
##$SINO= 400
##$SIOLD= 16384
##$SREGLST= <1H.CDCl3>
##$SSB= 0
##$STSI= 0
##$STSR= 0
##$SW_p= 3612.71676300578
##$SYMM= 0
##$S_DEV= 0
##$TDeff= 0
##$TDoff= 0
##$TI= <>
##$TILT= no
##$TM1= 0
##$TM2= 0
##$TOPLEV= 0
##$USERP1= <user>
##$USERP2= <user>
##$USERP3= <user>
##$USERP4= <user>
##$USERP5= <user>
##$WDW= 1
##$XDIM= 8192
##$YMAX_p= 0
##$YMIN_p= 0
$$ End of Bruker specific parameters
$$ ---------------------------------
##NTUPLES= NMR FID
##VAR_NAME=  TIME,          FID/REAL,        FID/IMAG
##SYMBOL=    X,             R,               I
##VAR_TYPE=  INDEPENDENT,   DEPENDENT,       DEPENDENT
##VAR_FORM=  AFFN,          ASDF,            ASDF
##VAR_DIM=   8192,          8192,            8192
##UNITS=     SECONDS,       ARBITRARY UNITS, ARBITRARY UNITS
##FACTOR=    0.0002768,     1,               1
##FIRST=     0,             0,               0
##LAST=      2.2672688,     0,               0
##MIN=       0,             -163098,         0
##MAX=       2.2672688,     127144,          0
$$ Real data points
##PAGE= N=1
##DATA TABLE= (X++(R..R)), XYDATA
0 0 0 0 0 0 0 0 0 0 0 0 0 0 -8 8 -8 8 -16 16 -16 24 -25 32 -40 48 -56 64 -72 85 -97 112 -129 145 -167 188
34 188 -213 240 -270 302 -336 374 -419 463 -517 573 -631 697 -771 851 -937 1031 -1135 1252
52 1252 -1379 1523 -1683 1861 -2067 2300 -2574 2894 -3278 3747 -4337 5104 -6142 7643 -10008
67 -10008 14309 -24662 107150 45217 -71009 123149 22383 -70343 52478 62157 -62381
78 -62381 4303 14123 -77238 -39051 34148 -22060 -34859 -25618 -56599 -52102 -20351 -19073 12956
91 12956 19637 -4054 12279 11696 -19988 28981 58243 10374 20606 41622 -9013 11865 55460
104 55460 1729 3608 50744 -25895 -59173 13669 -21780 -62103 20429 -1394 -78840 -706
116 -706 27805 -58762 -10425 55073 -23985 -27345 42012 -2133 -20366 46893 27961 -10201 28547
129 28547 25952 -8649 8269 11200 -5700 3011 -6073 -14166 4192 -11734 -22798 8853 -3868
142 -3868 -30663 4428 5012 -28799 3733 18341 -21685 401 29723 -8189 -2355 32029 -598
155 -598 -8895 25727 1677 -15283 18400 1242 -25702 6429 3531 -25686 1853 12201 -18607
168 -18607 -5898 10747 -11204 -4987 11833 -4134 -1231 13924 1060 1190 16463 7139 2862
181 2862 9932 -1566 -2982 4792 -10698 -10867 5434 -9136 -16939 3124 -5198 -17026 2429 -1284
195 -1284 -18250 969 6495 -12333 2659 18335 1414 6391 21463 6327 5068 18863 5007
208 5007 -3079 10773 2790 -9189 3388 2206 -10500 -5050 -3924 -14235 -11618 -8920 -14242 -9540
222 -9540 -5228 -9390 -3838 3942 751 3243 8216 6433 7142 9236 5800 9623 13518 7317 6235
237 6235 11310 5148 631 2887 -2965 -7393 -3753 -8356 -14294 -7773 -6931 -12394 -8127 -4529 -8247
252 -8247 -5195 -1386 -4388 -782 5832 3025 3360 10473 9896 6071 9368 9933 6425 5484 5008 3376
268 3376 3259 1659 -841 -1188 -2152 -4725 -6518 -7126 -7620 -7476 -8107 -7974 -4034 -2623 -4287 -2055 1933
285 1933 1089 -202 2173 3961 2757 3305 4958 5029 5179 6162 5134 3511 3426 2981 624 -1093 -569 -758
303 -758 -1288 -2328 -1461 -542 -1584 -3053 -2509 -1356 -3127 -4229 -3186 -1791 -2193 -2061 -1273 -426 873
320 873 242 -712 744 1695 -123 -237 2297 2815 1899 2875 3377 3951 3353 2463 2166 2446 1726 59 -57
339 -57 345 194 -480 -1746 -2763 -2521 -3791 -5579 -5161 -4176 -4741 -4501 -2907 -1918 -568 635 352 1552
357 1552 3645 3037 2169 4651 5710 4363 4133 5377 5181 3514 2343 1268 860 -157 -2800 -3508 -2944
374 -2944 -4423 -5708 -5199 -4553 -5018 -5496 -4397 -3728 -2884 -2127 -1418 -650 1988 3228 2466 4456 6719 6088
392 6088 5062 6264 6029 4278 3739 2849 366 -305 -122 -2355 -4175 -2327 -2802 -5202 -5238 -3631 -4352
409 -4352 -5689 -4858 -3214 -3354 -2894 -1809 -239 2000 3140 2880 2921 5370 4772 2015 3575 5396 2557
426 2557 1570 3972 2951 686 1661 231 -2260 -1547 -2504 -5470 -3861 -2068 -4541 -4228 -788 -1029 -2103
443 -2103 -659 -626 -1660 -419 -38 -984 591 2355 2412 2007 2361 3543 3448 971 1192 2919 466 -1940
461 -1940 547 728 -522 1680 1166 -1549 -82 -104 -4703 -2404 1411 -2472 -4039 386 -1357 -4163
477 -4163 399 1505 -1498 -129 3 -3452 -1302 1643 256 672 3579 2219 505 1678 2974 3239
493 3239 3448 2656 1464 242 -394 642 237 44 2019 -208 -5167 -3119 -777 -4583 -3730 298 -3597
510 -3597 -6064 -2171 -2802 -3951 2280 2386 -2524 1606 4120 -2101 1094 8414 4116 1263 5970 3839
526 3839 140 4409 4463 1022 2625 1743 -4026 -3684 -1373 -3584 -4383 -2573 -3603 -5279 -4404 -3725 -2800
543 -2800 -2071 -1201 -1095 -2090 -1174 1442 1767 2066 5766 5992 2901 4713 5730 2028 2522 4473 666
560 666 171 2918 -981 -2645 1891 -747 -5543 -2177 -1608 -7359 -5500 -2383 -4772 -3854 406 -1773
576 -1773 -1236 2949 571 -1018 3527 3377 569 2740 3886 2174 3699 4487 3252 3567 3105 591
592 591 -427 -585 -1507 -1688 -2236 -2835 -1714 -2413 -3960 -2580 -1484 -2984 -2892 -1803 -2970 -1900 72
609 72 -696 1103 3961 1818 388 3736 3444 1363 2871 3336 1645 1646 2182 579 2109 2347 -492 -752
627 -752 -348 -2380 -3088 -1634 -2119 -2808 -2161 -2753 -2307 -880 -1606 -1500 -37 -1032 -1499 171 269 747 2723
646 2723 2308 810 2990 2812 818 2227 2943 1109 699 878 -747 -5 1872 -107 -1256 755 -672
663 -672 -3445 -1779 -774 -2335 -2132 -1787 -2416 -1562 -678 -1102 -62 940 -54 -805 417 1200 978 1284
681 1284 2250 2731 2003 1516 2157 2136 1276 1091 642 -404 89 -45 -1297 -722 351 -1246 -2812 -1537
699 -1537 -2198 -2962 -1836 -2185 -2776 -1127 -563 -2027 -307 2009 551 -122 1756 2183 1060 2051 2768
716 2768 2383 3156 2526 1638 2327 2191 342 -228 88 -856 -2198 -1707 -1625 -2371 -2549 -2825 -2621 -2599 -2370 -2552
736 -2552 -2011 -1427 -1050 -489 -61 1121 2050 2010 2340 2961 2811 3018 3086 2394 2219 2535 1424 922 1652 1165
756 1165 -826 -1199 -860 -2076 -3117 -3249 -2782 -2847 -2857 -2965 -2223 -993 -1089 -1249 -651 297 325 391 1026 2069
776 2069 2582 2214 2668 3341 2982 2239 1858 1445 888 2 -244 -467 -329 -658 -1258 -1479 -1472 -1995 -2528 -2757 -2537
797 -2537 -2134 -2408 -1830 -1195 -308 472 643 1031 1381 1559 1146 1035 1896 1901 1290 1635 1983 2401 1432 781 1002
818 1002 218 -653 -1848 -1292 -1254 -1584 -2017 -1015 -820 -1072 -1734 -1325 -963 -1372 -1784 -1423 -497 153 429 1034
838 1034 1632 2078 1812 1260 1495 1547 1203 788 867 1270 1126 1154 516 841 611 -533 -1306 -1364 -1246 -1913 -2310
859 -2310 -1571 -770 -977 -1298 -1157 -452 -767 -1466 -1058 -362 -313 -272 499 1616 1612 1709 1862 2064 2235 1138 636
880 636 867 1058 521 99 559 321 104 -354 -691 -1217 -1710 -2079 -2164 -2136 -1881 -1845 -1385 -716 -225 -559 -137
901 -137 64 305 372 483 640 1419 1990 1721 1604 2075 2666 1781 973 1112 898 -88 -437 -663 -755 -1379 -1737
922 -1737 -1981 -1574 -1240 -1757 -2210 -1616 -1592 -2036 -1599 -356 -123 225 959 1212 1329 1856 2007 1757 2093 1975
942 1975 1410 1003 1459 1487 1167 1166 655 50 -591 -1225 -1592 -1788 -1766 -2732 -2787 -1849 -1788 -2139 -1135 1 137
963 137 -1081 -677 -257 378 632 1384 1799 2292 2335 1930 2259 2681 1916 1033 671 574 52 -481 -233 -39 -214
984 -214 -664 -1224 -2082 -2169 -2036 -1891 -1919 -1762 -1261 -1332 -931 6 660 607 562 767 869 787 1371 1637 1469 1974
1006 1974 1358 1224 1537 1338 -154 76 696 -188 -1410 -908 -462 -1437 -1396 -915 -1340 -1185 -993 -1663 -1519
1025 -1519 -502 -135 -1507 -223 958 155 405 1594 1490 709 1580 1593 928 1214 1896 417 227 1178
1043 1178 637 -394 359 693 -681 -980 -428 -1509 -1442 -1046 -1198 -1298 -1013 -837 -1672 -957 361 -522 -552
1062 -552 832 920 -301 397 1344 1130 1345 2020 1261 1238 1940 1144 141 1228 1596 -702 -570 -191 -853
1081 -853 -1721 -433 -474 -1508 -1297 -1265 -2081 -1840 -262 -587 -1173 -154 74 -397 -64 1223 1348 1256 1803
1100 1803 877 840 1315 1313 1168 1375 1836 423 -229 436 528 -304 -550 -91 -1518 -2199 -1831 -1190 -1430 -972
1120 -972 -701 -1271 -989 -772 -1187 -475 672 1025 -107 563 1216 1082 1190 2068 1868 1269 1046 686 -172
1139 -172 491 941 129 -240 -32 -318 -1500 -1255 -447 -1191 -1113 -1391 -1843 -1566 -937 -938 -735 46 458 -169 31
1160 31 857 792 597 1002 1334 1013 1294 1488 1201 1192 1204 614 529 543 -110 -968 -583 -381 -1133 -1072 -1051 -1253 -1400
1183 -1400 -1393 -1538 -849 -783 -783 -794 -289 59 -147 396 652 1257 999 1279 1153 1137 1374 1683 1061 1225 1016 605
1205 605 263 106 182 50 -678 -912 -849 -1138 -1781 -1527 -1136 -1025 -1323 -1025 -763 -313 -452 -161 202 396 218
1226 218 422 1037 1072 1202 1331 1355 1567 1347 869 742 751 609 62 -3 -250 -348 -841 -913 -1239 -834 -1295 -1517
1248 -1517 -1337 -934 -852 -858 -503 -257 -137 241 251 509 1216 992 509 1340 1372 1212 1089 861 1108 674 250
1269 250 162 306 -175 -650 -531 -834 -788 -1216 -1153 -1049 -1162 -943 -1119 -880 -549 -338 -209 154 548 508 557 808
1291 808 963 1155 1004 1063 1247 1142 1032 558 932 802 339 77 -438 -307 -262 -959 -907 -772 -878 -808 -1106
1312 -1106 -979 -641 -748 -1005 -650 -222 46 -169 376 926 674 718 1155 1076 909 882 537 500 656 642 452
1333 452 408 513 -47 -324 -236 -518 -717 -1109 -967 -813 -722 -878 -767 -691 -328 -541 -761 -400 -74 26 59 509
1355 509 825 834 834 877 1261 1088 783 544 679 382 410 -13 153 189 -520 -585 -454 -471 -521 -1207 -1363 -1177 -1023
1378 -1023 -962 -788 -209 -137 -323 72 102 175 132 216 546 778 817 821 1243 1543 1152 956 766 517 539 161 -571
1401 -571 -90 -486 -618 -681 -962 -687 -966 -1120 -1255 -1265 -758 -1087 -859 -330 -143 92 474 741 769 758 1025
1422 1025 990 890 879 509 850 1064 886 686 693 516 233 -402 -393 -541 -985 -926 -900 -1056 -926 -925 -897 -1152 -514
1445 -514 -331 -587 -423 111 84 21 445 892 895 1167 1143 860 1177 1036 589 376 740 -83 -467 55 102 -619
1467 -619 -644 -377 -612 -987 -1003 -1157 -990 -741 -470 -639 -394 115 -225 198 622 730 186 357 771 420 528
1488 528 731 781 653 938 657 -18 564 506 -341 -470 -165 -550 -667 -446 -517 -926 -460 -475 -901 -809 -293 -657
1510 -657 -719 -80 71 -154 581 897 658 442 488 541 718 920 805 580 600 242 429 327 341 522 -287 -548
1532 -548 -635 -956 -860 -478 -691 -782 -598 -982 -937 -599 -166 -223 -20 -104 -97 -24 112 1010 1042 896 1004 942 363 624
1556 624 659 542 975 514 -4 -87 -225 -32 -577 -441 -638 -980 -1228 -1041 -761 -348 -453 -203 -512 -566 -228
1577 -228 -370 71 428 644 597 650 778 712 747 1033 886 688 523 153 -24 262 401 -8 -394 -362 -751 -1069
1599 -1069 -913 -629 -767 -687 -735 -706 -548 -296 -283 112 277 244 32 382 768 579 524 1041 1094 751 659 378
1621 378 386 750 278 103 -61 -74 -257 -534 -727 -530 -624 -809 -496 -886 -834 -793 -674 -333 -273 40 73 31 254
1644 254 327 297 455 705 611 373 537 763 225 664 514 150 136 241 -397 -198 -41 -373 -459 -534 -363 -752
1666 -752 -615 -492 -449 -337 -333 -451 -517 -195 -213 -142 198 739 191 548 607 771 494 796 774 344 326 301 77
1689 77 -122 29 -119 -508 -190 -170 -434 -524 -386 -548 -647 -363 -859 -120 -181 -240 2 79 325 220 162 663 482
1712 482 423 589 876 528 552 506 471 487 434 -190 -234 -173 -221 -654 -659 -194 -494 -727 -801 -563 -685 -547 -281 -289 -262
1737 -262 103 195 47 371 591 508 488 850 502 382 674 383 265 669 288 342 401 343 -453 -322 -204 -669
1759 -669 -702 -735 -627 -459 -720 -293 -283 -269 -276 -206 -223 164 -118 34 353 382 525 548 434 385 643 448 223 289
1783 289 256 86 288 123 -139 26 -132 -595 -603 -567 -681 -426 -701 -554 -644 -586 -194 -152 -411 -416 35 287 -121
1806 -121 329 492 630 759 730 526 476 385 257 261 624 422 -78 -274 13 -143 -492 -405 -429 -467 -522 -638 -627
1829 -627 -476 -448 -226 -121 -48 41 -185 253 350 277 616 475 939 631 543 694 275 553 477 24 100 235 67
1852 67 -188 -32 45 -402 -678 -570 -675 -407 -633 -652 -496 -171 -365 -205 -135 309 -1 29 82 342 541 193
1874 193 620 727 676 492 226 54 170 -34 49 -314 41 -294 -285 -518 -146 -770 -441 -253 -173 -457 -403 -531
1896 -531 -203 -216 -142 -317 -168 306 142 149 328 284 473 349 592 548 614 139 180 347 359 62 8 -133 7
1919 7 -359 -307 -446 -593 -187 -278 -274 -349 -61 -211 -335 -37 -72 -15 77 419 252 24 239 353 586 430 353 244
1943 244 173 371 -28 10 125 165 -356 -43 -246 -122 -408 -358 -456 -265 -390 -386 -785 -218 -310 -160 39 83 183
1966 183 121 272 408 426 366 604 284 352 451 335 352 488 466 13 -82 393 -179 -363 -524 -315 -559 -422 -230
1989 -230 -353 -339 -380 -314 -634 -285 20 -196 125 247 270 334 613 433 532 337 439 422 469 403 221 315 153
2012 153 -249 -206 -192 -180 -361 -579 -168 -467 -426 -578 -370 -210 -281 155 43 -137 281 84 133 284 281 297 352
2035 352 516 617 244 105 206 129 120 127 -200 -137 -83 -28 -208 -506 -215 -400 -589 -89 -323 -231 -82 -157 -34
2058 -34 -89 134 -227 331 257 -114 346 321 187 185 180 396 200 496 283 200 44 -81 -33 -85 -249 64 -259 -239
2082 -239 -369 -361 -123 -294 -437 -528 -280 -321 -121 -333 243 38 -207 -57 222 59 204 261 354 136 347 563
2104 563 128 313 329 205 144 158 12 -314 -284 -288 -543 -276 -367 -440 -480 -504 -437 -621 -562 -178 12 -128 152 -81
2128 -81 150 123 376 85 344 640 275 336 298 333 251 136 61 146 149 52 -424 -76 -449 -402 -717 -376 -485 -415
2152 -415 -530 -403 -93 -167 -67 -116 -26 232 354 281 623 607 775 492 390 46 174 357 59 138 -134 -9
2174 -9 -99 -216 -337 -569 -534 -336 -431 -385 -310 -135 -478 -322 -182 11 -76 99 66 164 449 550 423 339 581 208
2198 208 384 334 100 191 58 269 -250 -184 -262 -331 -233 -259 -361 -435 -53 -155 -11 -291 -90 -205 -18 -21 -4 149
2222 149 195 125 160 257 289 213 205 246 175 128 111 -18 222 237 144 -133 -19 35 22 -55 -323 -74 -309 2 -164 -36
2248 -36 -275 29 -247 -161 -10 -170 -238 27 186 33 103 288 199 469 236 488 321 262 -35 -154 470 277
2270 277 93 83 316 53 -334 -107 -246 -287 -427 -158 -467 -279 -255 -346 -89 -30 -76 -131 41 52 56 125 444 417
2294 417 476 656 271 444 247 227 92 189 83 -20 -300 -397 -392 -284 -378 -282 -362 -464 -349 -415 -410 -260 -173 -241 64
2319 64 39 77 154 375 311 350 280 412 275 232 423 327 225 -38 -32 310 116 -36 45 -284 -384 -486 -159 -214
2343 -214 -57 -415 -206 -143 -185 -73 85 100 -23 345 274 49 164 0 114 466 297 264 329 124 175 -96
2365 -96 -100 161 -190 -233 -203 -246 -171 -14 -62 -166 -151 -289 -232 166 -58 146 -13 -35 -224 -19 -6 110 46 -17 329
2390 329 -88 -56 280 -88 181 272 111 16 -355 -183 65 -169 -168 -120 -183 70 -108 -64 -58 -160 162 -249 -71
2413 -71 202 165 -175 34 159 -50 412 482 249 152 -4 385 320 296 116 134 224 280 73 223 -51 204 48
2436 48 -187 -208 12 -53 -664 -149 -221 30 -297 -203 -291 123 -131 -169 204 235 162 -61 136 141 83 150 111 156 67
2461 67 39 178 84 89 7 -307 -175 -386 -229 -265 -301 -219 -275 -207 -1 -165 -235 20 -28 123 3 79 -163 467 252
2486 252 125 168 162 444 73 -37 -91 306 189 -30 46 -120 70 127 -294 -116 -297 -404 -310 -51 -429 56
2508 56 -141 -52 -55 -70 -36 158 94 293 279 161 368 103 51 321 456 141 288 37 2 -25 125 27 -229 -40
2532 -40 68 -52 -110 -146 -175 -353 12 -50 -60 -62 -182 75 -8 -47 90 -64 97 285 228 -51 160 212 -19 319
2556 319 79 -156 -207 111 -119 -98 127 -10 -69 117 -5 8 -238 92 -97 -246 -79 48 -359 -200 443
2577 443 -109 40 332 256 -133 333 119 250 461 206 105 -38 211 95 203 219 244 -82 2 91 -186 -244
2599 -244 -226 28 -165 75 -104 -334 15 -204 -38 73 -233 -3 -27 173 -58 -221 136 114 355 279 127
2620 127 -37 -37 128 124 -142 113 -34 14 13 -129 -207 -433 -280 -154 -203 7 -137 -252 -23 -7 142 -24 335
2643 335 106 517 -212 22 141 135 172 227 105 -33 328 4 189 -2 -151 58 -287 8 -166 -288 -39
2664 -39 -76 -369 -66 -194 -206 -186 28 -233 55 188 191 286 169 171 92 377 -22 263 -62 -117 67 99 70 -242
2688 -242 -160 -162 -69 58 -224 -190 -3 -240 -113 33 160 50 -126 -399 -47 10 167 8 147 3 153 61
2710 61 -41 188 112 -17 193 -160 27 130 -39 -259 -18 -116 -1 -360 -247 -122 -324 -39 -14 -167 -480
2731 -480 -379 45 9 105 18 37 231 -125 260 122 220 171 -25 -26 172 32 -54 73 239 84 45 33 -31 36
2755 36 51 -7 -278 174 26 -193 -3 52 -329 -230 -8 -187 142 -90 -103 -127 -41 13 -181 60 -168 167 174 159
2779 159 179 147 55 175 -91 138 118 15 37 -180 -95 -230 -22 -117 193 12 -24 -214 -219 -126 -276 -121 21 -91
2803 -91 204 -37 192 7 254 178 -130 340 26 -86 231 41 32 164 158 -307 -65 110 148 -262 102 -289
2825 -289 -107 -66 -34 142 -420 176 240 90 8 67 79 152 279 89 -153 -34 229 -24 340 137 -39 -146
2847 -146 122 -50 167 -12 -4 -62 213 21 -199 -83 -169 -245 -213 -115 -181 -228 -18 3 -65 55 -77 4 -43 -40 310
2872 310 52 130 86 239 75 162 123 -156 144 31 -43 114 39 -11 -10 -4 -29 -151 134 -170 229 93 133 120 -76
2897 -76 131 62 58 -118 12 82 10 165 -216 2 -38 157 334 151 -78 -41 -231 -108 -124 -332 15 38 -11 -225
2921 -225 17 -334 -25 -36 87 -196 -322 -12 -128 -115 193 2 123 196 -128 -111 155 56 24 122 -109 -410
2943 -410 430 128 144 100 -63 -118 -52 85 46 120 -113 -144 -266 -128 55 -59 145 18 -40 122 289 25 118
2966 118 79 95 113 51 205 49 188 44 -47 257 -48 336 89 77 -329 -87 62 -55 -124 -146 -291 -250 -130
2989 -130 -75 183 -71 25 140 63 -29 63 178 -41 50 364 -144 -62 16 -63 126 28 18 55 -32 135 100 -44 -47
3014 -47 -363 -12 -77 -67 25 -44 -2 -55 -12 63 -154 -125 68 213 -163 -205 179 119 -40 147 -201 93 51 117 219
3039 219 -100 44 54 -15 -84 -80 -145 210 54 8 -119 -204 -17 -44 -29 -32 91 165 -104 182 58 -148 -47 -63 -30
3064 -30 134 -2 -42 63 19 82 14 -64 44 120 -104 -39 102 -153 7 -269 -51 -329 -160 26 -16 -179 -93
3087 -93 48 -60 45 -98 9 -14 95 -27 52 190 191 155 214 96 93 -226 162 110 -162 -164 -51 -134 -116 9 -81
3112 -81 161 -196 -206 -85 -85 -18 -487 -128 296 77 40 84 4 48 109 -48 116 205 -151 -153 35 -122 -11 19 -106
3137 -106 36 7 71 33 4 -153 -139 157 9 117 -22 19 -89 -110 75 152 56 28 224 24 37 289 115 193
3161 193 88 129 94 63 88 -31 -120 151 -44 279 131 -132 -87 -216 -126 54 -14 82 143 228 -25 -308 -148 -50
3185 -50 293 47 -19 171 -3 163 -137 -225 200 107 -1 80 -141 85 -25 102 63 -133 -93 -110 17 32 -202
3208 -202 -174 44 82 -147 -150 70 -49 162 -2 154 -178 -68 -67 -29 307 190 8 -110 189 -203 236 -35
3230 -35 -76 -120 -49 -99 -33 155 15 -29 41 -186 -9 -331 98 -203 -217 -212 93 -57 65 -205 -192 174 -182 -44
3254 -44 -11 140 41 180 -140 204 -133 254 -2 120 -89 -97 -96 -77 -42 66 -253 16 28 -25 90 50 122 97 170
3279 170 21 24 -10 -234 43 124 123 73 -101 96 172 233 210 51 -234 110 -159 128 -266 37 34 116 -82 -326
3303 -326 -108 -185 -166 -45 -275 -174 -77 -182 -33 70 -24 -395 -49 -97 91 -61 -77 -105 15 -169 -41 -62 215
3326 215 18 50 286 -99 -73 31 -90 26 220 -173 -221 72 135 -1 -107 -331 -2 75 165 45 29 117 -16
3349 -16 164 238 31 177 -144 39 21 65 211 180 4 -111 -34 -65 119 -126 -51 -77 -49 -126 111 -347 -54 71
3373 71 11 151 -130 -114 22 -236 44 64 212 -148 13 -31 -106 303 58 150 128 76 362 103 14 133 38 -191
3397 -191 53 -66 -67 62 97 -67 -127 -195 -59 -131 -164 -47 -30 -151 60 -12 153 69 -46 141 -22 120 74 -56
3421 -56 -216 28 167 -53 30 64 241 4 -21 -119 191 67 203 -71 -246 -168 197 -53 -127 185 -12 -66 119
3444 119 65 -6 43 319 -179 233 64 -32 122 -94 61 274 -48 -81 63 88 -113 40 -66 1 -80 -65 -55
3467 -55 -97 150 -59 -122 82 -71 56 166 250 124 -21 223 -102 86 -162 214 -107 56 11 224 267 -65
3489 -65 -47 -85 11 -13 -22 -165 -120 -207 -40 -123 194 -98 -54 26 -54 -12 7 -126 -64 -198 4 31 43 -36 -2 -48 49
3516 49 206 358 -205 191 79 226 -352 -131 -188 -64 -149 -50 70 -33 114 8 168 -108 2 -50 186 -136
3538 -136 36 59 133 221 235 -64 -20 103 34 111 -3 50 23 104 -82 -105 230 -35 -60 123 -4 -54 -68 -11 -61
3563 -61 -315 188 -26 -14 24 -354 53 162 40 67 233 132 1 274 205 -152 -12 78 70 -66 -167 -151 4
3586 4 73 -313 -81 -67 -46 211 97 -183 -114 -298 -6 139 100 -77 16 -131 225 156 356 171 -89 79 -4
3609 -4 -26 99 51 246 2 45 -125 -118 202 -144 -275 -74 -136 -95 -21 47 19 -285 72 -81 -198 75 39 -152
3633 -152 177 45 72 122 57 15 135 329 47 -44 -108 -202 -194 -77 -80 66 64 -178 106 -4 -2 -90 -127 108 357 101
3659 101 -157 42 -178 37 -82 21 -36 -62 72 -105 -189 -345 -36 89 448 45 -134 -77 -106 -173 -162 -14
3681 -14 105 -143 268 120 -7 -59 -308 18 24 345 -189 -126 -33 21 196 -153 -48 35 -181 33 -35 55 198
3704 198 -3 187 -32 -140 108 -176 81 -190 -143 -78 -145 22 -97 -203 -107 -1 -2 285 -193 59 -77 166
3726 166 -40 -33 -249 29 45 102 175 41 -21 -110 49 -31 181 254 -68 -200 -23 249 -28 -222 -63 227 -8
3749 -8 29 -163 -256 -36 61 -151 -78 33 -105 -30 -193 363 -250 113 -58 284 -174 -17 63 271 197 69 -148
3772 -148 113 -167 -137 276 23 37 -63 8 297 -144 -124 -248 -181 82 123 -69 43 -144 165 60 -88 -42
3794 -42 62 27 117 152 -160 -27 366 -207 256 -4 157 61 -321 36 154 80 57 -107 39 -144 -321 12
3816 12 -26 -1 -159 -116 -190 -94 118 -36 70 97 154 157 15 -103 13 244 -69 118 126 304 122 247 229 87
3840 87 98 -45 -66 -287 -72 35 -150 -179 -111 -23 -237 -338 -125 -11 -165 -3 14 -66 -223 129 -60 54 183
3863 183 -126 350 153 236 -9 -28 -111 -129 104 226 -67 -40 -161 -237 92 68 -28 -161 -145 -43 -41 132 71 26
3887 26 67 172 18 26 189 67 -73 9 219 61 142 165 -112 45 -69 -16 165 -185 -158 -16 -133 -51 -140 17
3911 17 -154 -240 48 -157 -361 -335 -56 -18 82 109 251 211 218 32 -15 246 224 199 17 -13 40 8 184 -248 117
3936 117 44 -120 -213 -70 163 165 -18 -197 78 -194 56 -59 -102 -43 76 -151 106 63 -170 -43 156 127 -179
3959 -179 154 255 93 412 -113 176 -49 98 49 47 -290 45 54 124 -170 101 -44 -95 41 28 70 -97 -123
3982 -123 -188 -29 -216 165 -177 -180 89 382 120 53 114 -21 104 -133 89 33 -52 215 -34 98 -56 -93 -379
4005 -379 107 46 -205 115 58 94 -152 -180 -132 -13 225 214 320 89 70 256 240 208 12 47 45 -4 221 193 11
4030 11 4 133 109 113 74 20 -133 162 -159 -239 -122 -232 -56 -158 -38 -83 89 121 -1 -177 -221 173 109 194 117
4055 117 124 183 148 114 7 -56 189 48 50 48 345 -36 -71 231 -24 -130 -82 153 78 -150 -76 -94 172 46 -78
4080 -78 -134 -90 30 -211 102 -93 -29 287 83 -65 156 90 185 -62 -150 -47 216 -39 -9 -249 126 -62 -287
4103 -287 -24 -67 186 -165 -536 86 84 -252 -112 -65 -329 51 9 -30 134 259 65 24 104 -16 269 -59 64
4126 64 -12 -38 -167 117 -11 -118 -18 -134 -153 -158 -60 -251 -91 73 -74 52 -33 -212 -203 -242 152 94 -41 184
4150 184 27 150 40 202 195 129 102 167 7 24 -194 86 -82 -81 89 -51 -12 19 74 78 -58 -275 69 65 56 -167
4176 -167 37 27 163 117 89 -74 104 50 99 -37 136 -159 -79 185 -19 112 -94 107 -88 -152 108 -184
4198 -184 -16 -184 81 80 -129 -186 157 -95 -168 -11 7 -186 -32 -59 217 -45 -36 263 226 94 49 320 1
4221 1 -2 228 -47 -53 -122 124 53 58 -14 -146 91 -213 -21 -158 -146 -111 223 -47 -261 141 -52 -147 -170 -91 -124 45
4247 45 274 27 121 37 218 174 253 -90 38 -83 -85 59 -288 -214 38 -20 162 -77 1 -158 71 -176 -359
4270 -359 -332 -58 44 3 119 129 43 -5 81 -36 192 181 94 -20 246 54 86 97 86 1 144 -38 -180 -66
4294 -66 22 -187 -102 -167 -387 -111 -196 -89 -177 24 -229 59 -46 -59 181 -7 174 -56 5 -55 -8 59 -70 -102
4318 -102 58 116 -106 61 -54 -104 -27 -19 117 175 -156 -308 17 -7 -50 -105 -123 -90 69 193 -21 117 -22 204
4342 204 -81 -5 30 -60 -42 15 183 24 293 14 147 89 -231 -153 87 122 -132 -155 -140 -42 -181 -36 -118 105
4366 105 -278 -45 -56 54 -276 30 -126 -235 147 -127 176 -86 33 285 -133 -252 -95 126 33 -61 -76
4387 -76 -7 1 75 116 -21 -341 -47 -303 -24 -254 -102 -27 -255 34 -208 -20 182 68 -2 -140 -32 110 -95
4410 -95 135 -1 69 316 -44 38 11 154 -186 -36 185 19 55 -151 210 -209 -256 -14 -111 -128 17 53 -55
4433 -55 34 108 -68 103 152 47 57 0 84 155 165 -65 248 219 -67 217 -192 -92 -14 3 72 210 -51 -14 89
4458 89 -257 -107 -134 -164 -21 157 -6 -69 -8 72 -98 61 34 104 -84 -34 220 -107 73 -30 -118 38 147
4481 147 15 96 -311 -205 352 -8 188 -83 -126 -229 123 -44 66 -59 -350 117 -164 -285 54 -112 -5
4502 -5 -126 105 -28 149 120 116 42 237 -14 52 146 -172 -118 -154 68 54 85 -54 -87 -213 -203 207 -165 46 -130
4527 -130 -50 -273 -95 52 -96 -98 26 114 33 138 -63 428 277 281 -48 58 189 -113 87 -26 52 -97 -81
4550 -81 -187 -2 165 207 23 -52 -139 153 -187 13 133 2 -108 -24 195 -105 54 22 -107 299 235 -40
4572 -40 30 -9 -129 -12 236 89 152 44 69 -222 -30 -188 -397 -129 -11 -79 -231 -129 -52 -192 -224 23 -142
4595 -142 -91 234 -92 40 -164 52 -22 -85 97 180 -82 166 170 -142 166 -80 201 -8 -163 -178 -232 36 -89
4618 -89 64 -153 152 -42 -95 -73 178 -84 -92 154 46 -26 -15 123 -17 112 -80 3 121 240 133 91 -36
4641 -36 -103 70 -41 -225 -94 -13 -19 -74 -264 88 -93 -57 135 -70 38 279 -45 -196 -103 90 65 81 -109
4664 -109 1 176 93 187 173 213 -37 125 11 175 -106 168 1 -3 23 -26 -203 -33 -227 84 -188 -37 86
4687 86 -203 109 -75 71 -14 -73 13 101 15 295 -178 185 115 186 307 26 54 29 -106 166 -73 -51 -78 245
4711 245 62 39 -142 -161 -124 -233 9 -101 -75 157 136 2 91 310 232 -27 170 46 247 217 244 7 21
4734 21 164 67 380 68 -33 -33 -215 177 2 5 -78 0 154 -175 -118 -66 -47 24 -180 -64 -138 44 -93 -40 59
4759 59 141 31 173 -99 111 56 85 -227 -123 -36 -45 174 57 82 -93 -103 -55 -75 214 61 -280 41 -141 -75
4783 -75 -44 58 -203 105 -12 -208 135 12 37 61 40 -127 266 232 -14 -7 131 -238 132 50 46 -92 -123 33
4807 33 119 14 -140 -61 159 94 -185 -68 -71 -121 63 -11 -26 -208 148 -20 -40 -194 -13 -89 158 -29 42 118
4831 118 122 168 -131 102 65 21 20 -154 -47 -101 -298 -154 -76 -202 7 -121 -69 -9 -66 -87 114 -185 9 -90 190
4856 190 228 116 -10 41 232 -136 -46 197 70 263 -1 17 -61 1 34 -309 -93 21 -144 -96 103 -59 -282
4879 -282 -263 -62 -42 -147 139 -95 207 -213 -11 -147 -151 130 310 116 37 132 183 -180 -183 80 42 104 -275 -45
4903 -45 18 -238 50 -61 -134 -98 -134 -5 -99 3 -6 -74 -12 161 -66 -62 214 133 -173 93 -79 43 -16 -37 101
4928 101 74 -44 86 317 138 -89 -305 5 -32 71 114 21 -141 -131 -141 -189 -40 -148 -144 -199 33 -392 114
4951 114 -13 10 37 -119 31 75 30 -45 66 24 -31 -170 -84 -146 150 1 94 -86 -12 84 -39 -132 -4 -57 -108
4976 -108 125 -129 -62 -148 -5 301 60 86 88 14 83 139 57 204 218 496 155 -82 -34 -203 233 21 -34 -38 -131
5001 -131 18 -101 -165 5 -128 -53 179 26 -94 200 -82 53 48 -25 280 56 90 -131 179 40 -87 -2
5023 -2 -96 356 0 227 178 -92 -96 88 75 -25 19 -14 -205 196 12 -4 -259 99 -128 121 -14 -105 186 61
5047 61 -287 -33 62 102 -75 128 -85 48 -166 13 26 5 -121 -24 173 86 -90 -139 8 -135 -118 41 -2
5070 -2 -57 65 -11 -226 -370 7 21 -51 1 99 114 73 160 -87 26 61 115 -19 132 202 -142 247 -181 210 -118
5095 -118 -106 81 39 -69 -297 -138 77 -34 -118 -20 191 -40 3 -169 84 147 30 136 -24 194 59 -122
5117 -122 45 15 140 60 99 124 101 -50 125 67 124 198 342 149 63 -307 -298 -103 -199 21 -254 -139 -44 -127 -248
5142 -248 -38 -116 295 -98 -49 -2 59 4 -122 224 203 124 108 124 -84 154 -218 -180 90 59 100 -245 116 -105
5166 -105 -151 163 280 -12 -82 -28 71 -126 -289 21 5 97 139 64 70 -87 -164 216 -57 4 216 -40 252 259 235
5191 235 100 214 -21 -31 -8 -184 -78 -135 48 53 -192 129 -202 81 162 77 264 156 328 62 169 55
5213 55 35 243 32 -30 -24 192 -30 116 20 -221 149 -107 -84 -152 -82 -101 -79 16 -171 -94 116 -136 -1 -24 5
5238 5 -283 -59 188 52 50 21 97 -58 -96 -107 -117 70 -187 39 234 130 22 74 46 81 118 -44 62 23 125
5263 125 -295 -311 -159 41 63 -108 126 169 -47 -124 210 138 171 -39 0 66 53 227 -70 0 32 46 129 -89
5287 -89 -160 -2 -315 -49 -270 72 -133 -320 -27 123 75 45 -59 17 186 30 -125 38 9 31 -45 -19 74
5310 74 22 35 -104 -16 257 189 -221 46 123 9 -114 112 136 136 -31 26 41 0 -96 -87 -194 -335 153 180 -84
5335 -84 100 232 -45 173 -16 100 202 296 -133 81 -1 -219 146 80 117 -7 -317 -131 199 -15 -226 94
5357 94 -191 81 -49 174 -95 -97 23 33 -23 10 -32 233 153 0 -169 15 148 64 -11 -15 155 68 39 100 120
5382 120 132 209 76 47 51 75 142 -85 -21 136 -150 -329 -54 -392 -239 -266 -68 -233 -27 -89 -124 -164 -82 -210
5406 -210 6 6 80 217 -42 79 106 15 49 -43 1 -31 -50 72 -166 -61 10 -26 -64 -142 -115 71 -258 -207 158
5431 158 -78 0 -95 140 39 -154 226 -47 -111 -36 8 -10 -116 -101 72 212 148 8 139 -161 -202 40 -236
5454 -236 -43 -247 -254 -202 108 -232 -160 -83 -68 9 234 -36 107 -214 -40 206 59 231 217 73 -102 71 -122
5477 -122 -34 168 -207 305 -188 119 228 -177 32 -98 155 -157 112 197 -45 -19 -100 -110 -208 -152 -203 2 -47
5500 -47 -34 -40 176 42 27 367 97 109 75 341 -22 29 249 181 -138 -14 30 -192 -24 -21 77 6 -168 -79 86
5525 86 96 21 23 -106 20 113 -45 -108 -63 -49 14 123 -28 69 137 86 164 200 -39 -291 -139 130 -7 170 69
5550 69 -231 -14 -124 48 156 14 -173 -60 -127 -99 -164 56 -209 -323 -67 -69 44 156 115 112 -14 218 -128
5573 -128 19 -265 -91 -142 -280 -61 -69 -117 115 -180 64 -169 -186 179 183 130 -237 47 -79 -28 -146 94 213
5596 213 145 164 139 34 160 7 -121 388 56 -37 -4 -65 47 -71 71 45 -21 -68 -93 173 -35 -260 -133
5619 -133 -27 -13 3 32 11 -224 46 -135 -9 -74 -91 85 109 84 80 70 21 -127 16 -16 198 152 137 -171 94
5644 94 -163 198 -46 -85 29 -80 -204 -157 -9 -122 50 -60 97 -43 12 60 -185 8 -57 18 149 84 103
5667 103 -49 -81 117 1 112 -50 97 -188 10 -145 47 -114 -237 -82 -21 -212 254 -43 -197 -61 -133
5688 -133 144 192 -106 -125 153 98 85 42 197 75 -28 -19 198 59 232 -54 258 408 79 -82 58 36 46
5711 46 49 -194 -286 93 -65 40 -72 40 -158 74 188 -7 53 137 112 216 -83 -25 -27 -2 152 78 178 -49
5735 -49 182 -72 -350 -152 182 -194 -98 205 88 -54 113 33 -221 -32 -10 -59 -100 -113 60 67 48 -155 -34
5758 -34 10 82 -32 29 -175 103 76 68 75 226 220 -280 -68 38 -100 246 32 274 132 154 -341 -164 -223 -240 -25
5783 -25 -114 -8 -70 53 -19 -158 45 43 161 56 -59 -45 41 54 -50 -24 199 -92 115 -55 86 -20 -162
5806 -162 79 -66 123 -53 -73 -134 120 -276 -195 44 156 -38 -177 -39 -39 -214 192 -14 30 -36 5 57 110
5829 110 41 -124 158 -47 -160 3 -234 55 167 273 213 -63 30 203 -123 81 -63 -355 15 -156 46
5850 46 -174 -6 -134 -109 85 -304 -24 90 115 -17 -109 229 188 -54 -1 -169 -58 -68 -181 -238 -281 109 -132
5873 -132 -30 -13 -157 -62 -92 -144 -27 -16 124 -224 -47 -264 -1 33 -21 -238 179 71 199 -25 24 177 37
5896 37 -6 40 106 1 57 -68 170 -17 346 -181 96 21 40 -148 81 -123 -177 -223 -237 126 15 -76 40 122
5920 122 -45 93 62 -78 5 -148 -12 5 -9 -67 236 -169 -103 166 131 -63 -102 -218 -9 -80 -68 167 -171
5943 -171 -96 -14 -197 -89 59 117 -101 7 -89 -50 109 -173 86 31 -33 22 -91 -129 213 77 58 109 -150 -307
5967 -307 43 -61 -54 -164 44 154 -3 -249 58 125 -81 -45 169 -11 19 -217 16 -130 -157 -114 -107 120 -43
5990 -43 311 -32 42 246 -145 -65 253 99 -86 -254 -145 -155 -239 -125 67 133 -351 -150 18 2 -1 55 88 -3
6014 -3 -97 -242 14 67 75 -161 204 135 -129 119 -12 32 31 -29 77 -132 26 9 160 -85 -6 -84 -284 -58 -128
6039 -128 71 -60 -108 -47 70 -84 78 23 -81 -139 49 63 -45 -2 110 -28 59 39 110 80 -58 46 43 35 -18
6064 -18 -320 20 -133 108 132 -201 232 -28 -89 -71 215 -98 -11 -211 126 -27 -124 94 9 15 150 -14 96
6087 96 -163 90 -134 249 73 45 24 -213 112 41 -40 -200 106 -112 -187 58 -88 -100 66 225 -23 127
6109 127 144 -68 -3 -78 -11 334 212 66 -22 302 26 -210 19 101 -27 244 4 139 40 -15 -6 -24 -127 -57
6133 -57 -30 300 46 -122 115 -5 -78 -58 -1 -91 66 43 178 -129 -122 1 237 299 -12 26 -42 185 -202 16
6157 16 57 45 49 -122 -44 96 -205 -14 64 -114 -28 59 -111 -78 55 -139 80 16 109 -1 70 155 207 79 -13
6182 -13 -104 -70 -128 -12 211 -98 77 65 -56 65 226 124 75 -265 76 -85 60 57 -9 137 -33 29 85 -53
6206 -53 -52 96 19 47 -244 -26 235 254 151 -134 -146 89 -190 -112 101 -248 -303 -35 -170 -259 -8 -155 -38
6229 -38 149 -272 -25 -28 149 -154 230 51 -203 -53 -323 97 -166 -120 45 -124 -80 96 175 -107 122 -157
6251 -157 -147 8 -32 -153 46 -299 -21 -126 -25 -84 -6 -72 -204 -88 -184 -45 -115 -10 -244 86 159 39 143
6274 143 -130 93 174 294 125 198 220 -218 -18 33 189 1 -365 35 89 97 189 -13 92 132 45 -91 103
6297 103 -54 -181 -53 113 157 195 153 -128 83 13 -80 41 -78 -143 -109 236 50 215 -28 -43 21 -56 -98 -66
6321 -66 -61 83 103 -91 -58 -180 -83 156 71 247 -23 112 -198 -76 -164 -162 -229 -137 -15 65 -15 184 110 23 215
6346 215 -30 15 234 151 164 1 31 -18 -113 95 -100 77 -14 133 152 191 139 -22 -266 169 -143 -77 -54 -14
6370 -14 -67 -97 313 -100 102 110 11 241 -299 223 -42 -229 306 205 -234 -2 47 -65 22 0 69 168 34 132
6394 132 -37 265 124 -290 29 57 -252 100 -25 -230 -184 -41 0 -51 -52 -176 33 31 -62 144 187 26 4 -47
6418 -47 115 -263 -172 -208 13 2 -25 72 -197 -168 -3 136 88 -86 94 23 -31 125 19 227 -241 260 -35
6441 -35 -154 -64 16 -8 -121 56 -27 125 37 27 159 -155 -173 211 -108 -49 -39 227 -111 -78 -8 -122 13 40
6465 40 -145 19 149 42 17 13 144 -63 -259 193 66 -85 -195 -233 147 55 -255 2 -214 57 78 -53
6487 -53 -249 -198 -247 -373 162 -9 155 97 -128 -150 170 56 122 -222 99 -96 2 121 -12 -1 -161 -82 33
6510 33 -48 39 -81 -95 129 -13 127 103 -138 86 -47 5 -34 -29 196 24 -288 0 -141 179 -158 17 18 -32
6534 -32 -59 60 263 170 73 14 -71 -235 71 -126 -138 6 -225 -220 -201 43 79 -133 -2 -42 -111 -379 -193 -124 -67
6559 -67 -199 -75 -88 -128 -35 14 153 -174 -129 111 259 231 16 -130 122 -31 315 -24 -25 296 177 41 89
6582 89 197 37 46 -11 -17 46 -19 -321 -194 -84 -79 163 -16 -265 104 -10 -2 -224 8 -52 -16 -198 -186 -8 22
6607 22 -143 53 -9 -188 22 23 62 -312 19 19 248 -114 -8 159 -11 -99 85 -6 13 -64 38 180 87 -216
6631 -216 145 -79 -156 184 -98 224 -8 186 -163 181 -3 47 -133 34 97 -203 282 6 168 -69 18
6652 18 -274 -16 25 -25 123 -60 8 -195 199 187 -161 -173 -223 66 -215 95 -75 -56 11 -88 50 294 54
6675 54 -245 -116 -22 45 159 -112 30 -2 -258 137 -110 95 -7 -27 14 -57 16 257 52 -43 -89 42 8 194
6699 194 144 36 -1 -97 -99 40 189 -117 -70 17 65 129 336 -88 -236 154 153 150 5 182 130 -51 33 -90 10
6724 10 -148 102 267 255 -186 9 164 -209 -17 -105 76 246 137 313 -117 34 194 206 67 163 192 5
6746 5 -61 -23 74 -260 -124 101 26 -32 -152 -111 86 69 92 -88 126 64 189 176 -71 57 2 -62 -193 39 -172
6771 -172 -69 132 58 -150 -162 -74 -25 -199 -112 -147 -203 34 -58 211 -50 -68 31 55 -144 -13 -130 180 6 42
6795 42 -231 56 380 -33 247 -102 -138 -76 157 2 1 46 -16 -9 -3 -50 123 252 114 -93 -84 -133 31 -76 228
6820 228 -7 -212 241 -41 122 -59 279 18 -12 97 -117 183 -15 -133 3 73 -119 -18 26 -82 116
6841 116 304 -67 -124 -102 14 50 -80 216 335 58 110 157 32 -36 -122 108 78 -76 -45 -20 -114 -4 141 -86
6865 -86 54 -124 -188 215 -47 -197 35 -193 202 247 105 -165 -30 -214 -3 256 157 -228 -69 -23 -31 -91 -30
6888 -30 -8 -65 -4 155 -98 37 -119 45 -184 37 -38 34 -178 155 -140 -20 -35 -78 6 -210 -180 86 -201
6911 -201 40 138 27 257 -270 -94 -98 273 -226 102 134 102 -54 -187 -9 -80 -141 -201 -11 170 -124 22 -84
6934 -84 -118 80 -162 -14 -132 43 -137 258 -42 -292 -35 185 116 31 134 -72 161 83 60 181 -238 -86
6956 -86 94 -18 -116 -45 371 101 39 70 -113 107 116 110 24 -103 29 111 -144 -13 -13 -222 -78 48 1 -30 32
6981 32 243 97 118 -111 -4 -34 -69 -10 -55 68 255 -14 170 120 154 220 137 -61 25 169 39 39 -65 86
7005 86 160 -66 17 -93 94 -348 -163 89 -55 -63 -286 -73 -38 31 -56 88 -96 13 -66 86 17 43 237 -218
7029 -218 85 -46 88 -170 -129 -19 235 34 -61 -78 89 17 -249 72 175 -235 21 -116 -74 -109 14 30
7051 30 4 -26 29 235 209 102 57 -188 -36 -172 -66 -85 65 -23 271 1 -26 -167 -77 22 -8 -189 204 30
7075 30 51 -44 198 -110 -92 79 -84 -30 -138 -107 -96 25 -99 32 -275 -45 -208 -76 -44 -39 155 -177 -42
7098 -42 48 -193 -82 17 117 -59 287 89 124 -126 46 115 109 -138 -48 275 -189 -69 -29 102 -165 65 41
7121 41 -152 45 -85 -263 121 70 64 90 -4 -108 274 -75 -65 34 -191 -56 -67 26 82 30 -10 82 44 -200 29
7146 29 -69 -6 51 92 134 205 91 -46 -89 -43 177 -225 131 -30 -41 275 -121 -74 -244 -41 16 -179 55 -114
7170 -114 43 131 -63 -92 -126 -13 -260 2 -6 -201 94 -342 -130 -21 158 -122 -76 57 12 55 -19 -9 -74 -94
7194 -94 31 8 -85 -46 65 -58 49 -38 -2 -186 -31 -245 3 12 29 -154 61 83 147 85 -364 128 122 1 -131
7219 -131 -119 279 8 58 5 -14 -203 32 -37 14 -137 233 71 60 167 11 -49 -117 144 -42 -3 -231 -30
7242 -30 35 212 32 230 -16 -29 -97 -218 -95 118 250 10 -281 28 66 0 122 -71 4 -17 53 -113 -17
7265 -17 -52 29 -154 -116 -112 -130 -34 221 188 33 66 -36 107 176 242 117 144 -75 169 -40 -116 278 168 254 100
7290 100 20 -128 22 153 59 -74 33 16 56 70 18 81 36 42 88 -28 -131 150 -78 136 100 -213 18 112
7314 112 -276 -136 -182 -127 -101 30 -110 140 -125 -240 119 -63 20 79 10 -113 -131 -62 2 196 -14 42 -126
7337 -126 -153 292 129 -87 -36 12 -154 -85 99 -220 -1 75 104 -152 208 -6 118 17 144 -272 -52 140
7359 140 -13 187 94 -37 -76 35 -58 155 -194 -2 348 -129 104 -184 284 -94 -30 58 -225 141 51 -66
7381 -66 67 -53 -53 -19 -100 -204 -263 294 -80 -39 -206 181 -170 49 35 279 6 -262 -187 155 -137 122 -193
7404 -193 86 -21 178 -154 38 67 175 119 -138 -155 24 -6 192 -116 -43 -72 -145 -151 -68 14 -100 12 -229 74
7428 74 84 -38 -41 5 196 53 -118 -181 129 25 -57 -250 -131 -33 49 -288 182 55 -137 189 -115 31 -135
7451 -135 89 181 84 -60 224 18 39 10 -47 138 -190 -58 -371 -141 117 200 56 -29 362 32 191 -116
7473 -116 -341 209 -20 106 -19 -112 83 -241 129 137 81 326 29 145 -48 -103 110 -52 -251 -164 28 194
7495 194 14 29 -11 -126 6 37 -93 79 201 -77 -115 267 256 6 163 74 -121 83 88 42 -177 -119 82
7518 82 -157 -53 205 -188 -49 -170 59 -100 59 -115 164 -205 126 154 213 37 263 -39 82 126 -11
7539 -11 67 58 -88 57 -107 164 -156 -201 169 218 -75 -40 -154 -179 355 168 93 35 44 193 -58 166 -14 -87
7563 -87 167 -103 14 58 -59 22 157 -102 -61 184 179 19 -1 -57 -215 -164 288 101 -14 195 -188 148 51
7586 51 -163 -63 135 204 53 6 -23 320 -54 -159 -54 -181 56 -10 134 97 268 51 -1 43 -140 -129 145
7609 145 273 26 98 33 -97 54 109 -11 -49 28 145 66 183 -63 -105 167 -136 131 47 -46 -266 -160 -30
7632 -30 -161 -92 371 84 -164 4 -164 -171 13 248 13 -160 -83 248 125 -19 -65 -197 115 52 -142 104
7654 104 -100 189 61 0 118 -129 122 213 -215 77 -140 -83 114 0 76 98 -62 -22 -51 31 -76 110 -134
7677 -134 55 80 39 134 85 -66 9 77 135 27 -129 52 2 212 -75 99 40 286 -141 -31 28 -125 -225
7700 -225 33 -149 -107 20 -216 -222 291 61 24 -149 215 -128 -104 202 35 -64 2 -206 -1 -61 -81 -122 79
7723 79 32 16 -22 -1 -195 -14 -24 -180 119 -151 163 -46 -37 184 -91 -143 -31 21 22 137 -101 -6 -38 81 -198
7748 -198 213 9 -20 26 -86 -60 -123 -231 -129 142 -78 54 -129 73 172 96 27 -126 -50 -61 122 -34 134
7771 134 160 -33 256 -108 -156 -79 -130 -71 -232 65 -176 -38 87 7 -43 -57 -149 -107 175 -22 126 -128 -235
7794 -235 6 94 24 229 77 -92 -33 -9 65 32 -195 -94 -61 -11 35 -55 48 71 69 -187 -127 -9 55 100 -40
7819 -40 173 56 -85 -56 -83 -259 59 -153 -127 162 -34 45 -37 55 292 42 -26 219 -66 396 -220 162 117
7842 117 -30 86 -103 17 -97 30 -163 236 -10 261 -121 -54 -304 -43 -29 -271 73 -10 52 -213 -90
7863 -90 -24 -214 176 -341 -48 56 -99 -232 68 40 96 149 20 22 83 0 -108 29 39 -71 -251 50 -72
7886 -72 -82 81 -185 145 -189 -159 84 -143 67 -74 119 -22 18 222 -65 44 -64 -37 -60 142 74 -51
7908 -51 60 -235 -116 113 122 -113 130 -23 147 29 65 -48 -154 112 -41 204 62 226 -145 70 117 -87
7930 -87 116 149 -38 -42 -3 274 93 132 55 -137 -28 291 55 -99 -141 -195 95 72 -81 144 -137 -16 20 29
7954 29 113 166 138 199 2 69 -106 -222 -26 -231 120 -30 197 41 -61 -16 -61 177 -47 -1 57 83 71 250
7978 250 53 -34 -133 5 41 -160 89 276 -177 -127 -282 124 -287 -29 337 -177 -18 390 -111 60 163
7999 163 78 -129 313 -132 137 44 -42 -126 -5 -138 -64 -20 118 231 -42 197 11 52 -287 173 105 -74 184
8022 184 -247 14 95 109 159 -22 -28 306 76 -92 -154 -20 48 -141 -260 96 45 116 141 188 35 364 45 0
8046 0 -109 110 9 -103 64 86 34 98 -245 -118 -95 130 99 -140 -73 -118 1 3 296 114 367 -14 -87 -5
8070 -5 -34 -148 -89 -28 -333 183 -25 196 271 92 -115 -27 61 95 184 39 -14 -23 23 54 -93 253 -181 94 -25
8095 -25 19 105 -69 -130 154 -86 -173 101 59 229 -187 -52 -6 -101 123 105 -48 -89 155 140 -99 -80 -171 -1
8119 -1 43 159 41 -7 66 -65 255 -187 50 -94 157 218 18 102 -101 72 69 101 198 -354 -86 -258 -247 21
8143 21 -78 -3 -142 89 339 -35 -127 163 -172 -119 158 -34 244 -4 -165 -20 -32 92 -217 -73 -66 117 -40
8166 -40 205 21 209 -32 -49 75 40 33 -96 -52 -59 54 -6 68 251 41 147 -186 50 -187 112 -73 -121 -82
8190 -82 -10
8191a0
$$ Imaginary data points
##PAGE= N=2
##DATA TABLE= (X++(I..I)), XYDATA
0 0 0 0 0 0 0 0 0 0 0 0 0 0 0 0 0 0 6 -8 8 -8 8 -8 12 -16 16 -17 24 -24 30 -32 38 -43 48 -54 60 -68 76 -85
38 -85 96 -107 118 -131 147 -161 177 -196 215 -239 260 -289 317 -349 386 -427 472 -523 583 -652
58 -652 736 -835 956 -1109 1309 -1578 1963 -2556 3571 -5618 11274 -55780 -163098 62508
72 62508 66533 -61786 65493 127144 -9369 21481 80191 -11012 1801 84500 20302 -31988
84 -31988 -7034 -25922 -30608 4944 -2040 -4664 -5387 -43881 -43758 -28098 -50900 -17853 22616 -25365
98 -25365 -30883 16444 -6816 2227 61099 23922 732 57374 14885 -32412 44949 42015 -23028
111 -23028 36490 40690 -54815 -7913 44256 -48298 -40851 36853 -34355 -70141 12095 -7595
123 -7595 -48878 16881 20417 -32080 3090 22774 -13970 2886 24691 5702 10902 15155 4379
136 4379 19755 14732 -6629 15256 12536 -22840 107 12502 -28176 -12482 14767 -23769 -19079
149 -19079 19922 -11687 -21797 19930 321 -21044 18020 10719 -16509 16154 15965 -16718 10667
162 10667 22347 -12784 2243 21545 -12514 -13238 9944 -11261 -16619 4619 -7421 -13996 4559
175 4559 -2888 -8534 9349 5339 -3832 7205 3574 171 12389 5515 931 17432 9154 -6194
189 -6194 10328 7336 -12713 -327 1313 -20869 -9446 2342 -18371 -12735 6731 -9410 -13338
202 -13338 5632 -3252 -9952 8456 4445 -4827 12722 14657 2169 13873 19840 5103 7119
215 7119 11815 466 -843 2998 -4107 -5182 -1891 -8930 -9880 -4680 -10492 -13639 -9190 -10966 -11447
230 -11447 -6189 -6084 -2294 5259 3305 3202 11352 9892 6247 11801 10901 6957 11204 9611 3097 7238
246 7238 8293 -961 -1957 119 -6775 -9240 -6496 -10530 -11333 -5793 -8523 -10906 -3913 -2763 -6766 -2986
262 -2986 1247 -491 935 4887 5808 7069 8569 7575 8174 8397 6074 4346 3729 3152 1774 78 -1572
279 -1572 -236 -1061 -5066 -5678 -3312 -5625 -8297 -5735 -3322 -4530 -3876 -1058 340 35 1421 1670
295 1670 1476 2074 3040 2123 1689 3296 4670 3332 2392 3055 3292 1779 -340 -311 389 -723 -2006 -958
313 -958 42 -625 -1287 -911 -1051 -1421 -2634 -3826 -2910 -1686 -3051 -3404 -586 328 -944 -702 907 943
331 943 580 238 532 2037 2697 2402 3037 4198 4183 3636 3244 2360 2708 1443 -569 -347 64 -1237 -2630
350 -2630 -2401 -2875 -3764 -4415 -5907 -5846 -4650 -4864 -5906 -2930 -386 -969 148 3005 3734 3642 4024 4687
368 4687 5297 5053 4060 4421 5588 4614 2358 2316 2522 770 -1495 -2540 -2894 -4208 -5029 -6329 -6558 -5383
386 -5383 -5426 -6364 -4649 -2343 -2321 -2631 54 1829 1582 2858 4426 4340 4731 6369 5416 4384 5990 5809
404 5809 2396 1566 2269 681 -2495 -2939 -2342 -3529 -4438 -4102 -3878 -3760 -3416 -4116 -4687 -2975 -2417 -4241
422 -4241 -1854 1998 1055 698 4498 5012 3173 4225 4813 2357 3072 3631 947 1587 3591 838 -934
439 -934 1263 68 -2908 -2331 -2425 -4574 -3858 -2982 -3651 -2438 -571 -960 -1685 -1102 160 -286 -1390 -791
457 -791 1807 671 -915 2316 3863 1894 3192 3497 319 1135 2456 -1116 -162 4228 1014 -2139
473 -2139 2306 1457 -2536 500 2036 -2524 -2734 -1627 -4082 -3434 269 -1120 -2610 -218 -1189 -3362
489 -3362 -1804 33 255 191 139 -170 232 924 3038 3712 3042 4452 3402 -161 1220 5135 1546 -282
507 -282 3309 -110 -4697 -850 -347 -3880 -106 117 -7066 -5113 -711 -5952 -4965 2910 -294 -5173
523 -5173 527 1872 -1223 2904 5856 2097 3330 4653 816 1697 5656 3886 1742 3233 2058
538 2058 -606 -636 -472 -1579 -2427 -3528 -4522 -5758 -5215 -3146 -2568 -3598 -1370 -476 -3578 -1827 1626
555 1626 -315 314 4115 2903 2221 6426 5157 2559 6841 5347 -283 2218 3840 -2259 -2480 1911
571 1911 -1136 -2942 -244 -2702 -5301 -2360 -3828 -6688 -3116 -1853 -4915 -3027 90 -917 284
586 284 2740 1855 1932 3014 1575 1656 3258 3611 3497 4109 2931 3509 2532 79 423 1121 -1601 -2719
604 -2719 -2126 -3238 -3175 -1646 -2305 -3003 -1093 -2519 -4850 -1739 -670 -2619 -788 909 10 624 2692
621 2692 2108 2955 3720 1641 1334 2811 1689 962 2733 2436 553 656 -143 -417 -357 -1392 -2367 -1744
639 -1744 -2532 -3582 -2429 -1674 -2109 -765 -876 -2754 -822 504 -1532 -550 1914 475 49 1736 1572
656 1572 1703 4412 2476 678 2456 2376 -492 800 2270 395 -526 60 -661 -1067 -276 -1143 -1775 -1274
674 -1274 -2817 -3568 -2338 -1532 -1589 -1241 -781 -362 -736 -381 577 1108 821 929 1425 1372 1764 2800 2226 2100
694 2100 3339 1772 322 1209 1109 -26 97 30 -1435 -598 -662 -2874 -2351 -719 -2626 -4065 -2125
711 -2125 -1513 -2818 -1827 -291 -348 436 780 597 1632 2714 1303 1779 3052 2678 2021 2350 2956 1951
729 1951 1442 755 531 -155 -617 -1492 -1850 -1864 -2253 -2441 -2409 -2121 -1994 -2688 -2182 -1619 -1777 -1278 -246 187
749 187 757 2119 2198 2220 3087 3524 2336 1989 2923 2428 1044 1229 1446 300 -9 -787 -1079 -921 -1872 -2940
769 -2940 -2989 -2579 -2985 -3113 -2383 -1521 -1204 -1130 -621 66 384 491 581 1742 1657 1971 2329 3044 3150 3212 2308
790 2308 2174 1847 712 -131 -856 -705 -967 -1386 -1466 -1396 -1513 -1658 -2457 -2183 -2136 -2232 -2636 -1993 -891 -458 -120
811 -120 544 1352 1915 1672 1171 1674 1769 923 1006 1818 2453 1865 1292 1913 1451 147 -370 -1087 -1199 -1807 -2109
832 -2109 -1919 -1197 -1117 -1302 -1421 -1011 -1312 -1274 -1753 -1390 -825 -379 -112 646 1725 1775 1832 1652 1817 1726 1068
853 1068 806 721 1417 1199 775 1156 1440 933 -313 -650 -960 -1378 -2153 -2260 -1413 -1393 -1559 -1081 -532 -503 -873
874 -873 -914 -732 -413 -430 -219 651 1096 1518 1860 2273 2398 2002 1847 1260 1103 996 303 -1 256 584 -235
895 -235 -522 -649 -778 -1481 -2385 -2354 -2042 -2137 -2349 -1896 -1127 -556 -449 -401 370 848 702 307 1269 1860 1623
916 1623 1300 1954 2450 2292 1983 1325 1611 1454 321 -498 -798 -1100 -1597 -1669 -1256 -1394 -1562 -1417 -1594 -1943
936 -1943 -1478 -1153 -1722 -1069 -548 -500 94 1158 1823 1902 2380 2511 1705 1565 1520 1380 1470 1369 756 92 836
957 836 569 -555 -951 -680 -1596 -2745 -2742 -2004 -1654 -1735 -1599 -1137 -612 -371 -962 -314 729 702 498 785 1381
978 1381 1776 1803 2428 2656 2143 1545 874 637 78 402 91 -654 -869 -611 -1064 -1363 -1133 -1442 -2229 -2127
998 -2127 -1789 -1712 -1461 -826 -165 373 468 612 443 1135 1741 1006 1016 2027 1759 825 1385 2253 1160 626
1018 626 716 214 -175 -226 -729 -1251 -772 -683 -1964 -1604 -249 -1450 -2013 -827 -1179 -1363 -852 -143 -676 201
1038 201 830 203 344 1598 1710 676 1178 2041 867 825 1536 672 440 832 421 -281 202 -170 -1364
1057 -1364 -1151 -192 -1020 -2175 -1087 -1083 -2293 -1902 -469 -989 -979 -40 -243 -448 705 768 -9 1088 1831
1076 1831 650 555 1780 1648 933 1744 1634 615 388 100 -811 -669 83 -488 -1682 -1047 -1074 -1772 -1652
1095 -1652 -611 -873 -1281 -1247 -1222 -1255 -294 504 616 779 1566 890 386 1519 2322 1562 1167 1761 877 -56
1115 -56 655 1069 599 230 -325 -996 -1316 -1086 -1733 -1519 -983 -711 -2135 -1779 -662 -682 -723 151 76 -406 102
1136 102 527 645 1344 1912 1520 969 1519 1603 666 998 1424 1111 80 -85 -90 -677 -113 -448 -1313 -760 -678
1157 -678 -1640 -1753 -804 -953 -1592 -802 -195 -683 -543 358 154 428 762 771 868 1159 1138 445 1263 1412 763
1178 763 608 1110 880 105 165 -130 -466 -387 -589 -1162 -1218 -929 -1506 -1166 -611 -736 -780 -904 -641 -543 320 278
1200 278 164 587 826 739 839 1066 1684 1393 878 949 1068 690 217 461 322 319 -355 -970 -603 -822 -1506
1221 -1506 -1429 -972 -1175 -1622 -1527 -1216 -720 -309 -189 35 440 362 441 577 1300 1292 1191 1324 1406 1786 1663 1300
1243 1300 1129 825 299 -150 -244 -366 -649 -1002 -1040 -1044 -1153 -1224 -1382 -1032 -901 -1107 -1471 -503 -22 -145 130
1264 130 479 800 1198 1022 1266 1390 1207 1225 908 1226 1058 530 453 395 -85 -246 -477 -767 -564 -1112 -1290
1285 -1290 -1207 -953 -1002 -1099 -1112 -906 -782 -667 -470 -53 258 384 584 697 913 1073 848 1031 1153 1247 713
1306 713 602 951 749 185 -136 15 -278 -539 -867 -1050 -864 -807 -1240 -1009 -597 -848 -752 -464 -375 -180 -293
1327 -293 201 296 645 885 666 1200 1420 901 748 980 577 629 458 480 639 500 -47 -255 -163 -485 -794
1348 -794 -1163 -1311 -875 -1065 -863 -790 -159 -261 -855 -276 -606 -275 -126 247 398 746 818 701 1162 1289 853
1369 853 747 811 769 265 -6 382 182 324 -104 353 -287 -197 -952 -1051 -882 -1109 -1233 -1051 -899 -595 -436
1390 -436 -436 3 -56 272 -93 264 300 755 824 810 1035 1454 866 932 1116 835 344 -69 -422 -72 -367 -643
1412 -643 -723 -455 -756 -1068 -845 -643 -691 -1012 -849 -645 -619 -272 253 212 896 998 734 818 1147 886 916 983
1434 983 1062 303 445 443 315 94 -164 -240 -623 -794 -764 -1578 -1386 -859 -1188 -1208 -1025 -436 -724 -419 -55 -323
1456 -323 125 274 97 381 891 686 710 1195 1523 993 678 895 741 -64 273 -166 -424 -269 -420 -534
1476 -534 -583 66 -1029 -1329 -667 -1020 -1397 -853 -519 -699 -354 -27 14 114 527 711 227 466 1046 541
1496 541 421 1186 977 820 370 436 236 310 55 -317 -207 -242 -853 -1060 -396 -321 -749 -894 -440 -753 -979
1517 -979 -817 -341 -262 -210 153 68 251 561 538 439 951 841 312 530 679 542 259 644 607 223 -357 -303
1539 -303 -610 -395 -138 -646 -881 -561 -853 -893 -569 -541 -394 -342 -508 -614 45 165 338 406 1139 803 781 415
1561 415 815 1102 994 549 540 39 -159 86 351 121 -109 -324 -760 -996 -803 -768 -861 -614 -545 -753 -805 -369
1583 -369 -258 -351 333 14 139 326 278 916 1192 1123 618 554 1017 635 134 363 470 303 -255 -121 -330
1604 -330 -274 -249 -626 -575 -666 -981 -1050 -675 -476 -615 -674 68 202 -237 -30 262 414 310 562 604 502 766
1626 766 936 470 325 438 432 222 213 -61 -273 -546 -227 -713 -603 -389 -517 -660 -652 -832 -655 -500 -242 -408
1648 -408 -77 56 194 251 389 521 574 467 510 262 438 684 456 344 310 314 -55 -338 81 -32 -533 -270
1670 -270 -517 -954 -659 -604 -503 -549 -195 -577 -754 -270 19 -14 -37 169 48 228 655 710 681 778 710 520 696
1693 696 551 161 155 404 -66 -415 -197 -249 -580 -453 -564 -768 -789 -601 -849 -859 -439 -300 -400 -369 241 -16
1715 -16 231 352 310 345 531 500 463 689 822 597 472 780 455 180 57 45 -315 -341 -531 -563 -611 -412 -623
1738 -623 -735 -340 -451 -375 -552 -343 -232 -97 -92 252 330 530 537 574 733 618 533 211 807 264 315 577 444
1761 444 98 -109 263 -107 -521 -483 -544 -570 -405 -641 -663 -288 -191 -234 -194 -259 10 -68 325 240 139 446 457 515
1785 515 609 685 438 370 452 437 318 81 179 29 -22 -479 -187 -153 -333 -724 -612 -410 -298 -457 -500 -482 -109
1808 -109 -329 -119 -169 -65 216 183 323 548 589 452 533 462 672 520 614 349 274 61 235 212 -169 -238 -343
1831 -343 -314 -473 -496 -656 -758 -441 -279 -335 -333 -188 213 -140 37 -58 251 328 60 453 571 762 699 674 645
1854 645 526 268 205 56 -266 -8 -167 -362 -229 -328 -516 -324 -525 -627 -553 -233 -444 -338 -379 68 253
1875 253 365 88 139 463 315 377 400 503 626 624 331 454 342 220 82 5 54 -418 -419 -304 -258 -156 -316
1898 -316 -340 -412 -291 -384 -509 -228 -417 -281 70 -141 65 150 185 251 594 579 325 194 402 135 229 389 189
1921 189 300 73 74 -93 50 -228 -92 -423 -464 -347 -307 -422 -193 -135 -283 -441 -409 -196 139 -55 97 105 236
1944 236 136 314 125 599 278 262 537 454 264 89 310 142 42 -196 -87 -78 -135 -651 -605 -483 -380 -454
1966 -454 -455 -389 -327 -533 -330 -88 -111 113 380 233 529 619 361 623 508 690 338 430 339 369 331 162 101 -111
1990 -111 -219 -278 -175 -442 -40 -528 -507 -179 -222 -642 -339 25 -136 -82 52 208 -60 51 483 666 372
2011 372 593 292 276 463 180 304 341 416 -436 -152 24 -108 -129 -112 -233 -626 -322 -509 -344 -420 -102 -223
2033 -223 -229 124 30 70 5 254 105 401 215 300 295 195 470 406 432 114 -95 -121 -43 154 -68 -25 -324 -256 -291
2058 -291 -213 -359 -236 -72 -463 -170 -240 25 -136 -9 54 153 -165 44 159 -15 332 411 283 540 318 242
2080 242 -74 -22 113 -109 179 105 53 -7 -123 -199 -123 -73 -156 -345 -313 -158 -458 -466 -69 -64 -313 203 419 -27
2104 -27 167 168 136 94 407 462 136 392 498 547 275 324 166 -292 155 -131 -356 -424 -372 -344 -295 -336 -680 -484
2128 -484 -340 -536 -100 17 96 -70 -214 375 98 327 476 576 487 528 503 426 358 436 229 87 -140 -57 43
2151 43 82 -297 -270 -579 -514 -569 -453 -279 -316 -203 -186 -163 -4 -128 -3 49 111 282 341 371 476 317 397 87
2175 87 449 312 276 -19 28 4 -199 -115 -321 -399 -425 -394 -294 -491 -570 -383 -216 -306 -206 -36 3 6 164 24
2199 24 147 212 594 75 253 521 475 210 187 431 31 -52 236 88 -67 -161 -182 -448 -311 24 -335 -70
2221 -70 -132 -106 -357 -277 -458 133 -279 274 -30 -149 232 63 236 138 270 102 536 17 30 123 327 288 221
2244 221 179 10 260 112 -77 -126 -162 -288 -144 -69 -305 -278 -26 -308 -174 -259 118 -105 -118 -138 159 150 38
2267 38 213 349 265 131 502 267 -32 279 371 259 -125 222 159 147 -184 -85 -99 -169 -74 -283 -684 -527 -83
2290 -83 -466 -367 -202 40 -41 74 217 273 105 432 187 274 539 441 157 227 -42 57 -18 -117 200 47 -319
2313 -319 -117 -169 -236 -92 -392 -299 -260 -440 -391 -116 -176 -194 -156 107 -10 198 290 42 501 529 421 162 87 542
2337 542 95 341 279 -78 -143 178 -132 -395 -129 -452 -329 -414 -393 -461 -150 -230 -92 -156 -84 10 -99 -193 101
2360 101 165 237 132 246 42 325 186 128 -23 157 279 -67 86 118 -55 -187 44 -99 -53 -214 -139 -203
2382 -203 -28 29 -263 -356 -259 -3 -206 117 -140 45 -135 195 -39 308 57 118 -64 193 184 93 -20 131
2404 131 21 354 -95 -95 -74 -193 -104 71 -72 -60 -92 -106 80 -69 -197 -410 -46 -248 -323 -47 27 -16 26 149
2428 149 71 330 178 156 391 483 123 437 -105 129 136 -183 -96 -79 -44 -62 -192 -239 -191 5 -164 -233 -192 -230 -84
2453 -84 -44 223 -410 -83 83 302 342 78 60 265 142 262 99 285 226 344 -2 76 26 -28 -30 -265 -183 -337
2477 -337 -471 -348 -256 -293 -202 -257 25 -155 11 208 -100 -45 -116 54 290 63 126 221 -30 225 263 97 120
2500 120 84 37 -101 40 80 -78 -98 -229 44 -325 -324 -380 -493 -407 -23 100 4 39 281 -136 91 75 147 -46
2524 -46 156 230 -13 279 100 42 19 286 143 -131 194 61 -166 -76 41 -5 -265 45 -108 -61 -111 -39 -289
2547 -289 162 35 -90 -48 239 58 -209 111 106 -182 434 5 225 36 28 96 53 -153 120 119 89 154 204 -217
2571 -217 -197 -173 -93 -436 -62 -1 -91 -22 -201 -214 -231 55 -77 -128 -56 93 50 91 -148 309 43 104 120 61 178
2596 178 137 30 278 -134 -46 -43 -149 -191 -189 -255 103 -166 -102 -128 -304 -136 -121 -2 -111 -48 -196 -121 -49 231 93
2621 93 11 287 300 372 22 121 -165 -27 31 297 -220 309 75 -108 -180 -253 -28 -110 -125 -351 -118 -255 -380
2644 -380 76 6 -232 -52 -7 181 40 137 182 -36 205 223 193 233 4 135 191 43 -70 -75 -67 -264 -265 17 -131
2669 -131 -28 -128 98 95 75 -198 -123 199 -33 196 116 93 25 42 -27 49 -43 128 214 23 29 -4 49 49 119 196 -21
2696 -21 -29 -288 -83 -9 -42 -57 103 -58 67 -86 -128 100 -118 70 -86 -153 82 -16 -119 84 212 -43 226
2719 226 132 190 131 147 140 -151 319 111 -150 -92 54 -275 110 87 -131 123 -380 -8 -13 -26 -209 278 -169 3
2743 3 27 -102 119 -54 -66 108 -80 28 -14 128 58 322 243 59 28 13 198 164 -114 80 -68 -110 -29 -519
2767 -519 -87 -280 -107 -139 -181 -49 -102 -302 -139 -31 111 3 64 -172 115 13 -3 98 195 230 137 51 48 -202
2791 -202 -103 215 338 -55 44 -1 -344 -13 -174 -424 19 -40 -114 40 -134 -20 94 -29 192 -294 115 32
2813 32 -21 216 -78 1 198 195 55 282 62 167 100 59 130 93 40 -120 130 -31 34 25 -217 -92 -4 -196 -176
2838 -176 -161 60 91 82 17 146 52 -58 -159 -91 100 -142 232 276 151 157 5 -4 35 23 -96 55 50 108 -49 -152
2864 -152 45 -138 -240 -186 -89 -26 -6 28 -114 -96 170 -102 -213 139 35 -57 190 76 -5 -190 175 11 127
2887 127 -115 -131 99 -63 -106 -301 84 -170 -65 107 -57 1 -130 234 -190 -25 155 57 72 169 -16 188
2909 188 47 138 -96 -166 148 159 174 55 -243 87 -95 -54 5 152 -152 82 22 30 -239 -36 -2 56 -20 -136
2933 -136 18 -117 51 68 40 336 -58 -182 82 102 65 -59 70 141 -119 169 -184 196 -234 61 257 -70
2955 -70 -185 -221 -99 -257 -66 -72 -62 -380 -198 -302 53 -328 37 -93 -15 48 -141 22 -113 99 183 80 365
2978 365 102 265 6 276 -74 74 168 58 -119 -49 -44 -188 -183 0 -8 -160 -366 -33 -88 26 30 -155 -46 -21
3002 -21 -61 35 202 -174 36 252 342 29 204 144 134 109 -66 -137 -90 -264 -22 -167 9 -51 143 10 -18 -243
3026 -243 -103 156 -69 -79 74 9 65 124 -96 226 -123 5 103 -23 -68 48 17 -123 187 33 21 -115 88
3049 88 124 -126 -65 -134 5 143 -338 -158 -202 32 -80 -122 64 -22 -281 -121 65 37 157 37 79 120 16
3072 16 7 51 128 -146 141 -116 295 68 -18 -105 33 -108 33 -140 148 49 -356 -61 -184 -104 101 24 -26 136
3096 136 49 -73 141 -141 -81 -62 -13 118 50 33 -103 -94 -4 227 -4 110 -147 -168 189 -230 106 193 180 -103
3120 -103 15 -106 -174 11 -183 11 13 -109 -192 179 107 -65 -154 40 -127 111 -136 -259 371 -247 174 155
3142 155 276 -106 -236 -117 -163 80 38 -83 -125 7 -222 67 -236 -107 -31 219 -90 110 -174 -25 -19 78
3164 78 -84 -97 64 -214 129 -8 -38 -11 -81 -28 -78 -67 78 -14 -264 157 -80 112 -244 -278 -61 -183 269
3187 269 -118 -78 124 -231 -7 -10 -355 38 34 -6 -142 102 147 -35 182 285 98 -113 -150 32 115 355 178
3210 178 -233 33 -298 69 -333 -92 -64 -44 0 9 -119 20 -77 -130 120 -161 188 85 24 -33 -82 117 49 213
3234 213 155 139 180 -41 -8 151 11 222 -189 -185 -18 -21 -37 226 218 -32 -220 216 -125 20 188 84 134 -136
3258 -136 25 1 -170 77 101 -39 222 244 92 223 47 -82 -229 3 -139 -171 43 43 21 159 -113 -68 -219
3281 -219 -380 72 44 49 -160 -28 219 98 37 -229 229 -202 301 -32 -7 -101 -15 323 4 59 104 136 -129
3304 -129 72 227 17 -168 -42 52 -87 -32 -95 105 -65 188 -32 -61 208 -40 6 42 109 60 -34 116 70
3327 70 115 -29 -52 121 61 -56 127 64 329 129 237 -33 -132 -249 -113 41 -172 171 -60 -96 -65 67 -32
3350 -32 -268 -62 100 -100 -71 -53 66 210 -6 404 31 -50 217 -45 -90 143 92 -7 -40 -27 14 180 -318
3373 -318 -159 124 126 -124 -137 4 -38 -255 -236 -21 6 -89 -176 25 -104 142 138 -6 172 -192 -85 378 224
3396 224 262 3 5 110 -138 90 154 50 19 15 -253 -35 -316 -92 -13 97 -94 -12 5 -113 -101 -51 -125 62
3420 62 28 -176 45 -21 202 -32 52 -60 131 210 -108 -67 119 96 -68 159 189 -43 48 -408 -96 -217 95
3443 95 66 -118 -116 76 -120 47 -97 116 209 -4 -102 -26 -46 432 -46 18 140 -224 -27 164 -77 -116 -88 7
3467 7 -16 -105 75 -28 149 30 -168 -45 -266 98 -151 -263 29 21 313 -63 102 -178 -136 -50 71 145 -7
3490 -7 -59 136 91 -1 -13 -22 51 -89 42 67 -127 -250 17 -57 -193 9 -116 -12 -149 -40 -15 75 195 190 -26
3515 -26 47 155 100 252 221 -47 -54 88 -33 135 -68 25 -39 -122 103 -149 -121 -159 -76 -16 -51 -142 18 128 53
3540 53 -21 239 0 -59 -35 112 117 -91 235 -86 -158 -31 175 99 -100 168 281 177 113 2 -95 -82 -10 -28
3564 -28 -142 -191 -121 -83 -68 -251 -21 -89 -20 211 -5 93 -22 113 327 87 124 34 -1 139 -71 43 -46 167
3588 167 88 172 -98 65 205 -152 -170 80 38 -363 -130 25 -208 111 -234 -116 47 -58 156 264 145
3609 145 -12 190 271 -130 153 -106 208 30 -88 -83 236 98 196 216 1 -12 27 -26 57 -79 72 -258 145
3632 145 -77 -203 -50 205 216 183 -190 -148 -166 -302 169 216 -153 35 180 100 161 56 170 94 196 -23 115
3655 115 23 -60 272 -180 -214 -141 -113 -85 -192 -119 -181 18 -134 12 229 19 -123 29 89 46 83 -15 100 -117
3679 -117 80 -93 130 -43 199 21 52 109 -97 -120 5 159 -93 -71 -279 53 -154 14 -254 -36 65
3700 65 77 -145 18 72 -127 -43 153 -40 -33 -86 -54 258 312 -332 9 99 225 -152 -186 -42 361 11 -125 -229
3724 -229 21 19 -137 83 36 -135 -111 234 -63 -5 -133 242 261 55 40 266 213 98 207 226 143 3 -159
3747 -159 168 149 98 144 -28 -66 123 -173 25 384 -121 19 -36 50 -20 -169 -133 -62 53 -152 -119 23 6 46
3771 46 108 -70 172 22 249 150 -175 4 -154 -22 84 16 104 74 -61 -86 -87 -143 -148 -165 -17 166 17 -82 -42
3796 -42 179 54 -88 -22 -102 62 229 56 156 134 -4 26 113 17 77 259 -107 48 13 -329 25 107 -114
3819 -114 -139 -34 66 -171 -238 -203 -207 51 -270 -160 -57 -116 160 78 -200 58 -21 58 -120 116 226 -198 249
3842 249 330 -26 16 30 10 112 -25 -257 -175 -3 -4 117 84 42 -167 177 -25 -139 -193 -247 -52 249 -111 -43
3866 -43 -182 -115 -201 191 -75 -89 67 320 62 -279 -83 -68 -247 116 -100 27 2 77 -3 -85 13 -162 -122 -101
3890 -101 19 -28 -89 -222 235 -222 62 32 69 4 194 59 -258 -44 111 1 298 85 181 -172 -1 91
3912 91 155 -16 -190 -158 -60 -154 -155 -117 130 24 39 123 111 -82 79 199 -66 -74 68 143 115 51 270 255 -137 72
3938 72 119 199 297 -51 180 -163 93 -22 -74 -138 -128 2 -121 -189 -140 -128 1 -212 -31 80 102 -1 -246 -24
3962 -24 -17 51 30 135 14 -110 22 121 150 27 -151 108 64 -87 55 168 62 79 22 -21 -139 126 -56 147
3986 147 -88 294 -258 -32 -30 39 187 -98 -16 226 -27 145 -97 218 211 23 192 68 33 -105 221 106
4008 106 278 -100 94 45 9 -90 -100 -3 137 -24 61 -139 -10 -207 -97 56 192 197 -145 1 -33 67 289
4031 289 241 53 -35 -36 211 -22 117 42 165 -222 137 59 -161 -35 -109 59 87 270 -280 -301 -163 -12 -22
4054 -22 -88 -101 42 -99 -289 252 -114 113 -2 -19 97 82 41 35 -35 15 71 -17 238 -319 -163 -132 -66 -27 -137
4079 -137 -59 231 -190 -85 150 -170 159 -60 -24 37 -28 60 42 68 -85 -12 -86 133 258 -15 -270 73 12
4102 12 -88 175 -109 -226 -93 -49 -15 -116 225 -125 -315 -101 92 23 364 -97 1 123 -144 -55 -76 325
4124 325 -63 140 345 65 186 -108 -121 2 68 -30 96 -17 -18 -23 -25 -349 277 30 -53 -182 -142 -232 69 -34
4148 -34 -77 -38 -36 13 -15 146 38 -28 3 39 7 53 147 8 -275 -78 43 61 203 -84 -6 112 -56 -248 -174
4173 -174 -10 -102 31 -466 -121 -38 -267 183 -234 43 111 94 -69 151 96 -3 -40 -49 123 78 -60 231 89
4196 89 -142 -136 60 -75 -48 27 -149 -101 -143 -187 -47 -107 86 33 -276 -42 204 -120 -86 -150 148 52 78 -56 214
4221 214 -13 22 157 81 80 59 143 105 80 -80 -199 132 213 -41 121 114 -187 -82 -362 202 195 61 -214 -114
4245 -114 12 -76 -74 210 203 107 73 -81 -74 358 273 129 59 44 80 105 127 164 73 -117 106 104 91 226 -107 -84 -202
4272 -202 -32 -193 -81 41 39 -42 -128 -158 -162 5 -117 -137 306 -147 215 324 21 236 125 -199 19 -27 -125
4295 -125 76 70 5 72 11 -381 34 -115 134 -63 -18 -67 -102 212 -49 -179 -145 -133 174 -21 108 170 89 231
4319 231 -42 95 39 -34 -37 -167 -59 -74 129 -149 -69 53 -36 -180 -61 2 -185 47 -21 -241 124 -392 -250
4342 -250 70 -111 -185 42 -23 51 41 134 -71 310 141 258 185 -33 76 110 149 -95 16 -37 -80 -201 141
4365 141 -3 -63 -31 -18 -363 -111 -113 -303 -74 -60 7 99 -132 -223 -100 28 86 -1 -2 -84 -16 -107 369 77 176 229
4391 229 9 -88 -19 55 -209 -103 103 -93 -67 -230 -231 -17 -213 63 97 -139 -169 151 42 93 -52 189 61
4414 61 -83 -194 -14 -90 144 -66 -5 19 180 24 -35 -112 156 -111 23 153 74 29 -75 4 -99 -107 -319 49
4438 49 -194 105 53 58 -82 -13 -121 -19 31 44 75 73 -3 63 224 -39 199 332 174 -172 -154 432 119 -34
4462 -34 -83 162 -202 -118 -149 -243 -11 135 -284 -336 -92 -135 58 -73 165 34 144 -113 46 -34 -162 90 -91
4485 -91 24 168 -19 275 90 -49 273 100 14 -48 30 -242 -234 -159 -39 -113 -79 -74 -137 -161 -134 -126 83 86 -11 27 125
4512 125 107 42 72 114 -156 -39 134 -121 179 -129 126 10 96 -153 -75 27 -63 25 33 -160 -22 102 -225
4535 -225 -182 72 -23 51 -59 -179 133 237 173 54 31 -46 206 52 174 72 102 126 196 -164 -207 568 -49
4558 -49 -276 44 -135 -327 158 -50 82 -92 -116 148 -88 -97 -76 -192 -111 36 -191 -82 -23 -184 52 71 305
4581 305 153 135 85 -153 -2 -148 7 -66 106 190 -11 46 -173 2 -92 -37 195 -138 -3 -82 20 -57 34
4604 34 58 -111 -43 -99 161 144 197 -22 222 -194 174 -140 3 87 -11 96 -11 -16 132 232 -94 -94 -149 -180 -310
4629 -310 -88 -166 -126 -68 105 116 22 12 23 280 207 314 174 168 112 140 39 111 -11 126 -55 -119 -39 -53 -183
4654 -183 -251 172 109 -90 -209 53 -22 -356 178 97 -59 -140 118 -94 -212 -146 -208 -88 93 -32 222 285 94
4677 94 16 172 -99 47 -15 413 27 -196 28 -63 -30 -153 -53 -358 -155 60 -173 34 160 -293 -196 -87
4699 -87 218 -112 103 -87 98 -85 430 81 -12 204 198 124 91 -13 111 29 64 -23 -110 89 -91 -3 -137 69
4723 69 -263 -109 -163 -92 -122 -91 82 -195 -97 -4 -314 -110 46 -78 -42 -28 -37 226 197 92 71 37 193 -145 75
4748 75 72 57 -60 -155 99 -89 -38 -74 -233 -111 -230 -255 39 -166 65 187 39 100 -38 33 76 -13 323 147
4772 147 -85 -84 144 123 86 -18 -151 18 -5 -49 -137 -101 -34 -291 -258 61 -243 226 -19 -62 29 2 13 -18 -16 -294
4798 -294 -189 -51 24 80 -86 -137 -144 179 -104 106 -17 249 123 -257 -18 -148 38 17 257 -106 -112 -85 -67
4821 -67 -48 -185 -43 -121 30 -2 -321 -195 -57 -33 202 231 -139 -45 180 181 -10 145 -217 148 179 -51 -122 -244
4845 -244 131 8 33 -47 33 -239 -24 -36 -150 -119 -483 -61 -203 57 -216 0 172 70 95 7 251 53
4867 53 -290 -92 145 -107 117 140 106 224 -360 33 -58 -184 -100 2 -251 -38 55 -38 -11 2 -234 68 -74
4890 -74 -3 38 117 -8 -14 128 185 -277 269 -215 55 -62 226 -16 -103 139 155 76 -129 130 -285 -32 -124 110
4914 110 -57 54 -146 -128 -209 -247 -152 128 -128 215 52 97 158 -78 61 109 -47 77 126 86 175 -62 -83 -82
4938 -82 180 191 88 42 -66 -28 33 57 -75 -141 -291 157 5 161 -152 7 -42 -151 115 -168 -373 -252 5
4961 5 208 -42 108 110 273 174 172 -62 70 75 -74 -82 193 -9 99 -8 160 56 8 -84 -136 -78 -67 16 239 -293
4987 -293 5 -235 38 82 87 -193 59 46 207 -62 198 30 -75 -135 -182 11 -47 -32 -67 -151 47 -70 -168 -10
5011 -10 86 37 83 -26 -187 114 -118 -81 -182 -94 -21 -2 8 -42 260 159 -84 -165 -196 69 249 366 91 58
5035 58 -177 -121 366 -50 -46 132 78 -13 299 7 214 -43 -164 -126 104 116 11 269 -11 -13 -75 -78 -9 118 155
5060 155 213 270 -86 85 113 -127 20 263 -123 -138 -110 -7 -159 -39 -101 -3 167 63 -91 113 -96 -42 -138
5083 -138 187 89 -189 7 -252 -185 48 63 214 38 114 13 124 11 63 114 263 96 66 -81 -36 154 -227
5106 -227 -46 54 52 -5 -24 109 -142 -125 -168 -230 -122 -82 28 133 102 -86 -171 -152 144 214 108 194 -48 -111 234
5131 234 228 119 -110 -11 -242 112 194 -293 -181 -43 -180 -131 -100 -7 -29 75 41 117 -161 -7 170 72 198 119
5155 119 29 52 44 101 -117 179 -89 97 -197 164 279 -69 -53 -82 132 -34 6 -121 -142 -134 -109 -33 -152 -25
5179 -25 -86 191 -171 71 -12 82 81 129 -150 -323 39 119 94 12 5 67 -53 118 157 49 -56 -78 -80 -99 5 8 -163
5206 -163 -90 90 -4 25 67 -171 -129 182 -80 -88 -90 -175 136 -134 412 161 5 130 23 -192 -110 117 -186 -93
5230 -93 194 53 16 2 -210 162 -94 -13 -26 -196 -106 -336 -133 -49 -8 -48 -236 45 -32 -100 -4 -299 -137 -41
5254 -41 87 186 -40 -147 146 225 -43 267 -92 -97 161 188 -110 123 -197 -145 -154 -3 -64 -236 -213 -19 -97 -21
5278 -21 -129 35 -89 -201 180 -333 101 -56 -110 17 29 45 188 -117 102 -21 148 171 -36 -159 -161 -177 88
5301 88 89 -216 -21 -72 -206 -287 -101 -227 -101 232 -261 389 -162 105 -25 86 -257 128 156 73 289 15
5323 15 149 255 66 -242 -136 0 -141 -133 -35 -249 65 66 -406 -39 -310 254 -37 -14 -119 -113 -94 -283 -51
5346 -51 -72 91 112 -15 184 214 64 103 -158 -28 24 27 124 -157 -74 62 -135 -73 -157 -53 -7 -152 -37 -35 13
5371 13 -20 163 -80 63 230 85 352 2 234 266 63 -65 20 161 63 -125 -82 78 -143 -10 37 255
5393 255 32 -197 -91 20 101 -319 105 -188 109 -66 -7 304 22 29 140 191 -38 52 -21 -141 -14 49 109
5416 109 80 133 -149 -200 -22 52 123 -35 1 94 65 231 -316 97 -46 17 -76 115 -117 -102 -222 -153 108 -116
5440 -116 -17 105 60 4 -101 10 152 76 -221 141 31 27 -1 77 -161 -139 227 68 -154 -8 42 -113 26
5463 26 -198 14 -90 -146 2 -365 -80 -97 -164 -98 284 -27 60 -38 40 39 13 -143 -46 91 141 -6 -110 3
5487 3 -67 -16 68 -300 153 -193 -3 250 -175 -337 -105 -64 -109 7 -28 -73 -202 31 -151 37 139 77 115 -95
5511 -95 -35 -151 157 -247 37 26 -26 -27 -70 -33 -88 49 91 151 121 -182 101 52 -17 -57 -175 151 4 57 98 55
5537 55 133 92 -108 -261 -174 -56 20 -105 -156 -86 -58 -99 190 -81 287 57 90 35 -57 -14 -261 141 -84 25
5561 25 -261 -26 -203 -70 -58 -125 -55 -83 44 -138 -12 101 151 73 54 -56 211 254 248 -287 2 105 -136 34
5585 34 -21 -48 -26 150 -273 -102 198 -454 -177 -22 181 64 -96 -20 -180 94 72 85 -57 76 -132 -77 -150
5608 -150 -44 -269 -184 285 146 -178 153 -13 -255 -59 50 -295 83 124 -45 -34 -129 -83 -30 55 -33 218 -239
5631 -239 -53 22 -126 -55 -114 59 -119 -98 -143 -121 107 220 57 158 149 48 11 -43 9 -15 -252 -148 -125 121
5655 121 39 -61 55 -33 125 -44 -135 -103 51 -135 20 -337 -34 -63 151 -46 17 199 -95 -26 83 173 27
5678 27 -51 -88 -216 129 59 -94 48 70 118 -193 22 199 35 -86 75 -120 -341 -90 -52 -38 -20 -6 -42 78
5702 78 39 181 93 4 -348 82 114 -47 19 90 -290 -88 -57 -25 137 -131 28 1 -269 -237 -109 -57 23 -24 43
5727 43 32 59 -114 -93 -94 23 -153 -173 -27 -33 55 111 119 -4 -104 257 -15 200 -115 -82 -5 85 -88 44 169
5752 169 -15 -255 -117 -194 2 198 166 -114 45 -32 -149 -223 -176 -227 -119 23 -102 -34 59 -105 196 154 -199
5775 -199 -79 10 -63 29 -72 -107 -69 58 -81 -69 155 136 -124 -89 -120 161 18 35 -7 163 140 -431 -208 -46
5799 -46 -159 -101 56 16 -66 -159 14 -65 48 -252 60 -141 25 -85 -149 -4 11 -31 -192 -117 24 -242 -307 -56
5823 -56 206 -14 -137 -232 -289 141 130 238 99 182 -99 -136 -78 82 58 1 209 116 -88 -25 238 -60 130 108
5847 108 5 -97 -205 -154 43 -96 258 85 -31 -59 75 -126 247 94 257 -234 -57 42 105 -4 -138
5868 -138 41 19 -127 -37 64 -202 129 73 -223 98 10 68 -259 53 -153 55 -2 -36 37 -20 -3 33 -127 11
5892 11 42 161 134 -23 -11 -71 -39 -34 -63 -48 -182 50 -62 122 -76 -37 57 218 13 -117 132 41 -30 -45 75
5917 75 -209 -106 -126 40 255 44 65 68 -58 -73 93 -342 -13 -168 -8 173 231 -63 206 176 -151 -11 -186
5940 -186 -163 -139 -115 -24 41 -246 96 172 19 -132 269 0 -147 28 -204 56 -15 -160 141 93 59 -43 227
5963 227 -56 -44 151 42 -39 20 -113 282 -90 -66 121 229 160 203 -79 -19 -167 -257 -209 65 -30 -121 64 -122
5987 -122 -83 -190 99 432 266 7 -42 -89 145 -26 138 233 -138 -349 42 97 134 -146 -215 137 -139 -24
6009 -24 -102 -205 84 -130 102 46 -154 -168 -33 133 -227 -53 -45 14 106 172 31 76 147 140 -77 -165 192 127 14
6034 14 85 69 211 -220 -74 -4 -209 -132 41 106 -86 65 -246 1 -255 31 235 -103 18 113 -26 -183
6056 -183 97 -144 217 -201 -9 320 82 21 0 -132 -21 -92 157 88 185 -89 62 119 -41 15 94 -40 20
6079 20 -173 -334 81 -86 -226 -56 102 90 31 173 23 330 -103 149 131 81 98 75 -231 -206 -64 225 -20
6102 -20 -135 -165 -179 -189 -133 29 -99 -299 -15 104 120 165 -159 -164 154 140 19 133 44 -12 80 -32 200 94
6126 94 230 -84 -60 41 324 7 12 -122 1 -21 11 -10 -48 105 -98 -63 75 -116 -124 241 183 -19 229 11
6150 11 55 -30 190 -11 139 -165 -258 301 51 280 90 -126 -73 -157 8 -125 -168 -119 140 13 -245 52 49
6173 49 -24 -47 164 204 183 111 302 -66 -46 235 -88 -44 49 -32 -49 33 -65 66 -69 -21 -43 -29 -76 -12 -35 -42 -11
6200 -11 5 -46 121 -108 -149 -92 91 -73 96 13 -87 17 109 -190 68 -35 -41 -130 44 24 5 236 21 -34
6224 -34 -45 27 26 -65 -26 38 16 -39 -339 54 -110 -87 271 158 -115 -83 255 -152 -432 -184 -81 195 20 8
6248 8 118 111 224 19 -215 8 -22 114 57 67 97 -96 178 -10 167 47 -53 -73 41 118 -82 89 67 -86
6272 -86 -171 78 66 -32 -56 194 -140 263 74 -27 26 -25 -137 -369 -39 3 -59 88 29 -70 -407 -23 -88 137
6296 137 -95 -103 -115 195 128 93 25 113 -123 124 57 -376 17 199 -216 -53 -21 92 220 32 164 -89 -84 56
6320 56 173 170 17 -75 -93 174 -247 -74 186 17 -175 -13 95 98 109 -133 124 -130 -219 -79 -30 -183 -35
6343 -35 -106 60 105 -62 -52 -18 94 -53 17 -47 -347 -36 -83 302 101 -10 -23 43 -114 96 -147 -7 -193
6366 -193 -24 18 -70 80 -241 -76 -84 51 48 65 28 95 -293 108 -78 56 9 164 105 -160 84 229 -77 -41
6390 -41 142 189 -51 -62 6 -148 -65 65 -2 -215 69 -65 127 -145 -228 12 78 -53 -11 -90 -16 -97 30 -123
6414 -123 -96 70 -122 -118 24 58 -170 -269 101 -87 18 -146 122 -155 281 -31 176 14 -204 117 49 -23
6436 -23 411 228 -401 -252 -117 156 -9 -77 -72 -66 143 57 -76 221 -3 -128 -31 -50 -32 -99 -97 0 -65 110 84
6461 84 204 112 -236 10 -36 -132 137 -69 -34 -201 37 38 70 345 32 -174 -61 80 216 108 -1 -48 -17
6484 -17 -26 -24 75 -76 7 144 252 114 -72 -166 110 24 -112 65 -62 112 -300 117 162 69 106 111 -329 122 -51
6509 -51 -49 285 53 233 62 -113 -105 -221 77 -130 64 91 -34 -69 -313 -25 212 -33 12 7 -247 -132 -133 -107
6533 -107 10 25 -1 -186 -233 217 81 90 37 -134 -263 -80 102 83 84 122 60 6 30 18 -339 15 -87 25 -258
6558 -258 15 -40 32 103 -89 -67 -196 -306 102 -79 72 311 -243 -13 212 -36 174 189 -118 -138 39 120
6580 120 66 -185 3 51 -368 -103 26 34 -68 15 -255 -97 0 -190 -160 13 -216 -23 -144 39 -199 -37
6602 -37 -235 58 59 -138 -29 20 204 42 112 217 138 -198 -97 83 84 -53 65 -28 -10 -54 44 -139 -81 40
6626 40 96 -128 -31 3 -127 -170 84 40 37 57 -62 -198 30 18 7 -130 -51 72 -79 0 8 41 185 141 122 -21
6652 -21 61 -14 90 -128 57 -42 36 95 38 -11 -274 -76 95 -58 -58 112 -72 -34 61 12 127 177 -10 -98 -148
6677 -148 -105 -127 -148 -16 95 115 145 -61 98 -106 -340 184 154 -372 -262 -28 71 -290 -114 86 -292 -273 -324
6700 -324 -37 60 147 20 5 74 195 -60 103 -78 168 37 164 -104 16 62 -221 -62 -38 21 116 107 63 -21
6724 -21 -90 -39 -80 -188 -48 4 -137 -68 237 -31 35 63 42 201 -14 37 49 -5 87 -91 -41 23 -22 -192 -243 -188
6750 -188 95 -82 117 -216 112 -52 -81 -82 48 15 -112 -27 -219 -123 -91 -30 89 -63 -96 90 -51 226 165
6773 165 146 101 61 -133 94 -195 237 -33 81 219 57 -12 54 60 47 -73 -63 -200 -203 -75 -14 35 174 232 -70
6798 -70 -109 4 280 2 -57 208 232 -284 135 87 -186 -139 -80 -267 11 -36 100 -35 -197 -87 -155 -59 -73 -34
6822 -34 -95 -168 69 -147 -209 266 17 247 -54 32 -216 54 7 -126 -91 -4 296 69 -161 -230 39 -117 -94
6845 -94 105 131 10 -127 203 -45 -57 -226 -243 61 12 27 33 -15 -212 -26 -13 2 238 147 -127 112 -176 -30
6869 -30 93 -26 16 321 -71 111 -126 -12 183 -300 123 -159 44 -26 103 174 -206 124 25 58 5 -175
6891 -175 22 49 63 -63 -151 -227 -157 -258 -86 48 13 -26 169 46 -56 148 194 138 35 -142 163 129 -50
6914 -50 11 -92 209 92 -174 -95 160 -172 15 180 105 -73 91 1 85 18 62 -88 43 -50 -101 68 68 6
6938 6 83 -175 6 272 77 -313 -162 -160 -8 -118 -173 184 49 -106 160 -183 341 437 -168 -318 162 36
6960 36 122 -90 67 -119 62 17 155 230 56 51 -227 82 -164 195 10 -52 -37 -106 -227 17 161 2 186
6983 186 19 -376 -111 -138 -211 -279 63 47 -268 23 15 -19 -11 -16 -34 55 149 -101 -10 129 5 205 -84 -102 110
7008 110 170 142 -68 37 -42 100 29 152 -185 -128 214 -98 -37 -179 171 -163 -56 -139 95 97 94 -61 124 -27
7032 -27 -194 58 174 84 87 -103 -44 -59 63 148 179 -96 -51 -32 57 -237 181 117 -1 -120 -186 -25 -196 86
7056 86 -103 -53 -1 71 135 193 112 -63 -238 -202 5 -17 218 9 236 24 164 196 -386 -268 -200 -9 -51 -18
7080 -18 48 228 4 -120 201 -17 62 221 -27 -66 68 -185 -52 230 11 189 91 136 195 169 7 -66 170
7103 170 -138 -60 -82 212 -77 32 13 55 201 -218 65 -255 -101 42 7 -239 -186 -19 -70 112 -140 31
7125 31 181 -108 201 79 -17 16 52 -5 110 -49 53 -268 -196 -107 23 32 5 12 -94 112 -67 104 -1 -80
7149 -80 56 -15 -134 41 86 121 -26 -17 -220 -99 -171 35 38 58 9 -68 118 -366 159 73 -95 -50 34 -196 141
7174 141 52 104 -78 43 -102 -33 -59 88 48 36 -73 -235 -78 40 -14 226 118 -62 -23 135 225 303 6
7197 6 0 -293 35 227 14 -20 -56 -191 129 30 -66 88 -94 -232 56 -64 -68 -32 58 133 -18 21 -25 -15 -93 80
7223 80 10 125 -53 -233 90 132 97 66 -223 28 0 -195 -21 -249 -55 -94 -187 70 197 -80 -33 87 9
7246 9 24 -11 249 -15 -11 -3 220 193 144 -61 117 93 175 238 -235 -21 137 2 24 293 -95 24 -15 -73 65
7271 65 -44 -71 103 180 259 171 -26 -231 31 161 199 -170 51 -25 108 -57 11 -162 0 -145 96 -138 -21
7294 -21 197 -25 209 248 21 19 -277 127 139 132 119 -125 -42 85 -37 40 58 141 310 198 -17 141 -169 130
7318 130 283 -199 121 126 -61 103 248 57 -119 -255 10 -196 255 -144 53 -7 -60 217 -155 -17 67 65
7340 65 41 10 70 123 -41 36 34 -80 -200 16 -226 38 167 100 43 -74 -92 117 55 -186 -126 284 -111 13
7364 13 59 -141 -71 -105 -179 -92 145 -128 -18 -102 154 315 -67 52 -165 -133 -229 160 362 239 -254 -121 -28
7387 -28 63 34 -25 82 -81 -215 247 84 45 -84 -162 102 -123 406 55 82 51 56 -163 -65 -208 119 35 108
7411 108 -176 61 -142 -263 -134 2 -170 -39 -154 -85 210 -131 95 52 15 -51 -68 -44 -36 98 -71 -7 183
7434 183 37 64 8 -80 8 -118 90 217 153 -243 -57 288 -122 115 -33 -75 34 31 195 68 22 -88 -264
7457 -264 -12 -182 65 2 -107 -139 -59 26 190 -155 167 180 193 -8 -291 174 -426 -105 11 58 -104 60
7479 60 105 45 -104 -54 -17 136 109 31 -43 -65 71 101 103 66 -134 -1 84 -159 32 115 11 99 -122 -109 167 89
7505 89 -118 23 43 -124 61 -16 -313 168 -16 47 -47 454 127 177 316 -99 -90 210 -75 -14 -106 -106 132 8
7529 8 -65 -41 -158 -256 -61 -253 102 187 67 211 -83 -100 50 106 -10 -14 -124 -230 22 -33 124 188 31 -92
7553 -92 196 78 78 143 23 148 -106 -262 -168 -26 -51 -120 213 188 140 -86 119 56 -296 24 -105 8 37 191
7577 191 -161 -154 115 -234 112 1 -145 225 171 -196 71 -58 4 -89 -172 217 176 -377 198 -114 -72 211 -54
7600 -54 -51 -142 -116 -47 167 2 236 -20 -168 65 84 13 -133 -154 155 132 -20 -18 103 -75 -34 46 -222 -117 22
7625 22 108 -57 -18 45 105 1 -38 365 -138 79 176 120 22 -215 97 70 14 85 -90 133 48 -136 -45 65 -103
7650 -103 -47 120 161 -75 -98 -253 -5 77 17 -5 -104 93 -108 52 88 139 -6 46 179 111 22 -240 -57 -31
7674 -31 -112 -35 47 64 156 244 36 248 -306 78 88 12 69 -125 -9 -43 58 -158 56 -150 76 64 -219 246
7698 246 -102 145 -47 -145 -32 105 -79 54 161 59 298 -17 157 -49 5 305 27 149 -76 124 -41
7719 -41 25 257 -16 -228 -248 -221 90 -126 -69 162 9 -121 -10 -222 -213 60 15 -66 -231 -179 -55 112 48 -151
7743 -151 104 417 37 241 -260 -3 56 153 147 -12 387 166 9 -211 10 -193 78 -13 -120 -172 -212 3
7765 3 124 122 -162 192 50 -3 309 73 -88 178 -37 -16 159 66 137 -174 44 68 -177 21 75 -186 55
7788 55 -82 12 -234 139 92 168 -16 149 -170 -179 -167 65 -158 6 28 3 -65 -234 -300 25 -26 64 128 46 -111
7813 -111 273 227 186 242 116 127 296 210 -247 -132 -350 -224 -34 -76 211 -234 -35 68 -31 171 -104 31
7835 31 -102 -81 58 -31 15 -84 29 -260 148 136 -29 -38 -342 -12 -364 -148 346 128 -59 126 -57 5 75
7858 75 50 -165 -83 -55 -75 196 58 65 -11 -76 46 120 118 56 -166 -59 171 -141 85 -162 -88 -61 141 136 -161 -113
7884 -113 252 10 -20 61 -187 102 53 78 -183 -147 192 100 -153 -132 19 158 -87 -25 -107 -12 -187 -132 23 240
7908 240 234 -35 28 53 182 43 109 -208 -67 -45 -99 -159 74 217 -110 -7 30 -94 32 52 -330 -68 78
7931 78 -36 39 -123 13 3 73 110 -33 -88 20 106 -18 -30 221 -161 127 87 90 -38 63 -147 -211 -317 -96
7955 -96 -266 -117 41 181 156 175 18 21 -121 -34 26 -104 -154 74 83 -78 86 186 -113 143 62 -25 31 -75
7979 -75 223 -44 151 120 -146 -76 -6 -4 87 -33 -89 119 106 259 -40 3 -123 -100 -59 47 124 33 -57 -122 -151 -64
8005 -64 -71 178 46 134 97 105 -107 140 63 18 -36 -284 -253 -146 -87 65 -200 65 86 -267 -19 -113 41 7 12 127
8031 127 -2 58 31 -9 105 -178 -53 -140 251 -127 98 24 -23 148 104 71 -57 59 -16 47 -197 -194 -136 22
8055 22 51 -75 179 -56 -34 -70 139 87 81 165 -103 -68 216 -8 188 -135 -122 -189 -87 -96 -81 57 -35 90 -15
8080 -15 -241 87 -181 -140 -163 14 116 58 18 13 134 12 -18 87 3 92 220 -135 239 78 192 27 85 -158
8104 -158 84 116 -227 -19 -233 65 -74 147 34 -201 -59 87 -77 27 54 -237 -210 -206 -384 6 -133 -39
8126 -39 135 124 -1 86 -29 -125 -44 -174 231 -17 138 -236 -18 150 165 159 45 -138 39 -75 -39 -5 -22 173
8150 173 -9 25 27 -40 165 -27 81 185 -202 -11 -74 -82 -70 -117 -24 331 -221 -56 94 -55 -8 -123 241 -151
8174 -151 45 117 165 -60 -109 48 90 57 50 59 -249 -170 -296 147 -69 -58 235
8191B35
##END NTUPLES=NMR FID
##END=
