##TITLE=1H_SRM-146.oil
 CDCl3
 8 sc, 
 11.5.2023
##JCAMPDX= 6.0         $$ Bruker NMR JCAMP-DX V2.0
##DATA TYPE= NMR FID
##DATA CLASS= NTUPLES
##ORIGIN= UXNMR, Bruker Analytische Messtechnik GmbH
##OWNER= root
$$ XWIN-NMR		Version 3.5
$$ Thu May 11 14:02:10 2023 Russian Standard Time (UT+4h)  she@DPX200
##.OBSERVE FREQUENCY= 200.13135
##.OBSERVE NUCLEUS= ^1H
##.DELAY= (6, 6)
##.ACQUISITION MODE= SIMULTANEOUS
##.ACQUISITION SCHEME= undefined
##.AVERAGES= 8
##.DIGITISER RES= 18
##SPECTROMETER/DATA SYSTEM= spect
##.PULSE SEQUENCE= zg30
##.SOLVENT NAME= CDCl3
##.SHIFT REFERENCE= (INTERNAL, CDCl3, 0, 15.7039)
##AUDIT TRAIL= $$ (NUMBER, WHEN, WHO, WHERE, WHAT)
$$ ##TITLE= Audit trail, XWIN-NMR		Version 3.5
$$ ##JCAMPDX= 5.01
$$ ##ORIGIN= Bruker BioSpin GmbH
$$ ##OWNER= she
$$ F:/spectra/data/she/nmr/H-F/1/audita.txt
$$ ##AUDIT TRAIL=  $$ (NUMBER, WHEN, WHO, WHERE, WHAT)
(   1,<2023-05-11 14:00:57.98 +0400>,<she>,<DPX200>,
      <created by zg, POWCHK disabled, PULCHK disabled
       configuration hash MD5:
       00 E9 B6 7A A2 85 ED C7 34 08 36 98 17 FE 4E 26
       data hash MD5: 16K
       50 A9 59 B7 B9 BF 42 2F FD 54 EF 52 1B 65 AE 88>)
$$ ##END=
$$ 
$$ hash MD5
$$ 05 26 82 63 29 90 07 62 FD B1 9E E7 F3 9E 53 D6
##$RELAX= 
##$RELAX= 
##$RELAX= 
##$RELAX= 
##$RELAX= 
##$RELAX= 
$$ Bruker specific parameters
$$ --------------------------
##$DU= <F:/spectra>
##$EXPNO= 1
##$NAME= <H-F>
##$PROCNO= 1
##$TYPE= <nmr>
##$USER= <she>
##$AMP= (0..31)
100 100 100 100 100 100 100 100 100 100 100 100 100 100 100 100 100 100 
100 100 100 100 100 100 100 100 100 100 100 100 100 100 
##$AQSEQ= 0
##$AQ_mod= 1
##$AUNM= <au_zg>
##$AUTOPOS= <>
##$BF1= 200.13
##$BF2= 200.13
##$BF3= 200.13
##$BF4= 200.13
##$BF5= 200.13
##$BF6= 200.13
##$BF7= 200.13
##$BF8= 200.13
##$BYTORDA= 1
##$CFDGTYP= 0
##$CFRGTYP= 5
##$CHEMSTR= <none>
##$CNST= (0..31)
1 1 145 1 1 1 1 1 1 1 1 1 1 1 1 1 1 1 1 1 1 1 1 1 1 1 1 1 1 1 1 1 
##$CPDPRG= <>
##$CPDPRG1= <>
##$CPDPRG2= <>
##$CPDPRG3= <>
##$CPDPRG4= <mlev>
##$CPDPRG5= <mlev>
##$CPDPRG6= <mlev>
##$CPDPRG7= <mlev>
##$CPDPRG8= <mlev>
##$CPDPRGB= <>
##$CPDPRGT= <>
##$D= (0..31)
0 1.2 0 0 0 0 0 0 0 0.06 0 0.03 0 0 0 0 0.0002 0 0 0 0 0 0 0 0 0 0 0 0 
0 0 0 
##$DATE= 1683799257
##$DBL= (0..7)
120 120 120 120 120 120 120 120 
##$DBP= (0..7)
150 150 150 150 150 150 150 150 
##$DBP07= 0
##$DBPNAM0= <>
##$DBPNAM1= <>
##$DBPNAM2= <>
##$DBPNAM3= <>
##$DBPNAM4= <>
##$DBPNAM5= <>
##$DBPNAM6= <>
##$DBPNAM7= <>
##$DBPOAL= (0..7)
0.5 0.5 0.5 0.5 0.5 0.5 0.5 0.5 
##$DBPOFFS= (0..7)
0 0 0 0 0 0 0 0 
##$DE= 6
##$DECBNUC= <off>
##$DECIM= 32
##$DECNUC= <off>
##$DECSTAT= 4
##$DIGMOD= 1
##$DIGTYP= 9
##$DL= (0..7)
0 120 120 120 120 120 120 120 
##$DP= (0..7)
150 150 150 150 150 150 150 150 
##$DP07= 0
##$DPNAME0= <>
##$DPNAME1= <>
##$DPNAME2= <>
##$DPNAME3= <>
##$DPNAME4= <>
##$DPNAME5= <>
##$DPNAME6= <>
##$DPNAME7= <>
##$DPOAL= (0..7)
0.5 0.5 0.5 0.5 0.5 0.5 0.5 0.5 
##$DPOFFS= (0..7)
0 0 0 0 0 0 0 0 
##$DQDMODE= 0
##$DR= 18
##$DS= 0
##$DSLIST= <SSSSSSSSSSSSSSS>
$$ [...]
##$SUBNAM2= <"">
##$SUBNAM3= <"">
##$SUBNAM4= <"">
##$SUBNAM5= <"">
##$SUBNAM6= <"">
##$SUBNAM7= <"">
##$SUBNAM8= <"">
##$SUBNAM9= <"">
##$SW= 18.05172834244
##$SWIBOX= (0..15)
0 0 2 0 0 0 0 0 0 0 0 0 0 0 0 0 
##$SW_h= 3612.71676300578
##$TD= 16384
##$TD0= 1
##$TE= 0
##$TE2= 300
##$TE3= 300
##$TEG= 300
##$TL= (0..7)
0 120 120 120 120 120 120 120 
##$TP= (0..7)
150 150 150 150 150 150 150 150 
##$TP07= 0
##$TPNAME0= <>
##$TPNAME1= <>
##$TPNAME2= <>
##$TPNAME3= <>
##$TPNAME4= <>
##$TPNAME5= <>
##$TPNAME6= <>
##$TPNAME7= <>
##$TPOAL= (0..7)
0.5 0.5 0.5 0.5 0.5 0.5 0.5 0.5 
##$TPOFFS= (0..7)
0 0 0 0 0 0 0 0 
##$TUNHIN= 0
##$TUNHOUT= 0
##$TUNXOUT= 0
##$USERA1= <user>
##$USERA2= <user>
##$USERA3= <user>
##$USERA4= <user>
##$USERA5= <user>
##$V9= 5
##$VALIST= <valist>
##$VCLIST= <CCCCCCCCCCCCCCC>
##$VD= 0
##$VDLIST= <DDDDDDDDDDDDDDD>
##$VPLIST= <PPPPPPPPPPPPPPP>
##$VTLIST= <TTTTTTTTTTTTTTT>
##$WBST= 1024
##$WBSW= 4
##$XGAIN= (0..3)
0 0 0 0 
##$XL= 0
##$YL= 0
##$YMAX_a= 132741
##$YMIN_a= -147312
##$ZGOPTNS= <>
##$ZL1= 120
##$ZL2= 120
##$ZL3= 120
##$ZL4= 120
##$ABSF1= 10
##$ABSF2= 0
##$ABSG= 5
##$ABSL= 3
##$ALPHA= 0
##$AQORDER= 0
##$ASSFAC= 0
##$ASSFACI= 0
##$ASSFACX= 0
##$ASSWID= 0
##$AUNMP= <proc_1d>
##$AZFE= 0.1
##$AZFW= 0.1
##$BCFW= 1
##$BC_mod= 2
##$BYTORDP= 1
##$COROFFS= 0
##$CY= 11.3945322036743
##$DATMOD= 1
##$DC= 2
##$DFILT= <>
##$DTYPP= 0
##$F1P= 15.7292609196834
##$F2P= 12.9074282941183
##$FCOR= 0.5
##$FTSIZE= 0
##$FT_mod= 4
##$GAMMA= 1
##$GB= 0.15
##$INTBC= 1
##$INTSCL= 1
##$ISEN= 128
##$LB= 0.24
##$LEV0= 0
##$LPBIN= 0
##$MAXI= 10000
##$MC2= 0
##$MEAN= 0
##$ME_mod= 0
##$MI= 1.114404
##$NCOEF= 0
##$NC_proc= 0
##$NLEV= 6
##$NOISF1= 3.799351
##$NOISF2= 2.8
##$NSP= 1
##$NTH_PI= 0
##$NZP= 0
##$OFFSET= 15.70392
##$PC= 1
##$PHC0= -19827.09
##$PHC1= 13.2008
##$PH_mod= 1
##$PKNL= yes
##$PPARMOD= 0
##$PSCAL= 0
##$PSIGN= 0
##$REVERSE= no
##$SF= 200.130013532006
##$SI= 16384
##$SIGF1= 3
##$SIGF2= 2
##$SINO= 400
##$SIOLD= 16384
##$SREGLST= <1H.CDCl3>
##$SSB= 0
##$STSI= 0
##$STSR= 0
##$SW_p= 3612.71676300578
##$SYMM= 0
##$S_DEV= 0
##$TDeff= 0
##$TDoff= 0
##$TI= <>
##$TILT= no
##$TM1= 0
##$TM2= 0
##$TOPLEV= 0
##$USERP1= <user>
##$USERP2= <user>
##$USERP3= <user>
##$USERP4= <user>
##$USERP5= <user>
##$WDW= 1
##$XDIM= 8192
##$YMAX_p= 0
##$YMIN_p= 0
$$ End of Bruker specific parameters
$$ ---------------------------------
##NTUPLES= NMR FID
##VAR_NAME=  TIME,          FID/REAL,        FID/IMAG
##SYMBOL=    X,             R,               I
##VAR_TYPE=  INDEPENDENT,   DEPENDENT,       DEPENDENT
##VAR_FORM=  AFFN,          ASDF,            ASDF
##VAR_DIM=   8192,          8192,            8192
##UNITS=     SECONDS,       ARBITRARY UNITS, ARBITRARY UNITS
##FACTOR=    0.0002768,     1,               1
##FIRST=     0,             0,               0
##LAST=      2.2672688,     0,               0
##MIN=       0,             -147312,         0
##MAX=       2.2672688,     132741,          0
$$ Real data points
##PAGE= N=1
##DATA TABLE= (X++(R..R)), XYDATA
0 0 0 0 0 0 0 0 0 0 0 0 0 0 -8 8 -8 8 -8 16 -16 19 -24 32 -32 40 -48 56 -64 73 -88 97 -112 128 -145 166
34 166 -186 209 -235 265 -296 331 -367 407 -453 502 -555 613 -677 746 -822 906 -999 1099
52 1099 -1213 1337 -1478 1636 -1816 2022 -2260 2544 -2883 3298 -3818 4498 -5422 6760 -8884
67 -8884 12781 -22339 99773 76945 -44299 90579 37483 -40881 41847 81547 -39712 -19511
79 -19511 24405 -70113 -85580 39539 4166 -88646 -39916 -26870 -112709 -54520 41418 -6991
91 -6991 -21587 62304 23286 -45893 26349 68916 6051 31959 76309 1107 -23172 58383
103 58383 41689 -15401 35551 44579 -47189 -50058 -882 -42095 -56476 6211 -13476 -67303
115 -67303 -17220 15255 -34385 -15639 42639 5766 -24824 24542 25478 -11480 25700 53862
127 53862 8827 4906 39399 9996 -18331 15689 12222 -29807 -12851 9893 -25200 -31425 3278
140 3278 -7326 -29930 -5100 1821 -22979 -7809 16020 -6157 -11473 20098 17546 -1335 17671
153 17671 27325 4328 5391 21506 4850 -6475 10047 3110 -19464 -10171 -1810 -19273 -15535
166 -15535 3970 -7671 -19858 -1965 2359 -11901 -2224 11797 1319 107 15312 10542 3796
179 3796 18237 18552 941 4739 11891 -5070 -11781 1030 -3605 -15312 -7268 -3443 -13860 -9147
193 -9147 -752 -10681 -13307 -194 -3420 -11521 1571 10924 3858 7638 18162 12699 9137 16899
207 16899 11866 2114 7018 6843 -4650 -2869 4624 -4895 -11108 -3706 -6826 -17181 -12683 -8124 -14218
222 -14218 -13133 -5208 -5933 -4432 4784 5737 2975 9983 12378 4932 6748 13751 9809 5258 9710
237 9710 8553 3118 3558 2458 -4075 -4463 -3473 -10359 -13672 -8568 -8925 -12879 -8224 -4094 -6593 -5332
253 -5332 -343 -425 -25 5394 5928 4239 8380 11146 6442 6466 10876 7850 2936 4473 4711 77 -1314
270 -1314 -52 -3408 -5930 -4766 -7071 -9802 -7548 -6704 -8926 -6871 -1378 -1614 -3629 193 3632 1807
286 1807 1138 3093 4015 3537 4144 4780 4893 5393 5448 3782 2346 1876 346 -1635 -2359 -1955 -1840 -1972 -1787
305 -1787 5 925 -593 -2281 -990 -456 -3048 -4283 -1829 -456 -1616 -923 1119 897 718 17 -867
322 -867 -1278 -885 -975 -1607 24 2048 1766 2022 3747 4480 2338 958 1732 2187 1358 394 1178 2472 2508
341 2508 1344 424 -529 -1503 -3307 -5033 -6270 -5598 -5136 -4944 -3580 -1132 -30 -12 721 2104 2342 1412
359 1412 1485 3222 4448 3755 3924 5611 6233 3961 2201 1573 863 -1534 -3345 -3606 -3322 -4183 -4545 -3997
377 -3997 -2855 -3202 -3861 -4168 -3425 -2913 -2912 -2929 -949 2266 3045 2817 5268 7347 6141 5371 5928 4820 3165
396 3165 2252 971 -857 -1153 -914 -3050 -3608 -1523 -2821 -5401 -3888 -2628 -4312 -5721 -3164 -2121
412 -2121 -2446 -973 -8 1009 3267 4025 2552 3121 4688 2681 881 3227 3597 1345 1455 3214 1419
429 1419 -20 439 -1080 -2990 -2347 -3330 -5374 -3291 -1371 -2887 -2433 1596 2020 -203 634 1515 -522
446 -522 -894 420 -643 -266 2829 1782 -535 1955 2803 -196 -950 1419 -837 -3542 -2103 -674
462 -674 -782 1586 3244 881 312 1809 -1030 -2798 825 1481 -2194 -1950 269 -1458 -1869 2223 2562
479 2562 -781 -609 -2067 -4687 -3561 525 40 -278 2331 1567 -1237 1149 4616 3572 3500 3629 676
496 676 -1634 478 1058 595 3321 3229 -2443 -4675 -2172 -3182 -4468 -1822 -1685 -5194 -6029 -4372 -3681
513 -3681 -384 3605 1758 -434 1604 1065 -1215 2597 7064 5381 2811 4130 3329 1950 3700 4622
529 4622 2470 1888 -317 -5006 -5537 -2607 -2999 -4248 -2266 -2263 -5195 -5238 -2999 -2449 -1410 -2 -1443
546 -1443 -2252 255 1365 1384 4448 6878 5249 3746 3906 2778 1756 1869 1603 909 867 -163 -1594
563 -1594 -802 -83 -1778 -1882 -1706 -3054 -4988 -4809 -3830 -2245 -685 812 947 2006 1718 152 830
580 830 3049 2253 543 717 1394 991 1716 2773 2845 3238 1920 -487 -2113 -1207 -1390 -2074 -1375 -801 -1818
599 -1818 -1954 -1368 -879 -165 164 -1573 -2346 -1341 -1644 -1542 861 2837 1859 617 2059 1833 1249 1549
617 1549 1756 742 609 347 -220 776 2834 1735 -48 504 122 -1718 -2034 -541 -887 -2103 -2337 -1909
635 -1909 -1727 -777 -527 -878 -875 -715 -1744 -1584 374 1801 1157 1330 1890 1359 1415 2286 2592 2165 1915 285
655 285 -1027 -251 1367 777 -20 683 -106 -2187 -2189 -1166 -828 -1217 -1588 -2955 -2715 -1342 -1004 -602 1023
674 1023 1800 -273 -708 1065 1514 967 2116 2898 1789 817 1064 991 1106 1737 365 -626 -524 -555 -2250
693 -2250 -1788 131 -361 -1675 -1201 -1521 -1737 -1230 -1000 -1328 -488 -157 -1293 -1159 1115 1731 96 1111
711 1111 2206 1252 710 1490 1717 1543 1771 1279 180 996 595 -983 -764 364 -496 -1865 -947 -1084
729 -1084 -1601 -1924 -1378 -1518 -1369 -1266 -1769 -1301 -339 -599 -921 255 1108 604 469 1562 1790 1847 1904 1654
749 1654 2075 2097 1942 1067 1170 1511 756 -415 -753 -485 -1394 -2173 -1501 -1513 -1694 -2058 -2022 -1477 -1209 -1683 -1762
770 -1762 -925 -823 -506 -485 654 1534 1999 1981 2277 3080 2281 1901 1554 1694 1113 673 686 588 575 -337 -665
791 -665 -774 -1543 -2186 -2770 -2718 -2071 -2210 -2003 -1624 -500 -40 252 429 1006 1134 718 454 1202 1984 1749
811 1749 1622 2357 2705 2062 975 872 612 -335 -1656 -1802 -1526 -1302 -1802 -1723 -1096 -859 -1554 -1289 -1327 -1341
831 -1341 -1415 -1407 -554 307 891 1251 1856 2402 2377 1421 1181 1235 1255 487 331 757 1067 698 279 287 41 -713 -1373
854 -1373 -1922 -1850 -1668 -2130 -1836 -950 -22 -60 -183 412 146 -414 -761 -497 3 96 382 940 1674 1760 1119
875 1119 1115 1301 786 -235 -369 -201 -118 -351 -25 471 543 519 -28 -534 -530 -830 -1404 -1704 -1141 -941 -897 -412
897 -412 473 343 -15 -33 -173 -90 -196 -542 -564 484 933 639 738 1878 1689 439 540 1109 498 -566
917 -566 -75 -18 -346 -267 -510 -590 199 -435 -1426 -1632 -972 -1863 -2545 -910 -188 -295 117 780 608 687 1448
938 1448 1127 950 1687 1132 204 1036 2007 1566 1240 2129 1085 -373 -684 -956 -1440 -1647 -1247 -2770 -2625
957 -2625 -1321 -1596 -2215 -770 229 -1302 -1426 -317 -554 23 1157 1712 1690 2396 2555 1376 2155 2721
975 2721 1537 565 1060 291 -756 -313 444 -313 -733 -598 -1567 -2317 -1954 -1946 -2497 -1791 -953 -1417 -1072 406
995 406 134 212 1098 1346 926 973 1251 995 1243 1854 1374 980 1299 1144 -303 -382 108 -241 -1488 -1242 -764
1016 -764 -1369 -1315 -665 -569 -967 -404 -743 -1362 -325 650 -311 -125 888 555 -393 683 1311 788 1088 1288
1036 1288 228 -60 779 335 -724 447 688 -805 -648 333 -174 -609 145 170 -1269 -1016 -107 -1210
1054 -1210 -522 521 -580 -1432 240 346 -764 327 1463 -82 -1040 264 336 103 1635 1424 354
1071 354 942 1451 236 218 2093 549 -1063 -121 34 -1232 -708 549 -300 -862 -807 -1499 -2246 -913
1089 -913 -62 -886 -591 140 -1255 -1285 427 1477 801 1408 1376 203 361 1256 792 1144 1933 1180 -345
1108 -345 62 803 135 -219 49 -490 -1685 -1979 -1586 -1394 -420 -352 -925 -936 -420 -1141 -569 284 1165 970
1128 970 365 631 471 972 1653 1732 1851 1453 402 23 -108 117 336 -23 -233 -488 -1183 -1355 -1297 -588
1148 -588 -502 -1014 -1064 -1151 -1098 -1066 -230 397 488 514 145 357 1011 969 545 967 1742 903 394 769 890 414 491
1171 491 837 557 -299 -795 -1147 -1087 -589 -607 -1315 -470 -328 -865 -1170 -334 131 -521 -492 -122 -559 -312 385
1192 385 327 357 1304 1347 144 425 1037 664 182 884 678 143 104 301 179 55 438 -290 -487 -331 -799
1213 -799 -1408 -320 -362 -629 -1038 -322 -355 -946 -208 264 -34 -74 9 -311 172 1157 1020 509 1368 1198 506
1234 506 647 837 801 273 198 152 -72 -138 -550 -875 -348 -251 -890 -1435 -826 -697 -1329 -660 -382 -352 -69 565
1256 565 324 778 1235 601 650 863 1130 470 494 985 684 540 501 547 330 -202 -530 -694 -735 -865 -1348 -1200
1278 -1200 -925 -885 -1164 -865 -345 -386 -220 212 212 206 660 797 654 742 1168 666 850 1272 851 595 474 439
1300 439 220 -152 -340 -481 -610 -992 -493 -683 -608 -781 -994 -709 -619 -506 -678 -322 -263 164 70 281 921
1321 921 667 857 482 514 445 410 541 468 640 487 175 265 151 -38 -324 -724 -462 -891 -710 -841 -532 -352
1343 -352 -610 -234 -25 53 -241 -328 -368 -110 -193 -73 26 717 692 526 612 494 611 229 -55 57 -13 -115 96
1366 96 73 108 83 -72 -25 -95 -388 -871 -878 -809 -808 -682 -413 33 41 -189 -70 21 -242 98 -71 176 204 389 435
1391 435 782 1294 1160 748 680 463 333 -233 -167 -412 -180 -501 -553 -247 -517 -642 -898 -961 -678 -1044 -1264
1412 -1264 -955 -461 -322 -323 164 531 706 303 692 1031 936 548 573 495 975 1143 858 520 759 141 -332
1433 -332 -646 -249 -988 -903 -708 -935 -779 -881 -791 -700 -248 -289 -501 -98 -208 -114 260 555 503 962 831 895
1455 895 759 762 870 261 158 249 -128 -447 -252 -10 -23 -511 -448 -426 -806 -643 -744 -820 -445 -335 -438 -282
1477 -282 143 508 234 398 553 94 275 400 609 509 504 445 599 486 568 7 18 -14 -181 -368 -693 -475
1499 -475 -291 -471 -528 -399 -391 -310 -412 -6 -344 -358 -641 -267 -212 433 423 554 643 680 64 -130 501 571 173
1522 173 501 540 -67 -45 90 161 74 312 -446 -489 -142 -524 -922 -249 260 -595 -615 -564 -694 -450 76 221
1544 221 -218 -124 -93 -240 285 1085 829 305 652 848 -46 253 1013 345 326 543 -220 -342 -273 -228 -697 -349
1566 -349 108 -1093 -1274 -273 -321 -859 40 213 -582 -772 150 -134 89 1201 940 233 613 705 170 -69
1586 -69 1088 654 -5 316 257 -299 -144 357 -431 -361 71 -622 -1513 -806 -333 -853 -610 278 -208 -683 67
1607 67 28 -52 559 770 18 129 910 47 226 978 1156 45 190 411 -391 -381 408 183 -497 -330 -584
1628 -584 -978 -234 3 -524 -991 -133 -442 -1103 -465 -125 -278 94 597 -157 -265 577 154 -109 819 978
1648 978 -20 124 1015 101 70 707 668 119 195 234 -501 -409 177 -229 -502 211 -468 -1047 -320 100 -448 -416
1670 -416 355 -218 -973 -23 133 -311 123 679 184 259 604 684 -19 632 681 -13 -267 626 65 141 428
1691 428 68 -376 -42 -28 -1091 -549 -143 -772 -840 -100 -168 -366 21 467 -120 179 384 -107 58 588 162
1712 162 140 548 979 406 398 779 187 -81 75 -101 -229 -235 -150 -406 -474 -13 -267 -722 58 -181 -949 -505
1734 -505 -171 -372 21 171 426 214 481 497 211 577 519 -218 177 588 389 93 2 227 -35 7 -262
1755 -262 -219 -540 -266 -625 -443 -195 -282 -380 -231 -265 -37 76 -169 -140 -15 -100 -77 178 427 410 376 749 419
1778 419 328 353 337 273 -12 112 89 -165 -101 -80 -31 -254 -123 -407 -465 -312 -175 -312 -332 -123 -78 -158 -326 83
1802 83 18 155 218 63 145 226 304 5 460 339 504 304 335 216 215 95 -69 105 -216 -250 -481 -480 -105 -511
1826 -511 -258 -643 -516 -371 -279 -426 -308 -349 -144 -194 -77 412 247 255 508 464 406 596 491 421 307 39 296
1849 296 210 139 -207 -93 -103 -170 -371 -638 -368 -796 -368 -452 -140 -238 -382 -127 -168 266 36 -9 37 412 359
1872 359 223 709 582 507 448 775 621 178 41 -10 -164 -190 -400 -453 -397 -24 -258 -495 -505 -380 -534 -330
1894 -330 -272 -207 -232 -71 96 -9 575 143 428 488 488 218 291 630 513 194 72 112 1 52 189 -72 -201
1917 -201 -130 -417 -677 -385 -372 -168 -203 -189 -357 -217 -20 -95 54 95 191 170 144 268 -101 384 309 485 87
1940 87 145 84 132 -96 301 -10 -174 -50 -141 -68 -15 -49 -266 -113 -113 -31 -435 -310 -88 -253 -242 103 -250 5
1964 5 133 -42 -66 75 354 -58 307 133 96 244 345 394 -35 384 48 -83 -101 300 -221 -488 -111 29
1986 29 -412 -315 -351 -273 -294 -176 -321 -528 -4 34 53 234 440 -51 209 479 341 202 373 419 48 98 436
2009 436 215 11 236 218 -420 -66 -246 -465 -473 -161 -230 -729 10 -343 -510 -311 -17 -41 -118 446 222 -19
2031 -19 290 504 466 629 567 249 30 490 388 -245 144 425 -217 -489 -350 -560 -444 -34 -344 -388 -285
2052 -285 -325 -442 -325 221 -91 -273 198 203 -47 353 420 187 391 648 298 -22 330 335 -123 59 -14 -28 -206
2075 -206 62 -109 -521 -30 -278 -722 -321 -108 -374 -439 -57 -75 -190 -248 -53 -302 42 154 -75 -170 206
2096 206 4 -126 320 514 -41 218 360 -57 -83 -281 152 -47 -233 65 -268 -70 403 7 -413 -118
2116 -118 159 -350 -201 -93 -430 -399 59 -131 195 198 29 -104 26 144 5 -102 180 107 61 104 100 161 -27
2139 -27 105 86 -187 -84 -366 -313 -62 -162 -313 -449 -140 -522 -59 -542 -160 -114 7 -269 139 68 -72 340
2161 340 193 243 126 139 311 520 388 504 286 132 96 59 -107 -175 -276 -236 -149 -312 -82 -509 -653 -164
2183 -164 -172 -171 -467 -152 -112 139 16 171 396 379 241 139 410 186 450 115 473 304 105 -150 -182 -65
2205 -65 -352 -361 -238 -528 -442 -464 -280 -21 -133 -206 -30 -30 -124 -21 6 42 25 457 248 411 393 450 148 228 222 -119
2231 -119 -128 -85 -308 -21 309 -220 -166 -134 -166 -222 -234 -372 -51 -362 -251 12 94 97 148 -121 143 99 -89 40
2255 40 68 27 325 101 152 82 51 -49 94 235 164 5 -169 219 12 -95 -123 23 -26 -150 -298 -340 -204
2278 -204 -204 -193 -107 -242 53 -127 126 158 69 143 -24 153 -280 -113 144 255 379 151 237 48 228 123 260
2301 260 -125 195 43 -89 -41 38 -293 -392 -144 -369 -125 -332 -239 -169 14 -491 -254 72 118 -9 -21 16 62
2324 62 398 386 3 260 82 35 272 8 349 68 126 -107 -245 -267 -239 -419 -432 -137 -287 -116 -130 -170 -133
2347 -133 56 -16 61 119 155 59 309 -93 145 414 297 99 151 91 9 80 41 -37 -6 -369 -250 -66 -334 -108
2371 -108 -321 -209 -11 -86 -144 -145 36 -87 126 261 15 184 278 282 226 385 172 -2 346 200 133 168 189 -4
2395 -4 94 -150 -113 -146 -194 -417 -164 -159 -58 -329 -24 -48 -305 -10 39 53 93 29 62 213 116 -77 231 127 127 -33
2421 -33 188 323 287 255 -60 -320 -187 -100 -178 99 130 -128 -147 -257 15 -63 -52 -295 -236 -162 -153 169 -79 -159 30
2446 30 -46 12 10 -157 105 -102 63 -35 68 153 -114 33 151 -232 -126 97 -9 -142 82 23 109 24 -75 -335
2470 -335 -147 -38 -321 -65 -189 -122 -200 -219 -20 272 213 187 180 206 180 244 471 -20 240 -51 44 10 160 168 -40
2495 -40 -117 -204 -253 -322 -346 38 -115 -59 14 -101 75 -15 -250 90 119 -122 -58 201 24 138 389 402 360 553
2519 553 76 111 142 132 -50 -114 112 17 -138 -380 -324 -238 40 -140 -292 -94 55 -15 33 -210 -39 -47 73 265
2543 265 169 1 345 -12 153 194 313 -35 -105 46 -57 72 24 93 -106 -56 118 -287 -215 -108 -146 2 -233
2566 -233 -55 58 -240 81 -430 -66 194 84 17 -11 41 4 10 -6 215 -64 78 -140 43 200 -67 -113 55
2589 55 -40 -251 -200 -162 -55 17 -238 -104 -80 154 -85 88 -102 136 -25 -108 128 109 339 -190 -146 186 18
2612 18 8 34 142 74 -84 -162 190 224 123 -9 20 64 -315 25 60 -245 -307 70 287 87 -226 6 -42 225
2636 225 177 256 -251 10 155 -4 234 179 85 149 230 143 -267 -34 -16 -81 247 -7 83 -133 -55 -34 -336 -161
2660 -161 88 -208 20 -21 -192 -163 -126 71 -235 -42 -22 147 -322 255 203 225 175 146 26 201 55 -154 171
2683 171 311 -4 -235 -32 55 -322 -138 193 -319 -280 137 -257 -240 -83 34 -105 -82 11 62 62 -120 32 87
2706 87 -36 -13 -15 -134 -10 50 192 90 43 -196 18 -43 73 235 199 -408 -152 -156 -28 -186 -79 106 -64
2729 -64 65 -111 -145 -42 207 194 -182 -16 100 -32 -220 222 64 168 288 12 94 -77 37 94 54 92
2751 92 -266 -108 193 10 -58 -7 -132 -12 -90 -185 -53 128 57 76 169 228 34 228 59 134 263 -189 76
2774 76 -36 -120 186 105 -293 -25 33 84 -220 -157 4 -135 -99 -186 62 -279 -94 -17 185 -147 -102 8 127
2797 127 -106 -38 -56 96 145 130 59 53 218 -138 -17 86 371 226 43 262 17 23 -149 168 179 -89 -103 -236
2821 -236 -132 -14 -114 -83 -43 -88 64 -156 86 298 20 -49 363 83 326 19 -102 4 100 298 124 18
2843 18 -87 184 -139 -106 89 39 28 -89 -127 -192 151 -141 -198 87 -74 56 180 193 -115 -116 -138 -91 52 47 -64
2868 -64 94 49 128 -274 -14 114 -81 62 -63 -82 -155 -46 -127 -13 -306 102 180 -17 -110 -73 -93 -245 -58
2891 -58 -330 75 38 75 43 -77 -51 27 36 212 43 -305 194 96 -216 249 214 129 -35 0 198 -364 -89 -363
2915 -363 43 -42 -263 -59 -188 281 -73 -19 -32 51 134 161 82 -79 155 131 -37 -26 245 35 273 85 -34
2938 -34 -246 171 -68 37 68 47 103 -143 68 -529 -238 51 -145 -135 -383 -2 73 -27 -188 37 173 -143
2960 -143 38 -88 55 -108 342 -112 166 137 154 135 -32 37 179 -42 -46 14 -89 -55 26 -190 -272 -294 -93 -97
2984 -97 43 -163 -16 94 74 87 -83 96 -75 -18 -63 266 213 182 249 -16 -13 76 110 28 123 31 10 -30 -59 -153
3010 -153 -166 -154 42 -373 -85 35 -209 -189 -177 -55 105 148 147 388 -65 99 369 165 259 26 262 110 -136
3033 -136 -55 -69 135 -97 28 33 -114 -82 -83 -205 -74 -38 -111 -68 -73 -96 -148 -371 -118 180 -17 193 -40 88 -42
3058 -42 174 205 122 -193 -6 -117 32 143 153 -4 13 112 -49 263 -214 -151 -76 206 -42 -153 -265 -18 -201
3081 -201 -124 12 -184 -353 -25 62 87 94 142 -111 137 -19 52 21 116 54 183 -196 49 67 71 -90 -4 -37 -84
3106 -84 -344 -88 27 -45 -178 4 58 123 -361 -37 -263 87 -159 61 13 83 89 171 199 -112 153 -62 33 92
3130 92 199 -63 -129 -11 -228 -81 -7 -215 -179 40 -180 -171 -199 -175 -112 -72 -171 71 156 97 135 -222 308 213 82
3155 82 218 -39 84 161 -146 45 -6 139 56 154 136 34 282 -22 -13 162 -172 -178 -87 -93 110 -4 -249 -219 -61
3180 -61 136 -71 -312 34 -24 180 63 271 356 39 -33 128 109 -177 305 66 -131 29 260 -91 86 161
3202 161 -36 -19 -64 -166 -330 -165 179 28 -140 121 101 100 252 48 81 -307 85 256 152 309 196 132
3224 132 18 -132 167 -101 80 -2 -41 264 -80 -296 -220 -268 146 47 -207 -197 -141 -11 -280 -210 -16 -288 43
3247 43 147 107 106 38 -163 -7 -40 224 198 305 58 32 26 -279 48 33 -223 -35 -141 -310 -34 -49 -192 -55
3271 -55 169 -80 -326 -135 192 255 149 230 105 137 51 42 72 151 37 56 51 9 55 78 154 286 264 -141 61 43
3297 43 -238 -103 -163 -301 -134 -58 255 -1 -458 198 117 11 74 82 101 22 195 59 37 -184 226 -68 -172
3320 -172 34 293 106 -13 122 26 -157 18 -209 166 291 -146 -16 -159 5 -164 -208 147 -74 168 74
3341 74 -100 40 67 167 37 1 -100 -7 434 -97 240 158 199 -29 -40 206 114 -176 71 146 -298 57 -26
3364 -26 -286 -55 48 -337 -93 27 45 248 11 103 -87 -311 -173 354 73 274 -408 189 -119 16 161
3385 161 69 9 -48 -34 164 -63 10 -218 -212 62 -245 -266 -221 57 -80 51 -114 -156 -67 -254 -180 -18 246 195
3409 195 187 -3 48 -48 -44 29 175 -227 214 163 101 -150 -83 111 -170 -163 104 -155 -10 -135 -55 -76 -53 -152 -11
3434 -11 -54 -223 85 220 129 27 124 -32 144 -176 244 34 -33 116 -63 179 36 287 111 -51 -78 10
3456 10 48 -158 -13 -252 -253 -180 59 47 -158 -89 -42 -177 -82 20 134 -116 202 15 122 -136 144 252 105
3479 105 452 160 5 342 -75 -82 40 -125 -36 -18 -69 -167 -263 -205 -212 -220 -220 147 8 17 218 85 282 -20 -105 -77
3505 -77 149 -34 160 -4 198 -91 307 80 123 -99 311 55 -10 187 147 -216 -267 -41 -90 -129 121 78 -219
3528 -219 -108 -275 -280 -239 163 -100 222 54 -19 -203 246 89 208 -25 237 81 -66 128 84 -19 110 -52
3550 -52 -91 85 -39 377 -230 -356 -45 -112 36 -207 83 -40 128 -195 -419 -129 -137 -235 52 288 309 40
3572 40 -143 156 187 17 118 65 -40 270 -2 43 233 168 -106 46 -97 132 -204 -165 3 -203 -162 -132 -248
3595 -248 110 22 106 -39 39 11 -57 98 -165 218 82 190 58 -13 41 266 -27 133 217 180 -182 168 -141
3618 -141 -218 -72 -146 -9 -333 103 37 -116 -198 -126 -117 58 5 31 -143 119 93 -198 287 -122 196 -36 197
3641 197 68 203 -181 5 -109 -34 83 42 230 18 -164 -247 -384 156 -134 -258 -27 -192 67 44 47 -14
3663 -14 66 19 302 138 -71 -147 323 188 55 -5 -173 269 120 -33 80 -136 -224 -97 -43 -165 53 -115
3685 -115 -221 -39 102 -144 -292 3 6 -153 -114 -105 -4 -241 -39 197 49 451 187 200 -12 304 136 114
3707 114 -4 175 8 -74 -1 52 -114 -169 -248 -35 -195 -177 -366 -73 -22 -137 -226 -117 40 -103 162 -125 104
3730 104 19 6 113 -56 296 124 169 179 68 -40 -33 -62 -42 -269 -211 -424 -347 -84 -191 -137 -108 -100 -103 -6 30 -14
3756 -14 -56 28 -90 -95 92 -117 172 50 -1 -63 162 57 -81 142 101 -47 70 -14 -61 -71 -82 31 119 -141
3780 -141 -179 -197 -201 23 -237 70 131 -204 10 -237 135 168 -101 142 33 -98 -97 159 284 -29 -35 -159 155
3803 155 77 330 141 -40 151 27 10 186 -24 -30 -203 -34 -69 -79 -128 -11 -113 1 78 -79 178 66 -20
3826 -20 158 16 277 21 53 -76 15 160 -72 81 -26 4 -144 98 23 79 -76 -30 -19 -164 51 -110 133
3849 133 -64 -138 -429 -111 -34 -23 11 79 92 50 22 -84 -30 154 271 69 -214 -264 204 -23 -87 127 -336 18
3873 18 43 92 24 -117 -201 10 112 -68 -166 -95 -111 -87 -217 122 77 209 29 190 176 164 -2 -36 273 155
3897 155 295 66 -57 -216 -225 229 236 -82 -271 -162 30 2 -226 -111 255 -126 -183 -162 -120 119 -86 180 193
3920 193 35 -122 -126 263 -54 3 15 34 278 93 103 242 80 -88 49 -132 -215 107 -136 -84 -136 -96 -38 -149
3944 -149 157 -227 287 35 -53 56 -185 -16 97 -36 -159 51 -62 -100 262 154 -15 -110 -95 -46 -52 -152
3966 -152 126 23 -28 50 1 -143 -144 -27 -144 59 -136 102 -24 -197 -57 -103 137 43 -218 46 -330 81
3988 81 271 117 -7 166 -222 33 96 98 76 -14 194 155 94 -36 81 -360 -107 -58 51 -293 -357 -95 -3 -73
4012 -73 -226 234 88 -44 -56 -135 -185 49 26 65 124 -15 109 122 49 -128 242 73 -148 -49 -2 -415 -247 -53
4036 -53 11 -105 -201 -176 -45 153 -281 274 -146 -100 107 69 68 100 26 180 -181 122 -21 -13 -78 52 -125 68
4060 68 208 -42 52 -116 86 -47 168 184 -331 -80 29 21 -212 -52 -64 -91 86 22 71 37 -204 -13 -196
4083 -196 -117 -79 -183 375 180 -24 190 -37 -155 -246 -205 139 -94 43 -69 -146 51 -120 -46 -182 -258 -208 1
4106 1 118 -163 -172 47 116 91 -32 19 -141 428 158 -212 168 165 247 119 -126 -39 -22 24 -171 -20 14 -163 -73
4131 -73 -182 -280 -30 137 -123 26 -129 71 -104 -26 -100 -160 -153 -22 245 78 159 183 163 147 298 166 3 286
4155 286 -95 44 57 148 -10 224 -16 -13 -71 -6 -140 -255 -140 -68 -80 163 -108 -442 -295 268 -65 -101 -177
4178 -177 -181 254 -199 256 -1 161 -200 158 -96 57 -183 -172 226 264 -34 -185 -24 80 27 104 -128 -33
4200 -33 -1 -95 -6 22 250 -69 -192 -286 88 21 235 -135 57 -7 -103 -39 -80 78 164 63 43 138 59 -35 -42 -78
4226 -78 146 -70 -41 143 -116 224 81 71 27 -204 -211 -202 24 76 204 -200 25 75 -50 -75 -19 -15 97 163 108
4251 108 338 -20 145 221 168 194 -374 -317 79 -217 -35 173 -362 -303 -149 -22 -26 -37 122 100 -134 32 -88
4274 -88 21 119 -163 -37 46 -3 66 -147 145 47 258 -83 227 58 -60 -50 32 -92 8 6 89 -192 -288 -86
4298 -86 -78 -222 -69 -105 -32 180 63 -25 -69 -97 48 -32 142 341 65 197 304 82 113 121 -14 178 105 -71
4322 -71 11 -212 -176 -137 -48 227 -33 15 -139 -103 -4 31 -14 48 112 112 225 74 -24 248 174 82 40 231 67 -47
4348 -47 187 -134 -58 107 -22 53 58 211 -130 -62 -50 -200 -31 -150 20 -68 284 302 -70 29 -5 229 -154 101
4372 101 -53 242 18 181 151 45 70 55 -51 -24 -206 133 -42 -79 59 -88 115 -56 57 -156 76 -33
4394 -33 -320 -171 141 -187 107 -259 -41 -209 -24 -33 -165 101 -208 133 15 -13 61 -64 30 190 240 -29
4416 -29 -82 90 164 -198 -37 3 8 70 -142 20 158 -97 -30 -47 65 -48 172 -101 -168 -18 54 -61 148 -24
4440 -24 256 62 93 219 204 175 207 87 48 -31 -41 107 53 -44 -54 -57 -44 -337 136 184 -100 99 5 -221 98
4465 98 -100 113 84 8 346 32 -72 131 11 -103 58 -9 -5 162 14 103 169 100 -33 100 74 -48 -225
4488 -225 -280 67 -248 -20 -175 208 13 -76 -4 118 47 -66 74 -225 163 449 54 68 171 75 254 181
4510 181 299 -40 77 86 172 -91 -107 -22 134 -100 -47 -151 -238 -83 -145 -171 -210 324 -260 72 -142 -379 72
4533 72 -163 -46 -25 50 -19 141 48 -8 -113 118 76 40 60 74 110 -158 -121 -154 -89 -333 5 -227 -21 -48 -106
4558 -106 -38 242 -300 -81 -14 -276 -150 62 250 81 143 86 163 112 -186 161 4 -51 146 161 -101 20 62
4581 62 -26 28 -76 186 78 -44 -210 51 -196 -145 -181 -194 -150 15 -208 27 101 -11 69 116 248 49 -19 229
4605 229 -22 -246 -3 -57 114 177 225 81 140 82 55 -31 -55 -93 115 -194 -30 -111 -17 -167 -45 126 12 -119
4629 -119 89 208 -62 -168 26 227 90 135 12 142 217 -11 -84 233 117 -166 -43 -102 -145 0 -172 -251
4651 -251 103 -30 -15 114 -157 24 351 224 -30 -74 76 64 112 202 240 -152 86 -41 -90 189 138 35 105
4674 105 -164 -263 -20 39 163 -225 -167 84 -167 -144 0 -206 212 -166 -46 -24 49 17 146 -69 152 -90
4696 -90 17 130 -76 -137 300 1 93 160 145 99 124 87 26 1 -12 188 34 57 -164 -8 175 -418 -79 36
4720 36 24 -108 89 -130 -125 57 135 194 -286 211 -80 59 71 179 1 -59 38 -53 18 45 79 335 433 -232 63
4745 63 -154 -155 -174 264 -78 -73 -18 -139 -177 -22 71 -342 -92 6 144 181 -37 -78 325 320 103 -23 86 0 159
4770 159 -114 86 -11 78 92 343 -34 -104 -85 -10 -59 -71 136 -225 -118 20 -129 -110 -171 26 39 109 115 -109 117
4795 117 -130 278 197 60 22 129 -303 -5 38 110 -90 -122 -107 -283 -46 -245 -198 -18 -29 -100 11 -306 -11
4818 -11 50 -5 40 295 -144 194 281 147 211 -151 -141 -272 79 -35 -108 201 55 39 202 -12 -21 146 172 -53
4842 -53 113 -412 64 -47 -31 -23 25 58 196 -97 -172 38 -132 347 152 -68 -5 -112 -136 123 -12 260 33
4865 33 32 -247 -131 -187 70 190 -185 -21 12 82 91 -30 -316 -12 -27 60 -98 196 28 -61 -123 5 -91 0 121
4890 121 161 205 78 -127 -2 -185 -5 -37 30 -276 175 -15 -123 -32 -175 -106 -148 -63 -79 -63 16 -21 -293 -200
4914 -200 -77 -47 98 171 170 -17 173 166 94 159 78 213 -68 111 -48 152 -173 202 -13 -184 87 188 -95
4937 -95 -94 -147 -82 -95 -100 -162 -165 49 -129 -48 -106 -105 0 141 -64 -85 -176 -45 -98 33 155 47 63 -250 138 192 -215
4964 -215 -3 87 27 -5 226 -78 90 151 -237 -235 -204 14 -164 -56 16 -287 -28 56 48 95 18 -207 -173 -123 309
4989 309 192 86 -171 43 57 308 -202 -45 -3 78 58 -75 90 -75 22 -309 145 -137 -5 -108 -121 143
5011 143 -14 90 195 -80 83 283 194 121 149 -90 -173 88 16 259 38 90 96 -83 171 125 32 191 157 171
5035 171 36 -145 -176 165 42 -142 -362 -51 -88 -29 -455 35 224 71 179 149 157 -206 360 176 -196 199
5057 199 37 190 102 -106 36 -115 324 40 -17 67 102 -175 -308 8 58 32 -133 -90 24 9 -70 6 -20 86
5081 86 -398 -61 71 -146 -32 -24 230 139 -14 -148 49 -102 33 76 -345 -24 -97 -38 50 0 137 -106 46
5104 46 -172 -147 159 108 48 -75 -100 63 -134 -24 -6 -8 9 300 -35 116 6 -98 35 76 -125 165 45
5127 45 225 172 -223 -62 -147 94 -169 -38 161 -244 -132 -61 -46 -28 -33 -135 -80 -134 158 29 22 164 189 144 -24
5152 -24 -45 153 24 -81 -158 -66 -63 222 -30 28 39 22 4 -131 -89 -41 5 -147 -152 -98 -106 184 -36 126 -5 11
5178 11 -46 95 365 107 31 -64 49 135 -79 -275 42 1 -63 351 57 -28 83 -169 0 -400 1 -179 -44
5201 -44 -203 -11 -11 -149 97 -184 13 -32 49 41 -167 37 57 -10 76 -43 137 -25 129 -29 124 -103 129
5224 129 -187 -13 -49 -148 -77 -49 -29 -294 25 -96 -157 155 -69 -55 74 -43 -41 -74 -75 -72 53 201 39 -250 129
5249 129 -42 56 90 159 195 -282 0 -30 79 -168 -158 -215 -208 -109 181 -49 -42 -127 -141 -226 -355 -42 -295 236 50
5274 50 68 282 -168 -6 -53 98 -45 -133 172 272 112 96 136 -100 74 -49 -271 -52 -41 -97 -112 -74 -261
5297 -261 47 75 56 -321 54 -121 -2 -44 -218 -95 137 57 -79 81 -179 252 -213 136 72 -111 32 133
5319 133 177 -23 -67 -63 -200 0 -240 -341 122 -267 -133 14 -31 -176 -116 -321 169 -50 -74 73 -265 -235 115
5342 115 176 109 -37 -70 -44 0 85 -52 -45 -121 87 67 45 -210 -209 23 -191 -8 -4 90 -157 -65 -317 73 -78 -132
5368 -132 -59 123 71 -44 59 -156 -23 -26 175 109 -33 -136 -160 -117 38 -22 199 -72 -203 -2 -255 -171 121
5391 121 -215 22 32 -44 -34 -76 12 35 36 83 -75 259 222 32 136 -47 34 32 -3 167 227 -21 -80 -158 36 -118
5417 -118 17 -23 92 -112 -346 15 -161 0 -100 -73 -88 -182 53 70 7 -212 37 63 102 196 294 -89 -78 119
5441 119 -93 -139 -137 58 -63 183 28 -60 -34 -69 62 -153 16 -165 -97 -229 -220 -164 -77 -116 7 15 208 22 -103
5466 -103 23 -84 9 18 -174 55 -18 58 19 -52 160 0 -207 -198 171 -16 175 -21 -32 119 56 -30 -139 -8
5490 -8 59 251 -35 -3 -75 195 -49 -8 -147 7 204 -16 -47 21 -158 -118 -70 -58 91 47 -188 101 -2 15
5514 15 -97 104 -30 -55 48 304 -134 26 -232 -331 -57 -124 -42 -168 57 -152 3 -236 118 39 13 166
5536 166 47 140 60 32 72 -5 300 113 43 -182 -112 -124 15 91 -18 -60 40 56 -114 -55 -125 182 -155 -164 229
5561 229 158 57 6 -32 -149 23 117 -62 -91 45 353 -65 114 214 57 -259 145 171 98 97 -200 -104 96
5584 96 -102 -175 21 74 -20 -107 -190 -75 -32 -70 -132 -156 25 -88 162 -155 42 -221 109 20 79 -232 -60 -1
5608 -1 238 333 132 -157 3 208 -155 -14 -78 167 58 -142 -265 -194 -140 -190 85 -124 147 146 161 98 -36 -164
5632 -164 -209 -98 27 -132 29 154 -244 -188 -77 -13 213 -231 37 9 -234 -196 36 -39 273 52 -79 82
5654 82 92 101 -49 39 52 -41 192 26 -85 -22 -15 222 -3 111 -156 43 112 167 387 -151 122 151 -188 67
5678 67 106 -46 -82 -247 -113 -69 -17 -155 -26 -283 165 191 -39 119 103 -253 -152 -166 -93 -27 127 65 144 310
5702 310 38 227 -88 229 198 -77 282 12 23 -298 21 -437 279 -26 42 106 -224 -269 -134 171 93 102 -48
5725 -48 -38 125 20 94 26 -8 186 243 68 98 -206 -37 -108 -141 37 -82 -254 124 -167 77 -29 -118 -29 47
5749 47 -56 -253 29 81 -36 -65 151 46 -127 263 41 -233 90 91 -136 288 41 53 -44 -59 15 122 82
5772 82 16 150 56 256 -241 -262 -442 -13 186 -217 -223 -139 -228 -82 -27 32 -97 -117 -18 -22 215 235 -245 29 -7
5797 -7 -185 45 227 36 -5 287 79 -28 -192 321 40 -168 -177 -171 -173 -135 -52 -119 127 304 -239 6 -2 -194 87
5822 87 61 -29 248 84 -42 -7 -336 106 70 364 23 20 21 325 289 -52 187 143 -280 72 -96 140 -75 123
5846 123 -73 -151 -45 -14 10 -128 118 -261 137 -127 -4 -80 69 333 38 -216 92 101 -225 325 0 19
5868 19 194 -22 -83 -8 204 -68 -273 -113 122 -117 263 82 -36 9 -30 -31 1 47 31 140 82 -3 203 -8
5892 -8 112 -67 -100 115 -8 105 236 19 1 40 14 167 174 -24 -225 -91 -24 -338 -265 85 -168 44 158
5915 158 -59 -108 -70 -38 11 77 -192 93 -36 -10 266 149 141 7 232 -283 -193 309 4 -234 204 -187 -77
5938 -77 99 -105 -293 -101 -132 -61 215 36 -160 -12 -10 -118 -166 -27 96 -118 78 143 179 42 39 -124 178
5961 178 97 -160 143 -6 62 28 -130 -27 -74 -253 -295 125 58 -90 -221 -176 -42 56 -82 7 -237 33 -207
5984 -207 -49 -5 140 6 129 -13 12 85 10 33 -19 -29 218 -128 22 -118 124 -200 -61 7 -122 104 19
6007 19 -41 -5 -2 -163 -126 44 108 44 96 -114 -23 -133 128 -81 -84 290 16 174 -131 82 -120 -11 105 -95
6031 -95 -39 85 83 24 42 -77 180 -183 30 -182 -167 178 119 -272 55 172 275 -234 -142 60 104 -145 -98 -49
6055 -49 107 154 85 228 -135 -149 -90 42 167 117 90 -99 99 -145 61 -194 -20 -217 -113 -206 -35 -2 -152
6078 -152 19 258 -173 117 3 85 109 144 293 148 1 186 130 3 83 -10 53 -180 72 29 8 261 32
6101 32 7 44 -75 -32 -277 5 84 -329 -69 294 129 39 238 -179 -50 -8 -5 176 -43 -32 24 -132 16 -22
6125 -22 -371 120 101 212 -31 -92 145 -87 -44 34 18 92 -89 -26 -47 45 -251 -254 18 21 -474 62 -28 8 0 36
6151 36 -97 -169 -113 -29 7 -26 323 -130 -76 20 262 -211 53 -197 57 154 -141 82 -79 44 -142 -143 -137 122
6175 122 -118 117 176 -5 -236 162 -175 -95 -48 -117 -84 -42 69 104 -20 -14 -186 1 42 -263 -202 -77 -87 -409
6199 -409 -98 -81 -155 80 -114 83 125 -300 -9 -29 -32 59 156 6 -147 -23 42 161 3 73 223 16 133
6222 133 -71 24 76 -206 -237 91 32 7 -113 -104 -83 -114 40 107 111 -55 -139 -270 305 99 102 69 -240 -1 12 -15
6248 -15 -254 346 107 -289 -228 59 -41 -153 99 133 -102 48 -122 -40 50 144 41 30 -139 -136 131 -52 13
6271 13 108 149 49 48 -214 247 10 34 -4 -123 173 194 20 76 -193 -12 -108 -43 -18 -64 -189 -262 -111 272 4
6296 4 83 -201 56 -95 144 40 97 -97 61 28 177 -92 -13 151 19 112 128 -38 172 289 -92 219 140
6319 140 -88 -67 99 133 -53 27 -125 -127 68 -28 -189 -35 -81 79 -73 -166 149 -67 -33 27 119 -111 39 158
6343 158 -146 168 94 108 -78 115 45 -93 -240 237 51 -26 -54 109 222 113 259 61 140 125 -25 -95 22
6366 22 -204 4 -44 -90 -19 162 -120 -3 -151 -24 16 -39 -55 -183 86 -190 -36 120 -21 95 -69 60
6388 60 -66 -140 -234 54 -41 2 -185 -341 -2 188 38 104 -239 -20 18 280 135 193 162 12 24 80 -5 46
6412 46 -117 22 147 185 43 -156 282 -96 62 -159 -16 -111 -204 162 68 -188 68 -213 -257 -141 -186 -3
6434 -3 -43 132 -96 34 -48 -152 -116 -30 -174 54 48 -76 -29 36 -325 111 -75 -99 112 129 -156 -132 -163 -115 176
6459 176 -143 271 0 -91 -2 -160 52 265 142 114 -149 68 161 -106 165 240 -135 -134 53 -131 187 -29
6481 -29 64 94 72 -55 -38 218 100 159 -126 -26 -21 -351 115 -141 -64 -184 82 62 -241 -171 53 196 38 14
6505 14 159 -221 38 78 56 206 111 97 21 66 100 -13 -124 156 27 -23 68 230 75 -59 135 -136 66
6528 66 231 -102 -41 105 162 -93 175 -69 -244 -21 87 153 -7 -85 93 234 13 57 -284 -203 -128 -31 -257
6551 -257 -34 -144 -149 402 202 -1 -48 -93 -57 -239 -27 -66 -45 -119 -128 185 226 148 271 -247 -44 114 72 119 -7
6576 -7 -34 -134 -73 -66 -231 -190 87 155 -74 -19 -196 78 -46 17 -4 -28 100 -19 60 98 11 99 152 153 19 -39 151
6603 151 -121 0 56 -182 -2 266 -122 72 156 24 -132 -56 109 127 92 81 -64 -12 29 -162 -87 -29 226
6626 226 -24 54 -86 -66 396 -38 117 204 -135 122 -74 -37 91 -165 -36 -238 -125 97 -61 92 -80
6647 -80 -73 -88 109 -138 228 -203 94 72 47 56 231 -146 -161 -56 -19 214 -7 293 -179 -178 182 51 -75 -103
6671 -103 -149 -148 -66 3 -58 -96 -82 -235 -25 -68 196 -121 -20 -45 4 -143 139 -8 -12 224 -58 -82 119 109 -19
6696 -19 165 180 -119 111 -15 -375 2 90 -198 -29 1 -39 -166 112 142 1 -187 -155 -135 -68 -10 -17 28 -96
6720 -96 -43 -145 -124 -260 305 -179 -160 86 228 66 -28 -16 -78 88 -118 -143 -91 122 138 -78 -78 151 -115 67
6744 67 220 -144 -111 276 -23 -3 -70 4 -159 194 50 13 17 56 123 19 -66 156 -123 260 95 75 -118 183
6768 183 26 -121 -31 -82 51 -8 150 165 111 76 57 -250 101 150 191 190 55 84 -10 6 -84 -254 -183 -143 -31 -134
6794 -134 88 13 59 64 -308 -204 -10 57 203 -41 -96 -42 -83 -123 131 47 -63 -177 111 -177 -119 177 -65 -19
6818 -19 -212 128 85 100 103 64 -127 119 -6 80 104 -121 130 10 60 -1 178 -19 -47 -4 -155 -167 317 78
6842 78 -118 43 -150 -66 169 -44 -215 -39 -196 -32 -108 -273 184 -91 143 96 -195 13 153 16 -104
6863 -104 -50 -42 -3 -224 32 -94 243 82 -56 -181 44 8 1 43 -39 145 -129 -111 66 89 4 101 73 154 180
6888 180 84 22 -239 -1 -28 88 -31 22 78 59 -64 -156 -90 -8 272 41 84 9 179 -37 217 -191 150 59
6912 59 -152 95 -108 9 218 33 95 -73 221 1 -222 207 -64 -187 -125 -212 -66 271 -80 207 218 7
6934 7 132 3 36 -52 -8 -1 -124 258 -143 53 115 8 -3 361 -247 -142 -293 196 -65 -17 275 68 186
6957 186 8 67 138 -14 375 -210 206 93 -47 -85 -80 -8 109 -89 -292 21 -58 32 101 89 67 95 -103 17
6981 17 169 -41 -50 -37 72 7 -121 -19 102 100 12 -82 89 283 -92 -44 120 36 -117 -157 -339 5 93 -250
7005 -250 -152 88 -222 -19 68 -69 -73 86 126 -55 128 -16 2 25 -149 -105 -171 -32 -16 41 21 69 -62 57
7029 57 -133 -112 35 -25 -65 -110 -414 -226 127 84 1 -153 8 167 -84 114 78 82 33 -168 86 -284 126 -128
7053 -128 141 -326 35 73 101 -119 114 30 -165 -77 140 71 -52 277 -117 249 58 -126 -277 -138 -25 -27
7075 -27 75 -122 -195 -3 -21 -193 -201 68 12 220 57 34 100 -104 68 186 126 -203 127 78 -52 148 -26
7098 -26 -178 -96 -100 77 118 -8 179 26 -53 102 133 26 11 119 -16 -258 206 -117 55 335 72 65 -157
7121 -157 81 -238 39 206 -36 -180 7 -18 -76 125 -8 117 342 -56 235 -60 3 101 -53 -123 -38 105
7143 105 -47 -158 131 104 220 93 131 -67 -8 -6 -131 -72 -34 -64 -40 -123 45 31 183 -24 101 -96 -99 -17 -121
7168 -121 8 -28 41 -271 62 65 -156 303 116 -153 -97 -2 290 -30 65 -230 -198 13 -7 206 -236 -190 218
7191 218 36 -94 17 -90 4 -151 -37 153 195 74 205 56 108 76 -255 -112 4 116 -81 31 -3 -196
7213 -196 45 160 193 167 14 68 -131 -17 257 -103 80 -50 76 -177 -139 -241 3 -187 30 97 29 -1
7235 -1 202 175 -174 220 -299 441 -91 105 68 123 -59 -317 -8 -34 6 -153 -61 -79 9 -108 82 -110 -214
7258 -214 -153 139 95 34 -61 -126 80 -132 -229 112 -45 213 -241 -157 67 159 -9 -207 194 55 -123 17 159
7281 159 209 -144 200 17 31 16 100 -15 -313 225 145 -139 105 55 -326 -186 -64 58 -152 48 -16 -105 28
7304 28 -130 -186 20 46 206 212 -46 -245 100 27 -177 190 382 216 -108 -246 81 -261 120 -32 -66 18 -85
7327 -85 84 126 -72 -98 306 96 88 167 -98 -62 174 -123 -133 66 52 -86 62 200 128 235 54 -191 27
7350 27 285 -51 116 -81 -148 -156 84 -19 195 35 -66 97 -374 66 325 -47 -237 94 -177 -218 -284 -101
7372 -101 -9 -193 23 95 18 -119 -73 -8 77 22 -61 204 63 7 -102 -211 54 -7 90 56 -10 43 89 -41 77
7397 77 29 -87 50 -53 -114 -102 115 -200 -83 -117 -54 32 139 -52 -58 -99 31 -41 8 -20 230 -137 -22 86
7421 86 -29 5 -90 69 -65 -62 -142 88 79 -28 -195 211 -51 -101 53 2 204 143 32 -34 -198 213 -185 -200
7445 -200 -380 25 184 -37 -41 147 82 -226 8 -176 112 -167 -132 23 24 173 276 -131 213 -150 -34 26
7467 26 -20 124 -59 -72 155 280 -183 -62 -18 -167 288 228 92 -149 -125 -119 -110 -7 94 220 -31 -260 100
7490 100 -149 71 -77 124 -24 41 62 -96 69 -16 41 114 -158 174 -62 -176 -15 20 -24 58 -8 -183 225
7513 225 103 71 -1 0 78 81 63 131 -174 -92 -207 37 107 249 -28 104 -153 56 37 -240 -1 -50 -17 38 -157
7538 -157 -164 -24 -3 -74 41 199 242 59 -2 -45 50 125 -52 -44 140 167 -8 -13 98 -282 -5 155 -121 193 160
7563 160 -127 -7 56 29 -112 -321 -117 150 112 -60 24 147 132 55 255 163 -35 137 264 -15 -116 38
7585 38 125 -243 -23 50 34 238 38 152 266 134 12 5 -87 -181 299 -37 140 -83 25 126 -48 169 137
7608 137 70 199 147 92 -118 25 35 84 126 -189 -149 11 116 166 -17 66 -55 -23 -4 37 56 -21 -11 37 162
7633 162 255 160 -177 3 58 -103 -156 -149 199 -205 7 -131 -24 -99 96 21 193 -185 -116 -87 -10 283 22 -42
7657 -42 97 72 -6 -22 143 177 141 -135 -233 35 372 -37 68 -59 -259 -18 -15 147 -57 -24 178 1 30 -38
7681 -38 -27 -77 -122 166 -49 24 -43 194 -154 207 -161 -8 -179 123 -196 -4 36 168 141 266 45 -103 38
7704 38 188 -117 -182 -307 41 5 -219 26 -97 295 -72 65 180 -179 187 130 302 -84 24 238 -266
7725 -266 306 83 -40 -99 290 -73 -5 103 -89 224 35 13 375 305 239 132 45 -12 -12 -32 44 -13 -103 43
7749 43 -309 29 -36 97 -51 -91 137 132 -114 127 -43 -156 -25 -102 -106 -113 297 114 110 -248 277 61 23 42 -147
7774 -147 -19 -130 92 -155 188 -152 60 -52 -182 19 -64 -68 -18 45 26 30 -184 -120 -17 -24 4 -91 -56 17 108
7799 108 -102 -26 26 37 -51 -18 -19 -163 -35 31 35 -185 -161 -256 58 -140 -254 -125 -74 165 255 -79 -24 90 -107
7824 -107 199 252 -48 9 82 -133 97 -81 158 79 -160 -206 -24 -52 -75 -16 -175 -22 -171 76 172 -12 -150
7847 -150 -145 143 -14 -44 149 230 47 -132 -58 273 -26 -151 25 38 239 253 -134 -64 162 29 -13 -295 -83
7870 -83 -18 277 -2 -166 124 101 -250 -308 66 21 157 9 192 183 -143 -34 -90 -77 -134 -142 114 -194 -216 -32
7894 -32 61 -193 27 36 146 141 30 207 344 183 -16 -107 -131 193 28 -145 49 -64 -3 15 -99 -3 -111 63
7918 63 -138 -226 133 -134 -213 122 -70 252 -177 104 155 -280 -117 25 -82 188 -95 18 70 48 -86 -345
7940 -345 222 131 -54 -135 161 167 238 -129 38 -17 -31 82 -157 -192 125 37 -30 -162 87 6 -95 102 -162 -38
7964 -38 -48 -24 -125 64 -10 -22 -171 -8 -141 62 27 9 -186 -349 -85 -160 -27 34 -146 113 115 -279 361 -57
7988 -57 5 164 97 270 205 -165 8 182 46 85 -102 26 -9 99 -93 -132 217 -58 75 141 -102 -57 66
8011 66 -127 -53 82 -67 -35 182 -3 -33 343 -136 -131 -268 16 -236 -71 118 -151 -350 -80 101 -102 228
8033 228 81 -137 51 81 53 -20 -48 -89 54 -31 11 205 -277 118 -51 129 87 -229 -70 -94 108 308 -51
8056 -51 -153 -1 -86 165 4 7 -180 96 190 36 -96 -5 -103 117 123 83 -234 -134 77 144 89 1 15 85 -424
8081 -424 84 103 92 -77 43 -31 -158 360 26 -34 254 -62 -20 -67 48 -80 251 140 -129 -38 -165 8
8103 8 -127 -33 -106 66 160 14 118 7 -139 88 112 253 -34 -124 -35 -143 -109 28 133 -27 111 121 -54
8126 -54 -198 -257 32 -20 -108 36 2 136 82 84 -49 -83 -85 39 -105 229 70 -96 175 63 -208 84 196 -5
8150 -5 -288 -98 -99 -34 -29 68 85 11 55 83 166 50 216 10 65 109 41 7 -57 148 -202 -88 -30 -183 49 -38 -119
8177 -119 220 68 -127 -279 95 70 77 61 -260 261 -136 -61 -198 56
8191E6
$$ Imaginary data points
##PAGE= N=2
##DATA TABLE= (X++(I..I)), XYDATA
0 0 0 0 0 0 0 0 0 0 0 0 0 0 0 0 0 0 0 -8 8 -8 8 -8 8 -14 16 -16 17 -24 24 -30 33 -39 41 -49 55 -62 69 -77 86
39 86 -95 104 -118 129 -144 158 -174 191 -210 232 -256 282 -310 342 -377 417 -465 518 -579 651
59 651 -738 843 -977 1148 -1381 1709 -2214 3071 -4795 9559 -47383 -147312 19205 54701
73 54701 -30528 54312 132741 25596 13419 89763 26013 -10437 98308 70135 -62086 -33580
85 -33580 13304 -63281 -41560 50250 -9012 -71505 -7841 -26635 -106277 -40043 29721 -32055
97 -32055 -33827 28340 -13983 -35492 59559 70417 495 37178 71831 -5303 -16013 52233
109 52233 27943 -8065 40290 26860 -45599 -17964 21213 -34814 -46522 4746 -26485 -70160
121 -70160 -19887 1632 -36579 -9268 33229 -3889 -17082 26736 16463 -11468 25514 38218
133 38218 -3296 6505 39676 11643 -7119 23463 15253 -18916 -3778 7134 -23855 -22959 1657
146 1657 -16927 -30562 -1475 2064 -20567 -5203 13207 -6170 -7820 16314 10486 -2054 16457
159 16457 18480 -1914 6891 21390 4323 -1621 14661 3152 -17396 -6518 -1179 -19451 -16400
172 -16400 -700 -11262 -17573 -1543 153 -7460 5226 11213 -3419 683 15348 5832 -641
185 -641 15563 17253 3049 8244 13578 753 -1609 4921 -6734 -15871 -5882 -7560 -18940 -10602
199 -10602 -1151 -10537 -11527 -105 -3135 -8172 1793 3977 -1628 6505 13940 7749 10272 20603 14222
214 14222 5330 11697 10084 -2504 -1936 2842 -5952 -10089 -4839 -7849 -12591 -8060 -8572 -14934 -11235
229 -11235 -6556 -12000 -9601 1115 1975 -431 7117 11522 8114 10504 13684 9966 9458 12152 7176
244 7176 2989 7091 6405 -1196 -1484 211 -5906 -9761 -7350 -9459 -11798 -8274 -7477 -10373 -6532 -2098
260 -2098 -4317 -3775 2545 3369 431 4686 8476 6238 5758 9060 8004 5120 5777 4578 1513 2563
276 2563 2777 -1536 -2954 -10 -1977 -6471 -5298 -3628 -5923 -7210 -4171 -2188 -2483 -748 1265 2227
292 2227 2590 2582 1934 1580 2234 1822 1001 1481 2669 3220 2207 907 1450 1624 -442 -2939 -1912 -1124 -2698
311 -2698 -3000 -148 1654 138 122 1445 878 -1399 -1742 -1909 -2210 -1455 -1050 -1336 256 2024 1080 -676
329 -676 197 666 -1002 -2462 -1248 159 618 1379 2877 4185 4154 3431 3203 2992 1773 314 -433 -70
347 -70 761 -112 -833 -1072 -1063 -2229 -4799 -6292 -5976 -5986 -6465 -5804 -2771 -614 436 1374 3368 4566 3482
366 3482 3339 3774 4038 3014 2676 3956 5115 4327 3330 3445 2823 1218 -1212 -3025 -3440 -4395 -5287 -6461
384 -6461 -5945 -4421 -4390 -5058 -3098 -1439 -2100 -2101 366 1441 1404 2536 4236 4777 5688 6399 4853 4308 5669
403 5669 3889 215 228 725 -1820 -3947 -2520 -2373 -3620 -3394 -2549 -3227 -2574 -2407 -4080 -3710 -1345 -2331
421 -2331 -2899 374 2881 1672 2388 5156 4514 2984 3457 2726 1341 1874 1630 -615 16 1902 -223
438 -223 -1601 410 -12 -3774 -3549 -2272 -3897 -4026 -1123 -880 -428 2013 1284 -1214 188 2302 -707
455 -707 -2122 449 -232 -2320 -664 1881 1514 2370 3205 135 -1266 607 -556 -2236 1777 3285
471 3285 -372 -672 2974 2234 737 3508 3028 -1100 -2258 -1751 -3656 -2966 1187 14 -2517 -1439
487 -1439 -1882 -4759 -2816 969 -998 -2450 -1274 -2448 -2797 1288 4325 3603 5146 5455 859 -442
503 -442 3554 3982 1742 3128 2736 -1493 -2671 -741 -627 42 1193 -2294 -6739 -5288 -4110 -5596
519 -5596 -2749 2024 -226 -3002 -686 1066 823 3527 5141 3354 2468 2666 413 1272 5134 5079 2459
536 2459 2391 1850 -1927 -3165 -1150 -1779 -3281 -3148 -4659 -5886 -3745 -1948 -2430 -525 1107 -914 -2374
553 -2374 -892 557 487 2179 3645 3798 4078 3805 3479 4545 4632 2513 1133 891 -827 -3079 -2654 -1278
571 -1278 -799 -830 -1273 -2369 -2816 -3402 -4274 -3589 -1472 -1271 -3198 -1551 273 796 1838 3059 3077 2391
589 2391 1746 436 46 1791 3031 2120 2240 2785 1621 455 559 541 216 -638 -2450 -3312 -2250 -1894
607 -1894 -2225 -678 673 -1093 -2543 -1518 -1010 -1477 -910 -373 -745 -494 485 717 1716 3105 2140 54
625 54 647 1400 460 640 2037 2017 394 347 899 765 657 285 -1340 -2567 -2440 -2880 -2772 -1021 78
644 78 -1419 -1812 -1360 -1047 -705 -9 401 411 227 -70 -450 1389 3572 3274 1892 2119 1833 224 84
663 84 1710 1780 482 -487 -1046 -1429 -292 -507 -885 -1170 -1323 -3455 -4358 -2163 -1111 -2113 -835 169
681 169 -484 -883 730 1330 1660 2435 1467 121 1033 1997 858 1536 3020 2007 59 231 664 103
699 103 9 199 -729 -828 -854 -2167 -2248 -474 -339 -2270 -1988 -691 -1197 -1996 -615 -27 -295 299 397 -55
719 -55 952 1526 683 822 2103 1523 512 1154 1350 371 427 690 296 19 65 -893 -659 8 -462 -1426
739 -1426 -977 -483 -1541 -2147 -1186 -704 -955 -650 -394 87 584 865 541 1321 1790 1452 835 1231 1819 1434
759 1434 651 1161 1360 936 80 -424 -269 -714 -1687 -1939 -1798 -1668 -1930 -2084 -1261 -945 -821 -1135 -908 -58
779 -58 -361 -295 242 1251 1671 2003 2235 2972 2916 2572 2312 2066 1629 693 117 -25 -180 -705 -591 -1095 -1273
800 -1273 -1372 -2156 -2835 -2643 -2637 -2470 -2611 -1251 -347 -123 117 1211 1999 1567 1301 1431 1833 1630 1394 1748
820 1748 2265 2535 1880 1616 1601 905 -367 -1214 -1728 -1561 -1827 -2339 -1480 -1053 -1166 -1271 -1248 -970 -952 -1562 -1389
841 -1389 -651 -129 135 808 1868 2029 1944 1496 1624 1491 1010 30 158 318 452 304 318 700 608 -414
861 -414 -1213 -992 -1270 -1962 -2229 -1137 -883 -397 -486 -21 578 529 -22 -333 56 -224 -621 99 667 1067 899
882 899 1480 1613 1417 1147 417 257 -54 -31 -782 -520 367 455 -69 13 393 97 -896 -1418 -1081 -1126 -1698 -1274
904 -1274 -1291 -525 -95 -383 -126 495 365 -960 -525 466 166 212 791 1488 1574 1640 1626 1429 1668 1403 82
925 82 -551 -187 -418 -1042 -680 218 -588 -1093 -1006 -1288 -1823 -1312 -1501 -1844 -982 -907 -1339 10 1473 1240 673
946 673 1673 1520 611 707 1461 1212 1591 1927 864 363 1694 760 -1046 -473 -539 -2335 -2816 -2003 -1778
965 -1778 -1968 -1036 -736 -1109 -503 -89 -1111 -219 1398 574 -125 1246 1847 1066 1749 3001 1956 1566
983 1566 1491 450 -346 379 -67 -639 -631 -483 -1244 -2025 -1065 -966 -1949 -1845 -1415 -1923 -1389 -663 -349 74 1392
1004 1392 1323 871 1364 1789 1006 1009 2018 1994 679 728 1188 835 308 590 171 -603 -334 -912 -2059 -1269
1024 -1269 -290 -1436 -1764 -605 -590 -1439 -692 215 -260 -94 319 -218 -291 716 968 97 853 1735 262
1043 262 -24 1449 1006 -129 953 715 -413 -298 656 -1 -227 1098 -154 -1251 326 511 -1200
1060 -1200 -475 33 -1131 -2161 -622 44 -712 98 89 -600 -405 519 -322 96 1642 1071 -686 462
1078 462 1414 626 1089 2412 1244 -18 143 -252 -999 262 873 -752 -1121 -432 -1270 -1548 -182 189
1096 189 -1058 -1339 -1254 -1702 -1099 496 460 644 956 676 -322 872 2030 1552 1507 1838 1213 -100 -23 759
1116 759 959 906 380 -667 -1309 -1280 -1572 -1538 -534 -217 -1455 -2215 -1628 -829 -406 10 169 140 157 -212 84
1137 84 1132 1422 1328 1522 958 1027 722 537 844 1239 583 -244 -543 -385 -791 -778 -225 -177 -717 -881 -1133
1158 -1133 -1385 -672 -604 -601 -253 -23 -61 -331 205 1013 720 748 1276 772 231 279 315 797 929 434 -13 12
1180 12 444 -283 -711 110 73 -590 -1183 -532 -1066 -678 -279 13 -477 198 -71 -771 -254 332 84 -168 418
1201 418 398 29 320 977 859 767 812 406 138 462 385 -608 360 373 -299 -354 113 -342 -823 -562 -569 -1231 -1130
1224 -1130 -974 -1032 -765 10 -94 -478 319 685 1 -67 876 817 644 825 1113 784 1215 1426 724 486 824
1245 824 115 -472 57 -281 -1159 -689 -537 -801 -1260 -922 -851 -997 -879 -994 -948 -599 -60 -321 -120 794 747
1266 747 562 878 1313 1158 832 1162 1135 836 464 393 212 320 139 -346 -266 -104 -1035 -1244 -1028 -1020 -1278 -1117
1288 -1117 -780 -858 -590 -237 -261 -326 444 454 183 333 683 784 677 671 972 892 723 712 555 529 280 -426 -345
1311 -345 -241 -631 -1014 -736 -285 -813 -827 -599 -398 -678 -363 -706 -165 -103 -131 204 476 823 789 806 744 985
1333 985 591 152 121 361 389 334 627 233 125 194 -24 -145 -370 -889 -998 -697 -864 -551 -617 -524 119 -188
1355 -188 -288 -561 -115 -444 -282 -462 -89 356 429 410 799 820 479 384 532 449 100 68 -85 -100 309 207
1377 207 153 195 -137 -536 -727 -595 -537 -950 -933 -516 -407 -269 -298 -140 121 -7 -32 -129 360 126 239 623
1399 623 696 698 326 748 458 692 292 100 -333 -59 -110 -480 -259 -186 -129 -364 -707 -458 -489 -813 -683 -681 -301
1422 -301 -191 -281 60 718 724 669 740 934 725 557 441 533 634 345 370 293 102 293 -459 -305 -459 -962 -1056
1445 -1056 -1119 -792 -768 -925 -626 -464 -239 -376 -232 -94 72 235 154 471 661 640 677 1104 1422 980 599
1466 599 510 638 78 -74 -381 -277 -507 -511 -610 -372 -242 -583 -830 -696 -536 -1030 -718 -396 -238 -296 56 14
1488 14 270 500 527 165 160 561 398 184 475 1040 642 455 242 477 19 -303 -92 112 -359 -560 -577 -426
1510 -426 -277 -58 -105 -585 -308 -690 -803 -849 132 72 -141 286 415 4 263 765 365 518 467 363 85
1531 85 510 634 84 349 711 -87 -688 -324 77 -400 -283 -56 -746 -947 -501 -597 -426 288 130 -761 -408
1552 -408 -236 -272 -61 713 911 296 573 653 11 590 1184 340 442 888 -186 -756 122 343 -55 -357
1572 -357 -148 -1198 -1186 -541 -496 -796 -146 -113 -1384 -711 -12 -337 -246 800 707 -93 241 841 93 645 1271
1593 1271 808 279 419 278 -412 310 741 17 -230 302 -573 -1080 -217 -209 -809 -614 -257 -870 -795 453
1613 453 -261 -320 602 700 -370 -104 471 -5 282 813 738 -14 695 615 198 195 909 24 -356 105 -110 -900
1635 -900 -246 167 -199 -306 44 -313 -749 -182 -309 -597 72 396 -687 -309 399 413 -150 797 753 196
1655 196 387 772 -67 248 859 547 -217 663 319 -343 -27 426 -368 -807 -262 -388 -837 -148 -93 -450
1675 -450 -317 57 -424 -494 151 -151 -525 228 430 -405 315 1016 595 141 720 1021 82 523 662 -60
1695 -60 -171 509 88 -523 10 -60 -450 -327 -250 -579 -810 -360 -848 -796 -80 -145 -455 276 223 -68 73 306
1717 306 228 7 639 514 494 721 790 318 45 535 0 75 165 -202 -520 -426 -188 -318 -618 -272 -340 -481
1739 -481 -398 -376 -678 -333 212 -185 -283 106 599 246 400 800 177 280 532 150 289 141 -37 227 383
1760 383 261 96 -80 -21 -286 -387 -373 -433 -483 -708 -690 -212 -191 -83 -8 -94 342 152 -56 85 321 243 290
1783 290 367 488 455 311 143 139 323 251 -165 170 72 -88 -208 -323 -96 6 -230 -493 -138 -66 -591 -481
1805 -481 -299 -201 -354 -340 336 -128 -65 349 -19 111 292 178 433 373 150 258 324 438 358 276 15 7 169
1828 169 -212 -416 -326 -492 -152 -537 -141 -253 -175 -430 -388 -226 -307 -245 -272 104 164 411 86 368 511 361
1850 361 474 467 597 319 259 242 129 131 -89 76 50 -185 -417 -655 -163 -709 -709 -607 -478 -202 -270 -214 -58 235
1874 235 303 305 111 -45 330 365 578 648 728 579 437 567 259 318 -44 251 -134 -278 -509 -561 -302 -338 -640
1897 -640 -586 -168 -326 -453 -293 -264 -148 78 26 136 435 487 -69 266 448 468 403 482 257 553 148 270
1919 270 121 162 -266 -65 -189 -329 -148 -290 -404 -436 -427 -287 -454 -263 -84 -32 -12 54 58 -30 -324 137 -314
1942 -314 75 188 236 352 429 413 349 332 203 -48 -102 311 110 -77 -120 205 -288 -57 -78 -114 -594 -255 -57
1965 -57 -505 -209 -153 -593 -335 -83 293 80 235 134 -95 300 167 172 264 439 346 434 596 315 279 330 193
1988 193 -261 -263 -65 -20 -333 31 40 -366 -431 -108 -348 -428 -173 -74 -134 -82 150 -140 -4 389 631 480 457 387
2012 387 159 634 422 34 236 617 159 -94 -225 -135 -282 -336 -281 -647 -542 -253 -481 -454 -191 -76 -455
2033 -455 -207 234 -29 -35 358 407 252 -3 266 -97 308 511 389 182 477 349 -279 -315 54 -293 -287 -97
2055 -97 -230 -368 -299 -85 -383 -330 -137 -211 84 -75 76 -187 87 320 254 318 424 295 -322 538 409 175
2077 175 93 207 -418 -218 122 -66 -34 324 0 -210 -335 -120 -114 -299 160 -151 -261 -3 -195 -128 94 549
2099 549 30 -46 170 13 -280 193 480 135 121 248 37 -163 196 59 -256 131 92 -184 -125 121 106 -84
2121 -84 -139 0 -209 -261 -186 -553 -450 -181 -189 -427 49 -50 118 -112 308 82 254 232 298 -24 412 263 235
2144 235 301 669 161 54 90 88 -131 -150 6 -390 -221 -369 -309 -516 -266 -255 -526 -85 2 -460 -114 -42 6
2167 6 -92 264 87 405 414 372 628 494 280 17 253 -70 -127 -184 83 -241 -70 -460 -143 -413 -725 -305 -462
2190 -462 -263 -202 -355 -211 88 235 116 9 101 275 301 151 306 191 595 196 70 347 210 122 -157
2211 -157 -62 -214 -146 -579 -406 -696 -300 -13 -468 -75 31 -260 -331 184 72 -173 23 473 21 236 320
2232 320 378 397 544 440 113 86 64 13 -226 230 12 -268 74 -134 -218 -63 -284 -220 -372 -133 -135 -118 66
2255 66 75 -137 111 247 -102 149 127 8 92 114 70 101 -160 3 208 54 350 -92 -61 232 201 174 135 -153
2279 -153 260 -328 -268 97 -192 15 -37 -114 -98 20 -108 -114 -116 97 -253 -285 -48 40 51 141 -125 107 23 -86
2303 -86 62 246 272 -11 21 72 217 -154 -23 -117 -179 -202 -451 -205 -240 -90 -306 -46 -177 -88 -158 -166 160 92
2327 92 83 -45 397 141 69 110 318 294 121 301 -84 71 100 66 -184 -6 -108 -250 -154 -290 -191 -231 -440 -259
2351 -259 -396 -68 -203 -182 -41 47 209 125 150 18 115 103 254 143 242 207 145 444 120 203 -55 130 -188
2374 -188 28 142 -334 -78 -254 -545 -144 -208 -52 -296 -376 45 -13 -18 -186 306 -16 150 253 297 264 269 133
2397 133 347 182 -6 -19 17 -121 25 -168 -195 -219 40 -316 -116 20 -164 -331 -54 -51 84 117 -19 65 72
2420 72 -351 -94 248 108 298 -200 70 -242 181 273 40 265 61 -120 -94 161 -105 64 -23 -72 -156 130
2442 130 -361 6 -20 -138 5 -195 11 0 48 -115 -157 40 -36 -147 115 70 122 88 264 31 105 123 196 152
2466 152 141 33 8 -106 -16 -146 -105 -311 5 -129 -356 166 -285 -159 -131 -289 65 162 -294 -207 78 11 65
2489 65 -37 63 125 206 -64 -136 12 -97 259 47 -71 137 -22 -103 -54 -4 -75 -70 -250 -67 -315 -426 121
2512 121 -226 -134 -58 197 163 -56 -190 -66 -240 201 205 99 219 354 207 287 448 222 178 132 -260 64 -142
2535 -142 -258 -191 -179 -241 -207 -262 -234 -312 -15 -65 87 -8 79 360 -181 43 307 444 201 285 156 -37 -8 160
2559 160 -120 -123 229 85 35 -185 114 -196 -38 102 47 -92 -33 -280 -77 -120 41 -100 -202 250 -133 127
2581 127 -15 99 -211 264 148 -144 278 115 265 -237 -13 26 27 -63 -58 71 -74 54 -298 -142 193 87
2603 87 -201 -223 303 -267 -155 5 56 -37 -142 138 150 140 -9 1 278 225 209 -55 -26 110 -153 -95 270 495
2627 495 199 -7 324 88 -221 -22 -60 198 -280 -190 -219 -104 -246 134 22 -249 -23 113 -59 77 -57
2648 -57 -39 -68 -135 145 140 97 127 36 81 142 -96 169 243 27 -309 86 1 -17 -10 -164 4 -150 -363 -170 -141 -23
2674 -23 34 30 137 -172 10 76 111 60 390 223 203 28 225 194 -4 -54 -55 141 -55 6 -7 -337 -1 -183 -22
2699 -22 -379 -129 35 206 -124 -44 27 178 -170 -25 154 410 49 151 154 -35 79 68 236 7 69 95 64
2722 64 -207 -239 -143 -151 -163 -133 23 -187 -58 121 -24 -89 -380 -130 -134 87 134 145 69 -328 -148 183 -228 18
2746 18 181 -58 75 58 209 188 -191 54 -111 122 -155 -89 -17 -74 -105 88 166 -110 80 -135 126 -26 -163
2769 -163 -216 -46 -107 -158 -120 -76 209 129 36 463 106 182 -132 218 172 95 -95 -29 105 61 108 -31 -118 -144 -253
2794 -253 -77 -146 -19 23 -5 151 244 -231 -197 210 -21 -98 1 33 -97 -45 -1 235 -105 133 -139 16 62 59
2818 59 -227 34 -112 -127 139 16 124 15 -55 -80 -219 -112 -111 -99 61 -18 -89 -111 277 105 -160 124 474
2841 474 -31 49 1 148 -11 308 36 102 -29 105 -162 98 53 -117 -267 133 229 125 55 -189 -143 -131 -90
2864 -90 -102 66 -129 302 135 175 -167 69 44 159 254 -66 298 7 47 149 -68 251 86 -163 217 64
2886 64 -49 -92 -157 -195 -109 -132 -172 -125 -80 -197 -74 -32 52 -179 -144 -159 -136 -44 7 344 196 322 127 157 -138 227
2912 227 282 343 307 -89 69 50 18 174 -127 67 -187 16 -36 -95 82 145 -263 -98 148 -276 -66 38 -85
2935 -85 12 49 -250 56 194 64 -103 80 54 123 190 46 -221 23 -70 57 -44 -5 -164 -57 -211 3 41
2958 41 -301 -91 -36 -169 189 67 48 227 -178 172 59 17 256 -65 126 283 185 -2 -20 -150 -429 -153
2980 -153 -20 -85 -223 -67 -20 -7 214 -11 -225 -143 140 -71 31 -26 36 319 62 10 -9 59 -13 86 67 49
3004 49 168 -57 107 245 -21 54 -108 77 -208 101 141 81 26 203 157 -106 -98 -116 -141 -79 26 -4 -7 -69 -72 -254
3030 -254 107 -59 159 63 -4 251 119 280 121 92 -16 -98 43 -174 35 -197 316 100 121 141 -340 297
3052 297 -142 -152 -285 -51 -70 -97 -243 -179 45 -105 246 185 125 147 38 8 266 105 -128 43 -75 -11 -186
3075 -186 -22 212 64 -105 5 19 -148 -169 166 35 -235 -355 36 -142 -309 -136 103 -52 -152 52 10
3096 10 15 4 164 74 -77 149 58 -120 54 72 66 -272 -116 85 35 -281 -181 261 48 -178 -271 -128 -265 45
3120 45 125 -23 -345 -132 141 -74 239 52 35 -139 24 47 6 -51 161 246 150 -49 -33 -209 135 103 21 -127
3144 -127 -162 -334 -119 108 56 -71 -7 237 -275 18 192 -181 74 137 88 -95 14 -284 -31 86 11 -302
3166 -302 -130 94 110 43 35 -30 22 -230 -149 -1 -128 -113 -40 251 -184 -140 30 -22 1 156 -9 70 -35 79
3190 79 143 -110 -36 164 166 -70 184 302 17 113 -79 57 127 63 -117 73 -20 -34 -60 51 -186 66 -166 -80
3214 -80 82 22 -174 -27 252 -94 -24 162 13 -353 95 -11 46 -96 222 -65 44 201 -79 -137 69 -73
3236 -73 4 89 -175 -94 -91 -225 31 59 -14 -326 -111 -271 -285 1 -71 -5 92 75 40 36 -267 -18 170 -162 225
3261 225 62 -150 -5 186 -78 -232 -40 -196 -50 42 -9 -171 -75 -124 -20 -68 277 96 -57 -246 56 -46
3283 -46 -51 176 -139 -123 -46 -18 116 124 42 29 -96 47 -134 176 -43 91 101 -221 -124 44 -45 -123 -215 -86 -119
3308 -119 -78 -96 -247 -106 209 112 -266 87 -55 -43 89 -12 40 -13 -48 126 287 112 -146 -13 69 386 8
3331 8 -65 87 68 -372 149 -106 70 -126 -18 -193 -234 7 -182 -109 -22 -135 -164 -113 -71 28 -133 30 142 -145
3355 -145 -30 284 53 32 105 -174 154 -60 112 31 8 -78 -81 -129 -172 -22 -239 -111 -96 33 -130 30 112 109
3379 109 -53 -266 -50 69 83 187 14 -25 154 -118 -105 -289 99 -59 221 -111 113 -32 -106 -68 86 50
3401 50 73 20 -348 1 -167 -28 30 114 -58 -237 -41 -124 -177 1 59 -99 16 -50 289 53 144 -33 183
3424 183 102 -47 51 42 -159 -198 -47 242 3 -127 -229 -10 -40 70 -138 0 -100 52 -119 -19 31 8 -2
3447 -2 257 206 165 151 -57 -55 146 -86 -96 -70 -186 -151 -140 -41 48 162 26 255 -68 -187 6 -236 -162 152 151
3472 151 82 -73 -160 -207 47 208 47 233 -51 -177 34 26 166 220 -20 -149 218 50 -70 161 -146 -238
3494 -238 -147 96 56 105 -15 -101 -9 70 95 -203 -132 121 -53 -132 -25 55 -186 370 -41 -160 266 -275 369
3517 369 48 329 150 153 183 134 10 78 139 -123 -147 262 133 -123 -105 -125 -167 -162 -22 -30 16 -8 198 117 -137 234
3543 234 113 59 293 -143 52 310 -118 -80 266 169 289 178 163 -106 250 178 -71 -287 7 -42 -157 -313
3565 -313 -102 -148 -138 -169 -197 -261 -120 143 55 -151 324 75 -14 -85 71 176 115 364 55 -140 -31 198 -106
3588 -106 -28 -45 -10 -220 -234 -293 -112 -87 -67 -267 75 14 13 -44 -181 18 -295 -94 37 -40 -10 137 137 96 153 32
3614 32 -148 -126 91 -25 -99 263 -177 -61 -301 16 77 -197 80 -370 -281 -96 -132 -130 -27 -108 -22 -62 -107 -102 -98
3639 -98 -245 144 -266 59 49 158 132 71 -49 -106 -227 -142 -140 -22 132 -80 119 -215 269 152 -105 -47 0
3662 0 -38 -141 -250 -36 65 246 -2 1 80 12 -163 -83 149 -140 259 -1 -122 75 -8 263 43 24 70 277
3686 277 -41 -89 -169 -212 -18 -70 -262 -36 51 -107 74 -15 -223 -195 -24 217 -19 165 253 -4 54 -5 152
3709 152 -89 232 26 22 -17 -159 1 -177 226 -143 -233 95 1 -63 -60 -162 -92 -95 -71 -230 38 46 -169 -15 -49
3734 -49 -211 -112 101 -53 -116 -7 53 126 228 56 199 86 164 -144 -82 173 12 -6 -13 52 -37 -174 -225 -276 -23
3759 -23 11 -73 -105 -152 -181 -102 -202 -320 229 135 61 100 164 71 329 -34 -25 -125 88 420 185 -205 155 45 -78
3784 -78 -96 -64 -7 257 225 -109 -120 50 113 56 -53 -97 66 110 -46 126 -36 263 11 -72 58 144 215 132 134
3809 134 14 198 29 -54 92 97 91 138 -93 290 -149 -41 100 -140 -147 -135 40 -19 34 -102 132 153 -181 -144
3833 -144 119 88 163 86 238 -71 -198 2 1 -189 -63 65 103 -233 94 -205 -96 111 -72 -220 -96 46
3855 46 -196 -111 -206 -341 2 132 -51 5 2 40 -148 88 157 -23 22 46 -9 3 139 -15 116 32 -4 -70 113
3880 113 147 -19 -93 -34 -95 26 -261 -441 -159 -268 259 117 -89 -151 -163 -134 -7 -70 35 200 -109 -70 95
3903 95 -62 99 162 56 -136 153 124 -112 -156 -186 266 403 222 -34 16 -150 225 -55 -123 -121 -20 200 -259
3926 -259 -54 22 -215 5 -65 234 3 -50 -85 452 -22 -27 135 14 -111 399 35 -52 -168 -86 -255 -197 30
3949 30 -137 212 -42 68 -163 11 128 -10 -337 -32 -74 114 168 -113 26 154 -176 31 151 176 140 23
3971 23 0 145 456 -104 -78 -53 -65 101 -101 229 27 51 97 -243 -51 -99 -76 -58 -117 -113 185 -139 110 360
3995 360 -51 7 261 53 -64 147 17 -149 -87 -52 214 -114 74 90 -335 -120 19 3 155 -81 -205 -187
4017 -187 96 37 23 -39 55 77 -173 -37 -329 -93 106 -11 38 135 51 56 333 43 82 21 99 -66 -79 -155 -86
4042 -86 -99 -3 45 -276 -182 -102 -133 -66 -43 -157 -146 35 294 -182 53 184 -70 36 -25 324 94 6 22 153
4066 153 190 51 -9 -20 -44 227 -113 7 -228 -251 -56 -128 -69 232 -61 49 -57 -74 -128 -144 73 -97 -43 -165
4090 -165 152 260 9 65 16 23 439 -26 -82 -57 151 124 276 -99 87 -240 -136 5 -271 -87 -69 -43 -269
4113 -269 -244 -156 -231 95 -94 2 -128 74 -95 -42 42 -97 84 85 54 57 -15 212 64 71 4 47 14 -39 262 -50
4139 -50 28 16 181 -77 125 -75 35 -110 -116 -53 -77 -110 -33 124 -256 22 -240 165 -58 234 -53 227 38
4162 38 268 -28 -8 -44 -66 -224 170 -44 -43 -270 -96 -211 141 -193 -239 6 -112 12 179 81 -63 -335 -138
4185 -138 -1 -49 9 138 83 57 193 48 174 172 -311 -99 228 329 -123 -54 -15 87 -48 -143 -40 -136 -462
4208 -462 -128 87 238 -183 140 -118 168 -115 33 -185 144 29 283 82 151 -110 -63 262 57 56 5 80
4230 80 -3 -44 -95 -100 129 50 133 -62 -55 -95 59 12 -67 314 213 -49 55 79 -114 -96 -48 -109 -6 55 -42 131
4256 131 270 -97 -20 54 68 33 86 281 178 71 39 84 0 104 -196 -241 15 -170 138 66 105 -285 -134 -44
4280 -44 120 88 -29 39 6 -55 200 -6 -4 32 120 -40 -67 -100 -88 80 98 44 -23 -167 147 -120 -157 -20 34 -170
4306 -170 -101 118 -28 21 -111 187 -104 -26 19 353 220 54 54 -88 -18 44 -39 -169 26 43 -53 61 -46 -30
4330 -30 -87 268 -125 -87 -80 -15 -305 -49 -236 -4 -35 -28 -6 -177 -50 -230 -205 -101 203 -22 -94 117 -68 215
4354 215 349 293 178 72 227 4 99 -161 -62 -196 -138 -68 -151 72 -225 48 -18 -164 -129 -112 -177 -76 143
4377 143 -4 230 -65 -23 179 92 166 -122 110 71 -161 38 -7 161 126 -496 -154 -121 -178 -129 -101 -29 -147 -170
4401 -170 -189 -44 -8 -205 -359 -125 -41 -187 -116 69 -42 197 84 43 -126 -143 251 -68 -61 110 176 67 142
4424 142 142 -9 189 -2 288 -229 -37 18 -5 194 -172 201 53 -242 -26 -74 -38 -184 -17 -120 90 -40
4446 -40 -42 -42 164 104 -62 -41 244 130 -139 -244 -118 57 -248 140 169 -256 -100 57 27 -176 -48 -253 6
4469 6 -36 -169 7 -232 -197 284 -202 13 188 -230 141 -80 -98 -49 45 142 15 95 80 114 259 121 -20 -236
4493 -236 348 -16 -103 -12 -158 -66 -101 -63 -87 6 179 41 -12 -45 5 -230 148 21 176 274 -77 126 -8 309
4517 309 40 64 -81 75 -78 88 50 49 -102 -169 57 -78 -316 -44 -40 -254 75 -127 -149 -310 -155 36 5
4540 5 28 273 31 -75 90 -146 107 49 233 259 -13 266 94 -13 50 159 -97 -222 -229 191 -65 31 -182
4563 -182 -110 -100 -192 -69 203 -386 92 -45 68 146 124 -79 121 192 -138 -232 -73 77 36 219 31 -223 28
4586 28 -6 6 181 -108 71 -63 27 30 50 -116 76 52 -162 169 -77 95 -242 54 -111 19 75 -38 233
4609 233 12 293 -108 -118 176 189 37 -160 -73 -67 146 -66 -163 -128 19 151 -69 -251 -309 -79 -91 -120 -1
4632 -1 -147 -152 10 -27 6 413 155 60 -181 9 -91 -12 125 82 216 -65 -88 -217 -168 -245 -52 -72 -45 -365 66
4657 66 -138 133 -254 23 40 -124 -73 -101 -31 97 172 117 257 182 -11 -138 272 96 35 -116 -202 34 -81
4680 -81 110 93 -143 210 -15 -20 -176 -153 -159 38 -128 -72 -200 -119 -52 -170 17 -67 29 117 81 7 160 341 71
4705 71 -229 -7 -160 -115 14 -140 112 120 -74 67 83 -83 125 109 -447 -43 -34 -230 -12 59 -114 -89 -49 -167
4729 -167 -103 77 -143 25 -112 -91 -32 247 -11 9 36 -116 -114 209 366 -90 -43 16 -147 88 -102 -211 91
4752 91 15 -188 191 5 -230 -117 -2 -224 -229 -93 -81 90 336 46 -74 -53 134 224 58 5 -32 309 77
4775 77 136 41 -3 141 150 102 -208 -405 -26 -11 126 -28 -89 -81 -82 6 41 64 123 5 -108 127 190 -104 224 -146
4801 -146 248 60 189 -160 -68 99 -23 146 90 -119 82 -21 95 -33 -69 184 228 -8 -211 30 7 -190
4823 -190 -162 256 98 -76 -129 -56 152 216 211 183 32 205 232 53 215 -15 -13 314 55 180 -189 246 -106
4846 -106 120 -17 -229 -31 -144 -65 -157 -168 213 -15 -156 -195 -46 183 -157 -247 77 -30 156 118 -25 303
4868 303 46 5 71 -87 177 100 14 95 -100 -131 -104 -109 -247 11 -133 -273 165 -179 -144 10 -99 -186 249 -34
4892 -34 -237 -63 -136 -140 3 -62 71 96 38 1 318 -105 142 46 -9 -176 155 -70 212 61 -46 7 -31 -40 -185
4917 -185 -86 -91 19 -336 -9 -336 6 -61 -164 214 17 -10 55 73 -54 -91 32 146 95 45 302 85 -82
4940 -82 117 20 100 -209 -117 -289 -101 -88 -184 -254 -180 -192 -201 139 74 -57 81 21 -111 -51 -215 25 44 -92 159
4965 159 31 -37 25 -141 48 164 99 223 -134 52 -7 -136 -408 -141 -29 -77 -87 65 49 76 -66 140 -63
4988 -63 -233 133 -126 49 228 155 -20 211 272 -44 -137 154 182 9 89 -32 -28 -16 -182 -63 -156 136 -96
5011 -96 -61 -56 -191 -228 219 72 -195 -97 -287 -22 -127 -20 -17 4 -107 184 24 159 270 73 166 100 53 -133
5035 -133 -24 81 129 -65 69 -348 -39 -57 -77 25 59 43 16 252 205 221 -42 -200 138 -107 24 -21 182
5058 182 135 -5 193 -199 -81 -46 -61 196 138 -5 -74 -68 60 9 84 353 -72 80 -168 -138 -108 -86 18 -149
5082 -149 -316 -145 -180 -89 115 -283 -62 22 217 118 47 206 -22 -85 202 148 -197 66 44 182 10 -144 51
5105 51 -67 147 -79 -159 -174 -104 -250 -73 110 -3 4 42 -165 -131 -92 94 101 -73 130 12 -107 -31 58 204
5129 204 56 256 -106 14 -179 -277 119 -121 -204 -87 -6 -29 -255 -25 228 -186 88 -69 118 125 132 40 198
5152 198 -148 118 17 -27 -11 -5 -11 -78 223 45 -41 -51 144 8 -2 -161 22 -9 -104 210 28 -15 -205 145
5176 145 -150 61 -87 -246 -165 -320 -138 -96 -38 50 -5 -116 22 227 181 73 -122 141 -57 61 -74 138
5198 138 134 86 -311 -254 61 -139 13 -17 -93 191 146 -48 -272 45 -38 -71 88 43 -280 156 171 -62 123 231
5222 231 201 26 -197 14 47 -306 85 -59 46 135 27 116 -52 55 170 -158 -199 -102 -299 -101 132 -48
5244 -48 -25 26 -111 261 129 2 142 13 94 -170 -30 32 85 -44 41 -21 21 173 -257 236 1 33 -161
5267 -161 161 -129 219 -92 -105 -160 66 -174 48 -103 -83 115 259 -18 -74 263 -69 367 -60 104 30 -62
5289 -62 151 125 191 27 -203 -158 159 -3 -69 -318 -15 8 -198 -71 -83 -126 -159 -66 15 -119 22 -149 -160 -63
5313 -63 -246 42 98 -142 62 -19 55 108 417 212 145 60 136 -34 197 22 -280 24 -173 -57 33 -151 -238
5336 -238 91 -108 -105 -218 -8 64 35 43 107 238 -3 -10 246 291 -135 -86 276 -139 -41 44 -86 118 70 -164 247
5361 247 -33 -36 34 -141 2 -225 13 -209 -233 161 -119 -281 -69 84 -94 74 -302 -41 199 -4 119
5382 119 -108 275 316 2 -53 135 62 142 -107 -118 -104 46 -139 19 -45 -63 103 -33 28 -40 -155 -10 -57 -63
5406 -63 124 -37 -5 -70 30 28 174 247 224 232 63 335 26 31 -21 17 -114 -6 225 -56 84 -140 -16 -62 138
5431 138 -147 -44 -74 -226 -266 257 29 -160 172 -2 -152 -16 -5 190 13 -67 12 -42 171 182 180 -198 57
5454 57 210 174 49 307 10 38 -90 -190 -38 -195 -109 -60 41 209 -50 135 212 157 -60 168 135 73 129
5477 129 -7 56 -140 0 220 -8 -14 214 66 -101 222 151 46 65 -43 28 -49 150 47 -23 35 -219 19
5500 19 95 -80 389 231 88 -158 96 -61 -155 -46 133 297 -75 -45 164 85 77 76 44 -278 12 -204 -356
5523 -356 -48 -215 155 -122 182 -78 -136 -85 -178 -187 -28 -100 -248 -153 101 89 -66 -87 201 -107 127 226 105
5546 105 -21 -32 -41 46 -139 126 -71 84 48 14 186 -14 -145 -188 -142 296 -12 -116 60 -141 176 56 1
5569 1 21 -24 -51 -9 1 -40 -26 -41 31 65 123 143 -27 104 -126 -242 40 -180 -83 -257 -88 -148 -329 -1 -91 -138
5595 -138 11 -328 84 220 97 -236 -42 39 276 -104 -119 -109 146 -42 85 10 133 64 105 311 -151 156
5617 156 -111 -44 -47 -150 -105 -31 -115 24 -50 52 50 -9 -78 -214 -27 -66 -75 -152 -2 130 148 -46 -3 156 -189 237
5643 237 293 -9 129 148 -12 -84 -129 73 3 192 4 -210 -233 -244 -178 -229 0 -184 -15 -78 -16 182 -52 209
5667 209 -165 0 73 -86 24 100 188 35 146 195 -96 -224 86 100 88 -2 -276 -198 -367 48 130 148 -94
5690 -94 -97 -139 19 -131 -160 -217 -120 -37 -133 -195 -198 208 4 -107 229 90 111 -52 17 -6 -15 228 -155 -162 88 51 -38
5717 -38 -96 -150 -135 121 -52 294 -134 -245 55 -199 -152 -105 -84 82 161 166 52 107 -33 -24 226 93 -232 88
5741 88 26 165 -124 -97 218 -85 -164 -59 -35 -17 0 -33 28 21 -73 -83 -231 -107 183 -114 56 56 20 131 233
5766 233 -74 -103 -126 100 -32 414 85 -83 97 44 -125 -138 44 158 12 -168 98 5 98 106 -162 -214 26
5789 26 269 59 -61 -129 107 -44 121 84 -27 186 51 267 23 131 -129 -196 27 -17 84 -5 -25 -102 129
5812 129 129 -307 138 153 67 -86 128 -18 113 -5 -233 -164 -1 151 106 -203 88 172 -87 136 -178 297
5834 297 -25 1 -2 -317 36 70 -182 132 -87 395 12 -131 -5 -270 -157 -7 1 180 160 -97 42 46 -92
5857 -92 322 72 -13 -113 38 247 46 -5 207 264 99 2 -15 19 51 185 81 124 -27 194 85 -182 -65
5880 -65 -40 -86 -135 56 -41 -140 -259 103 -35 9 91 57 120 93 176 58 41 -8 56 4 120 1 143 73 -90 57
5906 57 103 -133 -101 207 -22 -272 -89 -121 25 -214 -5 62 -177 -179 -61 5 -228 -84 -36 -48 -19 200 42 114
5930 114 93 410 143 199 -68 -87 54 79 101 -33 44 -107 114 208 -224 150 -75 150 -65 -159 -56 -159 135
5953 135 -11 82 -79 -69 34 24 200 -95 -175 5 252 -139 1 44 70 93 -50 47 -75 -134 93 -174 -263
5976 -263 3 0 221 -73 -5 115 -277 270 136 99 210 37 117 -16 -177 206 121 152 172 310 334 311 29
5999 29 8 113 41 69 -208 70 -212 62 221 -22 -71 -168 1 137 -39 -46 -252 69 -2 -4 -127 102 58 -203
6023 -203 54 76 -65 139 220 -85 116 182 61 104 104 -47 41 54 63 125 56 -137 9 66 11 -207 -31 29 -130
6048 -130 -102 -77 35 491 200 -20 -51 -81 -110 -144 196 -18 233 -255 -47 -61 8 -17 1 38 -91 -66 -103 -60 -113
6073 -113 222 -209 -136 -87 -217 -74 -192 -32 187 172 10 -21 151 67 33 97 447 62 98 253 221 -81 -90 45
6097 45 -22 -82 174 -98 77 76 155 316 59 -54 -53 -268 -181 -155 150 -8 -66 116 5 -138 -116 112 147 -51
6121 -51 -51 20 59 212 -52 86 289 85 -16 -166 -132 -62 91 -108 62 80 -29 -55 22 -174 -48 111 -38
6144 -38 -36 -62 -163 -163 -220 -179 -82 -119 -37 84 22 234 176 -92 -132 275 -8 29 -159 215 -19 120 71 21 59 186
6170 186 15 128 -39 -9 -77 -174 -199 151 3 -252 29 193 61 63 -39 -146 142 -22 -194 -20 -42 -169
6192 -169 64 54 -174 159 -1 197 133 -28 103 -46 -51 11 84 -9 -111 18 -89 98 40 34 -364 20 35 76
6216 76 -76 198 136 -156 -89 -82 136 -31 59 115 47 251 111 -278 254 -128 -87 82 61 -24 -172 48 -15 -199
6240 -199 -45 83 12 131 -67 -35 -70 2 104 -13 -46 139 -33 153 132 242 -100 -80 -146 221 79 -77 46
6263 46 -15 94 -208 -140 -115 257 173 130 -100 43 217 43 -43 -147 -348 -72 -142 116 153 51 -54 34 -71
6286 -71 -157 73 -43 33 -13 47 172 -192 88 67 115 207 -108 -39 68 86 -88 185 -83 163 29 37 -185 136
6310 136 39 11 27 -145 -177 -104 79 -106 266 67 -150 -53 38 -71 -112 191 18 -67 -34 -33 -115 -91 -180 -111 6
6335 6 -30 19 292 -44 -46 32 16 4 158 -117 -69 -204 42 40 -146 232 -103 59 2 80 47 100 124 -99 155 61
6361 61 -185 22 81 -39 175 -145 11 21 47 132 82 -146 143 -3 75 -77 -46 9 104 -57 110 188 -83 100
6385 100 100 173 192 -142 22 98 -146 60 24 46 -342 24 -134 -38 -87 73 -57 -4 -309 -153 -52 -95 67 -133
6409 -133 -12 -519 -263 -126 68 298 11 -43 116 111 43 200 -7 55 -59 -159 97 278 144 123 -3 205
6431 205 -112 -153 -251 -62 1 -159 -142 -19 -144 90 -94 15 -178 -148 218 41 -12 144 -94 168 -23 -44
6453 -44 -63 194 284 -63 58 124 553 196 22 -63 32 -27 -5 27 -73 91 -25 3 18 48 4 -161 65 31 219
6478 219 39 -88 -115 121 83 239 304 -7 -60 -78 -235 23 121 -10 263 81 -122 40 35 -125 109 98 -88
6501 -88 32 -141 28 -79 56 -10 -36 138 27 -137 178 296 -27 -81 -17 -81 286 59 2 -21 -74 130 -115
6524 -115 9 -326 -221 338 -131 41 -12 -188 -73 -40 288 28 -14 -58 -207 44 -64 26 118 39 122 -98 38
6547 38 182 -17 38 148 40 33 34 -144 8 266 10 -84 -319 -166 55 -207 -82 -222 -75 51 59 -42 -1
6570 -1 -40 21 194 114 -27 -16 177 -169 -23 -16 212 -14 21 75 -182 31 221 -59 -45 -25 -301 110 23 -70 246
6595 246 126 -55 -86 -84 -44 38 -120 113 103 163 57 116 -54 -142 124 -67 226 -81 -76 0 148 6 -39 150
6619 150 -79 118 69 18 -94 92 -85 29 -29 -95 6 -58 105 -185 -205 -16 135 108 -153 -9 -279 214
6641 214 215 76 37 -191 180 -78 10 193 -42 -197 -37 -90 -15 -69 175 -80 -127 -48 -239 -235 99 -207 16 -320
6665 -320 -50 119 -162 -6 -195 -146 92 29 196 218 -68 6 141 21 -113 119 114 -77 -334 -250 -211 -85 -48
6688 -48 -51 -279 23 23 -83 -45 234 105 -115 33 -161 -21 94 27 -85 -229 -108 -33 241 -2 -104 -4 62
6711 62 -128 69 -116 81 345 63 125 14 32 -33 -96 -91 81 -86 4 18 -14 -32 -224 -141 -15 239 -42 -53
6735 -53 -69 -180 114 -60 -21 -261 165 151 -233 -21 19 108 11 -12 -134 -47 60 -16 305 80 16 74 -187 -217
6759 -217 -145 -302 64 11 -97 13 276 -151 21 152 -52 -61 -135 117 -155 -84 118 -5 116 -49 -139 57
6781 57 -111 -110 19 -331 87 69 18 -96 104 126 268 -63 -3 -140 227 325 269 -5 -35 147 -88 24 -69 20
6805 20 50 -65 -6 111 6 -83 193 -22 83 36 63 -49 -9 141 21 -5 13 -42 41 -43 115 18 118 115 -8
6830 -8 85 -66 67 -44 -228 36 61 85 164 -238 -88 -194 -31 -13 -125 339 60 -16 -19 34 -166 -129 142 -13
6854 -13 -101 239 50 -157 92 79 111 103 -155 169 36 -361 -55 70 -43 -176 -34 156 25 -110 159 -64
6876 -64 -204 -65 -146 -29 11 -8 -159 -104 62 -52 -46 -3 -151 83 -69 -248 -33 147 150 -142 205 -38 70
6899 70 -12 -90 78 -121 -70 151 61 162 348 -84 -14 -78 -92 -35 -118 58 76 -82 5 -91 -109 154 -71 53 61
6924 61 240 16 106 136 -99 111 59 -71 -77 48 64 -12 -47 209 131 106 -68 -57 -20 129 216 -147 -20 -82 -198
6949 -198 156 8 8 31 51 -61 -23 -7 118 106 111 -18 16 -143 10 -201 -173 -175 -85 -17 105 275 -28 -29 134 -370
6975 -370 83 -35 -156 -21 -127 -39 189 -128 229 49 294 10 145 -24 32 5 118 44 81 226 74 227
6997 227 19 -7 163 -33 212 -203 -178 231 25 -9 31 -353 -2 59 -21 -39 50 34 -183 39 -164 -160 178 -78
7021 -78 11 -71 -182 -118 127 9 -94 15 178 49 -13 -55 10 -64 -39 -34 157 -43 111 -296 -48 35 -61 26 -154
7046 -154 -167 -123 23 -36 163 -205 -111 18 27 406 21 -10 -45 1 -224 -84 -65 -114 83 -94 93 6 -95 26
7070 26 -18 -173 29 -103 -131 8 -161 36 -151 -87 -248 28 8 -74 -268 -76 -46 -70 -65 135 -96 -46 0 -20
7094 -20 57 101 -131 -223 -212 -76 -22 52 -10 -105 -275 -159 -168 -62 -63 -275 236 -15 -60 -99 -27 -25 19 -138 -128 -110 52
7121 52 -96 -26 250 93 -217 -8 190 -228 141 -154 101 -222 -99 167 60 -57 111 -103 -81 -130 -233
7142 -233 -240 -55 159 78 -164 -134 288 85 2 5 -91 64 -230 261 58 107 145 -17 -58 157 35 -70 -54 -14
7166 -14 -4 114 -116 -46 67 -58 73 103 -57 -83 18 64 -150 -115 197 -52 4 -299 -75 -94 -64 -181 -128 -24
7190 -24 150 254 222 -116 83 166 -145 -16 228 15 82 -236 -155 -7 -10 -146 137 -19 -71 -18 17 -43 -136 42
7214 42 119 96 -166 -1 54 197 67 -193 -70 65 126 -115 -123 -52 145 299 -131 -129 -78 -291 -258 12 163 62
7238 62 145 243 225 22 25 -153 152 73 10 -197 185 39 4 51 134 -117 202 -60 106 54 -62 12 -292 248
7262 248 -133 7 32 -29 -150 -77 -17 18 148 50 80 -111 -34 -78 -147 -16 -83 154 -49 219 269 114 -36 86
7286 86 -34 138 157 -126 131 81 -93 -211 85 -85 34 246 -46 302 -99 2 61 41 -78 -173 47 -45
7308 -45 -9 -72 -134 -125 -225 -89 -136 -235 214 43 113 18 -127 161 -9 -136 138 168 108 -107 -138 -215 -83 -22 87
7333 87 -79 -137 -70 85 -175 -237 -340 208 85 307 -120 25 -20 14 56 240 177 118 71 94 59 -231 -200 5
7357 5 252 -152 -37 11 54 32 -230 -26 237 22 20 54 -118 60 -156 187 -106 29 38 122 -242 166 2 -44
7381 -44 -115 -65 -8 -96 28 -132 19 -61 -37 57 59 62 84 15 -88 -97 21 -101 -55 136 -27 132 33 10 45 54 72 -56
7409 -56 188 95 -13 63 64 -32 16 5 -300 69 179 148 -91 -153 -76 182 -195 -53 -83 -234 -120 139 125 -88
7433 -88 299 -210 -176 244 3 -170 -132 -124 -150 -164 220 -66 -168 251 175 21 131 244 -73 -48 -5 73 -36 14
7457 14 -164 18 153 126 129 17 62 76 270 14 -18 -40 144 183 -189 44 -52 -79 -19 -81 -78 -32 157 -314 -12
7482 -12 23 -85 77 0 -117 -35 -129 -268 79 -131 58 -15 -121 161 77 126 175 140 287 132 160 -163 8 175
7506 175 -89 -2 137 -59 90 222 -197 62 -111 41 23 114 -30 62 -174 -206 -19 177 -29 91 22 -288
7528 -288 -182 7 39 358 -51 16 75 112 -70 164 260 80 63 54 128 88 -259 43 102 -91 -123 110 -11 68
7552 68 112 -186 -47 -46 -47 -33 -159 -103 10 25 3 -19 192 -151 75 69 70 -151 15 256 -68 -110 23 23 12 -13 113
7579 113 -37 -57 -42 68 -45 123 181 -102 -20 21 -93 100 -169 -17 -44 -129 -12 -51 -73 122 -46 -117 -8
7602 -8 120 23 35 -184 144 -63 148 157 -46 -167 26 36 112 -176 -175 101 -39 -214 0 68 -18 33 -57 -35 13
7627 13 12 6 282 -25 -247 204 131 203 -62 -118 11 -106 87 -25 -6 -129 -140 -175 42 43 -76 61 26 -59 55
7652 55 194 -178 -189 145 -13 -146 -156 -39 28 19 -229 -6 -9 -30 292 -240 30 110 -258 -54 -50 236 -74 50
7676 50 193 -121 0 21 -283 -86 -112 -132 -65 66 -159 -279 -100 19 -15 232 -227 -23 0 3 -106 59 -102
7699 -102 -264 -142 135 69 36 -137 176 21 166 59 103 31 -288 -11 88 -126 -294 -20 61 162 -50 278
7721 278 -79 122 104 -79 -113 17 -228 132 7 64 -11 246 78 -122 -164 129 -8 101 -36 -21 62 -58
7743 -58 -43 116 14 54 -19 50 109 111 22 -44 -84 -118 -114 35 94 65 126 95 163 -8 -43 -78 38 -93 14 -158 -99
7770 -99 -19 -255 238 106 -8 -236 -113 104 -11 91 -49 69 217 -81 -261 -147 -118 -246 52 -276 39
7791 39 16 273 -85 82 135 -21 198 -80 -41 -190 34 26 -322 -139 -194 205 110 -4 -80 64 150 -62 -129 -64
7815 -64 5 151 63 -25 -36 -23 -138 109 -46 104 78 -163 -104 -177 151 -109 -21 171 -164 17 90 -8 159 28
7839 28 -10 -236 91 -28 -67 2 -104 140 168 -64 -191 44 100 138 204 -23 27 70 35 -50 75 86 9 286 231
7864 231 -105 53 -17 -8 -36 33 -118 47 121 -293 -42 130 87 -194 117 -127 68 -49 34 10 -82 -6 -58 198
7888 198 -31 -192 224 -99 80 -107 94 195 98 -19 21 -31 -239 134 -65 75 9 74 -22 -4 -311 -26
7910 -26 -185 -173 1 105 11 58 -82 19 -284 -19 9 -96 150 156 -23 -82 124 -62 78 -31 -81 111 -50
7933 -50 89 49 -125 48 228 300 -65 302 -149 56 -104 -161 -97 37 -169 86 -153 -219 16 13 161 -16 28
7956 28 187 16 -132 5 -297 94 6 -96 53 55 -80 132 -6 -240 36 54 164 -68 118 285 -9 50
7978 50 243 92 -28 -45 44 -70 2 -58 95 265 63 35 71 -89 21 60 361 102 -27 118 62 279 -183
8001 -183 89 -194 29 61 278 -213 -99 113 102 105 157 88 -47 -57 -319 224 -130 120 -14 -321 67 170
8023 170 129 -157 -19 -40 -34 -38 91 22 49 -2 35 -13 -51 -58 -49 -138 -70 229 53 -62 210 200 -71 -91 29 -95 -52
8050 -52 -25 -178 -147 109 10 -44 137 -197 -80 49 -78 -147 217 -197 -3 -55 44 31 59 121 -12 -240 142 14
8074 14 -159 -238 -37 -12 140 -203 25 -205 -210 -99 -13 -11 211 153 15 -156 41 16 -86 10 35 127 191 -325 -30
8099 -30 -10 215 -97 -6 58 -45 42 -84 -97 47 -24 23 -34 -30 39 72 -86 -80 1 184 -167 -124 209 -150 -147 -25
8125 -25 -24 -140 -23 83 -10 -358 107 59 88 -192 58 -21 -14 -5 -151 120 -73 -321 -43 311 260 -145 -192 220
8149 220 -111 147 175 108 62 -37 150 -228 208 70 95 -88 13 249 294 83 -30 76 35 46 -9 -178 57
8172 57 -194 287 -17 -84 -14 -21 279 178 76 235 185 149 -80 7 78 82 -7 -79 212
8191B12
##END NTUPLES=NMR FID
##END=
