##TITLE=1H_SR9_kTFA
 CDCl3, 8 sc, 
 25.11.2020
##JCAMPDX= 6.0         $$ Bruker NMR JCAMP-DX V2.0
##DATA TYPE= NMR FID
##DATA CLASS= NTUPLES
##ORIGIN= UXNMR, Bruker Analytische Messtechnik GmbH
##OWNER= root
$$ XWIN-NMR		Version 3.5
$$ Thu Nov 26 10:18:37 2020 Russian Standard Time (UT+4h)  she@DPX200
##.OBSERVE FREQUENCY= 200.1315066352
##.OBSERVE NUCLEUS= ^1H
##.DELAY= (6, 6)
##.ACQUISITION MODE= SIMULTANEOUS
##.ACQUISITION SCHEME= undefined
##.AVERAGES= 8
##.DIGITISER RES= 18
##SPECTROMETER/DATA SYSTEM= spect
##.PULSE SEQUENCE= zg30
##.SOLVENT NAME= CDCl3
##.SHIFT REFERENCE= (INTERNAL, CDCl3, 0, 15.7039)
##AUDIT TRAIL= $$ (NUMBER, WHEN, WHO, WHERE, WHAT)
$$ ##TITLE= Audit trail, XWIN-NMR		Version 3.5
$$ ##JCAMPDX= 5.01
$$ ##ORIGIN= Bruker BioSpin GmbH
$$ ##OWNER= she
$$ F:/spectra/data/she/nmr/H-F/1/audita.txt
$$ ##AUDIT TRAIL=  $$ (NUMBER, WHEN, WHO, WHERE, WHAT)
(   1,<2020-11-26 10:17:42.73 +0400>,<she>,<DPX200>,
      <created by zg, POWCHK disabled, PULCHK disabled
       configuration hash MD5:
       00 E9 B6 7A A2 85 ED C7 34 08 36 98 17 FE 4E 26
       data hash MD5: 16K
       C2 D5 CD EF 4A C3 5B 64 63 4C A9 69 DB 74 65 C2>)
$$ ##END=
$$ 
$$ hash MD5
$$ 2A 33 40 59 B5 A5 27 F0 0B C6 35 C3 78 4C A3 51
##$RELAX= 
##$RELAX= 
##$RELAX= 
##$RELAX= 
##$RELAX= 
##$RELAX= 
$$ Bruker specific parameters
$$ --------------------------
##$DU= <F:/spectra>
##$EXPNO= 1
##$NAME= <H-F>
##$PROCNO= 1
##$TYPE= <nmr>
##$USER= <she>
##$AMP= (0..31)
100 100 100 100 100 100 100 100 100 100 100 100 100 100 100 100 100 100 
100 100 100 100 100 100 100 100 100 100 100 100 100 100 
##$AQSEQ= 0
##$AQ_mod= 1
##$AUNM= <au_zg>
##$AUTOPOS= <>
##$BF1= 200.13
##$BF2= 200.13
##$BF3= 200.13
##$BF4= 200.13
##$BF5= 200.13
##$BF6= 200.13
##$BF7= 200.13
##$BF8= 200.13
##$BYTORDA= 1
##$CFDGTYP= 0
##$CFRGTYP= 5
##$CHEMSTR= <none>
##$CNST= (0..31)
1 1 145 1 1 1 1 1 1 1 1 1 1 1 1 1 1 1 1 1 1 1 1 1 1 1 1 1 1 1 1 1 
##$CPDPRG= <>
##$CPDPRG1= <>
##$CPDPRG2= <>
##$CPDPRG3= <>
##$CPDPRG4= <mlev>
##$CPDPRG5= <mlev>
##$CPDPRG6= <mlev>
##$CPDPRG7= <mlev>
##$CPDPRG8= <mlev>
##$CPDPRGB= <>
##$CPDPRGT= <>
##$D= (0..31)
0 1.2 0 0 0 0 0 0 0 0.06 0 0.03 0 0 0 0 0.0002 0 0 0 0 0 0 0 0 0 0 0 0 
0 0 0 
##$DATE= 1606371462
##$DBL= (0..7)
120 120 120 120 120 120 120 120 
##$DBP= (0..7)
150 150 150 150 150 150 150 150 
##$DBP07= 0
##$DBPNAM0= <>
##$DBPNAM1= <>
##$DBPNAM2= <>
##$DBPNAM3= <>
##$DBPNAM4= <>
##$DBPNAM5= <>
##$DBPNAM6= <>
##$DBPNAM7= <>
##$DBPOAL= (0..7)
0.5 0.5 0.5 0.5 0.5 0.5 0.5 0.5 
##$DBPOFFS= (0..7)
0 0 0 0 0 0 0 0 
##$DE= 6
##$DECBNUC= <off>
##$DECIM= 32
##$DECNUC= <off>
##$DECSTAT= 4
##$DIGMOD= 1
##$DIGTYP= 9
##$DL= (0..7)
0 120 120 120 120 120 120 120 
##$DP= (0..7)
150 150 150 150 150 150 150 150 
##$DP07= 0
##$DPNAME0= <>
##$DPNAME1= <>
##$DPNAME2= <>
##$DPNAME3= <>
##$DPNAME4= <>
##$DPNAME5= <>
##$DPNAME6= <>
##$DPNAME7= <>
##$DPOAL= (0..7)
0.5 0.5 0.5 0.5 0.5 0.5 0.5 0.5 
##$DPOFFS= (0..7)
0 0 0 0 0 0 0 0 
##$DQDMODE= 0
##$DR= 18
##$DS= 0
##$DSLIST= <SSSSSSSSSSSSSSS>
$$ [...]
##$SUBNAM2= <"">
##$SUBNAM3= <"">
##$SUBNAM4= <"">
##$SUBNAM5= <"">
##$SUBNAM6= <"">
##$SUBNAM7= <"">
##$SUBNAM8= <"">
##$SUBNAM9= <"">
##$SW= 16.9725356469052
##$SWIBOX= (0..15)
0 0 2 0 0 0 0 0 0 0 0 0 0 0 0 0 
##$SW_h= 3396.73913043478
##$TD= 16384
##$TD0= 1
##$TE= 0
##$TE2= 300
##$TE3= 300
##$TEG= 300
##$TL= (0..7)
0 120 120 120 120 120 120 120 
##$TP= (0..7)
150 150 150 150 150 150 150 150 
##$TP07= 0
##$TPNAME0= <>
##$TPNAME1= <>
##$TPNAME2= <>
##$TPNAME3= <>
##$TPNAME4= <>
##$TPNAME5= <>
##$TPNAME6= <>
##$TPNAME7= <>
##$TPOAL= (0..7)
0.5 0.5 0.5 0.5 0.5 0.5 0.5 0.5 
##$TPOFFS= (0..7)
0 0 0 0 0 0 0 0 
##$TUNHIN= 0
##$TUNHOUT= 0
##$TUNXOUT= 0
##$USERA1= <user>
##$USERA2= <user>
##$USERA3= <user>
##$USERA4= <user>
##$USERA5= <user>
##$V9= 5
##$VALIST= <valist>
##$VCLIST= <CCCCCCCCCCCCCCC>
##$VD= 0
##$VDLIST= <DDDDDDDDDDDDDDD>
##$VPLIST= <PPPPPPPPPPPPPPP>
##$VTLIST= <TTTTTTTTTTTTTTT>
##$WBST= 1024
##$WBSW= 4
##$XGAIN= (0..3)
0 0 0 0 
##$XL= 0
##$YL= 0
##$YMAX_a= 224919
##$YMIN_a= -233528
##$ZGOPTNS= <>
##$ZL1= 120
##$ZL2= 120
##$ZL3= 120
##$ZL4= 120
##$ABSF1= 10
##$ABSF2= 0
##$ABSG= 5
##$ABSL= 3
##$ALPHA= 0
##$AQORDER= 0
##$ASSFAC= 0
##$ASSFACI= 0
##$ASSFACX= 0
##$ASSWID= 0
##$AUNMP= <proc_1d>
##$AZFE= 0.1
##$AZFW= 0.1
##$BCFW= 1
##$BC_mod= 2
##$BYTORDP= 1
##$COROFFS= 0
##$CY= 11.3945322036743
##$DATMOD= 1
##$DC= 2
##$DFILT= <>
##$DTYPP= 0
##$F1P= 15.9154993809931
##$F2P= -4.1035820241983
##$FCOR= 0.5
##$FTSIZE= 0
##$FT_mod= 4
##$GAMMA= 1
##$GB= 0.15
##$INTBC= 1
##$INTSCL= 1
##$ISEN= 128
##$LB= 0.24
##$LEV0= 0
##$LPBIN= 0
##$MAXI= 10000
##$MC2= 0
##$MEAN= 0
##$ME_mod= 0
##$MI= 1.114404
##$NCOEF= 0
##$NC_proc= 0
##$NLEV= 6
##$NOISF1= 3.799351
##$NOISF2= 2.8
##$NSP= 1
##$NTH_PI= 0
##$NZP= 0
##$OFFSET= 15.70392
##$PC= 1
##$PHC0= -11047.35
##$PHC1= 7.40088
##$PH_mod= 1
##$PKNL= yes
##$PPARMOD= 0
##$PSCAL= 0
##$PSIGN= 0
##$REVERSE= no
##$SF= 200.130013532006
##$SI= 16384
##$SIGF1= 3
##$SIGF2= 2
##$SINO= 400
##$SIOLD= 16384
##$SREGLST= <1H.CDCl3>
##$SSB= 0
##$STSI= 0
##$STSR= 0
##$SW_p= 3612.71676300578
##$SYMM= 0
##$S_DEV= 0
##$TDeff= 0
##$TDoff= 0
##$TI= <>
##$TILT= no
##$TM1= 0
##$TM2= 0
##$TOPLEV= 0
##$USERP1= <user>
##$USERP2= <user>
##$USERP3= <user>
##$USERP4= <user>
##$USERP5= <user>
##$WDW= 1
##$XDIM= 8192
##$YMAX_p= 0
##$YMIN_p= 0
$$ End of Bruker specific parameters
$$ ---------------------------------
##NTUPLES= NMR FID
##VAR_NAME=  TIME,          FID/REAL,        FID/IMAG
##SYMBOL=    X,             R,               I
##VAR_TYPE=  INDEPENDENT,   DEPENDENT,       DEPENDENT
##VAR_FORM=  AFFN,          ASDF,            ASDF
##VAR_DIM=   8192,          8192,            8192
##UNITS=     SECONDS,       ARBITRARY UNITS, ARBITRARY UNITS
##FACTOR=    0.0002944,     1,               1
##FIRST=     0,             0,               0
##LAST=      2.4114304,     0,               0
##MIN=       0,             -233528,         0
##MAX=       2.4114304,     224919,          0
$$ Real data points
##PAGE= N=1
##DATA TABLE= (X++(R..R)), XYDATA
0@%%%%%%%%%%%%%qJ6j6J6j6K4l2L8m6N5o3P2q8J04j20J37j60J85k10K39k71L10
35A66l54L97m45M99n57O23o95P73q57R48j051J163j283J415j559J716j890K083
53A092k295K531k794L090l426L809m252M769n386O134p066Q260r854J2129j5680
68h939K2400o2726J14425j54541N4959K59341k87268p6370J37248R157K2561M9581
80G9828q2507j08184Q0736J17667o1392o594k9773n2905P1585O2850j7078r3293
92c9060j3715J08949m4412L2703O1417j90147J2141J81159p9843l1065Q1574j10510
104c0809m1519J75827l5630j22463J00064l0282n9581J42295n7852r7397Q8512
115C1165j2848K784M7119o6425j8260J4174J5373M6824m7682k9806M6069l4244
$$ plain form
0 0 0 0 0 0 0 0 0 0 0 0 0 0 0 -8 8 -8 8 -8 16 -16 22 -24 31 -32 40 -48 56 -64 73 -87 98 -112 127 -144 166
35 166 -188 209 -236 263 -294 329 -366 407 -450 498 -553 610 -673 742 -817 899 -991 1092
53 1092 -1203 1328 -1466 1624 -1802 2007 -2245 2524 -2862 3272 -3794 4466 -5388 6741 -8939
68 -8939 13461 -49265 65160 -89381 -34422 224919 -62349 -138719 -1471 7686 30247 79828
80 79828 -2679 -110863 -30127 87540 26148 19554 -10219 -63124 8461 71311 54233 -39060
92 -39060 -52775 56174 11762 44465 105882 -84265 -72124 109035 29192 -1873 79701 -30809
104 -30809 -72328 103499 67869 -54594 45470 15188 -44393 97902 40050 -57347 31165
115 31165 18317 21101 68220 1795 -16465 -2291 13082 59906 12224 -17582 28487 -5757
127e757O890O0515p1523k9316Q7580k7638l9917N6174m1355l8588Q7028m305o6834
140b7046L6473l992m0471O2040Q03o0526L7646K734k1106L2632k8538j0085K6236
153F800j5558K4965j1471m5620M5028J895k6453M3593k6958m4130N6011M645m5840
166c3093L7157J47m8588N5571J0724o7332L8903R923l7416M8054p249m3063K5607
179a0655K729j420J2519j4634n732J552L758J2099o472j5184J0066J1022j5694
192a6046J1930Q140m1421K9194K9733n3969L0507J5576o1458N0724K1619n9922
204c5393L6427J0347m5641L5588J6067l8651J4263K0342k6198N850K2154k6077
216a0922M44K4968j6174K52Q017j1048O236r22P048M909k1980J6855P240k8987
$$ plain form
127 -5757 1133 61648 -9875 -39191 48389 20751 -19166 37008 -4347 -42935 44093 39788 -27046
140 -27046 9427 5435 -35036 27004 27807 -32719 4927 7661 -13445 19187 -9351 -19436 6800
153 6800 -8758 16207 4736 -40884 4144 6039 -20414 23179 -3779 -47909 8102 12747 -33093
166 -33093 4064 4211 -44377 11194 21918 -45414 -6511 3412 -34004 14050 6801 -36262 -10655
179 -10655 -7926 -9346 3173 -11461 -17193 -15641 -11883 216 -6256 -21440 -11374 -352 -16046
192 -16046 -4116 4024 -37397 -8203 21530 -32439 -1932 13644 -47814 2910 24529 -35393
204 -35393 1034 11381 -34260 1328 17395 -21256 -6993 13349 -12849 -6999 15155 -10922
216 -10922 -10478 14490 -1684 -1432 6585 -4463 1773 851 7899 12808 -9172 7683 14923 -14064
230a4064K7285Q877l6197K5956J2834l9550K0148K4211l9335J3597L2644m5695
242i289L789M0376m1396K532M0409l7078m282L2729k5803q143K5896q927j0450
255C63J3321j475j6624O088J3003q641l652J0591o705j4468J4859P482k2049J1049
269C142J7081k9655N425K4058l3334K664L4962k8524o467K9010k6943j1037L4759
282A5141j1634j7184K3980r110k0265K0644L363j7431J1953P042j4064O07O713
295b45o289m649J2140M732j4295K555Q171j6838M433K1745j7311n627J9992j7762
309i248q889K5757r526j2509K2556o970j8298J7313m58j4434J5699N572j4208
322g643L436L727r206K154R304k03n578K62M039q278l08J4966q262o686J6192
$$ plain form
230 -14064 13221 22098 -14099 11857 24691 -14859 5289 29500 -9835 3762 36406 -9289
242 -9289 -5500 34876 -6520 -3988 36421 -657 -4939 27790 1987 -6156 19740 10813 363
255 363 13684 12209 -4415 1673 14676 6035 2383 12974 6269 -8199 6660 14142 -7907 3142
269 3142 20223 -9432 -4007 20051 -13283 -10619 24343 -4181 -10648 18362 -8581 -19618 15141
282 15141 3507 -13677 10303 1193 -19072 1572 4935 -12496 -543 6499 -7565 -6958 -245
295 -245 -6534 -11183 957 5689 -8606 -6051 2120 -14718 -10285 11460 -5851 -11478 8514 -9248
309 -9248 -18137 7620 -1906 -14415 8141 1171 -17127 186 -272 -14706 993 6565 -7643
322 -7643 -4207 -480 -9686 -7532 1772 1569 -4009 -3747 292 -7986 -8294 6672 -1590 -8276 7916
337G916j0245j2930J9740l248j3887K0919j309k0952J5029K440j7605J6056R040
350A0964j7339N829O283j4187M398J0259o193q85N158l354m691K111N812l062
364A103j958R330n138j0930J2035L44j1449J5742L210j9531J1399O534j9930J2945
378C706J1969j9996N628J3868k1085L667J6547j5526K083J2064j1835l621J0217
391G686m689m476Q977J545q182J65M031n640L7P930j825p570N481K427j1773O678
407H02J0064j6002M389J3125j9874K324J6154j7090J834J6236j6004l582J3441
420E817q993m781J2817l453r585R391K73j0312P187M352q625L755L814o161j933
435f437N443J073o074M618L415j0810M953O938r864K462Q786q538j990R590n804
$$ plain form
337 7916 -2329 -15259 4481 1233 -12654 8265 6956 -13996 1033 3473 -14132 1924 10964
350 10964 -6375 -546 5737 -8450 -4052 6207 14 -871 4287 933 -3758 -1647 4165 1103
364 1103 -855 8475 3337 -7593 4442 4786 -6663 9079 12289 -7242 4157 10691 -9239 3706
378 3706 15675 -4321 1307 15175 -5910 -2243 14304 -1222 861 12925 1090 -2531 7686
391 7686 2997 -1479 7498 9043 861 1026 5057 -583 -546 7384 5559 -2011 3470 5897 -5876 802
407 802 10866 -5136 -747 12378 -7496 -5172 10982 -6108 -4274 11962 -4042 -7624 5817
420 5817 -3176 -7957 4860 1407 -8178 1213 1486 -8826 -1639 2713 -5912 -2157 1657 -4504 -6437
435 -6437 -994 79 -5995 -1377 2038 -8772 -3819 3119 -6745 -4283 4503 -4035 -6025 3565 -2239
450b239o298J3202l237j1258J5413o564r057J5022m300n356P049l365j081k04
464b273L502J334p590P942m1q861R649l121m334P513j067l483p85L281j308l873
480c515Q547l317p533J1259n099o035J1273m317m951O492n13n174R02N777m611
495h15O75M492p643K103J796j118K198k201K726j694m827Q646o029j685R841p326
511h61j304O233p594R88N720j693j523M65J547m221O79O137o124J260N943o997
527a345k5L714m286K513L914l057q53k83r41J410j3J924K96m437L953m94n945
544c955O736L20n355O920k338o241M258O73j721K560J141l521j848L284j632p37
560a456M420k028j554J061j600j471Q33L603j942n09K390n303K82L573k090K142
$$ plain form
450 -2239 -8537 4665 1428 -9830 5583 -981 -10038 4984 684 -4672 2377 -988 -2069 -2273
464 -2273 1229 2563 -5027 2915 2874 -5987 3662 541 -3793 3720 2653 -830 -1615 1666 358 -3515
480 -3515 5032 1715 -5818 5441 342 -5693 5580 1263 -3688 2804 2291 -2883 -1981 3796 -815
495 -815 -140 4352 -3291 -1188 608 -510 1688 -513 2213 519 -4308 4338 -1691 -3376 6465 -861
511 -861 -2165 4068 -3526 -2538 3182 1489 -34 431 1978 -2243 -1564 4573 -1551 -291 5652 -1345
527 -1345 -1370 2344 -1942 571 4485 1428 575 292 -649 761 748 2672 2968 -1469 2484 1990 -3955
544 -3955 2781 3101 -2254 4666 2328 -3913 345 1018 -703 1857 2998 -523 -2371 913 -719 -1456
560 -1456 2964 936 -618 443 -1157 -2628 -1795 1808 -134 -643 1747 -3556 -3274 299 -1791 351
576C51R8r90q56k949M727j874j529P667o460j452N468p346L498L688l659L269
592A651k308l41L53k920N953j986j179N199p167P39M075m012L823N28j973K74
608G09k108K488j694K70N001m337J86K379m836J905J556M26L24j314J088l473
624a430p3M489l772K857J117m314J711o51n96J520j46J729k610n61K510n125K768
641e77M139n663L525l61l855J555l34K025p71q31K632l957K03L242l421J633K801
658A985m184Q35M55j337J179J052L47k015Q14N16k149J586K52k51J090M84k536
675a877R85M86O71o51Q56L98k501J272J319k020J250J460j846K4R07j087m52K072
693A266L02j872J251N14k738J971J579l129J849R33k764Q30R68p56j07J080r7
$$ plain form
576 351 449 -541 -1397 -4346 381 -1493 -3022 4645 -1815 -3267 2201 -5145 -1647 2041 -1618 1651
592 1651 -657 -998 -645 -3565 2388 402 -777 4422 -2745 -2006 2069 -1943 1880 2408 435 709
608 709 -1399 1089 -605 -335 4666 329 515 2894 -1942 -37 1519 1945 2269 955 2043 -1430
624 -1430 -1503 2986 -786 2071 3188 -1126 585 -66 -662 858 712 2441 -169 -730 1780 -3345 -577
641 -577 3562 -2101 1424 1063 -2792 -1237 -1571 454 -317 -1148 1484 -2473 -2270 972 -2449 -816 1985
658 1985 -2199 -1364 -909 -2246 -1067 -15 332 -1683 -869 -353 -2502 -916 -664 -915 175 659 -1877
675 -1877 -892 -406 265 -386 470 868 -1633 -361 958 -1062 188 1648 -198 -174 733 -354 -806 1266
693 1266 1568 -304 947 1461 -1277 694 2273 -856 993 1926 -838 -8 960 204 97 1177 1080
710A080j817P11J476k874K226J187l228J502L43j622N82J072l75r61Q60P04k385
727a519J477J671k886J396R07k463Q25J297n25o97J478k72k449K244P92k610K391
744A057N89k975J460J011j834P59J572p51j423J360j30j745K478J03j788J814
760A557m55j879J251R13n29n34J358n95k450K114M20k103K440P12l298J085R73
777I80k379R32K506j991r84J933k092j034K843m60j618J998n82k666J618J013
793A7j634P10J829k491o11J416q20m45J939L8j981N46Q44k117P98K861k227n10
811a838K051j917j464L141l41j524K600m38l211K356P97k206K384J374k749M41
827e44J211j878LK453j26j500J396l81k114J833J498j512P52J177j941j274K721
$$ plain form
710 1080 -737 -26 1450 -1424 802 1989 -1239 263 606 -1016 -434 638 263 -698 162 866 -1519
727 -1519 -42 1629 -1257 139 1046 -1417 -592 705 180 -517 961 689 -1760 484 1276 -1334 1057
744 1057 1646 -1329 131 1142 -692 67 1639 888 -535 825 695 -1050 1428 1531 -257 1557
760 1557 1102 -777 474 1387 858 324 1682 1087 -1363 751 1171 -932 1508 2220 -1078 7 980
777 980 -1399 -467 2039 48 -936 997 -1095 -2129 714 254 -1364 634 52 -2614 -996 17
793 17 -1617 -907 922 -1569 -2180 -764 -1584 -2029 -90 -52 -2033 -1487 -643 -2760 -1962 899 -1328 -1838
811 -1838 213 -1704 -3168 -27 -368 -1892 708 270 -2941 -585 212 -1994 390 1764 -985 -544
827 -544 667 -1211 -1208 1245 1119 -381 1015 634 -1480 353 1851 339 1091 2268 327 -947 1774
844A774p46j430L501o67l561K381m7k476L261M39k177R05L33j895M31K216q87
861A355j066K030j780j884K071J67j150J548N43k149o60J629r44n20L028j256
877I62k544K105m09k444K825R71k514J943J98l454J470K172k258R58J542k320
893g97l43J236p52KJ470K0q57o79M26l93k94K512r94j326J114m04j551J785J130
912A305k070J274J230l147P75K290l293J171K865k880q46K511j903p09L131k094
928c90p56K196j687l03N63m2M69o64K24M69k352J334J740k683J256J058k754P69
946a553K378k385o85L300j946j905M150k624k311N074j995k107L303j465j669
961b440K673K87k032P18J362j651P2J481j638M67J495n77j48j520L392j230j723
$$ plain form
844 1774 1028 -402 3099 2432 -1129 1252 1205 -1271 1990 2429 252 1157 1490 -405 26 2242 1355
861 1355 289 2319 539 -1345 726 893 -257 1291 1834 -315 -975 654 -290 -810 2218 962
877 962 -1582 523 114 -2330 495 1466 -1048 895 1093 -2361 -891 1281 -977 -19 1523 -797
893 -797 -1140 96 -656 -654 816 836 -21 -700 -274 -667 -961 1551 557 -769 345 -59 -1610 175 1305
912 1305 -765 509 1739 -1408 -633 1657 -1636 -465 2400 -480 -1326 1185 -718 -1427 1704 -390
928 -390 -1146 1050 -637 -940 -377 -419 50 -614 -390 79 -2273 -939 801 -1882 -626 432 -2322 -1553
946 -1553 825 -1560 -2245 1055 -891 -2796 1354 -1270 -3581 1493 -502 -2609 694 -771 -2440
961 -2440 233 520 -1512 -794 568 -1083 -1011 470 -1168 -701 794 217 69 -1451 1941 711 -1012
978a012M012l504j405N360k616j925M050k481j570L714j065k210J513J551l081
993f69L090J90l781J739J828k536J447J75j860J125J237o37r73J73J316j658j80
1010B6J476k148L52K980j327k660K220J49l314L942K60m901M098J81l930L941
1026A345J20l438K862n7k145P98J26j34L22N16l51j172O19Q29r10j05J118n25
1044a82r69J828o26k367L086M48l108K938Nm061L356J353l976K766J232l396J818
1061A45J441l672J673K688l074J016J529l181J751L39j043J687k261J214K99k047
1077a496J376J253l190K734O07l472J512J818l339K535J407l751J043K317l502
1092b148J225K253k843Q5L100l558J98K632k322R10J778k688O06L10j090J927
$$ plain form
978 -1012 3000 -504 -1909 3451 835 -1090 2960 479 -1091 2623 1558 -652 861 2412 -669
993 -669 2421 2611 -1170 569 2397 -139 1308 1483 -377 748 1985 1348 375 548 1864 206 26
1010 26 1502 -646 -294 2686 1359 -1301 919 1068 -2246 1696 1956 -2945 1153 1334 -2596 1345
1026 1345 1465 -1973 889 832 -1313 -515 -389 -523 -201 315 -36 -1208 -589 240 -670 -775 343 -182
1044 -182 -1151 677 51 -2316 770 1218 -1890 1048 1053 -3008 348 1701 -2275 491 1723 -1673 145
1061 145 1586 -2086 -413 2275 -799 217 1746 -1435 316 655 -388 1299 -962 252 551 -1496
1077 -1496 -120 1133 -2057 677 1284 -2188 -676 1142 -2197 338 1745 -2006 -963 1354 -2148
1092 -2148 -923 1330 -1513 -1428 1672 -1886 -1688 944 -1378 -468 1310 -1378 -772 -462 -1552 375
1108C75p70l86J708k209J40K103k649J255K478k641o4K301l105K38L750k808n59
1125h43L664l401m83L427k571m80L260k019o50J507j283k0J264J13o33K83l68
1142G67j21J88j29Q19n39r08J988j596j461L672k388q70L766l345j136L712k623
1159b04q41L487k184j090K098j051j674K063N2j386J399k37j657Q48K85l94M29
1176e7m75O90r91p37K198j602n28K529k015j095L029j983j453L656j536j621K806
1193H15j044k432L452n43k530L083o93j872K066k58j278J401l83k88M70l34M33
1210F5j80j69J184q49q92J951j101r54K273q94j775K265l35k274K864k23k741
1227a785K776j5k384K304q3k351K033J80j774J476k02p34O72j50k86K99j43k60
$$ plain form
1108 375 -395 -781 927 -1282 -1142 961 -1688 -433 2045 -596 -660 1641 -1464 -1226 2524 -284 -843
1125 -843 2821 -580 -1063 2364 -207 -687 2573 554 -96 1411 128 108 1372 1485 852 1135 767
1142 767 646 834 705 1524 985 77 2065 469 -992 2680 292 -578 3188 -157 -1293 2419 -204
1159 -204 -1045 2442 258 -832 1266 215 -1459 604 656 -730 669 432 -1225 -377 -92 -486 -57
1176 -57 -532 158 -833 -1570 628 -974 -1502 1027 -988 -2083 946 -1037 -2490 1166 -370 -1991 815
1193 815 -229 -2661 791 248 -2282 801 108 -1764 302 44 -1234 167 -216 -504 -34 -368 65
1210 65 -115 -284 900 51 -841 1110 9 -945 1328 434 -1341 924 589 -1685 1179 956 -1785
1227 -1785 991 976 -1408 896 813 -1538 495 675 -1099 377 175 -559 113 -37 -323 -24 -167 -427
1245d27L41l48L28J89r94P27O73j802J244J082k564J824N92k544J531J295k305
1262a158J116J038k173J048R04j482O97J317j613K66N83j012P87L21n30O29l86
1279C52k06P14p80N95O06j490Q61N58j732Q93J283j646M79J106j833J72J690j630
1297hK8J596j145o58J433j062m97J298n72n26O25m17l22J87J05P8l84J85K14q47
1317f89K62O76q52O8R27p75o04J447j380k04J684j185k31J233j359m68J325l86
1335e11k78R80m08q53N74j11l95P73J56l72k94J56J76QL13N15q96j75O42p18M62
1356b56P90m02n77J040k35j492J656j69o40J320n00j470J505k98j040J622j15
1373G39o57L51k47j69J44mK61j73P4j02n91K51N40j50L6L4l50o56P35L06r18J358
$$ plain form
1245 -427 -86 -434 -106 83 -911 -184 489 -1313 -69 1013 -1551 273 865 -1679 -148 1147 -1158
1262 -1158 -42 996 -1177 -129 775 -707 -10 1307 -306 -40 543 -469 318 639 109 738 352
1279 352 146 860 80 675 1281 -209 652 1210 -522 371 1654 8 487 1593 -240 -68 1622 -8
1297 -8 20 1616 471 -187 1246 184 -313 985 413 -113 512 95 -227 -40 65 143 -241 -56 158 -689
1317 -689 -427 249 -603 -535 392 -383 -987 460 -920 -1124 560 -625 -856 377 -982 -1450 -125 -511
1335 -511 -789 191 -217 -1070 -496 -607 -1002 -229 -73 -445 -739 -583 -407 -399 -86 429 -467 -642 0 -718 -256
1356 -256 534 132 -445 595 360 -1132 524 355 -285 1035 535 -935 570 272 -768 854 739
1373 739 82 433 186 17 161 157 418 245 319 217 -374 -123 417 267 303 337 -13 -669 66 372 -546 812
1395H12m45j230Q20P5j007Q90N33j137M00O10j156O66M79q66N30L30n85J11k33
1414d03K03L38k82N11l99m08P37j02m44J036p07j02N42k76l26K44M56k25j9L28
1434G02p40l80J467r48J49P65p33m61J130p89Q1M46l19N5K01o65L59j01l8O11
1454G92o90J27L29q26L70K88o20L34N1o28L88q6k92J96K12j10l23O9P4q3M19j4
1476b3p08M46n4k34J95K03n07M36j37n22O03k10MK80k87K09J02n71R17k86n82
1497g26P86l07k56N99p73P55M1l70N90j88k04K61k13M57J0m86M89k57n6P78p17
1518B13K43j45j40J3K25j61J11L14m53j8l99L75K18j42J42J9q93Q50n8o74P09
1539C49P2r44Q49j94n23K36m6M06k52L5p7m22J20O79m61L46j22n67N85k42k18
$$ plain form
1395 812 367 -863 -43 32 -975 -85 448 -689 -289 321 -835 -169 310 -556 -26 304 -281 -170 -403
1414 -403 -200 138 -144 367 -32 -440 297 195 -249 787 80 -22 520 244 -82 162 618 393 374 702
1434 702 -38 -418 1049 101 250 1015 282 -179 951 162 243 689 370 425 626 -39 320 219 181 792
1454 792 102 229 558 -268 102 390 -230 104 155 -473 -85 -171 -463 -267 -55 -165 -488 -419 -345 -428 -9 -23
1476 -23 -731 -285 -339 -573 -378 -175 -682 -246 -383 -905 -302 -512 -508 -228 -515 -306 -204 -775 142 -144 -726
1497 -726 60 -247 -503 96 -677 78 119 -251 339 151 -53 208 -5 452 462 -24 465 208 152 930 213
1518 213 456 311 171 184 409 248 359 673 220 202 -197 178 396 254 396 415 -478 372 314 -360 349
1539 349 421 -523 326 132 -391 -155 -201 205 -47 -12 -89 -511 -391 288 -173 173 51 -516 69 -173 -391
1560c91L89p7rJ15k97N01l08k59Q14l46m18N52l24j37M59k81M54J82j95o22j29
1581c27M43J30K27J57o25k72R79p59O61m36M70o02N82j83k3L81o63L82j92j69
1601A61L39n64J30P79q83O24j7r01M64P0m22L93K8n47N52k61o97M60j27K84j41
1622b76K58m91k29K23K13kK68l70j61j52K6j9L28R4o85K91J35k17L95O13m37J09
1644h6j18K30k82o2N48l56J06K47n84N1M65m22J90K53q3k23N99k68q48M77J46
1665b0P55p94J15K30l38J53L97N2n12K97l44n0M70k31PL04l97j3O5J6j83K45l1
1688A93k53L19l94Q7m6L44l63j55K8Mj92J07J09k48J00M20l40k08L77N6k56L28
1710A7p9n20P97m07k14N07r7j43P7J96l61K17J43k03J49J72k25j70L10r5J95j70
$$ plain form
1560 -391 -2 -79 -88 27 -270 231 -77 -336 478 132 -286 266 -58 -195 264 -17 437 619 424 -198 -327
1581 -327 116 246 473 630 5 -267 712 -47 614 178 648 46 628 445 422 803 140 522 330 161
1601 161 500 -64 66 845 -38 586 569 -332 132 202 -220 173 201 -346 206 -55 -752 -292 -419 -135 -276
1622 -276 -18 -509 -738 -515 -302 -304 -36 -406 -567 -719 -693 -712 -384 -290 -975 -684 -549 -766 -371 242 -195 -86
1644 -86 -204 26 -256 -318 230 -126 -20 227 -357 -306 159 -263 -73 180 97 -126 473 205 -643 -166 -20
1665 -20 735 -59 56 286 -52 101 498 550 38 335 -9 -59 411 180 187 491 94 81 146 162 -21 224 193
1688 193 -60 259 -135 -48 -94 250 -113 -268 -240 -236 -428 -321 -212 -460 -360 60 -280 -488 -111 -55 -311 17
1710 17 -62 -582 215 -192 -406 101 4 -139 -62 134 -227 -10 133 -70 79 251 26 -144 166 71 266 96
1732I6K8L0n5L49k07j57L71j39k99K19J90k80M09k92l90O61k69k82J19M06q15
1753c07N06J22m00J65L15m74J22NL5Oj89K83m73K55k36J23k91J69J46k16J40N3
1775a41k03J4J13n93N96K58o49R5M79o89J16K38j99J32M93m57k37O51j26M1J14
1796D6%J07l92K60j10n5N21m76P3K89o2j09K24K50m19J75K45n62o1R08r08J2Q62
1819H18n52j39L99n80K10L43l09J19J44l48P2j33J44J23k59j25K6k6K53j82J2
1840A0J94q8l77J16L19k34k38L25q9m99M81p0q3J46p4k84N08k51n21O39j22K4
1862a68J87m58J23K44j6J7J42Q8l8m35K68J05k66O0N01l60J17J31l72J62Q2K31
1884C45j45J23l58J00J59J79l83J42M03m94n9M35o62M19M39l62L17m70j67L37
$$ plain form
1732 96 124 154 99 448 241 84 455 316 17 236 426 146 555 263 -127 534 265 -17 102 508 -307
1753 -307 199 321 -79 86 401 -73 49 54 89 95 -94 189 -284 -29 -265 -142 -433 -264 -118 -334 -194 -141
1775 -141 -344 -330 -217 -810 -214 44 -605 -510 -31 -720 -604 -366 -565 -433 60 -397 -634 17 -109 -68 46
1796 46 46 153 -239 21 -89 -144 377 -99 -26 263 201 92 316 566 147 322 567 5 -56 852 -56 -44 818
1819 818 266 127 526 -54 156 499 190 309 453 105 177 44 188 311 52 -73 -47 -73 180 -2 10
1840 10 204 116 -261 -145 174 -60 -298 27 -62 -561 -80 -150 -233 -87 -161 -445 63 -188 -709 -70 -192 -168
1862 -168 19 -439 -316 -72 -88 -71 71 159 121 -314 -46 59 -207 -147 354 -6 111 242 -130 32 114 345
1884 345 200 323 -35 65 224 403 20 162 565 71 12 447 -215 204 643 281 598 128 -39 298
1904B98l04L13j5l73J37p1l31P43o29J82J71l01k1J53j57M6j93K82L9k55J07k68
1926d47J22K81j29K34L9o81K01K56n08M84O00k52m22Q2K09n95R14n35L78l06J63
1947H8M2n63Q90j62o59P87r3k48K99j1j52j59K6L95k43J02K1l06K11L67n73J34
1969A93K34l44L89K4m90K82J63l85J37j03J50k44QJ73m92J88K79l55K92M2n04
1990c63K56J20J5j16o1J23L5l75J91J54k35MLk29J07m9k76Q06m05J44J75o36M43
2013a69J40r3k19J28r0K63j15p0m5k18M09J27j54K59J3k95L16J11l17m1p2K88
2035A56O1J6J74j94K61j20m48M34P5k32K2J52k22J41j49K40L7k07PK18k74P9O6
2058B93l20M33l22O0n6j33N7K15M5p00P08l13m2J38j62ql1P9j19J98M4l66L83
$$ plain form
1904 298 -6 307 292 -81 56 -15 -346 397 -232 -50 121 -180 -201 -48 -205 -159 -352 -70 -31 -286 -179 -447
1926 -447 -325 -44 -173 61 100 -581 -380 -124 -632 -148 452 200 -222 -140 69 -526 388 -147 231 -75 88
1947 88 130 -433 457 295 -364 423 330 82 381 370 218 59 85 480 237 339 360 54 265 632 59 193
1969 193 427 83 472 496 6 288 451 66 203 100 250 6 14 187 -305 -117 162 -193 99 141 -363
1990 -363 -107 13 28 -88 -149 -26 9 -366 -175 -21 -256 -252 -249 -478 -371 -420 -696 110 -295 -151 24 -612 -169
2013 -169 -29 -122 -341 -213 -303 -40 -155 -225 -270 -488 -79 48 -106 153 166 -129 187 298 -19 -60 -132 156
2035 156 217 233 407 213 474 354 -94 340 415 183 205 357 135 276 127 367 404 197 204 422 148 227 293
2058 293 -27 406 84 144 88 -45 12 227 272 -428 280 -33 -75 63 -99 -107 -138 -59 -178 20 64 -302 81
2081H1o9l92K76o0J50p6J8k83M00l71k03M39L23K24n18k53L96pl01J39K30k88
2103a45M03R5n69M33M6k48P2J06m6J97k17j22J46N0QJ29L7l32J48j47O6q4K65
2126B91p5j9L6k50nj65L69p4Jj22j99P2Koj33r2K06j72R9J40k14L2K89l17r2K0
2152c78Q0K24j64K6l3l4j20K58J1j09R4L7j0L18m43L70j50J20k09l5J40K6J12
2175A31j69J72J33j63m1J48K39l04M32m54l36L45j9Rp5N30l67K44m04L50j60j25
2197A16L88j48r0q8K01k20j97K31J65Q2k68l15J57m9k02M91k19j90J02q6j02J00
2219a41K51k28J3Nj14J11j82q1K48j19P7j11j96J01j5J60o1n8n5L22O1k96L18
2242A0r5j76K21k5j63K53n1j10K44r5q8p9j6kM11j27q6j81K85k92N70l50K15r2
$$ plain form
2081 81 12 -380 -104 -164 -14 -90 -72 -355 45 -326 -529 -90 233 457 -61 -314 82 75 -226 -87 143 -145
2103 -145 258 353 -216 217 263 15 87 193 147 344 127 5 151 201 209 338 375 43 191 44 110 26 291
2126 291 216 197 233 -17 -22 -187 182 108 109 -13 -212 -140 -138 -144 -277 -369 -163 -335 -236 -96 -310 -278 11 -306 -398 -378
2152 -378 -298 -74 -238 -212 -245 -279 -399 -141 -130 -239 -145 -108 -118 200 -243 127 -23 97 -112 -147 -7 19 131
2175 131 -38 134 267 104 63 211 450 146 578 124 -212 133 114 123 48 578 211 455 51 401 241 116
2197 116 504 356 266 178 379 159 -38 193 358 440 172 -143 14 -35 -237 254 35 -155 -53 -139 -241 -141
2219 -141 110 -118 -105 -100 -214 -103 -285 -366 -118 -237 -160 -271 -467 -366 -381 -221 -282 -340 -395 -73 -12 -308 10
2242 10 -85 -261 -40 -65 -228 25 -26 -136 108 13 -75 -154 -170 -172 239 112 26 -155 130 -162 408 58 273 181
2266A81n3k12L15j81qM20o19M02j16J50j18n6oJ5k21M50l26M8l81M18L2j02J37
2289A69l81J81j32J70K9k37j46J18R5R9j32K43j94j86J17J2j2K95m03M5K78O6
2311I4k41K68k36K14l39J66J59o1k20N9L69l70K26j4p4L4j90M51j19k61n4K52
2333A13K00J9l10K82j76J50m2P3R1j41oK0J55l27O0l3N9O8r9q0L30n21J65K09
2357B59k3k3j17J30k75M3j1k03L02q5k52N8J44o6j74J2J30j21Q9q2N9j22L14q9
2381a03k32J3K1K75J4q4m6m6j24q1L39j12J77R5k29P7K43o58L30j43K62K13j08
2404I3R4l84MQ13n30j03J38J8o1k10K46j17M2J52P4j6q9P6J07j09k7q3j77K38
2428A89kk32L56j61j47K80k10j6K6J90l66q4K72j3J7j65KJ38n9P5j54k9l1l2N5
$$ plain form
2266 181 128 -84 231 50 42 462 -157 245 129 279 161 105 99 114 -107 343 17 65 -316 102 134 32 169
2289 169 -212 -31 -163 7 36 -201 -347 -229 -134 -35 -167 76 -118 -304 -187 -175 -187 108 -295 -250 28 94
2311 94 -147 121 -115 99 -240 -74 85 24 -196 -137 232 -138 88 74 0 34 -156 295 176 -85 -139 113
2333 113 313 332 22 304 128 278 236 309 400 259 253 273 428 101 161 128 187 255 156 76 406 -115 50 259
2357 259 236 213 96 226 -49 -6 -17 -220 82 -3 -255 -197 -53 -119 -293 -281 -151 -272 -183 -265 -206 -328 -14 -103
2381 -103 -335 -322 -301 -26 -12 -96 -142 -188 -312 -393 -54 -166 11 106 -123 -46 197 -461 -131 -274 -12 201 93
2404 93 187 -197 -193 620 90 -13 125 143 82 -128 118 1 43 195 269 253 164 240 347 238 211 128 -49 189
2428 189 187 -45 311 150 3 283 73 57 83 273 -93 -177 95 82 99 -66 -64 74 15 90 -64 -93 -124 -156 -101
2453a01q8q5J0J47J25k83m2L57j69j39J59K90q4j16KJ08nk46N1KJ20J72j28K81
2477C38k14k25K90L2j5j41J02J01qk76J06R2k9L38k60l0L6O5j95p3J47O8q8l6
2501A25k51K60k27j09K90l1J82Rl1m4l77K99j05o7K00k40j6k3J74k12j78K96j61
2524b37j38J08m3J43Mj79J16Q2k25K18j9Pj23J04L1m9q4q1Q4K50l22J21J53Q6
2548Gj64k00M27j18J8j14J4J8L07N3k15K21o7j75L08p2j19N6L7l94J08L77l4k8
2572B51o4J21j5K2l6k15J50P9r1m29M43n5q3l6j42j57J60O0n2p5K92l69K89J33
2596A81m85K58N9J89j62nJ39p8k03j70QK42k46J29n6K3L20l39j14J10L0J25k48
2619b93m7K33M19m39O3P5J67k52Q7K39l50O5j10L67r4j45K85P6k72J58j02l8K30
$$ plain form
2453 -101 -189 -274 -264 -117 8 -275 -317 40 -129 -268 -109 181 97 -19 -17 91 86 -160 -109 -107 13 185 57 338
2477 338 124 -101 189 221 206 65 167 268 260 -16 90 182 153 491 231 201 237 302 107 34 181 249 161 125
2501 125 -126 134 -93 -202 88 57 239 248 217 173 -204 95 -10 -77 123 -117 -133 -156 18 -194 -372 -76 -237
2524 -237 -375 -267 -310 -167 -163 -342 -226 -144 -369 -151 -170 -163 -286 -182 -151 -200 -284 -365 -281 -31 -353 -232 -79 7
2548 7 -157 -357 70 -48 -30 -144 -130 -112 195 248 33 254 187 12 320 248 129 185 222 -172 -64 313 279 251
2572 251 187 308 293 315 279 64 214 293 202 -227 216 161 78 42 -100 -257 -97 -37 -89 -164 128 -241 48 181
2596 181 -304 -46 13 202 40 35 174 96 -107 -277 -269 -27 -273 -144 -200 -177 143 -196 -310 -200 -170 -45 -293
2619 -293 -340 -107 312 -127 -64 11 178 -74 13 252 -98 -33 -143 224 130 -15 270 346 74 232 130 92 322
2642C22k06M3K76k03j74J9J07j37P1J06N4r5m11L24O9k56K00J1l51L00k61J81
2664a1Pj31K64k61Q2J4l40K83l04J87Q1KJ9q3K15j67j2J23J54l81K85k94K15k04
2688b57K34p1j88J97Q4k77K23p3J40J20l93M28j9o3j9J15j12j90L44k78P9K59
2710B83Mk80oj6N4j8L69k29M8K09l03J27qP8k97N5J30j11K2k9L27j72M0j71N3
2735A59k05l91L84J25l6J5o7j95Q6L0k77L35P4q6k08J18k29K45m7J1J2k5J44l8
2759f6J12l42Q7L26k82K03J68k08N1N5k20r0K40j15L6o8J67j54J83j42J9k42L30
2782D8j92P8PL92j4k10m3j54K29J14j9m0k3o6j08O8j45J60O3m4MK79k43J90p4
2807B57l18R3j06R9j06M2k4n3j65K85M3j89J17j21J22J4k07R0m4l18J77K75k1
$$ plain form
2642 322 116 159 435 232 58 77 184 47 118 224 278 183 -228 96 165 -91 109 120 -231 69 -192 -11
2664 -11 -4 -135 129 -132 -50 -36 -376 -93 -397 -210 -129 -127 -108 -191 24 -143 -155 -32 122 -259 26 -268 -53 -257
2688 -257 -23 -94 -282 -85 -1 -278 -55 -128 12 132 -261 167 148 85 66 181 69 -121 223 -55 24 283
2710 283 287 7 1 -15 39 21 390 161 209 418 115 242 234 312 15 70 200 89 111 82 409 237 277 106 159
2735 159 -46 -437 -53 72 36 51 -16 -211 -125 -95 -372 -37 37 -49 -257 -139 -368 -123 -170 -159 -147 -172 -28 -66
2759 -66 46 -296 -209 117 -165 38 206 -2 49 104 -116 -206 34 -81 -45 -113 54 -100 83 -59 -40 -282 48
2782 48 -144 -66 -59 333 319 109 66 -88 141 255 236 196 173 107 -1 67 -78 82 145 101 105 384 141 331 257
2807 257 -61 32 -74 25 -81 -39 -63 -116 -281 4 47 -142 -25 -146 -24 -10 -217 -127 -171 -489 -312 -37 -58
2830e8j42J03k50K11J29l83L84l4j68l6K22O9j12j29K98k90J02Q2m4K93j32k68
2852a53Nj00r4J057p86M42n25J21l3R6o04N30J31j84K42j94J85J11k59P4L48m10
2874@J53j53O3J28k02K9J70j95q2K48k51K65m74K73N8l2k04J8L4J48J76m07J37
2897a00k20L25j43l1J24J19k49j3J55j35Q2P6L3j68k24J33K54N7k19J65j1J07
2919A17j91k7K77p9J72k39j77J32K88k07J30J3k05J48J15j87n7K70o9l2j89O1
2941F4k16K16oK50l68M24j63o0l22K32r4n2N3K6M53m42K10k31K36p8r3o9R0J8
2965G8k1l0M2j21j6j58L47k64J3j15l9R8P7j85L71n12J41J27l8Q4j12j14L02j8
2989f3Q6l41K20J20k64j31M72N1k22L4p4j0j68K19K04Lj45j34P6K45M5p6J6j07
$$ plain form
2830 -58 -200 -97 -347 -136 -7 -390 -6 -40 -208 -244 -22 47 -65 -194 104 -186 -84 -2 -46 247 115 -153
2852 -153 -148 -248 -342 715 -71 371 -154 -33 -66 30 -574 -44 87 -97 145 -49 136 247 -12 62 410 0
2874 0 153 0 63 191 -11 18 188 -7 -89 159 -92 173 -301 -28 30 -2 -206 -188 -154 -6 170 -237 -100
2897 -100 -320 5 -138 -169 -45 74 -175 -188 -33 -168 -86 -10 23 -145 -369 -236 18 75 -144 21 10 117
2919 117 -74 -101 176 97 269 30 -147 -15 273 66 196 209 4 152 267 80 23 293 224 192 3 64
2941 64 -152 64 58 308 -60 364 201 141 -181 51 -43 -95 -42 -16 437 -5 205 -26 210 132 39 -30 60 78
2965 78 57 27 69 -52 -68 -226 121 -143 -130 -245 -284 -186 -109 -294 77 -435 -294 -167 -205 -121 -233 -347 -45 -63
2989 -63 23 -318 -98 22 -242 -373 99 150 -72 -38 -112 -122 -290 -71 133 136 -9 -143 -67 178 223 147 163 56
3013E6K80k79J62O2l16J35J62k03p8K77j36k29L89j77j49J7n8K87j26j46K52K0
3035B02q9l2k03K56m8Q2j93j81j6J44Q2j79K5l22M76K29o25L18k87J95J1L0K3
3058a02j48J7j79M40k24P9J26m64L80n1k2K27j16k31J99K9J88J03l30o5J72J1
3080C9mJ20m4J20q4L5Mj11K87p4j94RK0j99L47K8k6j55Kk22L24l73L63j58J6K49
3106C19l37j73M88l06R1l17J98l3j0K21k50q7K53j15Q5j75j27K81j23K9n1L2O
3129a01j6j87l5R2K46k95L4J98j7l32M65p9k21n7J57O5J2K3l8Q3j21J96k23J33
3153a8J39j09R1j81L11k13L93m36K66j33p9J12J40l01ML62l25R9j29M5M40m30
3175D8N3p6j42K06K3k4N7k06j07J48k4kJ93o7q0j1r6K98k60K37J24m05j69J32
$$ plain form
3013 56 336 57 219 281 -35 100 262 59 -19 258 122 -107 282 105 -44 -27 -85 202 76 -70 182 202
3035 202 113 81 -122 134 86 168 -25 -206 -222 -78 4 -175 -150 -472 4 233 -392 -74 -361 -166 -155 -125 -102
3058 -102 -250 -233 -412 28 -196 -117 9 -455 -75 -126 -148 79 -37 -268 -69 -40 148 251 -79 -144 28 39
3080 39 35 155 111 231 147 182 186 75 362 288 94 103 123 -76 271 299 273 118 120 -102 222 -151 212 54 70 319
3106 319 -18 -191 297 -9 82 -235 -37 -70 -80 141 -109 -196 57 -58 27 -148 -275 6 -117 -88 -139 -107 -101
3129 -101 -117 -304 -339 -247 -1 -296 -262 -64 -81 -413 52 -27 -248 -305 -148 -83 -71 -48 -86 -3 -124 72 -151 -18
3153 -18 121 12 103 -78 233 20 413 -23 243 110 31 143 283 -18 -14 348 23 122 -7 38 478 48
3175 48 101 25 -117 89 112 88 145 -61 -168 -20 -44 -46 147 80 0 -11 -107 191 -69 168 292 -113 -282 -150
3199a50o0L9L0pn0R2K3k25j91P4R0Q6M63k76l14P7P61m64p10J076m20J46J33p8
3223A45o2L82o73M13J06j75j72j62J99L33j25l91J61O1M01k04k98N43m22q1O15
3244E94j25r8n3j2n76N22p9P6L35QJ97j429k01Q71p6n79M61l97J435q9j158L17
3266e6O7l55M53l59M70l16L29Q1o30J02k40P62l29j24J90q2n6m59M23L01n11K03
3288a36K68J60p51L68P5K01k67M87o98M02k13J13O8k13K74l47J15K06K7p6Q1o5
3310G9j25J20M4l0J37j18l9J43n7k07R8m2J64q4K47p7j15j01N4J32k15J68m56
3333b80L44n5m3K9M5k42K34P9j12J02j13Q3k67J18o7M3K66m07O6l6P7J04J3k3
3357d2j63M56k88J43j57O5Q4k44R2J42j96J36J68l11J92K6j60J96k57K07n2q3
$$ plain form
3199 -150 -210 -171 -141 -148 -198 -106 -83 -308 -499 -425 -335 -249 214 -62 -376 -299 462 -2 -712 364 -56 90 223 145
3223 145 83 465 -208 205 311 136 -36 -198 1 334 209 -182 -21 40 441 237 -61 482 60 -21 594
3244 594 469 371 318 306 -270 252 173 249 584 592 789 -640 -841 30 -46 -625 -164 -561 874 785 -373 -56
3266 -56 11 -344 109 -250 220 -96 233 314 -316 -214 -454 308 -21 -145 45 -37 -93 -552 -129 172 -339 -136
3288 -136 132 292 -459 -91 -16 185 -82 405 -293 109 -104 9 77 -136 138 -209 -94 112 139 63 144 79
3310 79 -46 74 118 88 225 107 68 211 154 -53 45 3 167 83 330 253 138 37 91 223 8 176 -280
3333 -280 64 9 -34 -5 40 -202 32 111 -1 101 -12 71 -196 -78 -145 -102 164 -243 -177 -213 -136 -32 -19 -42
3357 -42 -205 251 -37 106 -51 14 98 -146 -54 88 -108 28 196 -115 77 103 -57 139 -118 89 37 -46
3379d6l2K33k00M26l94o0k8P4L26j21j18j58K56j17j04L26K6l25M20m01k42L71
3401A12J74k66j83J27q0K61k09K79j46j41j33J48j10O9J58K1j69L25o8k63J99
3422A05k93j06Q7J41p8L9o2k8O2J61j46j34J8L17q6k6j31K66q5l06K43j05Q2L6
3446b9Nqo1j69J80K50Q6k76r2lK96m01J95J98k79M29l29J94q9k9K58n23P27n84
3470e4O34p62K16K67n55L05L39l21J5N19n07M36n37O8j19L11k45nJ03K4l56K09
3492a5k47R4k8p9J21K22J48l93N0L6n3K37k49M9n7J14j13K20m9j67L7N0k5K7L1
3517c9lj5P6j31J2K62m1K1n1j55J75j61L47j98K79k24j13J03j35J19k9Kj09J31
3541A23R1j19j8m4L1j6P4J94n51M88j37N2l76J67p6k1O4J25o8K9r7k48L47j38
$$ plain form
3379 -46 -78 155 -45 381 -13 -73 -101 -27 299 178 60 -98 158 41 -63 263 289 -36 384 -17 -259 112
3401 112 286 20 -163 -36 -116 145 -64 215 69 -72 -205 -57 -167 -98 60 81 -88 237 169 -94 105
3422 105 -188 -294 -207 -66 -144 -105 -167 -195 -133 28 -118 -252 -234 83 -3 -29 -160 106 21 -285 -42 -147 -65 -29
3446 -29 -24 -32 -93 -262 -82 168 254 -22 -114 -117 179 -222 -27 171 -108 321 -8 186 97 68 326 -197 530 -54
3470 -54 580 -182 34 301 -254 51 390 69 84 603 96 532 -5 63 -56 255 10 5 108 132 -224 -15
3492 -15 -262 -168 -196 -275 -154 68 216 -177 -127 -91 -144 93 -156 -107 -164 -50 -163 57 8 -159 -122 -72 -97 -70 -39
3517 -39 -42 -57 19 -112 -100 162 121 142 91 -64 111 -50 297 99 378 154 41 144 9 128 99 101 -8 123
3541 123 214 95 77 33 64 48 122 316 -235 253 116 168 -208 -41 -117 -138 -74 51 -17 12 -85 -333 14 -124
3565a24J73k03J93J36l05N5p9lN4k43J99J14K60l03Qm7n1M3K08j43M3n9M3K6j84
3590a89R1j99J87j16J20J0R5K9%K2o3m8K38k64K77K5l42K51Q7K1J14j31j80O6
3614A01M6L5Op2j31N4J00q6M01l04r0K13k98K01l55J5J03J11J99k66j66J3j06
3637b76L43m5k26P4K55l85M3J48L1p9q4K56l15K34QJ21j8L2n49J74K9J91J96l7
3661A21o9%k14j78n86P09J88L1l8K87j94l3j47L17k03Q8p6R5k08L00P6m02L13
3684A77j78p7p3P0L03k17J48p7o1j7R5L8M2O1k99K26jk20J74o0K34l96L43l03
3708f8R3o7K17j83J05j23j74j08K63R4j62N20l52o1l1j41K1J41q6k26J25J5k69
3731d57J33J26M5q4J63p2J9K40r9n8j6m7k29M46k00K86l13j26M24l02P9k0Q6J80
$$ plain form
3565 -124 49 -154 39 175 -130 -75 -154 -157 -103 -346 -147 -33 227 -76 -68 -115 -166 -123 85 -58 -15 -74 -31 -5 -189
3590 -189 -98 -297 -110 -226 -106 -96 -1 28 28 50 -13 -61 177 -87 190 215 -127 124 211 232 346 215 35 101
3614 101 147 182 188 116 -15 39 139 53 454 150 60 273 -25 176 -179 -164 -61 50 249 -17 -183 -170 -276
3637 -276 67 22 -204 -130 125 -260 -217 -69 -38 -117 -201 55 -260 -26 -18 103 85 117 -432 -258 -229 -38 158 121
3661 121 52 52 -162 -340 -926 -217 -29 2 -36 251 57 24 -123 194 -9 79 3 98 -110 190 266 -136 177
3684 177 -1 -78 -151 -81 222 5 153 76 15 -2 93 131 173 234 -65 161 160 -60 114 54 288 -108 235 -68
3708 -68 25 -42 175 -8 97 -26 -200 -308 -45 49 -113 407 55 -6 -37 -178 -157 -16 -102 -328 -203 -188 -457
3731 -457 -324 -198 -153 -237 -74 -146 -127 113 14 -44 -60 -107 -336 110 -90 196 -117 -243 181 -121 -42 -62 24 204
3755B04l35N6M90n13j48M85M9j65L2j77L94k31j17J57p5M48j74l24m65K81L82
3776B54J52o74J1Q99j134M45j16K73j64k73K36k29L55J0M2k71K71k17J65j6q3
3797f4q9K39p9j64M58l30k03K66p1r9J17j17J18j2J37j48j79K92j39J82O1p6m88
3820c88L32r4L94k54L44n35J73K26K58n00J28P3k57N7p97R21Nn04J227k25m2o17
3842g5P4L5J29J11k27j21K47n5J63j45j01oK88l87K2Q3K53n72P0L45J10n59M78
3865A60Q1n9m97R1K36j84Q9j08l51M80k7K19M5J53J67o42l04O78o17M08M8j23
3887e7N7m33M40j78m69K01J99J7N88j226O50o2J06Q00o87Q58k48l21j22n39O06
3908A80o7N1J35n09J09K55l10j3M27j89k63M26Q0l81l1m86M54pO05K26p83M87
$$ plain form
3755 204 -131 -75 415 -98 -246 239 288 123 155 -22 372 141 24 181 106 554 380 56 -409 -128 254
3776 254 406 -268 -257 642 -492 -47 -163 110 -54 -327 -91 -320 35 45 87 -184 87 -130 35 19 -64
3797 -64 -153 86 7 -157 301 -29 -232 34 -37 -136 -19 -136 -18 -30 107 -41 -220 72 -67 115 176 100 -388
3820 -388 -56 -150 244 -10 334 -201 -28 198 456 -44 84 157 -100 -43 -840 81 86 -418 809 584 542 -75
3842 -75 -1 34 163 274 47 -74 173 118 281 136 35 29 317 -70 -48 35 288 -284 -214 131 241 -318 160
3865 160 241 182 -315 -224 12 -172 -83 -191 -542 -62 -89 130 175 328 495 -147 -451 227 -390 18 66 -57
3887 -57 0 -433 7 -171 -640 -439 -240 -223 365 -861 -211 -273 -167 633 -54 804 556 235 113 -426 180
3908 180 113 164 299 -210 -101 154 -156 -169 258 69 -194 232 312 -69 -100 -586 -132 -139 466 692 -91 396
3930C96j65p28P03m02L76L99j195P67K6k84m61M30J54n27J048l90l56M7R6p8M59
3951C15o95n6N11M60p75J15M97n14Q5PR3k46O23k22m82K21o7J5m1M15l90N48j
3974D16n35K3L59m30p2M17K15rp49M73k69L91l59J91J21ql90K21j24J69j17O0
3996fK6K11n4j20L62l60P2m58K36J98K28k83j51L52J67j06l28J11P83k28M05k078
4018a021R52Q8R8m6j298J078J7L20k85J52l69J51m8J02Q1Q5k0k79J34Q0P1r3J37
4041H7r0j69K68k76L8Q8RJ23J16k15P3ko7J35j72J42jj28J67j5m4Q8q2q7p7K47
4067A56N2O7j93J19l12L36k56k5J31k02J65P6j18J86l08J28J06k39N9K5Q9m7m
4090in5j74L31p4j37L38n13K88j04J18j10j09K21L7k91K28k05J78rR9o3k06L05
$$ plain form
3930 396 231 -497 206 -196 180 579 -616 151 177 -107 -568 -138 16 -511 537 147 -209 -162 -66 -144 315
3951 315 -380 -436 75 535 -240 -125 372 -142 -57 -50 43 -203 420 198 -284 -63 -130 -115 -156 259 -131 417 416
3974 416 -119 -96 263 -167 -239 178 393 384 -365 108 -161 230 -129 62 183 175 -215 6 -118 51 -66 -6
3996 -6 20 231 177 57 419 59 131 -327 -91 107 335 52 -99 253 420 314 -14 97 880 652 1057 -1021
4018 -1021 -69 19 117 71 -1227 -149 -132 188 -97 55 -314 -163 -211 -109 -28 57 37 -242 -108 -28 43 -50 87
4041 87 -3 -172 96 -180 -142 -54 -45 78 194 -21 52 50 -17 118 -54 88 87 -41 126 111 67 155 73 -14 -91 156
4067 156 208 275 82 201 -111 225 -31 -56 75 -127 38 114 -4 182 -126 2 108 -131 -72 -47 42 -5 -9
4090 -9 -64 -238 93 19 -118 220 -293 -5 -109 9 -101 -210 11 48 -243 -15 -220 -42 -51 48 -15 -221 84
4113H4q4J64j24K70k88k8P2m2K8j9k07M3J89k5O0j80L14k32j81N37k64n4J03O0
4137A96m8L8R7l01q7L60l1j35j38K42n2n1m7R5P1j00j47J64k22R3n8J3O2k29K18
4162CNp8q5M30k07j5p6N3l12J10J99j46R4Q3j07l8k24J78L1O2Q6mj62j03K60k40
4188b03J80N9l37K91J17k79n5J73q1M8K06j22k9m3K75j27J25j77J39j34m5NJ93
4211A79o9J20j59j14OK77lN3l98j26M70k07p2N1J88l20M19k64n8m0J39j40j74
4234b42L32p4k34J50j86M59k59K7l8j7K88l29P2j30K9J40n4j69J37J87l99J62
4256a48j43L68j85p5j26K87J43j31L1n8L9j28J05M8J4J54l94KL35k42J97r5J49
4279A47m11M17k78K35r9J57m48K93j23p2M58n6%o1j45p9M21k88K02j49k52M55
$$ plain form
4113 84 0 164 40 310 22 -6 66 24 52 33 -174 -131 58 33 93 -87 227 -5 -186 351 87 33 136 196
4137 196 148 186 283 -18 -105 255 224 89 -49 193 141 90 43 138 209 109 -38 126 -96 -3 -61 -48 14 -215 3
4162 3 8 -70 -155 275 68 53 -23 30 -282 -172 27 -119 -25 58 -49 -87 -311 -133 -102 -40 46 42 -120 -223 37 -203
4188 -203 -23 36 -301 -10 107 -172 -227 -54 -135 -87 119 -3 -32 -75 200 73 198 21 160 26 -19 -14 179
4211 179 110 230 71 -43 -37 240 237 290 -108 -234 236 29 -43 8 196 -124 295 31 -27 -67 72 -68 -242
4234 -242 90 16 -218 -68 -254 205 -54 -27 -65 -82 206 -123 -51 -181 -152 -12 -66 -235 -98 89 -310 -148
4256 -148 -291 77 -108 -183 -309 -22 121 -10 21 -37 2 -126 -21 27 41 195 -199 -197 138 -104 93 -2 147
4279 147 -264 153 -125 110 11 168 -280 13 -110 -182 276 220 220 159 14 -65 356 68 270 121 -131 324
4301C24p12L37k78M06j03L13k91j33J89l16N67n57l0J35j74O03n56O34n15K99
4321A42l16J78M37l14k31L92j25r87Q27k29J010j158N70m23L75J94l61K00Q0l55
4341i4Ok7Q6J87L9l51J40K17j44k23K09j22K61j46M5k23j03L90o5J69k09J89k29
4364Bk10L54j85j25N38k98MJ96k31n0J02l02P4L53k25L05m66K94j43Qo3j00J38
4387c0q6N0j32J14J6J35j15o5K91j32j61j12K12M6r3J48k61J5J6L4L06k47n7k4
4411a32R8j84K33q0J01j39J98j48l5PJ4R6R3j55J38l69L38m4Oj05Q3l3K35l27
4435a11L23M2j48j15L04j97J75k69mJ43L7k0j87k6K91j95Q2j16R4o1J4R1j87Q3
4459D3k6k0M4J04k37K02l68M55l14K97l75N8N4M7K47k04K43l98J91j35j33M45
$$ plain form
4301 324 -388 -51 -329 77 -26 287 -4 -137 52 -264 303 -254 -284 -149 -323 280 -276 358 -157 142
4321 142 -174 4 441 127 -104 288 163 -824 3 -226 784 -374 196 -227 148 342 -19 181 261 -94
4341 -94 -88 -115 -29 158 197 -154 -14 203 59 -164 45 -77 184 38 83 -140 -243 147 82 251 42 231 2
4364 2 -208 146 -39 -164 374 76 80 276 45 -5 97 -205 -131 222 -3 302 -164 130 -13 -5 -68 -168 -30
4387 -30 -116 -66 -198 -84 -68 67 -48 -113 178 46 -115 -227 -15 31 -62 86 -175 -160 -144 -110 196 -51 -108 -132
4411 -132 -34 -218 15 -65 36 -103 95 -53 -88 -81 -67 29 122 -33 105 -264 74 30 36 -69 14 -19 216 -111
4435 -111 212 254 106 -9 295 98 273 4 0 143 180 160 -27 -53 238 43 125 9 103 42 56 147 -40 43
4459 43 17 -3 41 145 -92 110 -258 197 -117 180 -195 -137 -83 -36 211 7 250 -148 43 -92 -225 220
4481B20j48m6o9r1l1p9J24J63J10k39J21l1m26K18K64k87K03N1N8j17M7K91l79
4504g3qJ60o2L01n63J89J60q0K82j91j47Q1M3J19j70J7k04m7K32Q1p2l7N8L65
4528D34l38J02j30K6mkk03J72j82J25j72J68r6p1K43n72M53j20L82m83K15o2J19
4551Dj55n8J6J18o3k4K82j29L2J05k30J37q6J72k15o2J65q5M44m18K1m2J80j66
4575e7J25o5Q2k01q7L64k12J4R2J52j04M6q4J73q9r3Jn7K50j30J3J01j33j2n9
4600C0q8K15p0m56O20l00R4n5k22%K19j86k1Q1J07L7r6K7j78J66j43K01pN6K2
4625E3j9k82K92o8l49K71J6m5K24k32K31j18o2P7L58o61n56J132j84K2L5j08Q1
4648A08J73k67l1Ok47L14j18J87K8k7k75K41K47k41j85n7J94K1Mj43m1Q5K25k67
$$ plain form
4481 220 72 26 -43 -134 -165 -244 -120 43 153 -86 35 4 -422 -204 60 -227 -24 27 85 -32 15 306 -73
4504 -73 -81 79 17 318 -245 -56 104 24 306 115 -32 49 92 211 41 58 -146 -193 39 120 48 11 69 434
4528 434 96 198 68 94 90 88 -115 57 -125 0 -172 -4 -100 -171 72 -500 -47 -167 215 -268 -53 -115 4
4551 4 -151 -209 -193 -75 -138 -162 120 -9 23 128 -102 35 -51 121 -94 -156 9 -76 368 -50 -29 -71 109 -57
4575 -57 68 3 85 -116 -203 161 -51 -37 55 207 103 149 65 238 149 56 57 0 250 120 133 234 101 89 30
4600 30 -58 157 87 -369 251 -49 45 -10 -232 -232 -13 -199 -220 -139 -32 5 -91 -64 -242 -76 -219 -18 -25 31 53
4625 53 34 -248 44 -24 -373 -102 -86 -131 93 -139 92 -26 -88 -11 347 -314 -870 262 78 100 135 27 108
4648 108 281 14 -17 -11 -258 56 -62 125 153 126 -149 92 339 98 -87 -144 50 71 75 -68 -109 -24 201 -66
4672f6L60k70J53j06lP1J2P3j9O7k31rQ7n5L76j81n80J7%M90m38M5J08M94p33
4697c38r7O90l62K45n05J68K49k24J89p05K61L32N5J51k10L29k61j49K97j58P9
4718C6k94K0J22Q1J25j30J08j89J39n6J57q4l0k49L32m2Kmj2j14L9N5J3j03J51
4743G3j62K3J74j55m3J17j07j01K35j54J32P1J35j76K0K61j74j58l62J33K86K86
4765C54o1n10k50n83R58K93n33j57q7L56r2M54k70M14m77j54L74j09J25k12M7
4786a20KK56J06m15k01L38JK02p7r3L63m42J00J11r8J20k09k16K45M2Q0m0O31
4809F86l79P3j541J016R66j103K84n9N59j150K25P14n92K51J26m66O49l60l0J85
4829E4n6L11n06K78R4k37m90L92k94K74l55N33r2J60j53k15L87m59K86j11O5P2
$$ plain form
4672 -66 294 24 177 71 68 139 151 224 205 272 41 32 119 64 440 259 -321 -304 -304 186 -252 -207 -99 395 -338
4697 -338 -435 255 -107 138 -367 -199 50 -174 15 -690 -429 -97 -42 109 -101 228 -33 -182 115 -43 36
4718 36 -258 -238 -116 -35 90 -40 68 -121 18 -38 119 35 5 -244 88 46 48 44 32 -82 -43 12 25 -78 73
4743 73 -89 -66 108 -47 -90 27 -80 -181 54 -100 32 103 238 62 82 343 169 11 -351 -218 68 354
4765 354 293 -217 -467 -1050 -92 201 -332 -489 -576 -220 -312 142 -128 286 -191 -345 29 -80 45 -167 -120
4786 -120 -118 138 244 -171 -372 -34 -33 169 92 -1 362 -80 20 131 33 153 -56 -272 -27 15 95 55 686
4809 686 307 380 -1161 -145 821 -282 2 -57 502 -648 -423 291 -301 -50 76 -390 259 -101 -131 54
4829 54 -2 309 -197 81 175 -62 -552 -160 -454 -180 -535 -2 -94 66 -87 -302 85 -374 -88 -199 -134 -62
4851f2L12l38Q0n1J87j22M4j2p2N2r9k6R8l66M82j51J32j16j2Q9L6jj21J78J24
4876B65k17k1j66K09Q9j34K24m05K73j01j7rN5m5K1J85k50M21l09QJ89l45N9J43
4900A22n8j41m9J73k7O9JRm9o2M8m0j28P0n7P9q2oJ21k47N42k2n01M4J74J92l94
4927b19L68J87n40k81K76j77J53M63j95K41j33q5K47k1k88k1K53k24J84J05Qj6
4949B85p56R63q87Q83k00J2J7l04K64k73k63M01n2o8kK06k57K8j00n0J50O3k2
4972C8n8J57oj77J79k28l4J66J6r0o8O0L92o25L78p1L2j46n5J15j47P6q1J58j
4997b0M6mk41P3J66k35o9K65j7k3j16R5K09l23N8J64o1J29k24K45K8j8j47k04
5021b24J48MK10j09K59j98J4k11j7K35j23K20j00p8K5n4mm15O15j86j58J65N2
$$ plain form
4851 -62 250 -88 -8 -59 128 6 50 38 -34 18 -81 -107 -9 -375 107 -44 88 -28 -40 49 85 84 -37 141 265
4876 265 48 27 -139 70 159 25 249 -156 117 16 -1 -10 45 0 21 206 -44 377 68 76 265 -80 -21 122
4900 122 64 -77 -126 47 20 89 90 99 50 -12 36 -4 -132 -62 -119 -40 -122 -128 -7 -254 288 266 -235 -191 -17 175 -219
4927 -219 149 336 -204 -485 -209 -386 -233 230 35 276 143 58 305 284 -4 -25 228 4 188 293 301 285
4949 285 -471 492 -395 488 288 300 317 13 277 4 -259 142 90 22 20 226 -31 -3 -103 -153 -3 60 38
4972 38 -20 137 131 -46 133 -95 -129 37 53 -37 -105 -45 347 -278 100 29 61 -85 -140 -25 -172 -96 -177 -19 -20
4997 -20 26 22 -219 -146 20 -215 -284 -19 -36 -59 -175 -80 129 -194 -136 28 -33 96 -128 117 145 127 -20 -224
5021 -224 -76 -72 138 29 288 90 104 -107 -124 111 -12 208 108 30 55 1 -3 -418 197 11 -147 18 70
5044G0K4Km2k71L70k9n3l5P9k54L03J5J49k84k04L2r2J72J08o2o4K43j7m23j32
5069c95O18l27o4K23m09K88k30r4M54k50k98M43N93j78o99L92j15N4k5l2j57J73
5091c5J71ok67Q0J07L8k9j60K34j00j1pJ62k10K04N1k15m3Q1K54k03j42L30k95
5115a1j26K25P1N8l78J80Q0J04j37k10N5K96K0r0j30J3p3K53k28K6QK7J35j91
5139b3P0M2j57N8R2l52N1J72q6j86M79l39K6K12j40J55J38k62K1M4q7j65L65k27
5163i9R3j89J57l33N22l16K36J02K08o74J93l90P60o10K15m72J49P47l53K10j03
5184E3K6%pr4K75k14j58r3L73l41M48k60j10P5K32j66p1J83k77p6Q1L89J7nO1
5209C41l41Jj74K97M7k26p5q3J15J87l26K44m8p4J50j56L35k18n4j18jR5k6R0
$$ plain form
5044 70 94 96 54 -217 153 124 71 36 115 -139 164 179 328 44 -160 -128 -220 -48 60 -2 -66 177 160 -263 -395
5069 -395 223 -104 -168 55 -354 -66 -296 -390 64 -186 -484 -41 552 374 -325 67 -48 6 -19 -51 -208 -35
5091 -35 136 130 -137 -57 50 88 59 -101 133 33 22 15 177 -33 171 222 7 -36 45 299 96 -46 284 -11
5115 -11 -137 88 159 217 -161 19 99 203 66 -144 -89 207 227 137 7 20 -53 200 -28 -2 6 33 168 -23
5139 -23 47 89 -68 -10 82 -270 -219 -47 -133 -319 160 -179 -153 59 -81 74 212 -50 -29 15 -72 -237 128 -99
5163 -99 -6 -195 -38 -371 151 -165 71 173 381 -293 -100 -490 270 -340 -125 -597 -448 299 -54 156 53
5184 53 79 79 72 -22 253 39 -119 -212 161 -180 268 8 -102 -27 205 39 -32 151 -126 -202 -121 268 285 280 341
5209 341 0 1 -173 124 171 -55 -130 -213 -98 89 -237 7 -41 -115 35 -121 214 -4 -58 -176 -177 -82 -108 -18
5233a8l97K93R0k5P4L2l8m4r0K47l33J50q6J8J36n1M21j54j56n0J95m94L76k04
5257a08P5M6J44k13O2j55q9L58L14k69j21q5J36k29J23N9l0k8J94J48o04L62J65
5280B55j88j26k9K2R7q7K80J2j41q9J79l2j39n5j67P9m2J03j18K5J71kRj53J29
5305gK5k91M62j35l5j03k15K21o0K32k66R7K01p1j97%K01m3j06K34J7k55j74M10
5329A42j03k99J93J83l2k28K08J73l27J67j95J81P9m3r8KK36k18M3k68L15j85
5351g4J20j7r8O5q9K21k01r4M0N0J45K28l96J97k02J20J9nk16J74k68L59j44p1
5375a37K86j49O0M4J35l39j52k8K55j40L7j33N0L1j09J9L43O9k77K86q7O7l86
5398b55M59k03O0m6J75p3Jl7J02O0j87q9o4J00q9q9L04k69J49J83j78k36L1N96
$$ plain form
5233 -18 -415 -122 -32 -57 17 49 11 -33 -123 124 -209 -59 -145 -127 9 -42 379 225 69 19 214 -280 96 -108
5257 -108 -33 13 157 -56 6 -149 -238 120 434 165 44 -41 95 -134 -11 48 18 -10 184 332 -272 90 255
5280 255 67 -59 -88 -66 31 -56 224 236 95 6 185 153 14 -41 -208 -129 -171 -68 -186 -161 10 8 17 -136 -7
5305 -7 18 -273 189 54 19 -84 -299 -78 -138 94 -172 -75 126 55 -142 -142 59 16 -90 144 161 -94 -268 142
5329 142 39 -260 -67 116 84 -144 64 237 -90 77 -118 63 142 99 1 3 239 21 64 -204 111 -74
5351 -74 46 29 -69 -4 -93 128 -73 -167 -127 -77 68 296 -100 97 -105 15 34 29 -187 -13 -281 78 -66 -137
5375 -137 149 0 60 104 239 -100 -252 -280 -25 -165 -128 -261 -211 -180 -289 -270 73 142 -135 151 64 131 -255
5398 -255 204 1 61 15 190 117 118 81 183 243 56 -33 -97 3 -86 -175 129 -140 9 192 14 -222 -191 405
5422D05j48l64om1J57k07K69l75k0M43j21j01K09k21K9J95j85LnK39j78p1r5N3
5446a36l1J11n3k11M89j38l9L88o41J64J65j60N12o67K58k51M83m70K4M32j55
5467G4j11J31l37K46K48j22k8L6j13P0j80J56J0K6j32K30r0J05k49k14R7K00l5
5490A8J23l01L31R1k34P2J7J09l90K24j64J04Rk32J23j7K92l31J20k90L11Q8n4
5513A9j50R1K02l60Q9J52l53J20jJ21J17K8n1r4N3L4kK27n03L77j11M7J5m8jN3
5539G1p2M4J81k23p4Nm5M22k54r3K11j22K00k23J38l58K89k46k23M50M8k19K70
5562A77l46K89lj2j7k8l2K4K83j81k96L0K08j37M9J80r8j25r0P1J02j22M3q5J29
5587A3j82J27q7K27m7n5K6n7J35j87J94k38J18q3K86j13j23J63o1j73J98j86K72
$$ plain form
5422 405 257 -107 -113 -154 3 -204 65 -310 -330 113 -8 -109 100 -121 -92 103 -82 -79 -84 155 -23 -94 -189 -136
5446 -136 -167 -56 -109 -320 169 31 -8 380 -261 -97 68 -92 420 -247 11 -240 243 -227 -203 229 74
5467 74 -37 94 -243 3 251 129 101 137 24 94 -86 70 80 106 -26 204 114 219 -30 -244 -147 53 18
5490 18 141 -160 171 262 28 100 117 226 -164 60 -104 0 9 -223 -100 -117 175 -156 -36 -326 -15 73 19
5513 19 -131 -40 162 -198 -109 43 -310 -190 -191 -70 47 75 24 -70 -17 17 15 242 -261 116 5 52 67 19 18 71
5539 71 -1 43 224 1 -73 -68 -113 309 55 -38 173 51 251 28 166 -192 97 -149 -372 78 126 -93 177
5562 177 -169 120 117 105 88 60 28 52 335 154 -142 -112 96 -41 8 188 90 -35 -125 -54 48 -74 -31 -116 13
5587 13 -169 -42 -129 98 51 -4 22 -35 100 -87 107 -131 -13 -96 190 77 -46 117 56 -117 81 -105 167
5610A67j15q9M0K30l75O0J29j01L30m93J95J28l36J7K63r4lqM1j36O5R7n4K52
5634B10q4o0k0L4m6k6R6K9N4k28K63k10K45r2j74J06J3L3l26N21l67lJ23J15j97
5659Ij08J93O7k25L93l30R0j33k8j52J59J71q7J51l44K77j02o6P6m1K98m60j1
5682b03J20M92l70J11J3j29Rj86J47j43J11K6Q6k6k53L23j92N6K62l96J20k30
5704b52K40L87m16m1j63L27K45k56K4k44M00r1m5k96j75K45K51r5J59q4J7j36
5726AQ6j8p8J04j04j33MM0J59j21N1r5M5k9J08K34k31Q0o4nj21K54l78J15N7j99
5752b38K43j75J44n1n0k47K42J74J63l81K50k32J20M6j10q5P6J91j5Q6j52K35
5774B34o8m0o9j53J66p3K52o90O29n81J60P66r47L2M16L0J03j58K72l28J05L49
$$ plain form
5610 167 52 -37 3 233 -142 -82 47 -54 276 -217 -22 106 -230 -213 50 -44 -47 -55 -14 -150 -85 12 -42 210
5634 210 126 66 46 80 34 8 104 133 187 -41 222 12 257 165 -9 97 110 143 -183 338 -29 -32 91 206 9
5659 9 -99 94 161 -64 329 -1 89 -44 -72 -224 -65 106 19 170 -174 103 1 -65 11 -30 268 -192 -203
5682 -203 -83 409 39 150 163 34 43 -143 4 -139 -28 -2 84 58 -195 128 -64 -8 254 -142 -22 -252
5704 -252 -12 375 -41 -82 -245 82 327 71 95 -149 251 160 115 -181 -356 -111 140 45 204 120 137 1
5726 1 87 69 -9 95 -9 -142 -138 -98 61 -60 -9 -104 -59 -88 20 254 23 103 39 34 -87 167 -211 -96 -39 -238
5752 -238 5 -170 -26 -77 -127 -374 -132 42 205 -176 74 -158 -38 8 -102 -187 -111 80 65 151 -1 234
5774 234 166 126 57 -96 70 -3 249 -441 188 -393 -233 533 -414 -382 34 64 167 9 281 -47 58 407
5796D07j83m69j42O13l95M02j44m14N58n33j74M86J1j79j31M72q2j16J3rk5j4
5818d8J32n6k08k9L92j68J39m30N17k54R9n6K00l08m2pk10N34n4l16j4K03L9l03
5842b48K30J01j95L00k99K93k20K33k87M4K54k5j61j47L43m03J15K97j44l4J61
5863B08K39n73K4j19L47J26J65m09P7N45q21r1j04J60N95r01J588j128k23k46
5883e41J053pp78R85q22k13L68l8p6K43l67J02J72j00j7q7j17LJ37J16j59J84
5905D1k71K29K1L7K1M8k06o6J24m1L70l44j62M27k98O9J3J72P7j45k68K16J76
5928B40k49J23j26J21J23O3j90k07K02J83m06P7J38k46K67k80K17P1l23M5R3K03
5950A39q7k06j09J67M6j39R3r8J2MJ37O4l34L93O2j69O4J65l54J13j23K46J15
$$ plain form
5796 407 224 -245 -387 226 -169 233 89 -325 233 -300 -474 12 23 -156 -287 185 103 -13 0 -9 -34 -48
5818 -48 84 28 -180 -209 183 15 154 -276 241 -13 86 30 230 -78 -120 -127 -337 197 143 -173 -187 16 55 -248
5842 -248 -18 83 -112 188 -111 182 -38 195 -92 -48 206 181 20 -127 216 -187 -72 225 81 47 208
5863 208 447 -126 -102 -221 126 252 417 8 85 630 -191 -282 -386 -226 369 -532 1056 -72 -295 -541
5883 -541 512 505 -273 712 -110 -323 45 7 -69 174 -193 -91 81 -19 -36 -123 -240 -237 -100 16 -143 41
5905 41 -230 -1 20 57 78 126 -80 -146 -22 -63 307 -37 -199 228 -70 -1 12 184 261 116 -152 64 240
5928 240 -9 114 -12 109 232 295 105 -102 100 283 -123 -46 92 -154 113 -167 50 121 -202 -157 -64 139
5950 139 52 -154 -263 -96 -50 -189 -96 -194 -182 -178 -41 23 -311 82 144 -25 39 204 -150 -37 -160 86 201
5973B01m0j47K56m16P0n4J51j74J01j39K01j5j62K13n5R9p4J94k54n6R3J06l21
5996b22K42K9j20K50j21J85p5k3l3l84K04M7m3O7j83L85j24k40NN9N9KK97l2q5
6021A46l8J70m07L07k17K85j13j28o6J32p0j17K94m28O7O1O00o80o8O46m62l18
6043d04L72L52l91L31K2k29j80J83K50n41M69m06O42P7q71O26q38N95o43M37n4
6064b01l90N81m01J058p41k52L30o29J065J0k46k45j20K82K82J61n13P29m94k04
6084F2N6K49j73l76L75J71m19q8K75K0k79J56j94N1j12O72m99J80l70P17l64m35
6106c25R65p80Q68j450M59j15L57M26r32R94J42p86j00L77K55k87p0l45R1M80
6126B24l41n6J28K06m13K49n5MJ56r8j55N9o2Q6J16j7k97M54N49j74j113O80j55
$$ plain form
5973 201 161 14 270 -146 -76 -130 21 -153 -52 -191 10 -5 -167 46 -9 90 16 210 -44 -100 -7 99 -222
5996 -222 20 49 -71 179 58 243 168 145 112 -272 -68 -21 -64 3 -180 205 81 -159 -154 -95 -36 -34 263 231 146
6021 146 108 278 -129 178 -39 246 133 5 -61 71 1 -116 178 -250 -183 -122 478 -202 -270 376 -86 -404
6043 -404 -32 320 -71 260 282 53 -127 56 306 -235 234 -172 470 547 -324 302 -536 59 -584 -147 -201
6064 -201 -591 -10 -411 647 -94 -346 -16 -645 420 430 184 -61 -181 101 383 544 31 760 266 62
6084 62 118 367 194 -182 193 364 -55 -143 132 152 -127 29 -165 -114 -226 446 -53 127 -243 474 110 -325
6106 -325 640 -140 728 -722 -263 -378 -21 405 -527 467 609 -177 -277 100 355 68 -2 -347 -256 224
6126 224 -117 -173 -45 161 -252 -3 -58 -54 102 4 -151 -92 -154 -68 48 31 -266 188 737 563 -550 130 -25
6149b5m58L00K06n32l70N39R94j128K67k53l76N56L05K14k98r0M73J76l44K34
6169C90l30O85n16K0k24O6k35K54M6K63j394J507m61K42q89L33L68j02J76o53
6189d54R55m93K32m94n6M00j64K5K26l89L48L40n65l17L97L91o04J53l4M9J85
6210A31l61Q3L20k91L84k37J56k49L4L7j21J3L51l21K44k60L53j40P6j68j38J92
6232H8j0j17J36q0j14O2K8k9R7J00k45K45Q4j90L2j19P9K17k38%j71M51j93m4
6256F9j26P1p4kR9k96L04M1j70J28J4k74M6Rp6K2K13k12M62r4j79J49o8O6k73
6281a51L4l8J01n3L79k24p1j51J0J93p1oK63M2k79O3P5lj46Q7j5L59k74k83J37
6306b2J51j25P7m7J49q2J30j35k16J69k58J33J12J18n1k54K50Q2j90n1J71k13
$$ plain form
6149 -25 -483 -183 23 -509 -879 -340 654 -474 -207 -460 -836 -280 25 239 -59 -149 324 500 156 390
6169 390 60 745 229 249 25 91 -144 110 156 419 -975 532 71 313 -576 -243 125 23 199 -454
6189 -454 501 8 240 -254 -310 90 -74 -49 177 -212 136 476 -89 -406 -9 382 -222 -69 -103 -54 131
6210 131 -230 -147 173 -118 266 29 185 -64 -30 7 -114 -101 250 -71 173 -87 266 126 202 34 -104 88
6232 88 78 -39 97 17 -97 -35 -7 -36 61 161 -84 161 245 55 87 -32 47 264 26 26 -145 306 113 69
6256 69 -57 14 -60 -62 37 -259 45 86 -84 44 58 -216 -170 -161 -237 -215 -2 -214 248 154 -25 124 56 122 -151
6281 -151 -117 -155 -54 -107 272 48 -23 -174 -164 29 -42 -48 215 257 -22 41 116 113 -33 54 39 398 124 -159 -22
6306 -22 129 4 81 34 183 101 231 96 -120 49 -209 -76 36 154 103 -151 99 181 -9 -60 111 -102
6328a02K10%j21J00l2K9n4J86j84K0Q5J12p1k53M5J31j25p3N7N7MMj91R4m8K64
6354A44l19M61l08R2j61P4j27Lj26q5J96N0o1J29O1p0o1P8j2N4K20k78J36r8r8
6379a06Q9K49l14q5Q0L82j00j18j12J87j97Q7p4J18Q2j32J39L3n7ml7L7j10J43
6403A80l38R2P3J86k07k49J72j89N51k69K62j78r2K8L21k92k42O43L59r03j26
6424b18J79L7o0l2L17j36K5k08r6J61j21K00P8j39K7Kp2J14j70p2K00K80l72J08
6448C2J02o3k60J24K10j95j83L10M2q3J12k69J90n0Q9m5k09JK32j19j84L59k34
6471i1k72O20l28J8M5L5J31j39J13k66K99k02J2J02l8l4K35M7m52P6J70O3j3j54
6495b3R8k21K01j86J13n8N7j39K3K84k94K65k78n5L6J14K69m94J14J78l33N14
$$ plain form
6328 -102 108 108 -13 87 55 84 30 216 32 52 137 249 178 -75 -30 101 -24 -97 -40 17 21 25 -166 -72 -120 144
6354 144 -175 286 -22 70 -91 -17 -144 -141 -267 -352 -156 -106 -167 -38 23 -47 -108 -30 -42 12 232 -46 90 -8 -106
6379 -106 -17 232 -82 -167 -87 295 195 77 -35 152 -45 42 -32 86 168 36 175 208 151 147 110 147 37 180
6403 180 -158 -66 7 193 -14 -263 -91 -280 271 2 264 86 -6 22 343 51 -191 452 811 -92 -218
6424 -218 -39 -2 -62 -94 223 87 112 -96 -192 -31 -152 48 126 -13 14 16 -56 58 -112 -184 16 296 -76 32
6448 32 134 71 -189 -65 145 -50 -233 77 119 36 148 -121 69 19 108 63 -146 -145 87 -32 -216 143 -91
6471 -91 -363 257 -71 -53 -8 27 158 19 132 -134 165 -37 -25 77 39 5 240 287 -165 -89 81 144 131 -23
6495 -23 75 -146 55 -131 -18 -76 -19 -158 -135 149 -145 120 -158 -213 -177 -63 206 -288 -174 4 -329 185
6517A85m37J09K54n0o5j18J6J09J32l48J80q7J8K07p9Q3k55M24j96NJ27j27Q4
6540A71p2k81K13j2p6K9j3J08l8l6k7J32k63K48j74J51J00k77L84l90K61j80m23
6563d65L78K2J22L9j41O9m6j24K22k09O3l3K20j86O9p1j5L73j13m73L35M6l4j57
6587a09N2Mm0J67p0k61K19L6m8k6K51k46j06J19K37k18p4K72k40P6j16J93n9k07
6611a94K8K24M8J56k28m3j61K77r0j09J11O9j85J17Q4j98m5P8P4L6O4l13M00j22
6635G8j01k5J53k64K86j95J24k77K08J20k28N8J65Ro1k35O9L3K36j3k74kJ50j76
6659a62M0L17n05L31j90J89K58j85j02O3m09O04k6j21k86LK9O2k02K70rR05q99
6682b5l66O78k06l9m1j51K28K5J12l5j0o1k86L08P0r9Q4j78J29k54J91J35m88
$$ plain form
6517 185 -252 -143 111 61 -4 -122 -106 3 135 -213 -33 -120 -102 105 26 109 -146 278 82 87 214 87 171
6540 171 99 -182 31 19 -57 -28 -41 67 29 -7 -34 98 -165 83 -91 60 160 -117 267 -123 138 -42 -465
6563 -465 -87 -65 57 96 -45 24 -22 -146 76 -133 -70 -103 117 -69 0 -71 -86 287 174 -299 36 82 48 -109
6587 -109 -57 -53 -93 74 4 -257 -38 -2 -50 -76 175 -71 -177 -58 179 -39 -113 159 -81 -5 -121 72 13 -194
6611 -194 -166 58 106 262 34 -9 -170 107 17 -92 19 88 -97 20 104 -94 -139 -61 13 49 113 -200 200 78
6635 78 -23 -48 105 -159 127 -68 56 -221 -13 107 -121 -63 102 111 50 -185 -116 -83 153 140 -134 -136 14 -162
6659 -162 -122 195 -310 21 -169 20 278 93 -9 54 -355 249 223 102 -184 -181 -152 -90 -292 -22 -31 874 -25
6682 -25 -391 287 81 42 1 -150 78 103 215 180 170 109 -177 131 201 102 186 8 137 -117 74 209 -279
6705b79J2K95K08k19J32l17j8K34l6j81L36l83J58J7j0k2J25k75J8O4RK34nk15
6729a18K9jJ26j16N5K2jJ91k09k2k6K25r2m1l4J99k8oj75K52j78J38k23J78K4
6754A69l28J24P9J03p2j12n0K13l9N4j66J48j42J1K23r5Kk45K81o4J49j0l63J52
6778B2N4k46J90K53n12L66k30J1O5L3J7J23J73k1j49j39Qk90K43N3j50R8k15K54
6802A1p79M74L73m48J25P67M7p42J5K13j16M70k91L9Q3l04J25J70p4r7j13J6K12
6825A76j6q3q4O0j0k1J9N7m8%p6l03L59l1J8k16K10P4J76k26j11M9J1k1J3L1M2
6852D9oP3K7l06N5O0J37k42J97L6r9j00j77K52j4j42J56llK8J04L4K02l23J59
6877A54m33K24K88j36N1n02L16j10j37O42l99J05M18j033P05l84K69j21k47L71
$$ plain form
6705 -279 -267 28 236 17 149 -168 -186 48 12 -169 167 -216 -58 -41 -51 -73 52 -223 -205 -141 -132 102 97 -118
6729 -118 -89 -90 36 -80 -25 -3 -4 187 -22 -44 -70 155 63 22 -12 187 159 153 -22 230 52 190 -33 145 169
6754 169 -159 -35 44 147 75 -37 -87 126 87 141 -25 123 -19 -8 215 120 122 -123 158 94 243 233 -130 22
6778 22 76 -170 20 273 -239 127 -103 -92 -27 6 23 146 319 298 149 10 18 -272 -29 24 -126 -28 -243 11
6802 11 -768 -294 79 -369 -244 523 570 -172 -157 56 -60 410 119 158 241 -63 62 232 158 61 -52 -36 176
6825 176 160 77 -7 53 43 22 41 98 50 50 -26 -329 30 -1 17 -199 11 85 261 35 -76 -27 -16 -37 -24 7 49
6852 49 43 116 143 -163 -108 -48 89 -153 44 80 -19 -119 -296 -44 -58 -200 -44 -47 -50 -22 82 116 318 -5 154
6877 154 -279 -55 233 97 148 -354 -38 -148 -285 357 -42 63 481 -552 153 -231 38 -83 -330 41
6897D1r4K09J28l49K10j23O2k23J56nP8joK03k06k17L06o7Rj72L01k70J18m6M02
6922D44l21j65L4j34L82j77J31m5l01L61j63N4l23J51k01K82N2r5M8K77m07k7
6944a43K54M39m05Q0o85O28P5n28k20K65Q4J9m6L39r55l1N56p57J102M53j032
6965e08M6j42J11O93n3m19K22L48K8r31L61O10k49K27q41J70M42o13J16M48O20
6986F86j191L96O79r86K47J295q82N47o82k10K06L11j91l38j26J80L34o47K1N74
7006B23J11p75J6J38R68p36k17O16m02o08J067J40n2o08o12M96j116P98k07Q59
7026I9n62O58j23l1j92k27N77j46O7l54j4L3L2Q30n77m42R34m65p26J023k4l19
7048E1M81K11k21n56J45K60o68P43l65p20P88J36M16m30N75N19j346K65l6K8m74
$$ plain form
6897 41 -53 156 284 -65 145 22 84 -139 17 12 90 89 83 286 80 -137 169 102 111 -61 240 -30 88 42 444
6922 444 123 -42 -8 -142 240 63 194 149 -152 209 46 100 -223 -72 -273 9 61 -34 14 291 -116 -143
6944 -143 111 550 145 225 -460 168 243 -285 -505 -240 -156 -137 -183 156 -799 -830 -274 -1031 71 524 -508
6965 -508 -462 -604 -493 200 147 -272 -50 298 326 -605 -244 366 117 344 -497 -327 115 -498 -382 66 686
6986 686 -505 -109 570 -416 -169 1126 244 791 109 -101 105 416 225 -113 -239 -59 275 -372 -351 223
7006 223 334 -441 -425 -287 681 -55 -272 344 -58 -666 401 541 489 -119 -731 -235 -1351 -553 -760 99
7026 99 -463 195 72 41 -151 -378 199 53 120 -234 -248 -215 -183 647 70 -372 562 97 -629 394 370 51
7048 51 532 743 522 -34 111 371 -297 446 81 -639 149 285 701 271 846 1365 19 284 248 276 -198
7069a98J001m02j871R06O12q1l75o15J203q6R11j4o6k74n80P91J60j532M04N66
7089D60k71N3m17J207r45l43Q13n16j60N51l46o29n9M17LL94n54M00J70l63P5
7110f0jn5L04l55L84o39L59O0Q6J80K7J53l90K18p30p2J73R53p77K52k32P04k55
7133B87L03j51n71M07K87j047J4O04L47o08K69j4r0K09k27j17k16O92m82N39k56
7154A79k13j6k70P03p6n0m38K47J99k80N21k14m22jL18J84l94l88N63l90r8O24
7176B88l3o80L24L9J34m47L77P3k38J51K64n95K23J34j31L60j52R0q5m4j76J38
7198A4r3L47k62R4k15K32p8rk2o7J90p9J59J0n01M42k23n6OM03j80k43J36j39
7222a34M22k49k33O76o73L29k67K00R0r2mM4j31K20l31OK04J68k9k12J83l50J50
$$ plain form
7069 -198 803 401 -1470 -564 48 -33 -408 -1023 180 94 1005 991 925 651 71 862 1022 -510 -106 460
7089 460 189 242 -175 1032 87 -256 557 41 -119 432 86 -543 -602 -185 -182 212 -342 58 228 -135 -60
7110 -60 -61 -116 188 -167 217 -422 -63 -3 83 263 290 443 53 271 -459 -531 -358 595 -182 70 -162 542 287
7133 287 590 439 -132 275 562 -485 -471 133 480 -128 141 127 37 246 19 -98 -314 378 -104 435 179
7154 179 -34 -50 -320 383 307 257 -181 66 265 -15 506 292 -130 -131 187 371 -23 -411 152 -238 -336 288
7176 288 255 -425 -101 -62 72 -375 2 75 -163 -12 252 -343 -120 14 -117 243 91 181 96 52 -124 14
7198 14 -79 268 6 100 -115 117 39 30 8 -59 131 52 211 221 -280 162 -61 -117 -111 292 112 -131 5 -134
7222 -134 288 39 -194 482 -191 138 -129 71 161 69 65 109 -22 198 -133 -127 77 245 216 4 187 -163 -13
7245a3R6n5K05M0m73N02p65J16J42K85n92M56k53L5M18p2n4J34j78N41o14L68
7267B69J5nM1l63K29M82n06l75M95m5p8J97m70M27j96j64L62p55O67l47q1O33
7289D32m71o0J50L09m28J8M42m97m0J75j20K21l77J07K50n03N73m86M88j86K15
7310B12k89J38nj0k19L10k59j21K55J26J99kj06n68L33L6J33k89J87m29R2K80
7332Dq7l0m4K23N5k30J07N4r7j89M94l37PJ18M8j13j41K85l24K84n5jK89l75r0
7357a45K30q3j9P1K45l97P4j56J41K31r8p0r2m1K95k9m34M68J28k19J7mj90K44
7381A67Mr6j7J11M7Q2l56p4r9J95q1p3L75m48K45o1K2l3j1j94K22J0O7j13Q5K5
7407AM9k68K41l42M07p7o6q2J69R3k82J98p4m9J5K24k3j74k5R8j15L07p6r2K75
$$ plain form
7245 -13 83 28 233 273 -200 302 -463 -347 -205 80 -512 -56 -309 -274 144 72 18 152 -26 515 -99 269
7267 269 284 279 320 -43 186 668 162 -213 282 237 159 356 -114 313 117 -47 315 -440 227 -120 -201 432
7289 432 -39 -99 51 360 -68 -50 392 -105 -145 30 -90 131 -246 -139 111 -392 181 -305 183 -3 212
7310 212 -77 61 56 46 -173 137 -122 -243 12 138 337 335 229 -339 -6 30 163 -126 61 -368 -276 4
7332 4 -83 -113 -157 66 121 -109 -2 52 -45 -234 260 -77 -70 48 96 -17 -158 127 -197 87 32 31 320 -55 -145
7357 -145 85 2 -17 54 299 -98 -24 -180 -39 192 94 24 -68 -109 186 157 -277 191 319 100 117 113 -77 167
7381 167 171 75 58 169 216 298 -58 -132 -231 -36 -117 -190 185 -263 -18 -79 -57 -90 -101 -295 -73 -63 4 -109 -24 1
7407 1 50 -218 23 -319 88 11 -55 -137 32 125 -157 41 -33 -82 -67 157 134 -40 -65 33 -82 225 149 57 332
7432C32j52j22p0oj03j53L90k6J83M7j55k3n01M84l52L62M8m62K50J96o8p5q4
7455f0P5O8k99J24LK53j02o4qj37J31J03j52L6o2K05o8N5QJ01j47j95j68K40l14
7480c74L48l3K26k77L49qJ69l65K42M5j90M77q20M1k38K06O39m00j29N21J81l06
7502C04q42P14N5m55L87P91l41j72r08J119q07j70N14N72p24Q1J61j18l60P98
7522E99p38o3M65q36J306j93P7k25m63L03L88n25L37o74K75j3J50J2j97M30l6
7543C79o09L49k23M56K15j99l30L95j35m57N41m66j80N54q11J041n22j43P05r66
7563d06L7J25k80O05Qk36l3L95J39n4k5k40k84N06j86J93L7p24O50p7q1o0j61
7586a52J13j24L20j64K4j22J24O2L8j2Q1j72J1J30j84J9l8%J32j97J59O0K7k19
$$ plain form
7432 332 180 58 -12 -18 -121 -274 116 90 273 320 165 142 -359 125 -227 135 183 -279 -29 167 99 24 -60
7455 -60 15 83 -216 -92 -89 164 62 -2 -10 -147 -16 87 -65 -29 -91 114 46 101 109 210 63 -132 -300 -60 -374
7480 -374 -26 -59 167 -110 239 231 400 35 277 322 132 609 -211 -170 -408 -202 437 37 -92 429 610 304
7502 304 -538 176 231 -224 163 954 613 441 -467 652 -155 -325 189 761 37 118 279 161 -199 599
7522 599 -139 -202 263 -573 733 540 617 392 -71 232 620 95 432 -242 33 20 170 182 -15 415 379
7543 379 -230 119 -104 352 567 368 38 433 298 -159 382 -84 -264 290 -521 520 -2 -145 560 -406
7563 -406 -369 -244 -524 81 89 -147 -180 215 354 300 275 35 -249 257 71 264 301 -423 227 150 69 9 -152
7586 -152 -39 -163 157 -7 17 -105 19 81 119 107 188 16 27 157 -27 -8 -46 -46 86 -111 48 108 135 -84
7610h4K9R6O0l13N12l55rK30j93j04J45Jj26K03Kj08J1J93l35J86k2m4j58J81
7634bl20N17k72J72k57j9J74p9K18l23M8Q2P7J02j0j35o8P5L39j92N0j62O3k38
7658a60J96m0l72K05O9K27j12k30K49R7k57K7J35Q7j03J24j76J72k13N1M3pJ1
7681B3N5l4k93L77J12l26k9R8Q3j06j0q0J34j6j39J64o7J58Mj61J81n7j09j36
7705a74L2J19L25l37O0Nm41N83n6j18J63n3l2J94q6k78m1p2J64K18K9K36l21o8
7729E1N4lm9J8j71K17P2k74K2K6p0K09j53o6K73k32n6L49o9k7q4N3J6j07L7q2
7755d6q9K34j42m2lJ83j95J96j30L2k33N16m16K61k79PO9M5k03L90k09K1J61j82
7779e4k7PO4m7P2J54j93k03J21J51R1m09N4K51L19m69O4OJ5J94M1k00M7j63Q5
$$ plain form
7610 -84 -55 41 101 -212 300 -55 -64 166 -27 -131 14 15 -111 92 94 -14 -3 190 -145 41 19 -25 -183 -2
7634 -2 -322 195 -77 95 -162 -181 -7 -86 132 -191 -143 -61 16 118 108 -27 -95 -20 319 127 177 15 78 -160
7658 -160 36 -4 -376 -171 -102 125 13 -217 32 129 -128 -101 34 121 18 142 -34 138 -75 -24 19 12 23
7681 23 78 44 -249 128 240 -86 -115 -17 66 -40 -50 -130 4 -12 -151 13 -54 104 108 -53 128 71 -38 -174
7705 -174 -142 -23 302 -35 25 30 -411 172 116 -2 161 108 76 270 184 -94 -135 -207 -43 175 204 440 119 51
7729 51 105 102 53 71 -100 117 189 -85 -63 -37 -107 102 -51 -117 156 -76 -132 217 148 121 37 90 106 -1 36 -46
7755 -46 -135 99 -43 -85 -88 95 -100 96 -34 -2 -235 281 -135 126 -153 -146 -77 -32 -235 155 -54 -33 128 -54
7779 -54 -81 -74 -10 -57 15 169 -24 -227 -106 45 136 -273 -219 32 351 -118 -54 -48 -33 161 202 2 49 -114 -29
7804b9J4J83l20K55l11M71L7k00k66K68K6j47j4M03m30P7M6j08K12K5l81M17l14
7827h6q7J72L31k95K6k9p5mj58M51J4j21k47p6l92J476j282K64p7M50N21j480
7849g04J103j127M84O23p42L28l85N11j51M89jo25M97j79J6km5j84K67k78k4L33
7871B04n34L16k4l9M0K0K70j03L5k45J88rn0l45N00j5l0l9m58J63N29Q62n63m10
7895B63M5o72Q54J5m16K4J75O37j409K37R20q51l90O47k31K3L04n35L89k84L64
7916A09m44k50L29O24n44L23M9n95O50j85L45k01o24M69n2NN3j60K91k23O8KJ62
7939B01k43j23J38J46pl29J92L87l16l1L69l58j53L4lJ52j1K07j68N1j33J68j11
7962E9J7p8j45L23K0j61q5J13J09k92L9J1Pj10L96k87J58k4j33Q2k35J01J88k18
$$ plain form
7804 -29 -15 168 -152 103 -208 263 300 100 -166 102 128 -19 -33 370 -60 17 63 -45 167 192 -189 228 -86
7827 -86 -173 -1 330 35 61 32 -43 -47 -205 246 260 139 -108 -184 -576 900 -382 -118 -195 255 776 -704
7849 -704 399 -728 -244 379 -363 -35 -420 91 -60 429 428 -197 300 121 137 135 90 -94 173 -105 -129 204
7871 204 -330 -14 -38 -77 -37 -17 253 150 185 -60 128 119 69 -276 224 209 179 140 -318 -155 374 1236 673 263
7895 263 308 -364 490 505 89 113 288 925 -484 -247 673 -178 -568 79 -152 -129 175 -360 29 -255 109
7916 109 -335 -585 -256 368 -176 147 196 -399 251 66 411 210 -414 55 3 8 61 -99 192 -31 37 39 201
7939 201 -42 -165 -27 119 112 -217 -25 362 46 15 384 26 -127 -93 -96 56 45 252 84 135 2 170 59
7962 59 76 -2 -147 176 196 35 -50 63 172 -120 -81 -70 -63 -173 223 -64 94 70 -63 19 -216 -115 73 -145
7986a45L28k02j11j14L98k87K39J10k89k6K15J81l44J70k59R8J26j20L2J7J19
8007A36j4k59j12M08k75J40J19k12J36j02J60k5o1Kj47k19L18J6p6J7q5J63L2
8030F0j53J45R5p0r6L7r9q6K28j7j46K03J46l95K23L1J0j10k24L04j02J02k02
8053a16J30J76P2l07L2N9n1J76j8k17Kk3J82J0K7J4j68rJ06K20k17l55J78J29
8077C2j53J91j7k09K60k0J16l73J37l3L2n3l1J71l04J91L10k29p4j87O14m79K93
8100A85k53J93p0qj9J93k24r4J4J30k78L6K0J59r4r4K86Ql2J2K21j87o6j24P0
8125a6K11l62J23Q1l9j18L8M0n2L13m03L34k09n3O5Q6j78Q3M08m56K00k47J65
8148A4Q2L6k67K87j48K5n9m1l7M95k57j95%J15K88l47J07l5Q3m33L11N8l7N2k72
$$ plain form
7986 -145 183 -19 -130 -244 154 -133 106 216 -73 -99 116 297 -47 123 -136 -38 88 -32 0 17 136
8007 136 122 -137 -249 159 -116 24 143 -69 67 -35 125 100 39 41 -106 -325 -7 9 -67 -50 -135 28 60
8030 60 -93 52 147 77 -19 18 -81 -167 61 44 -102 101 247 -148 75 106 116 6 -218 86 -16 86 -116
8053 -116 14 190 262 -45 -13 46 -5 171 153 -64 -62 -85 97 107 134 148 -20 -29 77 297 80 -275 -97 32
8077 32 -121 70 53 -156 104 84 200 -173 -36 -69 -37 -90 -121 50 -254 -63 247 18 -56 -243 371 -108 185
8100 185 -68 125 55 47 28 221 -3 -97 -83 47 -231 -195 -175 -16 -110 -204 82 90 58 70 291 104 38 -86 -16
8125 -16 195 -167 -44 37 -2 -120 -82 -42 -94 219 -184 150 -59 -112 -47 39 -139 -56 352 -104 96 -151 14
8148 14 96 132 -135 152 4 29 -30 -71 -108 387 130 -65 -65 50 338 -9 98 63 146 -287 24 82 45 97 -175
8173a75J84k71L13q5l8J70k31N1n3r2L15j09J12J54k24Q2K0j45
$$ plain form
8173 -175 9 -262 51 -34 -72 98 -133 -82 -135 -227 88 -21 91 245 21 103 123 -22
8191b2
$$ Imaginary data points
##PAGE= N=2
##DATA TABLE= (X++(I..I)), XYDATA
0@%%%%%%%%%%qJ6j6J6j7K5l2M0m9N7p2Q8j04J21j45J69j94K26k64L04l45L93m49
33b40N11n76O49p29Q17r13J018j135J262j400J549j714J897k093K309k545K801
50A468l085L399l746M131m562N048n600O231o962P821q845J0092j1652J3659j6352
65h955K0182k6065L6310n9011J94335p4312l16012L27459n3717l1153J36330j45624
77b33j26062J53005R6862n3193p5574m099n4096R6647J14548j03250r3031P655
89d0821M6261O4232k983j749j18178k5945J85061n3685r3042R8197q9095l3543
101f5290J79836m7917j56262Q6967L5209p9064J14600J224j73216R0812O1900
112D8799q1016P8336k5848q8960P4359R072k0422O645l7148K8416J5870j8597
$$ plain form
0 0 0 0 0 0 0 0 0 0 0 0 -8 8 -8 8 -9 16 -16 24 -25 32 -40 48 -56 65 -80 89 -105 121 -143 161 -184 209 -240
33 -240 271 -305 344 -385 432 -481 537 -598 664 -736 813 -901 996 -1097 1212 -1333 1468
50 1468 -1617 1782 -1964 2167 -2395 2653 -2947 3284 -3678 4143 -4702 5390 -6262 7397 -8955
65 -8955 11227 -14838 21472 -37539 156796 82484 -233528 93931 40214 9061 145391 -233
77 -233 -126295 26710 123572 70379 -5195 -9294 -63390 33257 147805 44555 -48476 -40821
89 -40821 5440 69672 66689 64940 -53238 -79183 105878 52193 -40849 57348 -31747 -65290
101 -65290 114546 66629 -89633 -2666 32543 -46521 68079 69303 -103913 -13101 48799
112 48799 -32217 46119 20271 -68689 5670 14742 -5680 965 -36183 -7767 8103 -10494
124a0494L2448m7162l8625Q6386n723n4263N1897k4110n6091Q1923J0206p6716
136e0324M3161J8999n7664M1997K1798p1018L0362M4329m8332K0626J1883n1682
148d5865L3183J7313k1150J9270k5939J434K8473l1959K1385R602m7079M1879
160E47J6547n4282K7586J7177m4649L7345L0947o4309J3792L8407n1498K8655
172c735L5162o4302K0173L0875l7505K2054O430k8093J6623O989j999l46j2277
185i951N794R120q96M747l58k0944N603L0283k4068k495L1719m6447J0399N2361
199D4867n8975Q208M4600n7897K1198M1032n6723R233L5050l2606O530K6381l0301
212E97r576L2257j1020j2238K3473j6038j1072K1012p426k018J687l176J0120
$$ plain form
124 -10494 21954 -25208 -63833 22553 16830 -37433 14464 -9646 -65737 16186 26392 -50324
136 -50324 -7163 11836 -45828 -3831 17967 -53051 -22689 21640 -26692 -6066 5817 -45865
148 -45865 -12682 4631 -16519 2751 -23188 -21754 6719 -25240 -3855 5747 -41332 547
160 547 17094 -37188 -9602 7575 -37074 271 31218 -33091 -19299 19108 -32390 -3735
172 -3735 31427 -32875 -12702 18173 -19332 2722 9152 -18941 -2318 4671 2672 2326 -9951
185 -9951 -4157 4963 4067 8814 8456 -12488 -6885 23398 -670 -3165 28554 -17893 -7494 44867
199 44867 -14108 -5900 38700 -19197 2001 43033 -13690 -4457 30593 -2013 4517 30898 597
212 597 -8979 23278 12258 20 23493 7455 -3617 17395 9969 7951 9638 6462 16582
225A6582j4142K961J5449k8279J2484K4957l6758O744K5540l6146N352L6058l3796
238b994q584M0225l1688j7899M7912k6849k0689M7537k4198k6388L8115j3646
250H54j9081K9439m511k0934J2161N286j4115K612J2859q220p113J1990k049j6417
264a7239Q634J3206j5431K214J9233k5499q669L3196j6873j2900L4874k0704k1877
277b7835L5933j0427k3479L1351j475k5341K2876L223k7470J4787J4051j7015
289a0821P584J0496j8034k869J3196n29n017O855L056j3014M95J4322j1071m829
303a0180K1119r447j3270K0212q790j7494K5234K275j9838J6555N97k3115J5168
316i74J1283j6285Q264R047j6240J88J0321p390k93R449j362o478O19L237m936
$$ plain form
225 16582 2440 5401 20850 -7429 5055 30012 -6746 -2 25538 -10608 -5256 30802 -2994
238 -2994 -11578 28647 -3041 -20940 26972 123 -20566 26971 2773 -23615 14500 854
250 854 -18227 11212 6701 -14233 -2072 3214 -10901 -8289 4570 -3650 -10763 1227 -822 -17239
264 -17239 -8605 4601 -10830 -8616 10617 -14882 -23551 9645 -7228 -20128 14746 -5958 -27835
277 -27835 8098 -2329 -25808 5543 4068 -21273 1603 4826 -22644 -7857 6194 -10821
289 -10821 -3237 7259 -10775 -13644 -448 -977 -5994 861 3917 -9097 -8602 5720 -5351 -10180
303 -10180 10939 1492 -11778 8434 -356 -17850 7384 9659 -10179 6376 6973 -16142 -974
316 -974 10309 -5976 2288 11335 -4905 -4717 5604 -1786 -2079 7370 6008 -470 149 3386 -1550
331a550k456J3738k418j2198J1891k088j6702J8225O252j8901J3182N968k3294
344a0351R736J3571j7998P640J3997j8512p44J2978j2192p58J3732n681m907N710
358F221k873n378L261O257r45n322N106j693j0837J0069O356j3410O761R620k1170
373g977N706J4818j9035M440J8400j8826l203J7241j6726l483K0846r767r090
386f656J3960q025r326J3157j34q575O468K397p805o32N830m366j825P638o72
401A434q583K790N223q577J862J2705j2455m382J6377j3423o225K0794j1296p807
415a1563J8727j0492j0570J5951l650q797J2582K35j2062O812N358j0276M142
428c603Q259r550L81P200n523k412N397K076n159J485N399q850Q20J0455p386
$$ plain form
331 -1550 -4006 9732 7314 -4884 7007 4919 -11783 6442 12694 -6207 6975 12943 -10351
344 -10351 -615 12956 -5042 2598 16595 -1917 -2661 10317 -1875 -2633 11099 5418 511 6221
358 6221 3348 -2030 1231 7488 6543 1221 6327 4634 -6203 3866 10222 -3188 3573 13193 -7977
373 -7977 -2271 12547 -6488 -2048 16352 -2474 -5677 11564 -5162 -8645 12201 2434 -6656
386 -6656 7304 -721 -10047 3110 2976 -5599 869 3266 -4539 -5171 659 -3707 -5532 2106 1434
401 1434 -7149 -4359 864 -7713 -5851 6854 -5601 -9983 6394 -7029 -13254 7540 -3756 -11563
415 -11563 7164 -3328 -13898 2053 -1597 -10394 2188 2423 -9639 -2827 2531 -7745 -3603
428 -3603 4656 -4894 -4513 2687 -2836 -5248 149 2225 -2934 -1449 3950 -4900 -4080 6375 -1011
443a011j964Q921o177m598R477j623q951R972K907j4279J0968L277j5159J2942
457D702K004j0802P445k61m193K057R24K787n910L079M306j1575P174M056r027
472c234O030Q89o196K128J777N59l910M404K138j0649R106J473j0850J0053J158
487D876r350O524P39n807J395N561l287k843N513n122r77N374k605J477r06j058
503d96J870n119N900l08o323J0874m454q562R821l628k420P068k529l031P39K635
519B037k397j382N771k755l355O366n151k708N929k347n40M336l383k222J485
534c16q01J247N96L4J171m116P74K656n288M404M178p807L544J247p410M618L241
551A972l246Q70J265k552k298L421J33k373M217l76l797J570r78n35J848K832
$$ plain form
443 -1011 -2975 5946 -231 -4829 4648 3025 -5926 4046 6953 -7326 3642 6919 -8240 4702
457 4702 6706 -4096 3349 3088 -1105 952 1876 4663 -1247 1832 6138 -5437 1737 5793 -3234
472 -3234 2796 3685 -2511 -383 1394 1953 -1957 2447 4585 -6064 3042 4515 -6335 3718 4876
487 4876 -4474 2050 2789 -3018 -1623 3938 651 -2192 3321 -1801 -2778 2596 -9 1468 562 -496
503 -496 1374 -3745 2155 1847 -4476 6398 1944 -6618 3203 -425 -2845 4223 1694 -1337 -598 2037
519 2037 -360 -1742 4029 1274 -2081 4285 -866 -3574 2355 8 -532 3804 421 -1801 -316
534 -316 -1117 130 726 760 1931 -2185 -1411 1245 -4043 361 4539 -3268 276 1523 -5887 -1269 1972
551 1972 -1274 -404 861 -1691 -3989 -568 -435 -2808 1409 1033 -2764 -1194 -2172 -2707 -859 1973
567A973j234l486K694k427j012N979k446p37K066k378K30j594K546J840l999O378
583D393l025o292P845m130m38P341n426j27N49k083L092k362L104P94m667N201
599C769l488l660O568l021R49L022m583K68r45J770J343k107L769k860l128M349
615B015l589J85L786j658qj286J8r64j488N290k244j013L402n882J399K064k548
632b521L342j028K8j124k111L343j797O88M097m605o65K243k872J661J932j187
648e76J536k217J710j534j805M543k030N15K555m868Q66K567j420Q97O28n39j048
665b20k84J575j748K29K958j849J40J592k749J84K024J51j051K0N11k001J40K492
683B114j843J92K103k415o28J716q84o02J998P3k043J66J489k275N12K743k853
$$ plain form
567 1973 739 -2747 -53 -2480 -3492 2487 41 -696 1370 -1008 -778 -2372 174 2014 -1985 4393
583 4393 1368 -4924 2921 -1209 -1647 5694 268 141 690 -1393 1699 -663 2441 3235 -1432 3769
599 3769 281 -3379 3189 168 1117 4139 -444 -176 -1121 649 1992 -115 3654 794 -2334 2015
615 2015 -1574 -1389 2397 739 731 -555 -537 -1501 -2989 2301 57 -956 2446 -3436 -2037 27 -2521
632 -2521 821 -207 -179 -1303 -3414 -71 -1868 -1180 2917 -1688 -2353 -110 -2982 -1321 611 -576
648 -576 960 -1257 453 -1081 -2886 1657 -373 142 2697 -2171 -1305 1262 -158 739 1367 828 -220
665 -220 -504 1071 -677 -448 2510 661 801 2393 -356 -172 1852 2003 952 972 1483 -518 -378 2114
683 2114 271 463 2566 151 -477 1239 355 -247 1751 1824 -219 -53 1436 -839 -327 2416 -437
700d37J05J983k876M77J846j126o7M12J20j492J69K272k070r1K521l022j69K465
718A020j916J49J300k11j204N56R64j401k9K732k678j66K242k529M39K053p19
735F02j086J146J62k225J515K036l068J217J719l215O83J968j723L13J367j062
751C49j466J557M15k095J764J424l226J143O62j826M45J441n83n29M66r0j962
768b111J061J661k331R38J765l180N9K294j758K33K126j537j869K130l94j957
784b870K920P19l177J613O89k559J436J731j612q1J597j663p96J722L60r45J424
801E08O14k205R6J645j297m6L168j626j743K031o58j682K687P49k451J716O09
818B115l396J532K464k228Q91J947k859o68K025j015l75K269m21k112J057L28
$$ plain form
700 -437 -332 1651 -1225 -748 1098 -28 -95 317 437 -1055 -886 1386 -684 -775 1746 -1276 -1445 1020
718 1020 -896 -747 553 342 -862 -306 658 -743 -772 1960 -718 -884 1358 -1171 -732 1321 602
735 602 -484 662 824 -1401 114 2150 -918 299 2018 -1197 -514 1454 -269 44 1411 349
751 349 -1117 440 855 -1240 524 1948 -1278 -135 527 -1299 -854 587 4 -525 -59 -149 -2111
768 -2111 -1050 611 -1720 -782 983 -2197 -2138 156 -1602 -1369 757 -780 -2649 -519 -913 -2870
784 -2870 50 769 -2408 -795 -106 -2665 -1229 502 -1110 -1191 406 -1257 -2053 -331 29 -916 508
801 508 1122 -1083 -987 658 -639 -685 2483 857 -886 1145 487 -1195 1492 2241 -210 1506 2115
818 2115 -1281 251 2715 487 1378 3325 466 -202 1823 808 433 2702 2281 169 1226 1554
834A554j941J343J779j573o22R42j089j492K411N98k127J903K54l752J720J482
850A390k710J844J749l273j44J744j624j12K204n51j423R88m44k100K156J121
866H15j671R66L20j679p24J784j19r23J700L39l190J906M81k577K567J598k754
883a161N06J635l183R15K970j892n13K086k194q86K112m68p12J361J00r70m61
900g55M69p7m22K223m30k865J641M69j566J276Q46j056m04K180l185m15K978j527
918f20l37K391k027j982L471j147j570L047j058k345K375l83j396J276l1j5K89
935f2n71O16j385O01K027k006r4J986k246k42K870j273j785K982m61l210L699
952A446l42l642M565Ll903L073j9k499K544J070k400J50J860j617l01J994j840
$$ plain form
834 1554 -387 956 2735 1162 540 1482 393 -1099 1312 1910 -217 1686 1940 -1812 -92 1390
850 1390 -1320 524 2273 -1000 -1144 600 -1024 -1136 1068 517 -906 82 -362 -2462 -306 815
866 815 -856 110 430 -1249 -1973 -189 -308 -1231 469 808 -2382 -476 5 -2572 -5 1593 -1161
883 -1161 -655 980 -2203 -1288 1682 -210 -723 1363 -831 -1717 395 -73 -785 576 676 -294 -755
900 -755 -286 -363 -785 1438 1008 -1857 -216 253 -1313 -37 809 -247 -651 1529 -1656 -2071 907 -620
918 -620 -957 1434 -593 -2575 896 -251 -1821 1226 168 -2177 198 -185 -1581 -305 -336 -351 -62
935 -62 -633 -17 -1402 -801 1226 -780 -874 1112 -1134 -1376 1494 221 -1564 1418 957 -2253 1446
952 1446 1104 -2538 2027 2030 -1873 1200 1181 -1318 1226 2296 -104 46 1906 289 -12 1982 142
969A42k6K017j018Q4p63N19L79j238K287q27k949L967n87l392L922j371k269K891
987A768N47m323K651J415k208K59J569l051O24L365l359N13O63j150J5J122l59
1004F1j198O02R60r09r11J167m23j205K422m65l052K053J459k960K029K343n088
1021c115J736L261m969J886K268l556K356J338l285M82J458l88K50N00m01j020
1037a199L05J159o19n82J480m13r36J059K39k165K036J989l492J332J448l792
1053b151J437L613m277M75L043l538L21L113l537Q03L398k863j007J688j629K60
1069h51K188j982Q59r09m05J401j843J257J398k376J195J901l825P66K761k569
1085a034Q43K520l583m22L359k197j058L636k239j638L657k062j821L712j060
$$ plain form
969 142 116 2133 1115 1199 436 955 1334 96 2383 1556 -1393 2574 1987 -1405 2517 1146 -1123 1768
987 1768 2315 -2008 643 2058 -150 109 1678 -1373 -749 2616 -743 -230 433 -717 -702 420 61
1004 61 -1137 -535 425 -484 -1395 -228 -651 -1856 566 101 -2951 -898 561 -2399 -370 1973 -3115
1021 -3115 -1379 1882 -3087 -1201 1067 -2489 -133 1205 -2080 -1598 -140 -528 -278 222 -179 -1199
1037 -1199 -894 265 -354 -936 544 131 -805 254 493 -1672 364 2353 -1139 193 1641 -2151
1053 -2151 -714 2899 -1378 -903 2140 -1398 -1077 2036 -1501 -698 2700 -163 -1170 518 -1111 -851
1069 -851 1337 -645 214 -695 -1100 301 -1542 -285 1113 -1263 -68 1833 -1992 -1226 1535 -1034
1085 -1034 -191 2329 -1254 -1676 1683 -514 -1572 2064 -175 -1813 1844 -218 -2039 1673 613
1100F13j161K547k068q84J688j098J218N28j563J439r21j014K676j760o06L181
1116B815k618j078L135k000j172M094j676k637L397j777k239M185j226k370L399
1131B232j398j920J957m12q76J393k2q71j48M8k20J76J35N09k69j277J364m48
1149d7k103L103n60k458L198j418l098M096p32k393L389j098k456K556n22j633
1165b176J653P49j653O84O73j801R55R40p09K15l62L78j11p83J695n12j388K470
1183I17p43k075K642m17k119K734J26k793K288N66l059K528J059l089J958O76
1199A199k375J488J160k346J351L70j024L74J59k2M34n64M02j25j199J413j4j637
1217i56J814K43k271J553Q19k737J909J167l015J290J686l005J089K057k915J161
$$ plain form
1100 613 -548 1999 -69 -953 735 -363 855 1383 -180 1259 338 -676 2000 240 -366 2815
1116 2815 197 -881 2254 254 -918 3176 1500 -1137 2260 483 -1756 2429 1203 -1167 2232
1131 2232 834 -1086 871 459 -417 976 954 83 -65 -17 -237 -61 74 583 314 -963 401 -47
1149 -47 -2150 953 393 -2065 1133 -285 -3383 713 -19 -2412 977 -121 -2577 -21 -543 -2176
1165 -2176 -523 226 -1427 -743 -70 -1871 -916 24 -685 -470 -832 -454 -565 -1348 347 -165 -1553 917
1183 917 174 -1901 741 324 -1795 939 1065 -1728 560 1126 -1933 595 1654 -1435 523 1199
1199 1199 -1176 312 1472 -874 477 847 -177 197 356 334 768 204 606 481 -718 695 681 -956
1217 -956 858 1101 -1170 383 1202 -1535 374 1541 -1474 -184 1502 -1503 -414 1643 -1272 -111
1233a11J355k272P25J030j246L46R45j141L04K06j36J74l07K42Q9p79M25J250
1251A099j730O27J475k138M31J619k157N97K160k211l1K021k144K40J807j646
1267A9j01J597j336m80J192q95M57M81o63n4L56o28P03m96l33Q46p55k04J088
1286G94j442N8J606j290m49J307j042p06J794r28o26J637p98j313J402n11q81
1303a388J308q6o85O09m40l12K78NL2m9J53P6l80k46J231n37m69J000p03p78J398
1324A7m86n57J766r13j290J563l47r17J639l9r52P73p6o84M93O81o45M93P9o21
1344b3J11P7o2M58m0L44n49l47Q21l85o57J639m93r91Q68j45j242J297M28j312
1364b03J044J42j999J159O22j135R25j45q14N31K4j10J3Q0R7k12j4j37k56NP40
$$ plain form
1233 -111 1244 -1028 -303 727 -519 -173 772 -369 -65 141 5 179 -128 114 203 -576 -151 1099
1251 1099 -631 -4 1471 -667 -236 1383 -774 -177 1983 -228 -259 1762 -382 -142 1665 19
1267 19 -82 1515 179 -301 891 -4 453 934 271 217 573 -55 648 152 -181 665 -90 -294 794
1286 794 -648 -590 1016 -274 -723 584 -458 -1164 630 -298 -924 713 -85 -1398 4 -507 -1388
1303 -1388 -80 -166 -851 -242 -682 -994 -716 -711 -679 -728 -575 -499 -879 -1125 106 -431 -900 100 -603 -1381 17
1324 17 -469 -1026 740 -173 -1463 100 -247 -1164 475 436 -516 257 181 -503 -10 671 26 519 598 -23
1344 -23 88 165 103 561 521 865 316 -31 790 405 -252 1387 894 -97 771 626 -616 681 1109 -203
1364 -203 841 983 -1016 143 765 -370 555 410 -404 127 151 41 54 134 231 19 5 -132 -388 -383 357
1385C57k39l61J85l1o18N94L57p96N21O40j217Q1O57m97L61O91j198L43N27q37
1405d80L59R35r62J46Q16q87O7K49k28P16j53j21J90q15K79M25n68N40L55r56
1425i3O17Rm86J46N47o72J47J58o02p9J085m67n84O90k41p56P85j98m75Q22l56
1446cl71N41o76K0K15J0R8k76l77Q67m15k24P03r18J28L88m27J06M25p23M59q0
1468e30J27j07N4M41m02K94r4l64K63L02l61J85K12r2j50O14m13k3J32k72P12
1489E28n04J51K39n18P36mp94N90pn35J111p38k30N64j48k53L29q6l4l01L21Q3
1511E00m39L79l95j83Q83m61l46M81l96k87M74k28O5J82q9k09k63L86L18j55m13
1532a96M96j008L45O00q77N08L45o20K08K56m18M59j66R1J31o23P23n93N9P77
$$ plain form
1385 357 118 -243 -58 -89 -707 -113 244 -552 -31 609 -608 -527 130 -367 -6 685 -513 -170 357 -480
1405 -480 -121 814 -148 -2 814 -73 -6 243 15 731 578 457 647 -168 111 536 -32 508 863 -93
1425 -93 524 533 47 193 740 68 215 373 -229 -308 777 310 -274 416 175 -581 204 6 -469 353 -3
1446 -3 -374 167 -509 -489 -274 -264 -166 -442 -819 48 -367 -591 112 -806 -678 -290 -717 -611 -186 -909 -450 -530
1468 -530 -403 -510 -456 -15 -417 -123 -217 -581 -318 -16 -377 -192 20 -72 -222 392 -21 -44 88 -184 528
1489 528 24 175 414 -104 632 628 -166 424 417 -118 993 255 25 589 441 188 517 431 397 96 417 500
1511 500 61 440 45 -138 745 284 -62 419 23 -264 210 -18 47 229 140 -69 -332 54 372 217 -196
1532 -196 300 -708 -363 237 -640 -132 213 -407 -199 57 -361 98 -68 23 154 -469 254 -339 -280 497
1552D97o07jM70q46N32J22m87O11J09k77J40l42J93M97m85L15j68n58N06Jk80
1573e8O84n82K76L85p90j67L61j93N32o62l15O44q8k63O13n7n26L66l73R6K03
1594H6n95N03j58P8K5m15N7P0k28O49m22q9L31p89K93O30p15L11L25o94J92J59
1616c96n8J46K82m25j4K51j11l42K29M18j02K01k17j77l6L04k13L74J99j33M7
1637B27P9n8j44P59j92n10k51L69P94r45l53M87J97M03p82k91P32R1j77j85n3
1658A97Q8l66L43K18p5L5j31j16k87O01n99L11J41l32QJ64k53j87L86p3j95J33
1680A1J29p01P22J70o67M87k0m92K11N9j42K15r3p0M7j07J91j14k6K33q5k23K14
1703e1K7p1L47J70o35L35N5o47O96Q9k91L05Ok82J3L05k65R1j0l25K89J78k81
$$ plain form
1552 497 -110 -111 359 -487 45 167 -320 291 400 123 263 -79 114 611 126 441 273 -285 221 222 -58
1573 -58 626 44 320 705 -85 -252 109 -84 448 -214 -529 115 27 -236 377 320 -206 160 -213 -117 86
1594 86 -509 -6 -164 -86 -61 -476 -419 -349 -577 72 -350 -439 -108 -897 -604 26 -689 -378 -53 -747 -555 -396
1616 -396 -454 -308 -26 -451 -465 -214 -325 -667 -438 -20 -122 79 -138 -315 -351 -47 -260 114 313 180 227
1637 227 306 248 104 863 671 161 -90 279 1073 128 -225 262 459 862 80 -211 521 612 435 250 197
1658 197 285 -81 262 480 405 440 309 193 -94 507 -92 219 360 28 36 200 -53 -240 146 73 -122 11
1680 11 140 -561 161 331 -336 151 131 -361 -150 -91 -233 -18 -111 -181 -134 -241 -50 -164 -190 43 -42 -265 -51
1703 -51 -24 -95 252 422 -213 122 177 -470 226 315 24 329 335 53 66 371 106 197 187 -138 151 329 48
1726D8J88J64l1l98K44k34J95l04L02J5j73J39J16m72J20K49l85K31R5l78L7M00
1748A68o48K39Q5n94L89M74n31J71J78k85k5J00L6k38K48r9J19j50l2L01l41J71
1770b64M3l6O0M89k44k09K82l20L28r6m35N45K17k70r6M66j24m19K39K6j99M83
1792D66j15k02J75J9p7L3lj28L54J19j59k1j2r0L5j89J72q0k18J87q6k15M64j78
1816B51k44L88k28m26L48J13m33L38j22j08k51J37j32l1N60k53l69M06j43nj6
1837b20Kl7J09j16l34L88j89K17j84M92l46k07k3M15l71M97K7n62L59K02j90M26
1859C55k08k21J51l6j47J05j53L71O1k05K83k88j09L39p5J1J76j62l8J22j53k
1881A77J29k03o1J56j64j23n5N61l22j08J91l07J63M25m51j43L34k82k44K00m04
$$ plain form
1726 48 236 400 369 -29 215 -19 176 -128 174 189 16 155 271 -201 -81 168 -217 14 109 -269 -232 168
1748 168 -480 -241 -156 -750 -361 113 -418 -247 -69 -354 -379 -279 -243 -481 -233 -332 -213 -363 -395 -94 -435 -264
1770 -264 -221 -257 -197 292 48 -161 121 -199 129 33 -402 143 360 90 -6 460 336 -83 156 182 -17 466
1792 466 351 149 324 343 266 299 296 168 522 641 482 461 449 359 394 205 377 297 79 266 180 -35 429 251
1816 251 7 395 167 -259 89 202 -231 107 -15 -123 -374 -237 -369 -400 160 -93 -462 -56 -199 -204 -220
1837 -220 -218 -255 -146 -262 -596 -208 -397 -180 -364 128 -218 -425 -448 -33 -404 93 120 -442 -83 119 -71 355
1859 355 147 -74 77 41 -106 -1 -154 217 278 73 356 68 -41 298 223 234 410 248 210 332 179 177
1881 177 306 103 42 198 34 -89 -144 417 95 -13 178 -129 34 459 8 -135 199 -83 -327 -127 -531
1902e31K03J75L47r7m28K40n2m40N33q8k66M77m41k66K98p1K70k8j07R3O1Q2l6
1925g2k29N93j09p30N58O9n95N05j13J51K71o74j19O42j62j52L31k06N10m61m8
1946d0M75k99p4K85l84K76Q9k15L26Jl83L59m78L44l1Ro2p2K7kj3l21M40n22J02
1971a63L30k69j82J88j52K44m03N3J71j86K21l15j07M82k91JM12n83l7N43j17
1992a60K1n1j24J63m5J45P5l15J74J29k54K24Q8j97N06k12k83J80O7n36P19nj16
2015A93m7j1L38q0k94K70l02L39K02n47K97r9m6r0P4k42K08J58o7o6l4M57o34
2038b3J15K83k43j28N49n97J45K6l64M70k41l6J34P4k50j02j53L96l92J63J31
2059d3k26k11L97J5k41L59r2m90J25J43K14k2m69L54Q0J58n26K33L10q1j00J01
$$ plain form
1902 -531 -328 -153 194 97 -331 -91 -143 -583 -50 -138 -404 73 -368 -634 -336 -407 -137 -165 -272 -179 -118 -36 -72
1925 -72 -301 292 183 -547 11 80 -515 -10 -123 28 299 -375 -494 148 -14 -166 165 -41 469 8 -40
1946 -40 435 136 62 347 -37 239 328 113 439 440 57 416 -62 282 251 260 198 126 153 151 138 -183 257 -265 -163
1971 -163 167 -102 -284 -96 -248 -4 -407 -354 -183 -369 -148 -463 -570 -88 -379 -378 34 -549 -586 -43 -160
1992 -160 -139 -190 -314 -151 -196 -51 24 -291 -117 12 -242 -18 70 -127 379 167 -116 64 131 -405 314 309 193
2015 193 146 135 473 393 99 369 67 406 608 61 358 259 213 123 197 -45 163 321 254 188 154 611 -23
2038 -23 92 375 132 4 553 -44 101 127 -237 233 -8 -44 90 164 -86 -188 -341 55 -337 -174 -43
2059 -43 -269 -480 -83 -68 -309 50 -42 -532 -407 -264 -50 -72 -541 -187 -107 51 -475 -242 68 -13 -113 -12
2081a2j19K9J99j2n1K45k84p6M75m81J9N35m47M84n09L53q7l00K13j40m9l1K96
2104B50j48q2J02n4n3K48l05L8J45m04M82j65k37J02q2R1M3J81m3j63n4K23k96
2127a81J36k06P5o1Q8K5l38K3J65N2L5K10k22K2Q7k78J45L75j42j40J69j06j02
2150a69K31l73L58L1L8k10KQ6K59k14J80j6K0k40L24K05m34L16J1n26K45J74l71
2173g3L54Rj65L54j64k90L73p1j06J47j80J7j2k06j30M14j43O9q2l95rJ04K82
2196I7j84J22p2%n7j00R7R0l70K58n9k85L59j28l08J66j6p1J40K95m37p2M81j34
2220a88o1J03k31J59l3J71k9o3k00L95l42J37K03J17k97J48m5J29K19k65J8L4
2242G9K8j40J58j09J95k06j69K76m2k3J86R3k16K6J05k40J95q4k35K52O4k05J89
$$ plain form
2081 -12 -131 -102 97 85 34 279 -5 -81 394 -87 -68 467 20 504 -5 348 261 -39 174 34 -15 -46 250
2104 250 102 20 122 68 15 263 -42 -4 141 -263 219 54 -183 -81 -163 -72 -29 152 109 -54 -108 115 -181
2127 -181 -45 -251 -176 -237 -149 -124 -462 -439 -274 -222 -187 23 -199 -177 -90 -368 -223 152 10 -130 39 -67 -169
2150 -169 62 -311 47 78 116 -94 -92 -6 253 39 219 203 223 -17 307 512 78 394 405 -121 124 298 -73
2173 -73 281 290 125 479 315 25 398 327 221 368 188 205 193 -13 -143 271 128 197 115 -280 -289 -185 97
2196 97 -87 35 -37 -37 -94 -194 -97 -7 -377 -119 -178 -463 -104 -232 -540 -374 -390 -461 -321 -26 -463 -535 -54 -188
2220 -188 -249 -146 -377 -218 -251 -80 -109 -172 -372 23 -319 -182 21 138 -159 -11 -56 73 292 27 45 79
2242 79 107 -33 125 16 211 5 -164 112 70 47 233 326 110 136 241 1 196 112 -123 129 193 -12 177
2265A77j08K6l0j95J26K58k76m5J67k49J59K01o4j86j8q3nJ1J8m4J41K57k19n1
2289c2k72J87O9p4J23l4k73K57L6o3J81k66l4M01k54M3K67j96l57J19K22Q8L48
2312D86m50K3j02J65K94r6j69k28K64J92l0l71J40L3J13om8j71J34M4j46K28k00
2335I9M0M4j90M10k78m06N52m92K47J71l91K12k25k80M90q3j34K98k64o9M7Jq3
2358b84M6k37K82L7k30R5M4P6j14q4oP1J49o8Q4J2j49J75m2J8j76K82P8m4m8J15
2384H2j47L32l15PK59j68J90l80K30L02m12L4K64k19P5n58L80k56J71o5L57m94
2406c31J330m81m17J47j61Jj8Mj24J36JJ10k90R4J91l9k47J51q5l15N93l79OK67
2430A44m30M29o3l91K51n0qj02j16P8K44L1p5K6k02K97k46j14K52o2J2J30K7m0
$$ plain form
2265 177 69 95 65 -130 -4 254 -22 -67 100 -149 10 211 147 -39 -57 -140 -145 -134 -116 -160 -19 238 19 -32
2289 -32 -304 -117 -48 -122 1 -33 -306 -49 -13 -76 105 -161 -195 206 -48 -5 262 66 -291 -172 50 138 486
2312 486 36 59 -43 122 416 320 151 -77 187 379 349 -22 118 151 264 258 210 39 173 217 71 299 99
2335 99 139 183 -7 403 125 -281 271 -221 26 197 -194 18 -207 -487 3 -80 -214 84 -180 -249 -202 -201 -284
2358 -284 -238 -475 -193 -156 -386 -291 -247 -171 -285 -369 -375 -304 -155 -223 -139 -127 -276 -101 -143 -125 -301 -19 59 15 -33 82
2384 82 -65 267 -48 -41 218 50 240 -140 90 392 -20 14 278 59 134 -424 -44 -300 -129 -194 163 -331
2406 -331 999 518 101 248 87 88 70 74 -50 86 87 197 -93 1 192 153 -94 57 -28 -343 250 -129 -123 144
2430 144 -286 143 80 -311 -60 -110 -118 -220 -336 -258 -14 17 -58 -32 -234 63 -183 -297 -45 -107 -95 35 62 22
2454B2Q7j00J02M1m44M20j83O0Q7j79K97K12k18qK65m01J43N4m2L2m26K00J64
2477A85j11J43k9j87J69k43J15J43m65L25L3J3j26n0O6J09j31J16k01J2K91l47
2499a70J28k14j3j57M44l74J20J80j61J08j89Q0M8K7KJ37k57r8J12K48J8k1j18
2522a20n6J7q0Q5r8K45k2J02Q4Q3k37k8m6J9K64j24J67j30K15j24k4j07K60o2
2546B83j51L0LQ2j13j3L10n51L95n8J68k30r2m0J00J90M8j21r3j80J75j28K30
2569B44l47j90mJ37K68o8j5n6j3o7J28N5O4j87k79J40J91k25K62j88j03J7L6O7
2593a33l1J48j37K0J15J7oR8k79J32NJ65Q7k28j85J35m9L90k71j13J77r4O8l19
2617b88L96k0K89Q4k58q0Q1j49J97o0j55K62j97R3J28j96K29j97p3nq8q4L00k57
$$ plain form
2454 22 109 9 111 152 -292 128 -55 5 92 -87 210 422 204 196 461 60 203 257 215 247 -179 21 185
2477 185 74 217 188 1 170 -73 42 185 -280 45 78 91 -35 -85 -19 90 -41 75 -126 -114 177 -170
2499 -170 -42 -256 -269 -426 18 -356 -236 -56 -217 -109 -298 -218 -170 -143 -141 -4 -261 -359 -247 1 19 -2 -120
2522 -120 -176 -159 -239 -154 -252 -7 -29 73 157 240 3 -25 -71 -52 212 88 255 125 340 216 192 85 345 283
2546 283 132 162 165 247 134 121 431 -120 275 217 385 155 63 23 123 313 361 240 147 -33 142 14 244
2569 244 -103 -293 -297 -160 108 40 25 -31 -44 -111 17 72 136 -51 -330 -190 1 -224 38 -150 -253 -236 -200 -133
2593 -133 -164 -16 -153 -133 -18 -1 -7 91 -188 -56 -51 114 201 -27 -212 -77 -126 264 -7 -120 57 -37 31 -288
2617 -288 108 88 377 461 203 123 204 55 252 192 37 299 102 195 323 127 356 159 86 81 -7 -91 209 -48
2641d8j12J84K12o5m37L16k02J43j29k31L34j65k58M12j09N9k4jp7K15l35L84
2663F6k77J76q0J73k73L12m48L65J02k43K25l25QJ87o5L8r8J40q5M9K00k70J56
2686C3R4J86j43j71Q9p9k20P24n52M12l85L9J0J56k1K53j11l12mJ02P9o9J53R5
2710C58k00m4j37J07n5l1k5m8N5J69k87J16P0j91OrM8M0oJ52m65J60L1j1K29k12
2736a80K7L45m38P5K21N3l37J38j7q9K30l82M14j16r9O0J03n5o7O1j6R9J12j97
2760e5O0PK6J38k16J07Q0k85K19L9l5j94K91J5j68P2m4K0L32k3l69p2K52k6m6
2785A25PJ67k70Q8j58K05N4k51J08r0Mj28J94J15l8j62j8m8J34j27l3O2j64R0
2809a34R0k9p2j34J15J18Q9n1k16K5%M9j29K61l9K4K35k99J57J16m8l73J76M78
$$ plain form
2641 -48 -160 24 236 171 -266 50 -152 -9 -138 -369 -35 -200 -458 -46 -155 -96 -120 -121 -198 17 -318 66
2663 66 -211 -35 -115 58 -215 97 -351 14 116 -127 98 -227 -219 -32 -97 -59 -157 -17 -102 -53 147 -123 33
2686 33 127 313 170 -1 88 9 -211 513 -39 373 -12 27 37 193 172 425 314 2 -2 100 179 110 263 358
2710 358 158 114 -23 84 29 -2 -27 -75 -20 149 -138 -22 48 -143 -137 -146 -98 -58 -64 88 -377 -217 -186 -197 32 -180
2736 -180 -153 192 -246 -171 50 103 -234 -96 -113 -202 28 -354 60 -56 -155 -95 8 -47 -114 -53 -69 30 142 -55
2760 -55 5 12 38 176 -40 67 147 -138 81 120 85 -109 182 197 29 101 57 77 409 386 17 -55 197 171 125
2785 125 132 299 29 117 -41 164 218 -33 75 -15 -11 -139 55 170 132 -30 -48 -96 38 -89 -122 -60 -224 -134
2809 -134 -44 -73 -145 -279 -164 -46 43 -8 -224 -199 -199 -150 -279 -18 -57 -33 202 -97 60 176 128 -245 -69 409
2833D09l31k23K43l5K8j66m1K25j65P1j5n4K64p2J78j42k1j44q8J29q9k8j95K71
2857IO19o88L41j65j79P03m59R4o5k91J56j83K16l57K8M79l11j29k17L57o0K16
2879A14j38m09J13L16k21m9L67k51r1K61j44j89K72O2k04oo3L07J09l42K57q0
2901ij36L43k74K27k08J17P1m8r3J98o4n3J8k8K31k11K16l22lO6J99j95R5J30
2925B67q7r9J17J2m6J42j53p0l25M57M9l32L2L7J52l9q26M83MN6N47m37M20q39
2949d78K9M92m25P14l61r3J23l23N0J32n9j72K16J73l37L16p7q7J22j44J13O8
2971hp6J42p3q3r4L19k75L69k23J73m15K23K3L2K9J07K02j26k15l5L18k02K36
2994C48j29l31l0O04k96n8J5o5N7j61j30K93j81RM7j3J60Lj2M2m6j15Q9k5p8R5
$$ plain form
2833 409 78 -145 98 63 91 -75 -116 109 -56 15 0 -54 210 138 316 174 153 9 -79 50 -39 -67 -262 9
2857 9 628 -60 281 116 -63 640 181 275 210 -81 75 -108 108 -249 -221 258 -53 -182 -399 -42 -102 114
2879 114 -24 -433 -320 -4 -225 -274 93 -158 -249 12 -132 -321 -49 13 -191 -197 -260 47 156 -186 71 -9
2901 -9 -145 198 -76 151 -57 60 131 83 -10 188 124 71 89 61 292 81 297 -25 -28 38 237 42 137 267
2925 267 180 81 198 210 164 306 153 83 -242 215 264 -68 -36 1 153 114 -712 -229 -225 -169 378 -59 361 -478
2949 -478 -449 43 -382 332 -29 -122 1 -322 -272 -140 -199 -371 -155 18 -319 -3 -80 -167 -45 -189 -76 -8
2971 -8 -84 58 -15 -98 -192 127 -148 221 -2 171 -244 -21 2 34 63 170 372 246 31 -4 314 112 348
2994 348 219 -112 -142 462 166 108 123 58 115 -46 -176 117 -64 -55 -8 -21 139 142 130 172 126 11 100 75 -3 92
3020I2q9m1j06j36M6M4Q1oL3J20j18l3P6L5j41m6J08m7J98r8R8l19J61k00L67
3045G9j86J10q1n1M4J76l54L02l8K37k18j61K85J83l17q2K32j85K15j43j62K67
3067A52j21J67J40l22o8L86j05k20J57Q9k2k67R7rL09l03O6L0J97j76j23k36J04
3090g8J62M5k11L0K56j78q5N4r1o1k77K71J07j55m5K09p0k83K90l1j3r9Q4J02
3114f7j32L6J69q2j24J5J05O0m7J02k38J8L39l04K40k16J94p6K3r4M8j47J05l9
3138a12J93l9%j8K0M5K59j25j16M2J47l1o6J33l21KJ67j6q6q0J16j40J29n1J77
3163B29k53n1J48k97L16j36j91L11k11r1J33K4j22N7J50J89l08q0r5K12l95M51
3185a0k32K63k53J61nk13K55k6oL2l1m0R9K19l18j9P5j76J83P2j3j32j23M19J29
$$ plain form
3020 92 3 -38 -144 -280 -234 -190 -109 -115 -82 38 -80 -113 -37 -2 -143 -189 -81 -128 70 -28 70 -249 -88 -288 79
3045 79 -107 3 -78 -129 -85 91 -263 39 1 238 20 -141 144 327 10 -72 160 -25 190 47 -115 152
3067 152 31 198 338 16 -52 334 229 9 166 255 233 -34 63 54 363 60 126 156 353 177 54 -182 -78
3090 -78 84 129 -82 -52 204 26 -59 -5 -96 -157 -434 -163 -56 -211 -256 -47 -117 -400 -110 -141 -154 -253 -169 -67
3114 -67 -199 -163 6 -76 -200 -185 -80 -20 -67 35 -203 -185 154 -150 90 -126 68 -8 15 -79 -31 -178 -73 -112
3138 -112 81 42 42 24 44 89 348 223 107 149 296 265 199 332 11 13 180 164 78 -2 114 -26 103 52 229
3163 229 -24 -75 73 -224 92 -44 -235 76 -135 -226 -93 -69 -191 -134 16 205 -103 -183 -278 -66 -461 -10
3185 -10 -242 21 -232 -71 -76 -289 -34 -60 -66 -34 -65 -105 -6 213 -105 -124 -49 -225 -42 30 17 -115 -238 181 310
3210C10o87K92J39j31M54n96kK85J13n67K59m9J80R97q31k3k81J75M19m00j26
3231g0P41q32R26m23o11L56m75P65j73q3o01P50k25l8n10L29l53M10k26J71K65
3252I3m18J09N87l44q16J279r50Q00k6k38M60l97l45L1l58L64L8K46n3k25K55
3273I2k09m43P94o52K25M63j59m49L99l66K82l7O18o18l92P82l40K94j1k26n14
3294d67P41j60k38L50k70J35p2J85m08J94K24p9j63p8J45J35Nk55Q2r8K04k14
3316a02L20k33Q9l3k9R9k11N3j13J60m38P13l31k08J82m5J44k64J53J80j24j12
3338a50j45J30J12K1l24L08j59N3K11k44K29Q9j23R2k74M88j84k03R7j80K20j55
3360i1K44J23j99J93j59J4k06K47J02k93K36J84k06j34np2N3K7P3N9j64N4L5l5
$$ plain form
3210 310 -377 -85 54 -77 377 -219 -221 64 177 -390 -131 -180 0 997 166 143 -138 37 456 56 -70
3231 -70 671 -161 765 342 -269 87 -388 377 204 121 -480 270 45 7 -503 -174 -527 -117 -343 -172 93
3252 93 -325 -216 371 27 -789 490 -460 340 314 76 536 139 -206 -175 -533 -169 -131 115 62 -163 92
3273 92 -117 -560 234 -418 -193 270 111 -338 61 -305 -23 -60 558 -60 -452 330 -10 284 273 47 -467
3294 -467 274 114 -124 226 -44 91 19 204 -204 -10 214 135 -28 -106 39 174 179 -76 6 -92 112 -102
3316 -102 218 -15 74 41 12 111 -100 -47 -160 0 -438 275 -56 -264 -82 -127 17 -247 -94 86 -38 -150
3338 -150 -295 -165 -53 -32 -356 -48 -207 -154 57 -187 42 131 8 100 -174 314 130 -73 24 -156 64 -91
3360 -91 153 276 77 270 111 125 -81 166 268 -25 211 395 189 55 50 -22 31 58 131 190 26 80 115 80
3384H0M5J4J3j75k21K20n8K42k08j7J81J05l16l2j28J84j43J06j63L34l11N9J21
3407f8j39j8j2J17L1j25J14j24n8K50k39J0P1J35j17ML14j84%K04k95k8O3JJ50
3432E7j66o3L43r1Q0J08k92K19j80j1L32Lj9k08l8k08N17l03J12M9j54K7K46m18
3456e8l37L98N3J31m19N02j43j78r8L0M7K98L67j74q61r6O44k20qj65M23J32l20
$$ plain form
3384 80 125 139 152 -23 -244 -24 -82 160 -48 -65 116 221 -95 -127 -255 -71 -214 -108 -271 63 -248 -189 -68
3407 -68 -207 -225 -237 -120 -89 -214 -100 -224 -282 -32 -271 -261 -190 -55 -172 -168 146 -38 -38 166 -129 -157 -94 -93 57
3432 57 -109 -172 171 80 160 268 -24 195 15 4 336 339 320 112 74 -134 383 80 192 241 87 114 360 -58
3456 -58 -395 3 56 187 -232 270 127 -51 -149 -119 -72 226 593 419 -442 -538 106 -114 -122 -287 136 268 -52
$$ [...]
8191F3
##END NTUPLES=NMR FID
##END=
