##TITLE=1H_SR9_k
 D6, 8 sc, 
 27.11.2020
##JCAMPDX= 6.0         $$ Bruker NMR JCAMP-DX V2.0
##DATA TYPE= NMR FID
##DATA CLASS= NTUPLES
##ORIGIN= UXNMR, Bruker Analytische Messtechnik GmbH
##OWNER= root
$$ XWIN-NMR		Version 3.5
$$ Fri Nov 27 13:26:26 2020 Russian Standard Time (UT+4h)  she@DPX200
##.OBSERVE FREQUENCY= 200.1315066352
##.OBSERVE NUCLEUS= ^1H
##.DELAY= (6, 6)
##.ACQUISITION MODE= SIMULTANEOUS
##.ACQUISITION SCHEME= undefined
##.AVERAGES= 8
##.DIGITISER RES= 18
##SPECTROMETER/DATA SYSTEM= spect
##.PULSE SEQUENCE= zg30
##.SOLVENT NAME= C6D6
##.SHIFT REFERENCE= (INTERNAL, C6D6, 0, 15.7039)
##AUDIT TRAIL= $$ (NUMBER, WHEN, WHO, WHERE, WHAT)
$$ ##TITLE= Audit trail, XWIN-NMR		Version 3.5
$$ ##JCAMPDX= 5.01
$$ ##ORIGIN= Bruker BioSpin GmbH
$$ ##OWNER= she
$$ F:/spectra/data/she/nmr/H-F/1/audita.txt
$$ ##AUDIT TRAIL=  $$ (NUMBER, WHEN, WHO, WHERE, WHAT)
(   1,<2020-11-27 13:25:12.51 +0400>,<she>,<DPX200>,
      <created by zg, POWCHK disabled, PULCHK disabled
       configuration hash MD5:
       00 E9 B6 7A A2 85 ED C7 34 08 36 98 17 FE 4E 26
       data hash MD5: 16K
       B9 1A BD 88 65 90 33 93 06 42 4E 26 62 9F 65 A1>)
$$ ##END=
$$ 
$$ hash MD5
$$ 9A E3 46 A5 7B 3A 41 2A 6C A6 A8 66 DA 07 7A 49
##$RELAX= 
##$RELAX= 
##$RELAX= 
##$RELAX= 
##$RELAX= 
##$RELAX= 
$$ Bruker specific parameters
$$ --------------------------
##$DU= <F:/spectra>
##$EXPNO= 1
##$NAME= <H-F>
##$PROCNO= 1
##$TYPE= <nmr>
##$USER= <she>
##$AMP= (0..31)
100 100 100 100 100 100 100 100 100 100 100 100 100 100 100 100 100 100 
100 100 100 100 100 100 100 100 100 100 100 100 100 100 
##$AQSEQ= 0
##$AQ_mod= 1
##$AUNM= <au_zg>
##$AUTOPOS= <>
##$BF1= 200.13
##$BF2= 200.13
##$BF3= 200.13
##$BF4= 200.13
##$BF5= 200.13
##$BF6= 200.13
##$BF7= 200.13
##$BF8= 200.13
##$BYTORDA= 1
##$CFDGTYP= 0
##$CFRGTYP= 5
##$CHEMSTR= <none>
##$CNST= (0..31)
1 1 145 1 1 1 1 1 1 1 1 1 1 1 1 1 1 1 1 1 1 1 1 1 1 1 1 1 1 1 1 1 
##$CPDPRG= <>
##$CPDPRG1= <>
##$CPDPRG2= <>
##$CPDPRG3= <>
##$CPDPRG4= <mlev>
##$CPDPRG5= <mlev>
##$CPDPRG6= <mlev>
##$CPDPRG7= <mlev>
##$CPDPRG8= <mlev>
##$CPDPRGB= <>
##$CPDPRGT= <>
##$D= (0..31)
0 1.2 0 0 0 0 0 0 0 0.06 0 0.03 0 0 0 0 0.0002 0 0 0 0 0 0 0 0 0 0 0 0 
0 0 0 
##$DATE= 1606469111
##$DBL= (0..7)
120 120 120 120 120 120 120 120 
##$DBP= (0..7)
150 150 150 150 150 150 150 150 
##$DBP07= 0
##$DBPNAM0= <>
##$DBPNAM1= <>
##$DBPNAM2= <>
##$DBPNAM3= <>
##$DBPNAM4= <>
##$DBPNAM5= <>
##$DBPNAM6= <>
##$DBPNAM7= <>
##$DBPOAL= (0..7)
0.5 0.5 0.5 0.5 0.5 0.5 0.5 0.5 
##$DBPOFFS= (0..7)
0 0 0 0 0 0 0 0 
##$DE= 6
##$DECBNUC= <off>
##$DECIM= 32
##$DECNUC= <off>
##$DECSTAT= 4
##$DIGMOD= 1
##$DIGTYP= 9
##$DL= (0..7)
0 120 120 120 120 120 120 120 
##$DP= (0..7)
150 150 150 150 150 150 150 150 
##$DP07= 0
##$DPNAME0= <>
##$DPNAME1= <>
##$DPNAME2= <>
##$DPNAME3= <>
##$DPNAME4= <>
##$DPNAME5= <>
##$DPNAME6= <>
##$DPNAME7= <>
##$DPOAL= (0..7)
0.5 0.5 0.5 0.5 0.5 0.5 0.5 0.5 
##$DPOFFS= (0..7)
0 0 0 0 0 0 0 0 
##$DQDMODE= 0
##$DR= 18
##$DS= 0
##$DSLIST= <SSSSSSSSSSSSSSS>
$$ [...]
##$SUBNAM2= <"">
##$SUBNAM3= <"">
##$SUBNAM4= <"">
##$SUBNAM5= <"">
##$SUBNAM6= <"">
##$SUBNAM7= <"">
##$SUBNAM8= <"">
##$SUBNAM9= <"">
##$SW= 16.9725356469052
##$SWIBOX= (0..15)
0 0 2 0 0 0 0 0 0 0 0 0 0 0 0 0 
##$SW_h= 3396.73913043478
##$TD= 16384
##$TD0= 1
##$TE= 0
##$TE2= 300
##$TE3= 300
##$TEG= 300
##$TL= (0..7)
0 120 120 120 120 120 120 120 
##$TP= (0..7)
150 150 150 150 150 150 150 150 
##$TP07= 0
##$TPNAME0= <>
##$TPNAME1= <>
##$TPNAME2= <>
##$TPNAME3= <>
##$TPNAME4= <>
##$TPNAME5= <>
##$TPNAME6= <>
##$TPNAME7= <>
##$TPOAL= (0..7)
0.5 0.5 0.5 0.5 0.5 0.5 0.5 0.5 
##$TPOFFS= (0..7)
0 0 0 0 0 0 0 0 
##$TUNHIN= 0
##$TUNHOUT= 0
##$TUNXOUT= 0
##$USERA1= <user>
##$USERA2= <user>
##$USERA3= <user>
##$USERA4= <user>
##$USERA5= <user>
##$V9= 5
##$VALIST= <valist>
##$VCLIST= <CCCCCCCCCCCCCCC>
##$VD= 0
##$VDLIST= <DDDDDDDDDDDDDDD>
##$VPLIST= <PPPPPPPPPPPPPPP>
##$VTLIST= <TTTTTTTTTTTTTTT>
##$WBST= 1024
##$WBSW= 4
##$XGAIN= (0..3)
0 0 0 0 
##$XL= 0
##$YL= 0
##$YMAX_a= 395658
##$YMIN_a= -162399
##$ZGOPTNS= <>
##$ZL1= 120
##$ZL2= 120
##$ZL3= 120
##$ZL4= 120
##$ABSF1= 10
##$ABSF2= 0
##$ABSG= 5
##$ABSL= 3
##$ALPHA= 0
##$AQORDER= 0
##$ASSFAC= 0
##$ASSFACI= 0
##$ASSFACX= 0
##$ASSWID= 0
##$AUNMP= <proc_1d>
##$AZFE= 0.1
##$AZFW= 0.1
##$BCFW= 1
##$BC_mod= 2
##$BYTORDP= 1
##$COROFFS= 0
##$CY= 11.3945322036743
##$DATMOD= 1
##$DC= 2
##$DFILT= <>
##$DTYPP= 0
##$F1P= 15.9154993809931
##$F2P= -4.1035820241983
##$FCOR= 0.5
##$FTSIZE= 0
##$FT_mod= 4
##$GAMMA= 1
##$GB= 0.15
##$INTBC= 1
##$INTSCL= 1
##$ISEN= 128
##$LB= 0.24
##$LEV0= 0
##$LPBIN= 0
##$MAXI= 10000
##$MC2= 0
##$MEAN= 0
##$ME_mod= 0
##$MI= 1.114404
##$NCOEF= 0
##$NC_proc= 0
##$NLEV= 6
##$NOISF1= 3.799351
##$NOISF2= 2.8
##$NSP= 1
##$NTH_PI= 0
##$NZP= 0
##$OFFSET= 15.70392
##$PC= 1
##$PHC0= -10692.99
##$PHC1= 13.60088
##$PH_mod= 1
##$PKNL= yes
##$PPARMOD= 0
##$PSCAL= 0
##$PSIGN= 0
##$REVERSE= no
##$SF= 200.130013532006
##$SI= 16384
##$SIGF1= 3
##$SIGF2= 2
##$SINO= 400
##$SIOLD= 16384
##$SREGLST= <1H.CDCl3>
##$SSB= 0
##$STSI= 0
##$STSR= 0
##$SW_p= 3612.71676300578
##$SYMM= 0
##$S_DEV= 0
##$TDeff= 0
##$TDoff= 0
##$TI= <>
##$TILT= no
##$TM1= 0
##$TM2= 0
##$TOPLEV= 0
##$USERP1= <user>
##$USERP2= <user>
##$USERP3= <user>
##$USERP4= <user>
##$USERP5= <user>
##$WDW= 1
##$XDIM= 8192
##$YMAX_p= 0
##$YMIN_p= 0
$$ End of Bruker specific parameters
$$ ---------------------------------
##NTUPLES= NMR FID
##VAR_NAME=  TIME,          FID/REAL,        FID/IMAG
##SYMBOL=    X,             R,               I
##VAR_TYPE=  INDEPENDENT,   DEPENDENT,       DEPENDENT
##VAR_FORM=  AFFN,          ASDF,            ASDF
##VAR_DIM=   8192,          8192,            8192
##UNITS=     SECONDS,       ARBITRARY UNITS, ARBITRARY UNITS
##FACTOR=    0.0002944,     1,               1
##FIRST=     0,             0,               0
##LAST=      2.4114304,     0,               0
##MIN=       0,             -162399,         0
##MAX=       2.4114304,     395658,          0
$$ Real data points
##PAGE= N=1
##DATA TABLE= (X++(R..R)), XYDATA
0@%%%%%%%%%%%%%qJ6j6J6j6K4l2L8m6N6o4P2q8J04j20J36j56J80k05K33k64K98
35A58l34L75m22M73n29N87o54P26q01Q87r80J084j196J316j451J598j762J944
53A019k143K365k615K902l231L608m052M583n227O033p076Q483j0494J3626j9231
68a1450L2339j22698o0590K11989P5287N052J7247L4908q6918p7124J9207L3414
80G0663m4672o830L5460k2470p2820O201M3409m266r872M7257J7093m9634l0801
93b1282J7979j5686l6999J5932M2985j344r62M5157L1797k0579r573J6493j6880
106D7038m3207n048J1402k6028l0238R726P972j7012Q477M3095J9104p393Q755
119B6643J0589k5010k8411L151L408j7782k492J9574K069j0951R983J8042n722
$$ y = [0, 0, 0, 0, 0, 0, 0, 0, 0, 0, 0, 0, 0, 0, -8, 8, -8, 8, -8, 16, -16, 22, -24, 32, -32, 40, -48, 56, -64, 72, -84, 96, -109, 124, -140, 158, -176, 199, -223, 250, -279, 308, -346, 380, -421, 466, -514, 570, -626, 690, -761, 837, -925, 1019, -1124, 1241, -1374, 1528, -1703, 1905, -2147, 2436, -2791, 3242, -3834, 4649, -5845, 7781, -11450, 20889, -101809, -162399, 49590, 124877, 129929, 147176, 182084, 95166, 18042, 37249, 70663, 25991, 19161, 54621, 32151, -40669, -34468, 8941, 4675, -5197, 42060, 59153, 9519, -21282, -3303, -18989, -55988, -40056, 2929, 1585, 623, 45780, 77577, 56998, 47425, 63918, 47038, 3831, -1217, 10185, -15843, -46081, -36355, -28383, -45395, -36918, 6177, 25281, 17888, 26643, 37232, 12222, -16189, -13038, -9630, -27412, -29904, -10330, -8261, -19212, -9229, 8813, 3091]
132C091q888J0018L846j4733m212J2155j891j2018L684R878n994m424J2565Q628
146A1705o300j83Q572m019j2112j032K262r468q920M680M852l055L968J3393M648
161H991k975L479M613n303n937L020K469n332j747L889q20n596J283M567k389
176B212l698K729J364m753k936L215p05l969J536M827l56q82M597L412k154j395
192C044L014q52l843l60J636k770k890O18J112k388R5K830Q41j920M78J159j535
209a731k178J603J334j262l45K639P56j277O46J840m49j801P15P36j302r67J534
226D91K02j685K93J158l22r36J033J064j133j062Q20l09j012K81R68j95p28J295
244B23R17n19k60J351k8q87J02L51j99o17J04M65o93l95M36J36j005n2O58o91
$$ y = [3091, -5797, 4221, 8067, -6666, -10878, 1277, -614, -12632, -8948, 930, -5064, -9488, 3077, 11705, 5405, 5222, 13794, 9775, -2337, -3369, -1107, -10575, -19495, -14815, -9963, -13018, -9050, 4343, 8991, 6016, 9495, 14108, 8805, 2868, 5888, 8357, 3025, 1278, 5167, 4347, -1249, 34, 4601, 2212, -1486, 1243, 2607, -2146, -5082, -1867, -2572, -6541, -5005, -178, -534, -1416, 3181, 6593, 4439, 3044, 6058, 5206, 1363, 1003, 2639, -131, -3021, -2403, -1291, -3679, -3584, -754, 87, -1833, -1355, -196, -1731, -3909, -2306, -972, -2234, -2579, 60, 816, -461, 185, 2025, 1576, -225, 490, 1226, -76, -1043, 491, 693, -992, -699, 459, 137, -799, 234, 1298, 165, -897, -77, -386, -1398, -1117, -149, -344, -1072, 223, 1140, 621, 361, 1712, 1684, 797, 899, 1250, 1051, 434, 538, 1003, 310, -85, 351, 487, -518, -570, 88, -603]
264f03q77N57L42p29M85L63P24n45M38R08J4n93M68L77p32k70K36m00o46LM02
285g8n33m66N61J56k87k6K65J02k88K79O4P6l9M34J70J38rL55l09k02k33J10J33
308C73m66J31j95k11k42M65j69J73l96L61J33o8J76K03k44R6J31k52K12j52O0
329A19O1Q0l16J39%j13R1j22MJ64j04o0j69j8K32O1l88L54J80j23k92N45k57r9
353c1R8k26L13p4k04Q8O7r7L40k05j25j30J16J71l18J91l4J53p1k18L77l9l48
376b06J18O0m8R4j84k24M67m7Q2j93p4K45L01j25k69jM5O7j42q4K29m11J89J62
400E1j62J29j13K87l26K87l50J46J60m48L98j18P2K12Jk73j41N7Q5%n2J64K4j33
424d3l8Q8M5J95k26k6j12K12l7j57Q5K15m6n2k52L40k96L0P3K9Q9l4R4m33N21
$$ y = [-603, -1480, -923, -581, -1310, -825, -462, 262, -283, 155, 1063, 1077, 484, 952, 1329, 597, 327, 563, 163, -483, -480, -78, -611, -1077, -516, -360, -647, -673, -408, -306, -594, -315, -251, -175, -214, 220, 390, 528, 519, 874, 565, 363, 130, 240, 373, -93, 38, -157, -368, -610, -145, -314, -141, -537, -176, -43, -111, 65, 268, 24, 120, 251, -1, 211, 59, 119, 180, 260, -56, 83, 83, -30, 61, -61, -57, 107, 3, -57, -226, -244, -12, 49, -339, 15, 195, 72, -220, 325, 68, -31, 67, -159, 154, 80, -124, -36, 31, -66, 274, 69, -56, -186, -70, 101, -217, -26, -60, 93, 22, -196, 181, 142, -206, -88, -28, -76, 18, -166, -390, 77, 30, 112, -81, -155, 90, 391, 266, -3, -4, 41, 108, -34, -118, 111, -300, -111, 51, -111, 18, -95, 192, -134, 153, -197, -51, 109, -339, 59, -59, 13, 225, 226, -47, -188, -131, -46, -46, -98, 66, 90, -43, -81, 7, 52, 247, 21, -5, -117, 95, 58, -99, -14, 201, 155, 103, -149, 191, -105, -75, -2, 27, 116, 82, 176, -257, 264]
449B64k67K3J39k98K1J70q6q0k2n5J18r7j0R7J6K26j09L1j27M6L3n6N3m7j00n5
475a72K80n6n0K03n7k50k8N7Q5K04l62K13r2J8l3r2P8j48j21K69M5m3k2J22P0
500A18k03pj4Q1Q8N2j53p3P2r7Q0J52M5j28L3r3P4j88M74k56J11j6k32l6J09K56
526B49n02L52j83K43l09n8K01p4Q0l95M68j00J25j21L08q9j25j15J4p9K26k12
548i6N8p7Q2J38J4o6l16L48J11lm61K04k7K54k9k29J57n7p1K48j88K32m88L86
572A24k4K09l49R5Lj57K76j34M9Kj10J51k63L65k69K4J0L6j45N6L3k16J39Q3M8
597C6M50l14l47J85j99K34p0K58j9m67M00k63L95k82K13p1m4Q5n2j5k59K6n0K56
621H6k83j5K68K2p3r7N4oo1M16j25p3j88%R2p2j48K74j32L49l7k30K3j15Q8K89
$$ y = [264, -3, 20, 159, -139, -118, 52, -34, -114, -136, -191, -73, -170, -180, -83, -67, 159, 50, 81, -46, 0, 33, -23, 30, -17, -117, -172, 108, 52, 2, 205, 148, -102, -130, -73, 12, 216, -146, 67, -25, -7, -40, -132, -54, -202, -323, -54, -9, -52, -74, 48, 118, -85, -92, -106, -25, 63, 115, -38, -111, -39, -136, -56, 96, 141, 13, 46, -47, 27, -161, 313, 57, 168, 152, -80, -116, -7, 249, -253, 99, -84, 159, -150, -208, -7, -81, -1, -396, 72, -28, 97, -24, 284, 195, 70, -45, -31, -110, 116, -96, -38, -115, -33, 105, 119, 53, -263, 85, 196, 193, -268, -64, -91, 163, 134, -95, 62, 5, -66, 182, -6, 226, -262, 124, 100, 309, -40, 55, 58, -99, 177, 43, 92, 94, -16, 135, -128, 237, -32, -8, 2, 38, -107, -51, -18, -234, -95, -12, 36, 486, 172, -175, 10, -189, 45, -25, 233, 214, -253, 147, -116, 279, -3, 210, 139, 95, 180, 128, 113, -146, -120, -170, 86, -197, -212, 56, 78, 5, -92, -38, -44, -105, 311, 186, 113, -75, -75, 17, -55, -203, 71, -61, 288, 251, 21, 44, -71, 17, 306]
647C06l11J89k39Q7j38ML30k55J13j00P7ql99N16j15J21k45o8K71l31K58K09l37
670f5P4j13K56J28Q5p25K16K54l00j45K73j38M6q8L63o8l54J35J51K96m86P4n9
693a90K79j85J74r8j76J34J14l08J31j90O4O54l41l43j86N00Q2n3j42N20k49n7
715A34k89K42j09j11K31k98J87j36K53k54J33J33n60J10M62o42Q56k58L41j42
735B83m52L60n69O38l06M9k16M3J45O5j10R17o89K56l7j45Mk18o0K6j79mM26j57
759G0j97J16L4r3L37o28N33m8q2J15k12M7j95K06l3j4K1Oj09J80j22K35p2k50
783a55J82o6K00l3j32j36K99k85P8N4J08k71L68k29J20L4n3J26m48K41j52K7K01
806G8J9k45J02r2K48l76L41q2r2j4pJ98k2L8Ro0j60J57j96J21K45l05J82k50J06
$$ y = [306, -5, 184, -55, 32, -106, -102, 228, -27, 86, -14, 63, 55, -344, 172, 57, 178, -67, -135, 136, -195, 63, 272, -65, 9, -104, 152, 280, 365, -360, -144, 110, -190, -335, -62, -200, -154, -242, 121, 53, -301, -166, -15, 281, -205, -131, -190, 89, -96, 78, -20, -196, -62, 52, -256, -125, -315, -251, 403, 62, -281, -467, 33, 115, 62, -80, 440, 191, 134, -155, 87, -22, -133, 98, -200, -13, -149, 104, -150, -17, 116, -444, -334, 128, -514, 342, 84, 425, 283, -169, 191, -378, 260, -46, 3, -213, -170, -25, 40, -70, 847, 158, 414, 377, 232, 236, 18, -42, -16, -195, -199, 227, 70, -127, -11, 23, -70, 267, -361, 172, 124, 42, 157, -55, -8, -203, 3, -30, -44, -23, -17, -126, 54, -68, 167, 95, -155, 27, -39, 161, 128, -4, -140, 159, -126, -48, 6, 114, -157, 211, -18, 102, 136, 83, 209, -239, 2, -150, -123, 78, 97, -148, -46, -138, 110, -266, 75, -7, -99, -113, -120, 78, 56, 94, 103, 43, -117, 40, -156, -35, 210, -95, 87, -163, -57]
831e7J29R2l73J15J50q7j56N0J91R5n4j84J67q5J18j39OoK40k70K1p8K0qP8J89
857A64k48J73j04L67k42j91M8m6O5q6J12J15R4J23j97q0j66J30k60L61l9o5j89
880a61J80j37r6L66k9k28j8J05J58l24K94J60l32j20K33o4M1j11J09k50K36j46
902a34K06N2l13J71r5K12k96j8J72j69J80j55J27P3K9l6j7n6K55k7j27l9j84J63
926b6J91l45L94j76p5Q2j48J75j46L9p5K46j99q2K78j20k7j48K50l8j68J27J16
949A25j67q9N9j44M09k87K2Q8m8r4K25J2PL5J28m57nK15m2l3k2L4pm3P4J28j74
976e1j28j86M25lj75P4L71j21k33K70l45J18j42K59j18n7j26K09j5k48L36k7j36
999d9J4J80k03J42j18J41k89Q6J35o4K23j62ok23L15J18k97N3l6j95L53j17K3
$$ y = [-57, 72, 164, -209, -94, 56, -31, -187, -137, 54, 149, 95, -89, 78, -7, 111, -28, -22, -28, 212, -58, -37, -115, -95, -103, -25, 164, -84, 89, -15, 352, 110, -81, -33, -79, -14, -100, 12, 127, 221, 344, 147, 67, -99, 31, -229, 132, 93, 28, -161, 19, -118, -214, 152, 123, -105, -123, -18, 140, -184, 110, 270, -62, -182, 51, -13, 28, -83, 26, -224, 12, -134, 72, 124, -189, -18, -113, 99, -197, -215, -43, -212, -32, -187, -60, 13, 42, 6, -11, -67, 188, 161, 34, -5, -189, -26, 165, -180, 214, 38, -37, 45, -103, 72, -74, -35, -110, 136, -63, -145, 133, 13, -14, -162, 88, 50, -118, 9, 125, -42, -131, -72, -216, 193, -94, -72, 16, -32, -126, 99, 111, 118, 153, 281, -176, -181, 34, -8, -41, -63, -29, -36, -79, -5, 123, -51, -179, -365, 60, 57, -118, -44, 327, 206, -27, 243, -102, 16, -126, 133, 15, -42, -168, 41, 26, -222, 114, 87, -49, -35, 145, -58, 84, -34, 107, -182, -96, 39, -25, 198, 36, 30, -193, 122, 240, -57, -4, -40, -235, 118, 1, 24]
1022B4K10l07J84j21N7M3k3K21k34L8N1j35J8n8q9K8k19K52K95k67l7q5K35j28
1046d7O2jj57J3R9MQ2L1l9k84K85J82j43R1k01J30p7l2J28j6j07k6k82O43j34
1071B04l65JJ66O1k20J90k9j94N0K6J57r6m8K36k2L9j25o0j21J43J90r1p9j86
1095a73K25j41J32j00P3J50o6l53K85o0m3R5J40r2j25k62J91n7K06L14j34j86
1117A9q2J73n2r5Qm9J49O9k05o5M6Q2M4J62q6l27J39K89r6k0k93J24R9m7R7j25
1143d2J17k55L0L8R4N4lJ12Q5o4j68o6K94l1m54K56OQ5N2j99Q7N9l06K12j02O4
1169d5O6k30J44j47M17q0j64j22K0M25k96lN6K51r4l88K60m6o3k18J68J33J94
1192B38j24mK22l59j1mJ52q1p6K02k41K32J2j34q9J63l56J46J18K7Q4j48r7L2
$$ y = [24, 234, -73, 111, -10, 47, 90, 67, 288, 54, 92, 143, 8, 26, -32, -121, -93, -312, -60, 235, -32, -69, -154, 81, -47, 15, 14, -143, -130, -31, -27, 55, 86, 47, -237, 48, 230, 87, 178, -23, 107, 30, -2, 126, 110, 3, -23, -305, 338, 204, -161, -160, 6, 67, -153, 37, 8, -186, -136, -110, 47, -49, -97, 139, 117, 156, 31, -29, -150, -7, 183, 92, 13, -173, 52, -89, 43, -57, 16, 166, 100, -253, 32, -28, -71, 24, 164, 72, -53, -315, -124, -181, 25, 339, 205, 19, -63, 110, 58, -37, -29, -78, 71, 140, -65, -130, -84, -2, 42, 204, 118, -209, -70, 219, 123, 103, -190, -66, 33, -14, 83, -42, 75, -180, -150, -112, -18, 36, 33, 145, 230, 166, -2, -68, 226, 195, -259, -3, 3, 88, 140, -59, 28, 87, -219, -7, -109, -45, 21, -209, -65, -212, 205, 125, -39, -161, -141, 284, -12, -15, 41, 292, 198, -190, 70, 24, -39, -257, -89, 44, 238, 114, 110, 332, -27, -38, -42, 110, 29, -47, 155, -86, 146, 158, 24, -65, 98, -258, -112, 6, 33, 117, -31, -128, -96]
1216i6oJ07lk9j49L29l58J52M3j14q0K17k07J30J33k89K40n6l9q0m7K43p9q3j81
1241c02K16l8j7L09m32M99k12n6J56P9j8k49J34q1J29l22M54k93j03k02L07J24
1263H2qL5l24L10J50m02K89K9k69j7L73l19l6m2J0J33m6l5L2j67jO1l6J48j02
1288a52K36k45L20Mk15J02j01K02q4j50J74j6m9m4K66m48K27j68j03J47K45j84
1310c6K8N0o0l9Q1M2k13p7K81m5J15j40j0J81l0k2q5j88P9R0J25j24j34L78j96
1335E1lj27K97k58M3k29K95l56J90K97j96n9Q1k06L89r9k55P99p13N15j87L52
1357F21o56n1M12j1j67l74J17k60M69m01p1K49r3L06l93L38j28J76n8j12J05K00
1379B18l15J8J32K19l21N1m6J41N2K4Mr6j52J97l33K32j66L9L00j19j57Q8j41
$$ y = [-96, -102, 5, 2, -27, -176, 153, -205, -53, -10, -124, -204, 13, -194, -64, 69, -220, 20, -36, -75, -155, -202, 41, -38, -121, -302, -86, -124, -141, 168, -264, 235, 23, -33, 123, 202, 184, -65, 69, -12, 117, -205, 249, -44, -147, -349, -42, 82, 74, 109, -215, 95, 245, -157, 132, 161, -108, -125, 248, -71, -107, -149, -139, -6, -52, -87, -55, -222, -223, -162, -198, -50, -152, 84, -161, 159, 163, -52, 50, -51, 151, 67, -83, 91, 75, 26, -18, 248, -200, 27, -141, -244, -97, 148, -36, -8, 42, -18, -57, 24, 66, -147, -224, 57, 12, 127, -13, -23, 158, 128, 106, 21, -167, -88, 2, 127, 3, -131, 247, 51, 48, -79, 218, -40, 3, -226, 69, -287, -97, 200, 4, -55, 26, -180, 209, 110, -145, 654, -59, 456, 269, 621, -35, -86, 326, 315, 148, -226, -109, -369, 100, -301, -372, -123, -216, 90, -303, 35, -93, 83, 25, -87, 18, 218, -97, -79, 53, 272, -49, 2, -44, 97, 149, 173, 177, 81, -71, 126, -207, 25, -141, -102, 198, 79, -78, 10, -131]
1402a31r4K18J5J03J1J26k64K34m01K26J0Jl00K76q8K07j86%P3J41l35K93l08
1425a73P1LO3j87K55J15Rj01m8q0k0J13l8ro9K24Jj22K53L3m52Q5K31j86P3k15
1451a71J76m1J40J01j65k02j5O8O5K53l53k3K82k27K7K76l62J92n1J13j58j21
1473a96J78K09l14J7k3J35J10QM5k82L9K5N0J88j95n6j19L97r8k18J97k55J61
1496CR7j07j28J72j25K24k31J24j64K19k84M01j65o1j05q1K12K5r1j31J12Q7o5
1519f2K82j60L27m39K1L9j00O8R5J10k24N1P7J3j91K29k09M0K49k97N1j22MR3
1543e5K1l9j5MP3J63k08j95RL72k26K62l63K21Q2k21m9K75J73n05K79J42k18O1
1567D3j96J50l4j70K54m6l18N61l37K56m40L20mr6J63m27L22j19J5J57k96K71
$$ y = [-131, -225, -7, 8, 111, 122, 248, -16, 218, -183, 43, 53, 54, -246, 30, -58, 149, -37, -37, 36, 177, -158, 135, -173, -102, -99, -36, -223, 32, 147, 156, 55, 7, -73, -93, 20, -18, -27, -96, 128, 129, 7, 260, 293, -159, -74, 157, -29, 44, -171, 5, -36, 104, 205, 40, -162, -177, -109, -44, 209, -144, -167, 115, -112, -85, 191, -171, 21, -30, 83, -75, -196, -18, 191, -123, -106, -129, 6, 116, 124, 169, -113, -74, -49, 1, 189, -6, -62, -181, 216, 118, -100, 97, -158, 3, 100, -7, -135, 37, -88, 136, -95, 29, -135, 84, -200, 201, 36, -25, -130, -211, 1, 26, -65, -196, -84, 3, -62, 220, 60, 387, -52, -31, 8, -92, -24, 71, 181, -43, 8, 85, 98, -93, 136, -73, -33, 216, -81, -30, -152, -148, -55, -34, -73, -88, -84, -11, 152, -56, -251, -242, 130, -96, 166, -197, 24, 106, -115, -164, 111, 284, -221, 58, 200, -18, 43, -153, -3, -37, -207, 47, 1, -317, 244, -93, 163, -277, 43, 39, -57, 106, -321, 1, -118, -103, 54, -242, 29]
1589B9n4J15j50Q6r1n5o8L16R5k02P6k18J89J73j73j54J76j23K4j66K22j0r9R8
1613C6k41L39k07K02j64l4K53k81j37K8L11m6j3j44Q4K33k64q8M66j80l41L51
1635A63k45J26o0n7K87k32K58m3j20k76L08k74R4J1K55j90N8N0l03M40r9j58J83
1658A76k35J68l3k52L70j07J64j01j28Kk37K32j10M46m67P6K39k39p5L99k62r2
1680f6k3j35N01m96M02k54J74J5j00j09J08p3j0lM9J38j17P4j17J89l36M98m05
1703i6K99j06k92M05l31K59n3M1k91K24pj48J95r2n6J53j23J5j84j08L64K12j32
1726A48r3j06l9K79k03J35j70k2LK49k54l5J5J44J58j47J7J60r4k23K83j63j90
1749a48K09j32J9Q4j39l8P6j0j72L36j17M3L2j52R3k1j15L17j12O8k83L26j64
$$ y = [29, -25, 90, -60, 26, -65, -120, -188, 128, 223, 21, 97, -121, 68, 241, 68, -86, 90, -33, -9, -175, 47, 37, -62, 36, -205, 134, -73, 129, -35, -69, 184, -97, -234, -206, 105, 59, 46, -98, -14, 219, -45, -133, 333, 153, -188, 163, -82, 44, -16, -73, 214, -18, 240, 197, 77, -199, 109, -165, -71, -60, 195, 5, 63, 113, -190, 250, 151, -7, 176, -59, 109, 76, -176, 194, 87, 251, 150, 22, 24, -213, 19, -91, 355, -112, -36, 203, -36, -111, 288, 26, -66, -89, -224, 277, -219, 183, -71, 103, 118, 18, -91, 17, -56, -66, -69, -20, 118, 1, 75, -42, 147, -189, 309, -96, 203, 97, -195, 210, -121, 138, 85, 126, -165, 59, 52, -96, 99, 7, -49, 104, -19, -4, -188, -296, 68, 280, 148, 55, -51, -90, 189, -14, 121, -49, -71, -68, 181, -73, -108, -93, 51, 209, 62, 79, 239, 145, -78, 205, 42, -148, 61, -71, -52, 32, -107, -145, -69, -79, -251, 85, -32, 11, 43, -109, -16, -37, -152, 165, 53, 121, -162, 164, 0]
1772@j6k4L1K18k28J01j37M6M5k36J61k9P8j17J16k87L46P6j43o3K5K9K7pN6j5
1798E3o9n0j4Q2k9J04Lj88K37j76P9L9q7j91J46J46k91L06k47L28O0l31J68p8
1822@J67k78K90j83J77J91m10K5J00j41J84jj06j39Q6j17K1J80K3k63R9J25k08
1845a78K53p1J2J46J51m09J61M7JP7j66M6J22J48n48M47j43j02J56k4j40j16K06
1868G6J5m2l02L94j21K4J24o0m6j02N80m39k79K06l15L32r2m9J21r7PK7%J91l16
1893a63K18J24j25l5P6j89J22N3k89K6L0O9k8K17k7j00j24L70l5l42k3j16L50
1916E9k06J74k06L0k1J57J6J0j57j31K41p9p5j5K11P5j38J96j69r4J9J6J00r3
1940h0K50l06J71j59nR7K11r0L5j7l25N00j71k83q2K46Q0lk17J16o4M1K24n03
$$ y = [0, -16, -40, -9, 209, -19, 82, -55, -9, 36, -200, -39, -68, 10, -107, 9, -278, 68, 144, 1, -62, -37, -8, 19, 12, 68, 53, -16, -66, -80, 2, -27, 77, 80, -108, 129, -47, 32, 71, -16, -207, -61, 85, -206, 100, -147, 181, 241, -90, 78, 0, 167, -111, 179, -4, 173, 364, -46, -21, 79, -62, 122, 121, 15, -124, -38, -155, -134, 46, 69, -194, -95, 30, -178, 75, 4, 16, 162, 313, -96, 65, 112, 113, 190, 24, 70, 192, 340, -208, 239, 96, -6, 150, 126, -14, -130, 76, 91, 49, -253, 141, 20, 44, 168, 108, 62, -40, 540, 101, -178, 28, -287, 45, -47, -96, 25, -72, -65, -38, -38, 153, -163, 55, 179, 54, 19, 95, -94, 28, 81, -208, -182, -152, -83, -111, 106, 79, -21, -145, 225, 190, -152, -175, -291, 59, -147, 27, -179, -149, -170, -13, 3, 13, -144, -275, -34, -113, -188, -203, 8, 83, -55, 141, -28, -122, -103, -87, 13, -80, 170, -136, 35, -124, -129, -32, 179, 89, 124, 107, -218, 282, 111, -172, -254, -8, 72, 69, -148, -32, -96, -55, 169, -334]
1964c34J85L15k87m5J65k02L1L94j37j93J99J4l29K56j59J29J86k55j40O9N7l2
1986a13L21j58m97M27Q9j23J64J16j55k01P6r7N0j0J68j9M9j93n0K01j48J94j15
2009b4m6%J61j17q4J79R0m84L71K2k5m3j37J55jo8n3J20p4L0o4M7j7k41L42LJ73
2036B15l84j8J55k1J09qo4k8K6j49R1J98k1j34m7P7o7q9L10k41K40J17l11R8j58
2061a04R0n3j0J29J93J7m30J77n4m0j12R6J8n0J57O4o1l36J68L24r4k23J1K71
2085A48l11L51l99K34L3J2k12K67r5o1r6J62j22j11L90j73r2J42p8j3K01k04J10
2108H3k40K50k45R0J33Q8J75m62J74ln3m7r1J85Q6k24M3j7R9N6n6J38j87R1K18
2133B84k00m0J01k21J14k05J58m7K60j10k47L9J87M2j09j01L11Qj29J15m97K20
$$ y = [-334, -149, 166, -121, -166, -1, -203, -172, 222, 85, -108, 91, 105, -224, 32, -127, 2, 188, -67, -207, -138, -81, -113, 208, 50, -447, -20, 69, -54, 110, 226, 71, -130, -54, -151, -101, -111, 57, 38, 87, -106, -156, 45, -103, 91, -24, -70, -70, 91, -26, -110, 69, 159, -325, 46, 68, 43, 0, -137, 18, 17, -51, -104, 16, -58, -28, -92, -45, -62, -303, 39, 42, 215, -169, -187, -32, -53, 56, 48, -16, -44, -18, -167, -76, 122, 101, -33, -80, -3, -70, -159, 151, -90, 150, 267, -44, 54, -104, -14, -67, -77, 52, 245, 262, -168, 9, -45, -85, -197, -101, -83, -133, 24, 88, 27, -309, -141, 183, 89, -134, -123, 148, -163, 188, -211, 23, 56, 68, -144, 123, 28, -33, -129, 33, -89, -200, 190, 17, -75, 67, -11, -24, 177, -27, 83, -157, 93, -152, -62, 71, 159, 334, -128, 46, 43, -10, -57, -148, 37, 123, -101, -58, -75, 24, 80, 24, 162, -25, 66, 284, 84, 44, 145, -76, 38, -167, -9, -56, 204, 94, -153, -114, 73, 115, 6, -95, 216, 224, 95, 210, -287, -67]
2155f7j50L4R4j0J80k32k4J1j17K81n9J30j71J01J37l2j2J58jl84L33j66k25K53
2179F2r5R7j21J10k2l8J76j90J83j85J54k86K01m2M0n0P4m9J18j80j72K06j67
2202a76J25kj46J11K22j45R5l3j56L71l93j50J79J22m3Q4r0k8K10k61O1n1R4m
2226dK43k55j16L7N9J72k54L07l16J04J14J78k44R4j36L17k47m8l6K10o0j7l5
2249F7j45j00J67L9j90L34l18Q1q1J99j84o3L37L8l17L01l07J28K75m10r6M03
2271A58j74k0L10j53n4O3j00j66j3K80k87J11L20m04L8K22m64K20J71o6q8O0J30
2294I4j06n5J69j08j45J09j62K64n5j23Q3J35m70J78J97l4J65j06k16P6Q3j14
2316a41J40qj5J08P5j43J19k54J48j58L23j84L8J0r9J65j57Q4p3O2L18m21K9M5
$$ y = [-67, -217, -183, -89, -99, 81, -151, -175, -164, -281, 0, -59, 71, -100, 1, 138, 106, 94, 252, 251, -133, 200, 34, -191, 62, -33, 64, -57, 53, 31, -7, 169, -21, 162, -23, 131, -155, 46, 4, 44, -6, 68, 19, 137, -43, -215, -9, -176, -51, -53, -199, -88, 134, -11, 84, 51, -105, 266, -127, -277, -98, 24, -19, 65, -25, -53, 157, -104, -43, -94, 0, -4, 239, -16, -132, -95, -36, 136, -118, 189, -127, -23, 91, 269, 25, 119, -17, 300, 53, 5, -31, 179, 119, 102, 67, -78, -178, -11, 28, -162, 172, -146, -65, -146, 53, -131, -194, 143, 181, -136, 165, -142, -14, 261, -149, -245, 158, -16, -36, 274, 121, 67, 130, 30, -136, -149, 131, -156, -45, 275, -129, -91, 131, -333, -113, 58, -8, -96, -36, 94, -12, -67, 102, -6, -151, -42, -204, 60, 5, -118, -35, 100, -370, -192, 5, -29, 136, 30, -186, -110, -27, -141, -1, -9, -24, 84, 159, 16, 135, -119, 29, -129, 194, 10, 48, 58, -41, 124, -33, 51, -22, 40, 358, -63, -34, 11]
2340A1K17q6l00K8l8J92r5N0N5j77J88p5J03n0N6j49J73k10N1L5N2j99P7Q0j91
2365b02L95m7j54p6K19j73K6k35N66l36j44J50k37K19nJ58J80j73m34N51l09m66
2387e27P36j30J57N8j17K33j07n84P35l97m53O79m73M67J06q14O45k04K2j79K21
2408G4l03L31pk23N3K64k01L2j26mJ24l67L44K1k13L96k64J24R8j06k8P2j55M0
2432b4k7k04K17K8kL6M8m9N5o8j43R6M9n7J7L38o52L56j65J16j00R4k7M8N9k57
2458b18%L18k01J06O7K34l18m3m9M20k98j06K94r3j52J69o7m1j4k8r3L04k84R8
2482EQ3K09K5n11J46K29j28l83M36K13l89J26m4nl6JK7LJ25k28K93k61J05N0j68
2507g7K96l15j14J49L7J2M3j16J04l8r5J48k60J18K27j51j18J30j53k2K00J37
$$ y = [11, 228, 142, -158, -130, -168, 24, -71, -21, 34, -143, 45, -30, 73, 23, 79, -70, 103, -107, -56, -21, 31, -168, -91, -11, -202, 193, 146, -8, -84, 135, -38, -12, -247, 319, -17, -161, -11, -248, -29, -34, 124, 304, 131, -303, 248, -61, -527, 209, 79, 236, 294, 177, 410, 303, -281, 454, 57, -396, 283, -190, 277, 383, -431, 214, 10, 32, -147, 74, -229, 102, 95, -128, -75, 189, -12, 20, -106, -110, 14, -353, -9, 12, -201, 195, -69, 55, 153, 47, 19, 91, -64, -24, -51, -255, -38, -10, -12, 24, 72, 23, 78, 10, -133, -37, 12, -45, -28, 310, -342, 14, -151, -35, -135, -41, -68, -20, 39, -218, -218, 100, -101, 5, 72, 306, -12, -55, -104, 316, 18, -88, 206, 113, -39, 130, 63, 22, 8, -20, -113, 191, -93, 5, 88, 297, 322, -189, -43, 186, 58, -325, 111, 324, -65, 61, 17, 12, -24, -23, 4, 7, 132, -96, 197, -64, 41, 91, -77, 219, -96, -210, -61, -24, -12, 31, -85, 19, -19, -114, 34, -226, -108, 119, -32, -150, -20, -173, -195, 5, 142]
2529A42k12J04j75J12O6l90R6K95P1j84J42j27m0K26k43J32Q9l5l47M7J34j3l4
2552a44K87j54M9j29K87p2k71J68j08J32J29j01m5j02J81M9j13K57k50J44j66
2573B8L1k5k1j48K76M6k97l5J4R0M15k13j95Q5J6kq6J75j32k11m4k5K35k05K86
2598E8k54K80q4j73K49l31M37m36M22j70M13m52p69N15L40l29J63j91m58J94J059
2619D83j71k73K07m45L41l85J53O2pK05k79P1N0J95r2q9Q9j30J16j40k3J05O7
2642A10l33K67j61K61k89k9J28k1K54L0k17J03l20L7L44j53M0J27K9k10K48j8
2664B27k93J26Qo6P0M2j10Kj18L22p4j80l6J28p2k7J50k43L36l15K31o0qk8n0
2689c8N9O4J6k52L82k51j54K54m4QK2j37O0J34k32L6K50m29Jj33K67kK44j48m
$$ y = [142, -70, 34, -141, -29, 37, -353, -257, 38, 109, -75, 67, -60, -100, 126, -117, 15, 104, 69, -278, -231, -97, -110, -144, 143, -11, 38, -91, 196, 124, -147, 21, -87, 45, 174, 73, 28, -74, 107, 156, 43, 300, 50, 194, 28, 59, 34, 13, -135, 141, 187, -110, -145, -131, -41, 374, 161, -34, 51, 67, 65, -21, 154, 22, -189, -233, -258, -23, -228, 58, -196, 84, 0, -173, 76, -255, 182, -254, 168, -2, 411, -41, -810, -295, 45, -284, -121, -312, -770, -576, 483, 312, 39, 246, -199, 142, -243, -90, -28, -35, 170, -109, -38, 12, 207, 115, 26, 115, -15, 101, -39, -62, 43, 110, -223, 44, -117, 144, -145, -174, -46, -67, 187, 217, 0, 103, -217, -180, 164, 11, 51, 178, 207, -3, 245, 227, -66, 60, 68, 2, 72, 114, 4, 6, -112, 210, 136, -44, -80, 48, -24, -51, 99, -144, 192, -123, 108, 48, 40, 12, -38, 21, 85, 101, -151, 231, -20, -174, 80, 36, 44, 66, -71, -11, 123, -109, -73, 177, -252, -251, -384, -117, -119, 125, -23, -27]
2714b7O4k1M7j31K85l33K26j27K8L8j4k08J3R6J9j23j37J96R1R4j81K10j09P5
2738G1o6j08L25l05L83k96Jk70Q2J66RQ3P2j86J42r0O1O8l66M22k53K15j97Q8
2762E1J07j31q4M7q7R1J0j44K54l4J33k60o3K08r2m9k07p4L56j61J68K1L5Q7r7
2787H5k12J06K56k16mN5K49k32K9j77J15M4Ko6j04J84j97K74j50k16L66l4j16
2810D1P2j49P0lp4j52L28l06K94j53J03n8R7p0j89J48q9J17J22j49J30p3j15k01
2834b59K18K14j36k0J12k93K16M5j30R9n9K10l91K61j82J06K6Q7q4J84k63j13
2856a52L11l0k19q7K31j41o1k6K37o9l1m4J69Pj67L09k71kL5j86L96k15J39j65
2880c2k68M09Jk61J26j22M83j25l80K67j29O8K51k80J24p3j46K4j06J51m4Q0j05
$$ y = [-27, 37, 16, 63, -68, 217, -116, 110, -17, 11, 49, 35, -173, -160, -64, -45, -168, -305, -109, -18, 76, -105, 105, -4, 71, 5, -103, 222, -83, 300, 4, 5, -265, -183, -17, -8, 75, 147, -39, 103, 13, 74, 142, -224, 198, -55, 160, -37, 51, 158, 27, -57, -10, -97, -6, 4, -140, 114, 80, 213, -47, -110, 98, 6, -43, -250, -324, 32, -129, 39, 60, 95, 182, 85, -127, -21, 235, 19, 15, 70, 319, 87, 116, -61, 54, 98, 100, 34, -70, 114, -83, 191, 41, -175, 191, 157, 41, 113, -36, 34, 31, -43, -195, 133, -173, 121, -32, 71, 13, 110, 40, -149, -1, -90, 27, 149, 0, 130, 57, -58, -259, -41, 173, 37, 17, 129, -164, 52, 97, -33, 66, 7, 217, -174, 87, -95, 11, 37, 124, 40, 224, -39, -152, 159, 129, -90, -177, 54, -87, -148, -174, 63, -6, -37, -81, 88, 95, -72, 237, -34, -36, -1, -187, 209, -6, 133, -32, -300, 109, 110, -151, -25, -147, 336, 211, -169, 98, -31, 37, 288, 8, 132, 59, -87, -63, -169, -18, -62, 18, -87]
2903h7L02r9k14J02l8j09J74O0j65J16j11K3j53K57j33K76k05N8K5j22K03m36
2925b76J82J68k60K25R9q3M1R1k14O4N48p74qL6m7R5K91p4j29M5K47k21m1J26
2949A31r5k58R5q9J47J24l34j13K75J96J83m66R84n65n84M11k38P6M2K09k09J18
2971D0P6M6J7r1k28J94L2K3J78k31j35n1K15r1k5o3P3J7j25J30q0m2K03j52o4
2996a34J91k64J86M2j52L68k31L43j65q5K37q6o64j3R91o00N59n73K78J65k62
3017A31n82P72k61k53J18j53K51j46K9L11j52j73j10L61j81J36j69K2o5J23M9
3038E8k5L5j45J45j61O2K10j04Jj33Oj7K8J23k15N5J37n6k6j81K86j24l7J23k22
3063a77K17j08m7R6j33Oo1lr9K35L26j46p6o9K7Q7K0p9P3j42L08k10K3O4k08K04
$$ y = [-87, 215, 116, -98, 4, -34, -143, 31, 91, -74, 42, -69, -46, -199, 58, -75, 201, -4, 54, 79, -43, 160, -276, -94, 74, -186, 39, 138, 55, 96, 187, -27, 37, 585, -189, -197, -161, -208, -113, 178, 104, -25, 20, 267, 46, 5, 131, 36, -222, -127, -216, -69, 55, -279, -392, -117, 79, 262, -204, 780, 215, -369, 42, -196, -120, -78, 131, -78, 40, 116, 162, 179, 88, -140, 54, 86, 109, 287, 56, -79, -130, 85, -6, -31, -94, -21, -4, -129, 1, -79, -121, 82, -70, -134, 57, -207, -21, 21, -131, 237, 6, 349, 184, 99, 336, 250, -414, -427, 564, -36, 523, -50, 228, 393, 131, -451, 321, 60, -193, -75, -228, 23, -123, -94, 217, 65, -108, -218, 143, -38, 98, -71, -49, -114, 9, 58, 33, 68, -77, 68, -93, -31, 179, 75, 76, -57, -51, -68, -40, 83, -132, -77, 60, 4, -22, -203, 83, -41, -78, 45, -177, 40, -68, -115, -19, -152, -146, -207, -210, -309, -74, 252, 106, 30, -39, -12, 75, 95, 16, 89, -53, 255, 45, 68, 132, -76, 128]
3089A28k80P5K23l36K1L21J37m16j14J72k6J24j1q5K7J00l9Jj52K1N1p4M21k12
3113G7Kj41J04O4J7j46l2R0J83j90n0J50k25J69J15m93N76l05K2P5k3j27j8K11
3137A05l65L13N9j19k43L79k94L82j12o0m1lr1Q4j6K34j72j13J04KN1m4ol5j32
3162a33K06k1k64M84n08L55o8J75j52k21K09j66M2J08J39K4m05L42J28k92L32
3183C14k94R1j87K33j68J9j45L53j33j80L67o5q2k19J25k69K60k11L27j43m1r9
3205a47Q1J49j87K32j82J1N0J14n0j38l9K74o3k66O5J57J37P6l58J14j36K11K14
3228C19m88K35Q4j56L7Q2j7k89K12L3n4K08j47j09m7j2M5J85k29j42J01J63k05
3251a91J17J1J11j32J10J2n9L36n77M18lk43j67L28R8n3j32J3oJ43k07J62j55
$$ y = [128, -152, -77, 146, -190, -169, 152, 289, -127, -241, -69, -95, 29, 18, -67, -40, 60, 21, 22, -130, -109, -58, -132, 289, 77, 79, -62, 42, 106, 123, -23, -55, 35, 218, 28, -22, 128, -97, 72, 187, -306, 270, -35, -13, 62, 39, -88, -106, 105, -260, 53, 112, -7, -250, 129, -165, 217, 105, 45, 4, 1, -90, -6, -22, 212, 40, -73, 31, 33, 84, 40, 34, -1, -133, 73, 52, -212, 272, -236, 119, 51, 226, 74, -147, 62, -104, -62, 46, 185, 209, -196, 146, 274, -18, 314, 20, 111, -76, 157, -11, 8, -137, 216, 83, -97, 270, 205, 123, -96, 29, -240, 20, -191, 136, -7, -48, -147, -66, 83, -104, 128, -54, -43, 7, 121, 71, -67, -106, 168, 105, -161, -96, 61, 198, 274, -84, 30, -106, 105, 319, -169, 66, 150, -6, 31, 113, 96, -193, 19, 52, -2, 206, 59, -50, -97, -109, -64, 121, -108, -250, -149, 14, -191, -74, -63, 48, -84, 26, 38, -21, 315, -262, 156, 153, -90, -257, 71, 169, 116, -16, -3, -9, 134, -73, 89, -66]
3274f6j36K12j85K98k56J39r9J14O5q5J25j09k52K66j91L31j68l0k35J57l7K61
3296A19j50o1k13K79L1R1m7q8J58j55L4q3J05j24L45k6p1j03l5k03K88j91J13
3319A3Q6J95l05P4K81l17J77l59O2R2M3K62j59j52J72k81l6K1L85k3k41j4J49
3342A25j10K09l53M01j96j21J06op2J21k64M00l00K35k13L85n19M18k27J81k4
3363A76j89j41K60r5j77J93l8o1J91n3j4m8J47k19J92n5k17N3P3J56k07J25r6
3386d4j25J70j23L65l19J78k94P9K44j3M77o22J12N6j32j33K96o21M69K97j5n88
3408b86O03l69M75q10Q27q18M84m75j39N53l14L04j84R45j219P67j14l37J14k28
3428b21O7J04m3K44k08K52j7k89J27r0l20M68j20K28n7j29p7J41n4j22j45K30
$$ y = [-66, -202, 10, -175, 123, -133, 6, -93, 21, 86, 1, 126, 17, -235, 31, -160, 171, 3, -27, -262, -105, -142, 119, -31, -92, -305, -26, 5, 96, 49, -39, 119, -36, -2, -85, 20, -104, 241, 215, 144, 41, 6, -197, 91, -100, 13, 99, 294, -11, 63, 344, 27, 204, -155, -93, -1, 42, 304, 145, -7, 165, -116, -152, -131, 254, 231, -10, -24, 125, 15, 224, -129, 272, 76, -45, 61, 55, -17, 104, -160, 240, -60, 175, -38, 347, -172, 246, 19, 200, 176, -13, -154, 106, 11, -166, 27, -11, -72, 119, 66, 52, 4, 151, -68, 124, 69, -148, -95, -22, 134, -73, 52, -44, -169, 1, -122, 243, -76, 102, -192, -113, 131, 118, 595, -27, 85, 141, 9, -124, 172, -449, 20, 317, 302, -286, 317, -52, 423, -387, 440, -378, 106, -369, -508, 45, -269, 35, -149, 796, -423, 344, 230, -107, 7, -221, -154, -50, -93, 151, -57, 195, 178, -111, 16, -74, -394, 74, -46, 182, 125, -4, -81, 60, 6, -116, -261, -31]
3450c1k2k05Q8K09J05K3J46o3j02j55J0M2K48m27L0K8J57J18j61o7J59j53J72
3473A49j81j0Qj59K14l9P7K90k76j84J97k3k10J31M2N6j7r3j42P2M73m59J09j50
3497a25j18R9J39J44l04L3r3L57p4M6K6L5r7J64k54K46l64k07K43rK15j57N5n7
3521e7O5J79k39L9J44l11Q8j47M05j16N4k46K49n5L7J28l4k75K44l62K01Q6j87
3544a10O3O5j89K35r3K19j33P3k85K12P0j12Q1n4J4n5J9j59rK14K3r7k3L2K55
3569B56n70K50J35j63j35L00n8M2Rj75p5K46J71j44p9L5j06l0L1J09K09l07j1
3592f0J42k24K70l08K22j08j57K24R3K7k08K60k55J79k15K13q0O9j43K74j78k09
3614a72K18J06o8J16l38J21J39P1k57M4p9K17J25l58K8L55j84P9l9P2rl81K76
$$ y = [-31, -53, -258, -170, 39, 144, 167, 313, 250, 148, -7, 3, 45, 293, -134, -104, -76, 81, 199, 38, -29, 130, -23, 149, -32, -42, -34, -193, 21, -18, 59, 349, 73, -111, 86, 63, -147, -16, 26, 82, 65, -28, -170, -98, 375, -84, 25, -125, -243, -144, -5, 139, -165, -132, -225, 132, 58, 104, 130, 165, 68, 232, -22, 224, -140, -347, -104, -113, 102, -55, 0, -57, 8, 187, -52, -13, 131, -180, -92, -239, 166, 50, 104, -142, 107, 52, 89, 217, 183, -92, 152, -210, -9, 77, -110, -47, 18, -171, 64, -29, 190, 57, 130, -155, 57, 127, 15, 96, 42, 56, 1, 20, -139, -148, 66, 89, -8, -31, 1, 256, -314, -64, 71, -92, -227, 73, 15, 57, 66, -109, -184, 62, 233, 89, 10, 45, -61, -91, -60, 49, 258, -49, -60, 82, -142, 128, -180, 42, -66, -223, 1, 94, 121, -87, 173, -82, 97, -118, 95, 15, 84, -59, 215, 37, -172, 46, 152, 84, 200, -138, -17, 122, 193, -64, -20, -99, 118, 243, -115, -87, 268, 84, 163, 124, 196, 187, -194, 82]
3637H2n4J35k55Q7l8R9n8k4J81j53P5o1j37L3j50L00j53R0l0r4N0K65j09l35J0
3662b44J12K6J40l54L04O7r8K19j62J5K5r4N5K18k47N8j9r3J39j70N6L13k52o1
3686d7J07N8k63K20oL0j2L1j11Q0l3q8K03l46J01N7j26J84K07k98J62k11O1o1
3710a01L14j77J38k00J7O1Mo8l2L09k97j01j55K93ML20m74M30j59J0q6J78k67
3733c9K17k64P9O2P8p9k77J56J75j71l5J05N3k75N01L0l0l39m6K25j97j39N7M75
3757C22l37j3j8R8j02lj30L58j12q1J43l6k01J72j35l9R5l1K99l60P6j51L27M3
3781A84j81N4J6J36m80L77k81l14P14l40R4L04m30J64n9m6J78l67K78o2P6k24
3803b09K36j0j48m2M4L56j56j45Q9M9r5k79M77k82j44M16j97q5L02j52K7k79p4
$$ y = [82, 28, 163, -92, -5, -43, 56, -2, -26, 155, 2, 77, 16, -121, -88, -238, 62, -91, -1, -31, -125, -75, 190, 81, -254, -244, -132, -106, 34, -320, -16, 51, -47, 172, 10, 25, 50, -44, 11, 229, -18, 40, 21, -72, 67, -103, -47, 266, 14, -47, 60, 118, -145, 75, 69, 99, 87, 118, 7, 87, 54, -34, 169, -177, -76, -19, -145, 39, 246, -52, 110, -101, -40, -101, 213, 36, 174, -26, -9, 52, 56, -12, -44, 265, -32, -133, -288, 5, 9, 329, -145, 285, 126, 136, 50, 228, -39, 178, -86, -7, 55, 133, 54, -223, -67, 108, -63, -98, 7, 60, -215, 286, 316, 286, -53, -99, 126, -71, -210, -153, 322, -15, -28, -46, 52, -50, -53, -183, 175, 63, -18, 125, 89, -112, 60, -75, -114, -19, -50, 249, -111, -35, -186, 141, 184, 3, 57, 73, 209, -271, 106, -175, -489, 225, -115, -21, 283, -147, 17, -42, -88, 90, -277, 1, -61, 15, -209, 27, 17, -131, -173, -129, 227, 71, -74, 15, 64, -31, -310, 167, -115, -259, 157, -40, -125, 177, 25, 52, -227, -301]
3826c01R0J51L30j56J38p8r5m8r3k09O2rN2j99L06J34n8J27j0l07L82l21K92k87
3850a07J58l1j26J25j49R6l38L13M3K47n99L27jJ32j81L07o7k31J82p0L1K3n0
3873C4J03l8j04M1M5q9L7q0k98N22j72r0K21j03n02K57J55N0P6k1j43K18m18L75
3897G6L1Nl47J60K84k10L8l6J44j12n8Q9j18J53J38m11L35l62K95o1K32l14J40
3920I1j76M9l6J52n4m0P8j54K72k12j07K7J09mJ06J5k60J03L52j71k26L8n5O7
3944c6n0j07L47k27J33J47j51l38J52K64Kk03R4M7k20J06k54L54o6j10J28J05
3966A17Rl9p4K6j12J05K70n64J22n1K07L99m5l41q2j82M33k65K19q3q7k08K19
3989gJ0j04o6K67n1K04k11j19j5j84K84j55K54j95J91j77k5J31K60k82K74m00
$$ y = [-301, -211, -60, 270, 114, 252, 174, 79, 31, -62, -271, -209, -218, -166, -365, -59, 75, 17, 144, 134, -173, 209, -112, 180, -107, 51, 20, -106, 19, -130, -34, -372, -59, -16, 231, -368, -41, -42, 90, -91, 216, 149, -82, 100, 30, 61, 84, 34, 137, 99, -5, 36, 81, -8, 29, -51, -349, 173, 1, -89, 132, 29, -473, -216, -61, -11, 65, 44, -99, 119, -299, 76, 107, 112, -235, -75, 209, -1, 37, 1, 145, 33, -25, 64, -54, 99, 237, -174, 161, -201, 94, 33, 265, -49, 91, -85, -36, -72, 80, 26, -14, 64, -90, 182, -30, -137, -110, -1, -5, 101, 116, -144, -41, 311, 140, -86, -48, -103, -36, -86, -193, 154, -73, 60, 207, 56, -282, -130, 134, 136, -67, 27, 74, -146, -40, -294, 60, -6, -116, 12, 117, 126, 87, 13, 39, -73, 32, 302, -262, -140, -191, 16, 415, 370, 29, -53, -235, 198, -67, 152, 69, -18, -226, -7, 3, -101, -167, 100, 49, 253, 42, -77, -92, -276, 8, -147, 107, -88, 103, -74, -99, 32, 292, 10, 284, -116]
4011a16J04j57K26j23j28L71j46j43K41l4j76O3K13m14K18l3p1M7ko4r1L7L46
4034A68k17L3j36l0K63j29j72N1K25r2J45k61J1j1K61l28J33k2K49k29j04O1K97
4057A66k27K06k6l05K29m2k75K36J44k39J18J48k76J88k53J33J85o5j34lP0P8
4079E6l02L57k78J99ok7pJ63j56K61n35L66j63R2n40j28Q14l21K74q4J27k51L33
4102B44j65k52KL63j0k28K34L9k21kK18k55r0Q5P7l48P3N13k42J30l51L17M4l44
4126a69J11P6k17J73O3p9o3J80j24J30k43n5L89L0j86K2k9K4J1j50K15P4j06j48
4150g1J16p4K5P0j6m9j08J46j30J65K36j90j59p8P8J82j93Q8k7J84k96N3q3m8
4174a79K08j94K06L1l6J22j87N6j34L9J30r3r3K32j70J30J54k64K43j99K33j72
$$ y = [-116, -12, -169, 57, -66, -194, 177, 31, -112, 129, 95, -81, -18, 195, -219, -1, -34, -105, -58, -60, -124, -215, -178, 168, -49, -16, -152, -182, 81, -48, -220, -169, 56, -36, 109, -152, -141, -152, 109, -219, -86, -108, 141, -88, -192, -131, 166, -61, 145, 119, -186, 43, 1, -274, -38, 106, -133, -15, 133, -143, 45, -208, -75, 110, 45, -89, -92, -22, 56, -246, 111, -167, 32, 26, -1, -8, 155, -1, 260, -275, 91, -72, 20, -520, -648, 166, -155, 119, 35, 162, -89, 244, 79, -173, -171, 192, 182, -46, 188, 227, 6, 4, 222, -33, -123, -38, 39, -309, -236, 277, 35, 165, -186, 131, 175, -169, -58, 18, -199, -26, 37, -42, -105, 75, -49, 81, -162, -217, 172, 202, 16, 38, 9, 33, 44, -106, 109, 183, 77, -71, 45, -29, -4, 66, 50, 1, -107, 39, -91, 74, 310, 120, -39, -117, -39, 143, -50, 38, 11, 195, -101, -48, -131, -179, 29, -165, 41, 72, 36, 158, -29, 27, -107, -68, 62, -31, -124, 108, -62, 68, 222, -42, 201, 2, 235, 63]
4196F3j50K80j88r7N1Ol4J86j11j04J8J99k01j99K28P2k51J57n1J0L51j82K1j91
4220a17J72kj09o8K41JJ21k98j52K19j7M2N2j82LQ9R4j72J74m2j20m0j20K85j58
4245a04J00J38l0j37J28J17k43K65j95j4J38l27K18p0J20k40Q5L9J52k68J2J64
4267D8l2p4J03J41j58j58R8n2K99m44R0K23l26M35r7j97J78j25R8m5m5r5j7J58
4291Fj09M18m05m5K87l42J37J21j52j58L45p7j47K50P6m2N6l71K81l6J49Qj67
4314H3O2o1N3J16l33K20J3k57R9K1pR1j61J19k54J62K9L8R4j8P7l72J44n9J45
4339D4J41j69K43m40M67q2J19J73r98M50j06P8K66k06K65j41j71P9M7r2K71k3
4361B15p6m7j86J48j41J98j25l33K51L74k77N4L2J21k07N8j34O2j9j37J11j9J57
$$ y = [63, -87, 193, 5, -92, -41, -35, -69, 117, 6, -98, -80, 119, -82, -281, -53, 19, -232, -75, -126, -116, 235, 53, 74, -117, 55, 53, -56, -124, 117, 118, 239, -59, -211, 8, -9, 33, 85, -97, -94, -5, 89, -83, 91, 49, -71, -111, -231, 54, -104, -4, 134, 104, -33, 95, 212, -31, 234, 39, 25, 163, -164, 54, -16, 104, -136, -51, -12, 140, -128, -116, 48, 16, -58, 45, 186, 28, -130, -32, -84, 215, -229, -139, 84, -242, 193, 96, -101, 77, -48, 50, 5, -40, -135, -152, 6, -103, 315, -90, -135, 152, -190, -53, 68, -84, -242, 103, 26, -121, 129, 205, 163, 219, -152, 129, 93, 242, 250, 83, 145, 84, 137, 253, -80, 140, 153, -104, -5, 16, 9, 100, -61, 58, -196, -34, -5, 33, 127, 109, 186, -186, -42, -101, 44, 185, 16, 259, -181, 286, 204, 323, 496, -502, -52, -158, -80, 186, -20, 245, 104, -67, 12, 59, -33, 238, 215, 139, 92, -94, 54, -87, 111, -14, -347, -96, 278, 1, 55, 87, 208, 1, 59, -75, -13, -32, -169, -58, -77, 80]
4384H0L5k90L37j80n8j33jK35j4K14m25L43J49k59P2l7l35L95o8r9K72m96K00
4407f3J39Q5m98KM49l09J92k69J64J23J45O3n63J5M62n39O11O1k89K12k20J89
4429A62j0r2k60J18Q5j88L26k12K19k27j29K46N7R4K6k42Q3J3o6P1j63k9J50K0
4453E2k2j6R0j56l3J60m04P00m11j30L09j89R1P6l8N8p2q9N0j49K19j98J3J03
4477A4L11l69K20j3l78M28k09O9j48P8J94l49J15J11k83K72K09j43M9j67M7r6
4499c8K9J69q2k35L63p8k02j09L01J48k65K14l40J59J06l3j39J03j4k46K77M4
4521A32j66n3J17j46n0K32Q7r4O6M1m86M27m6J1j18n1N4P3qJ85k33J56q4J72k61
4546d3j60O6L5J27j71K01K9j48p7O8k13K87l0Pn1J55p2l28L04q1N7moJ28q0K3
$$ y = [80, 115, -175, 162, -18, -76, -209, -210, 25, 11, 225, -200, 143, 292, 33, 105, 68, -267, 128, 60, -39, 233, -263, -63, 76, 161, -337, -335, 114, -195, -3, -272, -108, 15, 160, 223, -340, -325, 137, -402, 209, 270, -19, 193, -27, 162, 152, 60, -200, -82, 3, -185, 141, -71, 148, -79, -208, 38, 95, 189, 215, -27, 56, 69, 3, 74, -89, -118, 32, 52, 30, 14, 104, -52, -85, 75, -329, 371, -40, -170, 139, -50, 41, 117, 79, 137, 65, -24, 26, -123, 96, -102, -89, 14, 325, -44, 176, 163, -215, 213, 4, 73, -75, 3, 197, -152, -37, 74, -209, 63, 272, 129, 178, 11, 58, -38, -9, 160, 78, -157, 206, 128, -74, -183, 118, 266, 1, 215, -125, 34, 140, 107, -32, 71, 57, -189, 88, 132, -34, -87, 30, -116, -166, 66, 153, 59, 125, 166, -320, 107, 61, 72, -46, -97, -43, 30, 22, 207, -26, 130, 46, 218, -43, -203, -137, -102, 25, -146, 55, 84, -64, -141, -73, -286, 1, -29, -22, -73, 82, 10, -318, -14, -95, -38, -42, -48, 80, 0, 23]
4572B3P1Q8k70K31j72r9NN6N5m0O2J01k7qn3L6N8j03P0k65K10o4j4K70l52K86
4598A55O6j06p2J16r6k13K28k09k2K7J85j7j71K72r1p3OJ6K0j7K22j68j83JOP7
4624d1M34k82j31Rn1R3m9K04l46mJ90N1k53K22k48P8L0J82J0k72J1K95l6J03k49
4649e0J77k61K33K5k17L4m7J10J6j81K10L5k46P2j32L45k26j58J18n9K05j62J30
4672b9q4R6N7j48R2J60j98K9k6l28L75l6K03k06R3R1m0l23J66J86j01j06o8L18
4696A73k54k6J41o3J60k22J70p4J92j16l25R4L05k95p7K27j3j9m8Q2j7O0pJ52
4720B00j65O7J08n0j55j42o7J81K93k42k08L46J23j39j04j82L2R0j31L5JK18k15
4743a06J78j74j74J80K43k20J31j69J17j93L20k08m0K39L3j53ok34L22k7q1J50
$$ y = [23, 94, 182, -88, 143, -29, -128, -123, -67, -12, -52, 10, 111, 84, 76, 23, 59, 117, 14, 84, -181, 29, -35, -49, 221, -131, 155, 221, 115, 43, 159, 63, -150, 78, -131, -153, -126, 59, 42, -129, 143, 52, -21, -15, 1, 21, 4, 226, 58, -125, -124, -118, -41, 393, 111, -20, -11, -62, 31, -18, 186, -160, -164, 26, 77, -176, 46, -202, -124, -94, 88, 98, -174, -163, 132, 96, 199, -50, 127, -134, 99, 124, -93, -59, -106, 4, 20, -161, 49, 84, -162, -90, -222, 123, -103, -261, -143, -202, 3, -159, -29, -113, -17, 40, -108, -16, 144, -54, -25, -51, -379, -4, -40, 163, -43, 50, 141, 101, -222, -56, 130, 29, -77, -145, 173, -81, -107, 34, -29, 131, -91, 79, 5, 197, 81, -244, -150, 155, -140, -217, 10, -3, -22, -70, 12, -5, 55, 48, 200, 35, 102, 210, 160, 5, -137, -204, -23, 270, 28, -180, 166, 289, 150, 46, -136, -104, -14, -145, -110, -109, 109, -106, 72, -102, -276, -96, 147, -73, 58, -111, 6, -187, 133, -75, -115, 124, 157, 4, -2, -236, 86, 59, -22, 128]
4765A28q9p8J83j38L8r7O6n3K65j89j11J52l89L48N2k19K02O8l5k67p5J96J66
4788A24k68J0J52k8m5p1lO0R2j7L6j04J10l6j38j6K49K1l72L15l74Q0J32K54n
4813A58j83L60l56K38o6k02K00Nl14K46j48J06Lj31K47n6q4k8j60J19J01o9m2
4836e6pQ7j18M8J50J3N4j2j33J30k14Q5j09J13K42l41j87J17J83P8o5k63j9K66
4860D2P9l53K48l1J36j35J29p2J10j12j84K03P9j09L1j08J76O0m1j56Q2N6k72
4883a42J59j52j43M2K35O0K8K72j62r8k48R6K36m35M24k63k9R7p6J9J44Q7q2M7
4907A16r8L0j51P2j8q6J39r1J71R0j74j74P4k4J03J77k12o0J15j18Q5j9n9JL9
4932g2J88J12m31J90K9J52k56j15M18k22P8n8J6mk74K71M8J8l0r8J66q5K69m16
$$ y = [128, 39, -39, 144, 6, 44, -53, 13, -40, 225, 36, -75, 77, -312, 36, 88, -131, 71, 139, 104, -163, -238, -42, 124, -144, -134, 18, -10, -55, -126, -129, -69, 23, 6, 42, -62, 48, 12, -126, -142, 107, 128, -244, 71, -303, -223, -91, 163, 158, -25, 335, -21, 217, 151, -51, 149, 154, -160, 86, -62, 44, 47, -84, 163, 107, 23, -5, -165, -46, 55, -14, -56, -63, 24, -94, -46, 104, 117, 171, 159, 26, 156, -58, 27, -82, 31, 273, -68, -255, -138, 45, 123, 58, -205, -224, 42, 121, -232, 16, -15, 121, -14, 115, 43, 153, 41, -143, 60, 139, 30, 61, -47, 129, 189, 148, -8, 74, 130, -142, 17, -135, -278, -236, -1, 59, 87, 359, 197, 99, -149, -53, 183, -252, 172, -91, -120, -23, -99, -80, 64, 151, 69, 116, 18, 48, -103, -31, -49, -135, 4, -87, 84, 174, 0, -174, -100, -124, -21, 156, -56, -116, -1, -119, -34, -53, -112, -111, -72, 116, 228, -203, -13, 16, 168, -88, -203, 215, -7, 71, 13, 29, 25, -249, 22, 70, 88, 58, -40, 126, 41, 310, -106]
4956a06K34k44J19J06j74J13j68J9P3m1L5j76J54J26m3K39j69r3L5O6n0k79L52
4979A28j80j10Q2oj40K48j29J42L7o6j05R0QN7pN1l53J26N6K90l68M7J18p8J28
5004F6k41K77j08p1K82Lm71K45m6O5n3rJ08L01l89J40M7k42L6JK11j10K50m20
5028a28L01r0P7j86j46J68P6j61J06P8p6k7J46q4k16J44N8o9m59M79o8J55l3o
5052C9J48m80o4N24k06J71o9Qj41O8J57Lq2k93K05m6P6P6k02O9J31k45P7J54k35
5077a57J0N0j31M18p7k15Q7j51J81j13J14J19j63J55L0K1J13j87j54J89k16J37
5099F0l43N03j59o6M3p4j09J15p3o6K77k75k9J61j61K2K44k46K90k08L6K06k53
5122a05n3J54q6k1J70mJ01k46J97l03K17j24O0J47m2J2k25R6m5J77OP3k16p5L04
$$ y = [-106, 128, -116, 3, 109, -65, 48, -120, -101, -28, -69, -34, -210, -56, 70, 27, 266, 97, 4, 39, 105, 55, -224, 128, -52, -162, -80, -86, -226, 22, -107, 35, 72, 6, -99, -9, -1, 56, 49, 100, -253, -127, -71, 219, -149, -102, 16, -62, 66, -175, 102, -6, -77, 205, 208, -263, -18, -64, 1, -52, -61, 47, 348, -41, 99, 146, -96, -60, -59, 152, 42, 292, -128, 173, 83, 160, -26, -172, -4, 72, -89, 17, 95, 19, -8, 138, 54, -162, -18, 40, -29, -488, -9, -77, 78, 45, 39, 187, -293, -357, 167, -39, 132, 63, 71, -70, -2, 155, 158, 76, -217, -12, -58, 18, 94, -108, -39, 92, -153, -76, 78, -157, -147, -97, -228, 190, 113, -102, -15, -166, 15, -98, 16, 135, -28, 127, 157, 178, 291, 104, -50, 139, -77, 60, -283, 220, 61, -5, 38, -36, -145, -30, -103, -169, 108, -167, -196, -35, -196, -174, 70, -176, 114, -94, -58, 148, -105, -158, -4, -90, -111, 59, 55, 156, -90, 107, -196, 21, -103, -43, 104, 62, 74, -151, -55, -100, 77, 83, 156, -60, -135, 169]
5147A69p2k26L14j54j11OJQ6k21M80k77q0KK9r4l7oL41k66k6K03j17J9J90k08
5172e5N6J70j84k50J8L45l1j0J30k68jJ33L4k55J66M53n58J95l74N08k15M78K54
5195G39q81r0J82K60J54n0R7q98Q6M79r53Q28K38k67l75P94N38j117N05p8j10
5216H1m6l5k10j25O30l02r3J53K63n45N9k99P00n72P92p53M41R6k51r3M5k03K93
5239B6J12l80L08j95J90M08j77j28j90J64k80j28M19k69N14k90j23K97k99q7M2
5260f6J23J54O9m56N4q7R9L9J40L6k60J01m8Pj42K87j07K6m2K87j9p8K76m68P7
5285Bq6J57J28M5l19j07K81M2q4K05l49K67m7l39K20J04R5j30j74J44L41n33L56
5308B19l02r3%M07k09J17L44o77N2j5J09o5K08n25N70k22J35l25K35m96L63L55
$$ y = [169, 97, -129, 185, 31, -80, -74, -73, 13, -208, 272, -5, -85, -83, -54, -148, -185, -191, 150, -116, -142, 61, -56, -37, 153, -55, 1, 171, -13, -263, -245, 100, 69, 59, 189, -79, -80, 53, 87, -168, -2, 451, -107, 88, -286, 222, 7, 485, 739, -142, -232, -50, 210, 364, 314, 411, -487, -401, 78, -875, -47, 191, -76, -451, 343, 881, -236, 269, 191, 81, 35, 0, -210, -335, 295, -7, -100, 53, 316, -229, -170, -469, 231, -341, 451, -302, 139, 235, -16, -109, -64, -267, 26, 138, -242, 66, -129, 61, 469, 292, 164, -26, 138, -142, -270, 149, -120, 394, 104, -19, 278, -21, -108, -66, 57, 211, 280, -176, -122, -209, -110, -71, 69, 105, -155, -54, -102, -95, -237, 50, -57, -31, -73, 214, 195, 117, 393, -75, 2, -84, 73, 201, 246, -73, -180, 101, 143, 59, 264, -85, 182, 135, -204, 16, 120, 215, 85, -89, 55, 396, -137, 219, -83, -176, -176, 231, 22, 139, 483, -194, -142, -157, -48, -113, 95, -430, 140, -82, 53, -272, -37, -533, -170, 185]
5330A85q7J37j07n52M34j2P9k69L94j71jQ0j48r4Q0m5r6J87q1K03m6o7L2K0q2
5355b7K9L8k92J53m0K63K43m42l0RL93l66J36j96o7J95j32J07q3L8K64J39n27
5378a95L38k05n5J21l4p6K90k08j05J21l56P39j66k37P1k29K37q1O6L3j58J77
5400H8j66K72l22n1N1R4L2J29n9j46R9m9M6j10L45k5MP6m03J46l5k15O1O4O4j
5426a1J03ln5o6L7J55l7q6K1q3j7M8r8P6k00K66j08L09J6k06n8k63J91O1j00J83
5452G5k13M44j71j2j58p1L06n9j90q2j19K95q1R1k06K13O5j71m2n2K11j34L01
5475B40n89L59M5J04j66J49n1j50J23O2j65M2L89j78j1m42L19O3q9J08j43Q2l1
5498G0k73K32q0K18j27j7l49N34M5l21P6J73m03J90j07j53L34j89L01J67l04j34
$$ y = [185, 98, 235, 128, -424, 10, -2, 77, -192, 202, 31, 30, 110, -38, -132, -52, -97, -193, -6, -87, 116, 70, 3, 35, 55, -27, 2, 40, -252, -99, -139, 124, 367, -75, -105, -96, 297, -69, 67, -129, -196, -1, -133, -26, -109, -71, 193, 332, -195, 143, -62, -117, 4, -30, -106, 184, -24, -129, -8, -364, 375, 209, -28, 43, -186, 51, -30, 36, 69, -89, 88, -78, 194, -128, -179, -128, -34, -2, 127, 68, -78, 21, -28, 18, -92, 253, 228, 232, 308, -95, 51, 16, -199, -138, -74, -10, -11, 92, 89, 34, -32, 5, 160, 123, 37, 58, -25, -42, 6, -92, -16, -216, 50, -58, 251, 267, 61, 3, -260, -69, -8, -108, 75, -138, 306, 135, 123, -35, -106, 200, 141, -49, -131, -250, 45, -36, 55, -151, 62, 127, -44, -86, -138, 73, -61, 240, -349, 10, 55, 159, -7, 142, 91, -59, 64, 126, -39, 3, 392, 214, 203, -239, 80, 143, 54, 162, 19, 101, 70, -203, 29, -51, 167, 40, 23, -326, 208, 253, -68, 8, 181, -222, -32, -139, -292, 42, -147, 154, 321, 17, -117]
5520a17K61m21L13M15k91j77J88M8j77j50M0J02j54k4K27p0J90l58J41J97r9J62
5542B46m44J53J72k87K33L4j81k2N1j20K94o8J5j3K23l08L35k02L6K25l29J84
5564B27k52M9J9O85n88J21m17L49o35R9J74k12M41L37q01N8P31k97n52J130j196
5585e30j62K19J58J27j82N77q2J79r11L95j03N14n41O85p05K63O8j1Qr9k56K24
5607a65P6J68K8p1o4m0K43J3l98L31q4p9L59j69l13j65M66N2j71j66M4N1J19n8
5631GJ3j02ooK27j91J18k37n3O0R1k3M1o9j39N01k98O2j8O4J7J42K2j98r1K29
5657A63r0j3l5J53k25j41K73j21L3J84j26J07k08j12J23m1J01J6P0q2j11K48k33
5680f7p0L81k70O5K8k12K86k12j13K53j36j16J01j29P6Q3K45k46M0np8o0N6K36
$$ y = [-117, 144, -277, 36, 451, 160, -17, 171, 219, 42, -108, -68, 34, -120, -144, 83, 13, 203, -155, -14, 183, 84, 246, -198, -45, 127, -160, 73, 107, -74, -96, -45, -165, 129, 61, 76, 63, 286, -22, 313, 111, 147, 372, 43, 227, -25, 24, 43, 728, 140, 261, -156, 193, -442, -343, -169, -381, 60, 397, -404, -346, 385, 88, -464, 666, -530, -692, -473, -315, -188, -370, 207, 125, 304, -607, -212, -315, 199, -342, 343, -362, -99, -31, -42, -34, -133, -389, -165, -89, 79, 107, 36, -28, -68, 175, 188, -210, 121, 37, -42, 317, 148, -165, -330, 136, 188, 17, -149, -105, -54, 65, 7, 20, -82, -88, -94, 133, -58, 60, -177, -230, -170, -79, -102, -61, -130, -269, 232, -66, -4, -22, 42, 59, 201, 223, 25, -66, 163, 73, 60, 25, 178, -47, -188, 85, -36, -3, 181, 55, 162, -46, -158, -35, -76, 25, 41, 111, 29, -82, 166, -67, -137, 244, -26, 39, 67, -145, 141, -71, -184, 69, -67, -183, -82, -211, -135, -52, 193, -53, -13, -18, -96, -156, -100, 136]
5704A36l42J84P9j40K06l7k54L8O9m9NJ58n9J91m93K15J46o74O12L7m33J0M1j98
5728e52R49j98R7m96k11M49q8q0J0k00n42J69J118J49o07L9lJ30o22K96N34l50
5750iL07n36n1N02j47Q2r45J090j76k57j14l04M44N34q7n31N1N05n35m31M03K05
5772@L61p77K91K3N50j40j1q45J9L01p17O49K93j48LL31j00r2j4j62J17L39j12
5795A59l24K87j41k3Jj63R0p5J56j41J59K87l62N6K3K31n18k0K21n0L15m7m2p9
5819@r28J305n25J05P10j115K78J73j00K0M58r51K97j43L92q4q3J19k90R9k13
5840d76N15o60R26l43m11R37l23k85K8m78Q64J61n41K55K0j0j56K94m12k15K89
5861b1m6K58o02QK83K24j4pn4j65K87k75J37k84J35J64P4j44J45J06k11j89K19
$$ y = [136, -206, -22, 57, -83, 123, 86, -168, -130, -61, -110, -105, 53, -6, 185, -308, -93, 53, -621, -9, 28, -405, -395, -354, -552, 397, 199, 296, -200, -411, 38, -50, -130, -120, -320, -862, -693, 425, 574, -33, 6, 3, 133, -489, -193, 341, -9, 298, -238, -289, 213, 66, 148, -797, 293, 117, -140, -254, -558, -114, 420, 333, -198, -147, 358, -177, -608, -205, 0, 361, -416, -125, -102, 448, 308, 297, -548, -529, -228, -945, -296, -3, -151, -148, 183, 83, -9, -23, -185, -68, 271, 159, -165, 122, -19, -42, -41, -204, -114, -189, -33, -174, -15, 272, -90, -34, -11, 220, -298, -318, -97, -147, 168, 121, 79, 0, -928, 377, -148, -43, 667, -448, -170, 3, -97, -77, 381, -570, -273, -416, -24, -108, -191, -72, -362, -263, -476, 39, -621, 305, -38, -449, 488, 165, -120, -92, -570, 294, 455, -86, 169, 189, 179, 23, 317, -95, -310, -21, -67, 191, -411, -403, -120, 104, 90, 83, 29, -136, 151, -124, 13, -271, -136, 28, 102, -42, 103, 209, -2, -191, 28]
5884B8L8J32r6k75L93qj70j35Q9q6M9j5J15JO7kk01MJ21j72j06P3J61qp8K09o9
5911E9k34K29J78l95J18n9J23J34k98J82k0k5J2Q0j14J17j00m1J47k24L76j57
5933H8k14J47o7%p6L70k01j05l14M32R9q3O9k43pq2K51N01q31L04m90K33L46N6
5957A83j0m77L21N09o99R42k51O0k89q60r9R98o64K85K84o36N55l53J98K28j42
5978H3q1k63M09j06N0k42O4J84k93J39k0J72R3k18n7L6rK34k43Ml2J26l71K82
6002e9P2k7j12K94m28L88j86K36k95P7J8O4j61J7J34o9P2k31L04j13n6q2k6K04
6026C5k74P8K85J65k49j68P9j17K68j86J19o7L4k42P0K73Nq9J31j92ll7J89J38
6050B45p6p1o0j11m5K58n5l13L08k36J17j25j5K17m1L1p0O7k4j04J16J43l15L92
$$ y = [28, 66, 198, 102, -173, 220, 212, 42, -93, -4, -90, -41, -56, 59, 60, 127, 125, -76, -72, 49, -123, -229, -156, 5, -3, -81, 128, 59, -175, 54, 232, -163, -45, -104, 19, 153, -145, 37, 17, -8, 4, 84, -30, 87, -13, -54, 93, -131, 245, 88, -126, 21, -46, -46, -122, 248, 47, -58, -372, 60, 159, 76, 145, -98, -105, -187, 64, 565, -266, 38, -452, -219, 127, 183, 173, -304, 17, 526, -173, 769, 518, 578, 289, -571, -670, 328, -336, -51, 233, -403, 152, -201, -3, 225, 83, 2, -261, 148, 42, 92, -150, -86, 98, -195, -56, -76, 96, 189, -29, -86, -50, -59, 175, -68, -64, -96, 30, -341, -59, 13, -14, -126, 168, -260, 128, -58, 178, -117, -40, -22, 42, -119, -102, 32, -37, 35, -196, 108, -5, -61, -143, -169, 35, -239, -161, 124, 289, 40, -128, -49, -166, 102, -84, 35, -32, 2, -240, -170, 103, 108, 19, 150, -42, -45, -82, 107, 245, 169, 98, 38, -73, -118, 140, 85, -228, 80, -156, -39, -164, -179, 38, -3, 28, -42, 25, 1, -103, 13, 156, -159, 233]
6074B33m25K31m1q1K8j38l4O1P5J70N0k07O3j69Q4R9J68j25m2l9L4j44P6J41j32
6099f4n5Po7L49l55K3M69m31O7mJ84o3j13Pk40K95o0K26o8j26J7j35K51j00l01
6124b87K18K69n9k29J72j83K59j83k2QRJ2J11r6J05R2k29n5L07k96L2J29k68J06
6148g8R4k1J31j52L09k10lk49K01l3j12K0R5n7j7m7K89J3k20J12J53k90J15m2
6172AN4m7J62m74J22o8L57J13n52J96P27p42M51M09q21M52m13l1q16R32n16J221
6194G17p93J92m40N25k66N28q37j32L56Q12n49j24L5lk23L80j97J3j45L52l47
6215a46j23J45k99K67KK85N7k11p1q5L69m5J41J19k38n4L23m90L3l49K19k3J70
6238dL73j45L40l73r0j87N7O7k30J89j90J01L99m48Q0R3N5J96m24n9K68j30L8
$$ y = [233, -192, 39, -2, -83, -55, -193, -227, -166, -91, 79, 129, -78, -15, -184, -100, -1, 167, 42, 0, -39, -5, -149, -73, 68, -64, -119, -112, -179, 170, -185, -162, 307, -124, -57, -61, 123, 60, -53, -46, -286, 9, -51, 175, 107, -19, -2, -137, 114, 14, -287, -69, 200, 141, -88, 84, -99, 160, -23, -45, -37, -28, -16, 95, -1, 104, 196, -33, -88, 219, -77, -45, 84, -184, -78, 16, -5, 126, -26, 283, 73, 70, -179, 22, -11, -123, -103, -8, -65, -82, -129, 160, 173, -47, 65, 218, -72, 43, 1, 55, 8, 170, -304, -182, -250, 107, 220, -332, -136, 591, -151, 300, 709, -112, 340, -73, -104, -920, 12, -504, 717, -76, 116, -324, 201, -65, 463, -374, -506, -150, 662, 113, -11, 24, 21, -202, 178, -19, -6, -151, 201, -146, -269, -124, -423, -156, -154, 131, 188, -23, -94, -179, 190, 145, 286, 405, 167, 113, 436, -54, -21, -370, -151, -174, -4, 369, 224, 564, 191, 101, -86, -29, 38, -192, -3, -193, -92, 307, -141, -61, 32, 87, 283, -141, -200, 68, -62, -24]
6261b4o2k24P03l33k1q0J67j63J12N6N0R0k85J47K08l8R9k78K63Ln24K34q1l30
6285c11L80K66j56p50N60n21L29Nj31P24l93r3O17P3l75l65J59J98o7P6j159J229
6307B95R8o07K10j5m9k72J06K85K38j290N78M07K26L48l00m96j24J001k53p8q48
6328e40N08N09o22J58N66n32R4m50lM30K23o87N91k35M20j58j03K01n61J84L61
6349C54k91m69L05o1l70J061r00J09K75p3N89n40K04n10K24J98J44m83R0K12k45
6370a77K21Q0l59K79oR7j39o4lL47k79J68j99k10L0K20P2j4kN8j08k3R5L4K3j86
6396d5J17o8J51k91M9L1J6K62k95j9K25J3k73P8P1J38o3k52K33Q1l57J17P7J38
6420A34k3l66N5R5J37q7J38j08K6j20j12J16K62l61r8N72j26j60K9J36n6j92J08
$$ y = [-24, -86, -310, 393, 60, 39, -41, 126, -37, 75, 131, 181, 271, -14, 133, 341, 303, 402, 124, 387, 390, -134, 100, 19, -311, 69, 335, 179, -571, -11, -532, -203, -198, -329, 395, 2, -91, 526, 599, 224, -141, 18, 216, 149, 225, -934, 295, 393, -214, -4, -19, -68, -340, -234, 51, 289, -1001, -423, -16, 210, 558, 258, -238, -362, 639, 386, 308, -540, -32, 477, -145, 13, 579, 47, 141, -309, -312, 118, 341, -346, 245, 10, 430, 272, 169, 370, -191, -7, 354, 63, -406, -101, -162, -532, 529, -371, -262, 13, -60, 529, -11, 193, -317, -93, 105, 249, -234, -144, 68, -177, 44, 124, -235, 44, 38, 135, -4, -68, -71, 276, -3, 165, -34, -244, -214, 6, 78, 64, 62, 120, 12, -11, 84, 118, 141, -45, 72, 4, 155, -136, -87, -56, -40, 222, -73, -92, 133, 146, -127, -49, 22, 160, 97, -155, 78, 159, -198, -81, -4, 134, 111, -255, -200, -105, 32, -55, 83, -25, 1, -119, -231, -115, 147, -214, -312, 260, 134, -26, 3, 139, 83, -109, -1]
6443aq1m9L69k84J51p1K2pJ53n1Q9p9j16q0M8k7l4J23J16kj07k47K03k06L23N2
6469B07k21J52n8j4m96M02Q3J60l86L64k85O3K7j04K3J7R2p2Q8J7M1k11o2j42
6493c15K63j5K7K4R6j04J20m6k05O74l88k84j60n5L78n1p9J64J21q0L3j46L88
6516C60j49j96j31K59m93N51l96J26k60P57n8m56L6l3k77K5M21o09R35o76J124
6537H60q71o1N74n49l60Q28l6m68k25M67l33r8K23k9M5J36N5j94j46o3K88l1O
6560A8R1p4O8l3j14j28K79j77O7L5j82J50l4J17Q1r6j79K73k05n1K63l9p0k09
6584a49P4K05j44J14j4k22Q0K66l44K30m1j91L25kj49K10l37M45m06R1m8l6N6
6607A3l27N33j40J68l91o2K47m52J67M63l89N3k33K49J81j12l4k24J97j03L90
$$ y = [-1, -82, -131, 238, -46, 105, 34, 56, 49, 202, 151, 240, 161, 45, -35, 13, -14, -48, 75, 191, 189, 82, -165, 38, -168, 155, 207, -14, 138, 80, 66, -430, -28, 55, 215, -171, 193, -92, -29, -2, -106, -83, -66, 26, -46, 42, 59, 100, -111, -173, -315, -52, -67, -40, -16, 80, -24, 96, 50, -155, 519, 131, -153, -313, -368, 10, -41, -120, 44, 165, 85, 118, -28, 360, 211, 15, -116, 143, -350, 201, -195, -69, -329, 428, 370, -86, -50, -83, -360, -335, 86, -523, 412, -264, 860, -11, -72, 502, -47, -407, 421, 385, -83, -308, 159, -174, -272, -49, -78, -33, 103, 158, -36, -182, -245, 43, 12, 18, 109, 35, 103, 70, -44, -172, 107, -70, -3, 32, -150, 0, -34, 83, 164, 68, -111, 162, -43, -94, 169, 130, 60, -149, -75, 130, -14, 100, 86, -136, -56, 210, -134, 96, 55, -136, 189, 187, 38, 248, -89, 356, -50, 41, -7, -43, 13, -314, 219, 79, 247, -144, -206, 41, -411, -244, 219, -170, -117, -350, -101, 80, -32, -66, -290, -93, -196, 194]
6628A94k26j1K07k84K73l9j83j39K48J41j33j59L05k09L0j9m3K33j20l01J65J61
6650I1j62K53l74J98m2J36q5J7k68K91J73l93J47K7p3r2K50m29K75J74r1J08j50
6673a9j7J07l8J19j11j46L46j57lq4J56Mm64M47M1k82K80n34P53n63J28L57l93
6696g3J58l74M22j10J50j89L1J56j45j21J07n1O7r8J40m1P8l9j5P0k27J64O8j6
6720A12M7o6l5j61J10J3QK33j90k70K17L64n52R4K31l9j28j82J91m5K20j62J57
6743A67N0l63Q7k04P7L13j74L41j77l14K81k13R0k63K73j5n3N4J02j6j18J35j19
6766e9J88J00k04j76J32J56j78l4j85J51R2m5K40mj95P5j90K8J47j42j7J05qK25
6790B02j73j51J50P3j11J87k80n0L20j24j40n1J42Q0K73k34p5J11j68r7L43k84
$$ y = [194, -32, -43, 164, -120, 153, 114, -69, -208, 40, 181, 48, -111, 194, -15, 15, -4, -47, 186, 66, -235, -70, 91, -71, 182, -192, 6, -36, 100, 15, 32, -236, 55, 228, -165, -18, 9, -64, -156, 94, -335, -60, 114, 23, 131, -19, -36, 71, 33, 152, 41, -105, 241, 84, 81, -3, 153, 157, -307, 140, 181, -101, 179, -355, 398, -165, -37, 320, -73, 85, -289, 133, 23, 173, -16, 15, 171, 26, -95, 12, -39, 28, -70, 70, 29, 107, 68, 53, 123, -104, 60, 128, 112, 159, 93, 58, -103, 7, 20, 28, 261, 71, -199, 18, 382, -170, -76, 155, 116, -12, -194, -3, -48, 172, 10, 167, 217, -146, -59, -263, -186, 127, -47, 294, 117, -197, 84, -129, -39, -302, -29, -44, -97, -43, 59, 43, -75, 60, -59, 129, 229, 25, -151, -19, 137, -41, -75, -260, -109, -17, -62, 178, 174, -21, 54, -136, -108, 39, -103, -120, -15, -23, 202, 29, -122, 28, 101, -10, 177, -103, -153, 167, 43, -97, -148, -6, 74, 347, 113, 38, 149, -19, -116, 227, -57]
6812e7lO2J10j86J78k62J85J60p6L19l11P9k10J9J54k6j68j09J40k4j5L26m65
6835a80K40K8k55J24M2m8J88J31k86l5K3J1J54j53j80M45Kpk65J12k77K41K7k29
6859a47M0J15q5J45K7o6N0k54L12n1J2N4n3j92p8lj34M60l55J35k43L13L4J92
6883B28k82n3K36k60J04j19K09k20K1p9J18P9K31j94N1K7P3p0j73J16l6J89k48
6906e2R5J34j12M0j74O1j19n2n9k23M40M8Q6j16J61k40K38m0l6p0K70l80J21P2
6930I3Q6j42Q5l59K85J94l67K77K4j31p5j4J18q5JM3j57P9k93K34L4J54N5k22
6954h3O8K11k20j80M39n5j18mj09P9j14R0J39j74M3L50k01j18k38J55J46k58J61
6977IN9J62j87j03O7j61L03j50o9R5k69K53n3J24PJ52k68o3K18r2K11l62M9L01
$$ y = [-57, -60, 2, 112, -74, 104, -158, 27, 187, 111, 430, 119, 198, -12, 7, 161, 135, -33, -142, -2, -26, -41, 285, -180, 60, 88, -167, -43, -1, -49, 139, 270, -16, -51, -28, -17, 137, -16, -196, 249, 251, 244, -21, 91, -186, 55, 82, -147, -107, 8, -77, 68, 95, 29, 79, -175, 137, 86, 98, 152, 99, -93, -171, -174, -308, 152, -203, -68, -311, 2, 36, 228, -54, -107, 129, -131, -27, -146, 63, -157, -136, -215, -97, -18, 213, 19, 70, 97, 170, 100, -73, 43, 7, 196, -52, 43, 177, 65, 105, -69, -8, -127, -179, -238, -461, -21, 27, 113, -3, 158, -82, 156, 116, 80, 10, 280, -100, 21, 93, 179, 37, 122, -237, 48, 242, -125, 152, 176, 45, -30, -44, 74, -11, -10, 33, -124, -45, -338, -104, -70, 84, 139, -83, -15, 196, -24, -204, 235, 180, 62, 58, -51, 28, -86, 4, 143, -31, 12, 362, 161, 43, -195, -40, 106, -152, 9, 68, 230, 43, -60, 7, -154, 149, -1, -70, 25, -244, 9, -44, 80, 87, 239, -29, -92, 126, 34, 245, -117, -68, 233]
7001B33k37n9K8J78k29J44j77OO5p2J99n5j48K0K74p1n2j6M8j8N4J42k02k6j81
7026a52L7K30O6k53N7j43L27j96M3K03k10R5j33j39P1o1J05K7J71k86L49k86K34
7049A56l87K43j24J55Jk42NJ82J83k80N0jJ25q0J93l09J84O6L6k23J19j49R6J45
7073A44k17P9k27L51j08R6k14J74p2J60j27J6M2j22L83k21k26N8nj6o2J27J54
7096A67k96j28K02r0K08Q3j10p3J40J63m71K95Qn6o0q9J03j74K03r5j6L80m00
7119a06L8p5P5p2K80j16J1j27J76K55l24r9k61J67K00k17J38p8jM3J06r7P6k69
7143b77J93p5J85Mk57J37J34o7J21l18K09j93N9J36J00o8k23K95p36j0R49o50
7165c52K93K22j62j62L58j16o8j85K05l7l8K8p6J40Kj47L40k35n9k7o3K31K8j51
$$ y = [233, -4, -63, -35, 143, -86, 58, -119, -113, -48, -120, 79, 24, -124, -104, 170, 99, 47, 31, 79, 61, 115, 257, 55, 29, -152, -115, 115, 181, -72, -15, -158, 169, -27, 16, 219, 9, 104, -29, -168, -97, -158, -53, -26, 145, -141, 208, -78, 156, -231, 12, -112, 43, 44, -198, -193, -11, 172, -108, -58, -59, 66, -14, 179, -130, 54, 120, 156, -67, 52, -97, -1, 144, -73, 6, -221, 130, 22, 118, -96, 78, 6, 166, 39, 55, 97, -25, 358, 137, -89, -31, -36, -52, -114, 13, 167, -129, -257, -55, -145, 63, 146, 36, -37, 103, 266, -205, 90, 98, 42, -18, -107, -4, -178, 25, -70, -86, 294, -106, -68, -143, -68, -140, 140, 24, 35, -92, 84, 339, 15, -84, -345, -178, 22, -195, -57, -135, -136, -93, 13, -84, -8, -277, -84, -159, 26, 30, -227, -90, 44, -23, 98, -220, -11, -204, -145, -9, 91, 23, -200, 95, -641, -651, 298, -352, -59, 163, 1, -161, 197, 81, 13, -172, 33, -4, -42, -14, -90, 50, 52, -95, 245, 10, -49, -76, -139, 92, 120, -31]
7189c1j68J33K51l02J03pL2j71J77K21k56j34M26l20K2Q9j51R5k66L15j07J01
7211E2j93m9J54r1J20L98m05R3L2M4k82P8k06K73m3j40J07J84k80L67p1j42j53
7234a53O0K44j10n8j49M0J93J67l67J51J33k13K93j88p3q0L2Q8j18K40j98m0N6
7257e0J13m7n17L24K82p5O0N6k91J38J68r6ql9o3m9K6QRJ9l0L49n52m5L30J3j2
7284B1k17K51k90K81k10J16Q9PK25J52n90L14j25n8J62j28Nk91N40j28j65j23
7306a62K71O7k61K0J85j12K6n4k2q6Q8J18P8l21M9R8pJ97l24L19j02j04N3k52
7330b38K82L2j68L21n1k72o1J64M5j05J8M1J62k50K36j82M0JJ94o9o6O3l65K82
7354E4J16j65J62m1k75R5K89k83M6L5j40pP8R4m07L37J37p8k9K56mk79J52j41
$$ y = [-31, -199, -66, 185, -117, -14, -21, 11, -160, 17, 238, -18, -152, 274, -46, -24, 65, -86, 9, -257, 58, -49, 52, -141, -190, -36, -127, -7, 391, -14, 79, 111, 155, -127, -49, -255, 18, -25, -165, -58, 126, -154, 213, 142, 0, -153, -93, 151, 41, -17, -166, -126, 67, 234, -133, 18, 151, -62, 231, 43, -30, -110, -78, 10, -108, 132, -66, -106, -50, 63, 16, -501, -177, 105, 30, 90, 146, -145, -7, 161, 65, 57, 18, -45, -94, -68, -60, -51, -32, -62, 287, -265, -310, 20, 33, 21, -196, 55, -235, 46, -164, -48, 41, 48, 273, 425, -165, 149, 24, -34, 128, 0, 5, -286, 254, 126, -39, -162, 109, 176, -85, -65, 120, 8, 34, -20, -42, -128, -40, 78, 156, -165, -116, -18, -25, 172, -152, 167, 65, -39, 14, -238, 44, 76, -92, 229, 178, -94, -155, 9, 54, -51, -33, 8, 170, -80, 156, -26, 14, 15, 209, 140, 74, 137, -228, 54, 170, 5, 167, 126, -149, -54, 235, -48, -2, 33, -107, -114, -36, 58, -349, -12, 125, 47, 18, 274, 270, -9, 143, 2]
7378Bj45Q0Q6J90k99J15M1j22J90j90J47j91m9J12j02K09J37m8k94K86j39K8J31
7401A75l06K54l3m69L24j26L49n1j27K01m24K06K0j9k77K62o0Q8k58K6L14k23
7423a54J46p1J7k2K61j95j2k83O39l41k42M78j10o4J4L2j29o7L1M2K9k75M04J0
7447A38k83J72j3J26j02j39L8J48r2K1O6j04o4J84k43J33L1Q1M3j1K1k86K62k19
7471i2J44j63J74qk65j0K1K94k24M16l22mKq3K33j08k25J54j8O9M3r8J90k04j08
7496a92j12K73J48j71o5L91l33k78K52R8J49j4m24L8J04J51k3PJ39q4j29M3kj8
7520e2J68p5r2J47l5j29No7K41j61K52k06j37J80K46l31k29L13P7j28k7k09M63
7543B14j50m8j55j9J20J2Q6j60K16J22l96K79J08k85K19k92J32M2j9j38N2P4j70
$$ y = [2, -143, -63, 23, 213, -86, 29, 70, -52, 138, -52, 95, -96, -145, -33, -135, 74, 211, 163, -131, 155, 16, 44, 175, -131, 123, 90, -379, -55, -181, 168, 117, -10, 191, -233, -27, -7, -26, -303, -41, -101, -13, -271, -245, 69, -154, -8, -79, -62, -84, 177, -18, -30, -313, 326, -15, -257, 221, 111, 47, 61, 93, -36, -103, -72, -30, -1, -276, 128, 138, -145, 27, 14, 140, 38, -101, -63, 85, -7, 14, 80, -24, -88, 96, -147, -14, 17, 98, 141, 130, 151, -135, 127, -92, 52, -111, 63, 55, -210, -220, -199, 95, -129, 287, -35, -39, -37, -120, 113, 5, -220, -66, -84, -15, 28, -70, 120, -84, -192, -304, -31, 117, -54, -119, 272, -61, -339, -87, 11, 160, 146, -278, -240, -136, 15, -8, -1, 138, 54, -75, -32, -34, -52, 116, 41, -51, 96, 61, -68, -63, -130, 111, -50, 202, -4, -141, 39, 285, -46, -275, 38, 115, -13, -40, -249, 214, 64, 16, -139, -158, -38, -26, 60, -100, 116, 238, -158, 121, 229, -56, 163, -129, 3, 45, 26, -112, -60, 14, -156]
7566a56J77j28O0J2m5O7J24k12K68k98m0L09ml13K01m3R1k17J72j33O1J10J48
7589B11j44j85L96k61p9j48J94mP8m6J48k20o4K22Nk59n5L48n8l84M16j08L07
7612C10j97J15j46o2j60M3J79l10K68j19K14J00j06k0j77L0J8K0oK3O7M1j34M
7636ej04J61j26N6m2l76M07J13j71L32n17K09J7J64k30J02K21k41k95N13j17l22
7658b51L21J5j67k69K71K1r9L07j26m3j20oQJ28qJ21Rl59J19M75l98o7L33k10
7682Ej9J19k8j10J24k69M42k79mj69K82n1j25R9o6j38J47N1J29J8k36K17k19p1
7706a51J23r9J28k73J33M20n48K39k03L09j3j74K92j00Q0n3k52K47k3r2J30R3
7728B13j74p7J60k15J96j54P0J53j77p9pJ03j55L89J6k67K7L8M2k57L72k04K46
$$ y = [-156, 21, -107, -47, -35, -80, -13, 111, -101, 167, -131, -171, 138, 134, -179, 22, -21, 70, -147, 25, -108, -47, 63, 211, 67, -118, 278, 17, -62, -210, -16, -20, 58, 12, 160, -60, -124, 98, 103, -156, -211, 137, 79, -305, 111, 3, 310, 113, 228, 82, 20, -140, -97, 82, -228, 40, -79, 135, 235, 129, 109, -68, -38, -20, 0, -6, 17, 84, 125, -9, -5, -109, 52, -74, -18, -60, -436, -29, 84, -87, 245, -272, -63, -46, 118, -112, -10, 211, -30, -325, 188, 71, -251, 70, 85, -82, -351, -80, -59, -158, 149, 23, -20, -140, -146, -138, -10, -18, 103, 112, -247, -128, 347, -51, -118, 215, 5, -14, 105, 77, -33, 91, -178, 264, -15, -19, -188, 94, 43, -82, 17, -49, -187, -40, 11, 140, 158, -78, 139, -80, -151, -28, -127, 1, -272, -139, 281, -267, -28, -231, 78, 65, -109, 183, 83, 163, 110, -142, 105, 82, -10, 120, 213, 39, -38, 122, -93, 103, -51, 19, 172, -5, -84, -91, 12, -143, 246, 262, -5, 22, 60, 102, -155, 217, 13, 259]
7751B59l03J81k21JN8l4J35J7L1j64j6N1j55J51J97j09q5k60L65n9k00j9L34k54
7775i9q1L43m2M8M8j95R3k68J95J53L2l74l9K22r6Lj29J59l5J00l24K95J8o9P3
7800C1J95k98J21j70J4L7K79l72J7M15l99J55j46P5J00j15J76j67K58n60J79N83
7822D08m04J12l16pL92j75K09J62m39L40o05Q3M48n29P81j7q41J08M96O20p51
7843G5k77J08k14L17m5L73o77Q54l20k21J33m92O90k99R6K95j88j98l44r0J044
7864F20p23J29l18m1j93J75M76K15n06K21j23K8k0J09l53K62Jk70L62j20O7k43
7886b45J099q48j05K74m9j73o89P48j584J320J99l95J454j092O60M59r29L09m29
7905a6J86p21L96J94P00m91k69J23m65L76J71j92j01l45Q04J14q71L81l12J046
$$ y = [259, -44, 137, -84, -83, -25, -59, 76, 93, 124, -40, -56, -5, -160, -9, 188, 79, -6, -266, 99, 40, -160, -179, 155, -99, -180, 163, 121, 169, 217, 22, 115, -153, 42, 195, 227, -147, -186, 36, -60, -57, -186, -27, -62, 38, -286, 9, 27, -42, 31, 226, -72, 49, -121, -107, -70, 209, -163, -146, 269, -130, 25, -121, -46, 54, -61, 115, -52, 206, -354, -175, 408, 4, 116, -200, -207, 185, 10, 219, 381, -58, 282, -323, -240, 208, -321, 460, 443, -398, -290, 206, 826, 75, -202, -94, -308, 9, -36, 337, -340, 514, 194, -27, 106, -386, 304, 5, 101, 396, 208, 10, -334, -424, 620, -103, 26, -292, -333, -526, -351, 125, 340, -166, 55, -68, -40, -60, 49, -304, -42, -41, -311, 51, -69, -2, -245, 854, 6, -99, 175, 126, -47, -736, 12, -1572, -252, -53, -448, 1006, -86, 574, 1033, 104, 413, -16, 170, -551, -155, 39, 739, 248, -21, 102, -363, 13, 184, -8, -109, -454, 350, 464, -407, -26, -338, 708]
7925G08j019P76j004Q51m58K59n59j14J398o53J82j91k43m65J167j20j137K06
7943d16J23j11K36M12j81j35J4Q39j462Q22J54m10J22j65R54o34k39N9J29o0K40
7964B91N1j053J380j32n79N28j22m82K6J71n7k2K71m54K34k24OK21J43l7m06L87
7986A41J68k94O6J7o2k90K99j01J22J9q0P5k8J30m28K51L79Nn10K12J76k09p8
8009b0q0K83j03j35K0j85k17L41L0K48o21N13l4K33l89L66j9K47o78Q4J72K76
8031C32m09k0M44m10M6L00o72j2N65J85J73j85J60l70R65j422l80J033j219J000
8051A04k16L02J35l15J77m18O0k8M58k49J13n12N07K96n38P42j230N8M42L80p79
8072e11M7Q62l17M08j06l92m84P78j80L5m37J74M65o28N09j06l46j58J90p1O12
$$ y = [708, -311, 465, -539, 312, -146, 113, -446, -560, 838, 185, 367, 176, -67, -532, 635, 515, -622, -416, -293, -404, -168, 244, 63, -72, -58, 781, -681, 141, 295, -115, 7, -158, 796, 162, -77, -18, 111, 51, 291, 342, -711, 669, 537, -42, 486, 364, -118, -92, 79, 22, 0, 271, -183, 51, -173, -167, 54, 197, 160, -246, 141, 309, 15, 81, 98, 36, -254, 45, -56, 66, 85, 5, 80, 52, 182, -246, 5, 384, 389, -121, 91, 267, 58, -20, -100, 183, 80, -55, -35, -220, -437, -96, -66, 182, -439, 74, 40, 273, -116, 250, 231, 478, -200, -116, 56, 332, -77, -97, 347, -63, -17, 283, -389, -401, 164, 349, 522, 337, 497, 127, 1092, -330, -710, 323, -896, 104, -112, 190, 325, 10, 187, -231, -171, -199, 259, 10, 123, -389, 118, 414, -124, 618, -612, -554, -112, 268, -511, -464, 398, 81, 489, 383, -9, -493, 285, 105, 140, -297, -123, 342, -286, 223, 117, -229, -387, -197, -268, 344]
8093C44p22O17n09l7L94l05K87L78J06m72K11q02J64J84K40n38K28K06l57K0O20
8114B57p72L60P18j17j1p71J95j98K81j24N11n39O5J70M16m76k86K37J88k02j00
8135a98J55j40Q76n90l51m21M88j74K45J78K82l99L18o13M15P93o81m44K80J68
8155A87m40N23l76N8M7P1j58l5K30j80K92j46M9n6j57m0K24l03R5J77n2N9q0K
8179i%J97n80M41K1l5m1J42m5m9k09J23
$$ y = [344, -378, 239, -270, -307, 87, -218, 69, 447, 553, 81, 292, -510, -346, -162, 78, -460, -232, -26, -383, -363, 257, -515, -155, 563, 446, 435, -336, -141, -339, -58, -182, 329, -210, -145, 25, 441, -35, -321, -84, 104, -98, -198, -43, -183, 693, 103, -248, -669, -181, -355, -110, 68, 350, -49, 269, -344, 71, 864, 183, -261, 19, 187, -253, 270, -106, -48, -1, 70, -88, -123, 107, -73, 219, 73, 122, 66, -91, -131, 93, -210, -115, 62, 10, 69, -11, -9, -9, 188, -392, 49, 70, 35, -6, 136, 91, 42, -167, -44]
8191d4
$$ Imaginary data points
##PAGE= N=2
##DATA TABLE= (X++(I..I)), XYDATA
0@%%%%%%%%%%qJ6j6J6j6K4l2M0m8N6p2Q8j04J20j37J61j92K24k56K93l35L81m35
33b32M94n58O29p07P93q88R92j105J228j363J510j671J848k042K252k482K734
50A432l011L319l658M034m456M931n468O082o791P624q619R828j1336J3281j5898
65h706J9633k5441L5819o0162K30447K04068j27859R724j38951j30330n3378K3931
77b1205p0463l1961M2095L5615m9366P950M8977L374l5192M4758N5923m743j6191
90I571L6453Q30m6046o656M9942J3807o507K8703K5075m2572m7294n045j3482
103c221m7802j6515J5089j6669l4920R743K8568J312Q388M6841L1621n232O631
116B3834K4373p221k7558j857N406k1207j4672J8252J2835j0288J874J5642p284
$$ y = [0, 0, 0, 0, 0, 0, 0, 0, 0, 0, 0, -8, 8, -8, 8, -8, 16, -16, 24, -24, 32, -40, 48, -56, 64, -73, 88, -104, 120, -136, 157, -178, 203, -232, 262, -296, 333, -374, 419, -469, 523, -582, 646, -717, 793, -878, 970, -1072, 1180, -1302, 1432, -1579, 1740, -1918, 2116, -2340, 2591, -2877, 3205, -3586, 4038, -4581, 5247, -6089, 7192, -8706, 10927, -14514, 21305, -38857, 191590, 395658, 267799, 277523, 138572, 8242, -45136, -21205, -91668, -123629, -81534, -45919, -95285, -87335, -38358, -34984, -70176, -25418, 30505, 25762, 9571, 46024, 46854, 808, -5848, 44094, 57901, 51394, 80097, 105172, 62600, 15306, 10261, -3221, -51023, -67538, -52449, -69118, -104038, -94295, -65727, -64415, -56027, -9186, 22435, 17203, 23834, 48207, 40986, 13428, 11571, 16977, -4230, -18902, -650, 12185, 1897, 3771, 19413, 12129]
129A2129k0233J954P417j3674j1399Q505J068j4505Q54J7933N310j599J4101J5141
143B3002l533l875R546J406j2683n440K539q483j2919K218P640k432n74J0219
157F631M470o952j904L839m377r218O44L615l827k354P120N050k978J148N948
172F855l38m366J769L464l544l805J554N81n479j025M280K41l067J800K344l123
188a859l418J809J051l334j63K672J16k555J870L703j42o04L505K134j850m48
204B487K277j112k958m88R35j940j855J577J059j682j88J422m28k118Q07J751
220d54p10n63J874J461q05J13K068K67q59J83J177j464j329M66j71j376r19P19
238c22l55j201N22P17j99k46O89N34n97k14J160r8o75O00N84m80l13P34N25p82
$$ y = [12129, -8104, -6150, 1267, -12407, -23806, -15301, -14233, -28738, -27884, -9951, -4641, -6240, 7861, 23002, 19469, 15594, 25140, 26546, 13863, 8423, 10962, 2479, -10440, -8222, -582, -3014, -3588, 6631, 11101, 4149, 2245, 6084, 1707, -7511, -6867, -3252, -7079, -9433, -2313, 2737, -241, 907, 6855, 6517, 2151, 3920, 7384, 3840, 35, 1589, 2170, -3309, -4334, -54, 187, -2880, -1080, 1264, -1859, -5277, -3468, -2417, -5751, -5914, -3242, -3126, -5681, -3811, -108, -250, -854, 2651, 4785, 2935, 2487, 4764, 3652, 694, 206, 1141, -799, -2654, -1077, -18, -1700, -1888, -466, -894, -3012, -2205, -454, -1164, -1727, 147, 1608, 803, 916, 2984, 3251, 2392, 2575, 3752, 2288, 959, 1425, 1254, -122, -1041, -322, -677, -1878, -1356, -639, -838, -1084, -395, 139, -458, -672, 488, 390, -285, 315, 899, 419, 106, 840, 1365, 583]
258E83m54K14l53q49j59K22j77m73O31O23l08j11O46Q9l21m5N95l20n31M55j65
279b08L3k34M99J58Mj50M41j70m34J32K89k72k79J21k2j66K97K39l2j95j22K19
301A48K90o18P1Jj64P9M51l98N3J08L35j32L0K30j10j15j96L08m41M8O7M6l21
324b30j09K80n9l4Qlp9K43k50M06k28n8K91j14K16j43J77l2O6k22J6j2l49K90
348G1m4k21J73Jr5k87L1N08Q5k39N8P8r9j25J45J4L38n44L82J01m5m22J83J5l88
373c26M01k11J72j69L67l49n7j24M50o1n5m0P2P3j60j4K10j41L2Rj55j8L75k23
397E8j82L53l20QJ35p8j21O3k52N45k30o3p6O3P7m6M1K38k08q0L7k6K65r5j83
422g7K51k71L20j02Qj30Q1j67J67j17qM3j58J72k50J74oJ10j67J65l4j72q6L25
$$ y = [583, 129, 343, -10, -859, -1018, -796, -973, -1446, -815, -192, -500, -611, 35, 124, -197, -242, 353, 33, -498, -43, -208, -175, -409, 90, 248, 252, 102, 543, 373, -61, 71, 360, 88, -191, -70, -92, -258, 39, 278, 246, 51, -71, 148, 438, -180, -109, -108, -272, -193, 258, -140, -87, 21, 356, 224, 254, 484, 374, 259, 63, 371, -70, -22, 45, 91, -230, -339, -59, -118, -152, -144, -147, -226, 17, -233, 173, -55, -113, 178, 64, 280, 137, 314, 282, 348, 126, 142, 130, -219, 71, 27, -194, -21, -20, -115, -402, -371, 137, 222, -17, 41, 119, 20, -105, 40, 54, 392, -152, 230, 331, 286, -136, 47, 62, -326, 75, -136, 36, -133, 234, -115, -172, -296, 154, 93, 38, -2, 70, 143, -17, -31, 179, 38, 70, 79, -76, -94, 281, 58, -124, 229, -91, -83, 52, -26, -147, -84, -336, 209, -21, -84, -160, -97, -20, -66, -25, 213, 5, -75, -38, -64, 201, 106, -77, 174, -97, 223, 121, 129, -1, 80, -87, 80, -37, -45, -2, -160, 12, -238, -64, -70, 40, -127, 38, 4, -168, -254, 71]
446G1P7q0jj38N1M1k36P4J3J71q9M5J3l64K91J97k32J03M2j20k22K17n2j13K3
471b18K74j21Lo0k65M90j87L5q2J68j18K20J06k59q2L36j62j02J3J57j74L5k65
494b58J47l5R2R7j65K19j99K8n3K03r3J76j16P9p9N1j6m5M6P1j88rP5k38J78l8
520g0M7J12k98K64Jk47J30K55j94k10L10r4l1j04%K2L25j92J17l32J45pr5M40
544B94m43K67q3j61L26l80K59l07J75J43J45j65J01l1M4r8J50m06J88q5pj8p4
567a66K7J26J5J9N9P8l39K70L12o72L37J63K7j46mp0nj05J24k68J18J71N0l29
591b08K18L7o6K69j22j08j24J05j66K69n53L68j69k5K37o7K47m07J30K50l18k77
613d80O27l17K24j84j7J77j6p9J86j63J73l04J26J23j86L22l05K27j87k17J45
$$ y = [71, 148, 68, 67, -71, -20, 21, -215, -141, -128, 43, -46, -1, 12, -352, -61, 136, -96, 7, 49, -71, -293, -76, -128, -241, -218, 56, -65, -62, -122, -387, 103, -84, -49, -131, 37, -81, 139, 245, -14, -96, 240, 78, -24, -11, 146, -28, 7, -258, -111, -146, -54, 43, -122, 97, -102, -74, -127, 76, -17, 159, 43, 122, 43, 94, 78, 33, 79, 150, -38, -47, 28, -210, -32, -70, -23, 89, -209, 55, 56, -191, -61, 194, 0, -210, 100, 6, -25, -129, -129, -107, 218, 26, 143, -189, -44, -51, -146, 294, -149, 118, 35, -126, 200, -180, 79, -228, -53, 90, 235, 70, 171, 140, 184, 86, 236, -170, 18, -67, -74, -92, -166, -139, -13, 2, 21, 80, 158, -181, 89, 401, -271, 66, 229, 256, 110, 106, 36, 31, -74, 50, -218, -100, 71, 121, -208, 10, 47, -19, 250, 128, 20, -104, 1, -165, 104, -449, -81, -250, -275, -38, -105, 142, -265, -135, 115, -203, -480, 147, -170, 54, -130, -147, 30, 14, -65, 121, -42, 131, -173, -47, 76, -110, 212, -93, 134, -53, -270, -125]
634a25j5j92O01l17K06j18Q6k35J39k07Q3l5O9n0J85j20M8N8j74L34k11nR7k3
658G9j73J22J98o7k3q9M9M7m63L58j26K01J17k62j85O07m79l3r0k92M50J15k80
681b19l16N33J22K35n04l42Q7N56L51k78J26k04k53J10O5mr5j84M19l74M16m37
703a90M14k83O2M7j84P09M9j009N46r0j27J82n19K44m0L93l02L19k26j4j17Kj64
726b98L92q40P16p5M04j6n58P3L06p1j91L91p6Jl85j13P18n68N04j97k85J11O53
749E96k38n92K58m35L63k24J18K31j23j08J40j05Q6N6j40L29j9l89K93J4k11j57
771b57K92r7L9p7L20j35k76L56j89J80k19K39j02%L5r4L7K9k0j43J51J84n21K88
795B0oq5J40M6o2j60n8O9J85m8k52J32J51P1p8J0j36M4K06L3j15j11m7J11l3o
$$ y = [-125, -140, -332, 269, -48, 158, 40, 126, -109, 30, -177, -94, -129, -60, -110, 75, -45, 3, 61, -113, 221, 10, 5, 102, 79, -94, 28, 226, 159, 136, 47, 96, 143, -320, 38, -88, 113, 230, -32, -217, 390, -89, -122, -212, -504, -54, 61, -219, -535, -2, 120, 355, -149, -491, -404, 152, 503, 225, 351, 147, -106, 4, 69, 65, -30, -214, 205, -169, 247, -190, 224, -59, 3, 50, -134, 575, 624, -385, 161, 71, -56, 126, -393, -149, -189, 204, -98, 221, -5, -19, -136, -134, -298, 94, -746, -30, -105, 299, 283, -275, -202, 104, 33, -158, 233, 157, 158, -227, -340, 378, -190, 314, 117, -168, -57, 596, 358, -234, 24, -411, -48, -272, -154, 77, -46, -154, -14, -119, -33, 23, -117, 212, 193, -196, 97, 111, -100, -257, 35, -62, -23, -100, 220, 85, -191, 165, -24, 156, -63, 176, 74, 74, 109, 15, 52, 81, 61, -82, 69, 253, -268, 20, 14, -71, 69, 115, 53, -107, -165, -96, 89, 41, -211, -79, 72, 143, 65, 75, -61, -17, 189, 222, 107, -4, -51, 60, 27, 21]
821B1j50n3N7L53k28mJ53N2j24j49J10J71j35P2j69K2J3O0q8J37J5l67J55Q3L5
846D2jk18J49J17j45k2m2J40L19k40r1N5k43J53NN7%j49J24J45j11j10K63J17
870C14k69J14j81p6J20p4J93P1k43K33l13K8J23j09M9J35q6m2L6L3q2N5J14r2
894E1p3J44L2j40k25K24k24K45P2k51K64k30L88l82J03J04j57J15l2o4J49k3k12
917a22K38k09n3M2J9K91j17j90J40k12L28j70p2J89k40R7M3L02l13L40n1m45K24
940E9l28J51j19K92k81L55l55J15k3R5K40m2r3j09J30q8m2j8J63m4j63P3L6J44
964A48j68K9O7r4j77L6L02m4o7P5Kj23K34l73J30j36J38O6Q2Q4r5p2k6r9k7L8
990g0K73k52K02Q0mj83q6J27P8j94J40j61K2m5M4Q2j01P2k7J58k18r6j9JK03Q
$$ y = [21, -129, -182, -125, 228, 0, -4, 149, 201, 77, -72, 38, 209, 74, 146, -23, -1, 12, 72, -16, 121, 136, -231, -76, 7, 42, 41, -177, -28, 89, -56, -78, -120, 20, 339, 99, 8, 63, -180, -27, -22, 35, 35, -114, 10, 155, 44, -66, 197, 314, 45, 159, -22, -98, 22, -52, 141, 212, -31, 202, -111, -83, 40, -69, -20, 115, 29, -13, 23, 56, -26, 29, 143, 51, -22, 122, 154, 14, -211, 13, -211, 34, 106, -145, 119, -111, 277, -105, -2, 102, -55, 60, 28, -36, 113, 90, -122, 116, -93, -146, -104, -85, 206, 89, -101, 39, -173, 155, -15, -87, 102, -138, -41, 2, 304, -9, 331, 280, -165, 59, -269, -118, -237, 55, -226, 129, -226, -111, -134, -39, 201, 159, 66, -43, 87, -1, -43, -61, 102, 58, -105, -32, 4, 148, -20, 9, 76, -18, -195, -159, 143, 99, 32, 107, 109, -14, 220, -153, -23, -159, -21, 45, 127, 211, 116, 44, 18, -81, -108, -70, 203, -49, 153, 233, 229, 46, -40, 87, 165, -29, 111, -50, -28, -73, -29, 53, -48, 24, -3, 155, -63, -159, -178, -177, 26, 34]
1016C4M3k11J54k16K7L5J33J96l69K17l38K93R6P9l52K0J63l3J36J46P8k24l34
1039b27K45RR5p8j03J3J51L2j50J43n5M5r1o9n5J63j85J79l11Q3k6M31n49N12
1063B02j80Mm0j16O5jL15k93N5J05j42k16O21k51j22j20J24j18L03l05O7J39j31
1086c5j34k3P9K84k52K9J77j21j23M23n37K65j11O7N8l6J66k18J98l58J14o4L53
1109B01m9j25j14ML3j81K14J83L6l23N7r1K29J4o7J1j73J70r9K26k20J33L0J81
1133B80k21j10M2J42j86R7J23j80K07l98J9M09n1j29j79j01K55M2K6j61N1J99
1155A76k55n5K62rK17k73kk5o7l8p0R4j17J99Jj29l4QJ77Q1k22K22j89m3O6J22
1181I7k69k3Q5J15Lj24J35r5J18k92K22J07K07l79j02R0K2ll3L64l74J28j44J94
$$ y = [34, 77, -134, 20, -196, -169, -134, -1, 195, -174, 43, -295, -2, 94, 173, -179, -159, 4, -29, 107, 253, 331, 107, -227, 18, 27, 122, 44, -59, -46, 105, 137, -13, 130, 75, 120, 29, -40, -95, 68, -117, 62, -249, -166, -192, 239, -310, 202, 22, 26, -14, -130, -65, -66, 249, -44, 11, 116, -26, -242, 379, 128, 6, -114, 10, -108, 195, -110, -43, 96, -35, -169, -192, -113, 171, -81, -52, 125, 4, -119, 304, -233, 32, -79, -12, 46, 10, 176, -42, 156, -202, -88, -152, 201, 152, 27, -87, -83, -50, -231, -17, 166, 202, -121, -64, -155, 74, 88, 21, 32, -141, 29, -70, 156, -64, 69, 99, 280, 59, -51, -9, 133, -53, 44, 167, -13, 194, -204, -185, 224, 173, 44, -135, -236, 19, 61, 87, -74, -23, 176, -79, -134, 128, 119, 336, 63, 61, 36, -31, -69, -139, -45, -162, 37, 38, -91, -125, -117, 60, 141, -81, 141, -48, -91, -25, 97, -172, -195, -110, 5, 8, -116, 19, -76, 42, -250, -28, 79, 286, -93, -195, -105, -83, -86, -119, 245, -129, -1, -145, 49]
1205D9qlr6K20k35J94l93J31J89J33k21j20K85k49Q6m02L86OR1K2p8r7J22j90
1229a78K69j04k0j85R4J99j05j7r3P2j04L13k76J64P5m4j4P9k31k2J50K5ml7J42
1254A48l05Q4J25J7k23j05J04L93k36J2J0MJ67j62J31j79m5O8J06k09J93J12k39
1277b9j45j20R1J07K12k65K7K48o5O9j58M4J1J21j36o4L38l72J68l14P0J72J75
1300A85j46K47j08j23J8m1J02j89J56k38K94l78K95K7k38R3J21k59L45n9k50o4
1322b10M08k58J7j73J14o5O2q7K52k15O8J32K6Jj24J85o3Q4K5k20j6j10L95k66
1346c8M31o02L10l74P3K00M4mj19n21L16k8K30K41k74O87o91K25M7L64q03k4K16
1369i4J43j09J84j39j29J9J84j62pK92O2M0j82l28K33j10K02m3j32J23J23L6j3
$$ y = [49, 41, 38, -58, 162, -73, 121, -272, -141, 48, 181, -40, -160, 125, -124, -38, -440, -54, -48, 43, 65, -13, -110, 12, -178, 91, -13, -33, -218, -124, 75, -30, -47, -140, -68, -172, 141, -135, 29, 104, 60, 46, 125, -106, -128, 22, 47, 43, 6, 148, -157, -73, 52, 69, -154, -259, -155, 238, 2, 14, 24, 28, 195, 33, 164, -15, -60, 8, 114, -95, 98, 210, -29, -174, -294, -203, -96, 116, -149, -122, 126, 61, 130, -28, 16, 27, 148, 12, -52, 286, -86, 82, -232, -162, 10, 185, 39, 286, 178, 55, 73, 32, 134, -55, 101, -137, 157, -221, 74, 101, -137, -44, 77, -182, 163, 104, -146, -210, 198, -60, -43, -216, -102, -167, -105, -192, 60, -155, -87, 45, 71, 72, -52, 133, 70, 154, 179, -41, -57, -167, 228, -38, 393, -209, 101, -273, -200, 0, 44, 40, -79, -600, -284, -312, -82, 159, -115, 572, -119, 106, 153, 517, -286, -310, -94, 49, -60, 124, -15, -144, -125, 59, -103, -110, 182, 244, 284, 102, -226, 7, -103, 99, 56, -76, 47, 170, 206, 193]
1392A93j39k35P9M9K92m71K07j14Q6R9K4J0j09M5M6j9M9l06L01k7rM7J1l6j96
1417a23Q0R1Rj39j47K16P2O2j76j88j23K64mJ90J5l16M87l03q0K06q9jj00p0L65
1442A98l66L23j6k12j55K90m3n0j1J23%j20k5rJ3k48J71R9j42L54j05q8K3j21
1466a17K58mj67J85k37R6j36J2M4J16q1L9J81l20K74k71m7J95p6M56k55k76J57
1489B6R5p3m8r0Q8k0j69N1J18k51oL30j43K22q2J5r2l4L18k62N3J21j86J54k00
1514f5J66j12k56K33J7K22ok32m7R2J39k58m1R9J59q5j77J32k07J72j26M65l24
1537d0P7K5K9j74N0L04k90J70L2l11J43J56o5r0K02j97j08J61k40L09j96R2k2
1560A7J29j9j8n3j26K10k46j30m8L79j07M5R0j38j96K03J4J25N6p6Nj11kj81M11
$$ y = [193, 54, -181, -102, -53, 239, -232, -25, -139, -53, 46, 70, 80, -29, 16, 62, 43, 92, -214, 87, 60, 51, 98, 109, 73, -123, -43, 48, 57, -82, -229, -13, 59, 121, -55, -243, -366, -102, -106, 84, 99, -217, 270, -33, -113, 93, 4, 3, -97, -167, 198, -168, 155, 139, -73, -228, 62, 19, -31, -42, 81, 81, -39, -64, -73, -60, -308, -137, -38, -180, 174, 69, -19, 4, -117, 141, 137, -30, 155, -82, 14, -122, -110, -66, 50, -31, 8, 189, -131, 143, -128, -175, 20, -56, 400, 145, -131, 26, 121, 48, 0, -90, -2, -22, -191, -140, -22, -273, -279, 51, -92, 130, 48, 63, -29, -63, 255, -7, 46, 167, -19, 135, -65, 101, -11, -267, -34, -17, 205, 199, -33, -80, 12, 151, -107, -148, -49, 110, 25, -152, -20, -227, -55, -181, 284, -40, 37, 62, 91, -83, -33, 271, -19, 151, 183, -128, 15, 171, 106, 16, 218, 21, -87, 74, -166, 143, -53, 39, 17, 146, 127, 109, 56, -70, 140, -106, -236, -284, 95, -12, 33, 123, -15, -211, -8, 6, 131, 187, 111, 116, 5, 3, -178, 233]
1585B33l06J49J6J77p9k10J00M2k02M58m44K42j63j12Q3J77l51L8N1K01j91J81
1607I0P3l19L40j78r9P8M6j17L3J08j6J39k05j52L2J00K07r6J23k06j5K26j65
1630B7j11J45%J6k04j69Q0K12j0K03k45rR3J25j35J83p2K47n08M7j26L25k04p6
1654a66L0K65j01k95L03J15l43M69l48M09k56k85J68L5N8M7P2pl5j83J41j86K20
1677A27q8l0J27L8j19J4k95L02J21k21L8K84o08L71k22K00N0j00Q1L3p6o2j04
1700a39K48P5l17L37J4j30P7M3l39K8K23j38k14N4J46L10j27j11j9l9j26J24r6
1723a16J00Q2O2M8j63k22J45J3J79j29O3jj49K86l05P0lK51j88j4k02L23M1l60
1747a89K97j40q6k72P24k83K2K3m7om8j9j01J12J20o4K43k85J02K0k84J67j34
$$ y = [233, -73, 76, 92, 269, 190, -20, 80, 122, -80, 378, -66, 176, 13, -99, -16, 161, -190, -152, -101, 100, -91, 90, 163, -156, 184, 6, -93, -15, 31, -86, -53, 55, 39, 178, -27, -179, -147, -47, 160, 64, 187, -19, -34, 192, 27, -84, 61, 61, 77, -127, -296, -216, -4, -14, 189, -56, -65, 28, 153, 18, 201, 129, 376, -132, -85, -211, 114, -90, -166, -136, 129, 28, -267, 36, 151, -192, 277, -71, 338, 82, -203, -35, 0, 58, 105, 177, 170, 135, -48, 93, -93, 127, 39, 9, 136, 174, 55, 69, -226, 76, 197, -24, 14, 298, -310, 61, -161, 39, 89, -11, 70, 103, 27, -35, -139, 109, 184, -133, 204, 218, 88, 165, 208, -131, -103, 120, -18, -232, -178, -32, 278, 151, 40, 21, -18, -144, -20, -116, -16, 66, 128, 176, 13, -209, -64, -51, 128, -1, 62, 61, -88, 198, -107, -37, -40, 211, 23, 9, -193, 130, 171, -189, 108, -32, -118, -390, 334, 51, 73, 96, 49, 43, -5, -24, -125, -13, 107, 43, 286, 1, 103, 123, -161, 6, -128]
1770a28K07%j00N6J50j09J82j72o8M4o6N7J0q4k1J10O7Jj26K36l28l4M8k02J70
1795a00J82jo9Jr6J94J04m01J75Q6j44O9o7J76n7J5m3j66K96j06j64m8L90j29
1819I7j43j6M8m4j77K55j42J87o4O7P9m6k58K32O5k93J35L5k1J24M6m3J37n10
1843b50J63J61J55k97O6K11j41L2m51N61Q9k48Q3r8l11PO08m86l5K79q6K11l73
1866a50J47k0q1M6N6o5J52K7k43q7K41j50JR5l1J22j3q5l30O40j12j00J60l32
1890a12J44j81J06o9Qj28L52l01K54j30j65mJ33J65J30l43K44k60M36k74J91n5
1912A41J10l29R0p3J80n1j43J36j49J06k24L10j21j63M7R3K32p3j62J59k26J09
1934aJ10l09J59n0n6K06j10L53m53J28J85R6k85L5L86l43j27K11m33K08J04p5
$$ y = [-128, 79, 79, -21, 35, 185, 76, 258, 86, 18, 62, -4, 53, 63, -21, -42, 68, 135, 136, 10, 246, -82, -116, -68, -270, -100, 82, 81, 12, 13, -83, 111, 215, -186, -11, 75, -69, 0, -67, 109, 52, 67, 24, -142, 154, 48, -116, -164, 226, 97, -46, -62, -14, -58, -235, 20, -122, 65, 1, 68, 147, 101, -157, 75, 140, -153, -18, 17, -4, 120, 166, 123, 260, -250, -87, 74, 229, -68, -2, 209, 68, 100, -351, 210, 299, 51, 134, 36, -275, -268, 340, -146, -181, 98, 12, 223, -150, -3, -23, -104, -58, -2, -67, 85, 112, -131, -218, 23, -127, -126, -31, -62, 60, 47, -38, -368, 272, 160, 60, 220, -112, 32, -149, -43, -112, -104, -232, 120, -181, 73, -57, -222, -226, -93, 72, 202, -141, 103, -157, 279, 5, 196, 141, 251, -78, 12, -61, 119, 68, -75, 61, -88, 18, -206, 104, -17, -180, -133, -40, 192, 119, -43, 116, -110, -1, 109, -200, -41, -91, -147, 59, -51, 302, -151, -23, 162, 258, -27, 8, 394, 51, -76, 135, -298, -90, 14, -61]
1956f1J29M4k68K31J9j21N0l05K25m3J1L0K06m0k39P8K8j16j11L3N41m85K30J05
1980A71r8pj03L5m7k08M80k08j22L26j76M8J53k87k00J02J26n6k07L07j30R8M9
2003D6l0j40L17l7l29L10k54P7j81J99q1J77j3j21O8j29J9k31M18j29m9P1l17
2026c39N39J4j9m08K08J54L4j28J0p4K9q5L1J08l0p7m5q2Q7k3p3MJ7K61j35L8
2052A6j70J64l5J54l06L81l7k32J23k05K55j33J55l11L84k59PK72k53rK29j84
2074Fl00K70J65L1m00L18l3J2j9r5J88N9k94J05J42k2j42k01J67L9J04k75J75
2097@k17K33J57l86K44m7J75l67J23k25N50k49J53k61M1O2qJ04j67K70j96MO8
2120F1p7j58J03k5j23L76k0l2L2j75K7K06j81Q7J15k62l5j04J46q1J26k51L87
$$ y = [-61, 68, 112, -156, 75, 94, -27, 23, -282, -57, -100, -89, -59, 147, 107, -132, -54, -26, -142, -253, -220, 321, -164, 66, 171, 73, 66, -37, -2, -49, -257, 223, 15, -107, 219, 43, 91, 244, -43, -243, -141, -15, -71, -278, 29, -101, -3, 46, 16, -124, 193, 156, -173, 137, -117, -40, -221, -22, -103, 74, 61, -60, 8, -121, -102, -333, 85, -44, -93, -22, -339, 200, 214, 195, -213, -5, 149, 183, 55, 65, -9, 20, -65, -34, 74, 44, -33, -78, -160, -73, -96, -169, -165, -148, 113, -22, 16, -154, 10, -25, 129, -177, 204, 167, -65, 58, -147, 108, -25, 130, -181, 203, -56, -49, 223, -30, -39, 190, 6, -294, -24, 141, 172, -228, 90, 57, 69, 50, -45, 143, 202, -92, 13, 155, 133, -9, -210, -43, -4, 100, -175, 0, -217, 16, 173, -213, 31, -16, 159, -208, -85, -310, 240, -9, 144, -117, -76, -14, -22, 82, -85, 185, -11, -7, 61, -16, -174, -71, -96, -219, 157, 137, 105, 137, -38, -11, 195, 14, 101, 216, -46, -81, -185, -39, -120, 6, -245, 142]
2143A42j50j4Q4k94K82L1k63J29j86J39PK31j17j31L39j67M6k91J56J81j61M4
2165C7j21J96k18J76j5J1%M5m51J73O5l7P5K42k38j52R9m4K34j4J01k92J13R0
2189G5ok72K23j6q2J2j49K50k48K81j64P6J24k36L6K34l64mK76l61L58o9J67l2
2213A09j14J74l27K17j27q4J52n3J49ok4N1K1q1m1j49P1m3p6J07j4k2K99k88N1
2238d8K24N7j45j6p5L84m91J32n3J88k25J30l43K81M40n12q7M7J6L79j65j00J68
2261A86M5l22K5k62M32J49l71Q9K24k70k06P01n20J65j24lJ28L06l58K22k96R1
2283C1J10j22j84l7J33N5R0r4O7p1k30K93Q2J09k21j79p7K9J95J01m4p4l15K08
2307a45K84l35L48k78N8j22M4P7K93q9j54j47J47Q3Jk63J74j33K05j05K99j74
$$ y = [142, -8, -22, 62, -232, 50, 81, -182, -53, -239, -100, -93, 138, 21, -110, 229, 62, 108, -183, -27, 154, -7, 37, -84, 112, -106, 70, 55, 66, 66, 111, -340, -167, -102, -139, -64, 178, -60, -212, -113, -157, 77, 63, 164, -128, -15, 75, 69, -203, 20, 4, -78, -66, -215, 35, -213, 68, -96, -20, 104, -132, -96, 138, -226, -230, 46, -315, 43, -26, 141, 109, -5, 169, -158, 59, -68, -152, 0, -53, 96, 90, 66, 117, 138, 57, 16, -133, -62, -105, -181, -74, -88, -110, 189, -99, -48, 176, 233, 88, 72, -3, 381, -110, 22, -31, 157, -68, 62, -281, 0, 440, -72, -159, -112, -96, 283, 118, 18, 186, 231, -91, -66, -328, 104, 253, -118, -29, 195, -75, -281, 420, -100, 65, -59, -62, 66, 372, 14, 236, -60, 31, 141, 19, -165, -202, -69, -14, 76, -18, 49, -22, -252, 41, 123, 232, 11, -168, -245, -216, -21, 80, 36, -38, -353, -145, 139, -196, 152, -126, -68, -190, -146, -69, 224, 135, -19, -166, -19, 64, 65, -198, -24, -157, 48, -57, 242, 68]
2329F8j1K21l10qj09J65P0j28qR0j2j79K32j81OM1K5J33l58N81l18j2j80K59k15
2354a38Q2o9L49l39Q3o7K3j22K00J32m5n9k8j24J20K0q6K17j18M7j48J76q4m85
2378d63O68j64l34P9k69P04K22m06m13R67p71N17l86j69N06r6M74p14N08r20J24
2399c36K87m00R22l56N1l07J19P9o3N9o9K97k28q4o2q5K49j40J05j15J62k12K31
2422A04Ll55L83o6m02K5K67k61L32r2J03M2l35K85j37l5M42k61o6R1j16Q7J0j53
2446a05J77R2j64k33M75l04J71k05J19J2L4M1j64J64J27k79o0j27L02k4j80J87
2468E6j50J38J69k73L1q3K59j45M5j70L68O9l92O0k0O0j82J76n5K15k34L71k65
2491D8n3J09k30K58k30K32j40L7k4kj41M18l28k4R6k8J07J28j76J44r3k84K71
$$ y = [68, 57, 278, -32, -40, -149, 16, 86, -42, -50, 40, 28, -151, 81, -100, -94, -53, -28, 105, -253, 328, 10, -2, -182, 77, -138, -56, -125, 224, -115, -32, -99, -76, -198, 2, 134, 89, 30, 2, -122, -2, 18, -68, 149, 31, 78, -70, 106, 22, -463, 205, 41, -293, -214, -483, 221, 443, 37, -376, 591, -180, 337, -49, -218, 288, 192, 666, -48, 460, -460, -336, -49, -449, 473, 117, 168, -139, -20, 59, -4, 55, -14, 283, 55, -29, -91, -176, 73, -67, 38, -77, 85, -127, 104, 107, -248, 135, 69, -333, -308, -41, -302, 30, -62, 41, 83, -252, 33, -104, -139, 303, 42, -24, 67, -49, 38, 48, -105, 72, 164, 0, -233, 242, -62, 109, -96, 23, 35, 69, 110, -54, 110, 237, -42, -102, -229, 73, 49, -131, 56, -94, 44, 213, -60, -29, -112, 147, 2, 47, -123, 245, 314, -78, -18, -38, 22, -160, 16, -39, 176, -58, 313, 48, -5, 104, -126, 132, -98, 134, -6, 31, 7, 5, -136, 282, -46, -70, 26, -2, 105, 233, 57, 201, 108, -176, 95]
2514I5p7k00J40p8J08k34LK45P7OO6j13j36K53l91K10j99J43J08p4p5O9j51K46
2538D1R3P1m26J2jJ7J62K42p9M6p1r2N3J11j71J22J27l57J13n0k02J18MJ96p3
2563FR0j66J80k38M0K86J8l59J38N6j12J87k7j28j32J60m1L6P4R5M7l16L6J24
2587E4j27K80k72J10k85K30J61M8k06J92j39M5l72J95QJ81k69pJ4j64N06P2r65
2610g10J028k16R4j54N90K20r21l12k95N34j55M65k09J33k28L34K7j34k80L24
2630A35l42J93r9K51L4k43Pk89K05j81R5K17l1J44j10J00O0l31J48K54j25p7J92
2653B07j70P7k07jj20j5J66KJ57n2j59L8J8J40n0j36M5K3O7m4J4j97J71l9K5j95
2679b35K36J10Oj24Q6k88K34n3j24l0J41J91o8j00j09K79k66J41P0j03j05N5K01
$$ y = [95, 18, -182, -42, -120, -12, -246, -243, 2, 79, 85, 151, 38, -98, 155, -236, -26, -225, -82, 26, -48, -123, -54, -205, 41, 134, 205, -221, -209, -210, -193, -31, 211, 132, 178, 107, 15, 68, 179, 8, 130, 257, -100, 13, -37, -239, -121, -117, 79, 6, 96, -70, 110, -128, -88, 198, 216, -143, -5, 51, -61, 126, 99, -29, -161, -1, -42, -6, 68, 163, 210, -106, -70, 54, -73, 207, -65, 45, -240, -10, 151, 199, -7, 185, 46, 91, -281, -86, -78, 103, -166, -173, -159, -323, 183, 255, -710, 318, 102, 196, 42, 632, 852, -69, -381, -676, -142, -297, 168, -41, 92, -136, 198, 225, 91, -189, 135, -207, -14, -113, 138, 172, -71, -64, -353, -148, -329, -234, -17, -48, 96, -14, 86, 146, -185, -37, 217, 92, 15, 207, 37, 114, -93, -94, -214, -229, -63, -61, 96, 44, -115, -77, -59, 81, 31, -105, -60, -37, 30, -14, 0, -197, -26, -65, -40, -235, 1, 111, 117, -7, 79, -209, 25, -28, -152, -182, -41, 150, 82, -18, -127, 152, -114, 27, 97, -6, -111, -56, 145]
2702A45p3m7j23K78j99K84l25L56j65R2j84N8r5J2K01l78K09l9l10L58R7r2q6
2725b6m0M8j83L02M1k17J47k6K6j45J23P2l82L66J94p6k26l9K14k55N0j17J08
2748d1l2J7k70M38j24k8k05L88l52j3K26P9J58k2l41kR8k63L15k39L16j09j1J29
2772A12j36m1j78J88OK8p9O4L9k35J52K24j26j17O3p5m0L92l16O1N4n5j01J94
2796G8R1k03J61j90R0k8m8K5j53J56o7RJ81r3k6r4j5K44j97j68L70j02N8J08k50
2821f3K80k00r6q8K01j89N2q5M15j72P4j17O5j09J79k7J2q2j29J44o2j38R7P2
2845C4J32k21Mo0K31j5L1j97j92L59j77mJ83j76j40N30l85R4j04j3j8kMQ6j49
2870a65M03l43K16n1j61K93j04l9K14o8m5k31J7J74j11m0J3M0J39k19J60O8r1
$$ y = [145, 72, 25, -98, 180, -19, 265, -60, 296, 131, 223, 39, 97, 2, 14, 215, -163, 46, 7, -303, 55, 152, 60, -26, -66, -18, -201, 101, 142, -75, 72, 46, 72, -73, 50, 122, -260, 106, 300, 224, -2, -41, 173, -82, -32, -149, -41, -73, -56, -326, 112, -12, -40, -245, 143, -209, -222, 4, 83, 241, 219, -122, -124, -26, -289, 26, -213, 103, -6, -17, 112, -24, -65, -243, -55, -49, -21, -100, -36, 3, -232, -80, 144, 18, -99, -36, -111, -151, 241, -75, -14, 40, -15, -116, 78, 169, -34, 127, -63, 27, -1, -49, -24, -177, -21, -88, -79, 102, 9, -17, -111, -126, 118, -79, -247, 123, 21, 79, 187, -63, 217, 17, -79, -167, 34, -155, -103, -188, 227, 55, 129, 12, 77, -32, 147, 120, 132, 50, -79, 65, 3, -135, -38, 34, 166, -55, -51, -111, 120, 105, 136, -61, -253, 106, -71, -75, 108, -68, -208, 322, -63, 31, -73, -86, -104, -106, -102, -16, -165, 238, -105, 111, 60, -101, 192, 88, 49, 263, 195, 150, -81, -64, 110, -1, -41, -28, 12, 151, -68, 92, 160, 69]
2893F9J33m09M52k32pj71J97L2j25jQ5j28L47l03j87K40p6kl06M19k42K38k28
2916b05K05N3J0j12K07k15k29J36J83K30l28MK17k12m5r2L73j94O97o26oLj57
2939a03J41N5Lj02J25Rj63m10N97l26M06m53M11l73O58j96K0p24m01P24J11L53
2961C62m7l89q7L66l42K59j74K35j77K98k52M9j04n1K5J10k05Q4q0K34J83j16
2983A81P4l76K79l25L15j82J8K54m03R1K07k75Q4L7k47L65j05R1k71K18l7L33
3005C26j74M03p13M6J34j3Pj55m15O6L89j75N55J55n44j16R0P9N4p7P1Q7j81J72
3029G1j35J02K25K29n36j43K06L6l22K70j17J58k5j15MJ59L6k2O4m7l19J97J42
3052A18k49K15k38K7K8J35J24k18L30n05l0L15N2j3q5l5K80k81k08P4K18q2j24
$$ y = [69, 202, -207, 245, 13, 6, -165, 32, 64, -61, -62, 23, -105, 242, -61, -248, -8, -84, -86, -392, 27, -215, 23, -205, 0, 53, 63, -49, 158, -57, -286, -150, 33, 263, -65, -61, 156, -56, -101, -193, 180, -14, 683, 57, 51, 54, -103, 38, 93, 96, -6, 119, 128, -35, -445, 152, -174, 232, -221, 190, -183, 475, 279, 299, -425, -826, -102, 9, 362, 315, -74, -161, 205, -137, 122, -52, 183, 6, 304, 52, 101, -3, -54, -29, 81, -124, -40, -120, 114, 297, 181, 255, -121, 158, -167, 148, -34, -16, 238, -165, -74, 133, -142, -58, -21, -268, 97, -8, 83, -188, 30, -7, 326, 152, 555, -158, -112, 22, 9, 16, -139, -554, -488, -99, -274, 281, 436, -108, -224, -134, -55, -1, -78, -7, 80, -101, 71, -64, 38, 263, 492, -44, -187, 19, 55, -267, 3, -114, 44, 19, -96, -92, 67, 103, 81, 145, 98, -221, -24, 118, -131, 84, -154, -127, -99, 36, 160, -58, 272, -233, -263, 52, 104, 91, 6, -29, 251, -30, -238, -164, 54, -28, -152]
3075a52K20j01m9J39J2J6j50q4K34J69l93K70j04J48k30m7K37j36P5Rq8j53R5
3098f3RK61m38N6J97j38J95M9k06O8j87L58l10j37J94R3K2j97K28k87L84j13J30
3121A68Rk10p6K48l50M80M2r9k3m68ON03j98j7j12R9J37m8o2r5K19J06j42k73
3145a56K69j18O7l4k43M42k35K2O6J8N2r8r9n1j8R6L7j56K44l02L50O1j66k61
3169b13J85Q8Lj37J29K9pj42M7J26K23j10m84J66l6J71k69K15N1J22j84q5O2K41
3193A91j85L5k90K93j78L60j90j9L8J09j73j4J3j88K54l5P0k16K81nkj69k24M05
3217A61j7j92j27K11j06L18j48Lj32L06m28l3N13k14j71P0r4Q0j19O0n6J46j87
3240a56L20q8k23Q1m2K92j72m5n9K28k48K50M9k37N4R4k19L5RK18l50J56o8J60
$$ y = [-152, 68, -33, -82, 57, 69, 85, -65, -149, 85, 254, -139, 131, 27, 175, -55, -102, 135, -1, 74, 83, -5, -158, -63, -54, 207, -231, -175, 22, -116, 79, 128, -78, -10, -197, 161, -149, -286, -92, 1, 23, -174, 54, -233, 151, 38, 168, 177, -33, -109, 139, -211, 269, 311, 212, 189, -279, -273, 230, 32, 15, -97, 2, 139, 91, 29, -66, 153, 259, 117, -156, 113, -5, 62, 28, -215, 227, -8, 14, 80, 98, 150, 52, -47, -98, -116, -20, 17, -139, 105, -197, 153, 214, 48, -213, -28, 60, 63, -74, 55, 84, 77, -65, -18, 108, 331, 221, -263, -97, -133, 38, -231, -16, 35, 157, -27, -112, -50, 191, 6, 41, -249, 44, -134, 226, 36, 17, 55, 164, -9, -23, -10, -198, 56, 21, 91, -125, 156, 151, 149, -20, -244, 161, 144, -48, -175, 36, -70, 248, 100, 103, -29, 277, -151, -184, 329, 115, -56, 14, -80, 0, -119, -59, -115, 31, -156, 164, 76, -147, -66, -108, 184, 12, -33, -92, 136, -112, 138, 187, -50, 4, 98, -121, -86, -77, 141, -209, -53, -121, 39]
3264C9k06J7j5Q4J26j50J05j32K66j90K0Q1p8L2PJ39j6l0mk23J30N9j05K07j08
3289E5K11n15J16k4J57O0r8k3j10J66rJ31l7l40L65N3k08l8k4K4J12j71K98j57
3313fk72K65j88J41L0P6k05K99k29n1qK69j64L7p0J62Q6j21m9j29J17l1J20l81
3337c02J58K7k3O5J7nj85K25J88l01J80k1m45L30M5K2K30m8O7p2k37P5K86k60
3361A6j54j1R6J18j34k1K73k44K74n74J27J96k9o7L27n8j23j70J9O5L1K9K0L2
3385C8j5J02l84OJ84K47l05J74L3Q7n3j55N9m1R4m1l3O1k66p1JM38k82o6J37N4
3411Cq7L4Q80r56K15L29j183k0M71K62j64J4J81Q1K58p3l07kQ4j27J03qJ69l7
3435A20l00L10N4M7m94K20J72k26R3p2k3M3k5J84j18M5j60L34o5p9k69K13qk13
$$ y = [39, -167, -150, -165, -81, 45, -105, 0, -132, 134, -56, -36, 45, -33, -1, 6, 145, 129, 99, 95, -128, 2, 61, -44, 163, 55, 266, -249, -133, -157, 0, 60, -38, -61, -171, -5, -14, 117, 80, -260, 105, 158, -50, -88, -112, -88, 24, -147, 151, -6, -278, -13, -201, -60, -30, 46, -159, 140, -89, -140, -148, 121, -43, -6, -76, 86, 172, 51, 2, -127, -10, -41, 79, -302, -144, -117, -140, -75, -58, -63, -248, -23, 165, -136, 44, 23, -422, -92, -47, -25, 205, 157, 224, 152, -85, -10, 276, 16, -138, -149, -53, 65, -69, -90, 183, -61, 213, -361, -234, -38, -67, -134, 193, 135, 12, -158, -139, -74, -43, -14, 6, 38, 23, 125, -259, -253, -69, 178, -127, 47, 80, 167, 114, -41, 18, -23, 71, 30, -3, 58, -208, -279, -278, 160, -122, -188, -51, 3, -84, -50, 830, -126, 89, 418, -765, -785, -314, -52, -216, -202, -21, 60, 318, 245, -62, -64, 20, -107, -4, -12, 157, 120, -180, 130, 184, 231, -263, -43, 129, -97, -4, -76, -99, -56, -81, 103, -15, 30, -130, 204, 139, 60, -209, 4, -4, -217]
3459b17K97j86L55p7q6J43j48o9q4J06j35J13l5K1M5O8r3J24j36J51k58J17M8
3482F4r5J46K4k38l4K04n7l8K40l18K96l02K29J3j86K05k50j2j43L13j43J55j86
3505a13K13J50k32K2k9J06j32J10M8m9r1rrj07J02k0MJ49k35L18r1j2M7o6k99
3530b25K76J70m41J25j63L11j49j65L67Q2n8l04J54k9N73k28l35J40l5J56j78
3551D4Q3j10J56j91n3l6N4J06M3j27OK77k47P4n1M2J12p8k89L09p3Jj21J62j32
3576c9K04k0L5l0o8n0k11L46k13jl5K63k24L50k3l19k59K63j33J3L53l87J95K30
3600B40k57J54k61O2K5j95J38k03J18M07m10J99J08k46k9K99r3J21Q5l50K3O0
3622er3N5J02J12o8j27J78k26R4J85m6j63l9J25O9Qj40R9m0J5J18k90J80k71L99
$$ y = [-217, 80, -106, 249, 172, 86, 229, 81, 12, -72, 34, -101, 12, -23, -2, 43, 111, 18, 142, 6, 157, -101, 16, 64, -31, 115, 139, -99, -133, 71, 14, -24, 216, -102, 194, -108, 121, 134, -52, 153, -97, -109, -252, 61, -82, 73, -113, 100, 250, 18, 40, 11, 117, -15, 95, 143, 94, 3, -6, -15, -122, -20, -40, -36, 113, -122, 196, 105, 93, 140, 74, -225, 51, 221, -220, -95, -258, 53, -96, -261, 106, 188, 130, -174, -20, -49, 524, 296, -39, 101, 66, 222, 44, 127, 17, 173, -18, -71, -107, -53, 53, 96, -31, -25, 252, 5, 79, 28, 70, 182, 104, -185, 124, 51, 52, -69, 93, -39, 165, 145, 180, 150, 82, 32, -179, 167, -46, -47, -82, 181, -43, 307, 284, -35, -294, -31, -164, -151, 202, -185, 10, 240, -17, 137, -124, -62, -37, -232, -94, -297, -179, 228, -182, 17, 125, -121, -150, 149, 56, 177, 262, -88, -65, -5, -98, -43, 59, 171, 103, -24, 154, -72, 22, 207, 161, -2, -41, 84, 153, 161, 21, 120, 80, 95, 213, -77, 103, -168, 231]
3647B31k42N2rj09J40j60o6J39P4k44J19k9J08qO6Mj99K5J23R3j6j8J26m77K75
3672bJ31k86L43j18mm47K81J11K49k83p2J07N3p2m7J92m6k45k08K95J56j29R3
3695E2O4j94O7Q1J14j07l28K60p5r4Q3M2K34j79J28k11J48L1r6j39J46p9nJ11
3719E4K9Q5l03j7K34l73K18k39L46j50M04m66L34j73m3J7O0k7K33j46j01J72j46
3742BJ92j50l3k98L83l22l98M67K72l43JM52q5l12K08m1p2L31k74j3JJ22J34l10
3766h6Q1J52k21K37J21k41O7j70L1M1mJ25K1m7j10j46J34l2J67j43q6J50j18K9
3790d8J74j73m7j36J16J57k67K95m7J17j42l61M35Pj79R5Q2k11J34K62m76K55
3812D2p5r7J90o7J70j8l04Q3J23k05O7j6M20m84O5K61k46O0J22n28O14l2k31J77
$$ y = [231, -11, 41, 32, -77, 63, -97, -163, -24, 50, -194, -75, -104, 4, -4, 62, 66, -133, -108, 15, 108, 92, 74, 200, -277, -2, 129, -157, 186, 68, 64, -383, -102, 9, 258, -25, -97, 10, 63, -9, -56, 136, 90, -155, -363, -68, 88, -41, 52, 116, -78, -11, 70, 184, 77, -251, 9, -66, -160, -77, -35, 199, 20, 148, -63, 85, 116, 20, -119, 27, -52, -57, 54, 83, 168, -135, -152, 82, -291, -73, -312, 34, -116, 288, -178, 156, -17, -60, -43, 17, -10, 223, 77, -24, 148, 2, 194, 44, 11, -287, 96, -226, -624, -157, 115, -228, -227, 225, 140, -172, 36, -5, -77, 254, -20, -33, -32, 90, 224, -86, -5, 147, -74, 163, 284, 43, 110, -60, -29, 12, 8, 133, 154, 107, -3, -149, -15, -47, 120, -23, -109, 41, -77, -48, 126, -47, -94, -230, -114, 43, -224, 71, 24, 141, -1, -362, 73, 80, -99, -4, 78, -133, 1, 263, -213, 42, -33, -130, 60, -7, 163, 145, -159, -76, 47, -158, -91, -107, 313, -171, -106, 155, -91, -31, 91, -437, 177, 145, -86, 91]
3836I1k3k08j1J22Kq0K08r8K4J22j72M9J32j93r6o6J74K07k19R5j09L49j18j65
3860A7Jp8R6J39k15L3K18j76m46N34j67P5J24k23r1J30J22j73K13k22K77l51k3
3883a86l3L02p3p0J14J9K19l57m9J26J83j77j10K79j51j80J3J12P0p0lK52k43
3906a3N1r4J53O9k45J38j30K36j25j63M0K9k33K33J47J2kP9j53L23m62q2p1L95
3930A32J26m51K13n9j61K46K5j35K36l7j90L59m90L10K4k45q2J20J96l45J52j61
3952b17M63l71K28r0q7P0l03K15J67j82K89k87P4j23J46O8J20o4l82J33N82k8
3974D21p29M48k14q4j82M26m93k82R82m28L37k91K27j69L11k66k10J26j53J59
3994f4J9JR3j70J04J99j39J32j28O6j12nJ01j21Q4m3k26J54N1j1L1J9N1Q4k29
$$ y = [91, 68, -140, -151, -29, -27, -107, 101, 3, 27, 149, -23, 26, 158, -35, -131, -197, -23, 184, -35, 60, -49, 300, 182, 17, 18, -60, 36, 175, -40, -7, 211, 35, -411, 123, -44, 31, 155, -68, -159, -29, 93, -80, 133, -89, 188, -163, -186, -219, 83, 10, -60, 54, 73, 292, -65, -114, 12, 195, 18, -92, 187, 36, -144, -131, -19, 51, -19, -22, 230, -13, 38, -56, 97, 166, -79, 59, -71, 165, 40, -123, -83, -54, -287, -54, 93, 105, 103, 182, 29, 352, -110, -192, -263, 132, 258, -193, 20, -39, -200, 46, 71, -64, 172, 135, -55, 304, -186, 124, 148, -97, -179, -59, 137, -208, -56, -217, 246, -125, 103, 13, -74, -4, -307, -92, 75, -107, 182, -105, -31, -154, -8, 60, 180, 116, -266, -133, 449, 421, -308, 140, -74, -158, -340, 86, -407, -689, 293, -135, 202, -89, 138, -31, 280, 14, -196, -70, -223, -64, -45, -44, 49, -121, -17, 182, 43, 175, 47, 113, 1, -4, 97, -24, 60, 17, -209, -55, -4, -15, 16, 35, 86, 170, -59]
4019e9J16j39L78k12j38o8m1J48j95L81o7l44L53j47J41k76L86k46n6P9j6qj30
4042a60K05K54l86K56k41K29k30N8O1l4q5R3R2k54M0J34K67m55J36K7k04O7M5
4065h5R6J44k8k15J09j10j27L21L7o6j80K06o3j47J30p6M1RJ6N0j3J17j66R0k35
4090a45L77j77J6L60n54O0L8N4J10j67O9J71k40J78n9k90l5K34j91J18Q4j3K40
4113B38l88J21k91L23K54k08Kj11M6K21k13r3N8jn9J50k45K56k74M00q5p7j22
4136i8K59j23m1O7j38J65m7J82k35M1J6j39L7O8j33J73k27L7K00j24m4n6J90j34
4160a04l8J77J53j45j78K7M0N7J5J03O7j39j90J14R6l40L53j44J6R5l89L24j14
4183a44M4K43m2N6j22N1P8l49J11J59Mj46J04n3j40L00l5M0n3J12j64k5p4J09
$$ y = [-59, 57, -82, 296, 84, -54, -122, -163, -15, -210, 171, 104, -240, 113, -34, 107, -169, 217, -29, -85, -6, -22, -30, -160, 45, 299, -87, 169, -72, 157, -73, -15, 46, 12, -73, 20, 112, -142, -102, 32, 299, -156, -20, 7, -197, -130, -85, 11, 155, 127, -88, 21, -89, -216, 105, 142, 76, -104, 102, 39, -108, 22, -54, -13, -4, 12, 62, 49, 166, 0, 90, -145, 232, 55, 71, 431, -123, -63, -25, 29, 139, -28, 41, 212, -28, 150, 91, -199, -234, 0, -191, -73, 11, -2, 238, -150, -29, -320, 3, 257, 49, 51, -60, -14, 207, -6, -99, -41, -42, -101, 49, -196, 60, -214, 186, 101, 24, -98, 161, 38, -3, 64, -74, 91, 44, 226, -9, 32, 48, -91, -54, 14, -119, 54, -173, -136, 64, -60, -104, -160, 30, -104, -142, 35, 188, 43, -135, -108, -68, -11, 4, 107, 174, 35, -155, -41, 55, -285, 68, -76, -60, 35, -354, -30, -144, -100, 143, 101, 157, 35, 86, 164, -185, -74, 85, 89, -57, 47, -6, -146, 154, 119, 159, 106, 218, 54, 29, -45, 64]
4207F4j58J7r1L51N6j76m1m6R6j99J35j41m7kM6J24J34k35Q4Q6j17N9oJ41j82
4232d8J76k78Q5K42k51OPN8m0L9k87J94K63j24o3Lj5j9J88l84K37R4j21l0n4J55
4258C3n7r1k04K37J79J25j60j34R8j81LR1J0J52j39q8PK2J78j2j04J67k73R1j19
4283a69K56o0R3p0p9o0J5P2R7K5j17j16K9K1J06J4o8j25NL05q2r3K1o4k2q2K78
4310A30j91K46k03J54o9k88L06O7Oj40P6j16J63j74q6n0K08N3l51M15M1m38M81
4333B40l29Q9j1n0J81j69k20J09M36k71M97n13O11k46k90q2K7j33j37L25J93j03
4355A54k62kk07K76j74M13m00K48LL1o2j77J86J4J39j78J22q3O6k2j31NN5J87
4379B01n25L92o8o9K63k97m9L32k50P6j19j73M12k0p4k14L26j68J64K9J7p8k95
$$ y = [64, -94, -77, -168, 183, 239, 63, 22, -24, 72, -127, 8, -133, -180, -182, -136, -12, 122, -113, -29, 57, -60, -1, -7, 134, -48, 128, -150, -65, 177, -74, -68, -61, -3, -43, -4, -291, -97, 166, 42, -21, -18, -33, -52, 136, -248, -11, 83, -38, -68, -122, 33, -24, -115, -319, -82, 97, 222, 62, -72, 26, -155, -152, -61, -51, 101, -38, -126, -119, -97, 81, 69, -35, 132, -141, -50, -169, 87, 27, 120, 50, -29, -89, -74, -2, 95, 120, 3, -113, -84, -63, 43, 57, -11, -136, -131, 174, 92, -1, 20, -44, -66, -148, 130, -61, 185, -18, 136, 67, -221, 85, 152, 158, 18, 94, -22, 141, -33, -119, -169, 39, 92, -259, 156, 197, -241, 240, -89, 0, -11, -61, 120, -49, -269, -160, 276, 5, 502, -11, 600, 354, 64, -18, 9, -124, -261, 64, 257, 154, -108, -110, -317, -41, -215, 198, -202, 46, 49, 80, 18, -159, 27, 41, 180, 2, 124, 41, 107, 85, -46, -41, 14, 201, -324, 68, 0, -69, 194, -103, -152, 180, -70, 6, -113, -286, 126, 106, 32, -182, 144, -24, 140, 169, 186, 108, -187]
4402a87J66l00J39K33P1l22L51k75J09q2P9r0J60J72j24k55L30l49N46k60k21
4423a09M40m67K23l59J21J83k15J76j80K64j41J6J38R5l70Q5n4K63n2o8R4j20
4445c7O0o7j0j87K99j53N6j11K14j33J51m5m4r2J13K16k12P6N5n1k27p8M5L79
4469B17l68m3n9L31j31J58P2p5K72r5k17j15q4j57K02J44j98N2J37j87r2K03Q4
4492E1p5j50K78k08M2J00l25L14J13k6J48l94J48L3n5N0j53J86J32k25J21M2j39
4515Hk6J5J84k12L1L6J30r6J4o3k20J05J9M3K8j20J36P7q5P5j18J15o9j78J01
4540g0L09j08n9j81K37Mk74PJ45K55m08PO2J79k2m10K59J31o8pJ31j3R6k58K74
4565B18j57k58L86M1j10j98J15j19JQ9k29M11k07q2JJ09j21K48l95J14J80L5k52
$$ y = [-187, -21, -321, -182, 51, 122, -200, 151, -124, -15, -97, -18, -108, 52, 224, 100, -155, 175, -174, 372, 112, -109, 331, -136, 87, -272, -151, 32, -183, -7, -187, 77, -64, -48, 90, 185, -185, -100, -154, 109, 57, -11, 83, -37, 23, -44, -54, -241, 58, -95, -39, -150, 64, -69, 82, 37, -7, -99, 14, 230, 18, 94, 149, 98, -129, -207, -162, 217, -151, -194, -253, 78, -53, 105, 177, 102, 374, 279, 62, -53, -137, -294, -92, 52, -146, -94, 43, -144, -236, -33, 51, -24, -174, 104, -104, -62, 38, -287, 27, 140, 114, 262, -132, 16, 49, -6, 44, -109, 77, 209, -16, 105, 147, 8, -18, -3, 181, -31, 0, 36, 166, 70, 84, 21, -199, -94, -75, -32, -4, -124, 12, 89, 4, 79, -39, 76, 7, -171, -70, 239, 131, 72, -109, 128, 132, -142, -135, 10, 265, -143, -136, -74, 105, 83, -327, -68, 63, -5, -12, 119, 106, 202, -56, 218, 61, -197, 189, 230, 120, -78, 37, -82, -81, 8, -221, 190, -17, -99, -98, 11, -110, 138, -257, -143, 37, 72, -180]
4588a80K32j54j26P3R2K02m61K32J86k50K00k59L54m9j6l1K36m62M0K85j45K9
$$ y = [-180, 52, -102, -228, -155, -63, 139, -322, -90, 96, -154, 46, -213, 141, 92, 76, 45, 281, -181, -141, 144, -1, 28]
$$ [...]
8191B70
##END NTUPLES=NMR FID
##END=
