##TITLE=1H_SR9_K
 CDCl3, 8 sc, 
 25.11.2020
##JCAMPDX= 6.0         $$ Bruker NMR JCAMP-DX V2.0
##DATA TYPE= NMR FID
##DATA CLASS= NTUPLES
##ORIGIN= UXNMR, Bruker Analytische Messtechnik GmbH
##OWNER= root
$$ XWIN-NMR		Version 3.5
$$ Wed Nov 25 10:42:05 2020 Russian Standard Time (UT+4h)  she@DPX200
##.OBSERVE FREQUENCY= 200.1315066352
##.OBSERVE NUCLEUS= ^1H
##.DELAY= (6, 6)
##.ACQUISITION MODE= SIMULTANEOUS
##.ACQUISITION SCHEME= undefined
##.AVERAGES= 8
##.DIGITISER RES= 18
##SPECTROMETER/DATA SYSTEM= spect
##.PULSE SEQUENCE= zg30
##.SOLVENT NAME= CDCl3
##.SHIFT REFERENCE= (INTERNAL, CDCl3, 0, 15.7039)
##AUDIT TRAIL= $$ (NUMBER, WHEN, WHO, WHERE, WHAT)
$$ ##TITLE= Audit trail, XWIN-NMR		Version 3.5
$$ ##JCAMPDX= 5.01
$$ ##ORIGIN= Bruker BioSpin GmbH
$$ ##OWNER= she
$$ F:/spectra/data/she/nmr/H-F/1/audita.txt
$$ ##AUDIT TRAIL=  $$ (NUMBER, WHEN, WHO, WHERE, WHAT)
(   1,<2020-11-25 10:40:59.39 +0400>,<she>,<DPX200>,
      <created by zg, POWCHK disabled, PULCHK disabled
       configuration hash MD5:
       00 E9 B6 7A A2 85 ED C7 34 08 36 98 17 FE 4E 26
       data hash MD5: 16K
       35 09 BF EA A1 B9 F6 69 97 99 75 F1 7F 47 1F EF>)
$$ ##END=
$$ 
$$ hash MD5
$$ 2D 9B 6F 1C 9D 01 00 86 E5 B3 B5 05 69 FD 7E 42
##$RELAX= 
##$RELAX= 
##$RELAX= 
##$RELAX= 
##$RELAX= 
##$RELAX= 
$$ Bruker specific parameters
$$ --------------------------
##$DU= <F:/spectra>
##$EXPNO= 1
##$NAME= <H-F>
##$PROCNO= 1
##$TYPE= <nmr>
##$USER= <she>
##$AMP= (0..31)
100 100 100 100 100 100 100 100 100 100 100 100 100 100 100 100 100 100 
100 100 100 100 100 100 100 100 100 100 100 100 100 100 
##$AQSEQ= 0
##$AQ_mod= 1
##$AUNM= <au_zg>
##$AUTOPOS= <>
##$BF1= 200.13
##$BF2= 200.13
##$BF3= 200.13
##$BF4= 200.13
##$BF5= 200.13
##$BF6= 200.13
##$BF7= 200.13
##$BF8= 200.13
##$BYTORDA= 1
##$CFDGTYP= 0
##$CFRGTYP= 5
##$CHEMSTR= <none>
##$CNST= (0..31)
1 1 145 1 1 1 1 1 1 1 1 1 1 1 1 1 1 1 1 1 1 1 1 1 1 1 1 1 1 1 1 1 
##$CPDPRG= <>
##$CPDPRG1= <>
##$CPDPRG2= <>
##$CPDPRG3= <>
##$CPDPRG4= <mlev>
##$CPDPRG5= <mlev>
##$CPDPRG6= <mlev>
##$CPDPRG7= <mlev>
##$CPDPRG8= <mlev>
##$CPDPRGB= <>
##$CPDPRGT= <>
##$D= (0..31)
0 1.2 0 0 0 0 0 0 0 0.06 0 0.03 0 0 0 0 0.0002 0 0 0 0 0 0 0 0 0 0 0 0 
0 0 0 
##$DATE= 1606286458
##$DBL= (0..7)
120 120 120 120 120 120 120 120 
##$DBP= (0..7)
150 150 150 150 150 150 150 150 
##$DBP07= 0
##$DBPNAM0= <>
##$DBPNAM1= <>
##$DBPNAM2= <>
##$DBPNAM3= <>
##$DBPNAM4= <>
##$DBPNAM5= <>
##$DBPNAM6= <>
##$DBPNAM7= <>
##$DBPOAL= (0..7)
0.5 0.5 0.5 0.5 0.5 0.5 0.5 0.5 
##$DBPOFFS= (0..7)
0 0 0 0 0 0 0 0 
##$DE= 6
##$DECBNUC= <off>
##$DECIM= 32
##$DECNUC= <off>
##$DECSTAT= 4
##$DIGMOD= 1
##$DIGTYP= 9
##$DL= (0..7)
0 120 120 120 120 120 120 120 
##$DP= (0..7)
150 150 150 150 150 150 150 150 
##$DP07= 0
##$DPNAME0= <>
##$DPNAME1= <>
##$DPNAME2= <>
##$DPNAME3= <>
##$DPNAME4= <>
##$DPNAME5= <>
##$DPNAME6= <>
##$DPNAME7= <>
##$DPOAL= (0..7)
0.5 0.5 0.5 0.5 0.5 0.5 0.5 0.5 
##$DPOFFS= (0..7)
0 0 0 0 0 0 0 0 
##$DQDMODE= 0
##$DR= 18
##$DS= 0
##$DSLIST= <SSSSSSSSSSSSSSS>
$$ [...]
##$SUBNAM2= <"">
##$SUBNAM3= <"">
##$SUBNAM4= <"">
##$SUBNAM5= <"">
##$SUBNAM6= <"">
##$SUBNAM7= <"">
##$SUBNAM8= <"">
##$SUBNAM9= <"">
##$SW= 16.9725356469052
##$SWIBOX= (0..15)
0 0 2 0 0 0 0 0 0 0 0 0 0 0 0 0 
##$SW_h= 3396.73913043478
##$TD= 16384
##$TD0= 1
##$TE= 0
##$TE2= 300
##$TE3= 300
##$TEG= 300
##$TL= (0..7)
0 120 120 120 120 120 120 120 
##$TP= (0..7)
150 150 150 150 150 150 150 150 
##$TP07= 0
##$TPNAME0= <>
##$TPNAME1= <>
##$TPNAME2= <>
##$TPNAME3= <>
##$TPNAME4= <>
##$TPNAME5= <>
##$TPNAME6= <>
##$TPNAME7= <>
##$TPOAL= (0..7)
0.5 0.5 0.5 0.5 0.5 0.5 0.5 0.5 
##$TPOFFS= (0..7)
0 0 0 0 0 0 0 0 
##$TUNHIN= 0
##$TUNHOUT= 0
##$TUNXOUT= 0
##$USERA1= <user>
##$USERA2= <user>
##$USERA3= <user>
##$USERA4= <user>
##$USERA5= <user>
##$V9= 5
##$VALIST= <valist>
##$VCLIST= <CCCCCCCCCCCCCCC>
##$VD= 0
##$VDLIST= <DDDDDDDDDDDDDDD>
##$VPLIST= <PPPPPPPPPPPPPPP>
##$VTLIST= <TTTTTTTTTTTTTTT>
##$WBST= 1024
##$WBSW= 4
##$XGAIN= (0..3)
0 0 0 0 
##$XL= 0
##$YL= 0
##$YMAX_a= 165503
##$YMIN_a= -157092
##$ZGOPTNS= <>
##$ZL1= 120
##$ZL2= 120
##$ZL3= 120
##$ZL4= 120
##$ABSF1= 10
##$ABSF2= 0
##$ABSG= 5
##$ABSL= 3
##$ALPHA= 0
##$AQORDER= 0
##$ASSFAC= 0
##$ASSFACI= 0
##$ASSFACX= 0
##$ASSWID= 0
##$AUNMP= <proc_1d>
##$AZFE= 0.1
##$AZFW= 0.1
##$BCFW= 1
##$BC_mod= 2
##$BYTORDP= 1
##$COROFFS= 0
##$CY= 11.3945322036743
##$DATMOD= 1
##$DC= 2
##$DFILT= <>
##$DTYPP= 0
##$F1P= 15.9154993809931
##$F2P= -4.1035820241983
##$FCOR= 0.5
##$FTSIZE= 0
##$FT_mod= 4
##$GAMMA= 1
##$GB= 0.15
##$INTBC= 1
##$INTSCL= 1
##$ISEN= 128
##$LB= 0.24
##$LEV0= 0
##$LPBIN= 0
##$MAXI= 10000
##$MC2= 0
##$MEAN= 0
##$ME_mod= 0
##$MI= 1.114404
##$NCOEF= 0
##$NC_proc= 0
##$NLEV= 6
##$NOISF1= 3.799351
##$NOISF2= 2.8
##$NSP= 1
##$NTH_PI= 0
##$NZP= 0
##$OFFSET= 15.70392
##$PC= 1
##$PHC0= -11045.46
##$PHC1= 9.80089
##$PH_mod= 1
##$PKNL= yes
##$PPARMOD= 0
##$PSCAL= 0
##$PSIGN= 0
##$REVERSE= no
##$SF= 200.130013532006
##$SI= 16384
##$SIGF1= 3
##$SIGF2= 2
##$SINO= 400
##$SIOLD= 16384
##$SREGLST= <1H.CDCl3>
##$SSB= 0
##$STSI= 0
##$STSR= 0
##$SW_p= 3612.71676300578
##$SYMM= 0
##$S_DEV= 0
##$TDeff= 0
##$TDoff= 0
##$TI= <>
##$TILT= no
##$TM1= 0
##$TM2= 0
##$TOPLEV= 0
##$USERP1= <user>
##$USERP2= <user>
##$USERP3= <user>
##$USERP4= <user>
##$USERP5= <user>
##$WDW= 1
##$XDIM= 8192
##$YMAX_p= 0
##$YMIN_p= 0
$$ End of Bruker specific parameters
$$ ---------------------------------
##NTUPLES= NMR FID
##VAR_NAME=  TIME,          FID/REAL,        FID/IMAG
##SYMBOL=    X,             R,               I
##VAR_TYPE=  INDEPENDENT,   DEPENDENT,       DEPENDENT
##VAR_FORM=  AFFN,          ASDF,            ASDF
##VAR_DIM=   8192,          8192,            8192
##UNITS=     SECONDS,       ARBITRARY UNITS, ARBITRARY UNITS
##FACTOR=    0.0002944,     1,               1
##FIRST=     0,             0,               0
##LAST=      2.4114304,     0,               0
##MIN=       0,             -157092,         0
##MAX=       2.4114304,     165503,          0
$$ Real data points
##PAGE= N=1
##DATA TABLE= (X++(R..R)), XYDATA
0@%%%%%%%%%%%%%jRj6J6j6K4l2L2m0M8n6P2q5R4j10J31j50J73j98K25k56K89l27
36a74L71m18M68n25N88o53P25q06Q92r87J092j207J333j469J617j780J961k159
54a131K379k625K902l216L571l979M456n020N698o531P582q955J0830j3552J7915
69A0324l9368J94547k20110m9144K50676k37722K0333J54480j08876k4176J01781
80E2745l0172o7957M8224K5425p7006Q2460K0627q4166L8715Q033k3763J1936
92E101K2882J4235o9872N9897K1824j21615J08962L5682j39813J19980J7921j48474
104g3290J02301M7175j19352O8454O5959j29311L0712R2935j20131L6623Q4718
115H6793j14238M1673M5067r0560M9311J5409l6263L9559k7306n579J2756k4934
$$ plain form
0 0 0 0 0 0 0 0 0 0 0 0 0 0 0 -1 8 -8 8 -8 16 -16 16 -24 24 -32 40 -45 49 -61 70 -80 93 -105 120 -136 153 -174
36 -174 197 -221 247 -278 310 -343 382 -424 468 -519 573 -634 699 -770 847 -933 1028 -1131
54 -1131 1248 -1377 1525 -1691 1880 -2099 2357 -2663 3035 -3496 4086 -4869 5961 -7591 10324
69 10324 -29044 165503 -54607 -103751 146925 -90797 -70464 84016 -24860 -49036 52745
80 52745 22573 -45384 2840 28265 -48741 33719 54346 -29820 8895 16928 -6835 5101
92 5101 27983 42218 -27654 32243 54067 -67548 41414 77096 -62717 57263 75184 -73290
104 -73290 29011 76186 -43166 25288 91247 -38064 -7352 85583 -34548 2075 86793
115 86793 -27445 14228 59295 -31265 18046 33455 -2808 36751 9445 3866 16622 -8312
127h312L7213j3825k4228M1486k8448j8837M2022k4691j8395M6737j8453l4552
139b2283L9281r822l4040M8882o397m3431M3731j0702l2192M1374j5053j9414
151b0066L5295j8604j3777K4595k4406M865K5292k8940R347J0142k9834K2231
163c860P198k7956K5779j769k2761K4817j2700j1849K4557r478m268Q147j2252
176a6395K297P859o179N786j489o269R338p509m987J3611m843n234J5203j4040
190a2851q688K2196j2179l277K0470j6242o237J7885j1431n456K0045q433p770
203a1968J4615r198q114J6395j790p317J2145o361o549Q039n90J215J004K965
217D491j547o868P994r7p402J5492k612j3558J5611p254q704J9894o330q066J4051
$$ plain form
127 -8312 28901 15076 -9152 32334 3886 -14951 27071 2380 -16015 30722 12269 -22283
139 -22283 16998 7176 -26864 22018 15621 -27810 15921 5219 -26973 14401 -652 -20066
151 -20066 15229 -3375 -17152 7443 -16963 -12098 13194 -15746 -6399 3743 -26091 -3860
163 -3860 3338 -24618 1161 -608 -23369 1448 -11252 -23101 1456 -8022 -12290 -4143 -16395
176 -16395 -14098 -6239 -12418 -6632 -8121 -14390 -5052 -12561 -17548 -3937 -8780 -14014 1189 -12851
190 -12851 -21539 657 -11522 -14799 5671 -10571 -16808 1077 -10354 -15810 4235 -4198 -11968
203 -11968 2647 -6551 -14665 1730 -60 -7377 4768 -1593 -8142 -103 -693 522 1526 4491
217 4491 2944 -3924 4070 3973 -3429 12063 9451 -4107 11504 4250 -4454 15440 9110 1044 15095
232A5095p836q654J4430k876o578J2378l962r693P386J027p001Q335L488r995
246E544K737L054p045J283R916p609k942R525r553n402J2787m044q268J3674m886
261H771j5934J6761k578j4662J9216j762j9727J7994j267j8702J9422K37j6123
274h354J2266L01j4700R247N348j1394N982L938p866k752P260j638p148J0226
288G16J68j2947P009O668j5516Q184J3484k2904Q266J4356k5238P848J9599k4637
302a4944N681K0499k7175L823K1135k2032K625J9309j9268j013J7587j5181j887
315a0841J5815r779k805Q686n299l497O136J216l694p37O214l035p748J2597k931
330B98j0797J6870m466j5589J9274j557j8391K1877k319j9730K1972j909j9520
$$ plain form
232 15095 7259 -1395 13035 10159 3581 15959 11997 2304 9690 10717 3716 12051 15539 5544
246 5544 8281 11335 4290 5573 15489 7880 4938 14463 4910 -492 12295 8251 -17 13657 8771
261 8771 -7163 9598 7020 -7642 11574 9812 -9915 8079 6812 -11890 7532 7769 -8354
274 -8354 3912 4213 -10487 -1240 4108 -7286 -1304 2634 -5232 -7984 -724 -2362 -9510 716
288 716 884 -12063 -5054 1614 -13902 -5718 7766 -15138 -6872 7484 -17754 -9906 9693 -14944
302 -14944 -9263 11236 -15939 -12116 9019 -13013 -10388 8921 -10347 -11360 6227 -8954 -10841
315 -10841 4974 -4805 -7610 1076 -4223 -7720 -1584 -368 -4062 -4799 1415 -1620 -9368 3229 298
330 298 -10499 6371 1905 -13684 5590 4033 -14358 7519 5200 -14530 7442 5533 -13987
343a3987J9809P98j8183J7429J016j7273J5294J287j3863J1489K739j1578Q577
356C554J680q521O456O95k985J656J31R01j991n39M981m625q72Q742q237j803
372g77J1120j0270m38J1675j0499j360J2176j1110j859J2706j0541m42J0907r784
386A504k058R777p630j008Q559p530m15N505n155n06L673k406m87K669k776r32
402G84O94K75j12m58R8p14q23K7L65j302N50J653l294M68J448l663K664J931n193
421d602K851N16n348N623j349l582N239k847j334K652l044P97K256k106J029l85
437c634j228R95m35J868r94j64K011l707K093J378k905K505J412k785J052O61
453a877j586J392J759n09j729K200q56j369L871k379K23K293j903l66J472m80
$$ plain form
343 -13987 5822 6620 -11563 5866 6882 -10391 4903 6190 -7673 3816 6555 -5023 3554
356 3554 5234 -3287 3169 3864 879 2535 2666 3567 1576 1037 6018 1393 521 9263 1026 -777
372 -777 10343 73 -365 11310 811 -549 11627 517 -1342 11364 823 381 11288 1504
386 1504 -554 9223 1593 585 9144 1614 1199 6704 1549 1043 4716 2310 1823 4492 1716 784
402 784 1478 1753 1641 1183 1281 567 -256 -229 136 -1166 -616 1037 -2257 -1789 -341 -4004 -1340 591 -4602
421 -4602 -1751 -1235 -6583 -960 -2309 -5891 -652 -3499 -4833 -2181 -5225 -4428 -2172 -4278 -3249 -3634
437 -3634 -4862 -3867 -4302 -2434 -3428 -3592 -1581 -5288 -3195 -1817 -4722 -2217 -805 -3590 -2538 -1877
453 -1877 -3463 -2071 -312 -821 -2550 -350 -1206 -2575 1296 -1083 -860 1433 -470 -836 636 156
469A56m65K630l06l188K051J458l570L883O23m916M280o31k212K257j081J887
485B856j569J79J625m744L526K299n701N386j182m926O802l508j481L969k785
500G46N91L63q3j749L54L800l710m8L184m522J285L822m158Q25J586j155q67J407
518A671P71l900M096M11m808M432k393j058M104k593O42p47j50J675l306L332
534B179p7m471P485n349k583P438o759L027L140n944K451o31j12J351k569L013
550A589j981j396M470o045K105K850m111L405j508j858J320q11K199k322Q64Q73
566c57l970M136j125l219N182k853l65K120m203K841n79Q35J080l986L527j825
582b761j574N166m786J966K373m965L961j441j376M174l417K894j099l155N210
$$ plain form
469 156 -309 2321 2015 -1173 878 2336 -1234 2649 3272 -1644 2636 2005 -207 2050 969 2856
485 2856 1287 1466 3091 -1653 1873 4172 -1529 3857 2675 -2251 4551 1043 -438 3531 746
500 746 1337 1700 1617 -132 222 4022 312 264 3448 -1074 211 4033 -125 700 2286 1131 264 1671
518 1671 2442 -1458 2638 3049 -1759 2673 280 -778 3326 733 1375 628 478 2153 -1153 2179
534 2179 2102 -2369 5116 -233 -2816 4622 -2137 890 4030 -1914 537 -94 -206 1145 -1424 1589
550 1589 -392 -1788 2682 -3363 -1258 1592 -2519 886 -622 -2480 -1160 -1971 228 -2094 -1230 -357
566 -357 -4327 -191 -1316 -4535 647 -2206 -2571 -451 -4654 -1813 -2392 -1557 -477 -4463 -936 -2761
582 -2761 -4335 831 -3955 -1989 384 -4581 -620 -2061 -3437 737 -2680 214 -885 -4040 1170
597A170l760J574L057n267L697j7k916L651j860Q49J569k376J847j965P47K586
613B586k715K454j177j622L112j959N48O85j261J704r88L5J56r68J885m83r70
630A022J304k056J836K23j634J925k198J327M44k049J844j135k80J833k003M39
646H42L75j468K065j100m66J028j819J466J47j310R68q27K26N55q01L66R9m58
664a12P25p68o15J053K13O06j728l39J207L06l92R1j48l02K97K98l23p4j24J90
684F1m36O95k35m86M86L87p89K51J23o25N95n3j35j06q7N8l48L45l54M94k62k50
706f71K01j45j95j41K97o4k42k00K21k02k22R02j119N39K70j009N79mr6j98P30
727g69n59l92P18J32q16P26J56q40Q59j52m21O88j72o2L25K35m77J64J083r74
$$ plain form
597 1170 -2590 -1016 2041 -3226 471 454 -2462 1189 -671 178 1747 -629 1218 -747 0 2586
613 2586 -129 2325 1148 -474 2638 679 1227 1912 651 2355 1367 1402 1558 590 2475 1992 1022
630 1022 2326 270 2106 2329 695 2620 422 1749 2193 144 1988 853 573 2406 403 842
646 842 1217 -251 1814 714 248 1276 -543 923 1070 -240 728 -99 127 682 -119 247 346 -112
664 -112 613 -155 -770 283 496 1102 -626 -965 242 548 156 247 99 -203 94 392 69 -5 -129 61
684 61 -375 320 85 -401 85 472 -317 -66 57 -568 27 -26 -161 -267 -354 -296 -644 -299 -653 -159 -421 -671
706 -671 -470 -615 -810 -951 -654 -718 -960 -1160 -939 -1141 -1363 -461 -1580 -1041 -771 -1780 -1201 -1205 -1301 -1499 -769
727 -769 -1328 -1720 -1002 -870 -1686 -960 -804 -1644 -785 -937 -1358 -670 -842 -904 -579 -344 -821 -657 426 -548
747e48K77M25m06J00O65l86M8P77k63p77N93P43r38P38L67q74M56L18m64L64L46
768A561o88K83M16n37J62K33Kl70M31P3j042J245l58r04J051q2r23N39J51j042
788B01O94M71r08j7O05j325L81J174j227q4P15j039K20L35k35k31L88k53q5j07
808c27J2l41K27N62o90J82K1k22j34M42Pq55Q88l91m87J037j91l52R52m28j132
829a220J464q68k21J363k88j049R09j76q76J168l63k97M18Mn40J94O68q82N31
848f1M2p38P62o30K41N16l34J5N5q25M42nk73J020o87m62R03j105L37O80n08J40
870d75N41j116nM35m74N61K39m22k00L83l84K32P50o47K03K8o15K16L31M8K97
891g4J14k94K48r3N8J53L10k84J86L75n57J48J97N1O02n23M38o11L19P97o20m9
$$ plain form
747 -548 -271 154 -252 -152 513 127 175 952 689 -88 505 1248 310 1048 1415 541 997 1315 851 1215 1561
768 1561 873 1156 1572 1035 1197 1430 1432 1062 1493 1566 524 1769 1411 507 1558 1476 553 1092 1243 201
788 201 895 1366 458 441 1046 -279 102 1276 49 -35 680 -359 -139 196 -39 -270 118 -135 -220 -327
808 -327 -315 -656 -429 133 -557 -375 -354 -576 -710 -268 -261 -1116 -228 -619 -1106 -69 -260 -612 340 -88 -1220
829 -1220 244 -624 -845 518 230 -819 90 -86 -962 206 -157 -454 -36 -32 -572 -378 290 -592 -61
848 -61 -19 -757 5 -625 -384 132 -202 -187 -132 -957 -515 -520 -793 227 -460 -922 -19 -1124 -787 -107 -615 -475
870 -475 66 -1050 -1055 -620 -1094 -533 -294 -716 -916 -533 -917 -685 65 -582 -379 -351 -966 -750 -419 -371 -74
891 -74 40 -254 -6 -99 -41 112 422 138 324 699 142 290 487 538 1140 617 1055 444 763 1560 940 891
913H91N95o23J38L32p11P06L44q75P68n43n57M86O03n51p9L05m96K85o8Nn47j29
935B79Q44r77M76ko88M97M20j067M41m07k90P29k08q4m37K68M13j381Q46R1j071
956a308J869q16j166J387q86l35J318j203q2N73K94n43J01p9k62L89N91q89k58
975a305O02j5J13J81k81k41Q22O9j067R21J75q81J648r33r75R79j74M64k08l66
995d72J07j87J118m20j251J941r59k58J312k164P26J243j265Q32j08o35L51m3
1013a32L20l13p70J571q20k52Q48j930J759M51j401L04K40m52N87L52m07j37L69
1032A87m2j14J02j89L4P11m7q4r85R00J16p98J504j222k41J559j153K67P46j195
1052E6J041M5r33P09l75O05j16l63O13j507J304M50j171J386r89m36J339j167
$$ plain form
913 891 1486 863 1001 1333 622 1328 1672 797 1565 1022 465 951 1554 1003 924 1229 733 1018 950 955 408 279
935 279 1123 146 622 620 -68 429 849 -218 223 -184 -474 255 47 -37 -474 -206 207 -1174 -328 -237 -1308
956 -1308 561 -255 -1421 -34 -920 -1255 63 -1140 -1222 -649 -355 -898 -797 -876 -1138 -749 -158 -1047 -1305
975 -1305 -703 -718 -605 -424 -705 -946 -124 -55 -1122 -201 -26 -907 741 -192 -1167 -188 -362 102 -106 -472
995 -472 -365 -552 566 146 -1105 836 -123 -381 931 -1233 -507 736 -529 303 195 -440 -89 -132
1013 -132 188 -125 -895 676 -144 -396 452 -1478 281 732 -669 -365 -125 -577 10 362 -45 -182 187
1032 187 145 31 133 -56 -22 689 642 558 -427 473 589 -209 1295 73 -168 1391 238 505 1251 56
1052 56 1097 1142 209 918 543 1148 1032 669 1282 -225 1079 1529 358 1744 755 319 1658 491
1070D91j82R98p03N45k41r11N99k06k2M30n28n7n9K48n51P49k47q2N03j293K4
1091d95R17j114m06J008j020L81L37p49R36o92j33L76k61L49q50M61J9q6N65q56
1111a313k92J244j309P96N13j243J298q03n04J314j053K51J207j063K56J74o42
1128a169M07Q85n02p9J21m5l7L97k54K88K03n44N54n34p0J021l68J93n8m69J73
1149A13M22l70M22J46m27n5jJ53l54R64k36q03Q69r53j85R11m48L18P22j351K64
1170A21K69m48O76k04K33k89n60K26PK52M90m43j91J69l92r6P70o5K5j0j45o0
1192C35l65P37r3J46j75o77P5M56k52N99P4p39K21nn72N83N38K9l60K55p99j38
1214a27L47K47Q8J22j72o16M20k14%L53J5l00l57j87l0L71K40l42J53l61k68m4
$$ plain form
1070 491 309 1307 604 1149 908 -3 596 390 368 798 270 213 154 402 -149 600 353 271 774 -519 -495
1091 -495 422 -692 -1098 -90 -1110 -729 -392 -1141 -205 -897 -1030 -654 -915 -566 -1416 -955 -936 -1022 -457 -1313
1111 -1313 -1605 -361 -1670 -874 -361 -1604 -306 -1109 -1613 -299 -1352 -1101 106 -957 -701 -527 -1169
1128 -1169 -762 123 -379 -458 -337 -382 -419 -22 -276 12 215 -329 225 -309 -379 642 274 467 409 -60 113
1149 113 535 165 587 733 306 251 250 403 49 1013 777 -26 843 -110 -295 616 168 486 1208 -143 121
1170 121 390 -58 618 414 647 358 -202 24 31 283 773 330 139 308 -84 -180 590 525 550 540 395 335
1192 335 -30 707 614 760 585 -92 -17 439 187 786 860 121 342 337 -235 348 886 915 555 810 11 -127
1214 -127 220 467 555 677 505 -111 309 95 95 448 463 163 -194 -381 -411 -40 200 -142 11 -350 -618 -662
1236f62K93l7q9J23l97m13L87J37J78K0J11p48J53l5r4M73J53k09l37q6n4K70
1258h63J71J51m9m0m34j64L93M59j21L69n43j22R0J4K20L90q5N06n40m67L05O1
1280b99L31L57p9k80m05K81O93p58J73O43n40Q3n2K00K13P4O02p76J71j63J51
1301F20K15r5K79p82J76N9j25L59J96m20l5J47k51k1O9J15N6j46j09l00K87j3
1323B81j45L87j77n05k6J05N3L87k34K15k88j67L9k23M64J48l71j33P4m04M19
1344a01K39o5J76j08l79K47M5J7m1N06o59J49K86o90N10m3J31j69J5k26l3K20
1366B7L26m39L00p3l57K87k07R0P2j13K32k93k83M05j49K17n7l36N4R8m17M50
1388a66P4l82J81k72l37L00M40j84J33j8k78j39j39N10j75Rn8r8k64N01m4r2K25
$$ plain form
1236 -662 -369 -406 -495 -372 -769 -1182 -795 -658 -480 -460 -349 -1097 -944 -979 -1073 -600 -447 -656 -993 -1079 -1133 -863
1258 -863 -692 -541 -590 -630 -1064 -1228 -835 -376 -497 -128 -671 -793 -703 -689 -469 -79 -164 342 -198 -665 -360 -299
1280 -299 32 389 310 30 -375 -94 599 -159 14 657 117 200 148 348 561 635 1237 461 632 469 620
1301 620 835 740 1019 237 413 472 347 706 902 482 447 594 343 322 391 506 562 416 307 7 294 281
1323 281 136 523 346 -159 -185 -80 -27 360 126 341 53 -114 -75 -298 166 314 -57 -190 -116 -520 -101
1344 -101 138 73 249 141 -238 9 54 71 30 536 -123 26 312 -378 132 89 220 51 66 -160 -193 27
1366 27 353 -86 214 141 -216 71 -136 -46 26 -87 145 -148 -431 -26 -175 42 -15 -351 -297 -199 -616 -166
1388 -166 -92 -474 -293 -565 -902 -602 -162 -346 -213 -231 -509 -648 -787 -277 -452 -443 -501 -599 -863 -362 -406 -498 -273
1411b73l35K58j06r3L22j05L84J83m91K81o69L45N49m37K18L25n56M82j54j21
1431GP84m30K9ok93K81J34N9L19j52m56J86P8J03J54k06L05m88n7J00L46l72J50
1454E75j35j62K16n6J40k7l87K34n3j25J87m98L30K87p96P97n69l24P60p81K04
1475a83K34k66J71j23k76K84l00K46M46p44N01j98l59M80l61R0L51l08j56J61
1495c10k19L53L62m27J84Q2l49L14j16J59k28p1J48K68m96K53J35l72Q15n90J13
1516HJ95o80O92l5l82N39l81q5M36p66O01K0n28Q88o87k35M74m75L83j5l55N58
1538A70n88J40K49k35J06O2k05K18j90j37J93J72j83ko1R3n4L22k24j15PQ1J2
1561a69k11L18J00l79O46l81J6K69n57O26k77j63M14j17J50J09m03N40j56k08
$$ plain form
1411 -273 -608 -350 -456 -549 -227 -332 52 235 -256 25 -644 -299 250 -187 31 356 -200 282 128 7
1431 7 791 361 390 384 91 372 506 565 884 732 276 462 540 643 797 591 896 408 351 451 797 425 575
1454 575 440 278 494 438 578 551 164 398 345 220 407 -91 239 526 -270 527 -42 -366 394 -387 -183
1475 -183 51 -215 -44 -167 -443 -159 -459 -213 233 -511 -10 -208 -567 -87 -448 -358 -7 -315 -471 -310
1495 -310 -529 -176 186 -241 -57 25 -324 -10 -126 33 -195 -266 -118 150 -346 -93 42 -330 485 -105 8
1516 8 203 -477 215 180 -202 337 -44 -129 307 -459 142 162 -366 522 -165 -400 74 -401 -18 -33 -388 170
1538 170 -418 -278 -29 -264 -158 -96 -301 -83 -273 -410 -217 -45 -228 -230 -291 -198 -252 70 -154 -269 -262 -181 -169
1561 -169 -380 -62 38 -341 305 -76 -60 209 -348 278 1 -162 252 135 285 394 -9 531 375 167
1581A67N23l65J3j4J8J55J47k91L35l27mK74l70M78p8k04M7k29K93K13m49k20
1603A12K64J80j05j51m8J51j18Pq8M1l37L60j48k85J96o1k25K43j99q7N2n9L06
1626Am62j15K93j7j85K4N8J91l20J61L1k68P7J23r4K51j90K51l59R2J01J94k30
1649c92J42J7l9K32q5k62K45J19n0k02L84k94j50Q2M1L21m60N16r2l26M77k95
1671g1J51R3k86J38p0J9M23q7j81L4n58N32k36q1L56j18K8L4k10L03j01j77K58
1694A93k59J30L5k90J33m8Q1J7j83K47J6q5k70N19J9k37J2m7R7k28J10j43K20
1717C9l1J29j63J16N4K4J39r0%m8K4j89K48n0J02j93J3J72P2o2J6m0o4qJ99J06
1743E15k13J93k27j52L7l1Pl5J69k39L64n43Q9L87j81l60K91j38p7J16j65K7j95
$$ plain form
1581 167 690 325 338 324 342 497 644 353 688 361 357 631 261 739 661 457 504 275 568 781 332 112
1603 112 376 556 451 300 252 403 285 292 204 245 -92 268 120 -165 31 -30 -255 -12 -211 -298 -246 -305 1
1626 1 -461 -576 -283 -300 -485 -461 -403 -212 -532 -371 -340 -608 -531 -408 -502 -251 -441 -190 -549 -457 -356 -162 -392
1649 -392 -250 -233 -272 -40 -125 -387 -142 -23 -73 -275 109 -185 -335 -253 -212 109 -351 165 73 -253 224 -71
1671 -71 80 173 -113 25 -45 -26 397 310 129 163 -395 137 -99 -180 176 58 86 120 -90 213 112 -65 193
1694 193 -66 64 99 -191 -58 -106 -25 -8 -191 56 72 -13 -283 236 255 18 30 -17 80 -148 -38 -181 39
1717 39 8 137 -26 90 144 168 307 217 217 169 193 4 252 202 304 111 124 296 368 306 322 282 218 210 409 515
1743 515 302 495 268 116 153 122 129 94 263 24 388 -155 -66 321 140 -220 71 -67 -144 -28 -193 -166 -361
1766c61j08L66k05k00j01J51L15q5o8j0J51l07J23p9O8m03M61l83P4L36l58J81
1788d42K41J56n42L55m2q3P8J33q1j5j12L72j14J45k11J29J09j42QK8K11j19J5
1811G7j50Q3N4L21j89Rl2qN7JO3M9k36K71k65J54K1j8J04j7j33J13j34J30Qk69
1837F4J29Oj38K35q0j63K6j1J95l40K56j97J0J14Kj36r5L2rM9J64m49K50J93l83
1862b76L43O4k73J00m4N3L14m96K64q6n9M0M62q10L97L36l14n55Q35m27n03L73
1884b62M24L49n6m61k38J130l36O5l7l06l29m0L14q5j05M06m02M6k85j70q2O11
1906A51k05o5K12m5k58K48j3J26k31k28K50r1r3N6k04M9J43L8k64J25k20M31j54
1929b42n8k7j62K54J24l12K84j5k75N55l07K9K66l47l1J87m86N18J84K2q7k3l29
$$ plain form
1766 -361 -469 -103 -308 -508 -609 -458 -143 -228 -296 -306 -155 -462 -339 -418 -350 -753 -292 -675 -601 -265 -623 -442
1788 -442 -201 -45 -587 -232 -274 -357 -279 -146 -227 -242 -354 18 -96 49 -162 -33 76 -66 -58 -30 181 62 77
1811 77 -73 10 64 385 196 205 173 165 222 223 286 335 99 370 105 259 280 262 366 349 216 329 195 325 333 64
1837 64 193 199 61 296 216 53 79 68 263 -77 179 -18 -8 106 108 -28 -123 -91 -100 -51 113 -336 -86 107 -276
1862 -276 67 131 -142 -42 -86 -33 281 -215 49 -37 -96 -56 406 -404 -7 329 15 -540 295 -132 -635 -262
1884 -262 162 511 455 -6 -244 886 550 615 578 272 -57 -97 217 132 27 433 31 77 -208 -378 -460 151
1906 151 -54 -119 93 48 -210 38 25 151 -80 -308 -58 -149 -242 -186 -390 -341 -198 -160 -424 -299 -519 -88 -242
1929 -242 -300 -327 -489 -235 -111 -423 -139 -154 -429 126 -181 -152 114 -233 -264 -77 -563 -45 139 161 74 51 -278
1952b78N42K70n99M48n06M88J28n04N49j98j45O9j72O6K22K22k41K19q1j36j35
1973B28K09p9Kj14j77J67Q1J3n0L11k80k15K36l83J56Q5J67k5l64J59K26k42j16
1996en7qP0j21q6P3j35J11J50m89M56j82P5J48j18l13K91K8j61K71k31j50K13
2019a70K31j37j40k09L50k28K11J41l92K86J61j50q6LJ7K41O1n61M55l77L71k64
2041a86L03J74n19N8K20j95Q9Qqo4M99l92j43j23N18j54k42L09l95K42M3j0k99
2064b67R8J37L34n22K96l94J03K15J18m01QL27k54k4J22j78J99L3j7p2Q0p6J31
2087dk78M73l29j00J83J5J16j30J09Q6k8J70l31M87k84J14O7l01J60j37K51n1
2109B58J3J22k46J51O1O9j90J9J65O3l65J81J53m31N13k10J0K2j98J64j33j75
$$ plain form
1952 -278 264 534 -65 383 -123 365 493 -11 538 340 195 264 92 158 380 602 361 580 499 363 228
1973 228 437 358 360 246 69 236 317 330 280 591 311 96 332 -51 105 190 357 332 -32 127 353 111 -5
1996 -5 -62 -70 0 -121 -207 -134 -269 -158 -8 -497 -41 -223 -148 0 -118 -431 -140 -112 -273 -2 -233 -383 -170
2019 -170 61 -76 -216 -425 -75 -303 -92 49 -343 -57 104 -46 -132 -129 -112 129 190 -371 84 -293 78 -186
2041 -186 117 291 -228 -170 50 -145 -56 -48 -56 -120 379 -13 -156 -279 239 85 -157 152 -243 -1 42 32 -267
2064 -267 -169 -32 302 -220 76 -318 -215 0 118 -283 -275 52 -202 -226 -104 -282 -83 -50 -67 -139 -59 -135 -4
2087 -4 -282 191 -138 -238 -55 -40 76 -54 55 141 113 283 -48 439 155 269 336 35 195 58 309 258
2109 258 271 393 147 298 359 428 238 257 422 485 120 301 454 23 536 326 336 358 160 324 191 16
2131A6R8rQ6R2j94k50K72j57J31nq0J79k71l8p3K80j21k29q0J15j78N9J15l7p7
2156c56L27j25j66J53m1j99L85j89O2P2j61j66o6K49j32K60o9j79J42K99k49p6
2178b25Q1J75J25k14o7K29j7j67J81k3Pk51N4J56M7j62J92j71O9J80m8J24pJ27
2202C95k51Q8l56J96J70k28K8j28J17o7j84J80p6J18J7P5k7r1n8rm6J99j51R0
2226Aj42k28O05l47o9J95j29M1M5r8n5K29k69K83j83O8J16k32M16j86L18l42R5
2249A32k37J39J10K8j33n2J26L53l16p3J89Q9r2k18J43j79J28k7N0J04j43J47
2271B68k14M8J14k06J48r8l1q2K27j75P3J41k82J4O8M4n6j19J09k28N02o85J62
2294b58K45j65K0k15J62m6J77J09l58J99l22K09k3j50r0J48K51J0q8j63K51k14
$$ plain form
2131 16 114 105 191 283 89 -161 111 -46 85 80 0 179 -92 -130 -203 77 -44 -273 -353 -238 -416 -357 -242 -279 -356
2156 -356 -29 -154 -320 -167 -208 -407 -22 -211 -149 -77 -238 -404 -470 -221 -353 -93 -162 -341 -199 100 -149 -225
2178 -225 -144 31 156 -58 -125 104 87 -80 101 78 85 -166 -112 44 91 -71 121 -50 19 199 151 275 268 395
2202 395 144 232 -124 72 242 14 42 -86 31 -36 -220 -40 -116 2 19 94 67 -24 -82 -91 -137 62 -89 1
2226 1 -141 -369 236 -111 -180 15 -114 -73 -28 -126 -181 48 -221 62 -121 -53 63 -169 247 61 379 37 132
2249 132 -105 34 144 172 39 -13 113 466 150 77 266 355 263 45 188 9 137 110 160 264 121 268
2271 268 54 102 216 10 158 60 29 -53 174 -1 72 213 -69 -55 13 57 1 -118 -9 -237 265 -420 -258
2294 -258 -13 -178 -158 -373 -211 -257 -80 29 -329 -130 -452 -243 -266 -416 -506 -358 -107 -97 -185 -348 -97 -311
2316c11K14o5l3Pj73K17J78J66l47K00j26k28K90Q0j22J50o4L30n36J91j19K17
2338A16K19p5k15q4O8j7L87p3k33N5j53J39k0j53J75J84m3k66J05k0j8K11l39
2361e0L44p0j9j80r0K24j09J99k73J75k82K86j81L5P6j24P8J30k96N5J30o8m7
2384e7K87j33k06K39m8l7q9J65l04N7J95q2j01K35q2L1J4m0m0j26K08m7j89K00
2408E0K02q5k18K07k8L7k65rL16m1j21J75j58Q5J45l49K6J67rJ24k62J47N4l74
2432a84J25J31k74Mm2m3O4Q2O2Q7k28l3J81o8K2L2l13L21l76J36O7P7m5r0M0J31
2458a34j39L1p2Q7j85K60R0J40k6k86k0j14J57P2Q4N5q2K37o9J41l15N2J89p1
2482H2j26lL12j68j9j15L08J90k06M8k00Q9O9J10j63j8j96J71k16L67k01J23K2
$$ plain form
2316 -311 -97 -162 -195 -188 -361 -144 34 200 -147 53 -73 -301 -11 69 -53 97 33 363 -173 18 -101 116
2338 116 335 260 45 -39 29 12 399 326 93 148 -5 134 114 -39 136 320 277 11 116 96 78 289 -50
2361 -50 294 224 205 25 -65 159 50 249 -24 151 -131 155 -26 9 85 -39 39 169 -127 -72 58 -10 -57
2384 -57 230 97 -109 130 82 45 -44 121 -183 -126 69 -13 -114 121 39 70 84 44 4 -122 86 39 -150 50
2408 50 252 167 -51 156 128 165 -100 -109 207 166 45 220 62 147 292 -57 -31 136 127 251 -11 136 190 -184
2432 -184 -59 72 -202 -198 -240 -283 -219 -137 -75 12 -216 -249 -68 -136 -114 -82 -395 -74 -450 -314 -247 -170 -215 -305 -265 -134
2458 -134 -273 -242 -314 -227 -412 -152 -62 78 52 -234 -254 -368 -211 -139 -55 0 -82 155 86 227 -88 -36 153 82
2482 82 -44 -47 265 97 78 -37 271 461 255 303 103 192 261 371 208 190 -6 165 -51 316 115 238 260
2505B60q5k05J43J00l15K12J71r2j06r6J0N2J15N2n07M39l4q4L3o9j54R7o9j54
2529b86J65j1K42l37J67J10k58L24n6Ll88J54K2k6j16L27K47j69j21r3J68K96
2551C64l73j27L67k92j06M46k20L2l9K20j67j35K35j48p5r5L41k28J94j22K71
2572C43k79j89oJ75k7K92l44q1J18Q2k65J62j99M9K21r6p1l7m8J47j77J61O6k30
2596b33L36k65j01K17Qj33n8L72l38r7L06q0j12J83j60k2K25L5l18K22l5o4L9
2619g3j51K36n5j55K12K42q6q3Oo9J24m5Oq6J67J74P2l93J44J8k9J13o0M6Kl27
2645e0J61J21j64K19k48L15o7k48j3k21L83k6k12q0K29j82O1n3O8p2j3K26j15
2668A9n3k83K94J80k70QKO2k28L77k08P1k26J54M0j60N5j95M83n29L51j18J92
$$ plain form
2505 260 175 -30 113 213 -102 110 281 189 83 -13 -3 49 164 216 -291 148 114 30 63 -6 -160 -63 -132 -286
2529 -286 -121 -132 110 -227 -60 50 -208 116 60 63 -325 -171 -149 -175 -291 36 283 114 -7 -100 68 364
2551 364 -9 -136 231 -61 -167 279 59 91 52 272 105 -30 205 57 -18 -113 228 0 194 72 343
2572 343 64 -125 -131 44 17 309 -35 -116 2 84 -181 -19 -218 -169 52 -44 -115 -152 -200 -53 -230 -69 -3 -233
2596 -233 103 -162 -263 -46 -38 -171 -229 143 -195 -292 14 -66 -178 5 -155 -177 48 83 -235 -13 -48 -112 -73
2619 -73 -224 12 -43 -198 14 256 170 87 93 24 148 103 109 23 190 364 436 43 187 205 176 289 229 275 277 -50
2645 -50 111 232 68 287 39 354 287 39 26 -195 188 162 -50 -130 99 -83 -22 -75 -7 -79 -92 134 19
2668 19 -34 -317 -23 157 -113 -105 -103 -41 -269 108 -100 -29 -255 -101 -61 -221 -166 -361 122 -407 -56 -174 18
2691A8k01M1J12j16N6k9j57K58P8o7l3j01M48l05M7k18N9K17J56m93K67O6j39
2714c6L2k2M2j48M39l61J17K0j59L98k21k29L34k13K90j40j50OL3m3j66K59j52
2737g0J26ro6p8J01j82j45N30m14K4K95j77J7k10J71o8oR8M7J52N8r1J2j23j5
2762b3Q6k11k22L37J51K4RQ3m27Q8J41k3L34K43m94qj36J27R4k63J95o4K10j07
2786A44j88L61m51r2O10k42J18k3J35n53L64J29j66j42K28K53m30j06J4L43m52
2807a46L46k72K47j95j59L72l59J38j30K55k70J00L8k7j64K15k41N0p9n6k1K92
2829f6j70p3J10P4K22n70P09k96O5j24j91J16j08J27J67j67J57k16K36L6j05j93
2851b60K17J13J06k70K07q9R6K55l16j24P8J80j00L1j5p1j24J6j2K77O6mj18K0
$$ plain form
2691 18 -183 -142 -30 -146 -90 -119 -276 -18 60 -7 -40 -141 307 2 49 -169 -110 107 263 -230 37 103 -36
2714 -36 -4 -26 16 -132 307 -54 63 83 -76 322 101 -128 206 -7 283 143 -7 -1 32 -11 -177 82 -70
2737 -70 56 47 -19 -97 4 -178 -323 207 -207 -183 112 -65 -48 -258 -87 -155 -161 -63 -16 136 194 103 115 -8 -23
2762 -23 63 -148 -370 -33 118 142 151 234 -193 -105 36 13 347 590 96 88 -48 79 173 -90 105 41 251 144
2786 144 -44 317 -134 -226 384 142 260 237 372 -181 183 312 146 4 232 485 55 -51 -37 306 -146
2807 -146 200 -72 175 -20 -179 193 -166 -28 -158 97 -173 -73 -35 -62 -226 -11 -252 -202 -281 -337 -358 -66
2829 -66 -236 -309 -199 -125 97 -473 236 -60 5 -119 -310 -194 -302 -175 -8 -175 -18 -234 2 38 -67 -260
2851 -260 -43 70 176 -94 113 24 120 375 59 -65 13 193 93 124 109 38 -86 -70 -82 195 261 257 139 159
2875A59Ro0J5P3q1p7l1L18q2r3r2j46p1R9K26j70J93l81J74m2J11j06J96j04q4
2900d7J0n7j5L1K66k62j48K63k65K45j96j72K04J16j02K39j78j49P0K47r9j0L25
2923C16k38O1J03k07K1j3k0k8M7l9j21K85N4j12j16L0NO3K03n9l00J91J42l49
2947h1M07l96P1P4l0Q9Ok26k2L3J35L3j60J60k17R9N5j73J45r5Q0mQ9k23k33M77
2973I3l6k03n9M3l5K95l24K51k0q9J78j68j59NJ90j54k5M0K13q3l29N23l98Q8
2997a63R1Q6K4j42m0K36o0j05K17l4J61j2M1l24L37L03k67l97j6K15l86M41N37
3020G43r69k48Q50n92J09j03Q7j3K36J05j68J10J19j07j75J1P5k60p1L77R5j64
3042D7r1J55k33J64k21K4J52n2j18j32R7K17Nj46M5J27j12J17j63j46J31j81Q2
$$ plain form
2875 159 168 108 123 196 115 38 7 325 243 150 58 -88 -159 -60 166 -4 189 -192 -18 -60 51 -55 141 37 -47
2900 -47 -37 -94 -109 -78 188 -74 -222 41 -224 21 -175 -347 -143 -27 -129 110 -68 -217 -147 100 1 -9 316
2923 316 78 139 242 35 56 43 23 -5 42 3 -118 167 221 109 -7 23 28 91 294 235 -65 126 268 -81
2947 -81 326 -70 1 75 45 134 140 -86 -108 -75 60 93 -67 93 -124 -25 30 -143 2 -93 -13 -17 72 -151 -384 93
2973 93 57 -146 -205 -162 -197 98 -226 25 5 -84 94 -74 -233 -228 -38 -192 -217 -177 36 -47 -376 147 -251 -163
2997 -163 -72 14 38 -104 -144 92 32 -73 144 110 271 259 300 -24 313 616 349 -48 -64 151 -235 206 743
3020 743 -226 -474 376 -216 -107 -210 -123 -136 100 205 37 147 266 159 -16 -5 70 -190 -261 116 211 47
3042 47 -44 111 -122 42 -179 -155 -3 -55 -173 -305 -208 9 14 -132 -87 40 -72 45 -118 -264 -133 -314 -232
3065b32L59l78j48K96O0K04k66j5M12m04J97jp2N3k38J68Oj42K38J18j37n5J05
3088A28k0j7n5N2j36L9j32L11j38j3K14k34K11m31K06J82j81Q3j03Lj15R7lj10
3112a62Q0J74p6K37k05j54M36l81M6j00k43J14K10l50L10PJ10k04j47J50p6N4
3134a70j16J57K98l70J12J09o9l90L57L07j44J12j05K50l5l69Q3J16k2n5p5J36
3156A17q9J14N6l9p6np8M00l83n2J28r0p1M73k65r1K00R4k25j4J49m73L22J18
3180B20j55J2j71k18J55J71j57K37j16K27k38j9K02l3k32J04J73p0J13l18n5K40
3202G2j01k1P2j85J9K40p9j17n0J48K56l34l54M20K07l04K5K07k15k5Q7K0M7Q6
3226A21p6Mkp3q9J36O0N3j88J2K79j93m7R9j35Q4j60J47J15j07K8K23j43j15R8
$$ plain form
3065 -232 127 -251 -399 -103 -43 161 -105 -120 292 -112 85 84 12 65 -173 -5 1 -141 97 215 78 23 128
3088 128 108 91 36 88 -48 -9 -141 170 32 19 233 -1 210 -221 -15 167 -14 69 -34 -31 -146 -49 -52 -162
3112 -162 -82 92 16 253 48 -106 330 -51 -5 -105 -348 -234 -24 -374 -64 -57 53 -151 -298 -148 -224 -170
3134 -170 -286 -129 169 -201 -89 20 -49 -439 -82 225 81 193 88 338 303 -66 17 133 111 56 -19 117
3156 117 28 142 198 159 83 78 0 400 17 -35 93 3 -68 405 140 49 249 343 118 104 253 -220 102 220
3180 220 65 77 -94 -312 -157 14 -143 94 -22 205 -33 -52 150 117 -115 -11 162 92 205 -113 -168 72
3202 72 -29 -50 22 -163 -144 96 17 -100 -150 -2 254 -80 -434 -14 193 -111 -86 121 -94 -119 -32 -12 35 121
3226 121 45 49 47 -26 -115 21 81 134 -54 -42 237 44 -3 96 -39 45 -115 32 147 40 68 291 148 33 131
3251A31j49N1l9L1J65k45K42k43K28o1k02r4K66o4kM8k0R4k57j24J69J72l96M99
3275B00n42K67M30m62p5Q3j49R7j2L9K52j34k09K60q9J97k06o0Q7RJ44m02L34
3298E9J05q0K5p9R0p4r6J78l09P0j40K92M4J59k88k1K16L7M8l21L69o5l5p5J5
3323A24J3r7P2j56L65p3k60J4j3j03K13j68k66L09k09K50K3j96n6K32j88J30j71
3346b11K48J0k90J76M4K01m9l77K50q9J15l2j29K62k05J4J58r1k35J10m7J08J58
3369I9j36qJ64k54K48J13j67k0J15j97LJ48n5O3j62L2J90j86r7Q6J34r0M0j95
3393a32K8K19k36K40P3k08J85l02L78l68L2R4n6j77J90j18K16J46j68k05L8L11
3415A80K15m35K20j16k36k8l7L44m4j74n5J39l00L64l78P5J66J03Q1j02O4p6j09
$$ plain form
3251 131 -18 33 -6 25 190 -55 187 -56 172 111 -91 -185 81 17 15 63 43 137 -120 -244 -75 97 -299 200
3275 200 -342 -75 355 -107 -182 -99 -248 -151 -163 -124 128 -6 -215 45 -44 153 -53 -113 -26 -17 127 -275 59
3298 59 164 84 109 30 120 46 -50 128 -181 -111 -251 41 85 244 -44 -65 151 188 236 -85 284 219 184 109 124
3323 124 137 40 112 -44 321 248 -12 2 -11 -114 99 -69 -335 -26 -235 15 38 -158 -214 18 -170 -40 -211
3346 -211 37 47 -243 -67 -23 178 129 -248 2 -87 28 -4 -133 129 -76 -62 96 5 -230 -120 -167 -59 99
3369 99 -37 -45 119 -135 113 226 59 39 154 -43 -40 108 53 116 -46 -14 176 -10 -107 -21 113 23 63 -132
3393 -132 -104 115 -121 119 192 -16 169 -133 245 -123 -91 3 -53 -230 -40 -158 58 204 36 -169 -131 180
3415 180 395 -40 180 64 -172 -200 -237 107 63 -111 -166 -27 -327 37 -341 -266 -100 3 84 -18 46 -30 -139
3438a39J22oJ71j73K8J05Ql45L25l27J52Q6O4n2j99L08K1j22l3j12J27L14l28
3461ej52J79J35P6l58K87p2j59N7jJ6P9j25J15K50k13r5o9K11j25J81k22j19K17
3485H8jj29P8M2j0j38Q4j44j06J60J17j60R0j05K41k25j77L10M5J20k10j15K46
3508A01m28L54%M4Qk52K5j82J89R4j09K33p4j41KJ34j48J15M9J14q1Jq3J1K8K24
3534B28k9l19L44j5j83P4o7j31J62J00j89j55K41r1N8K1nJ61l56N3R4K79l60O2
3558b3P5j07K5j96K39N7j95K57j67Jk75OJ77L01l80k6K29N5k51K43j74q5J92j16
3582a38K90l22J9K70k16n9L19l35J72L00m22M40l16J73j63K58m27K18J04j43m1
3603a9k79L02J31k20rk1L07j40Q5j40K66j78q5J16j35L69j43o1q6j62qM3J19l5
$$ plain form
3438 -139 -17 -23 148 -25 3 108 116 -229 96 -231 -79 7 71 19 -180 128 149 27 -6 -118 9 323 -5
3461 -5 -157 22 157 233 -125 162 90 -69 -12 -13 3 82 -43 72 322 109 14 -55 156 31 212 -10 -129 88
3485 88 87 -42 36 78 68 -70 14 -130 -236 -76 41 -119 -29 -134 107 -118 -295 15 60 180 -30 -145 101
3508 101 -327 27 27 71 79 -173 -148 -330 -141 -47 -156 77 3 -138 -136 -2 -150 -35 14 128 47 48 -35 -24 4 228
3534 228 199 -120 224 209 26 100 33 -98 64 164 -25 -180 61 -30 28 49 44 205 -151 -98 -4 275 -85 -23
3558 -23 52 -55 -30 -226 13 70 -125 132 -35 -34 -309 -303 -126 175 -205 -231 -2 53 -198 45 -129 -214 -22 -138
3582 -138 152 -170 -151 119 -97 -156 163 -172 0 300 -122 318 2 175 12 270 -157 61 165 22 -19
3603 -19 -298 4 135 -85 -94 -115 192 52 137 -3 263 85 0 116 -19 350 207 146 60 -102 -110 -67 52 17
3627A7J58l87M87j01o9k58R6k7R3k1mK6J10p1l11M77k10J48l55J04Kr9k01N06
3651A10r3j19r4M8q2J81j05Qoo4l7M1L72j78K41m61L95m51K47r5m9R8n8L15K29
3676C93j60k60l2J32K15k17jj40J77K18l05J78o7J19k45K33l11J19J06j69J33
3697A16N8o0j31K66k47K74j04q5k68Q1lR0RJ89j52j75L12l25J43k1JJ03qqk20
3722a65K19K66m06r5J60J1J11J0R7j36j26j77O53p04K3K78k10J11j12N44k80O5
3744A37j37J86m83K02l62O27q00P94q05R26n78r31P84K18o1M74L47o80L74m3k13
3765b4l5J62n1J29k4j7k90Q8k8J77K33l96P4J1j35J07J43j43j65n1K44q3P9J06
3789A11K9j00pk50K9J05R7o1j61N5K07q6J62j43j71L06n1j05O2j14q5K28k70K04
$$ plain form
3627 17 175 -212 275 174 105 -153 -57 -84 9 -12 -16 10 120 49 -262 215 5 153 -202 -98 -96 -195 -396 110
3651 110 17 -102 -196 -148 -230 -49 -154 -146 -152 -216 -253 -212 160 -18 223 -238 157 -294 -47 -142 -191 -93 -151 164 393
3676 393 233 -27 -59 73 288 71 70 -70 107 325 20 198 131 250 5 238 -73 46 152 -17 116
3697 116 174 114 -17 249 2 276 172 87 -181 -100 -103 -13 -4 185 33 -142 170 -155 -12 -33 -32 71 63 55 -165
3722 -165 54 320 -86 -181 -21 -10 101 111 208 72 -54 -231 422 -282 -259 19 -191 -80 -192 352 72 137
3744 137 0 186 -297 -95 -457 170 -630 164 -641 285 -293 -1224 -440 -222 -283 191 538 -142 232 189 -24
3765 -24 -59 103 52 181 157 140 -150 -62 -90 87 320 -76 -2 9 -126 -19 124 -19 -184 -235 9 -74 5 111
3789 111 140 40 33 -217 -188 -83 14 -47 -208 -153 54 -32 130 -13 -184 122 71 -34 28 -86 -171 57 -213 -9
3813iK6Kp7O4o8M5r0j90J67L45L4r3j6k21K0N2Q8p6L64m03o5N8K40N6j04j94m4
3840h9M28k28j37K37K2m35K19j34M61j00j56j29n9K64j54j50J03K47k45N1J32
3861A48k59p3J46J71k40j3pj64K09J01J45P8j19k21po2O9R0j28O3O4k28J71J32
3885F6q1QR1k34J06l26M44l1J72k48k3J00j65N3J22K9o5j94K57j21j86L60n5j29
3909e0j16K52O7k49l7Q0j43L09J7k25p2J51k0n3K48l24p1J55K13J20j87p6J43
3932A32j02nJ7q5m7L6J50j51j60K42j74oK1m2J34j01P1r8L0k27L88k82K62J30
3956A33n4o8k23L72k94J74j03j04J88j68L44k56M8J61N5J1j36p2k22J19p1J71
3978Er1J03Q3P8j35j98K40J91j61j41j09L66J38m96J20j3J86RJ81k32m2J52kN3
$$ plain form
3813 -9 17 19 -58 6 -62 -17 -107 -297 -130 215 249 156 140 -81 -61 -9 79 3 367 -36 -101 -43 197 253 149 -45 -89
3840 -89 339 111 -26 211 233 -202 17 -117 344 244 88 -41 -100 164 10 -140 -37 210 -35 16 148
3861 148 -111 -184 -38 133 -107 -120 -127 -291 -82 19 164 242 123 -98 -105 -167 -98 -8 -136 -73 -9 -237 -66 66
3885 66 -15 -7 84 -150 -44 -370 74 43 215 -33 -56 44 -121 -68 54 83 18 -176 81 -40 -226 134 79 -50
3909 -50 -166 86 153 -96 -133 -53 -196 113 130 -95 -167 -16 -36 -89 159 -165 -236 -81 132 252 65 -11 132
3932 132 30 25 42 -43 -90 -54 96 -55 -215 27 -147 -153 -132 -174 -40 -141 -70 -168 -138 -365 23 -259 3 133
3956 133 79 11 -212 160 -134 40 -63 -167 21 -147 197 -59 -11 150 205 216 80 8 -214 -95 -166 5
3978 5 -86 17 100 178 43 -155 85 276 115 -26 -135 231 369 -127 -7 -20 166 175 356 124 82 234 232 285
4002B85Nj41Jj55j21K34j78p6n1K0R0QQ5k67K32j48K09m68M72j1J20j41q8j38
4026b22P0o8L6K80l57J60J15j60K34j09P8o2j61p7K06j56L52r1k33K8K57r4K2
4049D8q2k67L69j57R9l8J38j49m6K00RO2l11J7K3J48K22l53K15l44L66j80J76
4072A65J1r3k16J83L99n19O1j32K09j89J11J41l70L01p9M09j32k65J06o6j85K06
4094E6k84J92k61L87k62l2J98J38j92M7Q8j30P0j33K46RL4j56J51k90K04p2q4
4117g6K07l68M56l88J89N1m8L3J0L4k0K96l58J57J19n8j80j01K11l6l27L11L4
4140A48o8l48L03k3k16M23j36r4m6J16N2k26K29o8J94nj65n15P86M6j102O18M2
4163e5R0j23Q2O7j74r9K91j64Q3j29K03m9M9j62J96O9m6m99O86m03J98m44M17
$$ plain form
4002 285 290 149 150 -5 -126 108 -70 -146 -197 -177 -87 -79 6 -261 -29 -177 32 -436 36 25 145 4 -84 -222
4026 -222 -152 -220 -184 96 -261 -101 14 -146 88 -21 57 -5 -166 -243 -37 -193 159 68 -165 -137 120 26 48
4049 48 -34 -301 68 -89 10 -28 110 -39 -85 115 124 186 -125 -108 -85 63 285 -68 147 -197 169 -11 165
4072 165 176 83 -133 50 449 -70 -9 -141 68 -121 -10 131 -239 62 -17 392 260 -5 101 35 -150 56
4094 56 -228 -36 -297 90 -172 -204 -6 132 -60 -13 75 -55 15 -118 128 137 171 15 166 -124 80 8 -76
4117 -76 131 -237 219 -169 20 71 23 56 66 100 80 376 18 175 294 236 56 -45 166 130 -197 114 148
4140 148 80 -268 35 12 -204 219 83 -11 -57 59 111 -115 114 46 240 235 70 -445 341 387 -715 -97 -55
4163 -55 35 -88 -6 61 -113 -212 79 -85 -2 -131 72 23 72 -90 106 175 129 -370 316 -87 111 -333 84
4186H4l22k40M00k70K03J09M5n4k1o2J73q0J34k33J91Q6J4l5j04jj98K35J81j54
4210H1O4J1k48J35j78p1J32K31j99K8J17m3j71j00K38R1j52J92Lk26K90k10R8
4233A13j78J0MJ71r2J60j54n8J18k8k5k20K28k53J67J8r5K04j91jL9J04r0k4M2
4258c1K92j52j85R9j89K78K5j16J15j55rN6P2k24O2j90K61R4Ok27J55J0j3J2o9
4283b3o9J78j53K59k80K4P9J75Q8l11J26k6N3q5j73K72o0j23k00L47j47M3J61
4306A55rq5k8J08l15L09m60J72L6k4J19Q4j27K7p0P8j77J17K08Pk8P0o2R4l52
4331a53K92l84J60N7pO2M2j24l9J45n9J9j27L08m21K20p6K15j89M8J43J79k51
4354F0J11o8j85J74Kk43J05K41j23j21J92j02O6k2r5J19j8L1j81J22Nj60k0K77
$$ plain form
4186 84 -238 -478 -78 -348 -145 -36 9 -45 -66 -128 45 -35 99 -134 57 143 157 122 18 17 -181 54 235 81
4210 81 145 156 -92 43 -135 -206 -74 157 -42 -14 103 60 -111 -211 27 118 -34 158 161 -65 225 15 113
4233 113 -65 -55 -51 120 28 188 34 -24 94 66 41 -179 49 -204 -37 -19 -114 90 -101 -102 -63 41 -49 -73 -31
4258 -31 261 109 -76 23 -166 112 137 21 136 -19 -28 28 100 -124 -62 -252 9 103 109 -118 37 47 34 46 -23
4283 -23 -92 86 -67 192 -88 -64 15 190 278 -33 93 67 120 35 -138 134 74 -49 -249 98 -49 -6 155
4306 155 146 61 33 141 -174 135 -325 -153 -117 -141 -22 62 -65 -38 -108 -30 -207 -90 118 125 97 167 105 199 -153
4331 -153 139 -245 -85 -28 -35 27 69 -55 -94 51 -8 11 -116 192 -229 -9 -85 130 -59 -11 132 311 60
4354 60 171 103 -82 92 94 -149 -44 197 74 -47 145 43 109 87 -8 111 93 124 -57 65 70 -90 -110 167
4378A67j72j52K16j68J80j05M7j30J39j87P4J12m8p1K92k83m1L36k90j89j1K28
4400e6K56m56j8Q5R3J01j63J36J1m3k1r8Nj95K53k8J54R4j03j4k20L29q8K32l49
4425a03M70J95j018j8L47K07k60p3J77J60q4J01Q4l99J64R2j23J43k78M46l06
4446g6j49K11o0L87o84M99J74J31j135J37Q19n15M82k97J39l40K86j76K78k8j56
4467g3L1l6n7L11j50L5k24J48j62j46L22j01J52j19K44m26J06Q2r9Q2j5J62j30
4490f3o1J26j35o4J07K54k42K12j56j6K33j93l1jp1J45j01K67m09K24j12j6j16
4513b19J91q6l8J57K00r9m0Nm0L73r9m47L4L47k79o3J26j9l2L4N3J85l64j06O4
4538a62J42j5M9j60K54R7k16j60K43k36J17j47j20L55J05j87L90m19o5j2J80k3
$$ plain form
4378 167 -5 -157 59 -109 71 -34 13 -117 22 -165 -91 21 -27 -98 194 -89 -130 206 -84 -273 -284 -56
4400 -56 200 -256 -274 -189 -96 5 -158 -22 -11 -54 -75 -173 -168 -363 -110 -138 16 110 7 -7 -227 102 14 246 -103
4425 -103 367 562 -456 -474 -127 80 -180 -253 -76 84 0 101 185 -214 -50 42 -81 62 -216 230 -76
4446 -76 -225 -14 -74 313 -371 128 302 433 -702 -565 254 -261 221 -76 63 -277 9 -167 111 83 -73
4467 -73 -42 -78 -135 176 26 61 -163 -15 -177 -323 -1 -102 50 -69 175 -251 -145 -63 -162 -80 -95 67 -63
4490 -63 -124 2 -133 -197 -90 164 -78 134 -22 -38 195 2 -29 -30 -101 44 -57 210 -199 25 -87 -103 -219
4513 -219 -28 -114 -152 5 205 106 66 71 31 404 305 -142 -108 239 -40 -103 23 4 -28 6 59 244 -120 -226 -162
4538 -162 -20 -35 14 -146 108 205 -11 -171 72 -164 -47 -194 -314 41 146 -41 349 -70 -135 -147 33 10
4560A0J17j69k6J91j47q3J09j33M2J52j70K97j84O0j02J81j72j1J14j40M24l32
4582B8m4j54O1J62O7n7j43J65n3o6J67k02N7K9j57J37Lj7j49O1K39k08J51j3l7
4607B7k1j20J81k16J74N5k5m3l5p7r5J29Q8m9K67j03P6l35J26j69L01k93J57O7
4631F7p3j12J23J91j77P6j96R9K6L7J02k21J79j42j25J26k66L52k28K75j94J90
4653A09o6j89J87J34j52j68J71P6M4j32j3j11n0J9o6k2R9l6K05l5J6n5J40J4M3
4678A62k00j71K24k13J08J40l6K93l81j3K24l25J65J37J12m14P1J83mj95K69k26
4700i0O0j5j84J45J49j25K1lk7J98j98n1J75l5k59J75K02k73Q8P6M2j39J39K40
4724C11k41r6M2k3j07K85j04O2k87J96J47O0l77j43O7J19M89k40j66RL43k83K37
$$ plain form
4560 10 127 -42 -68 123 -24 -107 2 -131 -89 63 -107 190 6 66 -36 145 -27 -38 76 -64 360 28
4582 28 -16 -170 -109 53 120 63 -80 85 32 -34 133 -69 -12 17 -140 -3 0 -17 -166 -105 134 -74 77 64 27
4607 27 6 -114 67 -149 25 80 55 12 -23 -100 -195 -66 22 -27 240 137 213 -122 4 -165 136 -157 0 67
4631 67 -6 -118 5 196 19 95 -101 -2 24 61 163 -58 121 -21 -146 -20 -286 66 -162 113 -81 109
4653 109 43 -146 41 175 23 -145 26 102 146 14 1 -110 -160 -141 -207 -229 -130 -166 39 4 20 -35 105 119 162
4678 162 -38 -209 15 -198 -90 50 14 307 -74 -87 137 -188 -23 114 226 -188 -117 66 62 -133 136 -90
4700 -90 -30 -45 -229 -84 65 -60 -39 -42 -69 129 -69 -120 55 20 -239 -64 138 -135 -47 29 71 -68 71 311
4724 311 70 -26 16 -7 -114 171 67 129 -158 38 185 245 -132 -275 -208 -89 400 160 -6 3 346 63 300
4747C00k9k28K18kl13J11k99P7M19p8j6j74lL8J9K03k90J48n4j17J5RP6l16L70
4772H4j21p4K5R3k6Q0j86j52L48j79n8K60L9lj33Q7J69j18l23L1M80l85J99J02
4796B39l10r4J53J22l60K46r3J6J20k43p6L47J40j24L9j23po6J71o9K45k17j43
4819h7K29l17J00N1J12Q6j44k53K07J49q0j97K45n3j06J98r9l00QL10j58k7j3
4842a39J18o6L6j44JJ89k29J73J98k06J57p6j01p5NR0m0M2n5L09q2j77n2K53o
4867A23J1j08k22J97R7k76J09J18K11j39J9k12K63m18J27K01k31M14%l83J70J14
4889A85j1j75k4K78o04N30j73n2K10n9l72K87M2k32K0j43M14j07L8J30k10K0J
4912gr0R7J5q4J40o0r6j92J75K44k82P6n8J59J03j51n1J07j19J4m6L35k11j1j36
$$ plain form
4747 300 271 43 261 259 -54 57 -242 -165 254 176 160 -14 -17 21 40 243 -47 101 47 -70 -55 -46 30 -286 84
4772 84 -37 -111 -86 7 -19 61 -125 -277 71 -108 -166 94 133 130 -3 84 253 135 -188 -157 323 -62 137 239
4796 239 -71 -165 -12 110 -250 -4 -97 -81 39 -204 -280 67 207 83 122 -1 -8 -74 97 28 273 56 -87
4819 -87 142 -175 -75 -24 88 174 30 -223 -16 133 53 -144 101 48 -58 140 41 -259 -251 59 -99 -126 -139
4842 -139 -21 -87 -51 -195 -194 -5 -234 -61 137 -69 88 12 -89 -164 -159 -69 -109 -67 -122 187 105 -72 -124 129 123
4867 123 134 26 -196 1 98 -178 -69 49 260 121 140 -72 191 -227 -100 101 -130 284 284 -99 71 185
4889 185 174 -1 -25 253 -351 179 6 -46 164 105 -267 20 62 -170 -150 -293 121 14 52 182 -28 -8 -7
4912 -7 -97 0 15 -69 71 11 -85 -277 -102 142 -140 -64 -122 37 140 -11 -62 45 -74 -60 -106 229 18 7 -129
4937a29K18J27j33p6N0l35M53k60J90k38o6J24J15J63P4l74J37J21m0k10J4J74
4959I9J02q2Pq5j50Q0K82k40k63K21k9k6K91p3l3PJ98l06k85L39K66l57j79J57
4983e9k3J61m2j71J72M1J27K4k70NPj80J43o8J7P4J34P5k17J58n2p6j14J16J65
5008A47n1N1k22N0j60K19j29J70n9j73J03Q9o2J92l83J98K17l98J71j4l2L11j48
5031H7P8lj69J6K03k95J92nN9k43K59q8l8pJ5N7j38M1J24J9k39K51k27Q2j42K59
5057A48m3j12R9n9j35j04J29J31m9k05R3O2J83Q2l25J46m1k90K12M4l6K2J91l19
5081a76K82l77K76M69l79l20K84k79L02k42M2M1J60Q7j39l0j91P8J4j5J16K49
5103B52m45K36Q9k13J88k08J21L7j07o0K85m89L08K23k04J68k05M7m8J62l08K98
$$ plain form
4937 -129 89 216 83 7 57 -278 175 -85 105 -133 -199 -75 40 203 277 -97 40 161 121 -89 -75 99
4959 99 201 119 126 41 -109 -29 253 13 -250 -29 -58 -84 207 134 101 108 306 0 -285 54 320 -37 -216 -59
4983 -59 -82 79 37 -134 38 79 206 230 -40 -35 -28 -208 -65 -133 -116 -42 92 167 -50 108 56 -20 -134 -18 147
5008 147 96 147 -75 -25 -185 34 -95 75 16 -157 -54 35 -27 165 -218 -20 197 -201 -30 -44 -76 235 87
5031 87 165 162 -7 9 212 -83 109 104 163 -80 179 91 53 46 61 118 -20 21 145 164 -75 176 -51 31 -111 148
5057 148 105 -7 92 33 -102 -206 -77 54 5 -200 -107 -45 138 220 -105 41 0 -290 -78 -34 -70 -48 143 -176
5081 -176 106 -271 5 474 95 -225 59 -220 82 -160 -118 -77 83 170 31 1 -190 -112 -98 -113 3 252
5103 252 -193 43 132 -81 107 -101 20 57 -50 -110 175 -314 -6 217 13 181 -24 23 -25 137 -171 127
5125A27p2p2j62J33Q3j01O9J43q0o6N1r5K91l51J04j70J49j11K20l84K66K16n43
5148c55M86k32r2K19J55p8M3ln8N8k46J90nj90j1M7J51j08n3J44j41L2N9OJ39
5173A57k60K04j46p1K24l23L56j9M3j08o5K29j73P0J97k39J14m7L3j72P6P1k50
5196i9o2J29L02n10L40k12J72j84L6n7K27q9oo9K95j58l82M81o6J58m80N3J72
5219iK21k20N4l26K18O1j44n6K0M81k62J13l43K55N4j60J14j59j83Q7p7J50r7
5242b08K15k4j27P4M2R2j5L5n1L72k69j69J93k70k18M59j96K23l55J53m0K31k04
5265e7L6M0k1j62J37L4J53k24j00M5M53m11J81k44P7K00l9n5j10N0L0l7J54p5
5289E5J23j85L42l92k7J09n0l8J93l5j49Rj70J89k42J90o6J78J1P7j98J43oR7
$$ plain form
5125 127 55 -17 -179 -46 37 -64 5 148 68 2 53 -42 249 -102 2 -168 -19 -130 90 -294 -28 188 -355
5148 -355 131 -101 -193 26 181 103 146 143 85 143 -103 87 82 -108 -119 -72 79 -29 -82 62 -79 -47 12 18 157
5173 157 -103 101 -45 -116 108 -215 141 122 165 57 -8 221 48 118 315 76 190 143 176 4 80 151 -99
5196 -99 -161 -32 270 -240 100 -112 60 -124 -88 -145 82 -7 -13 -82 213 55 -327 154 88 246 -234 -181 -9
5219 -9 212 -8 46 -280 -62 -1 -145 -201 -181 300 38 151 -192 63 117 -43 71 -88 -271 -184 -261 -111 -208
5242 -208 7 -17 -144 -70 -28 64 49 84 33 405 136 -33 160 -110 -328 131 -65 158 -197 -44 -84 147 -57
5265 -57 -21 19 -2 -164 -27 7 160 -64 -164 -119 334 -77 104 -140 -63 137 98 43 -67 -17 13 -24 130 55
5289 55 178 -7 335 -57 -84 25 -25 -63 130 95 -54 -45 -215 -26 -268 -78 -144 34 45 122 -76 67 61 158
5313A58k04M3l2M3k25K33qJ97l72O61n37K5J26J58m50J054j50o98N55m23l47P3
5335a20M96K69k52n87N83O2m14j99J32j96k80M66J73l41k2J97k74R22n04k46L18
5356A83k92K73l10m5L47p6k45K32k05O4j26J95j36M48k29N8j59P8j69J11l35J00
5378b38M08Q9j16j36k14K21M4j25J84k67%J54K13k48k6L06q5l99Q8J62J6Kk39
5401b06J90J83p9K7j80l7j0m1K01j7M1j90J11PR4p7M3p7o8K20Qj07l4k31L54k11
5427h6J45j27K63m05K53J17l51K45J8k8l4N2J00j17J90k27J66k59J38j0o43N37
5449f3j33J58O2J35k53J59J86k62j05N1l9L27l85Q1k2J17o3J20j14j06K77l35
5471b07J66K38O7k80j08k9j02J75L1L05j90o3L27n22K86k09L45q0o6k04J61j31
$$ plain form
5313 158 -46 -3 -35 8 -217 16 8 205 -167 494 -43 -18 108 266 -184 870 720 22 577 154 -193 -120
5335 -120 376 645 393 -194 389 451 37 -162 -30 -226 -506 -40 133 -208 -230 -33 -307 615 111 -135 183
5356 183 -109 164 -146 -191 156 80 -165 67 -138 -74 -200 -5 -141 307 78 136 -23 55 -114 -3 -338 -238
5378 -238 170 259 143 7 -207 14 58 -67 117 -150 -150 4 217 -31 -57 249 164 -235 -147 15 31 33 -206
5401 -206 -16 167 88 115 -65 -102 -112 -153 48 31 72 -118 -7 0 94 17 60 -17 -85 135 143 36 2 -229 125 -86
5427 -86 59 -68 195 -210 43 160 -191 54 72 44 10 62 162 45 235 8 174 -85 53 43 -600 -63
5449 -63 -196 -38 24 159 -94 65 251 -11 -116 -65 -104 223 -162 -81 -103 14 -49 71 -43 -149 128 -207
5471 -207 -41 197 264 -16 -124 -153 -255 -80 -49 256 66 3 330 -192 94 -115 230 150 84 -120 41 -90
5493i0Q8J07k10K44j30P0j51Q3o0J77k30k6j5L20n07M66K12n23K89N6j47J8O4
5516A05K2M2l99N16k63M11q49O35q14J121m22L90l05J62n45kJ60j00L46n61O53
5537C03k01l72L18K77P3l74L33n7j54o5j94l9J97j08K05m7r7K44k78J1J44j70
5559e1L5O1R6j00p3P9l2J7N2L4o4N5q2j75L17l3O8n1j39j70K09J9p8L42n29J69
5585b4m7q0K90Pl38K02J93m04J17J86k48K48j09J28j17j75K53k79K48j31RJ15
5607D4n6L4j5j33M8j6M9M7o3J24j01j0p0Q6K02j08N7N2j30L9j57L42j96O9k9j33
5633b4J30L1K0j27M6j18j5J96k52J42n7p5Q7L72n7k88M1n6NL84j91j93N32l27
5657B06n26M12l93J68K75K16j88q87N41L91O20o82j48j6K5O6k17N0J10j33R1K29
$$ plain form
5493 -90 -2 105 -105 139 9 79 -72 11 -49 128 -102 -128 -143 177 -330 136 348 -175 114 170 23 41 105
5516 105 127 169 -230 286 23 434 -415 220 -594 527 105 495 190 352 -193 -195 -35 -135 211 -350 303
5537 303 102 -270 48 325 398 24 357 300 146 81 -113 -152 45 -63 142 95 -2 242 -36 -25 119 -51
5559 -51 -16 45 141 41 -32 47 15 32 84 118 54 109 27 -148 169 136 204 153 14 -156 53 72 -6 336 -193 -24
5585 -24 -71 -151 139 146 -192 10 203 -201 -84 102 -146 102 -7 121 4 -171 82 -197 51 -80 -71 44
5607 44 -12 22 7 -126 -78 -94 -45 2 -61 63 -38 -48 -118 -32 170 62 119 171 41 80 -77 265 69 138 109 -24
5633 -24 106 137 157 30 76 -42 -57 139 -113 29 -28 -103 -16 356 299 11 52 -4 1 385 194 1 533 206
5657 206 -320 92 -301 -133 142 358 170 -717 -176 215 835 153 5 -11 14 80 -137 -87 23 -110 -19 210
5679B10J01k03n45L08k7l8M77k21j8j37K22j81J51M3N7j57k23L06J92l41J3P8
5701F7J16p2J12j51K91k07j33j02j17K45jQ2k66J46N4P9K0M3k04j33J17J98k1
5724A63j49P2p1M2j71L0o0N51n06J20L0j35R3O3P0k52K63j29p0M3j46J05p4P9
5748c9j51J72K2j24R4Q5k61NN6J30j77L26j20j9J34p6L6j6m2j7Mj04k4J10J17
5773A21j80K84k41J2k02M03j33Q5j07j50J11k06J91k6K67j38q6j00J69K4J2r3
5795A7q8o7K65j84K87m58J57K28j60J67j27j03J57P6j86O7p1J08l01K29J5k13
5817a85K3K25l40K44j16K20k99K92K3P8k83J37j74N5N3n3P3J37N8k41N8lJ90k0
5841A52K49m56k3J97j69J59k53P7j14K02m1J94j87J61k4k81m7k4J43J15j1R9k0
$$ plain form
5679 210 311 108 -437 -129 -156 -194 283 62 44 -93 129 -52 99 142 199 42 -181 125 317 -24 -11 67
5701 67 183 111 223 72 363 156 23 -79 -196 49 48 130 -136 10 64 143 163 206 2 -131 -14 184 163
5724 163 14 86 15 57 -114 -84 -144 407 -99 21 51 -84 9 72 142 -110 153 24 -46 -3 -149 -44 -118 -39
5748 -39 -190 -18 4 -120 -26 59 -202 -197 -141 -11 -188 138 18 -1 133 57 93 77 35 18 22 -82 -106 4 121
5773 121 -59 225 -16 -4 -206 197 64 149 42 -108 3 -203 -12 -38 229 91 5 -95 74 98 110 17
5795 17 -71 -138 127 -57 230 -228 -71 157 -3 164 37 -66 91 167 -19 48 -23 85 -216 13 28 -185
5817 -185 -162 63 -277 -33 -149 71 -228 64 87 165 -118 19 -155 -100 -47 -100 -27 110 168 -73 -15 -18 172 152
5841 152 401 -55 -78 119 -50 109 -144 -67 -181 21 -20 174 -13 148 124 -157 -204 -228 -85 30 19 118 98
5864I8j90j42J03K64j14j10M8K66k54O6O7j92j85M17j98j23J96P1R6k4l74J10
5886a04J32rk2j81J36j42J12N4o8o6L21L4k72KJ18K3J2j66j93L05k52J03N7j97
5910b63P9J92MJk20P5K0L63j09o2n6j23J58j34Q9J98o18M25j5M9q1o9k8J60J9
5935E4k06L5J0J3M9J27R0pq8o2j44N75l66k91N7K39J74k76k99L66m6K05k34l7
5959f2K01l01K55jk87K28km4J01k33K51m0j12j23J28J57k0j18r1N3K52j63K80
5982C09l08k23J73L3p6J53pp3M8j39R8p8J31L5m2J40j85J94n8k74O3J11k34J31
6006g8K02n9mk90K20p6l0J77r0j95L24j19J01M7Qj3k00j69L60k17P1Mj11J25P2
6031F0k70L46kl00J42N0O1j32J44k70K43j38R3R8j81J34l5L3j09J83n3j53K58
$$ plain form
5864 98 -92 -234 -131 133 19 -91 -43 223 -31 35 102 -90 -275 142 -56 -179 17 88 184 160 -214 -104
5886 -104 28 19 -3 -184 -48 -190 -78 -24 -92 -158 163 197 -75 -73 45 68 80 -86 -279 26 -226 -123 -66 -263
5910 -263 -184 8 12 13 -207 -132 -112 251 142 80 24 -99 59 -75 14 212 -406 19 4 53 -28 -97 -125 35 54
5935 54 -152 -117 -107 -94 -45 82 172 165 77 15 -129 446 80 -211 -154 85 259 -17 -316 50 4 209 -25 -62
5959 -62 139 -162 93 92 -195 33 31 -13 88 -145 106 66 -46 -169 -41 116 96 -22 -113 -60 192 29 309
5982 309 1 -222 -49 -16 -92 61 54 -19 29 -110 -12 -90 41 76 34 174 -11 183 125 -149 -86 25 -209 -78
6006 -78 124 65 61 -229 -9 -85 -115 62 -28 -223 101 -18 83 130 138 125 -75 -244 116 -101 -30 -26 -137 -12 60
6031 60 -210 136 134 -166 -24 26 87 -45 99 -171 72 -66 27 125 -56 78 43 76 -33 150 97 -56 202
6054B02n16N44Q6l29P3J39j85J62L4k43J94j88j27k1o0K34n8J3r2J18j5J21r0
6077dJ57j14k42J27mJ78M2j78J57k67J77r%J71l56j0L2L31k58R5j46j94L65PL0
6102H7o0L6j94J66J71m28J66J27J55n25J68J68r2N2P2j28J25o2J48j00J56k28
6124b0K7p3J4Q3m0J20j51K20k85L24j71j26n4q7L23r5O9j89J6k61N54l02K49k88
6148a43J85O5k22K45j14j11J37R7J21j67J7k55L02m2k19J80J83r9j86j20m5R5
6170i6Q3p9M0j00RR2j97L73l2k32K27l1j04j31m6K74M1k85Q7K22j60p6N3k7j35
6195b30M44r4p4J39ll3k03J07l6L4p2K19L9m19O4R4K4n5k2J19r1m4j6L10o4k14
6221g7k0J10j58J21OQ8m2O5l9j36r5O8K49P9L1j48m21K57J7j20rJ10L20k60j26
$$ plain form
6054 202 -314 230 316 -13 60 199 14 176 210 -33 161 -27 -154 -175 -235 -1 -59 -46 -138 -20 -35 86 -4
6077 -4 153 39 -203 -76 -80 98 140 -38 119 -148 29 20 20 191 -165 -175 -143 188 -70 25 -121 -315 50 57 87
6102 87 27 63 -131 35 206 -222 -56 71 226 -299 -131 37 -55 -3 69 -59 66 4 152 52 208 -20
6124 -20 7 -66 -52 31 -9 111 -40 180 -105 219 48 -78 -132 -219 104 9 78 -111 -95 -356 198 -104 145 -143
6148 -143 42 107 -115 130 16 -95 42 139 260 93 110 -145 157 115 -104 76 259 160 -26 -146 -191 -96
6170 -96 -13 -92 -52 -152 -143 -51 -248 125 93 -139 88 57 -47 -178 -224 50 91 -194 -107 115 -45 -121 -68 -95 -230
6195 -230 214 120 46 185 182 149 -54 53 17 51 -21 198 237 -182 -118 -24 0 -55 -77 42 -49 -93 -109 201 137 -77
6221 -77 -97 13 -145 -24 -18 70 28 93 54 -82 -177 -109 140 219 250 102 -319 -62 -45 -165 -174 -64 256 -4 -130
6246a30L6j49K97q6L41l91J1J87j40j65J49r2J58k59J93J9r5J56Ok7K8P6J16l66
6270a27J44N2Oj76lq5M00j95k4j93M8K33k6q3M8J0l9J96l35M0M5L19l89Q9L0J09
6296I4k44K69J50m43QK24Q8j75M6l6p3O5R3M2L6k42PK91k44J70j38Oj80K50J77
6321B41m14K91j01k10J04O2j44K59q4j47R4n1K99r4K02j89j69M1j7k3R0P5j69
6344e4K36j11k41L04q5p7J01j73J97J55j44l32N93k42k57M56l47q3K66l45M8J10
6366b5J18l94K45j63K94j18o5K56k46J99k66K64j67J83j06p4J06j25J46l6m3j8
6388c5P4J60j0l01R7M3MP8r1R6l53J48P3k32K03P7k91L32r8J76k92K49j27mK3
6413ao4l1K40j47N1J0L07m06j17N77M3r25M82L5k98N43m66J39J90k67J03J30l28
$$ plain form
6246 -130 -94 -243 54 -32 309 -82 -71 116 -24 -189 -40 -132 26 -233 -40 -21 -116 40 46 19 47 123 239 -127
6270 -127 17 69 75 -101 -104 -189 211 16 -8 -201 -153 80 54 -29 19 29 -10 186 -149 -109 -64 255 -134 -45 -15 94
6296 94 -150 119 269 -174 -166 58 146 -29 17 -19 -92 -27 66 108 144 -98 -91 200 -44 126 -12 -6 -186 64 241
6321 241 -173 118 17 -193 -89 -27 -171 88 4 -143 -49 -100 199 105 307 118 -51 -10 -27 -50 40 115 -54
6344 -54 182 71 -170 134 49 -28 73 -100 97 252 108 -224 369 127 -130 326 -21 -104 162 -183 -135 -25
6366 -25 93 -301 -56 -219 75 -43 -108 148 -98 101 -165 99 -68 115 9 -65 41 -84 62 26 -17 -35
6388 -35 39 199 189 -112 -15 28 32 110 19 115 -238 -90 -17 -249 -46 31 -260 72 -26 150 -142 107 -20 -24 -1
6413 -1 -65 -96 144 -3 48 58 365 -41 -158 419 462 -463 19 54 -244 299 -167 -28 162 -105 -2 128 -200
6436b00L07j5l4k57J77ORl6J50K9j64l05M77r1p0J24j15j39k6J52K61l34l3K16
6460H9k67J53L9J95k09R7%l35L37k3k04J41J66k55Q4K6k66K17j10L01k63K93n3
6483A53k14M9j26m8l9L61n0N0k30J1j56K22j76l9L21q2n6J6J30l43M15l72K95
6506I2m0k6k56oJ05N4j14K11LJ74m83K93L26m09L26m03L3J84J6J00j07k47K5J49
6530@No3k34j75N53k03J27l2J52r4N8q4j79Q3k33L65J3Q6k03j65K41l38L38j80
6554a62K17j34j41L59J3k36J62Nk32K10k79J46Q8K94l93J35P8j33K3Q2j26J9N3
6577D8j94K82j30O5J2k73M70m98L76l0j45l1J29j63L8K48j47j04J17j8m0Q1j06
6600a3K16o6J42k18Kj5k71J67R3m4r2K09j47K9j50PL07P5m30J57J01j01j14M75
$$ plain form
6436 -200 107 92 58 -199 -22 -16 -7 -43 107 136 -28 -333 144 53 -17 107 -8 -147 -173 -21 240 -94 -127 89
6460 89 -178 -25 14 209 0 97 97 -238 99 76 -128 13 179 -76 8 34 -232 -15 -125 176 -87 206 153
6483 153 -61 -12 -138 -186 -225 136 86 136 -94 -83 -239 -17 -193 -232 89 7 -49 -33 97 -246 169 -203 92
6506 92 52 26 -230 -236 -131 -77 -191 20 23 197 -286 7 333 -76 250 -153 -120 64 80 180 73 -174 -149 0
6530 0 5 -58 -292 -467 86 -117 10 -22 130 36 94 10 -169 -86 -319 46 59 145 -58 -223 18 -320 18 -162
6554 -162 55 -79 -220 139 152 -84 78 83 -149 61 -218 -72 16 310 -83 52 130 -3 20 102 -24 -5 48
6577 48 -146 136 6 71 83 -190 280 -218 158 128 -17 -48 81 -82 -44 204 57 -47 70 52 12 93 -13
6600 -13 203 137 279 61 63 48 -223 -56 37 -7 -99 110 -37 -8 -158 -151 156 231 -199 -42 59 -42 -156 319
6624C19k90p1k14K46K07M2k49M2N5k6J53k50J56q1J8J08j03p5l4p0o9J14q2J49
6648eJ69j96q9L36j16j7L2k58J12j66L83l0j74Q7m6j7k9m3j08R8J74k98K44J09
6672A52r0L7j29J98%j57J03p5k07L40J26n05J82p9K33j80K91l62J39n98N99P1
6694H9J5k93J4K65R6m44J90M7j37K00j39L2J47j79L8P3q1L34l62J81k14J86j22
6717f4q7QN89m20Nj22L62n8n20L97N5l34K34l5M9k31J9j9K21P5j79J30k70J52
6741d3K02O4j63j94K07j24J65J21l81J91m19L67L7P8k48Q2m8N8q6J06Q6J24q9
6764I3P7j75q8M6k24L12J71j47j01j7L0K67l67K32m8l81R5O6L17j80n0j42K32
6787A8j5K34k32M4m4j24M0j66K20j02J82Q0p4P3J28l59m0J2J60kR8j30p7J96j17
$$ plain form
6624 319 29 -42 -256 -10 197 239 -10 32 87 61 214 -36 120 39 57 165 62 -13 -47 -117 -186 -72 -154 -5
6648 -5 164 -32 -121 215 99 82 114 -144 -32 -198 185 155 -19 68 22 5 -24 -67 -175 -77 97 -201 43 152
6672 152 62 99 -30 168 168 11 114 39 -168 172 298 -207 -25 -104 129 -51 240 -122 17 -581 18 89
6694 89 104 -189 -175 90 186 -258 -68 -21 -158 42 -97 -65 82 -97 -59 14 -67 267 -95 86 -128 58 -64
6717 -64 -151 -143 446 26 31 -91 271 213 -307 90 145 -189 45 10 59 -172 -153 -172 49 124 -55 75 -195 -43
6741 -43 159 223 60 -134 73 -51 114 235 -146 45 -374 -7 30 108 -140 -58 -106 -48 -134 -28 58 182 93
6764 93 170 -5 -93 -47 -271 41 212 65 -36 -53 -23 244 -123 109 61 -320 -225 -159 158 -22 -72 -214 18
6787 18 3 237 5 49 5 -119 -79 -245 -25 -127 55 135 61 134 262 -97 -137 -125 35 33 131 1 -76 120 3
6812CJ12m9mj40L77k71j43J53j23k09L79O2j61k52J26K10r5J86m21K17J13j39
6834f9j61J40K06j50N1J3K7k58K57m5oJ23J27j53j07n5L6n2J69j88P3J86j55L
6858A2l2m4j40K22Ql02M09j15M1J52l33J29n3L4p3Kk22M48r6J97k95j8N9N7j26
6883g9r9L94o5m38L71l08L19R4j56J59m64J61J32M2L7R9k17P6k12n8K05J12k01
6906i6K79j62J24nj94M8J07K59n36J63J97j45k27L04k63R0J61j95j20K23P7kj60
6929g3p4L30k72l5J07K24Q6m65j54K06K78j66K7r1R4J78j78QL4j07J31k33K32
6952H7j24J18k30J73l6k69L73rl10L72p6k17K19kP8k75n7K01j75N9J68j77J13
6975Djk35K79l7M6j11L7j2j7J96l19K16Q0o7k51J87pO1q9QJ93k91P3r2M04m63
$$ plain form
6812 3 115 66 62 -78 299 28 -115 38 -85 -294 85 147 -14 -266 -140 70 -25 161 -260 -43 70 -69
6834 -69 -230 -90 116 -34 17 30 57 -201 56 11 5 128 255 102 -5 -60 -24 -76 93 -95 -22 164 9 12
6858 12 -20 -64 -204 18 26 -276 133 18 59 211 -122 7 -46 -12 -85 -83 -305 143 47 244 -51 -69 -10 47 -79
6883 -79 -178 216 151 -287 84 -224 95 189 33 192 -272 -111 21 63 100 199 -18 58 -154 -212 -7 105 -96
6906 -96 183 21 145 140 -54 -6 101 360 -176 -13 184 39 -188 116 -147 -57 104 -91 -211 12 89 87 -73
6929 -73 -147 183 -89 -124 -17 207 293 -172 -326 -120 158 -8 19 -72 22 200 22 30 64 -43 88 -145 87
6952 87 -37 81 -149 24 -12 -281 92 83 -227 145 69 -148 71 69 147 -128 -185 16 -159 -100 68 -109 4
6975 4 3 -232 47 10 56 -55 -18 -30 -47 149 -170 46 126 59 -192 -5 -12 49 -40 -32 161 -130 -57 -149 255 -208
7001b08J30Q3J83n3k0j61q6J42J34k56J64L4J22j49o5k30K36K58l49J4J02j43
7023a18j49L63P2Om5k57Q5l8K91j06k31K62R1k51l8j6p9K53K6m02K86Q6r9q9J93
7048I6j27J46r3j59J79J95l73Q4M2K1m3j39L71k89L36j46l8j03k8J57L1k13K45
7071A52k21J21R0k45j01K58mn9q4j15J73n6kJ09j48M1j17j01M20j95m2P8K62k91
7095g7J52l47j48M88j37K11l98L5M42j89J56m58J45P1j65O2J56n1O54N5n35r52
7117h30J069K0m58K52j14o3j86M99q59P14j04J19L80k94p4j07j15J48Q5k21L9
7138a00q8J67O5J10N1m15K78j7k06J64J12k56j5J03K1J68J23k54j4N9j63K11M6
7161A50j33k04K50j62j3J2J77k52J34j20M6p0R8K67q8j03j75J43L34j96k25J31
$$ plain form
7001 -208 -78 5 188 135 115 -46 -132 10 144 -112 52 86 208 59 -6 -236 0 258 -91 -77 25 -118
7023 -118 -267 96 168 174 129 -128 -43 -81 210 104 -127 135 226 -25 -63 -79 -158 95 121 -281 5 91 -8 -97 96
7048 96 -31 115 22 -137 42 237 -136 -52 -10 11 -32 -171 200 -89 247 101 63 -40 -68 89 120 -93 152
7071 152 -69 52 142 -103 -204 54 50 -9 -93 -208 -35 -91 -93 16 -132 -91 -208 -309 111 -84 -126 -48 214 -77
7095 -77 75 -272 -420 68 -69 142 -256 -221 221 32 188 -270 -125 -54 -219 -157 -1 -52 602 657 122 -830
7117 -830 239 259 -199 53 -61 -124 -310 189 -670 44 -60 59 439 145 71 -36 -151 -3 82 -139 -100
7138 -100 -188 -21 44 154 205 -210 68 51 -155 9 121 -135 -150 -47 -26 142 265 11 -3 56 -107 104 150
7161 150 17 -187 63 -99 -112 -100 77 -175 -41 -161 -115 -185 -87 180 92 -11 -186 -43 291 95 -130 1
7183Am1J36o7M0J62l84R8R7j39R2J34k03j32L63j72j28K97l64K90k40N%K35j93
7207a13J98r5J89j25j92J37j0k87M54k51j43L38k84L12j32r6K84l43K09R5n8k72
7229a85K98k37J70J10J23l31J02M5l12J15K26J34l31m8K16j26m1J22l0P7l11K69
7251E5j51M06j55j71j58J13j1p4m3K3L86J0k03J6r1J46J98m21K56j07J74k35P9
7274D2q7P2j15L34k66ol6K82m0j8j80r4J57l42K53J02K2k43K9o4J16P7K17K8l68
7299a28J37P8j38%N0nK4j65K46j24J21Jj16j03O53m35j36J36P2j34o0PO5J2j13
7324e5J42J6j24j86J11k2J20J73k03j63Q7J52k81J90J20j19K9j60M6K14rN5l13
7347a80P7J40r2J97k21J74J30j89j73R9q4Q8l8L6o3q1L30j42l8K0K49j03l01J11
$$ plain form
7183 1 -40 96 29 69 231 -153 -55 42 -97 -5 129 -74 -206 157 -15 -143 154 -210 80 -160 -155 -155 80 -113
7207 -113 85 -10 179 54 -138 -1 -11 -298 156 -95 -238 100 -184 128 -4 -100 184 -159 50 145 87 -185
7229 -185 113 -124 46 156 279 -52 50 95 -217 -102 124 258 -73 -121 95 -31 -72 50 20 97 -214 55
7251 55 -96 310 155 -16 -174 -61 -72 -146 -189 -166 220 230 27 43 -48 98 296 -125 131 24 198 -37 42
7274 42 -45 27 -88 246 -20 -26 -62 220 180 162 -18 -112 45 -297 -44 58 80 -163 -134 -198 -82 -5 212 240 -128
7299 -128 9 87 -51 -51 -1 -6 18 -147 99 -25 96 97 -19 -122 531 96 -40 96 168 34 -26 -19 46 58 -55
7324 -55 87 103 -21 -207 -96 -118 2 175 -28 -191 -104 48 -233 -43 77 -42 -13 -173 -127 87 78 133 -180
7347 -180 -103 37 -55 142 -79 95 225 36 -137 -38 -122 -34 -72 -36 -99 -180 150 8 -30 -10 239 136 -165 -54
7371e4J08j5J22r0j61Lp2K27j09J06n5j11J02J29j8R4j98M2QLJ06k06K05m33O16
7396C49j90P6j12R7j15O6k79J23K9p8O6j25P7q6J20M2j13K2L4j46K69j7j05j29
7420a25l2L02m2j10J38j4k2k13J11l8J12k10N28p05J82J21k28L13N5J0l62J2L40
7443A23o6j29m7K03k5j28J28J82m39J40N5R4L3j64q4J26M6J14n3j27J17pj40p
7467e5o8J42j05J64k4k19L91l98K50k20j38J40l5J22J48j68N9j2j69K27pj93J5
7490a53K25k88L28o9j17k2J87j3l8J50j38q9K07K8j71J14j23J63J68m01j46K25
7512B7o6O3K9o2L5Q8k9k20M21m28R2L01k41J99l67JJ77P1j85K01k66j05K06J22
7536F4jl11K39M3o0J54k58J90o7Oj35K83M4L3j82J15pj33k18J99j8j28K02j35
$$ plain form
7371 -54 54 39 161 71 -90 -87 -159 68 -41 65 10 -101 1 130 112 206 8 50 58 61 167 -39 166 -267 349
7396 349 159 235 123 220 105 171 -108 15 44 -34 32 -93 -16 -102 18 60 -53 -31 3 -143 126 109 4 -125
7420 -125 -157 145 103 -7 131 117 95 -118 -7 -45 67 -143 385 -320 -138 -17 -245 68 123 133 -229 -217 123
7443 123 57 -72 -119 84 59 -69 59 241 -198 -58 -3 91 124 -40 -124 2 48 162 109 -18 99 92 -48 -55
7467 -55 -123 19 -86 78 54 -165 226 -172 78 -142 -280 -140 -175 -53 95 -73 -14 -26 -195 32 25 -168 -153
7490 -153 72 -216 112 43 -74 -96 91 78 40 190 52 -37 170 198 27 141 18 181 349 -52 -198 27
7512 27 -39 24 53 -9 26 114 85 -135 286 -142 -50 251 10 209 -158 -157 20 91 -94 107 -159 -264 -58 64
7536 64 63 -248 -9 34 -26 128 -130 60 -7 -1 -136 147 191 224 42 157 150 17 -201 -2 -20 -148 54 -81
7560h1o2M28n04J85J84r6J00l0J84l64J33k49L32j17J13j92J47k26O2K9p6q4K67
7583H3k22M3K8K05j73K12j69kr6J44k70L5L77k33M5l2J25o1P2k18K38n8j36NJ81
7608A23k82kl2Q7M4k15L61r1j12J77J60l08L04m18o3M99k38M8l02K52J55j15J70
7631B02j39n0O0o4j77J97k9j06J15J5k91K66J7j1j22K55j26j5o2L8O1N9j1J07
7655A89n06N52l01P9J23L0J85l70Q3J64o6k28J05l1J31l5ok53J16NL7J44j7l25
7679a95L5K54j27J61j1p8J9rj04m8J23k10K87l34K10K92j71l10K03J50n0r0j05
7702a08K25j49l4mk32K65j05R7l8J27O1K87l47k27K92m9R4j61j17P4J07l9L14
7725C33m66K18j20j55J40n01O95k45K76o9J66l18k06K67l71L05j77K90O2m07N49
$$ plain form
7560 -81 -143 285 -219 -34 150 54 154 124 308 -56 77 -172 160 43 156 -36 111 -115 -53 -24 -100 -184 83
7583 83 -139 -96 -68 137 -36 176 7 5 -91 53 -217 -182 195 -38 7 -25 100 39 111 -107 131 73 -63 -58 123
7608 123 -159 -161 -193 -106 -62 -277 84 -7 -119 58 218 -90 214 -204 -267 232 -6 42 -260 -8 147 32 202
7631 202 63 13 73 9 -168 29 0 -106 9 24 -267 -1 16 5 -117 138 12 -3 -65 -27 34 93 82 189
7655 189 -317 235 -66 13 136 166 351 -19 64 228 162 -66 39 8 139 104 98 -155 -39 -34 3 147 130 -195
7679 -195 -160 94 -33 128 117 39 58 49 -55 -103 20 -190 97 -237 -27 265 94 -216 -13 137 87 -3 -108
7702 -108 117 -32 -66 -70 -302 -37 -142 -45 -83 44 105 392 45 -182 110 61 155 -6 -123 -49 58 19 333
7725 333 -133 85 -35 -190 -50 -551 144 -101 175 106 272 -46 -252 15 -356 -51 -228 62 124 -283 266
7746B66n69K35Q0k93R79m64k14k40K14N3m48n1P2M38K23o51P02j87K35n7K6k72
7768G7l33M10j15J9J61j26j68j5k78N64j45J21n47L57o3J1J05K18l28J34j21J8
7790d4k50J25L01J6j93J42K7l52m0M91j21K15n00L38j44N7R6o2Rl3j02M6M8q7
7814a7J00j24J25L9j79J1K4j5L8J59j3l26J97l0m5m1PL10q2j48n5j27M44k43J74
7839A83j84j00J26j79K57k12K64k77n2M36l31J02q0m25L33O6j38Q5P6m6J04j10
7861a02J18p0j01L53M7o8l28k96M95J9j43m81N76l33M64p5j36L43n34P3J53p2
7883i8J77N3k46J97j03np1K07k65j75M6qK13J2j19m9M91m11L79q73J81Q64j18
7906B79l81L5J023j135O5j5k77P48n20k06M46m08L02l01o06J537r23K73j87K47
$$ plain form
7746 266 -303 -68 12 -281 698 234 20 -220 -6 47 -401 -452 -380 58 281 -370 332 145 380 323 349 77
7768 77 -256 154 39 58 219 93 -75 -90 -368 196 51 172 -375 -18 -81 -70 35 253 -75 59 -62 -44
7790 -44 -294 -169 132 148 -45 97 124 -228 -268 223 102 317 -183 155 11 68 164 102 111 78 -24 22 70 -17
7814 -17 83 -41 84 123 -56 -45 -21 -36 2 161 148 -178 19 -11 -56 -97 -90 220 138 -10 -65 -192 252 9 183
7839 183 -1 -101 25 -154 103 -109 155 -122 -174 262 -69 33 -47 -472 -139 -73 -211 -126 -50 -96 8 -102
7861 -102 16 -54 -155 198 245 177 -151 -447 48 67 -76 -557 19 -314 150 75 -61 282 -252 -179 -26 -98
7883 -98 79 132 -114 83 -20 -25 -96 111 -154 -329 -283 -291 -78 -66 -185 -234 257 -154 225 -648 -467 397 279
7906 279 -102 -67 956 -179 -114 -129 -406 342 -178 -384 62 -346 -44 -345 -951 586 -337 -64 -251 -4
7926dO4K4m54M39k7r9m07L65L49j14K5K86k59m38J6K03P4m2j47M52r4k37MP7j43
7951h7J17K13k00j27K36j2q9j13MJ96m07K27K63j07k86n8K58j15J51J04k54J45
7973E9l0j13J29j59J92p6O7k04K20K0j46K69j39k95L11J8j05O6J8k8o3j82Q8L46
7997B63m84J95J47K9K45n46J40K22j57l29N1J27J77j24J37j49J76QK4r8j33J67
8019H8j95Q9j9J49p9k21J46n2P4K32l91Q8q5K84l38K75k0q0J6k5j6J59J53j53
8043G9k24K35Q7n6J78l39m3N7r4P9k10K47k0J5K76l69J16r5L25o0l49K52m0p7
8067c0j23K20j3o5p3K29k32K6J7J26o4O3r4R9k9j47K38j42p1M8q7n2K69Oj30o9
8093h0J10L8j96mo8M62l49J34M7n0o2K82k91J01K2K02o1l35R8n1KJ08j19p9K36
$$ plain form
7926 -4 60 84 -370 69 42 -57 -464 -99 250 136 161 447 188 -250 -234 -31 43 1 -146 306 212 -25 -21 56 -87
7951 -87 30 243 43 -84 152 140 51 -62 -58 138 -269 -42 221 114 -172 -230 28 -87 64 168 -86 59
7973 59 29 -84 45 -114 78 2 69 -135 85 105 -41 228 89 -206 105 123 18 84 102 74 11 -171 -83 263
7997 263 -221 -26 121 150 395 -151 -11 211 54 -275 -224 -97 80 -44 93 -56 120 128 152 54 -79 88
8019 88 -107 -18 -37 112 33 -188 -42 -94 -20 212 -179 -91 -176 108 -230 45 25 -55 -39 -64 -80 79 232 79
8043 79 -145 90 177 121 299 -40 -83 -26 -120 -41 -251 -4 -24 -9 267 -102 14 -81 244 184 -165 87 47 -30
8067 -30 -153 67 54 -11 -84 145 -87 -61 -44 82 18 81 -13 86 57 -90 148 6 -65 -17 -104 -156 113 119 -11 -80
8093 -80 30 68 -128 -132 -200 262 -87 47 94 44 -18 264 -27 74 96 298 237 -98 0 -51 -49 59 -60 -139 97
8118I7r0O9l16Q7K85J7L7r8J9r2R4m4j03m9J05k70M52k42k31K77k56J1M34k59
8142f6O6p1J19K57l83M6l3J2J14O6k87K99k13J96j78J88j4j99j3k0p3J82k23K61
8166C3mL1k1K24o11L69K3j32j07K58j26O7L0l00L31O2j09Q9j71J46j48M0J41J53
8190B68l10
$$ plain form
8118 97 7 76 -240 -153 132 149 186 88 107 15 109 65 -38 -87 18 -252 200 -42 -273 4 -252 -241 193 -66
8142 -66 0 -71 48 305 -78 -32 -65 -53 61 127 -160 139 -74 122 -56 132 118 -81 -94 -114 -187 -5 -228 33
8166 33 29 60 39 263 -348 21 44 -88 -195 63 -63 4 34 -266 65 127 18 107 -64 82 -66 -26 115 268
8190 268 -42
8191d2
$$ Imaginary data points
##PAGE= N=2
##DATA TABLE= (X++(I..I)), XYDATA
0@%%%%%%%%%%%Qj6J6j6K2l0L2m0M8n6P2q8J04j20J36j60J89k17K49k85L24l68
33a96M17m69N26n93O64p39Q27r22J023j133J255j390J537j694J868k061K268k498
51a310K753l034L346l695M088m535N051n647O345p182Q204r483J1135j3360J6529
66I205k1412K9949m8906J59716m3048k42596L17975j54303r9002K14294p9158
77D2714q9873J19450k0472p6834K9845O0888p2961L3608N4294r8506J3860M9129
89D5142m1168J6268J1339Q728n0942J2135O1426j03936M1829R8566j48377M7615
101a375Q9115j56697N2081J06430j24832J4563R7281j08159k3895J25804q5898
112a5582l3621J20696r3326k3609R3987q4927R649O1155n8219K2967J62l1451
$$ plain form
0 0 0 0 0 0 0 0 0 0 0 0 0 8 -8 8 -8 14 -16 16 -24 24 -32 40 -48 56 -64 72 -88 101 -116 133 -152 172 -196
33 -196 221 -248 278 -315 349 -390 437 -485 538 -595 660 -730 807 -887 981 -1080 1188 -1310
51 -1310 1443 -1591 1755 -1940 2148 -2387 2664 -2983 3362 -3820 4384 -5099 6036 -7324 9205
66 9205 -12207 17742 -31164 128552 85504 -157092 160883 6580 -92422 121872 42714
77 42714 -47159 72291 51819 -25015 4830 65718 -7243 26365 80659 -17847 -3987 45142
89 45142 3974 20242 31581 40309 -10633 1502 62928 -41008 821 99387 -48990 -1375
101 -1375 87740 -68957 -16876 89554 -35278 -20715 76566 -31593 -55488 70316 -15582
112 -15582 -49203 71493 -21833 -45442 48545 -36382 -26733 34422 -23797 -830 -668 -32119
124c2119L2037j8887J5360J0442m0569L3469l481l5952M1402l616l3567L9501
136D020o24m5397L1541J4643m0978L2515J7318n3790K8975J8878m5542L2899R323
149C781l5257L0600r73k9049K7300o116j2487L1416k0595r710K4559k4209P713
162a3027K3449k9802J1456J6325l0606J7991N920k1731K4692m69j5860J1487n651
175e826k695J2636m883n08L983q232O849M98q245J3091O75j0555J0980l531j4355
190a0118K1644j443j4410J9793q217j4066J9517l052j2325J8722j939j5527J3227
203A1806r33j2403J4773L824j3329Q191K42j1476J0618J869l193J602o09p05o170
218D107M813N106q839P569L835j7858J0023M256j5227J6500P57j6658J1362n51
$$ plain form
124 -32119 -82 -18969 -3609 6833 -33736 -267 -3748 -39700 1702 -1914 -35481 4020
136 4020 3396 -42001 -10460 4183 -36795 -4280 13038 -40752 -11777 7101 -38441 -5542 3781
149 3781 -31476 -876 -1849 -30898 -3598 -9714 -22201 9215 -11380 -21090 3469 -20740 -13027
162 -13027 10422 -19380 -7924 8401 -22205 -4214 1706 -20025 4667 4198 -11662 -175 -5826
175 -5826 -8521 4115 -768 -1276 2707 -5525 1324 1822 -6423 6668 7343 -3212 7768 4237 -10118
190 -10118 11526 10083 -4327 15466 7249 -6817 12700 9648 -2677 16045 14106 -1421 11806
203 11806 10873 -1530 13243 17067 3738 11929 12171 695 11313 13182 9989 11591 10982 10277 4107
218 4107 8920 14026 5187 12756 16591 -1267 8756 13012 -2215 14285 15042 -1616 9746 9195
232I195j3134J2214L196j2740R006o2j2413O117M446p662L822N422j1224o10O290
247A863n568j242Q872m761p813Q120l218q887J1790P55j1844Q821K873j7355J1843
262e751P945j7847J1100Q012k2187R709J1370k0699J2361J0265j9776P185P962
275c51j4406M840J1828j2018J317P281p154l116P937J128o928P206L650j2316
289a1102K860J1012j1419O30J7467j6844l513K2066j7815n033K6030j8004q512
302a2177K6409j8674q967K8046j5290r511K3551j2655j1230K0817p780j0764J8625
315A0400n790r643J1017k355n810O180J954m416p65M386j98q046Q271L778j3541
330d578J0704M716j8823J2826Q575k1663J3136R923k3954J3617J0052k3414J2735
$$ plain form
232 9195 -3939 8275 11471 -1269 7737 7675 -4738 1379 5825 -1837 1985 7407 -3817 -4427 1863
247 1863 -3705 -4947 3925 -836 -8649 -529 -3747 -12634 -844 -89 -11933 -3112 -239 -17594 -5751
262 -5751 2194 -15653 -4553 3459 -18728 -9019 2351 -18348 -5987 4278 -15498 -8313 -351
275 -351 -14757 -9917 1911 -10107 -8790 -1509 -8663 -11779 -3842 -2714 -9642 -2436 1214 -11102
289 -11102 -8242 2770 -8649 -8019 9448 -7396 -10909 11157 -6658 -11691 14339 -3665 -12177
302 -12177 14232 -4442 -13409 14637 -653 -10164 13387 732 -10498 10319 2539 -8225 10400
315 10400 4610 -5033 5984 3629 -2181 3999 5953 1537 772 5158 4960 -3086 5185 8963 -4578
330 -4578 6126 10842 -7981 4845 13420 -8243 4893 14816 -9138 4479 14531 -8883 3852
343C852J1039k1750R965J0842k0199Q497J0408j6843O359Q981j3153L608O989
356H595r697L510M314n798K018N64q03k59j798L681j265m122O909l337p050J1272
372F734m848o961J2732n966p837J2765n442q615J3640n288p676J2064n767p106
386g571J0887l363o411R195m047n460P581l567l011M915j635k173K361j216j996
401e511K116J30j41r62M45jj009P39L45k97n11K046j965j388L519k543R20L264
419h04m297M82L913n047K996K850n643M915j57l746L860j122n76L146j687l71
435a288J411j770J716K42O60L73j529K502k016l3L132k932J075K685l001k33K552
452C546j804R57J363q05j804J069J022k120K529k34k493K997j579j240J880l39
$$ plain form
343 3852 14891 -6859 3106 13948 -6251 2246 12654 -4189 2170 11151 -2002 1606 8595
356 8595 -1102 2408 6722 924 2942 3506 2703 2444 646 4327 3062 -1060 5849 2512 -4538 6734
372 6734 1886 -5075 7657 1691 -6146 6619 1177 -7438 6202 914 -6762 5302 -465 -7571
386 -7571 3316 -47 -6458 2737 -1310 -6770 811 -2756 -5767 -852 -2487 -4660 -2299 -3515 -5511
401 -5511 -3395 -3265 -3406 -4368 -3923 -3924 -4933 -4194 -3849 -4146 -4657 -2611 -4576 -5964 -2445 -4988 -4068 -804
419 -804 -5101 -4619 -706 -5753 -2757 93 -5550 -635 -792 -4538 -678 -1800 -2376 770 -917 -1288
435 -1288 123 -1647 69 311 971 1344 -185 2317 301 268 3400 468 1543 4228 1227 994 3546
452 3546 1742 2699 4062 3257 1453 2522 3544 1424 3953 3719 1226 4223 2644 1404 3284 2945
468B945p46J368j4l393J494K485l348Q85L002n574K624K205m445K745o26mo6j648
486a11K457l288O08M937n930J396L081o577M802Q67n221N110j768j440J565o40
502a52m45l72L110j831k868M445l188j176N436l470j306K972j638q93Q05J754
518A183k991J466L000n921K377J575l351L830j223j731J002j002J819j836K25
533a578K975n237M339Ro875Q060l189k102N935n948P28K420k140K094j830P70
549a569O02l135M378k753j898O034m636R85J490l851L120m22R76l94j407K469
565a1l225J583K654m949M430k9l529M003k847Q97K567k288K411l471J607J695
581A498l538N219k509j893N005m386J325J874l541M507j997p61K405m696M695
$$ plain form
468 2945 2199 3567 3553 160 1654 4139 791 1676 4678 -896 1728 3933 -512 2233 1607 1603 1537 -111
486 -111 2346 -942 -334 4603 -1327 69 3150 -3427 1375 2242 -2979 2131 363 -1077 488 -152
502 -152 -597 -969 2141 310 -2558 1887 -1301 -2477 2959 -511 -1817 1155 -483 -1376 -571 1183
518 1183 -1808 -342 2658 -3263 -886 689 -2662 1168 -55 -1786 -784 -1786 33 -1803 -1578
533 -1578 1397 -3840 499 508 -6367 1693 -1496 -3598 2337 -3611 -2883 -463 -2603 -509 -2339 -1569
549 -1569 -967 -4102 276 -2477 -4375 1659 -2977 -1992 -502 -4353 -1233 -1655 -679 -1073 -2480 -11
565 -11 -3236 -1653 1001 -3948 482 453 -3076 927 -1920 -1023 1544 -744 1667 -1804 -197 1498
581 1498 -2040 3179 670 -1223 3782 -604 721 2595 -946 3561 1564 803 3208 -1488 3207
596C207l04k401M426m907J119L341m507K796L27j993K662k835O86N88j635L521
612D091k576J66J111l356L105o80j263K074k210J005J1j436J100p10M36O31k020
629e21J020q00j71J803k395J460m59r36J690j895R96L4j188J518r30r69J716j388
647a415J118L99k052J744j100L41R41j283N12L30o30R05j146L60O68p54O38L23
665a01p75O40n83J132p86q46P20M27l24o15J203r08J39K50p0jJ71Ll24j6L27m98
687h35M07K43o46K1K15l14L77J24n11K77j18M7m20N57M8l27O26o91OM47q3j52
709g02J73K0k94L3M81j69k91P41m02k11Q02m23M2K73J36k77L47K12p41O37M13
730H00k70K1K57m55N18M07q47J166j28l43o3K72k20rO33k25m16P52o32l4O62O6
$$ plain form
596 3207 2903 502 4928 21 1140 4481 -26 2770 3097 1104 3766 931 1617 2205 570 4091
612 4091 1515 1681 2792 -564 2541 1861 598 2672 462 1467 1478 42 1142 432 868 1499 -521
629 -521 499 -301 -472 1331 -1064 396 -63 -999 691 -1204 -208 -174 -1362 156 -774 -1743 -27 -1415
647 -1415 -297 102 -1950 -206 -1306 -965 -24 -1307 -795 -465 -1095 -190 -1336 -976 -308 -1062 -424 -101
665 -101 -876 -236 -819 313 -473 -1319 -599 -172 -496 -1111 92 -816 -677 -427 -497 -498 -327 -324 -648 -664 -337 -835
687 -835 -428 -185 -831 -810 -595 -909 -532 -408 -919 -642 -760 -713 -1133 -576 -528 -855 -229 -920 -914 -467 -550 -702
709 -702 -529 -509 -803 -770 -289 -458 -749 -8 -410 -621 181 -242 -200 73 209 -68 279 491 -250 387 800
730 800 530 551 808 353 871 1278 431 1597 1469 1126 1063 1335 1115 1106 1739 1514 1098 1850 1218 1184 1846 1912
752A912p89L82kl82J14M09n35j65Q44j028M5O87q38O6M47o34k93N38j36l48N6
773C50M4m01j25L16j105R08J67j049O11J2r84J94Q38j075M33Q31j007O9L99m12
793i86l05J252r35l07O57k54k22M07J9n33N69l9n09O63Nj04o0M46m85j21L81j05
815e66j73M42L62q07N83l4n86P71K22o66L61J95j234R77N06q44O69J79r51L56
835b38N33p35N34R9o68N11K8p26M57O96p57k58L73n07M39l9o7O03n15l8R7k84
857d62Q5O35o69M56j7r17J179n43P1P26o52K09N07o60l26P23p6K86K53o12O5N23
879G84n9k94P05n08j17P81q23M4M82j49K35J47o94l2M91k68M65K21o47j60L95
900I99j23J77N94p85M73p00j87K59l09P44m1j160N76l29k35N48l63k45O42r45
$$ plain form
752 1912 1123 1505 1503 1121 1235 1644 1109 944 1788 760 805 1492 654 720 1167 533 240 778 642 294 350
773 350 394 -7 -132 184 -921 -13 154 -895 -284 -272 -1256 -1062 -224 -1299 -866 -35 -1042 -973 -574 -986
793 -986 -1291 -39 -974 -1281 -624 -878 -1100 -693 -674 -1207 -638 -677 -1186 -523 -518 -622 -682 -236 -721 -842 -461 -566
815 -566 -739 -297 65 -742 -159 -193 -779 -8 214 -452 -91 104 -1130 -153 353 -491 178 357 -594 -238
835 -238 295 -440 94 193 -475 36 64 -662 -205 491 -266 -524 -151 -658 -219 -258 -325 278 -237 -275 -178 -462
857 -462 -377 258 -411 45 28 -889 290 -253 -182 544 -108 101 608 -52 -378 345 269 555 808 196 261 784
879 784 725 431 1136 628 511 1292 469 513 995 846 1081 1228 534 502 993 725 1190 1411 764 604 999
900 999 876 1053 1647 862 1335 635 448 707 398 1142 1101 -59 517 188 -47 501 138 -107 535 -410
920d10L90o3q21P84L57n24l67J56l94K81J10q3m57k2P80j089K14M23p12O11M48
941c88j095L34L77p17O50k56J08p1j92R88j094K11Q23j187Q74P70j679J053M07
960h4j302J350l38p58J176Kj55j94J14j37O14L35j119L73M17K56k93j96J26k8
980A59J5O82j088N16O82q21N30J12j373J366N8k06k54l50K37J64J16Q4j263J461
1000H27M33j922J869j102p56K091j226L5L53q86N83L8p4J67o37J014J0j154J099
1019G62p90K42J299j671J07N89k40R6K91k47l08L15L06m87J60N7J8N62o00l28
1039A33K48j5R08j101M88J83j448J834o57q30J622j034j14P33j228K88L1L08M28
1058G77j126M94n89P2J237j610M48O79j399J226m61j079J442p23O8K64j014L49
$$ plain form
920 -410 -20 -83 -904 -120 237 -287 -654 -498 -892 -611 -501 -584 -1041 -1063 -283 -1372 -1158 -735 -1447 -836 -388
941 -388 -1483 -1149 -772 -1489 -839 -1095 -987 -1058 -1250 -262 -1356 -1145 -322 -1509 -635 135 -1544 -491 -84
960 -84 -1386 -36 -374 -1132 44 46 -109 -303 -189 -326 288 623 -496 -123 294 550 257 61 187 159
980 159 174 856 -232 284 966 145 675 787 -586 780 838 632 378 28 265 429 545 629 -634 827
1000 827 1260 -662 1207 105 -651 1440 214 249 602 -284 299 337 263 430 -207 807 817 -337 762
1019 762 -28 214 1513 -158 -51 538 298 394 685 438 130 445 751 264 424 481 499 1061 461 133
1039 133 381 366 1274 173 661 844 -604 1230 573 -257 1365 331 217 950 -278 10 41 349 777
1058 777 -349 145 -444 -372 865 -745 -297 382 -1017 209 -252 -1331 111 -612 -544 -280 -1294 -945
1076i45N92n83K74l90j82O32k71j68k90L85r4M64n33o15P05j59j73K719l012M92
1096a152P89p66N74O4o84Q72q10O22j41L37M53o86O47o43l15J252l74j63J239
1115A115j520P62O36j641J214K51q67J156o96m45J039p95M17N81n85O3j09Jp6
1134E01M21J54n49M39m92j00N31m56N93J7p64N03n66L9P64l32M19k40k32k27k03
1155B20J82k60N74M9q85N36l67l99R43l9o36N78o27l51Q83l59J35K91m21nm88
1176d46L92L3J94K38j06q51L11L50R7L98q2m90j43j58J14L54K29m81K44J48r00
1197e55K11N69k10N7M40o94m74K30l2N9N40k19m86j15K3n4Q13j46n56L2j03o27
1219a297M48O01r3n3r9l74m89O08q0O8L88k57k23l22L37j6O10j33l19k2k19K26
$$ plain form
1076 -945 -353 -936 -662 -1052 -1234 -602 -873 -1041 -1331 -946 -1040 -576 -1109 -1724 -1019 -1178 -1351 1368 -1644 -1152
1096 -1152 -363 -1129 -555 -491 -1175 -303 -1113 -491 -632 -295 158 -528 119 -524 -839 413 39 -124 1115
1115 1115 -405 357 993 -648 566 817 -50 1106 410 -35 1004 209 626 1207 622 685 576 577 501
1134 501 922 1076 527 966 474 374 905 449 1042 1059 295 798 232 271 1035 703 1122 882 650 423 220
1155 220 402 142 716 765 -120 416 49 -350 593 554 -82 496 -131 -482 401 42 177 468 47 42 -446
1176 -446 -54 -21 173 411 305 -546 -235 115 212 610 528 38 -105 -263 -149 205 434 -47 197 345 -555
1197 -555 -344 225 15 72 512 -182 -656 -426 -458 -399 141 -78 -564 -679 -656 -710 103 -43 -599 -567 -670 -1297
1219 -1297 -849 -248 -341 -394 -493 -867 -1356 -748 -828 -760 -372 -629 -852 -1174 -837 -853 -243 -376 -695 -717 -936 -710
1241g10J95L13J32k26K74o93L67J60m8K11O1N7n90J48J81N94J76l68K1k81J31
1262A05l9N38J98j84N6j80j60K79M39l62J57K95m07o6j89L91K0J12K47k72q09
1283A69O67n24J155L88j321P17r97OK81K79m05K13k12k90K02K95m80J75j9K09
1303E08n28j70L92j54m1J67l28l7K1j33L02k58J06J5k96J55k38L59L6m04M18k90
1325c98l91N71j19K15J3k68l02L77k77K10J31K41J68m51R7k3R3j26M96l05p1O2
1347e7l47K23J74J3j20M88o17m30N38l02O66l99j23L17k30l05P9K92N8j10K9k27
1369c90j41M22M0k47J10k46Q5K0l47N14Q9k37P6l11K48L36l23J55M51p13K71r0
1391b28LR5L46l72P8J30n43N91l16L82K08k64Nj11L39Qm36N02L55n25K77J15m28
$$ plain form
1241 -710 -515 -202 -70 -296 -22 -715 -348 -188 -236 -25 36 93 -497 -349 -168 426 602 234 255 -26 105
1262 105 66 604 802 618 674 494 334 613 1052 690 847 1142 735 669 480 871 891 1003 1250 978 169
1283 169 836 312 1467 1855 534 1251 254 260 541 820 415 628 416 126 328 623 143 318 299 508
1303 508 -20 -190 202 48 7 174 -154 -191 -170 -303 -1 -259 -153 -138 -434 -279 -517 -158 -122 -526 -108 -398
1325 -398 -789 -218 -337 -122 -109 -377 -679 -302 -579 -369 -238 3 171 -280 -183 -206 -113 -239 257 -48 -119 -57
1347 -57 -404 -181 -7 6 -114 374 -243 -673 -135 -437 229 -170 -293 24 -206 -511 -432 -140 -82 -192 -163 -390
1369 -390 -531 -109 -69 -316 -206 -452 -367 -347 -694 -180 -91 -328 -252 -563 -315 21 -302 -147 304 -409 -138 -228
1391 -228 -225 -130 216 -156 -78 52 -491 100 -216 166 374 110 115 4 343 351 -85 417 772 247 524 639 211
1414B11O83n03K23p1l76N27J02m76P06m67r5P45q16K28K86o46N83J33q12K15o1
1435C19J18K66l42k56J69%Q8k95j8M51l68J62l89k95K03M38l09N1k38m59N84n10
1457f30l9N59l67L38k05k84N54m87P7K31m12K65R8q04R75j08o15N83j55L6N2m21
1479g59O85R6m27L86m71L27O1n06N73p8k35M31l00J08J25l09K51K48j09l2k36
1500a71J89J95j06j94J51j20j25O03n28j1M69o61N11l03k65L96k08J15L53n70
1520b80K10K52m67K51k06l8P73q68L89K18p60O33l24K1L24n50L89r0k20L81j26
1541h8r3K67j70M14l66N8n8R4n5L9k3Q5L29Pj53k0p7J49r4j35K8L85m19P61n27
1566C38l73P06o11J71N46p48N05n7o72P76m03R1M93m00J19k87l3M67m70M5M56
$$ plain form
1414 211 894 391 614 543 167 694 796 320 1026 559 464 1209 393 621 907 261 844 977 165 380 319
1435 319 437 703 361 105 274 274 362 67 49 500 132 294 -95 -390 -187 251 -58 -7 -245 -704 -120 -630
1457 -630 -669 -110 -477 -139 -344 -628 -74 -561 -484 -253 -665 -400 -302 -1106 -131 -239 -854 -271 -426 -390 -338 -759
1479 -759 -74 22 -405 -19 -490 -163 -102 -608 -35 -113 -348 83 -217 -109 16 -293 -42 206 97 65 -171
1500 -171 18 213 107 -87 64 -56 -181 422 -106 -117 352 -309 202 -101 -366 30 -178 -63 290 -280
1520 -280 -70 182 -285 -34 -240 -278 495 -373 16 234 -526 107 -217 -196 128 -422 -33 -123 -343 38 -88
1541 -88 -181 86 -84 330 -36 22 -36 58 3 42 19 104 433 440 287 267 190 339 245 110 138 523 104 865 338
1566 338 -35 671 60 231 777 29 534 477 -195 581 178 269 762 362 481 194 161 628 158 203 659
1587F59o95N22l96j83K85l28K1J86k84O9Q9j67L63o22J87K85l67O9j57J47l6j17
1609d70O3Q2J18l53J56k14k8J61j25j03L82j57j47J37M68l10L3j2L80m97L14j91
1631c13k31L20J53r3M36k56k71L70Q9m7n6q8l7L4R9J67j35R5k9j53j9M4j01L17
1655B95%R1R2o1k23j12L76k18jk29J04j13J20K02k19j01O2j75J91k1J08j78P2
1678F2l29M53j73r3L37m4j03R0J10l12m6j16K48k83K45j10j17k7K11j37L38n3
1700A51J23m08J93Pk9K37kj13l07K38P7O2k16J57K87j68r7K04k33Q1K15k20m38
1723a99K30Q2n9Qn6L28k49Mr1J45l19L02k45L2KP5j3r8K15m5k69j77j06M23j42
1748b22O2l9K8p2J09k06j25K02J4k61J79L1k97J1J62L1K67k30j0J00K1PQ9k4n1
$$ plain form
1587 659 -36 486 90 -93 192 -136 -115 71 -213 -144 -55 -222 141 -481 -294 -9 -376 -307 -464 -317 -353 -470
1609 -470 -407 -325 -207 -560 -404 -618 -646 -485 -610 -713 -331 -488 -635 -498 -30 -340 -307 -319 61 -436 -122 -313
1631 -313 -544 -224 -71 -164 272 16 -255 115 204 157 101 13 -24 10 109 276 141 236 207 54 35 79 -22 295
1655 295 295 386 478 417 194 82 458 240 239 10 114 1 121 323 104 3 65 -110 81 60 168 -10 62
1678 62 -267 186 13 -80 257 213 110 200 310 -2 -48 -164 84 -199 46 -64 -181 -208 3 -134 204 151
1700 151 274 -134 59 66 37 274 272 159 -148 90 167 229 13 170 457 289 192 396 163 244 459 239 -199
1723 -199 31 113 54 62 6 334 85 89 -2 143 -176 126 -119 -87 -85 -10 -23 -121 94 49 -220 -397 -503 -80 -222
1748 -222 -160 -199 -171 -243 -134 -340 -465 -263 -249 -510 -331 -300 -597 -586 -424 -393 -126 -356 -366 -266 -245 -238 -149 -173 -224
1773b24K04P4k90L3R4J9J16M2k01J34p4LM05m16J69NK31P1k09J56J2O5K4k28k76
1798f1O22l58K02J53j92J22l47K31J56k52J0J01O5j58J86j82L44n57L20j2j94
1819A99k47M71k80j22RL0o5J44l02J01q7l1K16q0m0J99r9k25K80k50J50l2k21
1842b82L45l40K32j79J11N8j67q5P4L71m39J32L9kN2Q0j95J7L5j62K94J98j72
1865A5J20r4R7k75J78r3M9j40L80o2K62j73n66O92m02m1rq4J55K10L97q02P4j6
1889a28p8Q73r27J22j56k69N47J94k12j14R2L0m15K05j18k81N82k15J54k4KJ82
1911D6P3k61p4k26P7N44k38j29K71m12L68K0o4J54j78J89J07l38j13K97k72J98
1933C9J84k01L64m71K31K26r3k46M30k88M62j58k35K48j33q0N8k7N28k45J8K34
$$ plain form
1773 -224 -20 54 -236 -203 -109 -90 26 68 -133 1 -73 -70 335 -81 88 93 324 395 186 342 354 419 443 215 -61
1798 -61 561 203 405 558 366 488 141 372 528 276 286 387 452 294 480 298 642 85 405 393 199
1819 199 -48 423 143 21 30 60 -5 139 -163 -62 -149 -180 36 -44 -84 115 16 -209 71 -179 -29 -61 -282
1842 -282 63 -277 -45 -224 -113 -55 -222 -307 -233 138 -301 -169 -130 -132 -80 0 -195 -178 -143 -305 -11 187 15
1865 15 135 41 138 -137 41 -52 -3 -143 237 175 437 264 -302 390 -12 -53 -62 -146 9 219 616 -186 -112 -128
1889 -128 -206 667 -260 -138 -294 -563 -16 178 -34 -148 -56 -26 -441 -236 -354 -635 -53 -268 -114 -138 -136 46
1911 46 119 -142 -216 -442 -365 179 -59 -188 83 -329 39 59 -5 149 -29 160 267 -71 -184 113 -159 39
1933 39 223 22 386 -85 146 372 279 33 463 175 637 479 244 492 359 279 337 310 838 593 611 845
1955H45m09l81P2K55n53K76j37O04n88P56p70M75m95r5NM44l35j11J31ll88K67
1977a35Kl03L27k12j65M42k66J4j58J02L40j46M2j7j05J98j70k49L31m35L40k8
1999b51n0J83k17n9L69j86j56J99R2l4r3j8K28j12K3J48l42Q3J43M0Q5Q3l16l6
2023a94k9L43J8k29l4K07J6k9L47l42K39m06j38L20k28J49K95m20O9J07pj7l13
2046b76K52J50k15K84j83k66J59K30j61K27l11Q1j07M4K75Ll67L78l21J38q6j35
2068b07M29k20J02k81Q1L63q6j90q2Q2J88N1j06j31L16n7R1kl44J31J7l9R0M9
2092B45K0j4j65M8K41l47K75J31m81K91m2J10J52m59J08O2j80J58j04k7J06j61
2114c3j02j2J15O9m7k04K31j8l55K39j23M7O0k89J14j92M95m85R7J57J44k42J10
$$ plain form
1955 845 436 55 127 382 -171 105 -32 572 -16 740 -30 445 -50 -145 -140 304 -31 -142 -11 -14 -402 -135
1977 -135 -133 -436 -109 -321 -486 -44 -310 -296 -454 -352 -12 -158 -116 -133 -238 -40 -210 -459 -128 -563 -223 -251
1999 -251 -301 -118 -335 -394 -25 -211 -367 -168 -76 -110 -203 -221 7 -105 -82 66 -276 -193 -50 -10 75 158 -158 -194
2023 -194 -223 120 138 -91 -125 82 98 69 416 74 313 -93 -231 89 -139 10 305 -115 -46 61 54 37 -276
2046 -276 -24 126 -89 195 12 -254 -95 135 -26 201 -110 -29 -136 -92 183 186 -181 197 -124 14 -72 -207
2068 -207 222 2 104 -177 -96 267 181 -9 -91 -9 179 230 124 -7 309 252 343 341 -3 128 145 106 196 245
2092 245 265 251 86 134 375 28 303 434 -47 244 202 312 464 5 113 175 -5 153 49 22 128 -33
2114 -33 -135 -147 -32 37 -10 -214 17 -1 -356 -117 -240 -193 -133 -422 -308 -500 -5 -490 -393 -236 -92 -334 -224
2137b24L7M7j77K1kO5J15j04k46M5L34j99R2R7j30j21J50j81K09P9P4k36K13j5
2161e7Q0mO8j27J93j45Q0N6m6l2K27J07j81R3k30N3OO1%NL9j50P1o9R1k02J33
2188A20K27l14K99l58K24j99L32n28K01j9J63k93J99k0j19K99j92Km7K14k65o3
2210a37P4p5L14n22J55J85j31L36l3j98j48L01l90K42k29K20j18R7m9K5M44k09
2232A54Q4n8k47M5J20R4k76o5J3K14L0k42K54j50K0L72p3k02l72M13j68rJ62k21
2256a08J52K64k72K27k65k73J82L6K45k69J72p6k57N7k9K86j46j75J82r3j67J60
2278a67o1p4R6r7Q3QM9j00K05j43j04O4J07j43p2K67k25J93M1q8n7n3J12L9j4
2303a34J04q3m4K20j19PJ31ok5k62K45K31pq2q2K87K5j45J61k92Q7m2%o1J05n2
$$ plain form
2137 -224 -187 -140 -317 -296 -298 -233 -118 -222 -468 -423 -89 -288 -196 -99 -229 -350 -200 -381 -172 -93 -19 -255 -42 -57
2161 -57 23 19 87 -40 153 8 88 144 98 66 293 400 219 312 82 135 141 202 202 207 246 96 167 98 189 -13 120
2188 120 347 33 332 -26 198 -1 331 -197 4 -15 148 -145 54 34 -85 214 22 24 -23 191 -74 -137
2210 -137 -63 -138 176 -346 -191 -6 -137 199 166 -32 -180 121 -269 -27 -256 -36 -154 -57 -106 -81 363 154
2232 154 238 180 -67 -22 98 192 -84 -149 -136 78 108 -134 120 -30 -10 362 289 87 -285 128 -40 -49 113 -108
2256 -108 44 308 36 263 -2 -275 -93 -57 188 -81 91 15 -242 -185 -214 72 -74 -249 -67 -160 -327 -167
2278 -167 -228 -302 -206 -303 -220 -212 -163 -263 -58 -201 -305 -241 -134 -277 -349 -82 -307 -114 -73 -161 -218 -271 -159 -120 -134
2303 -134 -30 -113 -157 63 -56 -49 82 76 51 -211 34 265 258 176 94 381 406 261 422 130 217 175 175 114 219 167
2329A67nJ31R5k38K6Ql0K86m71J19L10k40M5l4Lk17K95k26O2Q1j18R5k00P8R9
2354A21Ok98KL9K98m05L84n2j96J06l3Mo9j8j60q0L91j67RJ31j64k4J23L7J5J70
2380A70j95L7r5j66K64r8R2J73r2L9j11J48j75R9j90K66o0N4r7L0k4J83J57l95
2404A4J60l75J88K89k73R8J48k98J4J80j72J39j37O3r3k67K45q8J01Q9m28M67
2426F4m15PL44j84o8J57k46Q6M4J72J22k20r5j32L02j29j12K50k29J36J69j11
2448h8J71k15J19K21l74J23K03k91KJ51J37J0k10J35j21J69K05l5l9j12n9J74
2470B76Q2r9n7J70p8J64j84p0R2k3j62P9L1j67K23r8j16lJ51Q5j76J14l38k7K8
2495a03L28j83J64k65k68J79K41n9j3oJ24Ml04m0Q1k37K36k31j69M43o8M3j54
$$ plain form
2329 167 162 293 388 150 176 184 154 440 -31 88 398 158 203 169 172 -45 250 24 86 167 49 144 -56 22 121
2354 121 127 -171 -169 -130 168 -237 147 95 -101 5 -28 -24 -93 -111 -271 -351 40 -127 -118 13 -151 -175 -52 -15 0 170
2380 170 -25 12 -83 -249 15 -83 9 182 90 129 18 166 -9 90 -100 166 106 160 63 93 69 252 409 14
2404 14 174 -201 -13 276 3 101 249 -49 -35 145 -27 112 -25 38 -55 -322 -77 -165 -64 25 -403 64
2426 64 -351 -344 0 -184 -252 -95 -341 -255 -211 -39 83 -137 -232 -364 -62 -191 -303 -53 -282 -146 23 -88
2448 -88 83 -132 -13 208 -166 -43 160 -131 -129 22 159 169 -41 94 -27 142 347 312 273 161 102 276
2470 276 358 259 202 372 294 458 274 204 296 273 111 190 221 54 277 179 63 60 211 296 120 234 -104 -131 -103
2495 -103 225 42 206 -59 -327 -148 93 34 21 15 139 143 -161 -201 -120 -357 -121 -352 -521 -78 -146 -103 -257
2518b57J88P8j60o6J62p2j4k9k3N0K1P3K06q6Q6j14l44N40q8l04K53j59j8J65
2542H8k89jK37j18O0J3k68N61k23Q4J8k88K91J43jk43J1j97j77L41J25N3j00j5
2566A05J40j70k17J96j0m5l1j26L08k60J80j65k39K28j75J04j46K40J68j95m0
2587a50M1j07K34N5k77j38L83J3oQ4l0j24J02p5K38m30J92K41k67L24k45J02j31
2610B9J41N1k5p8M6O6j14J42j33J36J1j98J28k75J84j13J96p3j64K10QK12l93
2633fL53p9q7q4n7p6R6p1o3J18l69J32L6P7J0j02j34K46k2j29k32K66L6j6q8J30
2659a15k10L65l26M7K24k42n9K71r8K16j01j28J20K9m39L95k74K35J0N7k09J70
2681f2j02N0l8j50K76J39o7j22L18j82O1k02J41j38J81M0L3l23RK10N4j2J31L7
$$ plain form
2518 -257 -69 9 -151 -217 -55 -127 -141 -170 -193 -143 -122 -49 157 71 157 43 -301 239 151 -153 100 -59 -77 88
2542 88 -201 -202 35 -83 -23 -10 -278 283 60 144 162 -126 165 308 307 64 75 -122 -299 42 167 220 120 105
2566 105 245 75 -142 54 44 -1 -32 -158 150 -110 70 -95 -334 -106 -281 -177 -323 -83 85 -110 -150
2587 -150 -109 -216 18 73 -204 -342 41 54 48 132 102 -22 80 5 243 -187 5 246 -21 303 58 160 29
2610 29 170 221 196 118 164 230 116 258 125 261 272 74 202 -73 111 -2 194 121 -43 167 175 387 -6
2633 -6 347 268 181 97 40 -36 60 -11 -74 44 -325 -193 -157 -80 -70 -172 -306 -60 -82 -211 -443 -177 -141 -157 -245 -115
2659 -115 -325 40 -286 -239 -15 -257 -316 -45 -143 73 -28 -156 -36 -7 -446 -51 -325 -90 -80 -23 -232 -62
2681 -62 -164 -114 -152 -302 -26 113 46 -76 242 60 121 -81 60 -78 103 143 176 -147 -138 72 126 114 245 282
2705B82l23O5n0K45j72l6kj77L37O4j19J19j95N8k9j61J72k15L28j14L5rj41k38
2729b76J16M5J6l0qP3n1J63j45p2J91o7M5r7O4J46O2j99j99O3J33O4Q2R2j23j78
2755i0J16N7J08n6M1k28J42J48p3k41J66o0K37k16J8RJ07o3L7J11n4j37L3J87
2779B99o4j83nk02K62J42o00N36l50L28j06r9P1k70J78L2j8L9k00R2J2k4J80M2
2803I2p4l56K17O5o4l1K28l61L8J08N2R3j00n4j02J66k7k34L54k59R9R0n0J20
2827A0R9N0j10o0N7j09L7J27l4O1q4o1J09MJ20no9k5KJ81l4l66n4M01l79K35M0
2854A43M0Qo6J03p7P2k93n8L04j7j44J12l47j60L38J64j25r1r8r8N5nK14j9m8
2879i3J8P4j18J80k74J33j96j1K17l11M05P6J04m45R0k4J5P7N6K7k44K66p4J57
$$ plain form
2705 282 -41 24 -26 219 47 11 9 -168 169 233 114 233 38 96 67 -94 78 -137 191 77 112 103 -38 -276
2729 -276 -160 -115 -99 -129 -137 -64 -115 48 -97 -169 22 -45 0 -97 -33 113 175 -24 -223 -160 -27 37 119 211 88 -90
2755 -90 26 83 191 135 176 -52 90 238 165 -76 90 30 267 51 69 78 185 122 159 270 216 79 112 299
2779 299 235 52 47 -155 107 249 -351 185 -165 163 57 -42 29 -241 -63 -31 -49 -10 -210 -118 -106 -130 50 92
2803 92 18 -338 -121 -56 -120 -151 77 -284 -246 -138 -86 7 -93 -147 -249 -83 -110 -344 10 -249 -150 -60 -110 10
2827 10 109 159 49 -11 46 -63 -26 101 67 128 44 -17 92 96 216 211 142 117 119 300 266 -100 -154 247 -132 103 143
2854 143 183 191 125 228 151 223 -70 -128 176 159 15 127 -220 -380 -42 122 -3 -94 -192 -290 -235 -240 -26 -45 -93
2879 -93 -75 -1 -119 61 -213 -80 -276 -287 -70 -381 24 100 204 -241 -151 -175 -160 -83 -27 0 -244 22 -52 105
2903A05k0n1KN7k68R5J63J16q4k55J67R2Pl30L92j64M06k22K5k38K26k49K46k18
2927@j8O9j44K00J92k01k21J10N0j04K1O7K5j81L61k25J68j09k29K14j4k65J53
2950h1K52l48J56r9J56n5PKr5j74J52J73o9J98l31m5J85J51k17J68k06k6j14L57
2974I7j94OK4K16l20O13j08k51K6p6j31K24M1j60j42K80j1k90L52k49J69n8L56
2997D14l57j29l4J00K11j88L0k68M08K2j54M04k71j32n2L72q77O92m53P31q27
3018c58J90O38p0Pj82o39L34n3o0j71J28R4J70j89k6J04k12K72j6j21j1M9j28
3041b50J6P3j48J58M9J30k8qQ8K4j70Q4K22l22k4L01m0k15M4K7L9K51j69k65J54
3066B1j70J28M03n52L01J54k94J24o7o8L49m5k26J21j96M5k3k42K00J09j86o3
$$ plain form
2903 105 85 34 36 93 -175 -80 83 199 115 -140 27 119 126 -204 188 24 430 208 233 -5 221 -28 218 0
2927 0 -18 51 -93 107 299 98 -123 -13 37 -67 -46 21 46 -135 226 1 169 60 -169 45 31 -234 -81
2950 -81 171 -177 -21 -120 36 -19 -12 -10 -105 -279 -127 46 -23 175 -156 -201 -16 135 -82 86 -120 -146 -260 97
2974 97 -97 -91 -67 149 -171 442 334 83 109 33 -98 126 167 7 -135 145 134 -156 196 -53 116 58 414
2997 414 57 -72 -106 -6 205 17 47 -221 187 209 55 459 188 56 4 376 -501 191 -262 469 -358
3018 -358 -168 470 400 407 225 -414 -80 -133 -193 -364 -236 -142 28 -161 -187 -83 -295 -23 -39 -160 -171 -122 -250
3041 -250 -234 -161 -309 -151 -102 28 0 -8 80 104 -66 18 240 -82 -106 195 155 -60 -16 11 50 301 132 -133 21
3066 21 -149 -21 382 -170 131 285 -9 115 48 -20 329 284 58 179 -17 28 5 -237 -37 72 -114 -177
3088a77R5K09j00Pk3o6L24l74j16M14m48K21k08K71k67M56l01L2j77J88M5l82
3110c77K48J41L8j39k9n0K5K23p4j26K2q3M05j56j19q2J19P4m4O8j42PML59l90
3135g8J58J01j96L01j78K16k70J79j22l15J13K57O4m7J26qk40M8r7J45j44j65
3157a52L39l9j51j32J36J87k01l5N7R3p6j21J01k49M2J54J29r0l6j57M01l03J25
3180B2j16j48j1K8K26N8m5J50m37K01j33kK59l73L78Pj08j85L91p5Ml50K94j05
3204g0K35l60M52J46m77J24N7l8j45J9K99k4l95L09J7k05K54m9Pn8J59l56J16
3227A7J47j87L9K38k79j44m3L48p7m8K7J97j64Lj54K52m34K33r1oK83k77Q1J15
3251G6J65m27L18k07L8j53K8L19k35R8j51j44L00j39K14Q6k60O8o9P9l1P1k9l8
$$ plain form
3088 -177 -82 127 27 34 11 -55 269 -105 -221 193 -255 -34 -242 29 -238 218 -83 -51 -228 -40 5 -377
3110 -377 -129 12 50 -89 -118 -168 -143 80 6 -120 -98 -181 224 68 -51 -133 -14 60 16 84 -58 -51 -47 312 -78
3135 -78 80 181 -15 286 108 324 54 233 111 -204 -91 166 230 183 309 301 61 109 12 157 13 -152
3157 -152 187 148 -3 -135 1 188 -13 -48 9 102 26 -95 6 -243 -201 -47 82 -8 -44 -201 200 -103 22
3180 22 -94 -242 -253 -225 1 59 14 164 -273 -72 -205 -207 52 -321 57 64 -44 -229 162 87 91 -259 35 -70
3204 -70 165 -195 257 403 -74 50 107 69 -76 -57 242 218 -177 132 149 -56 198 149 156 98 257 -99 17
3227 17 164 -23 16 254 -25 -169 -212 136 59 11 38 235 71 74 -80 172 -262 -29 -120 -126 157 -120 -39 76
3251 76 241 -186 132 -75 -37 -190 -162 157 -78 20 -131 -275 25 -114 100 186 -74 -6 -75 4 -27 44 15 -23
3275b3j54J07J75q5n2n2k3J08o9K38j45j5oR6oo7M4J17J04l89J28K5J08r6n4p
3301GM6J14j90K35m7j88R6J34k71K04l13M8J40j48K6k29K33Q7J59j04K22l30k5
3324i4Jj50J01J9p5O7j05m1L55j55K94k98k18jO6L85j31n6k3o6k08L10o0j20J48
3349e5j49OJ74Q7j65j45M6K21j93j4K65j54M1N3L3o4M8L36k35j33j28K77J00o9
3373A83j57O5q0J74q6J1k27K48M3k93P2K32n4R2k19j1J29j9j88K15J92l69N6J67
3397A76n60J74J68K06k54O6J25j81R5k96K17N8J73m3l99M12j92J4l3J13O2j57
3419e6j16R2OK55j16Q2j41k76M14o0R8q9k63J4L47k10K11j30M7M7l14J3L51l11
3443a05K27J10k39J91j24PM1K5J15k06j76m1K51J86l41R8P2m2J00k11P7J85j09
$$ plain form
3275 -23 -177 -70 105 20 -32 -84 -107 1 -68 170 25 10 4 100 94 27 71 188 292 -97 31 56 164 68 14 7
3301 7 53 167 -23 212 165 -23 73 207 -64 140 -173 -125 15 -133 -107 -336 -103 -16 143 39 261 -69 -94
3324 -94 -93 -243 -142 -123 -198 -131 -236 -277 78 -77 217 -81 -299 -300 -234 151 20 -36 -59 -125 -333 -23 -83 -203 -55
3349 -55 -204 -198 -24 63 -102 -247 -201 20 -173 -187 78 -76 -35 18 51 -13 35 371 136 3 -125 152 252 183
3373 183 26 91 11 185 99 110 -117 131 174 -119 -47 185 131 223 4 -7 122 103 -85 130 322 -47 9 176
3397 176 -384 -210 -42 164 -90 -24 101 -80 15 -281 -64 -6 167 124 -275 137 -55 -41 -74 39 101 -56
3419 -56 -172 -80 -74 181 65 147 6 -270 144 84 182 93 -170 -156 191 -19 192 62 109 156 -158 -145 206 -105
3443 -105 122 232 -7 184 60 67 108 133 248 42 -134 -175 76 262 -79 19 91 49 149 -62 15 200 91
3466I1k09J34J5J96k17QM8k2j12M4L2j28kq9J11l8J23j23O1o2K55k21J08j77L6
3491a38J59q2j19K21j12j00O7j77J94j27NM93j91k79m2J48J86N1l28L67j25k46
3513a75J94n2J23j34J1P0k54J28L88k28K2m6Q5J09%R8l47K34j92O2j27k1n6J16
3537Hk1J90p0p8k01O3j6J29J34l88L38k30J79J5O9j85L10m48K29Nn1J00l18J90
3561d7N8k45J62L1J78J1j92rR7m7j16p5Q6J06o2j03J70j14j06M15k62J9J12k41
3585a74K70J46k02n2L01k56j8O4p5j37J00K41l84K34q7J91q6L4j7K3r1j73k0L61
3609A93o9n2k02R3O6k2o3j8r5Rr8K62k6j27P4K5l2K82j74l0r7K57j70K7J91j24
3635H0p2l4J45j49J09q0l20L22J19kk34OL1n0J87j56J36k9J85j65r2O6J53J68
$$ plain form
3466 91 -118 16 31 227 10 18 66 44 -68 -24 8 -120 -122 -211 -100 -138 -15 -138 -77 -139 116 -105 3 -174 -138
3491 -138 21 -61 -180 41 -71 -171 -104 -281 -87 -214 -209 284 93 -186 -228 -80 106 157 -171 196 71 -175
3513 -175 19 -33 90 -44 -33 37 -217 -89 299 71 93 47 132 241 241 339 -8 226 34 96 -31 -52 -108 8
3537 8 -13 177 107 29 -172 -109 -125 4 138 -250 88 -142 37 52 121 -64 246 -202 27 32 -19 81 -237 -47
3561 -47 11 -234 -72 -41 137 148 -44 -53 44 -3 -119 -194 -108 -2 -64 -167 3 -111 -217 198 -64 -45 67 -174
3585 -174 96 242 40 -12 289 33 15 79 4 -133 -33 208 -176 58 -29 162 76 110 93 116 25 -148 -168 193
3609 193 124 72 -130 -37 29 7 -56 -74 -169 -160 -258 4 -22 -149 -75 -50 -82 200 26 -4 -101 156 -14 13 204 80
3635 80 8 -26 119 -30 79 -1 -321 1 120 118 -116 -110 -79 -129 58 -98 38 9 194 29 -63 3 156 324
3659C24k61K97p42M80R0J7j60J8L48n69K19M1J51j64j54J59L2k51J18j89J72k09
3681b33L69n2j40P6J47n8k59J68k8j27K22p9j35O3o7J31k70K47q3j1O1J08j85
3704a35q3K26J70l33L38k54j43L13j66n1O0KJ4N8k70J61qK10j12j97J69j57L11
3727A23J30J3k37k6M7j89q9K74NK17n14J26L31K64m76K3j224J632n87j67L39J22
3749A37L26r21Q69l91M27o15k13J089n53K36l30J55j58Q7r8m6k5j8P5k07L45k06
3771c5k37k3L04n7r6J42j95J79K04k51Q2j63j60J55K81j91l5K96k14J58k78K45
3793A11Kk34P9p1K16k5O7%p5j16J17k76J82J60k54J02k54K03J75m80M69o2P7j63
3817e0K65j9Q6r9k07J50l8P0j12j04K9l9J74j11K81n35L73J79k47k55K38L01k92
$$ plain form
3659 324 63 360 -382 98 188 205 45 63 411 -158 61 102 253 89 -65 94 126 -125 -7 -196 -24 -233
3681 -233 136 84 -56 20 167 109 -150 18 -10 -137 85 6 -129 -66 -133 -2 -272 -25 -108 -119 -58 50 -135
3704 -135 -218 8 178 -155 183 -71 -214 99 -67 -118 -58 -56 -42 16 -254 -93 -101 109 -3 -200 -31 -188 123
3727 123 253 266 29 3 50 -139 -228 46 51 268 -246 -120 211 475 -1 22 -1202 430 -157 -324 15 137
3749 137 463 -458 411 20 447 -168 -381 708 155 391 61 216 58 145 47 1 -24 -42 33 -174 171 -35
3771 -35 -272 -295 9 -48 -144 -2 -197 -18 186 -65 17 -146 -306 -151 130 -61 -96 200 -14 144 -134 111
3793 111 113 -121 -42 -113 103 78 145 145 70 -46 71 -205 -23 137 -117 -15 -269 -66 109 -371 98 36 113 -50
3817 -50 215 196 282 183 -24 126 88 158 46 -58 -29 -68 106 -5 276 -259 114 293 46 -209 29 330 38
3840C8mJ91j32N4l7j68j36K2l53M63J23j05o1J76k24J95j23J08k11J9L39k29K0
3863c5r3L0R3J64n7o6n9o3J13k92l1Q3m4K12P0K23k47J19q8q1J19k27J70m4J22
3888I1j50j0K47j63l2l5K24k99N31m67J2K55ro4J93O2j85j97L76k61R7j31q0K5
$$ plain form
3840 38 34 225 93 147 110 -58 -194 -172 -525 -62 61 -44 -105 71 -153 42 -81 27 -184 -165 174 -55 -35
3863 -35 -128 -98 -5 159 102 36 -23 -86 27 -265 -296 -213 -257 -45 25 248 1 120 32 -49 70 -157 13 -31 91
3888 91 -59 -69 178 15 -17 -52 172 -127 404 -63 -51 204 195 131 324 386 201 4 380 119 216 85 5 30
$$ [...]
8191d14
##END NTUPLES=NMR FID
##END=
