##TITLE=1H_SR9_1
 CDCl3, 8 sc, 
 23.11.2020
##JCAMPDX= 6.0         $$ Bruker NMR JCAMP-DX V2.0
##DATA TYPE= NMR FID
##DATA CLASS= NTUPLES
##ORIGIN= UXNMR, Bruker Analytische Messtechnik GmbH
##OWNER= root
$$ XWIN-NMR		Version 3.5
$$ Mon Nov 23 12:35:45 2020 Russian Standard Time (UT+4h)  she@DPX200
##.OBSERVE FREQUENCY= 200.1315066352
##.OBSERVE NUCLEUS= ^1H
##.DELAY= (6, 6)
##.ACQUISITION MODE= SIMULTANEOUS
##.ACQUISITION SCHEME= undefined
##.AVERAGES= 8
##.DIGITISER RES= 18
##SPECTROMETER/DATA SYSTEM= spect
##.PULSE SEQUENCE= zg30
##.SOLVENT NAME= CDCl3
##.SHIFT REFERENCE= (INTERNAL, CDCl3, 0, 15.7039)
##AUDIT TRAIL= $$ (NUMBER, WHEN, WHO, WHERE, WHAT)
$$ ##TITLE= Audit trail, XWIN-NMR		Version 3.5
$$ ##JCAMPDX= 5.01
$$ ##ORIGIN= Bruker BioSpin GmbH
$$ ##OWNER= she
$$ F:/spectra/data/she/nmr/H-F/1/audita.txt
$$ ##AUDIT TRAIL=  $$ (NUMBER, WHEN, WHO, WHERE, WHAT)
(   1,<2020-11-23 12:33:33.23 +0400>,<she>,<DPX200>,
      <created by zg, POWCHK disabled, PULCHK disabled
       configuration hash MD5:
       00 E9 B6 7A A2 85 ED C7 34 08 36 98 17 FE 4E 26
       data hash MD5: 16K
       0D C2 2B DC 33 26 90 27 68 0F 5C CF 52 4D 0C E1>)
$$ ##END=
$$ 
$$ hash MD5
$$ D5 23 FE 85 64 4C AE FE 7A 24 DB E3 07 72 88 1D
##$RELAX= 
##$RELAX= 
##$RELAX= 
##$RELAX= 
##$RELAX= 
##$RELAX= 
$$ Bruker specific parameters
$$ --------------------------
##$DU= <F:/spectra>
##$EXPNO= 1
##$NAME= <H-F>
##$PROCNO= 1
##$TYPE= <nmr>
##$USER= <she>
##$AMP= (0..31)
100 100 100 100 100 100 100 100 100 100 100 100 100 100 100 100 100 100 
100 100 100 100 100 100 100 100 100 100 100 100 100 100 
##$AQSEQ= 0
##$AQ_mod= 1
##$AUNM= <au_zg>
##$AUTOPOS= <>
##$BF1= 200.13
##$BF2= 200.13
##$BF3= 200.13
##$BF4= 200.13
##$BF5= 200.13
##$BF6= 200.13
##$BF7= 200.13
##$BF8= 200.13
##$BYTORDA= 1
##$CFDGTYP= 0
##$CFRGTYP= 5
##$CHEMSTR= <none>
##$CNST= (0..31)
1 1 145 1 1 1 1 1 1 1 1 1 1 1 1 1 1 1 1 1 1 1 1 1 1 1 1 1 1 1 1 1 
##$CPDPRG= <>
##$CPDPRG1= <>
##$CPDPRG2= <>
##$CPDPRG3= <>
##$CPDPRG4= <mlev>
##$CPDPRG5= <mlev>
##$CPDPRG6= <mlev>
##$CPDPRG7= <mlev>
##$CPDPRG8= <mlev>
##$CPDPRGB= <>
##$CPDPRGT= <>
##$D= (0..31)
0 1.2 0 0 0 0 0 0 0 0.06 0 0.03 0 0 0 0 0.0002 0 0 0 0 0 0 0 0 0 0 0 0 
0 0 0 
##$DATE= 1606120412
##$DBL= (0..7)
120 120 120 120 120 120 120 120 
##$DBP= (0..7)
150 150 150 150 150 150 150 150 
##$DBP07= 0
##$DBPNAM0= <>
##$DBPNAM1= <>
##$DBPNAM2= <>
##$DBPNAM3= <>
##$DBPNAM4= <>
##$DBPNAM5= <>
##$DBPNAM6= <>
##$DBPNAM7= <>
##$DBPOAL= (0..7)
0.5 0.5 0.5 0.5 0.5 0.5 0.5 0.5 
##$DBPOFFS= (0..7)
0 0 0 0 0 0 0 0 
##$DE= 6
##$DECBNUC= <off>
##$DECIM= 32
##$DECNUC= <off>
##$DECSTAT= 4
##$DIGMOD= 1
##$DIGTYP= 9
##$DL= (0..7)
0 120 120 120 120 120 120 120 
##$DP= (0..7)
150 150 150 150 150 150 150 150 
##$DP07= 0
##$DPNAME0= <>
##$DPNAME1= <>
##$DPNAME2= <>
##$DPNAME3= <>
##$DPNAME4= <>
##$DPNAME5= <>
##$DPNAME6= <>
##$DPNAME7= <>
##$DPOAL= (0..7)
0.5 0.5 0.5 0.5 0.5 0.5 0.5 0.5 
##$DPOFFS= (0..7)
0 0 0 0 0 0 0 0 
##$DQDMODE= 0
##$DR= 18
##$DS= 0
##$DSLIST= <SSSSSSSSSSSSSSS>
$$ [...]
##$SUBNAM2= <"">
##$SUBNAM3= <"">
##$SUBNAM4= <"">
##$SUBNAM5= <"">
##$SUBNAM6= <"">
##$SUBNAM7= <"">
##$SUBNAM8= <"">
##$SUBNAM9= <"">
##$SW= 16.9725356469052
##$SWIBOX= (0..15)
0 0 2 0 0 0 0 0 0 0 0 0 0 0 0 0 
##$SW_h= 3396.73913043478
##$TD= 16384
##$TD0= 1
##$TE= 0
##$TE2= 300
##$TE3= 300
##$TEG= 300
##$TL= (0..7)
0 120 120 120 120 120 120 120 
##$TP= (0..7)
150 150 150 150 150 150 150 150 
##$TP07= 0
##$TPNAME0= <>
##$TPNAME1= <>
##$TPNAME2= <>
##$TPNAME3= <>
##$TPNAME4= <>
##$TPNAME5= <>
##$TPNAME6= <>
##$TPNAME7= <>
##$TPOAL= (0..7)
0.5 0.5 0.5 0.5 0.5 0.5 0.5 0.5 
##$TPOFFS= (0..7)
0 0 0 0 0 0 0 0 
##$TUNHIN= 0
##$TUNHOUT= 0
##$TUNXOUT= 0
##$USERA1= <user>
##$USERA2= <user>
##$USERA3= <user>
##$USERA4= <user>
##$USERA5= <user>
##$V9= 5
##$VALIST= <valist>
##$VCLIST= <CCCCCCCCCCCCCCC>
##$VD= 0
##$VDLIST= <DDDDDDDDDDDDDDD>
##$VPLIST= <PPPPPPPPPPPPPPP>
##$VTLIST= <TTTTTTTTTTTTTTT>
##$WBST= 1024
##$WBSW= 4
##$XGAIN= (0..3)
0 0 0 0 
##$XL= 0
##$YL= 0
##$YMAX_a= 369390
##$YMIN_a= -342607
##$ZGOPTNS= <>
##$ZL1= 120
##$ZL2= 120
##$ZL3= 120
##$ZL4= 120
##$ABSF1= 10
##$ABSF2= 0
##$ABSG= 5
##$ABSL= 3
##$ALPHA= 0
##$AQORDER= 0
##$ASSFAC= 0
##$ASSFACI= 0
##$ASSFACX= 0
##$ASSWID= 0
##$AUNMP= <proc_1d>
##$AZFE= 0.1
##$AZFW= 0.1
##$BCFW= 1
##$BC_mod= 2
##$BYTORDP= 1
##$COROFFS= 0
##$CY= 11.3945322036743
##$DATMOD= 1
##$DC= 2
##$DFILT= <>
##$DTYPP= 0
##$F1P= 15.9154993809931
##$F2P= -4.1035820241983
##$FCOR= 0.5
##$FTSIZE= 0
##$FT_mod= 4
##$GAMMA= 1
##$GB= 0.15
##$INTBC= 1
##$INTSCL= 1
##$ISEN= 128
##$LB= 0.24
##$LEV0= 0
##$LPBIN= 0
##$MAXI= 10000
##$MC2= 0
##$MEAN= 0
##$ME_mod= 0
##$MI= 1.114404
##$NCOEF= 0
##$NC_proc= 0
##$NLEV= 6
##$NOISF1= 3.799351
##$NOISF2= 2.8
##$NSP= 1
##$NTH_PI= 0
##$NZP= 0
##$OFFSET= 15.70392
##$PC= 1
##$PHC0= -11046.36
##$PHC1= 11.00089
##$PH_mod= 1
##$PKNL= yes
##$PPARMOD= 0
##$PSCAL= 0
##$PSIGN= 0
##$REVERSE= no
##$SF= 200.130013532006
##$SI= 16384
##$SIGF1= 3
##$SIGF2= 2
##$SINO= 400
##$SIOLD= 16384
##$SREGLST= <1H.CDCl3>
##$SSB= 0
##$STSI= 0
##$STSR= 0
##$SW_p= 3612.71676300578
##$SYMM= 0
##$S_DEV= 0
##$TDeff= 0
##$TDoff= 0
##$TI= <>
##$TILT= no
##$TM1= 0
##$TM2= 0
##$TOPLEV= 0
##$USERP1= <user>
##$USERP2= <user>
##$USERP3= <user>
##$USERP4= <user>
##$USERP5= <user>
##$WDW= 1
##$XDIM= 8192
##$YMAX_p= 0
##$YMIN_p= 0
$$ End of Bruker specific parameters
$$ ---------------------------------
##NTUPLES= NMR FID
##VAR_NAME=  TIME,          FID/REAL,        FID/IMAG
##SYMBOL=    X,             R,               I
##VAR_TYPE=  INDEPENDENT,   DEPENDENT,       DEPENDENT
##VAR_FORM=  AFFN,          ASDF,            ASDF
##VAR_DIM=   8192,          8192,            8192
##UNITS=     SECONDS,       ARBITRARY UNITS, ARBITRARY UNITS
##FACTOR=    0.0002944,     1,               1
##FIRST=     0,             0,               0
##LAST=      2.4114304,     0,               0
##MIN=       0,             -342607,         0
##MAX=       2.4114304,     369390,          0
$$ Real data points
##PAGE= N=1
##DATA TABLE= (X++(R..R)), XYDATA
$$ [...]
1970F45K09K78k85m34L29J36J37l00J16n94Q87k25o45Lj85P61J22p70o4k69K47
$$ 645 854 1132 847 413 742 878 1015 715 831 237 1124 899 254 257 72 833 955 185 121 -148 99
1991I9J00l11j8R7Ok53r8n69J044m35N15o73m14M47k45J26K80n27L29j20NL20
$$ 99 199 -112 -130 -33 -27 -280 -378 -947 97 -338 177 -496 -910 -463 -708 -582 -302 -829 -500 -620 -615 -295
2013b95n61M5Q88o52L36k50j26M75p3J34k02J86l86O62j12M17o05N38k86M9K22
$$ -295 -856 -811 77 -575 -239 -489 -615 -140 -213 -79 -281 -95 -481 181 69 486 -119 419 133 182 404
2034D04m09N81M87p77K50l68L60j00K47j8k62K72J50k62j97K68k33L61k14j89
$$ 404 -5 576 1063 286 536 168 528 428 675 657 395 667 817 555 358 626 393 754 540 351
2054C51k9m82Q60l92j67K04l80L55j84k68J73K0k49L12n72k57J23k85M41m05j16
$$ 351 322 -160 700 308 141 345 -35 320 136 -132 41 61 -188 124 -448 -705 -582 -867 -426 -831 -947
2075i47K36j2K55p25L64j2j12L31j3o24O21p6j48K49l94N18k37J0O4k72N30LN
$$ -947 -711 -723 -468 -1193 -829 -841 -953 -622 -635 -1259 -638 -714 -862 -613 -1007 -489 -726 -716 -652 -924 -394 -391 -386
2098c86K24k28pJ89J15J49L25l83L59k55R2R7J60K03m8J78j85n8J17n7K67l51
$$ -386 -162 -390 -397 -208 -93 56 381 -2 357 102 194 291 451 654 606 784 599 541 658 601 868 517
2120E17K41k30M59m50M72pk66J76n65M47j12P8K16m28K3p61N43j19J55m61M47
$$ 517 758 528 987 537 1009 1002 736 912 347 794 682 760 976 548 571 -190 353 234 389 -72 375
2141C75l94J45l2l11M01n35K83j02j26J45l74M00k26p2J1k50n6K44J74l93L15
$$ 375 -19 126 94 -217 184 -351 -68 -170 -296 -151 -525 -125 -351 -423 -412 -662 -718 -474 -300 -693 -378
2162c78k37M40m64j57J30J26L12r7l74p0L23J18J67L03j27l2k53P3L71J5L60m96
$$ -378 -615 -175 -639 -796 -666 -540 -228 -325 -699 -769 -446 -328 -161 142 15 -17 -270 -197 174 189 549 53
2184E3R9j4nK28P8j73K54O6m95N63m43L30j22J3K21m51K33j00J27j3M5m5n39K71
$$ 53 152 138 133 361 439 266 520 586 91 654 211 541 419 432 653 202 435 335 462 449 494 449 -90 181
2208A81J16n9l38n6o0J01n8l21K81j09K09r3l40L1N4P6L7j01m6l0j64k37N08k68
$$ 181 297 238 -100 -156 -216 -115 -173 -494 -213 -322 -113 -206 -546 -515 -461 -385 -348 -449 -495 -525 -689 -926 -418 -686
2232f86K7r6K24q8j4o4K81j04nJ95k47J3J51M28k70J85J09k85P0K45J10J78j01
$$ -686 -659 -755 -531 -619 -633 -697 -416 -520 -525 -330 -577 -564 -413 15 -255 -70 39 -246 -176 69 179 357 256
2255B56P5L7j94k65O51j85M17K03k82M0m81N10K46K37k05k80L10n27M16k26J31
$$ 256 331 368 174 -91 560 375 792 995 713 753 272 782 1028 1265 1060 780 1090 563 979 753 884
2276H84K57m24K8l30L32M2J79j78j82j51l60R6j72L00l89K20k24m68M63p8J66
$$ 884 1141 717 745 415 747 789 968 790 608 457 97 193 21 321 -68 152 -72 -540 -77 -155 11
2297A1n6l97j84J98m72J99M7R5Ll01j66L15m35N28K37l74K39rl45K44p2K53k33
$$ 11 -45 -442 -626 -428 -900 -701 -654 -559 -556 -857 -1023 -708 -1143 -615 -378 -752 -513 -522 -867 -623 -695 -442 -675
2320f75r5K80k44J15K46K8L0J13k84P2K35Q3L02Q3l17M42j239J045m18K50O71
$$ -675 -770 -490 -734 -619 -373 -345 -315 -202 -486 -414 -179 -96 206 289 -28 414 -825 220 -198 52 723
2341G23l82m6O4Rm76R85n15L56k29m40L32o0O2K92q7n30K51l62K86L62o40N13
$$ 723 341 295 359 368 -108 877 362 718 489 49 381 321 383 675 588 58 309 -53 233 595 -45 468
2363D68k27o48Q61q23K03O11o95kJ85l77L92k90NL50n12Q8J47k69N07j06k99J48
$$ 468 241 -407 454 -369 -166 445 -250 -252 -67 -444 -52 -342 -337 13 -499 -411 -264 -533 -26 -132 -431 -283
2385b83l61j73N75qRK77n61M45k1q4N1K51j08M42n29Q3M08n73Q46k05l24O49o49
$$ -283 -644 -817 -242 -250 -241 36 -525 -80 -101 -185 -134 117 9 451 -78 5 413 -160 686 481 157 806 157
2408A57K76K04k88M56k65j69L85l99K86L81o17L29j44k66K04j23K08L24p14K56
$$ 157 433 637 349 805 540 371 756 357 643 1024 407 736 592 326 530 407 615 939 225 481
2428D81J56o34L79m9k38M73o18p7K82o28L35M4l41Q29n28m57K82k20k42O20r12
$$ 481 637 3 382 333 95 568 -50 -127 155 -473 -138 -94 -435 394 -134 -591 -309 -529 -771 -151 -1063
2449a063L09J66o74P63k78k70N40p23K42O11p36M84J00n13N56n54L91K49k92J17
$$ -1063 -754 -588 -1262 -499 -777 -1047 -507 -1230 -988 -377 -1113 -629 -529 -1042 -486 -1040 -649 -400 -692 -575
2469e75J30k98O19k6k24M08l74M39Q9n76P86l26j78P03k61k84N36k78J48L37m22
$$ -575 -445 -743 -124 -150 -374 34 -340 99 188 -388 398 72 -106 597 336 52 588 310 458 795 373
2490C73L92N1k95K10k09L8M16j80o6M0l69O81n62j86P44o76L64J01o68M69k00
$$ 373 765 816 521 731 522 560 976 796 730 770 401 1082 520 334 1078 402 766 867 199 668 468
2511D68m13Q32r05j69N85r61P48L01q27O95o18J58P2m68K49K73n35L42J60m82
$$ 468 55 887 -18 -187 398 -563 185 486 -341 354 -264 -106 -34 -502 -253 20 -515 -173 -13 -495
2531d95N52m05O2K8k46K76l53J93K04N3l32J44k70j98O96l29J55L03l76R8L04
$$ -495 57 -348 -286 -258 -504 -228 -581 -388 -184 -131 -463 -319 -589 -787 -91 -420 -265 38 -338 -240 64
2552F4k65L61n81L27L18l91J32L46m71R57o82q1N59o07L69K40j47o0k81K57M0
$$ 64 -201 160 -421 -94 224 -167 -35 311 -160 797 115 34 593 -14 355 595 448 388 107 364 404
2573D04p5m2L25q42R01l75l56M04l53PL13j60k43K98j80rj30L0M5n82O09k15k23
$$ 404 329 287 612 -230 671 296 -60 344 -9 -2 311 151 -92 206 26 17 -113 -83 -38 -620 -11 -226 -449
2596d49J15l30L6mJ25j71K83l7Q2o1p2J39K1J6lQ9j32N5k0k12L29j2J11J2j82
$$ -449 -334 -664 -628 -632 -507 -678 -395 -432 -350 -411 -483 -344 -323 -307 -310 -221 -353 -298 -318 -530 -201 -213 -102 -90 -272
2621b72K00o5K02l56L91k80K24M9N48k92J40K01n07L95k9j98L29nQl32K41qk2
$$ -272 -72 -137 65 -291 100 -180 44 93 641 349 489 690 183 578 549 351 680 675 683 351 592 584 562
2644E62K4%J76k00j14q2L8J84p7q5PJ36j43R6j27J42k41n0k07J40n1L2j79J09
$$ 562 586 586 762 562 448 366 404 588 511 426 433 569 426 522 395 537 296 246 39 179 128 160 -19 90
2668I0r6k61j19M6lj61J26j84Q6k2K57l46P0l62K22MK2O1l14N72l44R6j07K33
$$ 90 -6 -267 -386 -340 -343 -504 -378 -562 -476 -498 -241 -587 -517 -879 -657 -653 -631 -570 -884 -312 -656 -560 -667 -434
2692d34O1l5k8j97K16O0J41O1K3j5m8K16k8N1j53J95K00P1j16k08J91O1R4k01
$$ -434 -373 -408 -436 -633 -417 -357 -216 -155 -132 -147 -195 21 -7 44 -109 86 286 357 241 33 224 285 379 178
2716A78M02Q8m42M80l24L99l13L51k58K4q5P1j82N3J78k05L7j80m39L77K77j63
$$ 178 580 668 226 706 382 781 468 819 561 585 500 571 389 442 620 415 452 272 -167 210 487 324
2738C24j23j1j29l54O3K33J69m81M44k98o3K06k78Kk96m3R0J07J01j51L26l00
$$ 324 201 190 61 -293 -230 3 172 -309 135 -163 -226 -20 -298 -296 -592 -635 -545 -438 -337 -488 -162 -462
2760d62J27n89O92k31J75j95J60j91J76J89m61O68o81P60l90K10K38m73L0O38
$$ -462 -335 -924 -232 -463 -288 -483 -323 -514 -338 -149 -610 58 -623 137 -253 -43 195 -278 -248 390
2780C90n01J72J09J12J51j7k61M85p06J98N93k24L3l46M32j86J14q2j70n4j1J5
$$ 390 -111 61 170 282 433 416 155 640 -66 132 725 501 534 188 620 434 548 466 296 242 231 246
2802B46j92K21P7j80M4j60J16J86l93L3O3l59O01j84m18M36m45k34J94k94O43
$$ 246 54 275 352 172 216 56 172 358 -35 -2 61 -298 303 119 -299 137 -308 -542 -348 -642 1
2823Aj17m93K68l6k59N64k23p6J25n60P05l05j32K16k74J29L0j66J50K10j60M08
$$ 1 -116 -609 -341 -377 -636 -72 -295 -371 -246 -806 -101 -406 -538 -322 -596 -467 -437 -603 -453 -243 -403 5
2845Ek49j99K00j64L90M2NJ09j12Q3J55k26j11O39k87N5J32n04O12j9j73K52l53
$$ 5 -244 -443 -243 -407 -17 25 30 139 27 110 265 39 -72 567 280 335 467 -37 575 556 383 635 282
2868B82J88M27m55J54om59O35k94j43K61m93M50J43l81k5Mk31M58k00j44J13j11
$$ 282 470 897 442 596 590 131 766 472 329 590 97 547 690 309 284 288 57 515 315 171 284 173
2890A73L40l43p91O19k54j9K13m79j02M45m48N01l11l37N29j56M5kk12K89p3l20
$$ 173 513 170 -621 -2 -256 -275 -62 -541 -643 -198 -646 -145 -456 -793 -264 -420 -375 -377 -589 -300 -373 -693
2912f93J95P5j53P13o12o0N34o72L63rn9M69j98k58O10j84j14J32n27O81k32j92
$$ -693 -498 -423 -576 137 -475 -535 -1 -673 -310 -319 -378 91 -107 -365 245 61 -53 79 -448 233 1 -191
2934a91N68k49J17K43o43O38kj69K45l60Q2L26l90K21p9PM28j60k61l2K3p9K27
$$ -191 377 128 245 488 -155 483 481 312 557 197 279 605 215 436 357 364 792 632 371 339 362 283 510
2957E10n62J46K77m96K50j61j09L04k05J15j62j90J17K1P0p9k10L1K99m45M08
$$ 510 -52 94 371 -125 125 -36 -145 159 -46 69 -93 -283 -166 -145 -75 -154 -364 -333 -34 -479 -71
2978g1k30l87M87K6l44J07l0j20N48m99K65k3k40N18l71J22L02o70O32k36k2R1
$$ -71 -301 -688 -201 -175 -519 -412 -442 -562 -14 -513 -248 -271 -511 7 -364 -242 60 -610 22 -214 -236 -145
3000a45J04j17K64j80o5M65j51K39p1j32L6Qj11M31k24j00J07k0P9J73m13L28
$$ -145 -41 -158 106 -74 -139 326 175 414 343 211 247 255 144 575 351 251 358 338 417 590 177 505
3022E05p4j5J0J36j67J82n10K40O7m29L13j26L8K07m11M5J25l48K13p3J28J7k26
$$ 505 431 416 426 562 395 577 67 307 374 -55 258 132 170 377 -34 11 136 -212 1 -72 56 73 -153
3045a53r8j32j27K69p4J5J51m19J47J05j04L3R4k23K63j66J03j10k14K83k24L14
$$ -153 -251 -383 -510 -241 -315 -300 -149 -568 -421 -316 -420 -387 -293 -516 -253 -419 -316 -426 -640 -357 -581 -267
3067b67j38K05M3l6L2p5K13O9j82Q4O1K00p8M5j6j2j69M24j35K46k31JNk60K49
$$ -267 -405 -200 -157 -193 -161 -236 -23 46 -136 -52 9 209 131 176 160 148 -21 403 268 514 283 284 289 29 278
3092B78J09j90K48l6j71L75j76m2j54K10r5J9j44J60j2R2j65l39K56k3M4k49m4
$$ 278 387 197 445 409 238 613 437 395 241 451 356 375 231 391 379 471 306 -33 223 200 244 -5 -49
3115d9K8j35Q9R1j20k5r4K95k94o5l34N67k73k2j46R7K19k61J19o5o9O7j7j22
$$ -49 -21 -156 -67 24 -96 -121 -215 80 -214 -279 -613 -46 -319 -341 -487 -390 -171 -432 -313 -378 -447 -380 -397 -519
3139e19J84j02K45J04J17m15OL99j24L5J34k79L33o2j06O1J90j03L13q2R0l06
$$ -519 -335 -437 -192 -88 29 -386 -380 19 -105 -70 64 -215 118 56 -50 11 201 98 411 329 419 113
3161A13M2j4O6J78j93Q7N7k8K46j84j33O3J50j14l1J59m57L28M0r6n3K65k19j13
$$ 113 155 141 207 385 192 279 336 308 554 370 237 300 450 336 305 464 7 335 375 279 226 491 272 159
3185A59P7o0k8k44P9J6k83P2M1j38K32k1p4K4j95p2R6r2M10N7l60Jk73J54N0r
$$ 159 236 176 148 -96 -17 -1 -284 -212 -171 -309 -77 -98 -172 -148 -343 -415 -319 -411 -1 56 -304 -303 -576 -422 -372 -381
3211c81n6j43J67rJ0K79L5l47K85l4J9j45K58R1k0k02J90J38K28k03Q9m3n0N6
$$ -381 -437 -580 -413 -422 -412 -133 -98 -445 -160 -194 -175 -320 -62 29 9 -193 -3 135 363 160 249 206 156 212
3235B12m0M6O6k65L40M2n1P3n5r4J63R6k08k5m7K12k2r4l93M66k29L3j05L3q2
$$ 212 172 218 284 19 359 401 350 423 368 274 437 533 325 300 253 465 443 349 -44 422 193 226 121 154 72
3260G2q5K29q4p6K03l54j92L46l49L66l44K02J0j07r1J8q4M0k83L73l6l0o5L60
$$ 72 -13 216 132 56 259 -95 -287 59 -290 76 -268 -66 -56 -163 -254 -236 -320 -280 -563 -190 -226 -256 -321 39
3284C9m04j11oJ12J67j6N1k30j09L15M06n85N38l49l23N87j06K22o8j00J58k68
$$ 39 -365 -476 -482 -370 -203 -219 -168 -398 -507 -192 214 -371 167 -182 -505 82 -24 198 130 30 188 -80
3306h0L64J54m68K73k30L84l47J47K77p31J075p03J07Q7J25k12K04J64P5n4l89
$$ -80 284 438 -30 243 13 397 50 197 474 -257 818 115 222 309 434 222 426 590 665 611 222
3327B22J40l19L45N1l97J09J52l7k46N7k00K1L21k49nR6K40o40K96j37j41J62
$$ 222 362 43 388 439 42 151 303 266 20 77 -123 -102 219 -30 -35 61 301 -339 -43 -180 -321 -159
3349a59k21J15j36K33p4l54K38L7M2Q8l74J07L44n14J69j87M78q7J07j00l37M99
$$ -159 -380 -265 -401 -168 -242 -596 -358 -321 -279 -191 -565 -458 -114 -628 -459 -646 -168 -255 -148 -248 -585 -86
3371h6k88K53j33J27K91l26K78k07K04K9j20J6L0J98q0K18k16K00l24M49j26O3
$$ -86 -374 -121 -254 -127 164 -162 116 -91 113 142 22 38 68 266 186 404 188 388 64 513 387 450
3393D50j84j03M45j59k95J70K4j8j25M9J29k38R4J18k05o2K35j50R4o9j67P7o2
$$ 450 266 163 608 449 154 324 348 330 205 254 383 145 239 357 152 90 325 175 269 200 33 110 48
3416D8Q7K06m43O9k28M0l6K94l42j4J48r2J43j65j68K64P9k13J21j55J4O2l45
$$ 48 135 341 -102 -33 -261 -221 -257 37 -305 -319 -171 -263 -120 -285 -453 -189 -110 -323 -202 -357 -343 -281 -626
3439f26M68J15k94J79j91Q5m4K69k1k1l51M52l12L23M5r3J75j53j1J50O6p1J40
$$ -626 -158 -43 -337 -158 -349 -264 -308 -39 -60 -81 -432 20 -292 31 76 -17 158 5 -6 144 210 139 279
3462B79j47J14R9k79K64l1k6l2p8J83O9k84R0J41j01lo0j21J48L8k11J63j88l2
$$ 279 132 246 345 66 330 299 273 241 163 346 415 131 221 362 261 258 198 77 225 263 52 215 27 -5
3486eJ25j10N5k45n3J78j24L06m03jL92j62l37J38n2k42K46j02N6k5J08j32M4
$$ -5 120 10 65 -180 -233 -55 -179 127 -276 -277 115 -47 -384 -246 -298 -540 -294 -396 -340 -365 -257 -389 -345
3509c45r9J12j60J33j33N4L65j3l6Q1k46K04pK8j45J47k72K80K01p5N7o5R8m3
$$ -345 -444 -332 -492 -359 -492 -438 -73 -86 -122 -41 -287 -83 -90 -62 -207 -60 -332 -52 149 74 131 66 164 121
3533A21j53L02J26j60K49l9l65M22j1k75J41j9Q9K66n11J70K64m59J03k19M02
$$ 121 -32 270 396 236 485 446 81 503 492 217 358 339 428 694 183 353 617 158 261 42 444
3554D44k58k6p0J58l00J97K24m53J70J3J05j59J5q8l0r8K13k68L4K0j16P7p8L
$$ 444 186 160 90 248 -52 145 369 -84 86 99 204 45 60 -28 -58 -156 57 -211 -177 -157 -273 -196 -274 -271
3578b71K7k9j20j5J03lmR0m1O9p4k63M3L02q0K73q5k64K43o6J8k02J53J58k57
$$ -271 -244 -273 -393 -408 -305 -308 -312 -222 -263 -194 -268 -531 -488 -186 -266 7 -78 -342 -99 -165 -147 -349 -196 -38 -295
3603b95L10k29L12j29J33J78oj19L55n43K20J0J00j37K1OkM7k0L7k89M46j26J94
$$ -295 15 -214 98 -31 102 280 274 155 510 -33 187 197 297 160 181 187 185 232 212 249 -40 406 280 474
3627D74k19mO0J86k39%j29rP3O7l52J73P1l40K63l01O3J11L3J05l67J39K80n16
$$ 474 255 251 311 497 258 258 129 120 193 260 -92 81 152 -188 75 -226 -163 -52 -19 86 -281 -142 138 -378
3651c78J05Q7o0j13L7J26K13l25J03J00j64J60p6N2j7p5K48j75m7J30K69j92j27
$$ -378 -273 -186 -246 -359 -322 -196 17 -308 -205 -105 -269 -109 -185 -133 -150 -225 23 -152 -199 -69 200 8 -119
3674a19K42j90O8n8L3K24l18L02J11k15J64o2q6k07M16j44P8o4j26K49lj6j08
$$ -119 123 -67 1 -57 -24 200 -118 184 295 80 244 182 96 -111 305 161 239 175 49 298 295 279 171
3697A71J26l23K53J36k5j22j10M8J3L0l10L85l06l1K35J17n85N18k74j20K29l20
$$ 171 297 -26 227 363 338 216 106 154 167 197 -113 272 -34 -65 170 287 -298 220 -54 -174 55 -265
3719b65L15K3l56J39m5k40L23j03lj86L83l92j17J30O9m2Q6J89k23r1K17k31K60
$$ -265 50 73 -283 -144 -189 -429 -106 -209 -212 -398 -15 -407 -524 -394 -325 -367 -281 -92 -315 -406 -189 -420 -160
3742a60J83l84J86L3j40R4J40j75J50j24K27q6J4R2j40L51n7k50M23m05J17K77
$$ -160 23 -361 -175 -142 -282 -188 -48 -223 -73 -197 30 -56 -42 50 -90 261 204 -46 377 -28 89 366
3764C66R5k41K24k59j23M53j48Q1k23m0K06k24k6J50q1K36l4j86J43l52J62K79
$$ 366 461 220 444 185 62 515 367 448 225 185 391 167 141 291 210 446 412 226 369 17 179 458
3786D58m00J5k30K97o0O4k5P0j84l37K75j3ko5m7J33j4j74J2j53K07R3k83J35
$$ 458 58 73 -157 140 80 144 119 189 5 -332 -57 -70 -72 -137 -184 -51 -65 -239 -227 -380 -173 -80 -363 -228
3810b28N0n9l4o2L2J41j96M2K00j40K95k85jKr5J79N9n0P5M23m66J28J50m91N45
$$ -228 -178 -237 -271 -333 -301 -160 -356 -314 -114 -254 41 -244 -245 -243 -338 -159 -100 -150 -75 348 -118 10 160 -331 214
3835B14j49J10M48m74m6P9j64K79k41P1L70o12J92J96K81j41j72j1pr9rK11j95
$$ 214 65 175 623 149 103 182 18 297 56 127 497 -115 77 273 554 413 241 230 223 124 115 326 131
3858A31L6J2l09K09m13J89K49k04j01K62l25j27J83J32J96n09L59J93m07M86o08
$$ 131 167 179 -130 79 -334 -145 104 -100 -201 61 -264 -391 -208 -76 120 -389 -30 163 -244 242 -366
3879c66k46N54r82J028K68m52n8n9k34K55PJ74J74J0j32O2m45K15J70l00K27K41
$$ -366 -612 -58 -1040 -12 256 -196 -254 -313 -547 -292 -285 -111 63 73 -59 3 -442 -227 -57 -357 -130 111
3901A11J95k81N3k62L75L8k38K05l65N89l66M7J51k63J70K42k50K90p6J1M6l81
$$ 111 306 25 78 -184 191 229 -9 196 -169 420 54 101 252 -11 159 401 151 441 365 376 422 41
3923D1J18j9N1J28K1k31j3KK7J13j32R6j34j29J25j05j98j3M71k79L06l55k12
$$ 41 159 140 191 319 340 109 96 98 125 238 106 202 68 -61 64 -41 -239 -252 219 -60 246 -109 -321
3946c21K47j18j4j17l7l4L08j50J16j62mP7n07P22k95l6q5L1j05L30j79K5Q4L9
$$ -321 -74 -192 -206 -323 -360 -394 -86 -236 -120 -282 -286 -209 -716 6 -289 -325 -410 -379 -484 -154 -333 -308 -224 -185
3970a85%p2N6J25j36K38J1j3R4n70O59k07O8J33k37L8K43m0J19k16kK0JP9n3j43
$$ -185 -185 -257 -201 -76 -212 26 37 24 118 -452 207 0 68 201 -36 2 245 205 324 108 106 126 127 206 153 10
3996A0J93L7o8O8j10N7K82k96J04N7k66J00R9n5j28k46K23Q8j0l14R8J45K2J4
$$ 10 203 240 172 240 130 187 469 173 277 334 68 168 267 212 84 -162 61 149 139 -175 -77 68 90 104
4020A04k06k02K82l7l73K75l4o4l5k31M62j87k66K21j23K03k01L1K72O2j61K09
$$ 104 -102 -304 -22 -59 -432 -157 -191 -255 -290 -521 -59 -246 -512 -291 -414 -211 -412 -381 -109 -47 -208 1
4042AL5j77K43j6j84j54P1K36k12k6K10j75LJ92o3J39j85M8K56o7m9M6o3J9J16
$$ 1 36 -141 102 86 -98 -252 -181 55 -157 -183 27 -148 -145 47 -16 123 -62 -14 242 175 126 172 109 128 244
4067B44J8P4l8j47Q3m6J51j99Q9M5pj46J81l08K01j29J07l1q1k56M65r5j98K29
$$ 244 262 336 298 151 234 188 339 140 229 274 267 121 302 -6 195 66 173 142 61 -195 270 175 -23 206
4091B06r4J0m5k28K07k99J46j27J31k38l8k9K19M3q3p5j8J32m7n5N6k17L00j98
$$ 206 112 122 77 -151 56 -243 -97 -224 -93 -331 -369 -398 -179 -136 -219 -294 -312 -180 -227 -282 -226 -443 -143 -341
4115c41l1J47l0J56K5O1j16j63K09K81l00R7J57j32n4j74J51k3K01Kl1K16m85
$$ -341 -372 -225 -255 -99 -74 -13 -129 -292 -83 198 -102 -5 152 20 -34 -208 -57 -80 121 123 92 308 -177
4138a77L79J06L5P7k91m5L17j81K4k91L03j24J59k7k74L39k02J66j25O8j98K71
$$ -177 202 308 343 420 129 84 401 220 244 -47 256 132 291 264 -10 329 127 293 168 236 38 309
4160C09J6j92M4l1m8r1K98l87j50K06r3j57r3K48L0l9j35R7j30J42Q3j93r2J76
$$ 309 325 133 177 146 98 7 305 -82 -232 -26 -119 -276 -369 -121 -91 -130 -265 -168 -298 -156 -73 -266 -358 -182
4184a82k12J87O9m2j08o1L47l66J55P7o4M6Qo8J66k30K1Q8J16j26M52j25j85N9
$$ -182 -394 -207 -138 -180 -288 -349 -2 -368 -213 -136 -200 -154 -146 -214 -48 -278 -257 -169 -53 -179 273 148 -37 22
4208B2NL09j79j2qlj32L12k06Q1n7p2K69k27m8R2K10j57K2o7K14J34k71J44k01
$$ 22 27 336 157 145 137 134 2 314 108 189 132 60 329 102 54 146 356 199 221 154 368 502 231 375 174
4233A74J27k35L8k6M2k96J66j05J84j22o5j25J44K64k17J75j99l1J47k04R0j21
$$ 174 301 66 104 78 120 -176 -10 -115 69 -53 -118 -243 -99 165 -52 123 -76 -107 40 -164 -74 -195
4255a95N70o27J56k17K41o50r1J022l07J71m36l28J74R40o50n55K1Q31L6j96l4
$$ -195 375 -252 -96 -313 -72 -722 -813 209 -98 73 -363 -691 -517 423 -227 -782 -761 70 106 -90 -124
4276a24J8p6K11k57M38Ml14lK57K64Q3o40j27L47J27M3K06m30M49m27K85k61J18
$$ -124 -106 -182 29 -228 210 214 -100 -103 154 418 501 -139 -266 81 208 251 457 27 476 49 334 73 191
4299A91k7L3p5R0N8J77j72j68K49l05l3J24O4k32j85K59j05j39JJ82m0l2k2L1
$$ 191 164 197 122 212 270 447 275 107 356 51 18 142 206 -26 -211 48 -57 -196 -195 -13 -53 -85 -107 -76
4323g6m9Q9k60k7J38l5P8rj92K2j18J96P2l41K85R3k46K01k38K32L7j74J60N2
$$ -76 -125 -36 -296 -323 -185 -220 -142 -151 -343 -321 -439 -243 -171 -512 -227 -134 -380 -179 -417 -185 -148 -322 -162 -110
4347a10j00L69j70k9K4j7J9K22k31K21%k63Q3K48l04L04k85R0K92l45J73o9J62
$$ -110 -210 159 -11 -40 -16 -33 -14 208 -23 198 198 -65 18 266 -38 266 -19 71 363 18 191 122 284
4370B84k4j20J50rl6j96K73k55N9K3J33k8K35n18L18j55j38J07k07L05m26L82
$$ 284 260 140 290 281 245 49 322 67 126 149 282 254 489 -29 289 134 -4 103 -104 201 -225 157
4392A57j44j74J94j34j27P6jj00Q9j00P7MN0k00K75k33K24O7k03p6Q4p1O2l5j25
$$ 157 13 -161 33 -101 -228 -152 -153 -253 -164 -264 -187 -183 -133 -333 -58 -291 -67 0 -203 -279 -195 -266 -204 -239 -364
4417c64mM47k34J73o8k23K70j23K3K03j61O6K29j97J67L35l71K07k85l1J54MK63
$$ -364 -368 79 -155 18 -50 -273 -3 -126 -103 100 -61 5 234 37 204 539 168 375 90 59 213 217 480
4440D80l20j76K59j0j88O7O6K9l0j40p8K15L7o4L19m21K48K72l71l95P5K68j50
$$ 480 160 -16 243 233 45 112 178 207 177 37 -41 174 211 147 466 45 293 565 194 -201 -126 142 -8
4463hQN8l1J40p84Q31l90m90O22l22L22p0M4m95M81O31o85k91L18Q8p2o83R23
$$ -8 0 58 27 167 -617 214 -176 -666 -44 -366 -44 -114 -70 -565 -84 547 -138 -429 -111 -23 -95 -778 145
4486A45p40K94l48R48n87l46P77l03j30k01Q36K26p31j00j48O38k59N0m96J60
$$ 145 -595 -301 -649 299 -288 -634 143 -160 -290 -491 345 571 -160 -260 -408 230 -29 21 -475 -315
4506c15J91J7K05K06j98p4j44N73k42j54O4J86RP5n0j06p5J88M6k46Q4p4M7N1
$$ -315 -124 -107 98 304 106 32 -112 461 219 65 129 315 324 399 349 243 168 356 402 156 240 166 213 264
4530B64p8J23j76Q0k57M51j50k9k66L81l42j05J52l9Kk4J6k6k39K02m0j23p2K39
$$ 264 186 309 133 213 -44 407 257 228 -38 343 1 -104 48 9 11 -13 3 -23 -262 -60 -100 -223 -295 -56
4554e6l19L85j03J14k58P1j4n2j22J98J19R2l00L48k81P8K3K6j82J91j66J20O8
$$ -56 -375 10 -93 21 -237 -166 -180 -232 -354 -156 -37 55 -245 103 -178 -100 -77 -51 -233 -42 -208 -88 -20
4577b0n5j41L70k04M8l7OP0M4j09K12jl3o7l7J99J0k2p3J81J10m01J81k27M10
$$ -20 -75 -216 154 -50 -2 -39 -33 37 81 -28 184 183 150 83 46 245 255 233 160 341 451 50 231 4 414
4602D14J33o33L71j89O4n1J0j87K25n2j38NQ7J18N5l23J93JQ1l13R3k19K66k29
$$ 414 547 -86 285 96 160 109 119 -68 157 105 -33 -28 59 177 232 -91 102 103 184 -129 -36 -255 11 -218
4626b18Q1L4j25J14j43J38j23K88l29K84k17P1r2L4J73j74J51P2k60K61j74Q4
$$ -218 -137 -103 -228 -114 -257 -119 -242 46 -283 1 -216 -145 -237 -203 -30 -204 -53 19 -241 20 -154 -70
4648g0j27J32p7P2K41l36L5K59k77L70j73J62k84M3R5J65m8q3j07Q4J54%j66J14
$$ -70 -197 -65 -142 -70 171 -165 -130 129 -148 222 49 211 -73 -30 65 230 182 99 -8 76 230 230 64 178
4672A78j89P3J69J26m87L66o0j12j24K18k05L19j03l20K10j63P9PK24k87L99l87
$$ 178 -11 62 231 357 -130 236 176 64 -60 158 -47 272 169 -151 59 -104 -25 -18 206 -81 318 -69
4694f9j24J55J31j87J29j92j39L33j13j58K01k90Q9J89j08j40J8J14K3j01J40
$$ -69 -193 -38 93 -94 35 -157 -296 37 -76 -234 -33 -323 -234 -45 -153 -293 -275 -161 -138 -239 -99
4715i9Nk9j36K90k56l6O5J61j77j72L31j8n9K5J96Nq6J62M4j59J34j86o3P0J11
$$ -99 -94 -123 -259 31 -225 -261 -196 -35 -212 -384 -53 -71 -130 -105 91 96 10 172 216 57 191 5 -58 12 123
4740A23n5R3J04k10K69l52J91J49k02O9R4Rl54K97p2O6k3N2k59N5K96m70M33j58
$$ 123 68 161 265 55 324 -28 163 312 110 179 273 282 -72 225 153 219 196 248 -11 44 340 -130 303 145
4764A45l05L49k20q4M1p9J60j47J98j51J26j4j12KK9n9J16j97LJ40j05j77J85
$$ 145 -160 189 -31 -115 -74 -153 7 -140 58 -93 33 19 -93 -91 -62 -121 -5 -202 -199 -59 -164 -341 -156
4787a56m4N3L4r9J67l3j3j65r3K77J15q8j11J84j14M5j60K73j71J44q0J28K12
$$ -156 -200 -147 -113 -212 -45 -78 -91 -256 -349 -72 43 -45 -156 28 -86 -41 -201 72 -99 45 -35 93 305
4810C05j26j60J4L3J74k40R5J64j59n1kK93k14r9k3R0J11J81j89rO8q0q8P9l36
$$ 305 179 19 33 66 240 0 95 259 100 49 47 340 126 27 4 94 205 386 197 188 256 176 88 167 -169
4835a69M21p4j97L40l08J62q0p9o5j7l29L12k04Q6Q3j2q3J82k54J56q3j62L53
$$ -169 252 178 -19 321 13 175 95 16 -49 -66 -395 -83 -287 -201 -118 -130 -213 -31 -285 -129 -212 -374 -21
4858b1p6k13K41o0j79O8j8J61Q6r2J2k12J68j65M72ok23K8P3j3J59J09m25M56
$$ -21 -97 -310 -69 -129 -308 -240 -258 -97 -11 -103 -91 -303 -135 -300 172 166 -57 -29 44 31 190 299 -126 330
4882C30k41q8k9M6Q1k01K23J79k39P5J46j39J94Mk46k8J51J04l1j96O1K3j63K35
$$ 330 89 1 -28 18 99 -102 121 300 61 136 282 143 337 341 95 67 218 322 291 95 156 179 16 251
4906B51j42o2K50n03J35K3N0j96K49K31k36J08l65J46j26L7J60r7k53K97O6o9
$$ 251 109 47 297 -206 -71 -48 2 -194 55 286 50 158 -207 -61 -187 -150 10 -87 -340 -43 23 -46
4928d6R7k35j86L95k66J05lJ33j01L1k46J00L4k12L56K5J86k63l48M90K22m8m10
$$ -46 51 -184 -370 25 -241 -136 -139 -6 -107 -76 -322 -222 -188 -400 -44 -19 167 -96 -444 46 268 220 -190
4951a90J63rkJ86m49K94K9jN4k31Q7J48j83Q8m7J01J34J43j10Q7l44K73j54L1
$$ -190 -27 -36 -38 148 -301 -7 22 21 75 -156 -69 79 -104 -16 -63 38 172 315 205 292 -52 221 67 98
4975I8J29j01k5J36P2l75J58k62O7L16n2o6P2Q3k43m1J33j92J7j96K46j71M35
$$ 98 227 126 101 237 309 -66 92 -170 -103 213 161 95 167 250 7 -34 99 -93 -76 -272 -26 -197 238
4998B38l29l92M33k03K84k05K32k20L9P2p5J08r7j37R8P5L3p2l59K63J30j19J82
$$ 238 -91 -483 -50 -253 31 -174 58 -162 -123 -51 -126 -18 -115 -252 -154 -79 -46 -118 -477 -214 -84 -203 -21
5021b1J1j84M4K80k74P8L95l23o3m0K70k09K14l21L00m8k29L42j05k8L05k24K37
$$ -21 -10 -194 -150 130 -144 -66 329 6 -57 -97 173 -36 178 -143 157 109 -120 222 117 89 394 170 407
5044D07l55K29k09J52k29Q7O8J5Q0o1k3J12p2l21M77k54p9j39J99J39l64K78l62
$$ 407 52 281 72 224 -5 82 150 165 245 184 161 273 201 -120 357 103 24 -115 84 223 -141 137 -225
5067b25O43m44J22l80M15k4m27P4m25L09L74q1L97l34k60M49j48Q0O8m44j036
$$ -225 418 -26 96 -284 131 107 -320 -246 -671 -362 12 -69 328 -6 -266 183 35 115 183 -261 -1297
5088a297K204j221j029P97L16k27N11J61j062P91o45K26Q95m75J57m04J90j11
$$ -1297 907 -314 -1343 -546 -230 -457 54 215 -847 -56 -701 -475 420 -55 102 -302 -112 -223
5106b23M25K6j88J99j67R6NQ2k0J1k82k3J73O6J04k15k02L19r2J17R3r3k71K50
$$ -223 202 228 40 239 72 168 173 255 235 246 -36 -59 114 180 284 69 -133 186 94 211 304 211 -60 190
5130A90k6l28L79j34j13J98k04Oj45L35l31K46j65J5j5q7J97J8k3k42J55k0k40
$$ 190 164 -164 215 81 -32 166 -38 -32 -177 158 -173 73 -92 -77 -92 -179 18 36 13 -229 -74 -94 -334
5153c34K14m4j34J36j28o9K07m6O0j13K23r7J11l71M98l39J39q4j87M24k44J72
$$ -334 -120 -164 -298 -162 -290 -359 -152 -198 -138 -251 -28 -125 -14 -385 113 -226 -87 -171 -358 66 -178 -6
5175fJ42j60k82L85M3J08j91r5pK02m78O04kl69p1K68K93j11l11l7M02j45J6l63
$$ -6 136 -24 -306 79 122 230 39 -56 -63 139 -339 265 263 -106 -177 91 384 273 -38 -75 327 182 198 -165
5199a65N99j41k77L29l13O95p07k0J93k53L41j73M54p80N68p62L48J98J04q1j54
$$ -165 434 293 16 345 32 727 20 0 193 -60 281 108 562 -218 350 -412 -64 134 238 157 3
5220Cj7P8m96K07j29N8k2M56m5n63L47q7j7n7J27n3J56p57J21Q41M9M20o32K52
$$ 3 -14 64 -432 -225 -354 -296 -318 138 93 -470 -123 -210 -227 -284 -157 -210 -54 -811 -690 151 200 620 -12 240
5244B40o39j09P62n65o5K68J7K4K03m53N54j26j37J56j63J09K3q8l5R8L23l21
$$ 240 -399 -508 254 -311 -376 -108 -91 -67 136 -317 237 111 -26 130 -33 76 99 11 -24 74 397 76
5266G6N3R8r9j49L9M38k64rK73q37L99k13M54j57k51N21n47L11k16Q3k18L30J0
$$ 76 129 227 128 -21 18 456 192 183 456 -381 18 -195 259 102 -149 372 -175 136 -80 3 -215 115 125
5289A25O5J44j74k31K89m36L00N6l98L99J85o34j06N42j06k19N00l8l44j48J31
$$ 125 190 334 160 -71 218 -218 82 138 -260 139 324 -310 -416 126 20 -199 301 263 -81 -229 -98
5310i8o1j04M8j45J29J1j55K90l4j7J62j35L41k94n0Jj68L45j00j19M11m03P6
$$ -98 -159 -263 -215 -360 -231 -220 -375 -85 -119 -136 26 -109 232 -62 -112 -111 -279 66 -34 -153 258 -145 -69
5333f9M2m9N27l29j34L50j59k75J35J56j47K15q0Kp5k02N13l13RO3j54R4J71k38
$$ -69 -27 -76 451 122 -12 338 179 -96 39 195 48 263 183 185 110 -92 421 108 117 180 26 120 291 53
5357E3J18k65L3K57k52O9O0J4l8k32k8N3K0j23L24j40n6j20J07J88n2k63K48k79
$$ 53 171 -94 -61 196 -56 13 73 87 49 -183 -211 -158 -138 -261 63 -77 -133 -253 -146 42 -10 -273 -25 -304
5381c04J01M2n1K29r7k05K73j30L7J47J26j49j12j18K9R3j76J69R4O9J64l51J2
$$ -304 -203 -161 -212 17 -80 -285 -12 -142 -105 42 168 19 -93 -211 -182 -89 -265 -96 -2 67 231 -120 -108
5404a08N2J10l00L08k26L92k90K51%k00R5J17q9K15j18j87NK07n2j65K24O4m12
$$ -108 -56 54 -246 62 -164 228 -62 189 189 -11 84 201 112 327 209 22 27 234 182 17 241 305 -107
5427a07L97j25o2J61l06l6M0Q9K5n0j98L25kmm28J64L9N9R8j17M1j75k4J61J0
$$ -107 290 165 103 264 -42 -78 -38 51 76 26 -172 153 151 147 -281 -117 -78 -19 79 -38 3 -172 -196 -35 -25
5452b5l25M54K7m4n7p2P7j45J36J31l95J97r6L33j25Pk36k2K35k13L25m64K39
$$ -25 -350 104 131 87 30 -42 35 -110 26 157 -238 -41 -137 196 71 78 -158 -180 55 -158 167 -297 -58
5475e8oJ19J37m8n4L2o1k97K33j42J46L0j50J96n5L25l28Q6qL9j84q3L65j04J46
$$ -58 -64 55 192 144 90 122 61 -236 -3 -145 1 31 -119 77 22 347 19 105 97 136 -48 -131 234 130 276
5500B76j19k49J60k1M0m7J82J59k72k7J74k41Mk6k20O4N1J2J02J72n29N75l08
$$ 276 157 -92 68 47 87 40 222 381 109 82 256 15 19 -7 -227 -163 -112 -100 2 174 -355 220 -88
5523h8J05j99M3p1L1M69l65j27L6J87q0J4j6j93J02j7K51n6J44l11J6P0k58K70
$$ -88 17 -182 -139 -210 -179 290 -75 -202 -166 21 -59 -45 -61 -254 -152 -169 82 26 170 -141 -125 -55 -313 -43
5547d3j17m6L22j98j7Q7J50j41k66K48P1o1Q5m7pj12N0K14N2N8q8m85K33M26k29
$$ -43 -160 -206 116 -82 -99 -12 138 -3 -269 -21 50 -11 74 27 20 -92 -42 172 224 282 194 -291 -58 368 139
5572A39J55l37K83L40n98j18K02J64j39k61J36J45j48K7Q3L0j7J40k63k3K42j26
$$ 139 294 -43 240 580 -18 -136 66 230 91 -170 -34 111 -37 -10 73 103 86 226 -37 -60 182 56
5594E6k88R1O9r4L97l23j17j37K56nj07J70j27K70k79k91M63Rn9n3j1J24p5J49
$$ 56 -232 -141 -72 -166 231 -92 -209 -346 -90 -95 -202 -32 -159 111 -168 -459 4 13 -46 -99 -110 14 -61 88
5618H8m02Q2P9q3J92N2r6K78l63J82j13K53p3J08j94Q1Nj09J09j18K35j7k36r5
$$ 88 -314 -232 -153 -236 -44 8 -88 190 -173 9 -104 149 76 184 -10 71 76 -33 76 -42 193 176 -60 -155
5642a55K79o3J83m36K29K24k11L01k8L7j01k94P2K95l92J24J42j36L3L1k34O7
$$ -155 124 61 244 -192 37 261 50 351 323 360 259 -35 37 332 -60 64 206 70 103 134 -100 -33
5664c3l0O7J45l5m3l03M17j21k22JJ47J52l9k01Mj28q1L32l30K61j81pQ7o7RJ15
$$ -33 -63 4 149 114 71 -232 185 64 -158 -157 -10 142 103 -98 -94 -222 -303 29 -301 -40 -221 -228 -141 -208 -199 -84
5690h4k65M20J44k27j55N3N9J77j95J16k7J01o7Pn9k6j08K43Q1j42j18j45J29
$$ -84 -349 71 215 -12 -167 -114 -55 122 -73 43 16 117 50 57 -2 -28 -136 107 188 46 -72 -217 -88
5713h8K13N7J07k39K01j40%M2P1p4k4K8l2J78j16j58j80R1L16j28j54R1k05N8
$$ -88 125 182 289 50 251 111 111 153 224 150 126 154 122 300 184 26 -154 -63 253 125 -29 62 -143 -85
5737h5j00L08r0o0J04j2J07l5l10M3J41N2m22K06J07K5j4j1n4J66l07p2K89l51
$$ -85 -185 123 33 -27 77 65 172 137 -173 -130 11 63 -359 -153 -46 -21 -35 -46 -100 66 -241 -313 -24 -375
5761c75K51j95l7L06M0j61O9j56O6J12Jo1p9R5j42K46r4K30j03j14J59Q9j71J96
$$ -375 -124 -319 -356 -50 -10 -171 -102 -258 -192 -80 -79 -140 -219 -124 -266 -20 -114 116 13 -101 58 147 -24 172
5785A72p6j08R8J22J33m85M8O5L43k86MK61j85J35P7j49j59J54k60J92j9K05k12
$$ 172 96 -12 86 208 341 -144 -96 -31 312 26 30 291 106 241 318 169 10 164 -96 96 77 282 70
5808G0M3o0N2k1n3j96N05j48l24J21J40j92N0J03m1Ok57J53PK11k77k02K04M4
$$ 70 113 53 105 84 31 -165 340 192 -132 -11 129 -63 -13 90 49 55 -202 -49 -42 169 -108 -310 -106 -62
5832f2N7j22M9n5o3M9j26J70j50J02L72o92N0M72k56J85mK4j18L20o68P13o4l29
$$ -62 -5 -127 -78 -133 -196 -147 -273 -103 -253 -151 221 -471 -421 51 -205 -20 -24 0 -118 202 -466 247 183 -146
5856a46k21L87L83o93O84o96P20k30kL99m29r57P57L66n33O09q35P52N05p66M14
$$ -146 -367 20 403 -290 394 -302 418 188 186 585 156 -801 -44 322 -211 398 -437 315 820 54 468
5877D68k37j61q4J17k6l59N28k50q8O4J42J93k46j18k15m5M13J20m38K89K0k61
$$ 468 231 70 -14 103 77 -282 246 -4 -92 -28 114 307 61 -57 -272 -317 96 216 -222 67 87 -174
5899a74N1P8J11o4J8o9j20L2m8J53L6k18L61k22J83l23P6K8K8m3R9j28QO3K37
$$ -174 -123 -45 66 2 20 -49 -169 -137 -185 -32 4 -214 147 -75 108 -215 -139 -111 -83 -126 -27 -155 -147 -84 153
5924A53j29RK4qo7N3P3l1J6o3R5R8j12N1n1K0r0K47j73p8j0K87r2J8q8mM9j75
$$ 153 24 33 57 49 -18 35 108 77 93 30 125 223 111 162 111 131 41 288 115 37 27 314 222 240 152 148 197 22
5952B2L49n4k48j21p6J65OK49k50M7m50K63J64r4j33L18n3m01L09k26J08J37j18
$$ 22 371 317 69 -52 -128 37 43 292 42 89 -361 -98 66 -28 -161 157 104 -297 12 -214 -106 31 -87
5975h7K68k55O1n5p9J08k14N5J07op8j29J29J32j11r6J56J22j28j03P3m1k3K17
$$ -87 181 -74 -13 -68 -147 -39 -253 -198 -91 -97 -175 -304 -175 -43 -154 -250 -94 28 -100 -203 -130 -171 -194 23
5999B3j1N6p1k2q8J61j01lR2l3J05j15pK32j41r8J24j29j73M39k17M07m06M5j00
$$ 23 12 68 -3 -25 -113 48 -53 -56 36 3 108 -7 -14 218 77 -21 103 -26 -199 240 23 430 24 69 -31
6024c1K41ok45M01j13n93M79j26J58j77j54J29M6p7P8j54K89j30p8J5J59j8j88
$$ -31 210 204 -41 360 247 -346 133 7 165 -12 -166 -37 9 -68 10 -144 145 15 -63 -48 111 93 -95
6047i5JJ33O3k60L71j26N2n16N56k63j31J17J7J01J40k32k5R5j63J03q8K02j29
$$ -95 -94 39 102 -158 213 87 139 -377 179 -84 -215 -98 -81 20 160 -72 -97 -2 -165 -62 -150 52 -77
6070g7K16j03P8k93j55J11K42k05L00j26J20l15N31o4k37J3j03K1o3J27j5J88
$$ -77 139 36 114 -179 -334 -223 19 -186 114 -12 108 -207 324 260 23 36 -67 -46 -109 18 3 191
6092A91p6Q8q4J0N1P7k57K95k47j38N43k68l60mM60P2j7m35K13P9k57M77k03j72
$$ 191 115 203 119 129 180 257 0 295 48 -90 453 185 -175 -179 281 353 336 -99 114 193 -64 413 210 38
6116C8j11l1OL14l73K02j44J15j60J62m9j68J84j84K80p0j31J83j60R7m05K92
$$ 38 -73 -104 -98 216 -157 45 -99 16 -144 18 -31 -199 -15 -199 81 11 -120 63 -97 0 -405 -113
6138a13J26k7n4r1oJ05n2k03M27m02K44K1J3J33j10k3M0k06K12J65l02J0J98j64
$$ -113 13 -14 -68 -159 -165 -60 -112 -315 112 -290 -46 -25 -12 121 11 -12 28 -178 34 199 -103 -93 105 -59
6162e9l8L47k70rJ23O3m1j48L02j08j60L91l97L81j38j06K04l92J08J37J2n5M5
$$ -59 -97 250 -20 -29 94 157 116 -32 270 162 2 393 -4 377 239 133 337 -55 53 190 202 147 192
6185A92k61J86k97K08J41Oj99J10j57P9l81J7L01p6J08l45L07qj28J93j26J03
$$ 192 -69 117 -180 28 169 175 -24 86 -71 8 -373 -356 -55 -131 -23 -368 -61 -69 -197 -4 -130 -27
6207b7q7O1o7j21K40j63J87p7j2Nk5K30m21L41j49K53l43L14l21O2J59q7J30j32
$$ -27 -114 -53 -120 -241 -1 -164 23 -54 -66 -61 -86 144 -277 64 -85 168 -175 139 -182 -120 39 -48 82 -50
6231e0K10J56j72l58K44J60j14J72j88J04L6rj85J11j55L98j90P4o9j34K7j7O8
$$ -50 160 316 144 -214 30 190 76 248 60 164 200 191 6 117 -38 360 170 244 175 41 68 51 119
6254A19k74l9J43K91l32j4J75k14M65j48l41M4K38j27J64k65K24J7k96m6K14j06
$$ 119 -155 -194 -51 240 -92 -106 69 -145 320 172 -169 -125 113 -14 150 -115 109 126 -170 -216 -2 -108
6276a08m4J85O4k17K29r2l9J17qm03K77P6M5j71j3j78K34M7j13n6L64k88n4K17
$$ -108 -152 33 97 -120 109 17 -22 95 87 -316 -39 37 82 -89 -102 -280 -46 1 -112 -168 196 -92 -146 71
6300G1l51M25l42K21k2m1L9Q6k8j23R8J85j19L3j31J50o7J09q2L3N6j32K3j70
$$ 71 -280 145 -197 24 2 -39 0 86 58 -65 33 218 99 132 1 151 84 193 111 144 200 68 91 -79
6324g9J91O5o8k02K28k71J86P1j79j8K41k00o5M49j74k00k27M2J08K20l15L70
$$ -79 112 177 109 -93 135 -136 50 121 -58 -76 165 -35 -100 349 175 -25 -252 -210 -102 118 -197 173
6346A73o8j97j31J88K33l29p6J99k38J71J42l07K57j09J00ml55J35O8K0k1n8K20
$$ 173 105 -92 -223 -35 198 -131 -207 -8 -246 -75 67 -240 17 -92 8 4 -351 -216 -148 -128 -149 -207 13
6369A3j8j12J40q7j31Q0K02o1r0mJ30J57k03J66o8K2k82K59j48J50M5r1J67j74
$$ 13 -5 -117 23 -64 -195 -115 87 26 -64 -68 62 219 16 182 114 136 -146 113 -35 115 160 69 236 62
6393F2m1k9K26k9k9o9N8j03K85j85k41L42l94J16k16L98r4n4M09p27L40k28J08
$$ 62 21 -8 218 189 160 91 149 46 331 146 -95 247 -147 -31 -247 151 57 3 412 -315 25 -203 -95
6416i5J95k82L20k15p4J26L5oj01P1j65J88j51k3j75J71k16K42J8L0j24NL09j72
$$ -95 100 -182 138 -77 -151 -25 10 4 -97 -26 -191 -3 -154 -177 -352 -181 -397 -155 -137 -107 -231 -226 83 -89
6440h9o0J75j33J04q7R7j02n8NK98j15K5O4k66L30m8p1L3k50J88k18L65k15k3
$$ -89 -149 26 -107 -3 -90 7 -95 -153 -148 150 35 60 124 -142 188 140 69 102 -148 40 -178 187 -28 -51
6464e1J93k2RJ33k06Q6J12j80j06J21N5Q7j10j84K00J03l47O1K8o7K17P2j94N0
$$ -51 142 120 129 262 56 142 254 74 -32 89 144 231 121 -63 137 240 -107 -46 -18 -85 132 204 10 60
6488F0k00lp4K42j21K77k23r5L0N2q5r4M21k66j09L84M9l74q9J86j1J1M3j02J05
$$ 60 -140 -143 -217 25 -96 181 -42 -137 -107 -55 -140 -234 187 -79 -188 196 245 -129 -218 -32 -43 -32 11 -91 14
6513A4j03M4j37P4K67l64j9J80l12R5K9K83l6Rj30K40N0Rk05nK81l58J45l5K35
$$ 14 -89 -45 -182 -108 159 -205 -224 -44 -356 -261 -232 51 15 24 -106 134 184 193 -12 -17 264 -94 51 16 251
6538B51l02j06J1L89q1Pr3Q3N0l02M0K7j1Q2K65l16J36j56J65r0M7M6O2o7m57
$$ 251 -51 -157 -146 243 162 169 76 159 209 -93 -53 -26 -37 45 310 -6 130 -26 139 49 96 142 204 137 -320
6563c20M75M2m44L23j34p0J07j22R5J05Po5J88p8j31j8r8M8K7k24K83k23J41j35
$$ -320 155 197 -247 76 -58 -128 -21 -143 -48 57 64 -1 187 109 -22 -40 -138 -90 -63 -287 -4 -227 -86 -221
6587b21J90j18K20j29o4k29K47J79r1J36n8k01J3J62k0K9n3J10j34J23k35K14
$$ -221 -31 -149 71 -58 -122 -351 -104 75 -16 120 62 -139 -126 36 16 45 -8 102 -32 91 -144 70
6609G0k84L40l31j7J45N4J91K0j05j15L29j49j25J13k27K12q4j37J56j66J98j92
$$ 70 -214 126 -205 -222 -77 -23 168 188 83 -32 297 148 23 136 -91 121 37 -100 56 -110 88 -104
6631a04L7J96k30K21J25k74M4K31m67QK72k74J72J55j04r1J96k22J29j18K0O5
$$ -104 -67 129 -101 120 245 -29 15 246 -221 -213 59 -215 -43 112 8 -83 113 -109 20 -98 -78 -13
6653a3l36L19j55N0K59k47m6J3p9L28p9j79J12J39j96L18j45J08k46M0Kj72L39
$$ -13 -349 -30 -185 -135 124 -123 -169 -156 -235 93 14 -165 -53 86 -110 208 63 171 -75 -35 -33 -205 134
6676A34k19K37k16J75K7q2K5N4j30RJ2J9M7j44K37k45J54J35j89l1j05J70n1l6
$$ 134 -85 152 -64 111 138 56 81 135 5 14 26 45 92 -52 185 -60 94 229 40 9 -96 74 23 -13
6700a3N2R5J3k22Q6K75l55K6K17l1J53l58rJ4K32j99J78k59J51j80L25m1k60j7
$$ -13 39 134 147 -75 11 286 -69 -43 174 143 296 -62 -71 -57 175 -24 154 -105 46 -134 191 150 -110 -127
6724a27p9l5J37J05j47J47k18K41j79K7J03J38m15J76j66K94J4j26K99o3k62J60
$$ -127 -206 -241 -104 1 -146 1 -217 24 -155 -128 -25 113 -302 -126 -292 2 16 -110 189 126 -136 24
6746B4r3J09N0j46j83J79J1J5J72J86l27n5K55j84M7l0j01j1R9k2J01K13j32J78
$$ 24 -69 40 90 -56 -239 -60 -49 -34 138 324 -3 -58 197 13 60 30 -71 -82 17 -5 96 309 177 355
6770C55p2l32K03m1J6k22K4K45J21j87J6j50J59j82J08j1n7J6J27m0j60L3k0p2
$$ 355 283 -49 154 113 129 -93 -69 176 297 110 126 -24 135 -47 61 50 -7 9 136 96 -64 -31 -51 -123
6794a23O4J77p4k55N85j051O40j14J57m67O54j48J79m40q7N63m86L69M9k54j89
$$ -123 -59 118 44 -211 374 -677 -37 -151 6 -461 193 45 224 -216 -303 260 -226 143 192 -62 -251
6815b51j1J82n4j33N63j85l25o6K88N57o69K46k16K25K54j28k1j85K15K13n35
$$ -251 -262 -80 -134 -267 296 111 -214 -280 8 565 -104 142 -74 151 405 277 256 71 286 499 -36
6836c6k61K52M77l07m38O11k8m47M94o4o48k07N23j17O86n2o58P79p86K91k8K34
$$ -36 -297 -45 432 125 -313 298 270 -177 317 253 -395 -602 -79 -196 490 438 -220 559 -227 64 36 270
6858B70m61L30l5Qj00J62k22L1N2j86r4M25j40P6j60q5P7J02L5j84K12k3o1j0
$$ 270 -191 139 104 112 12 174 -48 -17 35 -151 -245 180 40 116 -44 -129 -52 50 85 -99 113 90 29 19
6882A9q1j27m5L76j99m2R5Q6M9k24m2J56r9R9k5J52k96j88M66j22m84N64K09j78
$$ 19 -62 -189 -234 142 -57 -99 -4 82 131 -93 -135 21 -78 21 -4 148 -148 -336 130 8 -476 88 297 119
6906A19m27K31j85O39k00P2j05o5J43o07L45l02J05M56o2k62m8J12M63p06O64
$$ 119 -308 -77 -262 377 177 249 144 79 222 -385 -40 -342 -237 219 157 -105 -153 -41 422 -284 380
6927C80p24L24L29k25K19o77L33q1j6N0J73J34p1l45r5J32J19J25j19J33l41N5
$$ 380 -344 -20 309 84 303 -374 -41 -122 -138 -88 85 219 148 -197 -292 -160 -41 84 -35 98 -243 -188
6949a88J15L7j2l04K23J3q0J36J39j24j73L65j09j95j4L11M2k76R5o6J6L1j77
$$ -188 -73 -36 -48 -352 -129 -116 -196 -60 79 -45 -218 147 38 -157 -171 140 182 -94 1 -65 -49 -18 -195
6972a95L00m1j49nPq1l6K19j9K27k1j00P8J07k82Qj7K05o1J02m48L83q9j27P1
$$ -195 105 64 -85 -90 -83 -164 -200 19 0 227 206 106 184 291 9 17 0 205 144 246 -202 181 92 -35 36
6997C6j38M95m87K85l8l0j85K04p1K65k27r9J29k09n8q3N5J78l06J4L93j68Nn8
$$ 36 -102 393 -94 191 153 123 -62 142 71 336 109 10 139 -70 -128 -211 -156 22 -284 -270 123 -45 -40 -98
7021i8M6J83j46P3j57J6K18k36l5K03q2m0Q5m6j40J8J95j55J65k54pK92j22p4
$$ -98 -52 131 -15 58 -99 -83 135 -101 -136 67 -15 -55 30 -16 -156 -138 57 -98 67 -187 -194 98 -24 -98
7045i8Lk24J90J93p7q2K8M9j77J01J35P8L8j36l6pK62k74k7K32l8M6m3Q6p8r7
$$ -98 -95 -319 -129 64 -13 -95 -67 -18 -195 -94 41 119 157 21 -15 -22 240 -34 -61 171 133 179 136 222 144 47
7071D7k4M12k72N8j56M2m9l0j95L40nj00k36M5J20J01j24L7j04J96O0j14n8L7
$$ 47 23 435 163 221 65 107 58 28 -167 173 168 68 -168 -123 -3 98 -26 11 -93 103 163 49 -9 28
7095B8J74k91j75J03R4J36j0j64J25k9k06J36R7j88M7P5Q3q1R6o3j92L2J21J91
$$ 28 202 -89 -264 -161 -67 69 59 -105 20 -9 -215 -79 18 -170 -123 -48 35 -46 50 -13 -205 -173 -52 139
7119A39k79K79j20j53lJ92n5l05J84O0J76l0l00L94j14J2m4j83L63k40K29j73
$$ 139 -140 139 19 -134 -137 55 0 -305 -121 -61 115 85 -215 179 65 77 33 -150 213 -27 202 29
7141B9j01Q0Q5j12J71j29J11j64O6K75k14k48K24q4N0K3N3l05J72QK36k42Q2n5
$$ 29 -72 8 93 -19 152 23 134 -30 36 311 97 -151 73 -11 39 62 115 -190 -18 -10 226 -16 66 11
7165A1M2J39kj12J20k11k19M00l61j7L52l10L47l67J27K27l23J99N5jj76K79k15
$$ 11 53 192 190 78 198 -13 -232 168 -193 -210 142 -168 179 -188 -61 166 -157 42 97 96 -80 199 -16
7188a6r4J54R4k4k20J35r9j0nJ14k3R9l6k97JL32j68J07L3j70K00j14l24M25k74
$$ -16 -110 44 138 114 -106 29 -70 -80 -85 29 6 105 69 -228 -227 105 -63 44 77 -93 107 -7 -331 94 -180
7213a80L13r1m2R3l63L49j53J34J39j2L1l6O2j14j0j80K31j29k3r9J93n1l3K2
$$ -180 133 42 0 93 -270 79 -74 60 199 187 218 182 244 130 120 -60 171 42 19 -80 113 62 29 51
7237E1J86l22K5J2J69M3j05o9J00J72k65j28o94M85M10p2J14m7k17o8n9L00r2
$$ 51 237 -85 -60 -48 121 164 59 -10 90 262 -3 -131 -825 -340 70 -2 112 65 -152 -220 -279 21 -71
7260g1j84L29l55K67K45k75N2P5j24j90J10J39p9m0N9K3l4K17j74Q3J84j26k73
$$ -71 -255 74 -281 -14 231 -44 8 83 -41 -231 -121 18 -61 -101 -42 -19 -53 164 -10 73 257 131 -142
7283a42J76J59j8j22m6J62J19j17O7k16l8J05j92L04j14j0q9J59r3j65L14Q3o2
$$ -142 34 193 175 53 7 169 288 171 238 22 -16 89 -103 201 87 77 -12 147 54 -111 203 286 224
7306B24l72K90j29NJ47j44J13p1j70K00n3j88L63j86p4m3K17m34M06l7j70L68
$$ 224 -148 142 13 18 165 21 134 63 -107 93 40 -148 215 29 -45 -88 129 -305 101 64 -106 262
7328B62J23o05j54M39m2K25k0p1L12r80J95k02M01p1n86N00l26K13L76m1p00N51
$$ 262 385 -220 -374 65 23 248 228 157 469 -511 -316 -518 -117 -188 -774 -274 -600 -387 -11 -52 -752 -201
7350b01P37l79K59l3k60k54j51O2M82j24k78J80K17l85K96l9lj70J97j08K66k94
$$ -201 536 157 416 383 123 -131 -282 -220 262 138 -140 40 257 -128 168 129 126 -44 153 45 311 17
7372A7M3J55k05Q1L20l14N5L7N0l50p1J05R1K63j53k4oj35l7K57j79J34l97L03
$$ 17 60 215 10 91 411 97 152 189 239 -111 -182 -77 14 277 124 100 94 -41 -78 179 0 134 -263 40
7396D0q1J48m00L36J45k9k41j55K40j69J57k40L73k73j01L39j64j5J42j18j65
$$ 40 -41 107 -293 43 188 159 -82 -237 3 -166 -9 -249 124 -149 -250 89 -75 -90 52 -66 -231
7417b31P4m1L33j48l6N7r9J24J98k04l7r2J92p8O6r2L58n01K44K00k49j3k1P5
$$ -231 -157 -198 135 -13 -49 8 -91 33 231 27 -10 -102 90 12 78 -14 344 -157 87 287 38 25 4 79
7441G9p9K96n31L03%n1P2J43n55L75n5J40K9N9l84L01M3r2k50K65J01l47L28l8
$$ 79 0 296 -235 68 68 17 89 232 -323 52 -3 137 166 225 -159 142 185 93 -157 108 209 -138 190 152
7465A52k90N9j37J82K2K0j9k91J63j13K14%o8KL1K00j40k06K57j82J91k47L30
$$ 152 -138 -79 -216 -34 -12 8 -11 -302 -139 -252 -38 -38 -106 -104 -73 127 -13 -219 38 -144 47 -200 130
7488A30j16n7k14K87m7k03K52OP7k03r0K68o5k41J97K4KN6K17j02j68L1J56k79
$$ 130 14 -43 -257 30 -17 -220 32 38 115 -88 -178 90 25 -216 -19 5 7 63 280 178 10 41 197 -82
7512h2j17J05r6K14K7L2J31l17R4No8J88Po5J03Jj54r1J93J0j86M00k52J53j51
$$ -82 -199 -94 -190 24 51 83 214 -103 -9 -4 -72 116 123 58 161 162 8 -83 110 120 -66 334 82 235 84
7537H4j67J01n3l6L59k33k1J7j08M7j32O2J45k65K49j57o5K55o6j05N1J64q9k10
$$ 84 -83 18 -35 -71 288 55 34 51 -57 -10 -142 -80 65 -200 49 -108 -173 82 16 -89 -38 126 37 -173
7561a73J1O2Q1O8L1R0j43p1m2j67J99kK5k5J3R7J19k97J20q3O9Pk4J10Q1l8R3
$$ -173 -162 -100 -19 49 80 170 27 -44 -86 -253 -54 -56 -31 -56 -43 54 173 -124 -4 -87 -18 -11 -35 75 156 118 211
7588B11k59k19N05p2k83J25K1K72j93K2n3J24l49Q7J34j22k0J91K9K97l43Oj1
$$ 211 -48 -267 238 166 -117 8 29 301 108 130 77 201 -148 -61 73 -49 -69 122 151 448 105 111 100
7611A00j43k7K57k07R5l69K85P3p6l6j49J72R7k03j1K68p6j79J3Q8L3r3K23j45
$$ 100 -43 -70 187 -20 75 -294 -9 64 -12 -48 -197 -25 72 -131 -142 126 50 -129 -116 -28 5 -88 135 -10
7635a0j40O2P7r0J83j60%Qj28K05K0N5j27J5j94k2L72n4l21J95m3Lj01L98m14
$$ -10 -150 -88 -11 -101 82 -78 -78 -70 -198 7 27 82 -45 -30 -224 -246 126 72 -249 -54 -97 -94 -195 203 -211
7660b11K02o0Qk2K90k81N2K90k50N3J32J14j39j0k07J31J86K5n13J26L29l29J6
$$ -211 -9 -69 -61 -83 207 -74 -22 268 18 71 203 317 178 168 -39 92 278 303 -210 -84 245 -84 -68
7683f8K68k61j07J37r9K03k80J30rq3L49k77K5J34n0j50m3q2L62q0j8j48J60J20
$$ -68 200 -61 -168 -31 -130 73 -207 -77 -86 -169 180 -97 -72 62 12 -138 -181 -263 99 19 1 -147 13 133
7707A33j28l07J13p2J31n3r4L59N6l47K17k9N9J74K0l3r5P0j31MJ35k09J08o5
$$ 133 5 -302 -189 -261 -130 -183 -277 82 138 -209 8 -21 38 212 232 199 104 174 43 47 182 -27 81 16
7731A6M2K47j54j42j83K31r3J11R9k0o1j42K8N5r4q4K85k37K41j65K83l84K42
$$ 16 58 305 151 9 -174 57 -36 75 174 154 93 -49 -21 34 -60 -144 141 -96 145 -20 263 -121 121
7754A21N2j90j46L47o1J79j50k35K16p0L8j6j54P4j28m7J82oj17J42Q4j23k61
$$ 121 173 -17 -163 184 123 302 152 -83 133 63 101 85 -69 5 -123 -170 12 6 -111 31 115 -8 -269
7777b69J84L58k13NK16k5k82J39n19L50k27J91R9J24q4k40J19O6l1J4n8l0K93
$$ -269 -85 273 60 65 281 256 -26 113 -406 -56 -283 -92 7 131 47 -193 -74 -8 -39 -25 -83 -113 180
7800A80Lm4j25K7R0j51m1J85j34K11k30J29q8N7nj63J47n5m9L24l25J38k5M3Q6
$$ 180 183 139 14 41 131 -20 -61 124 -10 201 -29 100 12 69 64 -99 48 -7 -56 268 -57 81 56 99 185
7825A85j45l5k7Q2N0k74J54O1j03L39k36K28k96j7K7P7p5k06J09m1J05K5M6P3
$$ 185 40 5 -22 60 110 -164 -10 51 -52 287 51 279 -17 -34 -7 70 -5 -211 -102 -143 -38 -13 33 106
7849A06k38J27J3q7K5q9J28j2K7k3m1n6J81r1J4p8K07j39m7j9JJ39J46m64M07
$$ 106 -132 -5 8 -79 -54 -143 -15 -27 0 -23 -64 -120 61 -30 -16 -94 113 -26 -73 -92 -91 48 194 -270 137
7874A37j65J08j4Q4n2j15k94L70p5M1O4J82k34j19K36j00M2QP7k17O8n1J6K21
$$ 137 -28 80 66 150 98 -17 -311 59 -16 25 89 271 37 -82 154 54 96 104 181 -36 32 -19 -3 218
7898B18L1k89K29j67m6l8k5J70M7mN6l05P1J30m01L93N4j44J01J5j04r8J64o5
$$ 218 249 -40 189 22 -24 -62 -87 83 130 126 182 -123 -52 78 -323 70 124 -20 81 96 -8 -106 58 -7
7922gq7J27kO6r0k8r4R1l8M5J79j60N6j55J3K04l15K38j47P9Pk46J83N1q4J81
$$ -7 -94 33 31 97 7 -21 -115 -24 -62 -17 162 2 58 -97 -84 120 -195 43 -104 -25 -18 -264 -81 -30 -114 67
7948F7j67LK82k41K32m51K70J9k5j02j70M00j58K81Lk35%O8k17J36J07j38N1j02
$$ 67 -100 -97 185 -56 176 -275 -5 14 -11 -113 -283 117 -41 240 243 8 8 76 -141 -5 102 -36 15 -87
7972h7J49O3j12K23j94M9j95L5K29j97J03m0O7j5j6o5J02J18j38k56K57K06m91
$$ -87 62 125 13 236 42 91 -104 -69 160 -37 66 26 93 78 62 -3 99 217 79 -177 80 286 -205
7995b05MJ38k27K82p5J15j77K19N1k93Q3k8J45l6K26n30K42j86K18l1j06J21J02
$$ -205 -201 -63 -290 -8 -83 32 -145 74 125 -168 -85 -113 32 -4 222 -308 -66 -252 -34 -65 -171 -50 52
8018E2k97L56k63J93J15jj67j65L00l83J21P6K78k39m7P0NR3K14l32j69L42J2
$$ 52 -245 111 -152 41 156 155 -12 -177 123 -260 -139 -63 215 -24 -71 -1 4 97 311 -21 -190 152 164
8041A64k34K72j15k17K83l25K47N4j3J55j01j73O2j5l1LM1k90P3K83j87j53K87
$$ 164 -70 202 87 -130 153 -172 75 129 116 271 170 -3 59 44 13 16 57 -233 -160 123 -64 -217 70
8064G0O1j54j14J82J06j03j22o2P8K3J36O8j25j61J25l85K65J55L2j67J23o9J4
$$ 70 131 -23 -137 45 151 48 -74 -136 -58 -35 101 169 44 -117 8 -377 -112 43 75 -92 31 -38 -24
8087b4Mr1Q8o1j13j9J70j27K45n4n0k17M13k75r7J50L0m2J11j59K69j24Q9j59
$$ -24 -20 -111 -23 -84 -197 -216 -46 -173 72 18 -32 -249 164 -111 -208 -58 -28 -70 41 -118 151 27 116 -43
8111d3R4m9q3j02J35Q3m2j50K83l9P3Q5l44J71K20n37J35L6p6O9J11Q1Oj88J26
$$ -43 51 2 -81 -183 -48 35 -7 -157 126 87 160 245 -99 72 292 -245 -110 -74 -150 -81 30 111 117 -71 55
8136E5j67K47J07k96k54M34o6J98j45j15K50j94j67L4K08P0l27p3K04r0N2n8K68
$$ 55 -112 135 242 -54 -308 126 60 258 113 -2 248 54 -113 -79 129 199 -128 -201 3 -87 -35 -93 175
8159A75l05l9K66j55k65K32j76J75L08m85J58j15K55Q9J56j30l44J97K71k74r5
$$ 175 -130 -169 97 -58 -323 -91 -267 -92 216 -269 -111 -226 29 118 274 144 -200 -3 268 -6 -101
8180a01J39n2M7k2Nk05J70K17k79R4J35
$$ -101 38 -14 33 11 16 -189 -19 198 -81 13 148
8191A48
$$ Imaginary data points
##PAGE= N=2
##DATA TABLE= (X++(I..I)), XYDATA
0@%%%%%%%%qJ6j6J6k4L2m0M8n6P2q8J12j36J60j92K24k64L10l58M13m77N47o24
$$ 0 0 0 0 0 0 0 0 0 -8 8 -8 8 -16 16 -24 24 -32 40 -48 64 -72 88 -104 120 -144 166 -192 221 -256 291 -333
31c33P11q07R14j034J166j308J464j636J825k033K261k508K775l068L389l740
$$ -333 378 -429 485 -549 617 -691 773 -863 962 -1071 1190 -1318 1457 -1611 1778 -1962
47a962M124m544N004n510O070o690P380q152R021j0006J1137j2452J3999j5844
$$ -1962 2162 -2382 2622 -2888 3182 -3508 3872 -4280 4741 -5265 5872 -6580 7419 -8425
61h425J8095k0916K4561k9469L6453m7215O6006j07640L47282r2166n29173P02864
$$ -8425 9670 -11246 13315 -16154 20299 -26916 39090 -68550 278732 186566 -342607 360257
73C60257l57818j95286M71801j99646j74289K62410o8262j29897M8265R6337j14436
$$ 360257 2439 -192847 278954 79308 -94981 167429 99167 -30730 17535 113872 -564
84e64O5491J02914j92142J6836Q9388o7696M0161K82L0027r8999J5025J30428
$$ -564 64927 167841 -24301 -7465 81923 14227 54388 54670 84697 -14302 723 131151
96A31151k11330O6812K11178k84386P6412J88742l17430Q6246K34581k47677P248
$$ 131151 -80179 -13367 197811 -86575 -10163 178579 -138851 -52605 181976 -65701 -58453
107e8453K11815k16697o6625K81153j92108p9659K73279k13342l5397J99558k01070
$$ -58453 153362 -63335 -129960 151193 -40915 -120574 152705 -60637 -96034 103524 -97546
118i7546M0537J25809j36849P0233j4216o9859Q8838o1929M5298K2540j03167
$$ -97546 -57009 68800 -68049 2184 -12032 -81891 6947 -54982 -9684 12856 -90311
129i0311R1723j4117p6394R3757j6121o6182Q5390o012r0263N8565L8325p4931
$$ -90311 1412 -12705 -89099 4658 -11463 -77645 7745 1733 -88530 -29965 8360 -66571
141f6571N0097M7571j20660N5199O1591j06540P0784K4383q5669P0859K861p0794
$$ -66571 -16474 31097 -89563 -34364 27227 -79313 -8529 15854 -69815 1044 3905 -66889
153f6889O4548o382l0589O6656n0073j7020M8081m0036K5571K7133n4999L2500
$$ -66889 -2341 -8723 -39312 27344 -22729 -39749 8332 -31704 -6133 21000 -33999 -1499
165a499J7136n5228N1679q939l5797O8058l0762k6119L7135k8636N788L8941l2226
$$ -1499 15637 -39591 12088 3149 -32648 35410 4648 -21471 15664 -12972 -7184 31757 -469
178d69J880J9112l3323K4615N554k4257K9842J845k6238J9184k977k6136M2844
$$ -469 1411 20523 -12800 11815 17369 -6888 22954 24799 -1439 17745 14768 -11368 31476
191C1476l229k6900K9862j7790j5781L0922n499j8571L1782j3012k1860L0993
$$ 31476 28247 1347 31209 13419 -2362 28560 23061 4490 36272 23260 1400 32393
203C2393k0715o782L5520j9079j0029K5442l4696O948L0573l8475K9218J627l7166
$$ 32393 11678 4896 40416 21337 11308 36750 2054 9002 39575 1100 30318 31945 -5221
216e221L5374j5980j7110L7644j9541r100K7112l6293N005K1818k5596J9041K279
$$ -5221 30153 14173 -2937 34707 15166 6066 33178 -3115 1890 23708 -1888 17153 19432
229A9432k2537P333M561j7556J4387J0562k7427J7766j623k9445K4472N705k6555
$$ 19432 -3105 4228 8789 -8767 5620 16182 -11245 6521 4898 -24547 -75 5630 -20925
242b0925K6468n23m0591L3111k971k7313L4712l525k9407K0725K027l1506K8829
$$ -20925 5543 5020 -35571 -2460 -5431 -32744 1968 -1557 -30964 -10239 -8212 -39718 -10889
255a0889O781k5611J9465j914k1064R212J3227j2021M778Q283j1100p601R307
$$ -10889 -4108 -29719 -10254 -12168 -33232 -24020 -10793 -22814 -18036 -9753 -20853 -28454 -19147
268a9147O998j5837J9252M796k5368J3781P459j7505J1091K0948k4184Q46K1469
$$ -19147 -12149 -27986 -8734 -3938 -29306 -15525 -8066 -25571 -14480 6468 -17716 -16870 4599
281D599k2477k504K9524j2069j6633L5427j7141k4989M1115r060k3998L6264j621
$$ 4599 -17878 -20382 9142 -2927 -19560 15867 -1274 -26263 14852 5792 -18206 18058 16437
294A6437l8251L6037N101m0083L8176Q858l8487K4440J5655m1948K3711K3592
$$ 16437 -21814 14223 19324 -20759 17417 26275 -12212 12228 27883 -14065 9646 33238
306C3238l9844J7740J8005l1011P425K2502k5246J552K4432k1759k530J3774o743
$$ 33238 -6606 11134 29139 -1872 5553 28055 2809 4361 28793 7034 4504 18278 11535
319A1535p651J1013J975j5740P660J1040j5383o351K4345j7835j2246L5941k5934
$$ 11535 3884 14897 16872 1132 8792 19832 4449 -1902 22443 4608 -7638 28303 2369
332B369j5263M0164k2515k3680M5152k0944k6136M9669k6451k5125M4015j5972
$$ 2369 -12894 27270 4755 -18925 26227 5283 -20853 28816 2365 -22760 21255 5283
344E283k6039L8767j1003k9389L7424j0800k5050L0543k824k1698J9561P3k1669
$$ 5283 -20756 18011 7008 -22381 15043 4243 -20807 9736 6912 -14786 4775 4848 -16821
357a6821J9706P8j1593Q870l69k850m398N017K381o682M671Q456j8201K317J9943
$$ -16821 2885 2963 -8630 240 -129 -2979 -7377 -2360 21 -6661 -1990 6466 -11735 -9418 10525
372A0525k5890R298J9544k8817O478K0922k8534M718K7319l0875P112J9354k8459
$$ 10525 -15365 -6067 13477 -15340 -8862 12060 -16474 -11756 15563 -15312 -8200 11154 -17305
385a7305O151K0084j9354o41J9945k0544j324J7646j4751p51J3821o225r747J1518
$$ -17305 -11154 8930 -10424 -11065 8880 -11664 -12988 4658 -10093 -10844 2977 -3248 -12995 -1477
399a477m494p135J3040r46o838K156L155p185M657L930l497J567n66K516q471
$$ -1477 -5971 -13106 -66 -1012 -7850 -5694 -2539 -9724 -5067 -1137 -4634 -3067 -3633 -1117 -9588
414i588N830O554r562R829m49j3686J1898L298j3190J7560m233j1047J4974q633
$$ -9588 -3758 2796 -6766 3063 2614 -11072 826 4124 -9066 8494 4261 -6786 8188 -445
428d45o94M706K209J351n263N240k581o427J2204o43q999J3270q180m664J1648
$$ -445 -1139 3567 5776 7127 1864 7104 4523 -1904 10300 9657 658 13928 5748 1084 12732
443A2732j0160N920L388n327J602k61j958k072P692k789l092M857m598m305O742
$$ 12732 2572 8492 11880 6553 8155 7894 5936 3864 11556 8767 5675 10532 5934 1629 8371
458H371j438k775M857n858K807l866q91N423o735N780k551k358k99l798P218m858
$$ 8371 6933 4158 9015 3157 5964 2098 1207 6630 -105 5675 3124 766 467 -3331 3887 -971
474i71j717Q146j1282K7R806j5038J0613N84j1105J6486j6710K942J0565j7189
$$ -971 -2688 5458 -5824 -5797 4009 -11029 -416 168 -10937 5549 -11161 -8219 2346 -14843
488a4843J4849j004j2596J2733p641j439J0321j1495Q466n88p978J0331r446O020
$$ -14843 6 -998 -13594 -861 -8502 -9941 380 -11115 -2649 -3237 -11215 -884 -10330 -4310
502d310P31l010Q981j3271O765M508j2068J3471O3j1641J2291m829m678R160m310
$$ -4310 -3579 -6589 2392 -10879 -4114 394 -11674 1797 1860 -9781 2510 -2319 -6997 2163 -2147
517b147K586j207K744l393k622R733j0018Q224K720j1911R838m144k584R319p319
$$ -2147 439 -768 1976 -1417 -4039 5694 -4324 3900 6620 -5291 4547 403 -2181 7138 -181
532a81M066L77q344J2622j2276K973J3351j9538J4508k973j2889J5990q157K221
$$ -181 3885 4262 -4082 8540 -3736 -763 12588 -6950 7558 4585 -8304 7686 -471 1750
546A750M141q445O574n963j60R765j4160J1317J087j5570J8343j2650k005J4861
$$ 1750 5891 -2554 4020 -1943 -2103 7662 -6498 4819 5906 -9664 8679 -3971 -5976 8885
560H885j2028M845l56n545M037j273L699j377l535O875p423k80Q690j0488Q339
$$ 8885 -3143 1702 1346 -4199 -162 -1435 2264 887 -2648 4227 -3196 -3476 5214 -5274 3065
575C065J102o874M398m192L353k57K331J416o756M478n82l178N700j541k026N218
$$ 3065 4167 -2707 1691 -2501 852 595 2926 4342 -2414 2064 1482 -1696 4004 2463 437 5655
591E655n564J978j384q92P786p955N889k665p472J1290n845k56O382p276P28L914
$$ 5655 91 2069 685 -207 7579 -376 5513 2848 -4624 6666 821 565 6947 -329 399 4313
607D313o565L666N10j029K768n696L511l836N18O013o249J986K98m006K443J026
$$ 4313 -2252 1414 1924 895 3663 -2033 1478 -2358 -1840 4173 -2076 -90 208 -3798 -1355 -329
623c29l082K102N40k495J708k699J145n28J850O88l365R55q33Q12O3J481j902
$$ -329 -3411 -1309 -769 -3264 -1556 -4255 -3110 -3638 -1788 -1100 -4465 -3510 -4343 -3531 -3468 -1987 -3889
640c889l39K616l132J403J59L08N23J037j183k039K789k38J744j193P51j297R63
$$ -3889 -4228 -1612 -4744 -3341 -3182 -2874 -2351 -1314 -2497 -4536 -1747 -1985 -241 -1434 -683 -1980 -1017
657a017J746k479K779p16K33K43O79j459L49L043k370J608l61p40N23R01J32j680
$$ -1017 729 -1750 1029 313 546 789 1468 9 358 3401 1031 2639 2278 1538 2061 2962 3094 1414
675A414K426j487O96k92R7m81J75J673k604J654j723K06J575j233m26n43J001
$$ 1414 3840 2353 3049 2757 2854 2373 2548 4221 1617 3271 1548 1754 3329 2096 1670 1127 2128
692B128j540J193p22p66R6j68P20k432K336j465j69M48q42N9q16K155k209K72
$$ 2128 588 1781 1059 293 389 221 941 -1491 845 -620 -789 -341 -1183 -1124 -1940 215 -1994 -1722
710a722J4p46R24o2j93j080K296k331O71J171j465J056J90J79j740K932j723m28
$$ -1722 -1708 -2454 -1530 -1592 -1785 -2865 -569 -2900 -2229 -1058 -2523 -1467 -1277 -1098 -2838 94 -1629 -2057
728b057L005k488J183OJ92n36J232k47K24P41j061J120j058J573j238J346N02
$$ -2057 948 -1540 -357 -351 -159 -695 537 290 514 1255 194 1314 256 1829 591 1937 2439
745B439k119K875k413J279O79j065R79q37j09N36j11j328K873k684M59J561l104
$$ 2439 320 3195 782 2061 2740 1675 2654 1817 1708 2244 2133 805 3678 994 1453 3014 -90
762i0K199j103O10q59M25n17r10R52j187P46m69J60j211P84r34n82K371l292J958
$$ -90 2109 1006 1616 757 1182 665 -245 707 -480 266 -203 -43 -1254 -470 -1404 -1986 385 -2907 -949
781i49l36j424O56J92l70n10K156l189J582O17j815J639l9p65l88K064l059J579
$$ -949 -1285 -2709 -2053 -1861 -2231 -2741 -585 -3774 -2192 -1575 -3390 -1751 -1790 -2555 -2943 -879 -3938 -2359
799b359J572k316K181n55k38l08K335k333J773O00j178J568j054N31J14M85k10
$$ -2359 -787 -3103 -922 -1477 -1715 -2023 312 -2021 -248 352 -826 742 -312 219 333 818 608
816F08L46o17M53N92j440J685L32j711J727M25k543K400J960l797J724R62l846
$$ 608 954 337 790 1382 -58 1627 1959 248 1975 2400 -143 2257 4217 420 2144 3106 -740
833g40M128p43l563L824N87n118M858j483l194M855k388j112J046K91k400Q53
$$ -740 3388 2645 -918 2906 3493 -1625 3233 1750 -1444 3411 1023 -89 957 1248 -1152 -299
849b99K421l765K343N98l014Q79R45j924K438k81k475K707l085K059N70k554L361
$$ -299 2122 -1643 700 1298 -1716 -837 108 -1816 622 341 -2134 573 -2512 -453 117 -2437 924
866I24k429M3J854k622N2L404k262j38K607l836J039K583r00j677L139j267l233
$$ 924 -1505 -1462 392 -2230 -2178 1226 -1036 -1174 1433 -2403 -1364 1219 319 -1358 1781 514 -2719
883b719N388k845j156M007j045j447J292o20j569L542n30j882J486k28j951K296
$$ -2719 2669 -176 -1332 2675 1630 183 1475 855 -714 2828 2298 416 1902 1674 -277 2019
899B019Q69m408M137k85k495K160k005P52L03Q02l01k463N78J924k081N15J592
$$ 2019 2888 -1520 2617 2332 -163 1997 -8 744 1047 1849 1548 -915 -337 1587 -494 21 1613
916A613m673L799k26l106K511j659J90J183p26j545L16N40P18r24r5M07l039M676
$$ 1613 -3060 739 513 -2593 -82 -1741 -1551 -368 -1094 -2639 -2323 -1783 -1065 -1989 -2084 -1677 -4716 -40
934d0j670m042N273k342j296M480l491k691N876k231l09J918l620K707K30O65
$$ -40 -1710 -5752 -479 -2821 -4117 363 -3128 -5819 57 -2174 -2483 -565 -4185 -1478 -1248 -583
950e83j451j170L428q16N81M37k876J447M211l432N38Q52k343M363p81j758J08
$$ -583 -2034 -3204 224 -592 -11 426 -2450 -1003 3208 -224 314 1166 -1177 3186 2405 647 755
967G55Q10J895n2j447j138J468J08K860k145l245M463j281j059L238l636j287
$$ 755 1565 3460 3408 1961 823 2291 2399 5259 3114 -131 4332 3051 1992 5230 1594 307
983C07O955n052j301L441n961N847J008m747J995k615J858J519k923J456j547
$$ 307 7262 2210 909 4350 -1611 4236 5244 497 2492 -123 1735 3254 331 1787 240
998B40l08M628p073J588K796n224P792m647m301N638m290L386J379n680K978j59
$$ 240 -68 4560 -2513 -925 1871 -3353 4439 -208 -4509 1129 -3161 225 1604 -4076 -1098 -1257
1014a257j436L361m320N15L682l035K214k447j520K547J111l8k046L53o25J813
$$ -1257 -2693 668 -3652 -3137 545 -2490 -276 -2723 -4243 -1696 -585 -623 -2669 -2316 -2941 -1128
1030a128J034k461P96L75O60N29j707n46J475N39K679m093r04L570l675N932k469
$$ -1128 -94 -2555 -1759 -1384 -724 -195 -1902 -2448 -973 -434 2245 -1848 -2752 818 -2857 3075 606
1047F06m506O730m348J077L697p341M623K598n174M532m270j246O966m523K026
$$ 606 -3900 2830 -1518 -441 3256 -4085 538 3136 -2038 2494 -1776 -3022 3944 -579 1447
1062A447j714j955M475l147J823j152k270N054k154k360K715l776L156L252o157
$$ 1447 -267 -2222 2253 -894 929 -223 -2493 2561 407 -1953 762 -3014 142 3394 -2763
1077b763K793q64j500L897j906j360J412L18j222K055k264r02M641k473k5J133
$$ -2763 30 -834 -2334 1563 -343 -1703 -291 27 -1195 860 -1404 -2306 2335 -138 -163 970
1093I70l831L384K427m899M172j117m145P380m808k80M079l532K587m09j723P52
$$ 970 -2861 523 2950 -1949 2223 1106 -3039 4341 -467 -747 3332 -200 2387 1978 255 1007
1109A007qK402r14j306K182l238J692L276o248N219j48m362N929m741m02M310
$$ 1007 999 3401 2487 1181 3363 125 1817 5093 -1155 4064 3916 -446 5483 742 340 4650
1125D650l110Q97J691m556K009P94j503K650k768L44J087k313J87P63k22j91J708
$$ 4650 1540 2437 4128 -428 1581 2375 872 3522 754 1098 2185 -128 59 822 600 409 2117
1142B117l100r95K503k503J372J574k778j71J035k386J164R71j561J506r57l81
$$ 2117 -983 -1978 525 -1978 -606 968 -1810 -1981 -946 -3332 -2168 -1197 -2758 -1252 -2209 -2590
1158b590k002J847R25k003L193l029j744L478j952J19K848k151O4O39k243K293
$$ -2590 -4592 -2745 -1820 -3823 -630 -3659 -5403 -1925 -3877 -3758 -910 -3061 -2997 -2358 -4601 -2308
1174b308r17J501J162k798K046j264n41K725l01o62J833j997n30K096j454J873
$$ -2308 -3225 -1724 -562 -3360 -1314 -2578 -3119 -394 -695 -1357 476 -1521 -2051 45 -1409 464
1190D64L52P0o45p04J458j103J683R82r81o43O06r73L36K304r10m4M98j160j136
$$ 464 816 886 241 -463 995 -108 1575 2557 1576 933 1539 566 902 3206 2296 2252 2750 1590 454
1209D54J442O68j157K306j356j689R52J03k30J095N28k131N51k88j256J400R63
$$ 454 1896 2564 1407 3713 2357 668 1620 1723 1493 2588 3116 985 1536 1248 -8 1392 2355
1226B355j117J92M2k326J152M74q13J664q14n41l53l92M23L62j05N06n80j535
$$ 2355 1238 1430 1472 -854 298 772 -41 1623 809 268 -85 -477 -54 308 203 709 129 -1406
1244a406K009j385K39J652j102n66P85o23o78K153j023l55J195j388m47O71P25
$$ -1406 603 -782 -543 1109 7 -559 226 -397 -1075 1078 55 -300 895 -493 -940 -269 456
1261D56q47K001j065j584K178j646L09J433q57m05J053j536j24J463j393J824
$$ 456 -391 1610 545 -1039 1139 -507 -198 1235 378 -27 1026 -510 -634 829 -564 1260
1277A260j008m18M54r42K26M83M6o36O92q38o08R94n51K77M39n59j316J130p22
$$ 1260 252 -166 288 -654 -428 55 101 -535 157 -681 -1289 -295 -846 -569 -130 -689 -2005 -875 -1597
1296a597m3J079j436M78l5k06n33L69J49L0J57k73o27L32M69m10R11l91m42J214
$$ -1597 -1640 -561 -1997 -1519 -1554 -1760 -2293 -1924 -1775 -1745 -1588 -1861 -2488 -2156 -1687 -2097 -1186 -1577 -2019 -805
1316h05j752J111K36j069K435j422n66J266n42L70J020q97O11J39m23R58r52J339
$$ -805 -2557 -1446 -1210 -2279 156 -1266 -1832 -566 -1108 -738 282 -615 -4 135 -288 670 -282 1057
1334A057j69k1Q03j370J306L17j52J55M53j005N51M43n81P50O2k14P7l18l09P34
$$ 1057 888 867 1670 300 1606 1923 1771 1926 2379 1374 1925 2368 1787 2537 2599 2385 2462 2144 1835 2569
1354B569k2k62Q62j850J283r7j527K031r34m20P06j707K51J200j439J133k59j793
$$ 2569 2547 2285 3147 1297 2580 2483 956 2987 2053 1633 2339 632 883 2083 644 1777 1518 -275
1372b75J823j923Q43R0j307K206k049k84J124k209J543Q54k307J279k9j916J973
$$ -275 1548 -375 468 558 -749 1457 -592 -876 248 -1961 -418 436 -1871 -592 -621 -2537 -564
1389e64j086k76J320q33j72m33j09L82Q24j050P75k21q57J589j453O12J278j469
$$ -564 -1650 -1926 -606 -1439 -1611 -2044 -2153 -1771 -947 -1997 -1222 -1443 -2300 -711 -2164 -1552 -274 -1743
1407a743J140K20j817J836j53r31K441k477R60Q44k161K990j495m17K482k927
$$ -1743 -603 -383 -2200 -364 -517 -1448 993 -1484 -524 320 -1841 1149 -346 -763 1719 -1208
1423a208J521P67k600K915m48k168L500k983O20J807k666K122m75r11J500j400
$$ -1208 313 1080 -1520 1395 947 -1221 2279 -704 -84 1723 -943 1179 704 -207 1293 -107
1439a07o8R72j211R26J31j267J300p57o92J511r23j11Q70r64k74J145j709J051
$$ -107 -175 797 -414 512 643 -624 676 -81 -773 738 -185 -296 574 -390 -664 481 -1228 -177
1457a77P89k133K542j888n76J832k040J465Q06k492K219n40j969M283l149L53
$$ -177 612 -1521 1021 -867 -1443 389 -1651 -186 620 -1872 347 -193 -2162 2121 -1028 -675
1473f75K685l902K726m23j838L059j936N52J554k688J768K59j689K943j957J18
$$ -675 2010 -1892 834 411 -1427 1632 -304 248 1802 -886 882 1141 -548 2395 438 556
1489E56J818k660J877j3j220J916l93j396R39n25j18J315j115L63M06j439R18
$$ 556 2374 -286 1591 1578 358 2274 1881 485 1424 899 781 2096 981 1344 1750 311 1229
1506A229L01j085J389o87j224K126k678K77K104k584K266o47k711K889k156K05
$$ 1229 1530 445 1834 1147 -77 2049 -629 -352 1752 -832 1434 787 -1924 965 -1191 -986
1522i86K135k829J645j83k682L321k311J62K687l924K145l71k121L019j366m10
$$ -986 1149 -1680 -35 -218 -2900 421 -1890 -1728 959 -2965 -820 -1191 -3312 -293 -1659 -2069
1538b069J712k263R11O02j447J837p43l42J216j302K20K73M4M94Q3l69l73J096
$$ -2069 -357 -2620 -1709 -1107 -2554 -717 -1460 -1802 -586 -1888 -1668 -1395 -1351 -857 -774 -1143 -1516 -420
1556d20p76R56k33l67J493q63m64J004o26Q45Q98j716J359q20o57K693k239R80
$$ -420 -1196 -240 -473 -840 653 -210 -674 330 -296 549 1447 -269 1090 270 -387 2306 67 1047
1574A047R45j893J821j096m47J888j668O78J008k718K238j93j374K442k392N17
$$ 1047 1992 99 1920 824 377 2265 597 1275 2283 -435 1803 1610 236 2678 286 803
1590H03R65k033J780p51q15J481j303M9N92j675J556P5q18O71r62K20K26n16K32
$$ 803 1768 -265 1515 764 -51 1430 127 176 768 -907 649 724 -94 577 -385 -165 61 -455 -223
1609b23k70K07j88L45o17L61J53l07M80o54J72j15j10m6O66m24J92K11j046J457
$$ -223 -493 -286 -474 -129 -746 -385 -232 -539 -59 -713 -541 -656 -766 -812 -146 -570 -378 -167 -1213 244
1629B44p41l90J339j220N86L32o17P42l33k03J058j272N03O64j108J484q23NO05
$$ 244 -497 -887 452 -768 -182 150 -467 275 -58 -261 797 -475 28 692 -416 1068 245 250 855
1648H55q18K82L22N3j3J99q72N92n86M61L71o33L89o32j00K71k66J19O1m5M7k33
$$ 855 37 319 641 694 681 880 8 600 14 475 846 213 602 -30 -130 141 -125 -6 55 10 57 -176
1670a76n67N20n6m81O87q45J06j43Q2J48R7P9p2l87l33N35l04L87j69k59J22Q1
$$ -176 -743 -223 -279 -760 -73 -918 -812 -955 -873 -725 -628 -549 -621 -1008 -1341 -806 -1110 -723 -892 -1151 -1029 -948
1692i48j35NN72p8o2J65k10K46jK7J84J31O0j03J97Q7J84l4M85l53j6L25n08R11
$$ -948 -1083 -1078 -506 -584 -646 -481 -691 -445 -446 -419 -235 -104 -44 -147 50 137 321 287 772 419 403 728 220 1131
1716A131K5l85L34k17L3J6M27l30N24m73L19n93K04K84j59P9j88Q7J59m91k38
$$ 1131 1156 771 1105 888 921 937 1364 1034 1558 1085 1404 811 1015 1299 1140 1219 1031 1118 1277 786 548
1737E48K22K57r7k52j54K77o84M61k90m7M30j146R3R0m61L10K9N8k95M0j36k52
$$ 548 770 1027 930 678 524 801 117 578 288 241 671 -475 -382 -292 -753 -443 -414 -356 -651 -611 -747 -999
1759i99L4K59l59J82K48j144R09n49L20K77k20L09o35L96l75K26M30rK29j54n9
$$ -999 -965 -706 -1065 -883 -635 -1779 -870 -1419 -1099 -822 -1042 -733 -1368 -972 -1347 -1121 -691 -700 -471 -625 -684
1780f84o0K81k14R73o61p4M50r38J147k41MR62m91m55K14O1J09N54m47K69j90
$$ -684 -744 -463 -677 296 -365 -439 11 -927 220 -21 -17 945 454 -1 213 274 383 937 490 759 569
1801E69k05L53J2P3r3K42j22n61M45j20M12k65L8o48Q4K98j29K59l48K3k68P4
$$ 569 364 717 729 802 709 951 829 268 713 593 1005 740 778 130 214 512 383 642 294 317 49 123
1823A23n08M17j7j63M68p87J76r5k56R28m66k40k00l9J8O14r08Q43k15k92O85
$$ 123 -385 32 15 -148 320 -467 -291 -386 -642 286 -180 -420 -620 -659 -641 -27 -935 -92 -307 -599 86
1844H6j135L74M53k03M89l86n60M05P9M21J11n23O65j3k83M32o18N84L55l09n7
$$ 86 -1049 -675 -222 -425 64 -322 -882 -477 -398 23 134 -389 276 263 -20 412 -206 378 733 424 367
1865C67k1j6K58L40m62L83m25J50O32o85M3N78p6j92j40n29M11L65l34K47q46
$$ 367 346 330 588 928 466 849 424 574 1206 521 564 1142 1066 874 734 205 616 981 647 894 48
1886D8J58O9l26Q54p51k08Q24n06k89J87r38J124j34o32K14o46K23R57l04o33
$$ 48 206 275 -51 803 52 -156 668 162 -127 60 -878 246 112 -520 -306 -952 -729 228 -76 -709
1906g09R7o9N9k05p67N89J18J05L79j073K78J65J42L72k70m18L22K26j71L66n41
$$ -709 -612 -681 -622 -827 -1594 -1005 -887 -782 -403 -1476 -1198 -1033 -891 -519 -789 -1207 -885 -659 -830 -464 -1005
1927a005O91J80l05L25p31N02N38j09p0J21n70P72L70n58Q76r51N98J65o29M02
$$ -1005 -314 -134 -439 -114 -845 -343 195 86 16 137 -433 339 709 151 1027 76 674 839 210 612
1947F12j01L86O60p64m74O33l2M92j98n72K80j78K05n6l86O53m53K34k53p07M1
$$ 612 511 897 1557 793 319 952 920 1412 1214 642 922 744 949 893 507 1160 707 941 688 -19 22
1968B2O00K13n06j18n22L90J0m5j75r5m8J04K44j149N32j19K04M67j059J27M49
$$ 22 622 835 329 211 -311 79 89 44 -131 -226 -274 -170 74 -1075 -543 -662 -458 9 -1050 -923 -474
1989d74rK40j6o27O94n49K18k5m34P09l9l6O2r94J140K23k06J15j06j42M16k13
$$ -474 -483 -243 -259 -886 -192 -741 -523 -548 -982 -273 -312 -348 -286 -1280 -140 83 -123 -8 -114 -256 160 -53
2011e3j79O16p66J065m43o1J31j69P25j04k80k25J43L80o0j07j29l31N09%m55
$$ -53 -232 384 -382 683 240 179 310 141 866 762 482 257 400 780 720 613 484 153 662 662 207
2032B07M56j22J5N41p86j94j97K59N11o62M47o64L03Q0l50l59J61mL93m35m39
$$ 207 663 541 556 1097 311 117 -80 179 690 28 475 -189 114 194 -156 -515 -354 -358 35 -400 -839
2053h39M89m85O82k54n49L48k85L07K2l79P6N36m46J53l43j59O62p7J35q9j50
$$ -839 -350 -835 -153 -407 -956 -608 -893 -586 -564 -943 -867 -331 -777 -624 -967 -1126 -464 -541 -406 -495 -645
2074f45L10k05K96n45J72O28r6j22J22K07L3M0K2M10k39J1J47l24O02l45K49J60
$$ -645 -335 -540 -244 -789 -617 11 -85 -207 -85 122 155 195 217 627 388 399 546 222 824 479 728 888
2096H88o4k35J21j47K00K99l38J17j03l7L75l18J83n15L24j94j41K16P7M6l08
$$ 888 824 589 710 563 763 1062 724 841 738 701 1076 758 941 426 750 556 415 631 708 754 446
2117D46J70m17L18n03J38L09m18M9n49L56j09q4n1j51L10k93J29k10j35m3J59
$$ 446 616 199 517 14 152 461 43 92 -457 -101 -210 -294 -345 -496 -186 -479 -350 -560 -695 -738 -579
2138e79K53l63J77m03M32k33l8K58k62L08l46M12j61J03r3R2P0j54J05j26N26
$$ -579 -326 -689 -512 -915 -483 -716 -754 -496 -758 -450 -796 -384 -545 -442 -535 -443 -373 -527 -422 -548 -22
2159b2j48L3pM7L17m65N15l87M16k9l9k6j37L67k5K0k89K41m9R1J07j47L60k71
$$ -22 -170 -137 -144 -97 220 -245 270 -117 299 270 231 205 68 435 410 430 141 382 333 424 531 384 744 473
2183D73J0m5k00J30J99m73J97J02m34j38L77j20J18m96L08k02l38L18k21J16M1
$$ 473 483 438 238 368 567 94 291 393 -41 -179 198 78 196 -300 8 -194 -532 -214 -435 -319 -278
2204b78J8q1nl42J24m6J00J4l10L16l34L76J68m0j6j92L4K05j2K59m7j99j81M17
$$ -278 -260 -341 -346 -688 -564 -610 -510 -496 -806 -490 -824 -448 -280 -320 -336 -528 -494 -289 -301 -42 -89 -288 -469 -52
2228e2m3K26m6N1R8k50K89R7J19K6K23j99j6k03J52oN10k22p5Q6j5k35L18n9M86
$$ -52 -95 131 85 136 234 -16 273 370 489 515 738 539 523 320 472 466 976 754 679 765 750 515 833 774 1260
2253A260l45m55Q7K8K9O2J48j20l2m70J4k7M59j50N3m6n29J91m30K91J54k69J18
$$ 1260 915 460 547 575 604 666 814 694 662 192 206 179 638 488 541 495 -34 157 -273 18 172 -97 21
2276B1n88J69l37J22J19k02M3k38j12K04J05l5K34m72K46lm55L42M9P8L06l98
$$ 21 -567 -398 -735 -613 -494 -696 -653 -891 -1003 -799 -694 -729 -495 -967 -721 -724 -1179 -837 -788 -710 -404 -802
2298h02l57L71k4K79M55p87L14L12l67L68j69L30L54j50m84J93J00M0J36j84M79
$$ -802 -1159 -788 -812 -533 -78 -865 -551 -239 -606 -238 -407 -77 277 127 -357 -164 -64 -24 112 -72 407
2319D07k95Q3J90k26M69l7J44n60K99k15J75L34j75M12r31L27O16n52N36l1m00
$$ 407 112 195 385 159 628 591 735 175 474 259 434 768 593 1005 74 401 1017 465 1001 970 570
2340E70j16k0l31M83m82K42N56j148L27l61L55K03n78M88j81o88N02L9k26M01
$$ 570 454 434 103 586 104 346 902 -246 81 -280 75 278 -300 188 7 -681 -179 -140 -366 35
2360C5k28l05L03p74Q51l11M7N25o19r6K82k30K51K92n19O35j35l67L41k65L15
$$ 35 -193 -498 -195 -969 -118 -429 -382 143 -476 -572 -290 -520 -269 23 -496 139 4 -363 -22 -287 28
2381B8J66k52K08L7n72O49P3O8J87l60O0J92l66N18n4l75M35k45j30O04n70M5
$$ 28 194 -58 150 187 -385 264 337 405 592 232 292 484 118 636 582 207 642 397 267 871 301 346
2403C46K14m70N16m34L9K81l66L09o0m80M51o0n92P52o05j25L50o47O07k17l19
$$ 346 560 90 606 172 211 492 126 435 375 -105 346 286 -306 446 -159 -284 66 -581 26 -191 -510
2424e10L94j62m21K92k68j38L14j61K60l21k79N80o17L13K90l55J09J56n55K40
$$ -510 -116 -278 -699 -407 -675 -813 -499 -660 -400 -721 -1000 -420 -1037 -724 -434 -789 -680 -524 -1079 -839
2444h39K78m43P16j96j16N03k96M80l44m17P11m0n57R80n58J45N11p74J002l14
$$ -839 -561 -1004 -288 -484 -600 -97 -393 87 -257 -674 37 -3 -560 420 -138 7 518 -256 746 432
2464D32l20N47m90K39L77m28L25K0l92O33k03L2K33p15M39J79l53K65j3l32P6
$$ 432 112 659 169 408 785 357 682 702 310 943 740 772 1005 290 729 908 555 820 807 475 551
2485E51K27j86K66l83O3l7m98L94L1n25M32k54R0Mm89J55K67p11N61l67k31O37
$$ 551 778 592 858 475 538 501 3 397 428 -97 335 81 171 175 -314 -159 108 -603 -42 -409 -640 -3
2507cp81M60L05n50L10k92k84O64o22K39M02q22P80k59k98O65r15M06K33K2Q8
$$ -3 -784 -324 -19 -569 -259 -551 -835 -171 -793 -554 -152 -974 -194 -453 -751 -86 -1001 -595 -362 -340 -252
2528b52j91r5M26k15j08L57l77N10K11k60j58J52r7j0L29l88P94l26j13L37p22
$$ -252 -443 -538 -112 -327 -435 -78 -455 55 266 6 -152 0 -97 -107 222 -166 628 302 189 526 -196
2549a96N24L65m46J96J7l64L73j03k32M94n63O3L45m56O28l51k88L15m89J00L6
$$ -196 328 693 247 443 460 96 469 366 134 628 65 128 473 17 645 294 6 321 -168 -68 -32
2570c2j33L32r8k00Q5l06N3K69m08L47k59j33J22j27q2M02l46K04P4m35M72l36
$$ -32 -165 167 69 -131 -46 -352 -299 -30 -438 -91 -350 -483 -361 -488 -570 -168 -514 -310 -236 -671 -199 -535
2592e35L9M78m21P0J17k35J04L43k99L26mk19J41J81j4M7k9J3K73m08K40L23k49
$$ -535 -496 -18 -439 -369 -252 -487 -383 -40 -339 -13 -17 -236 -95 86 72 119 90 103 376 -32 208 531 282
2615B82L00Jk08J51l38L41J22j37L65m40L80l01O7j46K94k56K55m32L13O9j83
$$ 282 582 583 375 526 188 529 651 514 879 439 819 518 585 439 733 477 732 300 613 682 499
2636D99j14k4j69J48j30q3J79k59N1n82O6K39K6r9K22m67N8k20L14l17L36Q7m10
$$ 499 385 361 192 340 210 127 306 47 98 -484 -418 -179 -153 -252 -30 -497 -439 -659 -345 -662 -326 -239 -649
2659f49P6P0j60%M3J76k49J51n2l03K86p0P1K35K8k71L41j66qJ66j10J94R6m2
$$ -649 -573 -503 -663 -663 -620 -444 -693 -542 -594 -897 -611 -681 -610 -375 -347 -618 -277 -443 -451 -285 -395 -201 -105 -147
2683a47j14N04o2k49K92L9k28J64j5J91P8k99J35o3K50R1j39K12j68J20j89J68
$$ -147 -261 243 181 -68 224 263 35 199 184 375 453 154 289 226 476 567 428 640 472 592 403 571
2705E71J33k96K25k1j78Q4l4j90J15J14j99P8m79J92R3k20K95l70J88l0p6j65
$$ 571 704 408 633 612 434 518 484 294 409 523 324 402 -77 115 208 -12 283 -87 101 71 -5 -170
2727a70L0o3O9k59m5L05k78K5P3L8j10l9k92j7M51j30P1j13J66k44P1m5N02n88
$$ -170 -140 -203 -134 -393 -438 -133 -411 -386 -313 -275 -385 -424 -716 -733 -282 -412 -341 -454 -288 -532 -461 -506 -4 -592
2751e92O52j16N8J61j90L26K97l59l92L57m94J276p00m60N77j77m0J46k76N00
$$ -592 60 -56 2 163 -27 299 596 237 -155 202 -292 984 284 -176 401 224 184 330 54 554
2771E54l23J57J50k50J73J96j15M92m84J79l08k00P2k83K84m6r2M8J61j013Q14
$$ 554 231 388 538 288 461 657 542 1034 550 729 421 221 293 10 294 248 156 204 365 -648 166
2792A66J3K13m93O9q8L6Ln5P0l44J21J42n69M69j76k30L19q4j35L43l05K59k08
$$ 166 179 392 -101 -32 -120 -84 -81 -136 -66 -410 -289 -147 -716 -247 -423 -653 -334 -418 -553 -210 -515 -256 -464
2815d64j13K71k23J25J54l9j89J88p9K46j21k46O56k78k74N11n01K23K16M0K65
$$ -464 -577 -306 -529 -404 -250 -289 -478 -290 -369 -123 -244 -490 166 -112 -386 125 -376 -153 63 103 368
2836C68j74l07O05k91J85K82l81J36L04n74M26l12J67L49m01K44M6l86J71J41
$$ 368 194 -113 492 201 386 668 287 423 727 153 579 267 434 783 382 626 672 286 457 598
2856E98m05N81K2m45K19n72N27m6l50M14l78k47P53o04j04K81n03L97l31k61L44
$$ 598 193 774 796 351 570 -2 525 479 129 543 165 -82 671 67 -37 244 -259 138 -193 -454 -110
2877a10j65j49M57n40K56ro54N61j95N3J84m19J87J17m38N40k42K45Q9k89J6K54
$$ -110 -275 -424 33 -507 -251 -260 -914 -353 -548 -495 -311 -730 -543 -426 -864 -324 -566 -321 -232 -521 -505 -251
2899b51k72O5K43k28K29l2j20L23l02LO10l21J49K19k00L49m91j07N09k09K4M19
$$ -251 -523 -458 -215 -443 -214 -246 -366 -43 -345 -342 268 -53 96 315 115 464 -27 -134 375 166 190 609
2921F09n10J38L06n8K86k92k16M30k31J34j01m52O90m96q2L5m0M1L25m15K9L33
$$ 609 99 237 543 485 771 479 263 693 462 596 495 43 733 237 155 190 150 191 516 101 130 463
2943D63m78L09n6n36N18l77L29Oo62L78P2j58L42m44k06M66m84J61r8r6L32j23
$$ 463 -15 294 238 -298 220 -157 172 178 -484 -106 -34 -192 150 -294 -500 -34 -518 -357 -455 -551 -219 -342
2965c42m12L85o9j6N52o89K74J13l74M32j88j2M61m17j24L50k01J36L18k96K33
$$ -342 -754 -369 -438 -454 98 -591 -317 -204 -578 -146 -334 -346 115 -302 -426 -76 -277 -141 177 -119 114
2986A14j68K57O2k13M60j65l95M46k87j38M19mK2j1j27K45o0k88O49k98J75r7
$$ 114 -54 203 265 52 512 347 -48 398 111 -27 392 388 410 399 272 517 457 169 818 520 695 598
3008E98l06l2L56l94j23j9K6L20m61J12J89l14j82K31Q9j34l30J70K48l75K00
$$ 598 292 260 616 222 99 80 106 426 -35 77 266 -48 -230 1 90 -44 -374 -204 44 -331 -131
3029a31N5m82r0j2P0L61k43K70k05l81K80J56j10j1J89j20K13l05J00J74K9p7
$$ -131 -76 -558 -648 -660 -590 -229 -472 -202 -407 -788 -508 -352 -462 -473 -284 -404 -191 -496 -396 -222 -193 -270
3051b70j88N7J19m6K90jk13J52J41J39j26R8J05j28K96l32J29K66k1K40m42J89
$$ -270 -458 -401 -282 -328 -38 -39 -252 -100 41 180 54 152 257 129 425 93 222 488 467 707 265 454
3073D54j11k9J60l2P7k18j76K34K69J1m72L17k82K37k29r7L30j90R5k98Q9j02
$$ 454 343 314 474 442 519 301 125 359 628 639 167 484 202 439 210 113 443 253 348 50 139 37
3095C7r1J93k56L2r8J61j71j83J87m8O9r1k76K3j43J32K31k10J21P4l2j75J09
$$ 37 -54 139 -117 -85 -183 -22 -193 -376 -189 -237 -168 -259 -535 -512 -655 -523 -292 -502 -381 -307 -339 -514 -405
3118d05j27J17K39n4k62p3J53J27r9L85j95kp9J99j41J54J10Q2j63J43K90j34
$$ -405 -532 -415 -176 -230 -492 -565 -412 -285 -384 1 -194 -196 -275 -76 -217 -63 47 129 -34 109 399 265
3140B65j64J87j16J12O2J68m1k20L74k41P2p6j5J1p2J0o0K29j82N1j91j2N4M3
$$ 265 101 288 172 284 346 514 473 253 627 386 458 382 367 378 306 316 256 485 303 354 163 151 205 248
3164B48k15K60j82j37L43k9j85m30K53j57J43n4O8R0k52m2n5Q3PJ6j02j6J7p3
$$ 248 33 293 111 -26 317 288 103 -327 -74 -231 -88 -142 -74 16 -236 -278 -333 -250 -243 -227 -329 -345 -328 -401
3188d01K09j02j63J88j77R4k2J97k85k18N22j30l82L74J09j58M44l74R6K12l1
$$ -401 -192 -294 -457 -269 -446 -352 -374 -177 -462 -680 -158 -288 -670 -296 -187 -345 99 -275 -179 33 2
3209BNo3K0J67K09or4J38k69K43L74m40L1j65K75o4p0J66j40J79L7j65O1J66l46
$$ 2 7 -56 -36 131 340 334 240 378 109 352 726 286 317 152 427 363 293 459 319 498 535 370 431 597 251
3234B51o1J38o1j77J49K2j47m1J42j63J01K4n8l9l09Q3K11j94k54n5K81Pk22L23
$$ 251 190 328 267 90 239 261 114 73 215 52 153 177 119 80 -229 -146 65 -129 -383 -438 -157 -150 -372 -49
3258d9k47J07m68N5L55M8j20o4N0J82j24R7j33N1N2j82M36j94o1K9J99n4K32k61
$$ -49 -296 -189 -657 -602 -247 -199 -319 -383 -333 -151 -275 -178 -311 -260 -208 -390 46 -148 -209 -180 19 -35 197 -64
3282f4M9j86R6M74k52nK12j25N3J48l05J62J4q8K83l37K01P0j25M4R7n3M5j89
$$ -64 -15 -201 -105 369 117 112 324 199 252 400 95 257 271 183 466 129 330 400 275 319 416 363 408 219
3306B19P3L58l1n78L58O4j15k53K21k4q44R45m26m16K15m33Q03j69k9o5k43O8
$$ 219 292 650 619 41 399 463 348 95 316 292 -552 393 -33 -449 -234 -667 136 -33 -62 -127 -370 -302
3328c02j53P3kR3j19K03M9j22j77M9k9L53l16r8N9Q9K5J08j70J10m4K73l10J73
$$ -302 -455 -382 -384 -291 -410 -207 -158 -280 -457 -408 -437 -84 -400 -498 -439 -350 -325 -217 -387 -277 -321 -48 -358 -185
3352a85lJ09k15J77l1j39M31K95k95j70O3j7M52k67k3k06L47j89K04M2j41k54
$$ -185 -188 -79 -294 -117 -148 -287 144 439 144 -26 37 20 472 205 182 -24 323 134 338 380 239 -15
3374a5M04j43J61l2J60k25q8J28j23Q6L9j3j85j3o7L27j54l3L2j60oM7j71p6r9
$$ -15 389 246 407 375 535 310 222 350 227 313 352 339 154 141 74 401 247 214 246 86 80 127 -44 -120 -219
3399b19J77J3nj55J85%r4j53k42K29R7k3r8n6j05N1K27j8j57J09q1J68k51L92
$$ -219 -42 -29 -34 -189 -4 -4 -98 -251 -493 -264 -167 -190 -288 -344 -449 -398 -171 -189 -346 -237 -318 -150 -401 -9
3423il08K26k47l9J64Or8Q7L27j99P6J0j80K01n7R7j08J03R8m5J28J11j60K50
$$ -9 -317 -91 -338 -377 -213 -207 -305 -218 109 -90 -14 -4 -184 17 -40 57 -51 52 150 105 233 344 184 434
3447D34k49l67Q54n31n3K61k13J90j32J25j16J16j65Q2p0r8J21j80O0P3j67J25
$$ 434 185 -182 672 141 88 349 136 326 194 319 203 319 154 236 166 68 189 9 69 142 -25 100
3469A00k30K26r8Nk50J24K7p1J5p7O1j36M29l29j91L8q5K33j65J82j30J13q8J43
$$ 100 -130 96 -2 3 -247 -123 -96 -167 -152 -229 -168 -304 125 -204 -395 -357 -442 -209 -374 -192 -322 -209 -297 -154
3493a54o9M5p9o8L66j93o9R8J06j57J64j31j05K07J31j93J32K00k4rj42O1J82
$$ -154 -223 -178 -257 -325 41 -152 -221 -123 -17 -174 -10 -141 -246 -39 92 -101 31 231 207 198 56 117 299
3516B99m6J89j11r8K2L0J7O0J74j93K14l26K91r6j50J54J88l80J7N5j52Q0J10
$$ 299 253 442 331 233 255 285 302 362 536 343 557 231 522 426 276 430 618 238 255 310 158 238 348
3539C48j07j62N2j9j8k37j0J71j00J49j87l5j47J10J73k14J26j07k35J77j68O5
$$ 348 241 79 131 112 94 -143 -153 18 -82 67 -120 -155 -302 -192 -19 -233 -107 -214 -449 -272 -440 -375
3561c75K2J7J64k73j00N57m09J27j13jj74K47J97n2j15J35m6j18K30k15K14Q9
$$ -375 -353 -336 -172 -445 -545 12 -397 -270 -383 -384 -558 -311 -114 -166 -281 -146 -192 -310 -80 -295 -81 8
3583HJ58j23K37k48k04M92j77k95Q4M33l99L38k52J55K24k93Q6J54J4R7M3j96
$$ 8 166 43 280 32 -172 320 143 -152 -68 365 -34 304 52 207 431 138 224 378 392 489 532 336
3605C36nkj6lk89M40l33J25K1k45p5K29k10J65J09k29O1j04K2K1p2N6m3o1N1k62
$$ 336 331 329 313 310 21 461 128 253 274 29 -46 183 -27 138 247 18 79 -25 -3 18 -54 2 -41 -102 -51 -313
3631c13L37j40l33L86j4p4j2n7l1M3l2p4n8J3K43K24l58O9J00l3J7j5M4o5J90
$$ -313 24 -116 -449 -63 -77 -151 -163 -220 -251 -208 -240 -314 -372 -359 -116 108 -250 -181 -81 -114 -97 -112 -68 -133 57
3656E7l4k23J44J51j0l9P2p6L2J30k1n5L85m03J21n7M65n44J53n9k7K08j38J80
$$ 57 23 -200 -56 95 85 46 118 42 74 204 183 128 513 110 231 174 639 95 248 189 162 370 232 412
3680D12j50q3K14j85j30J80j62K17l57J88j62K06o2k86J22L2j03j63L32L4j0j63
$$ 412 262 179 393 208 78 258 96 313 -44 144 -18 188 126 -160 -38 -6 -109 -272 60 94 84 -79
3702g9o3n2NJ45k78l5K99l11j4N9L5n6M8N4K19l84m4J45k33L06L4j18K74j50L
$$ -79 -142 -194 -189 -44 -322 -357 -58 -369 -383 -324 -289 -345 -297 -243 -24 -408 -452 -307 -540 -234 -200 -318 -44 -194 -191
3727a91K2J49o7KJ12K20j87K7q6j76L56O5k84K41M5j82J60J39N9j92K21j84L11
$$ -191 -169 -20 -87 -85 27 247 60 87 1 -175 181 246 -38 203 248 66 226 365 424 232 453 269 580
3750E80m00M7R1m5M0p7m3K45l05L23l9k90J75L6k07r7K94j89q3j25J51nL7j53
$$ 580 180 227 318 273 313 236 193 438 133 456 417 127 302 338 131 34 328 139 56 -69 82 77 114 -39
3774c9KK0K02k71k39J86O2O1j92q5k39K03K73j37o7j13N4O9J5J09m77M81j58j58
$$ -39 -37 -17 185 -86 -325 -139 -77 -16 -208 -293 -532 -329 -56 -193 -260 -373 -319 -250 -235 -126 -603 -122 -280 -438
3798d38N34l85O7J26l11J22K99k38J48j7R4L54l76L00j09k5K4j82K41P8m2n5J7
$$ -438 96 -289 -222 -96 -407 -285 14 -224 -76 -93 1 355 -21 279 170 145 169 -13 228 306 264 209 226
3821B26m3j55L01l60L81j57K09k17rMJ92o53J41PL38K60n19L34q8j79P0J34l22
$$ 226 183 28 329 -31 350 193 402 185 176 180 372 -281 -140 -133 205 465 -54 280 192 13 83 217 -105
3844a05L31m2m26M36l33J00K7l24N08k38q7l5J21l19J16n7J6K88l99L33o8J64
$$ -105 226 184 -242 194 -139 -39 -12 -336 172 -66 -153 -188 -67 -386 -270 -327 -311 -23 -422 -89 -157 7
3866Gj21k53P3J37k05K74L7n53K46K20J72K03n97p4R21l64P24q41j7Q7m0J27J92
$$ 7 -114 -367 -294 -157 -362 -88 -51 -604 -358 -138 34 237 -360 -434 487 123 847 6 -11 76 36 163 355
3889C55l67M97j24o9j41o3M2L54l52NJ39k31J81J65k30nM8j7J66j74l5K41l16
$$ 355 -12 485 361 292 151 88 130 484 132 137 276 45 226 391 161 156 204 187 353 179 144 385 69
3912F9K09L7n26M29j66j14L42l34p7J47j88J93k42k1L64k67j23L0J47p2q6j51
$$ 69 278 315 -211 218 52 -62 280 -54 -131 16 -172 21 -221 -242 122 -145 -268 -238 -91 -163 -249 -400
3934d00K52O6j60j3m17K75M43l60J46J8L0J03l58J55Q6k60L05l1n05M19N8J20
$$ -400 -148 -82 -242 -255 -672 -397 46 -314 -168 -150 -120 -17 -375 -220 -134 -394 -89 -120 -625 -206 -148 -28
3956b8N2l40L31j75J24q3J41O9K6l3p5K40m33L18O9n2K24j71J43J98k65J03k83
$$ -28 24 -316 15 -160 -36 -119 22 91 117 84 9 249 -184 134 203 151 375 204 347 545 280 383 100
3979A00K51K10m67K4K50k34k58K93J30m3k47K26R1k20m7N3P4l14J69k45N8J05
$$ 100 351 561 94 118 368 134 -124 169 299 256 9 235 326 106 59 112 186 -128 41 -204 -146 -41
4001d1j86L9J83j20q9p0L37l16j30Q0l1Lk00N29l01K29q1j07L0Q4J77l21P9K12
$$ -41 -227 -188 -5 -125 -214 -284 53 -263 -393 -313 -344 -341 -541 -12 -313 -84 -165 -272 -242 -158 19 -302 -223 -11
4025a1r6J47k09N4rK48k48L6M6j76L99l27J76J60l24J21n8K28K17k01K54j52J26
$$ -11 -107 40 -169 -115 -124 124 -124 -88 -42 -218 181 -146 30 190 -134 -13 -71 157 374 173 427 275 401
4048D01k34K45j56o1J97m0k31K0J11j1j12J76pj17qp7l8P4Q1j11OP7j76O7j42
$$ 401 167 412 256 195 392 352 121 141 252 241 129 305 298 181 173 96 58 132 213 102 108 185 9 76 -66
4073f6o1L2R0j31r0K78k63M64m56O1l5n6j29K6M78m86K51l53l7J03L19j32j31
$$ -66 -127 -95 -5 -136 -226 52 -211 253 -203 -142 -177 -233 -362 -336 142 -344 -93 -446 -483 -380 -61 -193 -324
4096c24K23M5j34j2KN4n6J18q2L6K15m2n6j29N4J12J26o3Q6j80J74K56m39R8L3
$$ -324 -101 -56 -190 -202 -200 -146 -202 -84 -166 -130 85 43 -13 -142 -88 24 150 87 173 -7 167 423 -16 82 115
4121A15J60j05j3J3N4P9r9J25P3ql06J12J8J01o2m48K97M0J36k36Q4j42Jj3J14
$$ 115 275 170 157 170 224 303 204 329 402 394 88 200 218 319 257 -191 106 146 282 46 130 -12 -11 -24 90
4146I0J8j31KP8L8l72J93k21J90J70j04Q9k99M5q8K3K3m9kK35j41%J6Ok6k69L89
$$ 90 108 -23 -21 57 95 -277 -84 -305 -115 55 -49 40 -259 -214 -302 -279 -256 -305 -307 -72 -213 -213 -197 -191 -217 -486 -97
4173i7K7Mk95K48L6K1l1Q3J05nl33K03K02J7j53K0j69L35J21j10j53L04K5k94
$$ -97 -70 -66 -361 -113 -77 -56 -87 -4 101 96 -237 -34 168 185 32 52 -117 218 339 229 76 380 405 111
4197A11K36l52L03l24L39k52M21k29k76K78J59n18L45j32O7k09J83k47O5j95L32
$$ 111 347 -5 298 -26 313 61 482 253 -23 255 414 -104 241 109 176 -33 150 -97 -32 -227 105
4218A05J28j08m4J29k92J30J48k31K5j66J20q3K5R7J29o2j10r0j8j65L5M13l30
$$ 105 233 125 81 210 -82 48 196 -35 -10 -176 -56 -139 -114 -17 112 50 -60 -150 -168 -333 -298 115 -215
4241b15M3N4k50J55L9J39j07j80j1L04k78K24L06o54M30k0K14o42M52l5l01O92
$$ -215 -172 -118 -368 -213 -174 -35 -142 -322 -333 -29 -307 -83 223 -431 -1 -21 193 -449 3 -32 -333 359
4263C59j192N88K18Q6O61n40M7o38N75L32m55K98j1k67L10k19M6j9J39l9J84n67
$$ 359 -833 -245 -27 59 720 180 227 -411 164 496 41 339 328 61 371 152 198 179 318 279 463 -104
4285a04M52kj02q6J62L6l58Q9N0p5p2K18l15J4j11j18L00j16J35J49j47j05m4
$$ -104 348 346 244 158 320 356 -2 87 137 62 -10 208 -107 -93 -204 -322 -22 -138 -3 146 -1 -106 -150
4308a50m4J57l61n1K02J14j35L32k80J80m6l17L02q7N5j53L69l44K1L8K11l8r3
$$ -150 -194 -37 -398 -449 -247 -133 -268 64 -216 -36 -82 -399 -97 -184 -129 -282 87 -257 -236 -198 13 -25 -118
4331a18J42m5J6J8J36j20J66q7k29L72K8j64M1j57K11k49k5L44P2l67L75j99J48
$$ -118 24 -21 -5 13 149 29 195 108 -121 251 279 115 156 -1 210 -39 -64 280 352 -15 360 161 309
4354C09p2j48J16K21N1l66N7Q0j36R6Q8j18l87L20j29o7j4N9J15O2k04k72K98
$$ 309 237 89 205 426 477 111 168 248 112 208 296 178 -209 111 -18 -85 -99 -40 75 137 -67 -339 -41
4377d1p8O0k20K49j1k22J19k6j85K77R8k81n4M9JK21q0j62K96j04K60l31P8m8
$$ -41 -119 -59 -279 -30 -41 -263 -144 -170 -355 -78 20 -261 -315 -266 -265 -44 -124 -286 10 -94 166 -165 -87 -135
4401a35j35J90O8l1K5Q8J72o0k66J53K36k15J32j34J88j3N4m20K81j22k7J34J39
$$ -135 -270 -80 -12 -43 -18 70 242 182 -84 69 305 90 222 88 276 263 317 -103 178 56 29 163 302
4424C02j64Q3K98l81P5j1p5J05j78M2J95q5k74J86k18K75J13j92l10N52p81N95
$$ 302 138 221 519 138 213 202 127 232 54 96 291 206 -68 118 -100 175 288 96 -214 338 -443 152
4446A52q8k77L23k82K1j29K64l49L26j45k83N07l85K4K62Q8l06k49L89o69P35
$$ 152 64 -213 110 -172 -151 -280 -16 -365 -39 -184 -467 40 -345 -321 -59 29 -277 -526 -137 -806 -71
4467g1L57n40M0j8Q35o33n89K2l04P82n2k21k8J028p40l49N08r28P57k0M84k96
$$ -71 286 -254 -214 -232 603 -30 -619 -597 -901 -119 -171 -392 -420 608 -132 -481 27 -901 -144 -164 320 24
4489B4k8K8j82Q37j047L76J63N2j76k67K10j40L67j19N0L44n95J43K34k29n62
$$ 24 -4 24 -158 679 -368 8 171 223 47 -220 -10 -150 217 98 148 492 -103 40 274 45 -517
4510e17N55K75p06O22l0M0k01M6r6N5m5j38R4J84k44r7N6J18k6p8K5L9q8k41J50
$$ -517 38 313 -393 229 199 239 38 84 -12 43 -2 -140 -46 138 -106 -203 -147 -29 -55 -133 -108 -69 -157 -398 -248
4535b48M7n8M4J25l9j38K32j27J04j5m00J17K83Mn7J43j42K11m23J48Q0J41j47
$$ -248 -201 -259 -215 -90 -129 -267 -35 -162 -58 -73 -473 -356 -73 -69 -126 17 -125 86 -337 -189 -109 32 -115
4558a15l6k20K12j01L35q6K9N5j5Q6JM19m78P1Q8j71J14J56J00m65L24J55k99
$$ -115 -151 -371 -159 -260 75 -11 18 73 58 144 145 564 86 157 245 74 188 344 444 -21 303 458 159
4581A59O6J48j3j76N8r2L9l15L44k09m7r5J85J32N1m0q6j87M9N8k82K91m5Jj57
$$ 159 225 373 360 184 242 150 189 -126 218 9 -38 -133 52 184 235 195 109 -78 -29 29 -253 38 -7 -6 -163
4606a63R6q4k01J43L18n68N30j14q4r5J0o4J84k4om7J83k18P5J4N0J16j86J49
$$ -163 -67 -151 -352 -209 109 -459 71 -43 -127 -222 -212 -276 -92 -116 -122 -169 14 -204 -129 -115 -65 51 -135 14
4630A4Q9k15p2Q9J39k22L71k63J27Q6l98J30M72k06k85L45k48K54K8R3l46K94
$$ 14 103 -112 -184 -95 44 -178 193 -70 57 143 -255 -125 347 141 -144 201 -47 207 235 328 -18 276
4652B76q5M0R3j26J19k48J77J77k69J60l07J60M5J12n3k59M3j22N0j64L56L26
$$ 276 191 231 324 198 317 69 246 423 154 314 7 167 212 324 271 12 55 -67 -17 -181 175 501
4674E01l93j70R9j30K7m0j30J64j25J35l65K41N7n9Q2n3k15K19J05mk28P0J41
$$ 501 108 -62 37 -93 -66 -106 -236 -72 -197 -62 -427 -186 -129 -188 -106 -159 -374 -155 -50 -54 -282 -212 -71
4697g1M7j35m5m2R2j34o7J69J38M6n6k59N8K57k0J18k21N8K16l02J35%OJ08M5
$$ -71 -24 -159 -204 -246 -154 -288 -355 -186 -48 -2 -58 -317 -259 -2 -22 96 -125 -67 149 -153 -18 -18 -12 96 141
4722A41K54l14J36m3j60K9K80%k16J86k60J20K32j18J6j3P3j43l22K94L0j31P7
$$ 141 395 81 217 174 14 43 323 323 107 293 33 153 385 267 283 270 343 200 -122 172 202 71 148
4745A48l14L71k46n5o2O7P2R6j0m7l38oL15j62j19K41l10m2K34l7r1K22J60k34
$$ 148 -166 205 -41 -96 -158 -91 -19 77 67 20 -318 -324 -9 -171 -290 -49 -359 -401 -167 -204 -295 -73 87 -147
4769a47L8k32m0M11j34M1j51j04pM59j36j15K8m4l7K12l9O7R0KM1j48K5k7J72
$$ -147 -109 -341 -381 30 -104 -63 -214 -318 -325 134 -2 -117 -89 -133 -170 42 3 70 160 162 203 55 80 53 225
4794B25j87K63l91K31L06m21J55p6j2rk5J58K6J91m6J0k6l92K46l1j96M48m43
$$ 225 38 301 -90 141 447 26 181 105 93 84 59 217 243 434 388 398 372 -20 226 195 -1 447 4
4817DJ2J18j84L1L9j1j2l89M04R4j04j16j60L31k20r5J83k1kj62J10j2K13l29
$$ 4 16 134 -50 -19 20 9 -3 -392 12 106 2 -114 -274 57 -163 -258 -75 -96 -98 -260 -150 -162 51 -278
4841b78m4J45R6n3M3j88j40L32j10K62j97l3J32j77r6M86k83j43J4R8q4J3K13
$$ -278 -322 -177 -81 -134 -91 -279 -419 -87 -197 65 -132 -165 -33 -210 -306 180 -103 -246 -232 -134 -218 -205 8
4864Hj17p5M03M9k73K12M5r7j8j46J44P2P8l07J96r8J34q8J75p2O6j89l9k3J55
$$ 8 -109 -184 219 268 -5 207 252 155 137 -9 135 207 285 -22 174 76 210 122 297 225 291 102 63 40 195
4889A95K13l79K3o2J30J04l30J40j15K2OJ51O7k56lQ6j68R5m8L1J03j00O7L0k70
$$ 195 408 29 52 -10 120 224 -106 34 -81 -59 -53 98 165 -91 -94 -8 -176 -81 -129 -98 5 -95 -28 2 -268
4914b68K09j21j57J96m6q3j9K75j28j38L27j77oP5k02K33K3l30L07j51K68k33
$$ -268 -59 -180 -337 -141 -187 -270 -289 -14 -142 -280 47 -130 -136 -61 -263 -30 -7 -337 -30 -181 87 -146
4936a46K65j81K86N7j18j68l1L30k93J63L2r0K68j61j59P9M5P2l0k79L20j67J04
$$ -146 119 -62 224 281 163 -5 -36 294 1 164 196 106 374 213 54 133 178 250 220 -59 261 94 198
4959A98P3j66l6J6Pk01L47K05l72l1K52l63O6J2K51k32j17l8J76k54J75J1K33
$$ 198 271 105 69 85 92 -109 238 443 71 40 292 -71 -5 7 258 26 -91 -129 47 -207 -32 -21 212
4982B12l41r1J03k23K8M5J05K55k20Q0J29m22M12k30m4J5j35L6K30K6j91R6L7
$$ 212 -129 -220 -117 -340 -312 -267 -162 93 -127 -47 82 -340 72 -158 -202 -187 -322 -286 -56 -30 -221 -125 -88
5005h8Q0J73r4j9k09L19m12K92m9K31k61Q2J48j18J05K26j28l72R3J94p9Q7p9
$$ -88 -8 165 71 52 -157 162 -250 42 -7 224 -37 45 193 75 180 406 278 -94 -1 193 114 201 122
5028A22J12j3r7N8n8K8r8q6K34p0J14L0j22p2m9LJ85j71j52m4k07M37q2k87J84
$$ 122 234 221 124 182 124 152 54 -32 202 132 246 276 154 82 33 36 221 50 -102 -146 -353 84 2 -285 -101
5053a01R2J14j0J9m24M94j48l30K09r8O3J12J0k25J10o4J36j97J35l47O22j063
$$ -101 -9 105 95 114 -310 184 36 -294 -85 -183 -120 -8 2 -223 -113 -177 -41 -238 -103 -450 172 -891
5075h91J177l07m48k5r9N38k04l77j0K98O82L23j466O33m2N98P42j592nM56k11
$$ -891 286 -21 -469 -494 -593 -55 -259 -636 -646 -348 334 657 -809 -176 -218 380 1122 -470 -475 -19 -230
5096b30Q3M68J19l28l31j0L66J9L59n01K29j8k0j77L3K3m7J33j31K00k6k8Q6m50
$$ -230 -147 321 440 112 -219 -229 137 156 515 14 243 225 205 28 61 84 37 170 39 239 213 185 271 -179
5120a79L33q4r6K08J0k85j64Q5J23j46K33l70L19j18R2k05O4N8j64L8M00n07L13
$$ -179 154 70 -26 182 192 -93 -257 -172 -49 -195 38 -332 -13 -131 -39 -244 -180 -122 -286 -248 152 -355 -42
5143d2l11L23Lj38P6oq7k9J28K45p0j91L63l76q6N31l49J47j0j31K00k47m6K52
$$ -42 -353 -30 -27 -165 -89 -95 -182 -211 -83 162 92 -99 264 -112 -198 333 -16 131 121 -10 190 -57 -103 149
5167A49j72J90j21P0p0N5J13l1k90J93l6J46K1j40j56J17Or0L05j89J2p8R2j90
$$ 149 -23 167 46 116 46 101 214 183 -107 86 50 196 217 77 -79 38 44 -46 259 70 82 4 96 -94
5191i4J58j65J90J78l02J05n11nK97J56L06n28J76k9k44J37J94q9j85M20j44r5
$$ -94 64 -101 89 267 -35 70 -441 -446 -149 7 313 -215 -39 -68 -312 -175 19 -70 -255 165 21 -74
5213g4m1r9K8K79j07k60nR7K02l47L42M2j75J69%j95L81n35N04J08n63K72p4o4
$$ -74 -115 -214 -186 93 -14 -274 -279 -182 20 -327 15 57 -118 51 51 -144 237 -298 206 314 -249 23 -51 -115
5237a15K38L69m01j73R9J31p05Q37J95j96n25L71r2M1J74j50K3L90l64J98l21
$$ -115 123 492 91 -82 17 148 -557 280 475 279 -246 125 33 74 248 98 121 511 147 345 24
5258B4J23p8p5P1M9j33P4L0M6o9K66n26k98K26K5o1M09J30Ml38m3M44n95J8J90
$$ 24 147 69 -6 65 114 -19 55 85 131 62 328 -198 -496 -270 -245 -306 103 233 237 -101 -144 300 -295 -277 -87
5283h7Q3N2k00M4l03N58l05rJ92m85L91n26Q80o01P60m32l55p3M75m52K86K04
$$ -87 -4 48 -152 -108 -411 147 -158 -167 25 -460 -69 -595 285 -316 444 12 -343 -416 59 -393 -107 97
5305I7o52O43l04M23m58N01l84L49j19J10nk58oM10m74J94k32J70r3K92m4N0R2
$$ 97 -555 88 -216 207 -251 250 -134 215 96 206 201 -57 -63 347 -127 67 -165 5 -88 204 160 210 302
5328C02m7rm5k32K24m11J69K96j59J38Np5j68J84l0j55n1j88N38n70J79L75n84
$$ 302 255 246 201 -31 193 -218 -49 247 88 226 231 156 -12 172 142 -13 -64 -252 286 -284 -105 270 -314
5351c14J95j26K06M8k01l5R8J47j42j27j86K87n9nJ81m42M96m28J55J58o3Q6O6
$$ -314 -119 -245 -39 9 -192 -227 -129 18 -124 -251 -437 -150 -209 -214 -33 -475 21 -407 -252 -94 -157 -71 -5
5374ek9L8J05l09J62R9j32L8K6J9n8J70j53J91k61J68J85l72L00k17l5J49j36
$$ -5 -34 4 109 -200 -38 61 -71 -33 -7 12 -46 124 -29 162 -99 69 254 -118 182 -35 -70 79 -57
5397e7J26M8j3%K9k26L68j20l23K34J03N7j8Lq5j09J14j18R5j63L00m3j17J98
$$ -57 69 117 104 104 133 -93 275 155 -168 66 169 226 208 211 126 17 131 13 108 -55 245 202 85 283
5421B83o54M08L5j0j04r1P0l30M25R4n23J99j02L84k40K29j40k04n2M06k03p8
$$ 283 -371 37 72 62 -42 -133 -63 -393 32 126 -397 -198 -300 84 -156 73 -67 -271 -323 83 -120 -198
5443a98K36k67J57R4j50N9j68K00M2k35N7pP1J2J70l63K85J79k43M4K3O2p1J17
$$ -198 38 -229 -72 22 -128 -69 -237 -37 5 -230 -173 -180 -109 -97 73 -290 -5 174 -69 -25 -2 60 -11 106
5467A06j20K51M6j76J93j8j93L00k16k0l6q9O7r5J04O1J70k15o1Q9k57J21O2k02
$$ 106 -14 237 283 107 300 282 89 389 173 153 117 28 95 0 104 165 335 120 59 148 -109 12 74 -128
5491a28L12l41L56l10K74j80l05K68O7o6J58j36m54N04J04j66q3j11L95m47J11
$$ -128 184 -157 199 -111 163 -17 -322 -54 13 -53 105 -31 -485 19 123 -43 -126 -237 158 -289 -178
5512a78j5J5K12m9k90j5L60j54J27j72N6j04O0J40J63k90M18q5j77J08j84J10
$$ -178 -193 -178 34 -15 -305 -320 40 -114 13 -159 -103 -207 -147 -7 156 -134 284 199 22 130 -54 56
5534E6k12j46M89R7j98p4o4L21k20M6L6p5j20L30j09J91j00l81J45m3K25mj03
$$ 56 -156 -302 187 284 86 12 -52 269 49 95 131 56 -64 266 157 348 248 -133 12 -31 194 190 87
5557H7M9k21K07K18m30O43n43oj00J66j7r1L73j75k65L51k04J38l31l23M59m8
$$ 87 136 -85 122 340 -90 553 10 4 -96 70 53 -38 335 160 -105 246 42 180 -151 -474 -15 -63
5579f3L4N9M8m1o1M1l94K12J28j25l08M39j11Q2j29kJ58m7j48J33k1K39j01l3
$$ -63 -29 30 78 37 -24 17 -377 -165 -37 -162 -470 -31 -142 -60 -189 -191 -33 -80 -228 -95 -116 123 22 -11
5603a1m6l7J28l29J98L7K5j22J91oJ63k1j27pm1k51K01J06o6K64j48q7Q8R9k35
$$ -11 -57 -94 34 -295 -97 -60 -35 -157 34 28 191 170 43 36 -5 -256 -55 51 -15 249 101 14 102 201 -34
5628c4K91j87J62M7j89j94O1J53o1j58L3J04l1k1j15L10n1j88K92l00J95K2j55
$$ -34 257 70 232 279 90 -104 -43 110 49 -109 -76 28 -3 -24 -139 171 120 -68 224 -76 119 141 -14
5651a4m9K03k69j59L32P4l05J44j7l2O3R6n6k09N5J46k13K06k25K50k19P8J16
$$ -14 -63 140 -129 -288 44 118 -187 -43 -60 -92 -29 67 11 -198 -143 3 -210 -4 -229 21 -198 -120 -4
$$ [...]
8191a22
##END NTUPLES=NMR FID
##END=
