##TITLE=1H_SR95chl
 CDCl3
 8 sc, 
 28.10.2021
##JCAMPDX= 6.0         $$ Bruker NMR JCAMP-DX V2.0
##DATA TYPE= NMR FID
##DATA CLASS= NTUPLES
##ORIGIN= UXNMR, Bruker Analytische Messtechnik GmbH
##OWNER= root
$$ XWIN-NMR		Version 3.5
$$ Thu Oct 28 11:40:44 2021 Russian Standard Time (UT+4h)  she@DPX200
##.OBSERVE FREQUENCY= 200.1313468511
##.OBSERVE NUCLEUS= ^1H
##.DELAY= (6, 6)
##.ACQUISITION MODE= SIMULTANEOUS
##.ACQUISITION SCHEME= undefined
##.AVERAGES= 8
##.DIGITISER RES= 18
##SPECTROMETER/DATA SYSTEM= spect
##.PULSE SEQUENCE= zg30
##.SOLVENT NAME= D2O
##.SHIFT REFERENCE= (INTERNAL, D2O, 0, 15.7039)
##AUDIT TRAIL= $$ (NUMBER, WHEN, WHO, WHERE, WHAT)
$$ ##TITLE= Audit trail, XWIN-NMR		Version 3.5
$$ ##JCAMPDX= 5.01
$$ ##ORIGIN= Bruker BioSpin GmbH
$$ ##OWNER= she
$$ F:/spectra/data/she/nmr/H-F/1/audita.txt
$$ ##AUDIT TRAIL=  $$ (NUMBER, WHEN, WHO, WHERE, WHAT)
(   1,<2021-10-28 11:39:05.15 +0400>,<she>,<DPX200>,
      <created by zg, POWCHK disabled, PULCHK disabled
       configuration hash MD5:
       00 E9 B6 7A A2 85 ED C7 34 08 36 98 17 FE 4E 26
       data hash MD5: 16K
       31 86 09 DD A0 C2 E2 A6 13 C2 D6 8C B0 76 75 60>)
$$ ##END=
$$ 
$$ hash MD5
$$ 3D AE B7 9D 2D C2 0C FB 0F 42 F0 B1 B1 A3 2F E1
##$RELAX= 
##$RELAX= 
##$RELAX= 
##$RELAX= 
##$RELAX= 
##$RELAX= 
$$ Bruker specific parameters
$$ --------------------------
##$DU= <F:/spectra>
##$EXPNO= 1
##$NAME= <H-F>
##$PROCNO= 1
##$TYPE= <nmr>
##$USER= <she>
##$AMP= (0..31)
100 100 100 100 100 100 100 100 100 100 100 100 100 100 100 100 100 100 
100 100 100 100 100 100 100 100 100 100 100 100 100 100 
##$AQSEQ= 0
##$AQ_mod= 1
##$AUNM= <au_zg>
##$AUTOPOS= <>
##$BF1= 200.13
##$BF2= 200.13
##$BF3= 200.13
##$BF4= 200.13
##$BF5= 200.13
##$BF6= 200.13
##$BF7= 200.13
##$BF8= 200.13
##$BYTORDA= 1
##$CFDGTYP= 0
##$CFRGTYP= 5
##$CHEMSTR= <none>
##$CNST= (0..31)
1 1 145 1 1 1 1 1 1 1 1 1 1 1 1 1 1 1 1 1 1 1 1 1 1 1 1 1 1 1 1 1 
##$CPDPRG= <>
##$CPDPRG1= <>
##$CPDPRG2= <>
##$CPDPRG3= <>
##$CPDPRG4= <mlev>
##$CPDPRG5= <mlev>
##$CPDPRG6= <mlev>
##$CPDPRG7= <mlev>
##$CPDPRG8= <mlev>
##$CPDPRGB= <>
##$CPDPRGT= <>
##$D= (0..31)
0 1.2 0 0 0 0 0 0 0 0.06 0 0.03 0 0 0 0 0.0002 0 0 0 0 0 0 0 0 0 0 0 0 
0 0 0 
##$DATE= 1635406744
##$DBL= (0..7)
120 120 120 120 120 120 120 120 
##$DBP= (0..7)
150 150 150 150 150 150 150 150 
##$DBP07= 0
##$DBPNAM0= <>
##$DBPNAM1= <>
##$DBPNAM2= <>
##$DBPNAM3= <>
##$DBPNAM4= <>
##$DBPNAM5= <>
##$DBPNAM6= <>
##$DBPNAM7= <>
##$DBPOAL= (0..7)
0.5 0.5 0.5 0.5 0.5 0.5 0.5 0.5 
##$DBPOFFS= (0..7)
0 0 0 0 0 0 0 0 
##$DE= 6
##$DECBNUC= <off>
##$DECIM= 32
##$DECNUC= <off>
##$DECSTAT= 4
##$DIGMOD= 1
##$DIGTYP= 9
##$DL= (0..7)
0 120 120 120 120 120 120 120 
##$DP= (0..7)
150 150 150 150 150 150 150 150 
##$DP07= 0
##$DPNAME0= <>
##$DPNAME1= <>
##$DPNAME2= <>
##$DPNAME3= <>
##$DPNAME4= <>
##$DPNAME5= <>
##$DPNAME6= <>
##$DPNAME7= <>
##$DPOAL= (0..7)
0.5 0.5 0.5 0.5 0.5 0.5 0.5 0.5 
##$DPOFFS= (0..7)
0 0 0 0 0 0 0 0 
##$DQDMODE= 0
##$DR= 18
##$DS= 0
##$DSLIST= <SSSSSSSSSSSSSSS>
$$ [...]
##$SUBNAM2= <"">
##$SUBNAM3= <"">
##$SUBNAM4= <"">
##$SUBNAM5= <"">
##$SUBNAM6= <"">
##$SUBNAM7= <"">
##$SUBNAM8= <"">
##$SUBNAM9= <"">
##$SW= 18.0517286264689
##$SWIBOX= (0..15)
0 0 2 0 0 0 0 0 0 0 0 0 0 0 0 0 
##$SW_h= 3612.71676300578
##$TD= 16384
##$TD0= 1
##$TE= 0
##$TE2= 300
##$TE3= 300
##$TEG= 300
##$TL= (0..7)
0 120 120 120 120 120 120 120 
##$TP= (0..7)
150 150 150 150 150 150 150 150 
##$TP07= 0
##$TPNAME0= <>
##$TPNAME1= <>
##$TPNAME2= <>
##$TPNAME3= <>
##$TPNAME4= <>
##$TPNAME5= <>
##$TPNAME6= <>
##$TPNAME7= <>
##$TPOAL= (0..7)
0.5 0.5 0.5 0.5 0.5 0.5 0.5 0.5 
##$TPOFFS= (0..7)
0 0 0 0 0 0 0 0 
##$TUNHIN= 0
##$TUNHOUT= 0
##$TUNXOUT= 0
##$USERA1= <user>
##$USERA2= <user>
##$USERA3= <user>
##$USERA4= <user>
##$USERA5= <user>
##$V9= 5
##$VALIST= <valist>
##$VCLIST= <CCCCCCCCCCCCCCC>
##$VD= 0
##$VDLIST= <DDDDDDDDDDDDDDD>
##$VPLIST= <PPPPPPPPPPPPPPP>
##$VTLIST= <TTTTTTTTTTTTTTT>
##$WBST= 1024
##$WBSW= 4
##$XGAIN= (0..3)
0 0 0 0 
##$XL= 0
##$YL= 0
##$YMAX_a= 584790
##$YMIN_a= -869536
##$ZGOPTNS= <>
##$ZL1= 120
##$ZL2= 120
##$ZL3= 120
##$ZL4= 120
##$ABSF1= 10
##$ABSF2= 0
##$ABSG= 5
##$ABSL= 3
##$ALPHA= 0
##$AQORDER= 0
##$ASSFAC= 0
##$ASSFACI= 0
##$ASSFACX= 0
##$ASSWID= 0
##$AUNMP= <proc_1d>
##$AZFE= 0.1
##$AZFW= 0.1
##$BCFW= 1
##$BC_mod= 2
##$BYTORDP= 1
##$COROFFS= 0
##$CY= 11.3945322036743
##$DATMOD= 1
##$DC= 2
##$DFILT= <>
##$DTYPP= 0
##$F1P= 2.36226072786647
##$F2P= -0.459571619588291
##$FCOR= 0.5
##$FTSIZE= 0
##$FT_mod= 4
##$GAMMA= 1
##$GB= 0.15
##$INTBC= 1
##$INTSCL= 1
##$ISEN= 128
##$LB= 0.24
##$LEV0= 0
##$LPBIN= 0
##$MAXI= 10000
##$MC2= 0
##$MEAN= 0
##$ME_mod= 0
##$MI= 1.114404
##$NCOEF= 0
##$NC_proc= 0
##$NLEV= 6
##$NOISF1= 3.799351
##$NOISF2= 2.8
##$NSP= 1
##$NTH_PI= 0
##$NZP= 0
##$OFFSET= 15.70392
##$PC= 1
##$PHC0= -15156.23
##$PHC1= 16.20082
##$PH_mod= 1
##$PKNL= yes
##$PPARMOD= 0
##$PSCAL= 0
##$PSIGN= 0
##$REVERSE= no
##$SF= 200.130013532006
##$SI= 16384
##$SIGF1= 3
##$SIGF2= 2
##$SINO= 400
##$SIOLD= 16384
##$SREGLST= <1H.CDCl3>
##$SSB= 0
##$STSI= 0
##$STSR= 0
##$SW_p= 3612.71676300578
##$SYMM= 0
##$S_DEV= 0
##$TDeff= 0
##$TDoff= 0
##$TI= <>
##$TILT= no
##$TM1= 0
##$TM2= 0
##$TOPLEV= 0
##$USERP1= <user>
##$USERP2= <user>
##$USERP3= <user>
##$USERP4= <user>
##$USERP5= <user>
##$WDW= 1
##$XDIM= 8192
##$YMAX_p= 0
##$YMIN_p= 0
$$ End of Bruker specific parameters
$$ ---------------------------------
##NTUPLES= NMR FID
##VAR_NAME=  TIME,          FID/REAL,        FID/IMAG
##SYMBOL=    X,             R,               I
##VAR_TYPE=  INDEPENDENT,   DEPENDENT,       DEPENDENT
##VAR_FORM=  AFFN,          ASDF,            ASDF
##VAR_DIM=   8192,          8192,            8192
##UNITS=     SECONDS,       ARBITRARY UNITS, ARBITRARY UNITS
##FACTOR=    0.0002768,     1,               1
##FIRST=     0,             0,               0
##LAST=      2.2672688,     0,               0
##MIN=       0,             -869536,         0
##MAX=       2.2672688,     584790,          0
$$ Real data points
##PAGE= N=1
##DATA TABLE= (X++(R..R)), XYDATA
0@%%%%%%%Qj6J6j6K4m0M8n6P2q8J12j37J61j93K33k80L36l95M59n36O22p19Q26
30D41r45J079j230J397j580J782k001K244k517K812l132L482l865M288m747N246
46B754n792O389p045P765q553R420j0380J1446j2639J3976j5485J7211j9205K1535
60A1397k4298K7641l1788L7088m4129N3996o8928R4458j49729M78529l58580n24338
72d98681P02095m26049j49053P37525K4836o28193K42627k8284m54335M48637
82b8875N38874o33091k05544N03911k70820l67815O36129K23536m85802M9277
92d0220J62105l91034J16302M85099k49499k34606L98408j79425m87192M26508
102F446L78919m16060m194K89503l60055j87213L87177n0539j73162L52678n9702
$$ y = [0, 0, 0, 0, 0, 0, 0, 0, 8, -8, 8, -8, 16, -24, 24, -32, 40, -48, 64, -73, 88, -105, 128, -152, 184, -211, 248, -288, 334, -385, 441, -504, 575, -655, 742, -838, 944, -1057, 1187, -1330, 1482, -1650, 1832, -2033, 2255, -2492, 2754, -3038, 3351, -3694, 4071, -4482, 4938, -5442, 6004, -6635, 7341, -8144, 9067, -10138, 11397, -12901, 14740, -17048, 20040, -24089, 29907, -39021, 55437, -94292, 384237, 25657, -498681, 203414, -222635, -371688, 365837, 390673, -237520, 5107, -23177, -477512, -28875, 509999, -123092, -328636, 175275, -95545, -463360, 172769, 396305, -89497, -40220, 121885, -269149, -152847, 332252, 82753, -151853, 246555, 67130, -420062, 6446, 385365, -30695, -34889, 254614, -105441, -292654, 94523, 43984, -129178, 223500, 163798]
113A63798m91306K38282L22342l91489r474M33935k54736l28561L12779R6039
123I1609j71183K12288M8080l36333M9202J82808k22171N7787M10179j38417l40347
134a56498J62937P3730k26375J07494K04495j38884n1561R6558j46938m9800K42919
145A18077n3833k36971J57967J23946k24393K5412K15887j11407j17691J02427
155e79l0699l5293J58965j8358j56106J04261P2366j87961K6749K15667p8578
166G0434j40404Q9868J9639p4387N1288K1599n7766M2277J0493j10838L0251J25248
178G7702p6230r9671R7591L8328q9929J9154O2100k8614p578P461m0172K9014
190a0844O4770o0692m9028R9710K8005r6883J8275P4158n3470n1480K5143N818
$$ y = [163798, -327508, -89226, 233116, -158373, -167847, 266088, 11352, -317209, -4430, 91609, -79574, 132714, 180794, -155539, -106337, 76471, -145700, -87913, 322266, 183849, -156498, 6439, 80169, -146206, -38712, 165783, 26899, -24662, 71896, -75042, -124842, 118077, 64244, -172727, -14760, 109186, -115207, -89795, 126092, 14685, -103006, -579, -31278, -66571, 92394, 74036, -82070, 22191, 94557, -93404, -66655, 149012, 70434, -69970, 19898, 39537, -34850, 16438, 38037, -19729, 22548, 33041, -77797, -47546, 77702, 1472, -98199, -608, 37720, -52209, -33055, 29045, 431, -7147, 314, -39858, -10844, 53926, -6766, -55794, 43916, 71921, -24962, -6687, 67471, 14001, -37479, -12336, -6518]
202f518K0845L1716m2654j7020N5423l5998q9798M7789P9787m6354l7263M7136
214G091R494l2476j2538J70L3328L0842m7040l2810N7534K1078n8589M510P1190
227E1784l595n8156n886K3877P849m130j9598L721L9386j5096n9638K0413O1159
240D2090l2245o2378K6111M1743k2019j9015J7869J7995L791k8517k9329M2630
252a274M4829m6596l6486N3093K5654m9725j0451M8767J4827l2890k8868N223
264a3897L5246L466m5542K578N7376j3545o7083J2568N7321j6546m8670J1370
276b5358L5562o07k3510j3616K1008L1985k3943m2353L4771N0817l8657m5836
288c9737M2870M2257l4439l1895K3266K5139j0164k9508o172L9615J7346n1693
$$ y = [-6518, 14327, 46043, 3389, -13631, 41792, 5794, -84004, -36215, 43572, -2782, -40045, 7091, 16585, -15891, -28429, -28259, 5069, 35911, -11129, -43939, 13595, 34673, -23916, -19406, 51784, 48189, -9967, -15853, 8024, 15873, 11743, -7855, -4134, 35252, 20156, -39482, -19069, 42090, 9845, -52533, -26422, 15321, -6698, -25713, -7844, 10151, 13942, -14575, -43904, -1274, 43555, -3041, -39527, 13566, 39220, -10505, -20956, 27811, 42638, 9748, -19120, -13897, 21349, 24815, -20727, -18149, 39227, 25682, -41401, -28833, 28488, 11942, -36728, -25358, 10204, 9597, -13913, -27529, -6521, 25464, 1521, -40832, -6061, 44756, 6099, -39737, 3133, 45390, 10951, -20944, 2322, 27461, 17297, -12211, -18383, 21232, 38578, -13115]
300a3115k4276N2712J6688n7085j4979N0626J2359m0036j4639K7600K3983j6673
312C165l7581J1227N1608r644n3689J9097N7364k0519n0031K0869M1309j1811
324B1364l1315k284K4032J7859k5637l1911L1009L6063m2291m0382M1874L3585
336C1966l9267k8905K8813K5182j5580k7814K818L5549O312m4282o020N4769Q187
349C1728n1126j974M5495K574l4412p375K4577J8925j7813l2486J7433M2740k3906
362A4380m9640K6460M1511l2479l3910K5935K3497j4099j9490k260K1682J7416
374A9003k9709k5615L9716K5693m3797j4268M7788J0077l5964o693K0916J1698
386A8845n665k1769j839L4799J98m7110P612N0772j8584m8276J7437K9276j6423
$$ y = [-13115, -37391, 15321, 32009, -25076, -40055, 10571, 22930, -17106, -31745, -4145, 19838, 3165, -34416, -23189, 28419, 18775, -34914, -15817, 41547, 21028, -29003, -8134, 33175, 21364, -9951, -12235, 11797, 29656, 4019, -27892, 3117, 39180, -3111, -43493, -1619, 31966, -7301, -36206, -7393, 17789, 2209, -25605, -22787, 12762, 19074, -25208, -31228, 23541, 31728, -19398, -21372, 24123, 26697, -7715, -15090, 9487, 28412, 10599, -21887, -4454, 38286, 14380, -35260, -8800, 32711, 232, -33678, -7743, 15754, 1655, -17835, -20095, 1587, 19003, -10706, -36321, 3395, 29088, -14709, -28977, 18811, 28888, -7076, -13769, 7147, 18845, 13180, -8589, -10428, 24371, 24569, -22541, -14929, 35843, 17259, -31017, -13580, 15696, -727]
399g27j4505N804Q291J2063j2446l2079K1160M1592l1211l5834M2478K4318m2227
412a3323p473L7115M012j5101n708o799J2936J7729k6003j4337M1563L404n2244
425b4229L268M4590r961k8392Q881O268p923j442q799P164L4395r427m6895J3749
439a8753L8253k5700k1396M0755J6031l3153j0229J1955O537J3944l329k1400
451f485J4507J5100l9665j2663N3233J0175m5187k326K2826j3095j2458R898O730
464E90Q751m282l2015Q99M0411m037l1861K0079K4959k8610k0234K3101J7547
477A5298k653p566j0390P218J6172j6702j6004L1374J5535m0083j8061L0972R159
490A4269k0769p65J4942J279j4005j7191L519K7347K937k7708K314K7194j0311
$$ y = [-727, -15232, -9428, -1137, 10926, -1520, -33599, -12439, 29153, -2058, -37892, 4586, 28904, -13323, -20796, 16319, 20331, 5230, -478, -7277, 5659, 23388, -2615, -16952, 24611, 28015, -24229, -20961, 23629, 13668, -14724, -5843, 425, -7498, -8940, -17739, -10575, 23820, 14393, -32502, -18753, 19500, -6200, -27596, 13159, 29190, -3963, -14192, -2237, 4300, 18244, 14915, -6485, 8022, 23122, -16543, -29206, 24027, 34202, -10985, -13311, 9515, -3580, -16038, -6140, 590, 9341, 5059, -26956, -26057, 14354, 10317, -21544, -1465, 23494, -5116, -25350, -2249, 15298, 12645, 5079, -5311, 1907, 18079, 1377, -14627, 16747, 32282, -7801, -25862, 5110, 14269, -6500, -7265, 7677, 8956, -5049, -22240, -18721, 8626, 11563, -16145, -13831, 13363, 3052]
503C052k8072J2962L0770j402k0979n359J3997N881j7888o445K9998J7069k7334
516F250j9822J4294Q376j3202p095J3528J8398j0451l4008m96L2836J45k5236
529a6483J1395K2714j9067k6497P020K3037J4420o969j8250Q112J7678k3189j9678
542b5757L8691K5222l6811k1213K3008P425r252M050L129J223p35k8590j4331
555c3941M4612K2106m3758j0586L4852j5443l3074K7786L0661j2252j2649j3808
567a5494j3685K8274K3319k6065N821L8512l6093n4307L8529M5972k1982q552
579D249J4237j9914j4552R576m338J8334L7442l4823n5718K9137K9735l5741O422
592a5954N1793j5037m5796K753R463M764K6677l383k9111J7303J1026m2787O971
$$ y = [3052, -25020, -12058, 18712, 17310, -3669, -9028, 4969, 10850, -7038, -13483, 16515, 33584, 6250, -13572, 722, 9098, -4104, -11199, 2329, 20727, 10276, -23732, -24228, 8608, 8753, -16483, -5088, 17626, -1441, -27938, -20918, 2119, 16539, 9570, -8680, -568, 17110, -6079, -25757, 12934, 38156, 1345, -19868, 3140, 10565, 1313, 5363, 8492, 9715, 8980, -19610, -33941, 10671, 32777, -10981, -21567, 13285, -2158, -35232, -7446, 23215, 10963, -1686, -15494, -29179, -905, 22414, -3651, 2170, 40682, 4589, -49718, -11189, 34783, 12801, 4249, 18486, -1428, -15980, -6404, -10742, 7592, 45034, 10211, -45507, -16370, 13365, -22376, -15954, 35839, 20802, -24994, -22241, -12778, -8014, 18663, 15280, -13831, 3472, 14498, -28289, -21318]
605b1318O4461q748n3419J0897J9646k1729M338K3601o736k324j485l5015J855
618b5976N3037n449m3736J9542J9522m3330j0001M5119J2092j4170l274j6403
630a3027p388K3649j063j4216L2029J4965n0020j7133M2737Q807k1099J1460J0224
643A9925j9834j1084n25R51K3147J2781l0308j2419K5398p683k8879K1181K9716
656B2367j8828k0147Q876M796l6M340m043L661J4583j3428k2652J9744K2592k0149
670A676j3147K1040O459j7149m144R079M947l823j2246l562J5886N441j8812k873
684a1228K0097k302k3067J670K0100J6j3171J05R465K344o626n897Q289J4486
698A4281o368j6853O659J5277r617j3301J2616J4189r059j3337K208P919j486
$$ y = [-21318, 43143, 34395, -19024, -8127, 11519, -10210, -5872, 17729, 10993, 8669, 7184, -27831, -25976, 27061, 21612, -22124, -2582, 16940, -26390, -36391, 8728, 20820, 6650, 3376, -13027, -20415, 3234, 2171, -12045, 19984, 34949, -15071, -32204, 10533, 19340, -1759, 9701, 19925, 91, -10993, -11518, -10567, 12580, 25361, -4947, -17366, 8032, 349, -28530, -7349, 22367, 3539, -16608, -7732, -2936, -2972, 1368, -2675, 986, 15569, 2141, -20511, -767, 21825, 1676, -11471, 9569, 16028, -1121, -5265, 3814, 8761, 4938, -7308, -10870, 5016, 10457, -8355, -11228, 8869, 6567, -16500, -14830, 5270, 5286, -7885, -7780, 1685, 4029, -2597, -8494, -205, 14281, 7913, -8940, -2281, 12996, 3379, -9922, 2694, 16883, 7824, -5513, -3305, 4614, 3128]
711C128r475j231J2199L669j5203p764J3874Q111j3015o606J4372O582j5176p711
725a4246J3034J0587o304p850N544J0043m679j4524L229J7980j516j8037K915
738c824J6196n147j5122K939J1237M5j0276o048Q215Q647j0179j2060J2421J3707
752A0751j2813j2293J3370J0419j1373r355Q539J0726j886r119K3J2090K294j5763
766d390m125J7797M888j8386m055J6091J854j4846l488J0521O243q532j1597N489
780f536J3882o714j6025R126J7529q949j5267P866J2733m008j0164R08J1959M861
794A1201j2285p382J4548R116j5842q830J5380P780j4989q240J0478Q160p716
807A379j0353L994J2008l061j5796Q59J6757l28j6901J366J6903j46j4185j206
$$ y = [3128, -6347, -7578, 4621, 8290, -6913, -14677, -803, 7308, -5707, -12313, 2059, 8641, -6535, -14246, -1212, 9375, 3071, -4779, 765, 10808, 6129, -8395, -5166, 12814, 11298, -6739, -3824, 12372, 7225, -7897, -4958, 6279, 6324, -3952, -10000, -1785, 6862, -3317, -15377, -2956, 10751, -2062, -14355, -985, 9434, -1939, -11294, -2755, 7971, 6085, -3034, -3011, 9079, 11373, -4390, -8515, 9282, 14170, -4216, -8271, 7820, 9674, -5172, -8660, 1861, 8104, -428, -12025, -6536, 7346, 632, -15393, -6267, 11262, 2313, -12954, -5088, 7645, 3637, -6527, -5619, 6340, 11201, -1084, -8466, 6082, 15198, -644, -9474, 5906, 13686, -1303, -9543, 935, 9095, 1379, -8974, -4980, 7028, 3967, -11829, -10970, 5787, 5459, -11442, -10076, 6827, 6681, -7504, -8710]
821h710J2596M954r538p559J0505J1374j0493j2715J1350J3208j1301j2354R035
834C52J0330p495j0875K623J0967L16j3102l583J4144L648j5941m541J5807M920
848G570j4031m238J2450O237r034o951P185J0267m565j1929M355J4557l934j4779
862f840L807J4332l884j3709J860J0892n02j0274l501Q896N796r667q873R961
876a706R601j1049r926J1514R648r322p743P572Q164m128p539J832R959J316j1092
891b899k767J3154L082j3533k649J3137J132j2966k435R476K720o965m897L694
905b716O796l777j0227M045J2826m441j3493N237J2141m786q624N873P797k321
919D330o532j964O842O038o557p066Q471O753j1496o760J2164N453j0920m896
$$ y = [-8710, 3886, 8840, -698, -8257, 2248, 13622, 3129, -9586, 1764, 14972, 3671, -8683, 352, 10682, 3187, -7688, -5065, 5902, 6218, -6884, -10467, 3677, 7325, -8616, -13157, 2650, 7570, -6461, -10699, 1751, 7988, -1046, -7997, -812, 9455, 4890, -7039, -2684, 11873, 7939, -6840, -3033, 11299, 7415, -6294, -4434, 6458, 5956, -4318, -7819, 1077, 6873, -2794, -11667, -1706, 7895, -3154, -13080, -1566, 8082, -1240, -8983, -1411, 6753, 2625, -4914, -3082, 6877, 8193, -2899, -5666, 7488, 10570, -2963, -5612, 7525, 8657, -4309, -6744, 2732, 5452, -1513, -6410, -2716, 4080, 303, -9924, -5879, 6947, 2506, -10987, -5750, 6391, 1605, -7019, -1146, 6651, 4330, -2202, -4166, 2676, 8714, 2157, -4909, 3562, 10315, -1181, -7941, 4223, 9676, -1244, -6140]
933f140N544K724l754l242J465O561J03j1076j968J2844J859j1445J309J1674
947F458l381j0348L813R122R67m405l986J702N428k780p666O757J0865r726j2169
962i349Q017Q159p543m265O193J560m650m907l77P606N827q066o380R079L251
977D155j1879j7J5069J042j1347r78O031J135j241j025J043M890k090j2071J681
992e602J5173k139j3152M135Q603r186q161P888O722k144m093m852J635P448l053
1007g78o984J0394R042j5146r746J3788P105q501N96P345k314m804l265j133R186
1022D785P469j2094p956J2621L45j6592N466J7795n680j3046K052J745j738M194
1036f34m94j547R725k791j8880N619K0731o674j3205J2720N404j5542k070J0806
$$ y = [-6140, -596, 2128, -1626, -4868, -3403, 3158, 3261, -7815, -9783, 3061, 4920, -6525, -5216, 6458, 3077, -7271, -3458, 5664, 6631, 2226, -1760, -58, 5370, 2590, -5076, 1681, 12546, 2820, -9349, -1332, 6827, -716, -4981, 1212, 2772, -1878, -6785, -7162, 444, 6271, -1795, -8175, 904, 4155, -7724, -7741, 7328, 8370, -2977, -3955, 2076, 3211, 1970, 945, 1988, 6878, 4788, -7283, -5602, 9571, 7432, -5720, -1585, 7018, -2168, -10329, -2441, 4281, 2137, -1956, -6808, -5173, 2275, -778, -7762, 2632, 11674, -3472, -13218, 570, 7675, -826, -230, 7115, 4801, -3, -3268, -4401, 4785, 12254, 160, -7796, 4825, 5170, -11422, -5956, 11839, 6159, -6887, -4835, -3090, -4828, -634, -1128, -2675, 7050, 4259, -14621, -9002, 11729, 5055, -8150, 4570, 9974, -5568, -7638, 3168]
1050C168J743K398K58j2597k76J2637q040j0463J8954Q322k3848o328J7171j396
1064A703p644Q285J126p159K246m530o943J7647J1556k0591n712J9181p555j6748
1078a5138J6758J4452j2496m751K338p722N169J1479r714k611J6211j1619k3653
1091b1297J5915J9726j5047n444J3851p341j2035P508K450r00J2290m448j9767
1104a4539R568J5418j6046l654K4113k911k2515N387J0536o889L476O762r862
1117a156O70Q159j3850m884K3300o79k3625O012J4389j3748m514J5145j026p376
1131c183L987n808n213J5438K446j6422P128J3772j6462q925J9876M660j3178
1144a884K680L667q084K441N089o401M987R676j4243j0612J5955L605j5204N082
$$ y = [3168, 4911, 7309, 7567, -5030, -5306, 7331, -709, -11172, 7782, 16104, -7744, -14072, 3099, 1703, -5941, 2344, 3470, -3689, -1443, -5973, -12916, 4731, 16287, -4304, -10016, 9165, 1610, -15138, 1620, 16072, 3576, -1175, 1163, -6559, -1390, 10089, 375, -2236, 13975, 2356, -21297, -5382, 14344, -703, -6147, 7704, 363, -11672, -4164, -1714, -2614, 9676, 5228, -14539, -4971, 10447, -5599, -9253, 14860, 11949, -10566, -5179, 5357, -1532, 1944, 8706, -1156, -486, 7673, -6177, -11061, 12239, 11560, -12065, -6053, 8336, -5412, -9926, 5219, 4193, -3183, 804, -5004, -10217, 5221, 7667, -8755, -1627, 12145, -4317, -13242, 6634, 11294, -1884, 796, 4463, -3621, -1180, 3909, -2492, 2495, 12171, -2072, -12684, 3271, 6876, -8328, -3246]
1158c246J2084r972p583P007j65j39O727n046o359R871N58j3335O380J4763q951
1173B594r288R742K566p789K253L473k831K272m07q197M386R285q180p427J0494
1188B946K406j2046P94Q962k427l870J560p48J046L698m288k315Q565R4j0740
1203f363K622J0265l584o002N701K460m258j469K9O38M126j475o375K780N575
1218D670o682m778Q304L463p168k417L743L42j639n61P49L997J164n914j696P203
1234B780J089p021J336P123j601o031J042M375M35k498k176J716L418l425n628
1249e066L821N661m445n397M447M064m038l763K274L953p57l894m13N372J781
1264C600n625j460O201J599n509j210N265J888m552k626L640L474k998m534K440
$$ y = [-3246, 8838, -1134, -8717, -1710, -1875, -2014, 4713, -333, -6692, 3179, 3737, -9598, -3218, 11545, 2594, -6694, 3048, 5614, -2175, 78, 3551, 720, 2992, 2585, -5612, -1226, 8059, -121, -7548, 2946, 5352, -6694, -5900, 3062, 635, -3235, -1675, -2423, -1377, 2321, -1967, -4282, 4283, 4377, -6363, -3741, 6524, 2940, -3062, 2639, 5099, 841, -628, -599, 39, 4165, 2690, -3685, -905, 4670, -2012, -6790, 1514, 4977, -2191, -4608, -865, -523, -2162, -2723, -1974, 2023, 3187, -2727, -4423, 2780, 3869, -3152, -1816, 5307, 3706, -2325, -1283, 3092, 3527, 1029, -1147, 569, 3987, 562, -5066, -1245, 4416, -29, -5426, -979, 3085, -953, -4716, -2442, 1511, 754, -3140, -3553, 1819, 3600, -2025, -3485, 2716, 4315, -1194, -2404, 2861, 4749, 197, -2429, 1211, 4685, 1687, -2847, -407]
1279d07M630l112n907J913N901j729n367Q57N276o55n494m41N574J899m909k297
1295d268N420L063n160k623N142L708m118l892L107M282k572m846J818N735j780
1310C016o171Q07N402r65n492l21N137Q47m704k274M649L144m698l449M703M263
1326C894m168l959L908M567k692m066K152M773j075n346K10N380L74n884q17N824
1342C075Q40n892j848M728J925m480k784L549L409l236m173K937M920k453m807
1357d290K671M753j558m389J027M635M91m310j071M773J617m913k080M531K243
1372D130m401k716L608K526l265l492K015L882j726m720J495M959j455m976J419
1387b717M817n17l837J5L652J208l341j659L943K991l867l181L795L053m026k701
$$ y = [-407, 4223, 1111, -4796, -2883, 3018, 1289, -4078, -3221, 2055, 1400, -4094, -4535, 1039, 2938, -1971, -4268, 1152, 4215, -945, -3568, 1574, 5282, 1164, -2728, 379, 4661, 2089, -2757, -939, 4796, 3016, -3155, -2348, 3054, 2089, -3403, -3724, 1413, 2260, -2444, -4718, -69, 3075, -1623, -5072, -369, 3894, -274, -4233, -325, 4242, 1550, -2516, -364, 4409, 3334, -2012, -1802, 3578, 3952, -1932, -2749, 3075, 3915, -1977, -3825, 903, 2828, -1652, -4436, -887, 2522, -714, -4887, -1950, 2970, 517, -4290, -1619, 3134, 1576, -2813, -1786, 2849, 3340, -970, -2041, 2732, 4349, -564, -2644, 1887, 4130, -271, -2987, 621, 3147, -118, -3610, -1595, 2287, 561, -4159, -2664, 2295, 840, -4136, -2717, 2100, 1583, -2254, -2239, 1413, 2621, -720, -2379, 1564, 4555, 688, -2493, 1302, 4355, 329, -2372]
1403b372L424K271k886k639Q83K700J14l774p16M488J01n399l0N382M4m293O82
1420b020K959K0j785p19J929K661j281m320K025M612k383l941L374K928l684k848
1436b473K321J781m64j442j346J441J420l434j916N115J814n238j250M292r6k579
1452b054J010K493J34j125k189p9M044P06m035J053M172l034m507L423L636k116
1468A532k067K43j60O4l94j221K509K596m157m134M251K623l534l65M152n56l554
1485b172p2J766K091J248k371j735K984K22m630J729O137j794n509J150K132j491
1501c15n65R43Q04N08k119l868K188N169k202l866L451J863m799j488M722K363
1517B789j628j391o21N06J832j743p10M579J171o568j863N514J133l626Q03K509
$$ y = [-2372, 1052, 3323, 437, -2202, -1319, 1381, 1495, -2279, -2995, 1493, 1594, -3805, -3835, 1547, 1591, -2702, -2020, 939, 959, -826, -1545, 384, 3045, 1764, -2556, -531, 4081, 1698, -2243, 1131, 4059, 375, -2473, -152, 1629, 1165, -277, -1623, -182, 1238, -2196, -4112, 1003, 2817, -2421, -3671, 621, 525, -2054, -1044, 1449, 1583, 458, -1731, -1810, 2234, 2940, -1095, -42, 4130, 1096, -3411, 12, 3648, 1532, -535, -292, -452, -388, -782, -2003, 506, 3102, -1055, -5189, -938, 1685, -1849, -2214, 1938, 1382, -2172, -2244, -478, 1613, 2861, 490, -1245, 1739, 1961, -2669, -940, 5197, 3403, -2106, -956, 1176, -315, -880, 63, 867, 1375, -744, -4612, -2424, 2745, 543, -3323, 128, 1991, -2808, -4296, 426, 2789, 1161, -230, -851, -345, 1487, -256, -966, 3613, 4784, -1784, -3647, 1867, 3000, -626, 177, 2686]
1533B686j974k859o93J208L499K62m164p42L690j360m311L635N476l090m601J472
1549a866K476m22J5N59J015J139k981l689L701N091l416l678L525J383n052j187
1565c387M788J566k479j796j363J224J831j562j077M467Q94p024j263O703R62
1580B484l815J201K600k114j861L35J301L440P96n301j671M845j102m930M235
1595D43N258m498m929K048J543m98P35l1m06J207k188m350M421N813l780m075
1611c287M465P14m987N03N010M53j286j111k236J283L329k444j818M984J98p529
1627c759q9O399q01l133J656P95k634m4k47o3M004O02n777o9N200j947l868M962
1645A187L032m333k198K071L15O36J451j646nK384l104l500M566L597m797k065
$$ y = [2686, 712, -2147, -2840, -1632, 1867, 2129, -2035, -2777, 913, -447, -4758, -1123, 4353, 1263, -3338, -1866, 610, 188, 203, 762, 1777, 2916, -65, -3754, -53, 5038, 1622, -2056, 1469, 2852, -2200, -3387, 1401, 2967, 488, -1308, -2671, -1447, 384, -1178, -2255, 2212, 3106, -3918, -5181, 1522, 2484, -1331, -130, 2470, 356, -1505, -1170, 131, 3571, 4367, -934, -2605, 2240, 1138, -3792, 443, 5701, 1203, -3726, -1678, -135, -633, 102, 71, -335, 872, -1316, -5666, -1245, 4568, 788, -3287, 1178, 1892, -3095, -2592, 2418, 2871, 1585, 474, -1762, -479, 2850, 406, -1412, 3572, 3770, -3759, -3848, 2551, 1750, -1383, 273, 1068, -1566, -1610, -1857, -1920, 2084, 2686, -3091, -3160, 2040, 93, -3775, 1187, 4219, -114, -2312, -241, 74, 710, 2161, 515, 510, 2894, -210, -3710, 856, 4453, -344, -2409]
1661b409L602q52l310J495K286j06J2j742k309K600K099l215J64M534j125m834
1677c110J704L611j348j114J388j73m56N1j484N85L293j299l768J713K767l203
1693h43j762L049R61k478n79Q86J99P87p55j222J872J225l111o01L843Q55l322
1710i96K90K380p82j341M22P44Q84l49k083J28K393n53k503J104K186k125k235
1727b436J517J852j011j085L80O92K94j177j074K109J612k037j358K214J293k290
1743e05l16K094Q29j479j088O69J151l46j769J06K265m61k569J18K558p15k439
1760a897M90J937k08j724j34J498P32j159j167J590J578j503j706J887J795j782
1776B27j509J809J482q70j599L61J362j30j826k86K189K05k648m83K247M08k439
$$ y = [-2409, 1193, 341, -2969, -1474, 812, 706, 718, -1024, -3333, -733, 1366, -1849, -1685, 2849, 1724, -3110, -1406, 2205, 857, -257, 1131, 958, 502, 553, -931, -346, 2947, 1648, -2120, -407, 2360, -843, -2605, 444, 1405, -1073, -1652, -766, -567, 220, -535, -1757, 115, 1340, -1771, -2372, 1471, 2326, -996, -706, 1674, 892, -449, -27, 717, 1601, 1252, -831, -703, 1690, 1137, -1366, -262, 1924, -201, -2436, -919, 933, -78, -1163, -783, -91, 203, -974, -2048, 61, 1673, -364, -1722, 492, 1785, -505, -821, 1273, 2102, 623, -465, 204, 1355, 1009, -760, -654, 1611, 1150, -1419, -1301, 1257, 542, -1897, -1407, 530, 322, -1402, -1536, -38, 694, -465, -1632, -42, 1536, 33, -1673, 214, 2009, 227, -1282, 527, 2009, 1139, -460, -99, 1263, 1133, -693, -979, 1210, 1415, -1233, -1716, 531, 939, -1500]
1793a500m81K022O16j445j133J450J533r42j644J007K140q73k293J102K589q55
1809A293k131P22J784k48j778m83J801N65j849j339J884J167k045j384J792J429
1825A180j767j398J204J551r23j618Q69J948j67j966K6K410R5k260k4K227O21
1842B008k062o14J552R33j675j506J502J528j450k038J263J807j249j838R60J797
1858I18p07j846K32J828K99j828k53K099Q36j994r90K294R08j698r82J678Q51
1875A645j263j132R34J185n38j847J40K050m87k221K42J931j52k020L10J663J99
1892F39j570n06J199J100j003j406J609J852j504j706J605J531j352j189R78J104
1908A381n38j344J90J132M46j661r57J683N84k014o44K257L9j707j6J107K99n12
$$ y = [-1500, -1981, 41, 657, -788, -1921, -471, 1062, 120, -1524, -517, 1623, 750, -1543, -441, 2148, 1293, -838, -116, 1668, 1420, -358, -841, 960, 1525, -324, -1663, 221, 1388, -657, -2041, -249, 1180, -587, -1985, -781, 770, -153, -1771, -902, 1046, 879, -1087, -1061, 1349, 1444, -816, -840, 1387, 2008, -54, -668, 884, 1817, 142, -1364, 138, 1666, 216, -1822, -559, 1248, -1, -1839, -879, 918, 211, -1635, -1403, 425, 724, -1104, -1357, 742, 1578, -416, -1406, 888, 1796, 98, -884, 794, 1645, 382, -750, 184, 1369, 831, -1016, -876, 1174, 687, -1534, -1292, 639, 487, -1533, -1223, 440, 639, -931, -1437, -238, 862, -141, -1547, 62, 1914, 410, -1296, 309, 1840, 488, -701, 277, 1381, 843, -501, -311, 821, 1267, -394, -1351, 332, 916, -1098, -1742, 515, 554, -1153, -1169, -62, 237, -275]
1926b75n08O8J434o3j712M17K360m58k158P32J820j037j207Q10R05m96n46p75
1944f89O05J055r26j407J115J399k175j074K211N65j411o1P75m1l34O9l58J266
1962E84Q82j896o93K070K57k048R49J846j283j168M02M95K0K11o82n69J262o20
1980A9j988J595K022j938j564J678N34j577L34J394q5r0n29j286J259J768j515
1997C1n90K039R7k961O33K374n14j002L78j40p96M12n48n5K156n18k938L98K292
2016G48j321j188K385N42j775p24N58M04R91N47j620L82J562k011j196L056J260
2033B600k710n41J474p27p77J086l3J67M02j840j533K664R05k282K94K209j576
2050b18k426J573J784m06m9m8j012P94M94j657J095L011j896k830J693J760j969
$$ y = [-275, -783, -715, 719, 656, -1056, -639, 1721, 1263, -895, -163, 1657, 620, -587, 223, 1128, 632, 86, -689, -84, 971, 45, -1362, -247, 1152, -1023, -2097, 114, 679, -732, -793, -18, -59, -393, -324, -682, 584, 1466, -430, -1123, 947, 1204, -844, 105, 1951, 668, -500, -98, 397, 417, 628, -54, -623, 639, 19, -1969, -374, 1648, -290, -1854, -176, 358, -1219, -885, 509, 424, 334, -195, -1481, -222, 1546, 31, -559, 1480, 1577, -1384, -751, 1623, 1109, 107, 485, 345, -451, -39, -587, -642, 1514, 996, -1942, -1544, 748, -573, -1761, 624, 1166, -609, -1333, -775, -371, 620, 1167, -453, -71, 1491, -520, -1716, 1340, 2600, -110, -651, 823, 96, -681, 405, 372, 539, 941, -899, -2432, 232, 1137, -1145, -851, 1358, -218, -2644, -1071, 713, 307, 258, 210, -802, -8, 486, -1171, -76, 2935, 1039, -1791, -98, 1662, -307]
2067c07j45K046n39j389k13n47N76J964q97k169J676R40k815m93L592l9k330M28
2085f61Q03q34M91P25o25R98P86k751n98L284l7k525J228J777k208j227J688K76
2103E90l08L05j072r20J934m42k057J491K518k682j870K468P78j712O73J204q61
2120C7k6lj047R22K215j843j583K304N22k974O97K759j084j610R43j79p89J160
2138D21m18j176J594K75k717N53K830r13k286K031P55j822M9J001J7L06N44j535
2156d91k19K183r80j779K143J221k659o72J885j97r65Q67q2p04O02n55j231J690
2174E7J219k206m70K265p54j583J189J319r19l60L83n22N43O95p78k99J776p17
2192H38k072J013J711j396q13J272k44r90L84nj75J012m65j364R13R54j324o09
$$ y = [-307, -452, 1594, 1055, -334, -547, -1094, -518, 1446, 549, -1620, 56, 996, -1819, -2312, 1280, 1241, -1089, -661, 142, -692, -201, 524, -101, 897, 1683, -1068, -1666, 1618, 1581, -944, 284, 2061, -147, -1374, 314, 590, 282, 587, -485, -1405, 529, 87, -1970, -479, 2039, -643, -2513, -45, 733, -979, -306, 898, 37, 11, 8, -1039, -117, 2098, 255, -1328, 976, 1498, -1476, -779, 1980, 896, -714, 229, 50, -739, 421, 3, -1173, 421, 696, -2021, -1468, 1362, 449, -1837, 194, 949, -873, -824, 177, 194, 500, 1044, -491, -710, 1473, 493, -1286, 857, 2078, -581, -1253, 632, 435, -530, 337, 255, -449, 153, -402, -1633, 57, 1276, -930, -1400, 865, 111, -1472, -283, 1036, 117, -243, 140, -382, 161, 856, 78, -221, 1555, 838, -1234, -221, 1490, 94, -719, 553, 309, -681, -297, -302, -477, 535, 70, -1294, -381, 573, -751, -1360]
2210a360K017K27j720L34Q77k63o2K12j22L01J56r11j12J714k42j741N51J297
2228A153j287n70Q06M79m47l38k99kP31l07r51Q70Q52j238n73J242M60q51j80
2247d50P18P6j62l42p6R04N7q15m36J366j51j198L32R88m45q04R4M44n3k44l94
2268e91L83O35n99q49P10R29q65o32P86N69l39m68M55M84k80o30j08J028K87j016
2288a11l33J029J04r81j28M76M31o97n20M05O08m25r23M81P72q1j030M85R79k50
2308B91q83K06R82j93o96O6P44K60o57l93O78N08r25n02P66M94p17o92P88M13
2328E38n15o89NR23j42q95J61J028k10q16K8P84K52o63k22P54K54m18l71L86P38
2349I10o18p80O70Q07o58p85L36N84j72q02K4Q39l1j029p2P85K10p44k45P55N74
$$ y = [-1360, 657, 884, -836, -502, 375, 112, 50, 262, 140, 441, 597, -314, -426, 1288, 1046, -695, -144, 1153, -134, -704, 102, 581, 134, -204, -503, -505, 226, -81, -1032, -162, 690, -548, -1121, 121, 581, -270, -450, 268, 344, 182, -160, -236, 668, 725, -90, -526, 840, 689, -509, -177, 811, 366, -438, -344, 100, 47, -197, -591, -208, 427, -172, -1021, -311, 618, -247, -879, -93, 476, 137, -331, 124, 608, 328, -302, -410, 618, 905, -111, -444, 585, 689, -292, -420, 56, 487, -210, -730, -325, 283, -142, -1065, -584, 188, 107, -923, -438, 541, 291, -592, -386, 596, 403, -293, -227, 517, 777, 120, -273, 405, 913, -12, -514, 252, 746, 29, -663, 125, 538, 23, -666, -661, 262, 120, -775, -614, 414, 204, -612, -584, 200, 452, -211, -433, 321, 575, 157, -214, 172, 910, 292, -488, 182, 989, 331, -454, -118, 466, 294, -508, -484, 355, 324, -705, -777, 8, 218, -526, -771, -16, 558]
2370E58p82n61Q20N00o66l50O21N71m28m54K16O79j83o73j5Q00k60p21j35Q77
2390D14j27o73j98N55K63n81k71L57N82l48p21N30N91l89m37K76P13k02p04J90
2410a80O64J08m19m01P92P4p91r8N02K85p14m07O00L36p08j66M08K73j17n65J33
2431c91M98J79p05P1P65k18o72K80N64j6n06J57M37M9l68m54M81M50m08o10L62
2452e5O41q51l50O93K38n11k55J76K26K0k37N7K99K50p24j03Q88P4q11L58N59
2473E82m94k30K69J22L04j6o92j05O97qq10M10O16q08l53L03L84l38j77K81j06
2494a69J22k68k79N41N76o57k61O05K35p21K63O16j66m53OJ17L08j7m10M9L92
2515D29n2j084K79J045m79p05N47J55m95j03Q9K95L71l16o37L32O94m37l16J002
$$ y = [558, -224, -785, 35, 535, -131, -481, 140, 711, 283, -171, 45, 724, 541, -132, -147, 653, 393, -328, -463, 414, 287, -386, -584, -29, 234, -347, -618, -261, 321, -27, -748, -218, 373, -16, -453, -177, 536, 334, -370, -180, 484, 592, 173, -228, 564, 638, -153, -251, 251, 536, -178, -585, 15, 351, -357, -523, -115, 158, 41, -524, -391, 107, 286, -419, -348, 417, 199, -473, -193, 371, 355, -151, 6, 443, 492, 124, -330, 151, 601, 193, -417, -55, 586, -265, -615, 78, 316, -195, -450, -274, -48, -28, -265, -208, 91, 341, -383, -486, 402, 476, -335, 23, 582, 88, -142, 127, 249, 553, 537, -155, -260, 437, 429, -381, 29, 645, -163, -516, -213, 171, -167, -344, -63, -169, -47, -315, -594, -53, 523, -134, -395, 210, 445, -276, -13, 603, 437, -16, -10, 107, 415, 398, -12, 37, 429, 377, -707, -428, 617, 138, -567, -20, 135, -360, -463, -374, -79, 292, -24, -661, -329, 365, -72, -388, 614]
2535F14K10j028j45N10R9n0K17k08r6K18p04l26J131K42j182m1Q08l84n74N95
2555i4M53l33k66k77p4P51K24p87K22J002q89p36Q04P59m15m26L48k64l7nj11
2576a51M18N24o40r08M71N51n25j94J082l47j035J61L01K99K52j31o33N07K81
2595B83q81K16J267l45r24L62M51n54O5L41K33j23l87m19R6P23K06j180N99N56
2615E85r25o03R69L22m67j00J01j38K03J12m29N92O92r53p03R14N81q97rR05n77
2636A75l09n1O3J55M99n14m03N51L0r04L84Q68k28q63L24J05j02j7J58PK06o2
2658G2m89O7Q33m07l49N01L79p13k43N51J94l29J59k4m08L58k65l65N85K70n45
2679a68l27M77J77p08K13N05k58k63J05K1L14L29m08q4M07j05p36P04L50m33k65
$$ y = [614, 824, -204, -349, 161, 260, 210, 427, 219, 123, 341, -363, -689, 442, 684, -498, -539, 269, -115, -689, -94, 359, 26, -240, -517, -591, 160, 384, -403, -181, 821, -68, -804, 0, 759, 344, -82, 266, 2, -35, -40, -151, 267, 791, 151, -757, -286, 265, -260, -454, 628, 281, -754, -593, -292, 7, 259, 128, -505, 2, 283, -598, -382, 885, 540, -384, -22, 429, -125, -60, 281, 514, 391, 4, -415, -319, 404, 610, -570, 29, 585, -340, -943, 26, 348, -119, -219, -118, -256, -53, 59, -370, 222, 914, -39, -742, 172, 753, -144, -153, 752, 175, -134, -185, -122, 33, 532, 18, -385, 166, 196, -708, -324, 544, 316, -547, -223, -118, -220, -237, -79, -72, 134, 72, -417, -350, 483, 76, -273, 228, 607, -106, -349, 202, 396, 67, 226, 202, -206, 152, -113, -478, 107, 377, -168, -495, -18, 159, -549, -336, 169, -89, -352, -247, -226, 88, 417, 9, -75, 332, 227, -509, 195, 545, 112, -153]
2700a53L74o6q4k7j2J62K11m91m30L50L72m50j17O30l02l49LM33J93k77j71J40
2722f1J60Q3l57J45L82L9m64k52O38j02m19K27K46l9k05q4J76J52k79l81J95K94
2744I4k68k52L28M08m82r6K01Q6k9O8m6K22q8k52n8L11Lj67k39N72Lm08n2K73
2768A32M6j31j30J1J19j55j86K41Qk9l39K18M11m35o0J12L79o6l20J03K25J55
2790C09j64k62K01L35l80j47K94L6k14k77L55J09k48k03J38K46n3l57P2L38q2
2811D6k91j4M30R2l13k07L59J67o7k90J41L23l27l50K21K93ok95J6M02k07l78
2833b55n4L51R8m52K02K71l9m20J0K70K29k24m52N86Q5j34k72J22M40l25j33n
2855a01N55j94m95R8N17k37l51J02K78Kl00p1R2L79m35k48K66J78pk48m4M14j75
$$ y = [-153, 221, 155, 71, 44, 32, 194, 405, -86, -516, -166, 206, -244, -361, 269, -33, -382, -379, 54, 247, -30, -201, -61, 99, 182, -175, -30, 352, 391, -73, -325, 313, 211, -208, 19, 265, 226, 21, -63, 113, 265, -14, -395, -200, 94, -174, -426, -98, 310, -172, -268, -67, 19, -10, 58, 12, 234, 146, -106, -164, 147, 150, -17, -256, 316, 319, -89, -141, 132, 178, 47, -83, -72, 47, -108, -294, -53, -45, -74, -413, -195, 216, -219, -279, -167, 212, 146, -174, -71, 154, 309, 145, -117, 84, 419, 39, -108, 186, 222, 8, -269, 86, 195, -53, -256, -118, 128, 75, -282, -210, 128, 46, -245, -259, 171, 263, -50, -257, 102, 269, 202, -88, 53, 376, 49, -301, -80, 213, 207, -88, -72, 330, 123, -255, -309, 42, 140, -312, -110, 161, 122, -298, -288, -18, 211, -13, -465, 121, 206, 72, -200, -78, 362, 37, -96, -101, 454, 260, -235, -137, 380, 143, -208, -106, 172, 174, -126, -197, -105, 274, -161, -409, -143, 35, 28, -220, -264, 150, -25]
2878b5k86J90M03q0k97J6M13l7l87j1L67J17l82q8K31Qk09n0K59J61l93j32K22
2901A0L06k76l75P3M27j26l38K75J18k10rj41K21J06kq7J24J77l23m7K52K92l61
2924H6k01K74M9j39k09R1R0K0l13Q6Q8K28k71r5K45j00j75K44Q4Qk25P6R0k2n0
2949d1l3M2L58l98L4j38M85j48m18L72j51O6j20N2N8j40N1k67K18M7L3l52M73
2972H3K87o56K82K07j80rJ19O6j82M6r0N8K89k0l24J08J71k95p1J98K53l70j13
2995a43ok2J89K7k76J54L32l10m25N69J29j99J6J97l14k9K23nP6J08k87p0K45
3018A79O7m41J94M63m52k40J37J03j37J39k6j33j6R8k17k0L84j13j61J67J22l40
3040b43o5N77j23J56j63j00n4J15Nl54M46M4m84o5N55j51k63L1L49l03k4j43O
$$ y = [-25, -311, -121, 282, 202, -95, -79, 334, 297, -90, -101, 266, 383, 1, -87, 144, 152, -57, -107, 152, 313, -80, -212, 10, 316, 40, -335, -262, 165, 39, -299, -24, 94, -116, -125, -266, -45, 61, 59, -28, 96, 273, -50, -97, 155, 447, 86, -115, 159, 208, 69, -140, -49, 41, 61, -252, -166, -78, 150, -121, -216, 29, -71, -246, -2, 82, 90, -135, -59, 31, 9, -41, -74, -32, 326, -72, -38, -176, 309, 161, -257, 115, -36, 30, -90, -38, 20, -120, -69, -336, -118, -71, -38, -390, 83, 370, -286, -4, 203, 23, 14, 133, 199, 17, 63, -27, 31, 320, 300, -24, 84, 255, -40, -111, 87, 340, -30, -143, -149, -171, 18, 45, -231, -77, 255, -55, -480, 89, 218, 19, 35, 232, -82, -111, 112, 107, 183, 291, 4, -66, 179, 246, -195, -1, 462, 10, -230, -93, 10, -127, 12, -14, -147, -163, -65, -282, -302, 82, -31, -192, -25, 97, -243, -308, 269, 146, 302, 139, 39, -15, 100, 105, -249, 197, 241, -243, -308, 247, 96, -167, -136, 213, -90, -114, -257, -251]
3063b51M30L8m07m9M42l3l73K65L40l84m9K82j02M8P0j75Q3J02l88j78K81M30
3085D22n05j65M72j82m76J99M19k06q4kk60L52J77j31l79N11P1n87L12Q2J39k00
3107b1J46j98o1K97k92OM29Jm18J7K77l00o0K24J64l39j65L02j98J59M5o9l0J24
3131D0k18j13L67L51m87n4J83Ol15L34l2L3J74k40j15L39K6l66M8K79k58k08K26
3154@J75k68o1N7j68J06Q7k49R1N73k93k75N0L15l5l41N29k09m7p5J15k0J84j28
3178A13k02R1K08m49R5L44n1l25J81J05k57J17j0P8P3J17l11j16L13j65j36J70
3200a7L27l41jM1noM5l6J61m6k00j26K77n4n9j48J72j1l68K22J64mJ41j37j54
3225a63K9J19L6k29K02L6k29R5K74k5m3q3P2j23J4Q7o2J32j22k49L11J43l21n1
$$ y = [-251, 179, 217, -190, -239, 203, 170, -203, 62, 402, 18, -31, 251, 149, 197, 267, 92, 175, 277, -111, -289, -8, 422, -83, -248, 224, 42, -434, -235, 184, -22, -106, -108, -368, -16, 161, 30, -349, 162, 233, -354, -42, 40, 179, -21, 125, -73, -134, 163, -129, -123, 306, 307, -111, -94, 183, -117, -177, 47, 211, -128, -293, 9, -189, -30, 15, -54, -84, 40, -178, -291, 76, 427, -60, -114, 69, 75, -240, 94, 62, 95, 269, 29, -86, 253, 279, -87, -39, 240, -18, -226, 0, 175, -93, -154, -97, -265, -159, -72, -321, -230, 343, 50, -225, -175, 140, 105, -236, 293, 84, 37, -38, 77, 57, 241, 113, -89, 2, 210, -239, -144, 200, 149, -176, 5, 110, -147, -30, -40, 38, 111, 228, -83, -199, 114, -51, -187, -17, 310, -31, -32, 9, 4, -2, 43, 7, 168, 122, -78, -204, 73, 19, -40, -188, -16, -27, -395, -173, -9, -13, 128, -9, -163, -134, -15, 21, -208, -6, 30, -199, -104, 170, 145, 102, 19, 91, -32, -18, 69, 7, 139, 17, -232, 79, 222, -99, -150]
3249a50O6K01k23q8lJ77m9j6K1J85j30j91J66R5K4k13J3K34P4j97J37r7J74j10
3273A00r2n0J53q6m1J08j4Oj09mJ65K7j27o2MK05j97j68J79J58k34J31k25J17
3297e6j8L24k34J02j10M3Q1K2m9k22K67L6k32p6R0o8l6O3R4k%n5j55J40J58j68
3323f1K2J96j01j82J5j6K93j34j27J57M3J4k15O4J78j23rj80J29J05j36P5j00
3346i3K42k54J24j41J66m8q0Q1J28k80m2J38K26l2j77O7j7N2j42J4J31J04j87
3369b0k3K42l9k64JJ15n0l3RR8j17j9Jl3M7L9r9K07p1o7j8M7K7J45j00l0O9R6
3397A60l4N9q0j79nR5k5J44j01L0k1m6k12J51J44j32J52r7o3M1j10J66n5p8K23
3422A27k78M9P7P9o3j4l5K10j55o1R1P4j40P8p3K51j41p4j24M7N0pJ72j14k6q1
$$ y = [-150, -84, 117, -106, -194, -197, -20, -69, -85, -64, 121, -9, -200, -34, 61, 85, -128, -115, 119, 193, -4, 133, 36, 210, 100, 8, -42, 111, 25, -16, 92, 78, 84, -25, -29, 136, 163, 36, -26, -22, 183, -14, -182, -3, 155, -79, 52, -173, -56, -74, 250, 16, 118, 8, 51, 132, 154, 105, -117, 150, 186, -46, -122, -32, -100, -136, -73, 21, 19, 19, -36, -191, -51, 107, -61, -39, 157, 56, -126, -111, -127, 166, 32, -95, 62, 105, 119, -96, -32, 146, 23, 14, -166, -37, 68, -68, 7, -93, 149, -105, 19, -122, 44, -4, -84, -3, 125, -155, -197, -59, 167, 135, -42, 25, 8, 60, -82, -68, 63, 167, -20, -43, 199, 160, -104, -103, 12, -38, -71, -62, 36, -81, -100, -99, -132, -85, -46, -145, 62, -9, -76, -94, -47, -20, 125, 25, -5, 64, 160, 126, 185, 105, -74, -79, 16, -9, 135, 34, 64, 43, -3, -215, -64, 80, -52, 100, 3, -60, -19, -129, 37, -18, -96, 127, -151, -102, -25, 54, -9, -23, -58, 152, -3, -64, 27, 101, -39, 39, -34, 217, 76, 2, -122, -75, -25, -32, 140, 26, 0, -81]
3448h1L6O4k26Q5J63J05r4k63J84rlJ82k73J88K1k42L81l31N5J59k11J27J85n7
3472A45k44J52n7P9r4j24L02j26l8P4l1R9j23mJ32m3j22O5j24K05o4l4K2j29J89
3497A07m6j69M7K06q9q8Q8l9j67J84Q0k34M6jm3J41K2j36JK22p0j81Q2J38j24
3522b3mJ5M9n5K4L2K6Mj42j7J46O9q7j4J14j47p2NJ01nk12M9J16o0M8N4J26j65
3550b5M5M3Oj9N3j09q9J26M8n2m2j2J12l5j52J35j19n4m6K15O5k42m0K92k89P9
3576a06J1K64j79j65K57J00r4K6j38j5J92k7l2j3O5j35N7J38k54j0J44R1r3P3
3600A57k20j14J08Q5Q8k51L15j72M5j46m2J90J98k58J4RK4j23m9R4J86j63J30
3623A05p6l4J10j08K74k74Q5l68K11K57l07J51l5lj68P7J53n7Q7q8J87j07n8m0
$$ y = [-81, -45, 19, -207, -122, 41, 146, 52, -211, -27, -36, -39, 143, -130, 58, 79, -163, 218, -113, -58, 101, -110, 17, 202, 145, -99, 53, -4, 75, -19, -143, 159, 33, -5, 69, 38, 137, 14, 10, 142, 99, -23, 42, -82, 123, 59, 25, 47, -82, 107, 61, -108, -61, 145, 56, -32, 56, 17, -150, 34, 114, -120, -74, -75, -118, 23, 45, -91, -90, 132, 62, -119, -37, 101, -23, -27, -12, 37, -18, 6, 38, 64, 68, -74, -91, 55, 124, 37, 23, 137, -10, -82, -77, 24, 19, -193, -144, -28, -88, -40, 14, 140, -25, 20, 63, 69, 50, 103, -6, -95, 31, 79, 27, -15, -27, 85, 50, -102, 33, -86, -140, -186, 29, 94, -148, -188, 104, -185, -106, -95, 169, -10, -175, 82, 182, 88, 114, -24, -39, 153, 126, 94, 81, 146, 11, 68, 206, -48, -58, 86, 177, 84, 157, -63, -177, -69, 16, 104, -147, 168, -4, 41, -105, -147, 43, 241, -17, -3, 6, 30, -93, -142, -48, 138, -25, 105, 29, -5, 105, -3, 271, -3, 82, -286, -75, 182, -125, 26, -9, -12, -180, -103, 50, -7, 80, -8, 179, 72, 14, -26]
3647b6p1J88J10j50nk5q1k87M46k9J8p7k8J56j65P8N1j45J25j32Q4M3m9N4j32
3672d9J99l0j66j46J39M6o9J45k6J7j4Q0j93J71j17n0N2J52j30P5mr0N8rj48Q1
3698b6J3K0M9j18J25j29k06K64O3j8k32Q8J8K1K39j20l6M9j62j72K93J21k74K24
3722I4po1k19J70L7N8m7Ok09M04k29p2j7k2J74k03KK60k73J06J0j25L41k65J11
3747B4N2j77J29j18K12k1J12k98P5M5j11J00L9q3j08J47p2%n2P3j39L35k27K5
3771c8j2J2O3k19J19K3jK0L7m3R1j7j65K24N1j25K3m5k7P8RO9l60K79j14M7J18
3798I7j16j7j84K12J3q1J46o0m1mQ3N5l3R1j93J88p4j1Lj09J04r1Q6k1j50K62
3824A55k26j3j15K05L17n49K06J4J48k59J53L2k3r1j2M4n4Nm6N5M0k2nJ16jq8
$$ y = [-26, -97, 91, 201, 51, 46, 21, -60, -347, 99, 70, 88, 11, -17, 139, -26, 52, 103, -42, 83, -49, 35, 78, 29, 83, -49, 150, 120, -46, -192, -53, -7, -76, 69, 43, 60, 46, 126, -67, 104, -13, -63, -11, 141, 11, 86, 82, -8, 50, 41, -107, -26, -13, 7, 56, -62, 63, -66, -272, -8, 55, 37, -195, -107, -89, -68, 171, 51, 15, 64, -98, -270, 23, 144, -130, 94, 87, 26, -193, -23, 14, 72, 25, 31, -178, 226, -3, -75, -92, -114, 60, -143, -141, 119, -154, -48, -38, -163, 178, -87, 24, 76, -101, 28, -90, 122, 101, 213, -85, -10, 35, -76, 24, 63, -20, -128, 19, -53, -53, -105, -32, -171, 164, -63, -38, -50, -38, 25, -194, -75, -52, -53, -33, 4, -39, 52, 35, -130, 94, 145, 20, 43, -2, -29, 49, 58, 127, -233, 46, -68, -21, 97, -19, -36, -220, -8, 5, -76, 70, 10, -31, -35, 48, 103, 70, 161, -32, 156, 82, 71, 74, -35, 69, -22, 64, 43, -107, 155, -71, -84, -199, 6, 323, -226, -20, -6, 142, -117, 36, 68, 45, -46, -58, -14, -68, -63, -109, -54, -14, -36, -41, 75, 74, -14]
3850a4K24k07P0j00o8NR8k5o2K7PolO3J51n2l69J1L29j60J57n0n0N2n2J2Q5J21
3878A94k02o0K22j78K74m96K71k7O4n8j48R9Oj21J81k8Q5k45RK23k1j70J0j5J59
3903B8j12R3K5l2O0n8M1p9l4J5J26J20k80J26k3k0rK0r0M8N9r1O3j38K12M5k96
3930a81K36n1K3jo6q8N8r1J13J60j91J34p3R6J19j22j8k28K41q2k3k8J23P5l86
3955b51J40K13j0k26k5J23r2KR2K4p7m5J94j0M8j88J36rl6r0Q8K24j76o0k5K0
3981a6O2n2o6K8J15Jj25m2K30j05j61jL13j95J6qJ09j36j11J73j64K05j57N7L7
4006GK38j96k5R3k6j42K2O1J16k05J32j28M2pR2k76K26j82J19p0J97%j88J06O1
4031F7l3K2l3Q1N4O3l34P8J98j42q5J23L9n6k4J06j5j15n4q0J43j0j14l3K26R3
$$ y = [-14, 210, 3, 73, -27, -95, -90, 8, -17, -79, -52, -45, -51, -54, 9, 160, 108, -261, -250, 79, -81, 76, 26, -24, 28, -24, -12, 73, 194, -8, -68, 154, -24, 250, -246, 25, -2, 62, 4, -144, -45, -39, -160, 21, -7, 78, -167, -158, 65, 44, -126, -116, -131, 28, -84, 9, 34, 2, 62, 4, 45, -34, -68, -53, 73, 193, -87, 39, 16, -4, -13, 7, -83, -35, 24, -67, -4, -142, 70, 115, -181, 55, 4, 27, 26, -40, -128, -70, -161, -48, 112, -79, 55, -18, 78, 197, 75, 57, -171, 70, -12, -35, -63, 60, 135, -251, -111, 102, 92, -134, -159, -36, -128, -126, -34, -10, -87, -132, 62, 52, 100, -88, 48, 39, 3, -87, 1, 225, 49, -11, -36, -16, 46, -6, -72, -44, 71, 72, -53, -95, 135, 30, -131, -132, 181, -14, 2, -6, 103, -33, -144, 29, -135, 70, -87, -30, 7, 245, 49, 24, 117, 91, -51, -29, 32, 148, -57, 75, -53, -11, -18, 74, -202, 24, -158, -39, -109, 88, 88, -100, 6, 67, 34, 56, 23, 104, 158, 221, -113, -35, 163, 21, -64, 59, 98, 42, 18, 124, 109, -6, -60, -140, 3, -7, -121, -154, 72, 165]
4057A65k68p1K76j23kp2K17N0k56J51k03K46%l7j8m4K0k00J38o6K1Lj3K09k54
4082a31M9k12O7L56j25r7J5K02j34j35J72P6j82K67l36J41P0kl0n6L33j75l26
4105a93M66O1l41k2K68j70k76K01O9j88R0Pn9R0k5j53J29J85j71k08K07P1j37
4128i9M2J88j53L11k08j56L6K42q5k48J22J02k20J23Q8o5r9n4Q1k08L53j6k84
4151b07K91N3l88L1M09j78l5O8k4q1PK14r8J34lq2l14N26r1j41L1J39l86n4J87
4176HO1k45L89k77n7P2j07q6K18J65k12q9J13k1m0K00m7m7j16R9PR6k4J17k02
4201b5J87r4n24N03n9q1K6o9J92j20J47k72J60q3L2k29J03K69k26P5J01k4K4j04
4225i1J75p0nK31j64O2P4j53j43J98R9k28M1J71l01p6K17J04k08kp6M9q3P2J81
$$ y = [165, -103, -174, 102, -21, -23, -95, 122, 172, -84, 67, -136, 110, 110, 73, 55, 11, 31, -169, -31, -97, -76, -73, -86, 123, -131, -82, -294, -227, 129, 4, -93, -78, 124, -10, -145, 27, 103, -79, 188, -148, -7, 63, 61, 31, -25, 308, 133, -193, 273, 334, -7, -29, 239, 69, -207, -6, 63, -125, -35, -28, -87, 3, -22, -175, -46, 139, -32, -240, -33, 38, -99, -57, 131, -22, 289, 81, -75, -39, 203, 118, -130, -8, 94, -126, -3, 85, 20, -79, -133, -52, -260, 93, 77, -207, 84, 137, -251, -220, 189, 11, -24, 44, 20, -61, -54, 160, 62, 196, 193, 111, -203, 323, 232, 91, 122, 261, -125, -179, 8, 69, -176, 213, -64, -121, -49, -156, -242, -24, 141, -71, -160, -47, -68, -108, 92, 45, -2, -118, -19, -12, 84, 60, 177, -25, 162, 68, -456, 47, -12, -93, -67, -136, 56, -64, 83, -189, -29, -112, -80, -309, -206, 63, -163, -88, 13, -11, 13, -91, 84, 14, 9, 240, 76, 138, 212, 59, -84, 114, 213, -15, 26, 197, -104, -180, 37, 141, -67, -69, -145, -96, -179, -107, 74]
4250G4j40Q8o3O3j63K17l3j37J29j50J15K31j14q6K3j6j31N7%nK5J30q3pp2j42
4276a90J87L1p2n7J53%k49nL71l21N6O7Q3Q4j09J37j47o3L4Q4MO1k21J36p9J57
4302A32l44j0K61j19K0nJ37j11Q9k09J07J78q2k97K3L47p7m8K8J9K16k01q9N6
4326B1j24J14J5J1R9q0k26K66m1j10Kj14J02j1K0J29r7J02j93O3L3R0p8R8q1P0
4352H0r4R8K07j15K2l31K76k34N0N2LJ42n4l22K16nP2k05P3J50o9k21L48j62K53
4377B30l47j1Q7K32k67o2J56L06j40j94M3J0J9J6N1r3K8q8M1M5J0k83Q1j8K25
4402G7j11j25Q4J53l4l2j17J74K0j68m3L07M1p9k43J59j23J86j41J05j00l9R4
4425D5n4J49l00K2P1J34o0k25J63o3K1mo1J67P9j14k3P7L1r2M8J22j60J23j76
$$ y = [74, -66, 22, -41, 22, -141, 76, 43, -94, 35, -115, 0, 231, 117, 31, 54, 38, -93, -36, -36, -41, -16, 114, 31, 24, -48, -190, -3, 28, -44, -101, 52, 52, -197, -202, 169, -152, -96, -29, 54, 138, 29, 166, 19, -44, -10, 74, 78, 139, -82, 54, -25, 132, -212, -222, 39, -80, -60, -65, 72, -39, 50, -159, -52, 126, 44, -253, -230, 117, 40, -8, 20, 39, 255, 54, -35, 21, -103, 11, 26, 37, 136, 56, -170, 96, 55, -55, -53, -167, -65, -76, -56, 73, -24, 78, -115, -52, -19, 71, -7, 91, 10, 80, -14, 84, 291, 176, 198, -133, 143, -91, -41, 11, 14, 156, 102, -220, -4, -9, 63, -142, -69, 81, 12, -209, 139, -23, 230, -117, -128, -41, 191, -76, -138, 18, 324, 184, -10, 33, 43, 62, 78, 129, 36, 64, -24, 17, 62, 72, -211, -130, -148, 77, -34, -159, -75, 78, 44, 12, -105, 69, 89, -79, -122, 185, 226, 147, -96, 63, -60, 126, -15, 90, -10, -49, 45, -9, 140, -160, -138, -67, 67, 7, -218, -55, -118, -97, -101, -162, 5, 84, -30, -53, 24, 55, -37, 11, 133, -27, 96, -80]
4450h0K08l7J07l15J45k7j02P2k6J35j31J45o1N6k08q2K39p4po7J4Ml8R3o1J49
4476E1M9j48j23L19o7l03L10M2j96J01n2O5p5R2r3O9o6jj1j77J58J20j67J4O0
4501b9j15K09k0j37MK18r7J3L15l44k3M8ok10J54J21j52j7J79n2K8r7J37j46J15
4526I6p3k25L5J91p9k41K26J42p6j55J65r2J23o2O9j03J53J37l01J91J91k19j15
4549b2j5k9J68P1j33j7p8M9m9m6J36m3k59K11Q7j80J49K95m42K16k18L3K48o7
4573F5p3J4J20j8l63K46J38j78J1O5k2k7J71j61j18L50r5k76K4j7J49j60J86J06
4597A37r8k18J2J09R5J12k06p5K69j70j4K26Ok39j0J11R1j36M0j5k21K09j01J3
4621g3J12l7o0PJ54n4l23K94L8r3Krn8J66p9q9J87R6j42j81K94Mp4j49J9L2O7
$$ y = [-80, 128, 91, 198, -117, 28, 1, -101, -29, -55, 80, -51, 94, 33, 89, -119, -201, 38, -36, -43, -110, -96, -92, -130, -37, -98, 51, 100, -48, -171, 148, 81, -222, 88, 130, -66, 35, -17, 48, -27, 65, -28, 41, -25, -26, -37, -214, -56, 64, -103, -89, -29, -144, 65, 45, -92, -88, 130, 33, 46, 361, 17, -6, 42, 36, -174, -20, 101, -51, -68, 111, 59, 87, -10, 127, -19, 96, 23, -202, -167, 24, -55, -296, -70, 72, -4, -159, 6, -86, 37, -25, 44, -59, 94, 231, -70, 121, 312, 93, -22, -37, -66, 102, 173, 40, 23, -55, -6, -55, -101, 35, -8, -267, -56, 31, -149, 0, 295, -147, 69, -149, -116, 132, 65, -8, 6, 126, 108, -255, -9, 129, -49, -38, 27, 5, -22, 149, -12, -130, 220, 125, -151, -127, -144, 5, -155, 31, 137, 39, -179, -167, -58, 37, 149, -57, -132, 137, -33, -47, 179, 185, -54, -64, 47, 138, 2, 42, 27, -194, 15, -86, -73, 39, 2, -58, -51, 103, 49, -274, 20, 58, -35, -33, -42, -100, 66, -13, -102, 85, 181, 39, -142, 152, 156, 82, -67, -48, -16, 51]
4648E1k44KK66N6q5k32J68q7k85J97K92j68M4J24j14l3r1J38R5m9P9j52j08K92
4672A56j25j72K17K15l20L7P3J91k73o8K5n9K76l40P7J32q9k23K56p2K7L5K1J17
4696A14R8k60J02r4Q4R9n3j72K22J7j42m2J91j10k4r6M9l4j03K7O1j73J92j78
4720b25K16J09j39O0K6j35O4j9J02j01J33j0j63qJ23L1L2J12j87Lm6J8q5O6J25
4745A02r9j2j0j52R9O5J00j34k2J84o2q5J76j21n4qJ48J6r4N8j08J44k27J15M7
4770F6n8j9J0j3J24j41L4K1j11N7j9j49K24j30jJ49j66NmN9M7M9n2j24J49J65
4796A72j50J6M3Q6j59L3j03Q8R1J6j34QJ37j23p1J05o6j71P1jQ9P9k37J18K4J63
4822A24j34j47K39j2j15J57q6o9J10j32J49k39K73m1m4Q6q1j06r7K62j56K1r4
$$ y = [51, -193, -191, 75, 131, 46, -186, -18, -105, -390, -193, 99, -69, -25, 99, -15, -48, -139, -1, 94, 45, 124, -28, -136, 156, 31, -141, 76, 291, -29, 8, 81, 272, -1, -69, -44, -103, 173, -167, -90, 42, -47, -270, -14, -86, -59, -24, -3, 114, 212, -48, 54, -40, 44, 143, 90, -82, 140, 157, 15, -27, 164, 54, 30, -66, -17, -51, -154, -127, -66, -239, -47, -225, -9, 100, -39, 21, 47, -88, -24, -43, 59, -42, 91, 81, -82, -90, 33, 64, 96, 208, 21, 24, -22, -4, -89, -23, 102, 3, -9, -19, -171, -72, -7, 93, -41, -63, 121, 59, -26, 150, 29, -25, -33, 115, 131, 37, 95, -13, 131, -96, 19, 66, 8, -11, -1, -14, 110, -31, 3, 24, -87, -30, -49, -198, 26, -104, -105, 44, -122, -117, -121, -62, -15, 34, -18, -142, 7, 172, 22, 38, 81, 167, 8, 41, -62, 26, 117, 133, -1, 7, 144, 21, -50, 55, -11, -182, -111, -112, -23, 56, -181, -63, -39, 124, -10, -157, 82, 70, -45, 112, 26, -43, 67, -65, 84, -155, 118, 77, 33, 119, 38, -68, -165, 97, -59, -38, -132]
4845a32P7Qp0P3o3J58Mk16P3J71k48N7J58o0j1N8M2Pj82K4K8J26l5r3n9K42L0
4872A67k29j82K26l4J06j00J61p8o9q1J20J95k38QJ8J41o1n5j13K57q0j70N2J99
4896A60O5j58k0qR7J40l89K09l3j78K3OP6p9M6r5R3n9R6p6J64R2l65J24L07k97
4922e9O9Q5J18r4L6k26J24j2kQ0j35J04j18j58J94k5J06m8k46K14j16J15p3O7
4946@M1m1J6j86K40r5m0J60J23j17j85J30J57j49r2n5K06M6j07j01P0J35j88k9
4970f1J27j81O4m8m3J18J22j50O8J5K5q0J11m5k8m0L6J39j36M5OK3o1Q2j24J21
4996A05j4j64K7%k7n2n3Q3P7o3K5J0k9N2p7L5P3j26K7J12J53j62j01J12ko5L30
5023B86j50J5j36o1P3O4p5n7P2j05N2j33J05l5%J57j91J29q5m7j00J12J73Q3j80
$$ y = [-132, -55, -47, -117, -44, -107, 51, 55, -161, -88, 83, -165, -108, 50, -10, -21, 37, 79, 86, -96, -72, -44, 82, 47, -46, -105, 137, 167, -62, -244, -18, -52, 54, -46, 115, 37, -32, -113, 7, 202, -36, -28, -10, 131, 70, 15, -98, 159, 79, -91, -39, 160, 225, 67, 47, 39, 136, 276, -113, 96, 63, -115, -92, -86, -10, -89, -43, -138, -45, -104, -8, -84, 80, 172, -193, -69, 238, -59, 10, 95, 213, 119, 155, -71, 53, 41, 39, 119, -16, 88, -30, -188, 6, -19, 87, 39, -207, 7, -109, 6, -67, 0, 41, 0, 16, -170, 70, -25, -65, 95, 218, 101, -84, 46, 203, 54, -38, -93, 113, 159, 52, -49, 21, 156, -32, -61, 66, -115, -51, -99, -142, -24, 98, -52, 16, 31, 56, -24, 87, 42, 14, -26, 10, 149, 13, 58, 64, 87, 26, 108, -16, 105, 91, -73, -46, -46, -73, -125, -178, -95, -18, -81, -56, -46, -75, -23, -100, -65, 8, -118, -91, 21, 174, 12, -89, 23, 21, -44, 286, 136, 151, 15, -46, 27, 91, 16, -41, 31, -74, -22, -155, -50, -85, -85, 72, -119, 10, -75, -122, -222, -110, 63, 146, -34]
5048c4J3K01L5l01R5J22j13K50l48p9K54j81j7O6J61j29j65J73M3j94Q6J19k25
5071a68J93j87P1O7k1q8K57j22K35l12r2M09k01n2P5j15O5J05p3J2J9nk80L5K58
5096H5j80p3K8K87l49K72o5j46N4K19k00nK65j22p6K93k5k25J64j11j4r8o6R0
5120Bk7K15k30KQ4J9l35J49J4J92n3K8k7k76K89j55o3R6J52j70J99m7K1q7J47
5145A39Qo3k23J86p3M1k1J70o0N1j97q3P3M7l2o5L92l42j54K47nm4j6O6p6N7J57
5172A80j77J15J06k8l30o1L38m6r9J6J6kq6j50J01K58n3j61J9K30l21J32L4M9
5196H0Q9j81J2p3J4O6n9P3J27k33N5N0K5m7J45r5K6j08J93j85l3J44o0r9K43j06
5222F3k17P7J73j72N8K5j43q4J57J12k38L0K24M0r7O9O4j00J92k01j43j9K60P
$$ y = [-34, -21, 180, 215, -86, 9, 131, 18, 268, -80, -159, 95, -86, -103, -37, 124, -5, -170, 3, 46, -148, -62, 57, -168, 25, -162, -91, -24, -45, -133, 124, 2, 237, -75, -167, 242, 41, -11, 64, -51, 14, 119, 46, 58, 77, 72, -208, -173, 85, -95, -168, -140, 147, -202, 70, 5, -141, -87, 132, -68, -73, 192, 70, -6, 287, 262, 37, 201, 90, 76, -22, -88, 2, -25, 190, -40, -38, 46, 65, -270, -121, -107, 85, 32, 60, 33, -243, 46, -109, -172, -76, 76, -94, 105, 58, 79, -8, 139, 147, 84, -139, 47, -26, 15, -6, 164, 104, 155, -42, -125, -52, -5, -37, -102, 290, -52, -206, 41, 36, -8, -24, 42, -34, 23, 180, 3, 118, 224, 196, -134, -195, 143, 97, -2, 14, 30, 28, -58, -208, -107, 151, 98, -63, -44, 186, -135, -3, 31, 80, 169, -12, 0, -73, -59, 7, -52, 21, 148, -85, -30, 20, 45, -2, 143, 48, 74, -34, 159, -26, -59, 85, 25, -74, 169, 63, -154, -77, 96, -76, -18, 7, -136, -220, -63, 49, -189, -159, 65, 105, 8, 77, 141, 41, 233, 32, -111, -130, 130, 137]
5246A37j6l9j37PJ36O3j19j44K58j66m8O7j18J14p5M2J08q4J43r6l3K33l69K0
5270a16K07mjn9N6p1N0j2N2M9j36k1J03n4j43m9M7K04o6j48K46o7j66J56r1j05
5296a39O7J14L0p9N6Rj02P9m0L4j20L73l41K1J76k57J40J18k21P3Rj51J31j34
5320a54L59l80n9J44K04j76L5MP5N2j2k73K09J9J17r9k1J61n2j39P9j74j14K46
5344E1L3j15J1K9L1K8M7j86kJ27jj45J23o8Q8o0j01N4M7j30mK82K2j6M7m9p8o4
5372AL7p3J09j23O5m3m6J45l7p3k7J39l06K18O9j94P5j40J70Q6l8j78J28oK26
5397A84j46j4M1o4K2J4L3j12j15K09O5l5j45o0J58q0K2p2P8j6J10j05J37j28j6
5422c5M9j59J82r2L7J4n3J32L4k04J38j19J06J22q1j20N5J71k60R4j31P9J51o3
$$ y = [137, 121, 82, -55, -48, 88, 151, 32, -112, 146, -20, -68, -1, -119, -5, -80, -38, 70, -14, 129, 33, 0, 233, -136, -116, 91, 87, 86, 27, 83, 12, 62, 50, 102, 151, 15, -6, 97, 43, -100, -149, -102, 102, 36, -112, 134, 67, -99, 57, -34, -139, -72, 42, 72, -7, 49, 58, -44, 35, -5, 29, -91, 282, -59, -38, 138, -119, 21, 139, -82, -9, 0, -151, -20, -154, 205, -175, -234, -90, 114, -62, -27, -23, 52, 104, 92, -181, 28, 47, 164, 65, 44, 205, 153, 14, 93, -81, -195, 51, 84, -31, -20, 9, 40, 68, 115, -71, -73, 54, 53, -92, 31, -37, 51, -9, -110, -56, -9, -139, -143, 139, 161, 145, 192, 143, 65, 1, 38, -35, 74, -49, 16, -27, -73, 72, 35, -38, -65, 74, -232, -14, 55, -139, -64, -204, -34, 52, 14, -164, -36, -42, 184, 38, 24, 65, 1, 23, 37, 70, -42, -157, 52, 117, 82, -63, -123, 35, -45, -23, -95, -17, -33, 77, -28, 109, -19, -35, 14, -145, 37, -55, -18, -4, -57, 75, 109, -95, 43, -76, 30, 152, 71, -49, 6, 177, -83, 11, -120, -41, 110, 47]
5446D7q4oK06j11k37J58Q4o3k6P2J3M4O6j34k1K07k08O6n2J29L4j27p8J20p4l6
5472a1K1M7j13J6m8Q2j06J23j63R0RJ80k82R8J46k95J03R6j0l8R9M2j33J0P4j25
5498h8M%R9k3J24j71o8J43r0l6J03lK3J03k19Q6n0J06j3pn4K5k0N1O7rOp8j3Q5
5528H3K5r1Ql8O9N5k39J90n9M2j02P9k09J42Lq1P1p9M4L7M4oj0n0J49k5QO1j3
5557A08j39k0q4j0J15J81k27J45m5j95J97J07k3j71J9p2L2J19j40l0J12M5Kk45
5581b19K64j3j37K94j04j02l3M8K6r2K24j14j27l9K3O0O5r1J4j5o1J36J40Oj03
5606E0j37K21l04J02LJ01ko6J3l6O3p0k9J33K3k00J26j02J52L0j73K56j78j4k5
5631f3K46j71j01J44J7m3k40J01J51N7j74j02oK85p2m7J04J5j04N3n7n8OP4o7
$$ y = [47, -37, -43, 163, 52, -185, -27, 57, -6, -32, 40, 53, 97, 163, 29, 8, 215, 7, 73, 21, 150, 184, 57, -21, 99, 25, -11, 10, 57, -56, -40, -88, -6, -112, 11, -152, -62, -53, 127, -155, -57, 89, -206, -103, -7, -17, -55, 44, 86, -47, -37, 37, -88, -84, -84, 15, -8, 116, -55, -123, 20, -70, -106, -3, -6, 17, 120, -99, -13, -63, 43, 30, 23, -31, -6, -26, 25, 92, 83, 89, 11, -2, 83, 108, 17, 25, -13, 56, 111, -128, 62, 3, 45, -57, 22, -187, -45, -42, -123, -52, -131, -87, -50, -6, -12, -22, -72, 77, 52, 60, 121, 108, -31, -51, -135, -145, -30, 151, -76, 69, 24, -171, 26, 133, 110, -61, -42, -114, -82, 37, -103, -133, -21, 24, 26, -219, 45, 32, -105, 189, 85, -17, -50, -2, 24, -68, 156, 42, -85, -124, -101, -41, 24, -67, -53, -68, -129, 7, 147, 153, 50, -87, 134, -170, -68, -65, 36, 34, -32, -19, -55, 8, -62, -91, 42, 65, -135, -9, -111, 41, 71, -102, 154, -24, -38, -63, 183, 12, -89, 55, 72, 29, -211, -110, 41, 98, -76, -178, -184, 101, 29, -18, 86, 101, -3, 50, -7, -65, -59, 15, -52]
5656e2J58L9j97j6L4J36r1k5q3K4o0J91m1n8n3j27K17L9k02J86L1N6m8M6j31J99
5682A72n8o4pP0k25Q9P7j39P4j6p5O6n0j5J95k05K79k27K37j70k32K36q6j03K02
5707B5q3J41j46Q1l2J06M6j03L3j91K59q4j74O6P9j23J67j52M8M6k8j06J68o1
5731a8M0o0J5J5J9p1R0lM4n0n1j19nK89k90L7LJ14j00R3j60J55o8K9l9P8Nj47
5759a55O7K95j12k16r1J59j01J10K5o1N3P5M7j78Q5J04k7p3Q5j18R4r0K6Rr3J87
5785A06k44J9J4J70L3q1r8P3N2Rm3N1Mn3j15J60Q4k47K89k17J8J11k28J60o9L21
5811B79l30j7K05J08j66q4n5Q1J06P5k49Q1j99J53N2K2n5L0q0R1J9P1j40j29J51
5836B0k3rJ3P2l6j48l0P7J34j18J19j15J5J99j03j82P3j5R6j77K22k23O9J44n9
$$ y = [-52, 106, 145, -52, -68, -34, 102, 11, -14, -97, -73, -133, 58, 17, -41, -94, -221, -4, 35, -167, 19, 50, 106, 58, 104, -27, 172, 114, 50, 43, 113, -112, -23, 54, -85, -11, -27, -102, -36, -86, -101, 94, -111, 168, -59, 178, 8, -224, 12, -74, -177, 25, -58, 83, -63, 18, -14, 92, 138, 35, 68, -123, 136, 52, -122, -56, 23, -100, 67, -85, -37, 9, -19, -125, 43, -18, 22, -38, -23, -8, 11, -60, 30, 27, 71, 21, -30, -149, -154, 135, -155, -118, -115, -1, -101, -8, -168, -13, -81, -52, -91, -13, -8, -155, -88, 207, 95, -121, -212, -53, -154, -44, -19, -80, -27, 48, 95, -83, 2, 106, 79, 6, 91, -27, 67, -23, 3, 12, -81, 106, -138, -119, -105, 65, 98, 17, -81, -8, 44, 53, 10, 61, 65, 12, -103, 57, 141, -106, 183, -34, -16, 95, -133, 27, -42, 279, -51, -68, 137, 245, 79, -5, -60, 21, 127, 202, -47, 34, -165, -12, 40, 62, 7, 37, -43, 48, 67, 138, -2, -131, 20, -3, -12, 1, 73, 37, -111, -141, -64, 70, -48, 71, -44, -29, 170, 67, -115, -42, -57, 39, -138, 84, -139, -70, 74, 15]
5861A5N7j20K2J51j35R7j11J41O5k54J22KQ2j14o0J71oR6k29q0J12Mn0j16M8m2
5887a32L1M9J42j95N4r4J78o8Jq9K38k98J46O7j20J67Kk24J45N2n1l7K08q2k40
5912a50J46JQ0j5n9o2l8K23j15Nm8J18r0k5M2p4J3j20K9J52J80o6j5j66J94l1
5938A09l01J61j51K15l4J49r8j38J63j45m1J38j2k35J06Q7N4p6J1Q3j21P6K8J01
5962A29n3j37J99lq4j57J64j45K34j73j07J05J07j02Q6q5m0O4k32J03J54K4j62
5985a11Q9J73j85L7Q4j06l6P5J29l14R3Q1J%o9Q0q8j9K43k22P2R3j40j6P8l6r7
6012a11K7n7n1J52j31K8N9K7n8m5J42J27j26L3m5kk3R7P5k5q0k7M6lM2k27J96
6039D0Pq5J13Kp6P0j94J37O8o0j33J6K7J57r5r0R9pQ7j12J89j11K9j41Q5q9J32
$$ y = [15, 72, -48, -26, 125, -10, 87, -24, 117, 182, -72, 50, 52, 134, 20, -40, 131, 125, 221, -8, -88, 24, 28, -22, -138, -90, -132, -101, -52, 90, -105, -51, -145, 33, -35, -34, -123, 115, -183, -37, 30, -90, 77, 79, -145, 0, 52, 1, -36, 172, 90, -150, -4, -3, 77, 62, 3, -59, -97, 126, 11, 16, -32, 86, -4, -29, 13, -61, -48, -168, -139, 13, 193, 127, 112, -54, 140, 109, -192, -31, -182, 33, -1, 148, 50, -88, 75, -70, -111, 27, 15, -220, -114, -27, 27, -49, -38, 45, -76, 0, 28, 129, 76, -61, 138, 135, 51, -106, 58, -87, 147, -26, -133, -28, 79, -23, 63, -22, -62, 2, -230, -127, 27, 51, -111, -22, 151, -34, 3, 87, -19, -55, 20, 149, -165, -72, 9, 10, 10, -59, 21, -67, -86, 157, -65, 7, 100, -40, -56, 22, -14, -111, -84, -141, -192, -40, -171, -143, -84, -57, -115, -160, -18, 109, -17, 16, -29, -31, -54, 43, 118, 93, 13, -14, 32, 29, 71, -156, 40, 47, -38, 75, 77, 1, 71, -123, 14, 82, 22, -111, -95, -68, 89, -6, -96, 3, -4, 83, -29, 160, 49, 78, -63, 22, -67, 65]
6066F5p6q3K90j76J05j20M0m9O1O6j91L4l3J64j87J75j23q6J31J31p9q4J57j71
6090c9J75o7R7r0J31l24N8jJ40l4k5L8j09lJ22j00P8j05P5o1P0r9p0L3P3J73j35
6117An6m6K49j50j14R5n1J52p4L4N6j52M2P4J0L1j07N5%j37J07p8m7J12l9N3n3
6144c3J02j92K02o5l0l9O0J67r7j53K15j76K07j04j78J68j23pj00K13Ql4K17k40
6168a2K1j7M2j32LJ30k6j94l5K81j33L6J0m7l8J62M9k9k25J61N8L9Mj4k85L23
6194A32j59j04N6K3J11j64J86k74J04K3n%P0N1m6k9m8M9j4l4P3r5J73j27J65j20
6220cRJ8q5R8j37JR4J36j53p5JnK67j43N1j26Q0n0J4M8j1j70J79r3j40K86j75
6247h4N3Q8k30K22q2j03K53p6J28j04j17J96j41Q1k7j15L9KQ9j35J0%q9N2J95
$$ y = [65, -11, -94, 196, 20, 125, 5, 45, -4, 57, 123, -68, -34, -67, 97, -90, 85, -38, -124, 7, 138, 59, -25, 132, -39, 136, 69, 166, 76, 207, -117, -59, -60, 80, 46, 21, 59, -50, -53, 69, -31, 47, -58, 17, -44, 26, -73, -143, -110, -37, 136, 1, -55, -101, 148, -2, -116, -21, -72, 80, 6, 40, 96, -56, -14, 60, 70, 101, -6, 49, 49, -88, 19, -59, -106, 6, -33, 20, -33, 69, -123, 79, 14, -16, -55, 5, 172, 75, -78, 137, -39, 168, 64, -114, 54, -69, -76, -176, 37, 45, 11, 228, -12, 9, -8, 34, -98, -95, 35, 9, -185, -220, 61, -72, -36, -26, -73, -111, 51, 100, 71, -154, 7, 65, 104, 108, 94, -191, 132, -27, -131, -75, -52, 59, -105, 81, -193, -89, -66, -71, -71, -1, 50, 4, -25, -73, -24, -38, -72, 1, -94, 79, -48, 117, -3, 6, 24, -61, 37, -100, -99, -5, 131, -22, -97, -96, -101, 166, 23, 74, -52, 28, -22, -8, 40, 29, -141, 38, -55, -195, 91, -84, -31, 57, -173, 49, -33, -136, 117, 41, 169, 65, -52, 144, 3, 84, 57, -58, -19, -17, 72, -63, -53, -53, -142, -90, 105]
6272A05l7k02J83j04JR9p5M3j65J84o8L6m5m9J30j78J20K3rj38J40n0j6Q2P6o0
6298B6o0q4J00J6l5k6Nl9LJ32%k4L4j04Q3K5r6J52j24K9M3L1n3p2N9K5J9j84k5
6327a44Q5K26j40p7O8M2o6P5o8r3j4J66j22J88k12Q6O3q1m5roJ04o1J5P4r7J26
6354H3J31k98J55j76P1p5l0J36M8P5k02m5RM9O0J44k31pR3n7J96j06O2j91K01
6379I5m6J5Q4j58J22k25p0J80P3j17J8J63mj82P9j60J72J3j66J42Nj72O0J4o3
6404a28O5J82j19Lj9qK4P1k7L1LJ18k34n2J09j4kM9Q6j28P3j16oM6p3J33j40L4
6432c9J11j15P3j53J71n7N6mlkL1qJ7o5j17J12j17J5K35k20NL0J0o6j2r2P3J17
6460a4K7kj75J24m2j7J00Q1j43N9p1j5K31K6p4r6K3p0J45j67lJ88p0k62K44o2
$$ y = [105, 68, -134, 49, -55, -54, 45, -30, 13, -152, 32, -36, 0, -45, -94, 36, -142, -22, 1, -8, -146, -6, -56, -72, 10, 86, 26, -34, -118, -18, -2, -37, -63, -58, -97, -94, 38, 38, 14, 48, -56, 27, 52, -44, 108, -16, 13, 56, 87, 34, -38, 21, 46, 65, -119, -144, -59, 167, 27, -50, 18, 60, -6, 69, 1, -92, -106, 60, -62, 126, -86, 0, 63, -18, -63, -72, -78, 26, -35, -20, 54, -43, 83, 214, -84, 71, -105, -34, -109, -139, -3, 45, 120, -82, -127, -118, -69, -9, 135, -96, -103, -10, -67, 129, 23, 85, -106, 95, 49, 64, 148, -10, 112, -113, -183, -3, 70, -47, -29, 134, 130, -52, 27, -133, 39, 52, -114, 28, 33, -139, -79, -65, -128, -63, 119, 0, 3, -16, -24, 0, 71, 44, 75, 78, 196, -38, -90, 19, 5, 3, 52, 138, 10, 83, -33, -39, 7, -66, 67, -73, -39, 72, -43, 30, -123, 48, -9, 47, 43, 40, 38, 69, 61, 78, 13, -104, 8, -109, -94, 141, -79, -74, -44, -34, -100, -112, -204, -131, -14, 13, 11, -164, -40, -82, -99, 1, 82, -61, -2, -73, -88, 143, 169, 95, -1, 22, -48, 97, -70, -73, 115, 45, -217, 27, -35]
6486c5J47l5j00L4O4j48L55l93K0J26lj31Q6n2K4J06O0p5j01L7k8J23q1Q5l4j89
6512a38J72l7K7m1R5j62j59K53O2qj02jr1J3Q8K30k22R8j13N8q4j73J86K6Pm6
6538f2L1P0j05o6Q8M4j09K27j61l5M6r1J70j07p5J47r5K00j32p1J00k4r8k1J68
6563C9LN5j8J13k10j12p2L56j44o5J26r0L0J37j35J10p7M7l9j06J6N5o5L1Oj8
6589b7J94k03J03p3Pl7Qn2J68K9j41O5k7j65R7n3K68j66oJ11m0k2p6K1Q6J9r6
6616hj20N3Q8J9Mj1p9K27k01L3P2j58j5J17L0L7n4q0K22j68jj2L9j66J76j52N6
6643e2j25J90p8J01N0j32J24r1j56J04P5J05p0j62J23%M7o5j10K16k0k50J30l5
6667h1J05K5m1r8m5L0K13k8k10J02R4kj5j22J57k14R6oo3P9M7L1R4q0k26L13l01
$$ y = [-35, 112, 77, -23, 11, 75, -73, 282, -111, -91, 35, 32, -99, -13, -65, -41, 65, 125, 50, -51, -14, -42, 81, 0, 85, 51, -138, 34, -3, 24, -17, 78, -84, -243, 10, 72, 64, -38, -39, -130, -117, -29, 201, -21, 77, -36, 22, -62, -235, -49, -23, -16, -62, -31, 39, -66, -132, -44, 0, -109, 118, -43, -78, -32, -123, 47, -60, -135, 12, -83, 117, -15, -86, 14, -10, -108, -129, 39, 42, 97, 79, 192, -18, -130, -202, 154, 10, -55, 71, -19, 11, 148, 13, 123, 46, 93, 54, -52, -36, 19, -46, -15, -9, -27, 167, -36, 67, -6, 1, -36, -28, -80, 88, 117, -24, 41, 14, -151, -54, -107, 161, -5, -11, 100, 60, 38, -38, -17, 69, 88, -8, -128, -75, 13, 32, 36, 25, -54, 173, -28, 5, 77, -81, -96, 21, 51, 88, 34, -46, 176, 8, 7, -5, 34, -132, 44, -108, -52, -177, 13, -65, 36, 86, -46, 78, -13, -169, -65, 10, 115, 45, -117, 6, 6, 53, -12, -122, 94, 74, -176, -46, -81, 24, 49, 8, -90, -135, -105, 108, 80, -130, -28, 66, 64, 49, -73, 84, -130, -34, -40, -103, -24, 23, 54, 148, 68, -158, 155, -146]
6694a46K14j08m9J26j2l0Rk9R4Lp4J88j73l5R7j66M9l5K8R8l0j29K8J11q5J28
6720G2j09QN2n1J36j08Kj86J87J10j14O9m4J3N5J0j18l0L0K4o1J61j87L02l23
6745a00M4Q2m1Nj24J12j26J03K0L5r2Q1l0Q2K8k66J82L0j0K4J1%m3Pm4JnJ47j54
6774d1Q5kj12J0m5l3O8jO9J38j13q0L9L5q4J49n8N7Rr4K28k68O6j50J89k8j04
6801g1Q1n9j2m6K32q1k3J3n5j0q9N8J49j52J10l4l2N3N9q8o3J40q6PM4jR0n8k
6830G4mNj34KOJJ02l2pj54J45N0m3k8rN2P8j81J7J32rj12J1Q2j95M4J11P1j07
6859c2j77K65j91K09p9l3p9J51l5Pp7J0L9J10j62P3p5K5M6J1L1j64K00pj05K5
6885a4J50k30J63l9l4j8l3J9J25j21K4J9L7k67K19J23j23n5m7L5J68j26kK4Qn
$$ y = [-146, 68, -40, -89, 37, 25, -5, 4, -25, 69, 72, -2, 186, 13, -22, 75, -91, -42, -77, -49, 49, 19, -110, -82, 29, -56, 72, -37, -29, 23, -28, 108, 0, 2, -184, 3, 113, -1, 68, 24, 37, 92, 102, -16, -46, -16, 8, -53, 108, -79, 223, -100, -56, 26, -15, -10, -134, -22, -148, -45, -25, 10, -82, -1, -31, 51, 79, -187, -5, 25, 15, 39, 50, 50, 7, 14, -30, -29, -34, 113, -41, 44, 42, -70, -60, -105, -138, -70, -71, -2, 136, 23, -57, -18, 17, -67, 82, 24, 81, 90, -4, 224, -44, 22, -128, 61, 33, -71, 10, -49, -61, -107, 125, 44, 21, 34, -21, -31, -120, -62, 87, -65, 45, 11, -21, 32, 91, 3, -60, 80, -6, 1, 45, 44, 134, 76, 74, 70, 75, -59, -57, -51, -50, 52, 20, 13, -141, 4, 54, 11, -17, -26, 26, 104, -77, -60, 72, 63, -49, -38, 44, -151, -107, 4, 75, -32, -209, 56, -135, 74, -5, -38, -117, 34, -1, 6, -71, -61, -22, 88, -74, -1, -76, -51, -5, 6, 37, -127, 73, 66, -39, -14, 136, -94, 69, 30, -4, -22, -55, -36, 89, -32, -8, 11, 48, -219, 0, 123, 0, -55, -102, -67, 101, -25, -27, -3, 5, 0]
6911@O4n9k4J0R2L6k85J81M9j47N0O6K1L6j07P9j33J6r5K15r0k%J5On1m5k8K8
6940a02P3k7M5k5n2J06J13k80K39N2j78O4m1J49rP4m1k57N0R6k33J28M9%j69R
6966a67K32K6j64m0K05p1j09K35r6o5o7J26j6j76K01q1Kl9RQ2K8l1lO2j66J58
6992G5j25J06j03J62J8j29M9o8J3q6J50j0q7L2P1j00J20j73K92k68l4RQ2J23r8
7017B1k2l9J92p9j98K44k31J05n6L1K6l1J53Ok2k05J23J1J8KK8r5N2p9K8N3m9
7044a3j29K0J60J8PJ03j97O0Jj81J83Q3j86n1K24m4p1rk13J99L2J06j32J14j20
7069c6j3J12r3J36j69K57j28q7O5O0l8j4J49j86j1p9J36j31P7N6N3k09R5J76q0
7094I8j03R2p6l4r2R9k1m4J3J7O1OO6j05nL8J04j01m7P0j06J20j06J09p5L08k69
$$ y = [0, 64, 5, -19, -9, 83, 119, -166, 15, 64, -83, -33, 33, 54, 90, -17, 62, -71, -55, -150, 65, -25, -27, -27, -12, -6, -57, -102, -130, -102, -29, -56, -11, -36, -88, 18, 131, -149, 90, 142, -36, 28, -13, 136, 127, 201, 160, -97, -47, 49, -184, -56, -7, -7, -176, -167, 65, 91, -73, -113, 92, 21, -88, 147, 51, -14, -81, 45, 29, -147, 54, -27, -25, -64, -55, 27, 55, 24, 21, 83, -83, 75, -50, 56, -47, 115, 133, 4, 53, -15, -2, -88, 62, 52, -35, -3, 68, -32, 88, -85, 207, -61, -95, -86, -4, 119, 21, -1, -40, 152, 73, -125, 119, -112, -7, -63, -32, -6, -37, 116, 122, 100, -105, 18, 29, 47, 49, 77, -18, 34, -45, -17, 36, -13, -142, -122, 38, 56, 63, 166, -31, 29, 30, -151, 32, 115, -71, -122, 102, 58, -13, -22, -235, -36, -4, 102, -30, 84, -36, -49, 63, -30, 106, -63, 194, 66, -21, 44, 104, 66, 52, 201, 15, 4, -75, 61, -70, 7, 63, 116, -93, 2, 178, 98, -5, 87, 11, -23, -115, -16, -37, -81, -68, -51, 10, 16, 82, -23, -28, 10, 114, 13, -34, 36, -70, 50, -56, 53, -22, 286, 17]
7121A7r3J2j31K91q8K1m2m8P5R2j87J10K7l1K2j35J66j02o7P4q6Q9k4R9j72P2
7147c9N1j65K16j57J08O7p0P3q5j85J89L1ro8K5M2N9j02j04J88L3j92J4r2L58
7172A86j70P7p6p5N7o7K8K4L2o1O6K3Q1o0kk25R6R2j05K04j35M2Jj25J33j30J99
7199A10l6j70L3J07n1r6K0J9R6K0L7j39M5N7k10K21M3o4j8N8m9O8j17N6J2L4k26
7226a40J16P8j43J71l9j50P9N9j41J92j21k5O5o0j8pj04L14n5lk47J40K1qK9j57
7252a54K79r0k3K39k08Q4j94N3j0L4r0RNK8O8j19J24j68K14j59KK62k27LK1j6
7278c3j9P9n2Q9j07j4j30K54j00j78J53K04j08k8p4j2J21Q0p1n9J21n2j04J18
7302G8P6k05Po5J92p0k6p9Q9lK09j04r5o9m1K11j05l5J4K9n4Ok3K03o3k30K12
$$ y = [17, -76, -64, -195, 96, 8, 29, -13, -61, 14, 106, -81, 29, 56, 25, 47, -88, 78, -24, -91, -17, -103, -14, -38, 61, -111, -39, 12, -153, 63, -94, 14, 81, 11, 84, -1, -186, 3, 34, 25, -43, -18, 24, 83, -19, -123, 65, 98, -94, -80, -172, 186, 16, 93, 17, -58, -1, -68, -40, -16, 16, -45, 21, 44, 125, 65, 63, -162, -66, 26, -79, 125, -10, 32, 33, -92, 41, -89, 110, 74, -96, -63, 44, -7, -103, -83, -64, 32, 52, 89, -50, -5, 52, -158, 63, 106, 42, 24, 82, 33, 101, -16, 40, 52, 86, -140, -24, 54, -89, 82, 43, -107, -28, 31, -110, 82, -39, -64, 1, -59, -77, -84, -188, 126, 71, 68, -179, -39, -18, -26, 3, -154, 125, 35, 12, 251, 43, 127, -67, -14, -24, 10, -80, -71, -66, -38, 30, -89, 35, -133, 81, -78, -76, 186, -41, -38, -17, -33, -52, 27, -25, 64, -43, -57, -187, 67, -33, -211, -58, 146, 38, 10, -64, -76, 45, 125, 54, -5, 116, 64, -40, 78, 154, -51, -44, -109, 83, 13, -13, -92, -3, -6, 203, 99, 4, -65, -106, 105, 0, -35, -21, 8, -46, -40, -63, 140, 77, -153, 59]
7329E9k4R7j99Q0p7L4M9j20L0J17j87J72Q4J4j69K1M7Q0j50q2J16P8N4o5J4j65
7355i2N3R8k4l7n5J31p9M1r7k5K4Q0O6m9j16J6J05j79J39p6J24pj53J61j6j44
7381a11K04j42O6P4l2R1j83o2qK18l2p7o3l1m8J80pJ46j75q1P2K14l56q3K38j02
7407i0J56k00J40oK1J43j31j55J79q4J63l10K9P4nj09J03K24k35O4K4qn2K59k33
7432c9J16o9J27o1j92R0J52k78J99J3p4n3R9J5m0M6j59J22j11J16j07J15r7J03
7456C3n4M0K7K1j98J30n2OQ8p9n4J00kNp3Q8l6N9L5j23N2jJ86j78J15k3k27K62
7484A47j75l5K15k56J19N4q7L5N3m4k0K4M6q6L0o8R6l1j56K08l9m1j35O1K10j00
7510B5O7k77J05K8L3L2q5N4P3q3o2j9K31j34n1J50j55m6K1m0L24j64Q6l7Q9k28
$$ y = [59, 35, 132, -67, 13, -64, -30, 19, -101, -71, 46, -141, 31, 115, 129, -40, -19, 28, 108, -42, -124, -8, 70, 124, 59, 73, -92, -39, 59, 35, -2, -57, 74, -5, 36, -61, -86, -62, 18, 84, 35, -81, -65, 40, -139, 0, -76, 48, 41, -112, 49, 33, -111, 93, -49, 17, 91, 59, 150, -33, -95, -103, 115, 83, 6, -57, -88, -136, 44, 37, 183, 8, -73, -1, 213, -143, -226, 12, -90, 66, -134, 6, 0, 21, 164, 33, -122, 57, -27, 136, -174, -145, -71, -76, -185, -82, 142, -93, -29, -5, -13, -65, 194, -39, 77, 8, 135, 74, -118, -28, 124, -154, 45, 58, -16, -69, 30, 45, 5, 51, -108, 14, -97, 19, -88, 27, -70, 33, -21, 19, 46, 67, -131, -1, -53, -47, 41, -38, -92, 8, 6, 11, -62, 26, -10, 49, 84, -39, 13, 12, 198, 20, 135, 112, -115, 147, -28, -63, 152, -104, 15, 69, -18, 17, 70, 26, 6, 30, 76, -10, 20, -48, 48, 17, -139, 69, 30, -11, -146, -85, 125, 25, 92, -185, -80, -52, -19, 13, -72, -18, 55, -28, -90, -109, 122, -12, -63, 87, -68, -114, -93, -133, 191, 27, 113, 76, 165, -63]
7536f3J14m6O2N1k41n6M6K54j32q8J02q1J24o9j12J72q4n0J51n9Q3lk01J75p0
7561b1MJ72j13l2R3O5o7n3j66j9J23l3N9k6J00r1O5j14k4PN2O7k3j03P9J19r9
7588B1j4K03k33k4K3Q4J2j31L5J70j49q2M8J19l1r0Rk6P9j40j5J16q2K43o4P4
7614A55q0j34P1l1J40l8O5k40J80Q1k69J44Q7l28J29J77n0J1n1r2P0p7M4m0J5
7639f1J6PQk7Q9MM0J2j07O1qk8k11L04j62m9O5M8K8R5j15j77K59p1O8j88J30j10
7667h0j18L59j42L9j59J19p1L1rK00K9j50M2k49QK46k83K55k1o4k2J30n5k3K2
7692C4k6M1l7o8O6L4l9N4j37oL1P1j14J49k9n0r3J10k4J11N6j04J00j30L5m7R
7719cn8l8J9M9J56k63K05P7r1l9J12J3l8j16L1J0j12P4J43O2k88J94mn1jj43K09
$$ y = [-63, 51, 5, 67, 118, -123, -179, -133, 121, -11, -99, 3, -78, 46, -23, -135, 37, -47, -97, 54, -5, 78, 75, -126, 49, -21, -17, 155, 42, 10, 103, 168, 101, 48, -118, -137, -14, -47, 12, -14, 86, -5, 60, -54, -78, -71, -19, 48, 25, -78, 1, 120, 21, 7, 210, -23, -47, -24, 60, 72, -59, -24, 146, -3, -85, -37, 82, 51, -39, -30, -56, 23, -117, -132, -16, -98, 145, 81, 155, 75, -59, 12, -19, 121, 83, 148, -92, 88, 169, -100, 44, 131, -197, -68, 109, 59, 70, 19, -73, -3, -80, -36, -76, -61, -45, -38, -30, -57, 32, 36, 76, 88, -19, 42, 34, 6, -205, 99, -63, -112, -47, 1, 29, 124, 9, -168, 91, 20, 88, -100, 30, -80, -198, 161, 19, 58, -101, 18, -53, -22, -31, 169, 198, 48, 90, -159, -151, 95, -188, 67, 46, -18, -40, 90, 35, 12, 34, 8, 49, 12, -56, 10, 44, 5, 59, -78, -84, -53, 18, -96, 53, 24, -26, -119, -9, -33, 78, 134, 30, 130, 0, 35, -12, -3, -61, -99, -80, -31, 125, -138, 67, 144, 53, 14, 126, 139, 101, -15, 16, 26, -86, -12, 131, 193, -95, 99, 95, 44, 43, -100, 109]
7746A09pj22K22k20J11j2n5K0q6J21p5r0P2PO2j35nJ88L9j50mj49LJ45%Q4NJ0
7774H8q1N3l6j2K7n2m3JJ82l4J42l47R5J0M3j4j11l2R3m2P3M3n3m0J41k24Q6P3
7802B9m8l2J41j88Q4M2N1J5j33J34j70J29q9R2j14J65j19j12L9J05J8q3L4nM1
7827B6N4M8k2l2o7Q7j80J73Q1k81J96p9j00J79k49Q3J42l2L6o6k8M4J13k19K95
7852B02k37r1K17k51J61p0J9R8M4k86J40K6l0O6K4j04K33j06k3j97K72r6O2n0
7876B3k7n7Qr9K31p3j6O8J15j06j38K21j71P7j63J76Rj54P7o7O6O8j9j4P3Q5k06
7903a3L9n0N7rJ01mj78q1J74J50k18m3J46q6j6J28m9r5j49L52k12K8rK9j22J65
7929C5r9n2J07K9oQ3q4j41J67p3j02J76j77J49Q7q3P0p2L9r3M2o8o4J31r8J49
$$ y = [109, 102, -20, 202, -18, 93, 81, 26, 46, -40, 81, 6, -84, -12, -5, 57, -78, -83, 105, 144, -6, -10, -159, -156, -11, -11, 73, 78, 88, 7, 60, 24, 12, 39, -13, -56, -55, 127, 93, 235, -112, -17, -7, 36, 22, -89, -121, -28, -70, 3, 46, -7, -47, 94, -130, -44, 29, -19, -51, 90, -98, -14, 28, 79, 94, -39, 95, -75, 54, -35, 57, -57, 108, -11, -123, -84, 21, 39, -44, -10, -15, 26, 80, 128, 106, 74, 7, 94, -86, 87, 168, -113, 83, 4, -96, 83, -166, -83, 59, 27, 63, -3, -31, 13, 126, -93, 202, -35, -126, 91, -160, 1, -69, -50, 48, 92, -194, -54, -28, -58, 8, 32, -72, 161, 55, 32, -165, 107, 11, 73, 23, -4, -61, -53, -152, 79, 6, -10, 58, 173, 67, -71, 150, -21, 56, -107, 69, 78, -76, 1, -66, 0, 68, 49, 35, 108, 193, -13, 26, -24, 33, 24, 125, 121, -57, -138, 36, 186, -32, -75, 71, -15, -31, 97, 48, -47, -196, 156, -56, -28, -37, -8, -130, 35, -64, -116, -9, 20, 14, 97, 13, -128, 39, -34, -136, 40, -137, 12, 99, 16, 86, 14, 53, -40, 2, -66, -130, 1, -97, 52]
7955E2j52m0J1M6K05l6q1m3J03l9l2J79q4p4J6J7j77O9J38P8q3j28J7J00n8Oo0
7982e0j6P3o0J6r2J51L0n4j07J58Lj32N3Q1n6J8l2J36j15L1Pj46L5r5J79K12k44
8009a6L3j04J87k1l0r5O5M6k1K8r7L6l9J8p4K01j09J06kj71J24q8O6n4K2l5J8
8036fQ2P1j42M6pj43K17k37J6J27Qjj51N3P6j52K23j11K8M3J38j86ljj7N1O8l0
8064F0p2J6pJ05j67p0K23pj15pkMp6Q0J7Q4pJo1o7mJ25R0j45L5p4l7J78M1j96
8094e5j27J07o2J4K54n7j04M7l2j5k4M4J7LJ0k3J35P6j16m9j39j0K23j24j86M9
8120a44O0J50k9l4J17j67l8J7L5K5%Q3j5q0R1l9l5lj72J90M9k02J32J34j04r8
8146g7q9K31q5P9j83J81r1K3J51j38J05j04j48J69k4Lj52J46Q8j35M0m7J05n3
$$ y = [52, -100, -140, -129, -83, 122, 86, 5, -38, 65, 26, -6, 173, 89, 15, 31, 48, -129, -60, 78, 156, 73, -55, -38, 62, 4, 10, -50, -66, 7, -53, -37, -129, 22, 52, -2, -109, 49, 52, -80, -27, 54, -2, 16, -16, 120, 5, 36, 43, -103, -68, -163, 16, 228, -16, 17, -87, 100, 79, 49, -46, 19, 65, 44, 72, -25, 11, -28, -10, -84, 117, 8, 114, 112, -59, 65, -23, 43, -11, 11, -24, -6, 76, 147, 5, 51, 44, -99, 118, -119, -103, 24, 32, 31, -120, -67, 9, -143, 80, -31, -3, 40, 178, -8, -11, -12, -29, 22, 90, 60, -12, 4, -3, 102, -65, -135, 88, 81, -34, -41, -43, -39, -115, -35, -18, 66, 59, 60, -1, -68, -72, 53, 143, -2, 33, -41, -78, 100, 141, -55, -182, -75, -137, -123, 131, 74, -30, 17, -15, -30, -54, -10, 7, 10, 20, -3, 132, 208, 92, 43, -96, -106, 117, -7, -193, -144, -84, 66, 37, 3, 120, -47, -85, -68, -33, -8, -8, 75, 60, -20, 71, 32, -3, -6, -178, 12, 61, -141, -9, 125, 21, -77, -166, 65, -20, 59, -124, 57, -34, -11, 140, 2, 107, 3, -145, 24, 0, 3, -149, -3, 85, -50, -10, -57, 48, -5]
8170eP6k82K33k4L7L6J5k23J18N2j07N4R2N2r8l0J82k09rPL19
$$ y = [-5, 71, -211, 22, -2, 35, 71, 86, -137, -19, 33, -74, -20, 72, 124, 26, -4, 178, -31, -40, -33, 286]
8191B86
$$ Imaginary data points
##PAGE= N=2
##DATA TABLE= (X++(I..I)), XYDATA
0@%%%%%%Qq%%Qj6J6j6K4l2M0n6O4p2Q8j06J29j51J74k04K37k75L17l61M11m69
32b50N33o02O78p61Q54r59J071j191J325j472J632j807J995k201K429k677K950
49A547l248L576l941M345m798N305n876O532p291Q176r225J0495j2068J4069j6712
64i114K0374k5782L4549n1037R1982l67180n63328R30650J9327l47744O15169
75C47866P8045p95810J04780L07527l24627K93091N73918n70350m02111N71606
85A83935m1497m59087M88260K90155o06851r9599L45842k22038J645M72094k05300
96A47559m21053L06071J5744m53013L49995M89948m29891k01143L54246k11777
106e3314k56895M06880P9992k93494K15018O5237m43097J63925M41898l28796
$$ y = [0, 0, 0, 0, 0, 0, 0, 8, 0, 0, 0, 8, -8, 8, -8, 16, -16, 24, -32, 32, -40, 48, -58, 71, -80, 94, -110, 127, -148, 169, -192, 219, -250, 283, -319, 359, -402, 452, -507, 564, -627, 698, -774, 858, -949, 1046, -1155, 1274, -1403, 1547, -1701, 1875, -2066, 2279, -2519, 2786, -3090, 3442, -3849, 4327, -4898, 5597, -6471, 7598, -9114, 11260, -14522, 20027, -31010, 60972, -306208, -869536, 61114, 80441, -267303, 347866, 425911, -369899, -265119, 42408, -282219, 10872, 584790, 14440, -387671, 183935, 142438, -316649, 171611, 461766, -145085, -244684, 101158, -120880, -119235, 352859, 147559, -273494, 32577, 48321, -404692, -54697, 435251, 5360, -195783, 158463, -53314, -310209, 96671, 176663, -116831, 98187, 163424, -279673, -115748, 326150, -2646]
116b646j85530M14394j54813m05753L16031K36741k42974P2652J04202l13982
126a61678j2755K75865j33905n8351L33985j10075m01416J59890K23167j91062
136g6335L5843K26008j47380j48528J18375m8450o7470K20565J2251k50318J05566
147a9873J82328k10401n8098K24514q2037j72906J25424N3584o6323J05007K721
158H3940j82443M8368J14933j49682j4485K22475m9408j81168R2322P8581r0575
169b7142J8784M7147o4007J1730M2373p2532J6546J27973n5840j22875Q2898O3430
181F8485j02489p936Q0404k6463l2368K2695j8954P269N1572m9690o3301Q1485
193A0709M3064r7797l56R2120l7636o2963M5009K8340k589J6620l3763k8191N1299
$$ y = [-2646, -188176, 226218, 71405, -334348, -18317, 218424, -24550, 48102, 152304, -161678, -174433, 101432, -32473, -90824, 243161, 133086, -268330, -108440, 114727, -76335, -40492, 185516, 38136, -110392, 7983, -40467, -107937, 112628, 124879, -125439, -19873, 162455, -47946, -106044, 118470, 36433, -136473, -11049, 42535, -23788, 81219, 83940, -98503, -50135, 64798, -84884, -99369, 123106, 73698, -107470, -15148, 63433, -27142, -8358, 38789, -25218, -13488, 28885, -43647, -27101, 100872, 45032, -77843, 5055, 68485, -34004, -41940, 38464, 12001, -20367, 2328, -16626, -9357, 42215, -7475, -70776, 10709, 53773, -44024, -44380, 47740, 10104, -52859, -7850, 20490, 17901, 34521, 758, -27433, 23866]
206B3866o224p1373M6434Q8229n2355o6375M2119J6294m3266n984K0015K4124
218A5504J7500m3001l8833M9213K5993n8397n316O9582k004o3756K187M3351O900
231A8923j2612j3419J263K9931o665m7334K0850O3679k7188o5768K6623M9531
243C7814k7515l1610K0124J6110q036k1837j7412L4265L6872m8354m5157M9656
255e080L2453m8851j3167N4144J3484m1360k1421J8419L1971K340l8745M46N4132
268C8765n997o2016J3455O1882j7764n6784J1637L9740q153k9277n880K1368K2467
281B3443k2949m0182K6786M5402l8159m8685M3423M7514l6342l4489L1291K8562
293B5615j6577k6209K327L5077J4136m4332k0125N4341K1720n6456j7195N2367
$$ y = [23866, 17642, -53731, -7297, 80932, 28577, -37798, 4321, 20615, -22651, -28635, -8620, 15504, 33004, -9997, -48830, 383, 26376, -32021, -37337, 32245, 30241, -33515, -31328, 12023, 18923, 6311, -7108, -5845, 24086, 17421, -29913, -9063, 54616, 27428, -38340, -11717, 37814, 10299, -21311, -1187, 14923, 6887, -14950, -32362, 1903, 38775, -9579, -54736, -5080, 27373, -21478, -34645, 19499, 32983, -8377, -29798, -11379, 20592, 22932, -15813, -15367, 38765, 32768, -29248, -15793, 46089, 28325, -28459, -16822, 22918, 14765, -14512, -20392, 976, 23443, 494, -39688, -12902, 32500, -5659, -54344, -10921, 36593, 251, -34238, -2947, 25615, 9038, -17171, -14844, 20233, 34369, -9963, -30088, 24253, 45973, -10483, -27678, 24689]
305B4689J0177m8127j4572L2820J7782k1861l0994J2418M3247j1368n4936J2911
317b7814N6203j9333n2266K3866M8690j5211l5051O073K7282J0634k3045k4033
329b4005K9241L6447l5623l8154M2518L6162m3271l3457L2552K4702k3544k6400
341b2832Q363L0394J414m1187q227M8819O657n4256m642M9799L675l7853k502
354b2378L0700J3720j9601k4899J7477L9220j9075m6011K6403M7398l0111l8700
366b5857K8908K6942k2703k2166M777J8645R494k6054k3728L3635K5629m3561
378a6039k1211M6630J1957m2432o164L0256J0073j1470j4905J658K9279K919m0189
391a9638M532N0989j2555n0241J8739L8981j8339k2147J0536Q913Q24j0692k3275
$$ y = [24689, 34866, -13261, -27833, 4987, 22769, 908, -30086, -17668, 25579, 14211, -40725, -27814, 28389, 9056, -43210, -19344, 29346, 14135, -20916, -14843, 12439, 23073, 28, -24005, 5236, 41683, 6060, -32094, 10424, 46586, 3315, -30142, 2410, 27112, 3568, -22832, -14469, 15925, 17339, -23848, -32075, 16744, 23401, -30855, -35497, 14302, 17977, -19876, -22378, 8322, 22042, 2441, -22458, -4981, 34239, 15164, -30847, -4444, 42954, 12843, -25857, 3051, 29993, 7290, -14876, -10099, 8546, 18040, -8014, -31742, 1893, 27522, -16039, -37250, 9380, 21337, -21095, -27259, 2997, 13070, 1600, -13305, -11647, 17632, 20551, -19638, -15106, 35883, 23328, -26913, -8174, 30807, 12468, -9679, 857, 9770, 10594, -98, -23373]
404b3373J5379L7351k6988m1735L6380K9823m3913j5015M1812N594k6167l215
416a4067M676R696J5283j7519j6440L5167J0262m7328J284N1138o930l8153R182
429c749J5073j0267k698Q24K873K0494r819m4929R465M3417j9579l0185L4246
442E166J7582l9391j2428K4945R528L273l058j9081P524K0063k5387j1891N0402
455B7247J2930n1167o955L3527o733j7074J3299Q339l343o738k2007J231L7671
468B0227k125l8343R977K6832k6727k2494K8467J9995j2400j1522m150O898J5222
481I857j0048j5177K4981J6410l5956j6156L7695J5385k5209m760J6699j972j6264
494d515r371Q474K2548J13k9115k697K5858p476k8307J2467K9767q018k6552k785
$$ y = [-23373, -7994, 29357, 2369, -39366, -2986, 26837, -17076, -32091, 9721, 15315, -10852, -14067, -9391, 305, 15588, -1931, -18371, 16796, 27058, -20270, -18986, 32152, 25222, -12931, -3749, 11324, 1057, -1641, -817, 2056, 22550, 12731, -32198, -22733, 20684, 1105, -29080, 5166, 22748, -16643, -29071, -4126, 5402, 8675, 5617, -13464, -5940, 14123, -11264, -23155, 27247, 40177, -10990, -17945, 15582, 8849, -8225, 5074, 13413, 10070, 3332, -18675, -17444, 20227, 18102, -20241, -10264, 16568, -10159, -32653, -4186, 15809, 3409, -8113, -12263, -5365, 9857, -191, -15368, 9613, 26023, -9933, -26089, 11606, 26991, 1782, -2978, 13721, 11749, -4515, -13886, -5412, 17136, 17249, -11866, -14563, 11295, 3819, -24488, -12021, 17746, 9728, -16824, -19609]
508a9609J7272P317j3227l938K5488J2284k9794j9535K1504J5547j1311n165J4156
521A0989J1579j3848k7589M263L4169J457l0292L763K1799j8161k5627J4741K5843
534A3086L615j5025j8974M734J8203j3947j7369L3222K3660l9044k3615L1791
546C37J6263j4399R95N794m017k343j3810o021L8793J9866m6854k0142L8340l318
560I484l4024K3500L1947k4126k4974j549j531K3593K2849k7050j1630L0449k2803
573e865m6728M1920N5456k9210k8181J7025q502j4130K0079Q576M583K0356k9991
586E388n1705L2138M6719l0756j0476M3315j6134n4294Q844K8902K010J0953m289
599A0615l2225Q236K1607k8802k9N7163q582o2670R612L8544j4683m262K6307
$$ y = [-19609, -2337, 4980, -8247, -12185, 13303, 25587, -4207, -23742, -2238, 13309, 1998, -3167, 10989, 22568, 8720, -18869, -14606, 19563, 21020, -9272, -5509, 16290, -1871, -27498, -12757, 13086, 16701, 1676, -17298, -12564, 5639, -8308, -25677, 7545, 31205, -7839, -31454, 337, 16600, 2201, 3196, 8990, 4973, 2630, -11180, -17201, 21592, 41458, -5396, -25538, 12802, 9484, -24540, -1040, 30907, 6781, -18193, -19742, -21273, 2320, 25169, -1881, -13511, 16938, -5865, -52593, -10673, 44783, 15573, -12608, 4417, -4085, -18215, 1864, 10440, 15023, 35379, 5388, -46317, -14179, 32540, 1784, -8692, 34623, 18489, -35805, -26961, 1941, 3951, 14904, 10615, -21610, -13374, 8233, -20569, -20598, 36565, 27983, -34687, -25075, 13469, -1214, -5476, 20831]
612B0831p119j5603K997j6664K305M7580l276n2290J0114L0265l2890j2720M7769
625B1299R986l3036j0444m194l946K3030O709j8785J6015J3664m3460j6003N0146
638A0981J5878l1011J963J4261j8090j0009J2906Q372J3666O715k9374j5751K7302
651G809K715k6930J5695K9518k2766k7377J3145J1921m712J220k177k310Q473
664D224q707j8940J7879K4589j9296j7481K1675J0164j8930m188J3938M633o045
677C515p876J76J4627N090j7659m965J8319r51k2537J545K1491j397j7412o81
691h715J0422J68p782l960P685J0201p450j5770O650J7305p157j2972J2637J4446
705A5708j1279j3510N823J0849j204p920L02J0722K109j4596o622J4291P607j4127
$$ y = [20831, 13712, -1891, 1106, -15558, -13253, 34327, 31051, -21239, -11125, 19140, -13750, -26470, 21299, 31285, -1751, -12195, -16389, -20335, 2695, 9404, -9381, 6634, 20298, -23162, -39165, 10981, 26859, -4152, -2189, 12072, -6018, -16027, -3121, 5251, 18917, 25632, -3742, -19493, 7809, 10524, -16406, -711, 28807, 6041, -21336, -8191, 3730, -982, 238, -1939, -4249, 4224, -4483, -23423, -5544, 19045, -251, -17732, 3943, 14107, -4823, -9011, 4927, 9560, 3515, -4361, -4185, 10442, 15532, -2127, -7092, 11227, 10276, -12261, -10716, 10775, 9378, -8034, -8715, 1707, 1875, -5907, -9867, -2182, 8019, 569, -15201, -8551, 8754, 1597, -11375, 1262, 15708, 4429, -9081, -3258, 7591, 6387, -1533, -1231, 9491, 11600, -2996, -9618, 4673, 12280, -1847]
719a847q334J2631N427j5526p354J4371R398r497r074N235Q626m868j1414M832
733g394J7666j376j7620K630J8022m020j5506N004J3456j888j0534l426Q448P286
747A0748r245j1204J0663J2714j3906j3931J2467J0437j2956r960J0417J0163
759F407n048r673J171J0521J627j3250k568J7849N468j7461m075J7746L296j5319
773c309k252J2730M388r579r565O341J2343o414j5652P325J6318r887j7410P996
787f627J3666o223j1243K668J1198K189j1778n701J4048Q666j4421q549J6619
800D512Q901j5064p399J3332Q230q962r106N430J0539l748j4461J210J5972q44
814H542j7690K80J6493j588j6148n98J3071L070j0790o179J0570R674r914j1581
$$ y = [-1847, -10181, 2450, 7877, -7649, -15003, -632, 8766, -731, -9805, -4570, 4056, -812, -12226, -7394, 10272, 8896, -8724, -6094, 11928, 7908, -7598, -2594, 10862, 8974, -1560, -4986, 3462, 10748, 1503, -9701, 962, 13676, -230, -14161, -1694, 8743, -4213, -14173, -3756, 6407, 1359, -8314, -7143, 3378, 5005, -8245, -10813, 7036, 12504, -4957, -9032, 8714, 12010, -3309, -5561, 7169, 11557, 1978, -7587, -1246, 11097, 4683, -10969, -3644, 12674, 2787, -14623, -6627, 7039, 816, -10427, -7759, 3439, 5628, -6150, -11851, 2197, 10863, -3558, -12107, 4512, 13413, -1651, -9050, 4282, 12512, 3550, -5556, -126, 10413, 6665, -7796, -6586, 9386, 8542, -9148, -8868, 7625, 6037, -10111, -10709, 2362, 5432, -5358, -11537, -967, 8707, -1207, -12788]
828a2788J1663J3636j1046j2117J0949J1602p857j0254N225J0957j228j2248k346
841e852J3096L249j5759m953J5622M351j5741n233J3167M727j1196o477Q088Q539
855E628n440j0875N144J3813l806j4047M331J5439l458j3584L308J2534r23j0537
869b473j494R360M562r414q008R285Q709j1310j0352J0901R272j0588r155Q145
883b560P486o017p334K919Q957K42j0194j692J2787L539j2693k478J3928K336
897I226j3172j239J1562K714q357m203N116N416m164q816L419J0676m538j3951
911a0311M363J2669n242j0571N356P980m289p095N54P130M471n748o376P828P656
926H375r552o365J2516O330j1642n171Q286L512m396k939K173M197j467r582j530
$$ y = [-12788, -1125, 12511, 1465, -10652, 297, 11899, 4042, -6212, -987, 9970, 8742, -3506, -5852, 7244, 10493, -5266, -10219, 5403, 9754, -5987, -11220, 1947, 6674, -4522, -10999, -2911, 5628, 188, -10687, -5543, 8270, 4464, -9583, -5252, 10187, 6729, -6855, -3547, 8987, 8064, -2473, -3967, 5393, 9955, 541, -7467, 1818, 10527, -783, -11135, -234, 9038, -1550, -10705, -2560, 4926, -1091, -8425, -5506, 3451, 3693, -6501, -8193, 4594, 8133, -4560, -7038, 6890, 9226, -3946, -5185, 6377, 9091, 734, -3469, 1647, 7063, 2899, -5917, -2498, 8178, 3640, -10311, -5948, 6721, 1479, -9092, -3736, 4244, -45, -7140, -6586, 544, 5015, -733, -7109, 719, 8375, -1177, -7542, 4974, 11304, -338, -5509, 2777, 6289, 1893, -1046, 1127, 5324, 3857, -5725, -7255]
941g255J1921J920j2843r59J1449l000j0719L969R907j255o767k210K937N543
955B638j346n609N425R449q414j1657R422J0742p753o004O645K380o120l367K081
970a488N915K832q498p460Q062M753j0701j345J3667K79j3567j220R186J398l025
985a212j53J332K623j344p733K703J4622j318j4491K704J0703p095q442R250P346
1000I495n725o038k201K069O184j896p716N956P670j3878r875J5248R607j0948
1014b048k722P718k233o024N69L115O732N156j0773q493J2610M758j4194L217
1028b612J7629o476j6943L520P026k165J933J111m189M007j285j4924L860K1269
1042A1761n915j7754R535R111j4447k698J5061K288m374n73q101p39J3929k480
$$ y = [-7255, 4666, 6586, -6257, -7216, 4233, 1233, -9486, -5517, 4390, 3135, -3632, -5842, -2905, 2638, 1292, -4317, 1108, 10557, 2143, -9514, -92, 10650, 2897, -3107, 3538, 5918, -202, -3569, -1488, 4427, 7259, -1239, -8699, -637, 4116, -6585, -7930, 5737, 6016, -7551, -8771, 415, 1813, -1212, -1365, -33, 2590, 1246, -6487, -3784, 10838, 9520, -4971, -2267, 8436, 1341, -7101, 2149, 9495, 3770, -2268, -4469, -2400, 3784, 1888, -5828, 128, 7798, -6080, -15955, -707, 8900, -2048, -4770, 2948, 715, -5309, -4740, -1625, 5107, 10263, -510, -9003, 3607, 8365, -5829, -2612, 15017, 8541, -8402, -4882, 2144, -21, 1912, 3023, -1166, 2841, 1556, -13368, -9508, 11761, 5846, -11908, -2373, 6738, -7709, -10407, 4654, 6942, 2568, 1995, -6106, -6845, 7084, 4604]
1056D604j1398J3900R285k2705q001K1340K573j2575M997L410r594K53J720m692
1070f883J1477J0008k0741j0157J9983o71j7506J3668J6643j5788j0015P960j537
1083c559K470J1749p286q178J2873m924k0369J5045K3299j5660j3530J3868k482
1096C316j4041Q466Q004m892M741k358j8042O791J8786j2254r760K0714m79k4738
1110a5746M870J7684n518k453P884p566l570R814o949o359J9628K158k4483K845
1124g761J9655j0507r241J5130J059j2989K291N12n214J1121M429j7037J747J5278
1138H473j2042j1148J9379P230j7401r02Q586n496M33Q148m230r6Q275j0224j0835
1153a1850J5983Q097j6159O83J3625q800j0530Q853L951m008L351k974p783P307
$$ y = [4604, -6794, 7106, 16391, -6314, -14315, 7025, 9598, -2977, 2020, 5430, -4164, -3911, -2191, -6883, 4594, 14602, -6139, -16296, 3687, 3016, -14490, -822, 15821, 33, -9982, -2022, -3559, -1089, 10660, 3374, -4804, 8069, 3145, -17224, -2179, 21120, 5460, -8070, 5798, 3316, -10725, -2259, 5745, 853, 5594, 3236, -14806, -8015, 10771, -1483, -11243, 9471, 8992, -15746, -10876, 6808, 1290, -1163, 6721, -845, -4415, 5399, -1550, -7909, 11719, 13877, -10606, -7761, 11894, 1387, -7854, 7276, 8335, -4654, -2363, -1851, -7065, 4056, 8485, -8552, -6805, 8473, -3569, -14717, 4662, 11892, -5509, -6411, 2175, -3321, -2888, 5260, 1030, 934, 9209, -1015, -11850, 4133, 12230, -3929, -3246, 10379, 1579, -8951, -98, 3853, -155, 3196, 222, -7561, -254]
1167b54L514j1725L434J4730p924j2673R850O215q567M16O269k661l47J685n174
1182c212K685R496o412q682R287M639j1744n62J0513k314o757J925J110p65K289
1197A496k674l857O439J396j0294J398J1545l170p961N075M379n252j690L113
1211e7J226K401p72n439K009O594m845n189P461L910q246l347N132J005k793o09
1227a559J228J809l1n343j971O826J692o900J55P326j334o402J570N659M4l105
1243c36j181K286K887k262m593L899N872m488n780M403M302m686m148L054L211
1258B440j472l930j31M467Q51n581j865O147J453n740j238O145J627m846j781
1273c454M376L411l210l687K821M414k635n183K624N879k064n735J039M965j369
$$ y = [-254, 3260, -8465, -5031, 9699, 1775, -10898, -1048, 5167, -3400, -2984, 3285, 624, 277, 1962, -3212, -527, 8969, 2557, -6125, 3162, 7801, -3943, -4505, 6008, 3694, -3063, -1138, -28, -793, 1496, -1178, -5035, 1404, 2800, -7494, -6096, 5449, 2279, -5682, -607, 3772, -1480, -3170, -57, 1169, 3570, 2798, -2641, -632, 5962, 1117, -4072, 3389, 7299, -947, -4294, 838, 1843, -950, -1559, -331, 1478, 1447, -3896, -5867, 959, 2651, -4249, -4094, 3232, 1898, -4504, -2934, 2725, 2769, -336, -1517, 769, 3656, 1394, -3199, 700, 6572, 2084, -3696, 707, 5009, 323, -3825, -771, 2440, 968, -2962, -3093, 1374, 2225, -3356, -5221, 926, 2379, -3361, -4599, 1546, 3173, -1673, -3454, 922, 4333, 1123, -2564, 257, 4671, 2036, -3147, -523, 5356, 3292, -2443, -1404, 3561, 2192]
1288B192n478Q7N299O42n337k393N327K405n281k663N248L339m533l531L824M538
1304C685k571m348K556N344j472n894J243N876p53n737L39N174N85n141j929M268
1320A225K255m720l383M375L474m442m237M113M324l100m398K503M794j439m807
1335c463P82N663N93n564k66N941Q14n727j287N351J505m511k453L773K831l485
1351D97m213K666M686l152n029K169M894k163m643J550M495j74m302m95M609J581
1367B976m548j703N099K335m384k083L952K502k961l308K222L667j902m428J391
1382a173M430j463n342J200M589j144m272p9L842M64l363j273L578K821l702k894
1398c781M116L199l772k551L996K478k781k446J897K506m37l305l80L705L72n044
$$ y = [2192, -3286, -3199, 2100, 2742, -2595, -4988, 339, 2744, -2537, -5200, 48, 3387, -1146, -4677, -853, 3685, 1114, -3234, -678, 4666, 3194, -2700, -1457, 4419, 3666, -2071, -1732, 3442, 4027, -1114, -3043, 1225, 3480, -1240, -4623, -248, 3226, -1216, -5453, -1340, 2984, -116, -4514, -2011, 2783, 1344, -3463, -2681, 2982, 3575, -1989, -2255, 3686, 4500, -1227, -2514, 2837, 4342, -169, -2622, 1151, 3982, 497, -3716, -1050, 3636, 484, -4545, -2376, 2518, 355, -4288, -2738, 1757, 1583, -2719, -3214, 1395, 2976, -1572, -3275, 1824, 4159, -225, -2308, 1644, 4146, 1185, -2123, 99, 3766, 1864, -2564, -1173, 3257, 1794, -3548, -2348, 2241, 1097, -3175, -3254, 588, 1052, -2311, -3584, -6, 2815, -887, -3781, 335, 3534, -238, -2789, 1207, 3685, 904, -1542, 355, 2861, 2424, -881, -1261, 2444, 2816, -2228]
1414b228l76N295l79n025kL596n10k250m35J760J876j568l321J720M711k001l949
1431c086L235L428l568k455L270K303j230j575o71J308J444k684j703M237J503
1446C756n617j832M700M16l628O74K496j069j714r83O36L240Q15l897J36M152
1462B281j883m023L776M372k751k922J179Q45j0L33r23J408J797l926l749M308
1478A12L482m061j849L679n19m162M03K651J320n7k258j803K844J281l518J209
1494a246N676j652n848J241M145j090j080J372O17n72j748k271K202M499k030
1509B215n121K375K593m508j618N035K029l360k065J9J163J456p29j118L344J091
1525B801n858j162O302J974m270o6K812j511k834Q39K456J940n74m253j128M003
$$ y = [-2228, -2604, 2691, 2312, -2713, -2715, 881, 371, -1879, -2314, -554, 1322, -246, -3567, -1847, 2864, 863, -3086, 149, 3577, 9, -2446, 824, 3127, 1897, 322, -349, 959, 2403, -281, -1984, 2253, 3756, -1861, -3693, 1007, 1423, -2205, -1531, 965, -104, -1818, -2801, -2165, 1075, 1890, -2007, -1871, 2281, 398, -3625, 151, 4523, 1772, -1150, 29, 874, 864, 1197, 274, 1682, 3479, -447, -4196, 112, 3594, -467, -2316, 1363, 844, -3318, -2915, -264, 1056, 999, -1259, -3062, -218, 1063, -2455, -1246, 4430, 2778, -3070, -1829, 2316, 1226, 146, 1518, 2135, 1563, -185, -2456, -254, 4245, 2215, -2906, -531, 2062, -2446, -4064, 971, 3000, -360, -2425, -2406, -1243, 213, -516, -1634, 1710, 2801, -3057, -4219, 2083, 4057, -213, -279, 2533, 1022, -1812, -973, 1483, 3423, 2849, -1404, -2532, 1471]
1541A471m26l971K348M891l899n570K601L526q13q80N94L22j05j836k072L699
1557a20N036l405m545L202K960m196j000N133J297l757k223L47J439K115j373
1572I10j771K766M24o300r94O867J530n444k6K943k083j917J612K059J746j85
1588B137m580j186N203O25m398L050N129m798n400L520L260j311k6l5j215L76
1604C51j211k808L543N322m248n638L813K341m895M73N406j33l337p68n75J297
1620a067L501j558k510L797J111o576J54P193r6m916J254J653k681l09J044O8
1636F2K137J32n451m16N518j058m328L382L438m949k898L392J581l32Q70j157
1652g7q26K128j520k734M386L912n013l063M290N16l514J600K642j317j304q75
$$ y = [1471, 1045, -2926, -578, 4313, 414, -5156, -2555, 971, 158, -722, -128, 194, 89, -1747, -3819, -120, 4916, 1511, -3034, 168, 3128, -1068, -2068, 3065, 4362, 605, -1618, -1271, 168, 2283, 910, -861, 1905, 2329, -3971, -4965, 1902, 3432, -2012, -2038, 905, -1178, -3095, -1483, 576, 2322, 2137, -2443, -3629, 1574, 2199, -2199, 851, 5980, 1182, -4218, -698, 2562, 1251, 1225, 1190, -25, 351, -860, -3668, -125, 5197, 949, -4689, -876, 1465, -3430, -2957, 2449, 2316, -1021, -1789, -2364, -1067, 2434, 876, -1634, 2163, 3274, -3302, -3148, 4045, 3949, -967, 287, 1940, -741, -1050, -6, 62, 2199, 2331, -3120, -3536, 1982, 924, -3404, -22, 3416, -1533, -4431, -1039, 542, 210, 1080, -77, -903, 1225, -295, -3029, 1357, 5269, 256, -2807, 1483, 1999, -1515, 85, 2727, 1410, 106, -769]
1668g69j668J987K352l017q97L802r09m904J583M462j502k071J255L15o42J92
1684d31j26N71K697r44l972J627L572k424k266L360J155l073q52J556K34J1p39
1701d4j416J159J321k631j009L408J008l691k57K747l78j714O80J417j4l48j212
1718i74M36K320j13k309N84K673j800k627J884K151j417j412M78O04j48j175o03
1735a448J505J207k166j423K032J423k393o15K325O50j831o95J364J090n43r77
1751d95M73J918l57k464M52K627p14k356N82J677j83k154R6J366J91j447r47J120
1769f15J680j786j571J742J780j805j466J894J710j344j587J078J547j00j743
1784e86J88K105J18k356n34K548K59k467k75J799N77k008r96J507J068j060j664
$$ y = [-769, -2437, -450, 1902, -1115, -2012, 1790, 881, -4023, -2440, 2022, 520, -1551, -296, 19, -623, -431, -557, 14, 2711, 1767, -2205, -578, 2994, 570, -1696, 1664, 2819, -254, -1106, 450, 684, 695, -44, -1460, -301, 1020, -1611, -2620, 788, 1796, -1895, -2152, 595, 217, -1497, -817, 600, 586, 238, -974, -538, 1782, 1669, -640, -56, 2617, 817, -1810, 74, 2225, 808, -604, -126, 478, 330, -845, -1448, 57, 1264, -902, -2325, -293, 1130, -1263, -1878, 447, 1097, -734, -1429, -65, 1025, 482, -495, -22, 1896, 1539, -925, -473, 2154, 1440, -916, -334, 1343, 1160, -994, -898, 468, 659, -788, -1735, -615, 1065, -721, -2292, -550, 1230, -575, -2041, -147, 1563, 219, -1368, -290, 1257, 1157, -586, -398, 1707, 1825, -531, -1065, 1483, 1742, -725, -1000, 799, 1376, -632, -1628, -121, 947, -113, -1777]
1801a777Q14J927j098k254J211K642q35k211P26K067l34j731p3K146N80j730j104
1818a034J992J253k201j053J744J291k033j482J418J402j066j848P63J727l49
1833E24k374k7K402J09k120j10K454M88k180m05J942J018j627j019J373J480j292
1850F36j739J315J889j077k247J164J689j013j948K56J792n9j921m46K048N57
1866H96k093p91K040J067j921r94K062J102j510p59J015J415o98j562N39J856
1882A664p2k449K67K319k29k478Q4J877r5j699m99J192O00q56j218J133J373j323
1900d09j499J343J885j292j470J220J344o81r85M36J274K42j526o83J757R14k000
1917a30p53J986L31k302k60J475K76q95m84J89P32o0j490K94K236p24k186R96
$$ y = [-1777, -963, 964, -134, -2388, -1177, 1465, 630, -1581, -855, 1212, 878, -853, -926, 1220, 1800, 70, -1034, 958, 2211, 10, -1043, 701, 1992, -41, -1523, -105, 1297, 231, -1617, -854, 873, 524, -1850, -1877, 525, 634, -1486, -1596, 858, 1346, -834, -1239, 703, 1721, 94, -925, 448, 1928, 636, -1103, 212, 2101, 1024, -1223, -59, 1630, 617, -1331, -1075, 717, 658, -1263, -1709, 339, 896, -1197, -1988, 52, 1119, -802, -1796, 266, 1368, -142, -901, 114, 1529, 831, -731, -192, 1664, 1592, -857, -590, 1729, 1500, -978, -894, 983, 888, -811, -1310, -118, 482, -374, -1592, -459, 914, -409, -1908, -565, 1320, 28, -1442, -222, 1122, 441, -544, -108, 1166, 1408, -118, -801, 956, 1870, -130, -883, 1103, 1434, -868, -1128, 347, 623, -272, -756, -567, 165, 105, -1385, -1091, 1145, 421, -1765, -769]
1935g69J849q67j348J305R02l49q81LL15J320p23j475J068J328j741j416K292
1952H13P87k154m39J179k10o05O1k84J052K59j548o91K306M34k249O22J895r33
1970B95j745J430R77n5j15o93l13J068o4j863J014K254j550k445J711R88j549
1987f55j14J285l08p77m9q29Q07J752j440j096K000L41k550L77K902k99j766L14
2005a05M47m63O16k0k25J366m58k617K95K811r73j894J645Q84k376n93J198M23
2023c9L38R5j461j39J607j076j196K907J311k974r29K009Mo95P97O45o44O5j043
2042d18j132K479J326k555o20K285j178k662J875K264j333j014J50o68L76R17
2058I2r42N37K158j540l005J903K579j701o91K019l96j829M39L35K95J564p24
$$ y = [-769, 1080, 213, -1135, 170, 1072, 723, -158, -155, 160, 1480, 757, -718, 350, 1678, -63, -1479, 813, 1600, -554, -993, 186, -24, -629, -568, -852, 200, 459, -1089, -1780, 526, 960, -1289, -667, 1228, 295, -1450, -20, 957, 902, 787, 94, -219, 849, 785, -1078, -64, 2190, 640, -1805, -94, 894, -655, -769, 516, 208, -569, -618, -1447, -640, 1112, -328, -1424, 576, 917, -1633, -1256, 1646, 1347, -419, -105, 342, -121, 495, 475, 250, 1616, 1158, -1459, -1164, 1647, 674, -1220, 425, 1309, -1067, -1660, -462, -39, 299, 394, -1067, -1206, 401, -675, -1871, 1036, 2347, -627, -1556, 453, 457, -238, 559, 1204, 560, 625, -418, -1550, 929, 2255, -300, -920, 1365, 187, -2475, -600, 1664, 331, -683, -533, -1201, -825, 92, -850, -313, 1845, 305, -2700, -797, 1782, 81, -610, 1409, 1013, -816, -377, -42, 253, 1817, 1093]
2075A093k286R21J777k539n99L268J34l114m1J533o81j0Q02n08l5Q03j930p30
2093b142L289O17l117O05K473j862j365J986J095j041l2m11j058J780M96k259
2109i46J026K165k423k389K614J408k188j15J354q06p34M72l41L66J980j388j897
2126a842J994J468k737l1L219q74k177J035N88p71O77L02j479J086O92k403P0
2143a183K795n57k678J416J258k014m10J669j72j71L16j209k35J970m25j696J367
2160D1J790k250j179K488L49j478P50L59j057L91O2j113J268J235k069j094K140
2177F33kk254J091J495j200p73P06j46Q9Q17p89l18J581m78k015J135J986j104
2195D54j177J345M31j406L73O50l45K64j58j335N62J456j390q73J758Q0j907L7
$$ y = [1093, -1193, -272, 1505, -1034, -1633, 1635, 1769, -1345, -1386, 147, -534, -544, 258, -250, -285, 518, -1412, -2142, 1147, 1764, -1353, -748, 1725, -137, -1502, 484, 1579, 538, 506, 95, -963, 817, 1313, -946, 80, 2245, -178, -2567, 47, 1455, -733, -848, 506, -300, -1034, -562, -903, -537, 1443, 55, -1842, 152, 1620, -1117, -1148, 2071, 1197, -980, 55, 643, -128, 549, 851, -628, 458, 1150, -1253, -1183, 1612, 1055, -1623, -207, 1051, -963, -1373, 296, 124, -47, 269, -940, -1175, 795, 370, -1326, 41, 1831, -419, -1598, 890, 1239, -239, 511, 870, -187, 204, 266, -847, 421, 1656, -413, -1507, 633, 631, -1623, -532, 963, -237, -1010, -304, -450, -361, 456, -333, -651, 930, 452, -1563, -428, 1558, 454, -723, 622, 1053, -353, 20, 670, 325, 589, 431, -904, -342, 1114, -276, -1149, 609, 689, -1218, -1181]
2213a181J494l95m39L66j82J07K42n12l19J684j93j439N53J252p64o95Q69N66
2231A014o26k88j69J73L75j92p36M07Q04j375n02J199O50j247j78P34r3l94j50
2250e94K24N34L00p68j75R24J78j019J52J218k85j126L14N53j6l84r9K51L60l80
2270A62q20N00R72r79q70Q52O78o47l93J21N46j2p07P2P55K73p19j44R01L16r07
2291e0l34J155P1q16k28M59L88o27l91L41P16n87p98L22Q58n08q17K72P67Pq60
2312f60k0P90K67n63m50Q96M29p58n15R65M42m77q52Q61M16n50n55M01N53l52
2332B68p84j35J188j29j064q0R48J30p43l93P85L75p29l42O53N61l43q42P59N26
2352F09k87o26L36O35j46p30o6R58p1q61j04Q51K55r95m52O65M50q26l98P01M29
$$ y = [-1181, 313, -82, -521, -155, -337, -230, 12, -500, -819, 865, 672, -767, -214, 1038, 274, -421, 448, 1014, 388, 100, -69, 104, 479, 287, -449, -42, 762, -613, -1115, 84, 734, -513, -691, 43, -50, -444, -594, -370, 164, 464, -304, -479, 445, 623, -396, -244, 974, 689, -437, -123, 430, 414, 30, -69, 182, 542, 162, -658, -158, 814, -165, -1035, -183, 495, -152, -545, -424, 122, 110, -597, -525, 230, 503, -216, -360, 541, 857, -50, -384, 771, 842, 26, -202, 257, 645, 18, -373, -32, 684, 97, -701, -379, 479, -29, -846, -574, 193, 200, -660, -680, 110, 377, -186, -636, 260, 689, -69, -584, 381, 823, 346, -506, 355, 771, 221, -334, 67, 620, 268, -516, -651, 537, 408, -656, -736, 212, 342, -401, -794, -9, 366, -363, -705, -52, 509, 166, -676, 83, 609, 322, -304, 32, 667, 521, -209, -275, 683, 612, -249, -353, 498, 753, -242, -694, -29, 421, -405, -803, -102, 327]
2373C27m59o36M26P02l72o37M35N52q1q03M54N97J85r31n0Q86J17o16l24O37j00
2394C09m81m04N24N08l90o09L03M57k96o25M53O04k71q85L50O84k07l29L1M87
2414B13J71n60k78P91M70p63m87O91L74n83k06M94K50l56n37l3M33J41n60j24
2434d59Q69l57q18K81Q06j84n80L08K69m2k55j74L64M60l26n90M34O81n87m16
2454c16O45K45p00j32J54L21j26k36oJ59N8n12r6P39L43j048O3O59l11l96M30
2475f3L29N1j35n30L15M38K5o71M41M96n78o57N93N96m63l51K03m4j58k5j34L28
2497FK89m69o78P65K35n41k5J019l45n99n8M70O5K06j72k21M95l0n73R3R66l50
2519E48q34L13M47o56j25M10J63j54j61n94J27P36j59n78O28L21j119o5Q00L77
$$ y = [327, -132, -768, -342, 360, -12, -649, -214, 338, 257, -546, -92, 505, 690, -241, -291, 595, 712, 96, -228, 409, 309, -172, -576, -52, 456, 66, -543, -240, 217, -79, -704, -251, 353, 82, -803, -453, 231, 24, -305, -274, 213, 384, -176, -454, 337, 807, 44, -443, 248, 622, 39, -167, 327, 577, 221, -316, -349, 84, 225, -335, -459, 410, 53, -765, -484, 322, 138, -442, -134, 135, 93, -162, -336, 28, 488, 162, -428, 6, 687, 100, -316, 329, 574, -126, -258, -104, 217, 91, -145, -151, 8, 66, -446, -542, 197, 540, -508, -445, 214, -97, -493, -63, 266, 317, 182, -348, -33, 405, 430, -241, 200, 696, 118, -539, 54, 650, 187, -164, 39, -5, -163, -188, -322, 6, 295, -174, -852, -87, 148, -393, -418, 601, 256, -343, -401, 69, 134, 340, 168, -53, 442, 412, -161, -68, 898, 548, -286, 27, 474, -182, -307, 103, 266, 112, -49, -643, -516, 220, 61, -517, 111, 432, -687, -752, 48, 425]
2539D25l98J22p8j42L80l32j18P53K93j263k7Q04p8n04K77N62p39l34k1P4M76
2560A32K19p40j08P61m41p26R51O75p04m74K89R9j51L39M1J36L18o22o76Q62P02
2581H82p80l79Q01j96q22N8P17k30K87l35o19L10M04m66k15J166j38j247K51R25
2601C74j76l51M12j23p8k07q8K14O89L6r49K39O58o86n92J110K65p42k59J89q4
2622a49M5O5j94K09M36q70n66J241L19p66k5O84k43n70L22L51R0J1j32m27L39
2643A70L54q96J68R17l49q21J61O72m65m1K54o4o7q2m31J04O72r7q44M93O92p47
2665b47l81P20L82m56m5O9k7J54ql48M78L47q04k83O30L15p11J68M40o57q4J34
2687b14K19o2J12k97p7M32J8o88L50P17m21m07L13J34p4K1K19q2J28k94l09J58
$$ y = [425, 27, 149, 71, -71, 309, -23, -141, 612, 905, -358, -385, 419, 341, -163, 114, 676, -63, -397, -418, -344, 132, 351, -389, -497, 264, -177, -903, 48, 723, 19, -455, -166, -67, -218, 121, 162, 298, 616, -6, -682, 180, 882, 102, -277, 524, 328, -494, -436, 281, 51, 338, 3, -616, -306, 98, -368, -583, 583, 445, -802, -551, 374, 198, -153, 259, 136, 58, -149, -237, -23, 666, 702, -247, -8, 650, -36, -628, 482, 747, 5, -254, -65, -149, -104, -39, -233, -24, 412, -458, -1024, 217, 536, -230, -255, 429, 186, -384, -62, 289, 379, 390, 258, -169, 170, 524, -372, -204, 713, 364, -457, -296, 376, -89, -130, 124, 60, -7, -89, -520, -416, 256, 159, -685, -192, 500, -247, -628, 92, 474, 18, -27, 42, 15, 169, 161, -187, 291, 638, -166, -449, 181, 496, -215, -47, 393, -264, -348, -214, 5, -57, 55, -242, -319, 113, 131, -557, -207, 510, 89, -318, -5, 129, 55, 76, 295, 213, 341, 47, -262, -104]
2709a04N48j71n27N19J78o82k37N55M7k97N5j23L46m3j88J08K43k1o85K85M04
2730B10P4n59K38L55l37k63K64K87J7j69k32J48K03p7n40M62L35m88k28J80J76
2751E6j95j16J6N6J70k51j20N11J43m74n9M31n6k57J3M91Q2l61j85J93J77j28
2773A37k06m0L29j26m30J98L10j73l01J56J86j03j98l8K36J81l17O3O5J41k41
$$ y = [-104, 444, 273, -254, 265, 443, -239, -476, 79, 126, -171, -116, -239, 107, 64, -124, -16, 227, 206, -479, -194, 210, 284, -275, -37, 318, -19, -282, -18, 269, 286, 117, -115, 33, 236, 159, -381, 81, 416, -72, -300, -120, 56, -139, -255, -239, -183, -13, -264, -384, 127, 270, -204, -263, 168, 112, -145, -132, 359, 441, 80, -105, 88, 265, 137, -69, -109, 220, 94, -336, -138, 172, -1, -302, -146, 40, -63, -261, -299, -63, 118, -199, -136, -71, 70, -171]
$$ [...]
8191a04
##END NTUPLES=NMR FID
##END=
