##TITLE=1H_SR95_oil
 d2O
 8 sc, 
 28.10.2021
##JCAMPDX= 6.0         $$ Bruker NMR JCAMP-DX V2.0
##DATA TYPE= NMR FID
##DATA CLASS= NTUPLES
##ORIGIN= UXNMR, Bruker Analytische Messtechnik GmbH
##OWNER= root
$$ XWIN-NMR		Version 3.5
$$ Thu Oct 28 10:27:14 2021 Russian Standard Time (UT+4h)  she@DPX200
##.OBSERVE FREQUENCY= 200.1313468511
##.OBSERVE NUCLEUS= ^1H
##.DELAY= (6, 6)
##.ACQUISITION MODE= SIMULTANEOUS
##.ACQUISITION SCHEME= undefined
##.AVERAGES= 8
##.DIGITISER RES= 18
##SPECTROMETER/DATA SYSTEM= spect
##.PULSE SEQUENCE= zg30
##.SOLVENT NAME= D2O
##.SHIFT REFERENCE= (INTERNAL, D2O, 0, 15.7039)
##AUDIT TRAIL= $$ (NUMBER, WHEN, WHO, WHERE, WHAT)
$$ ##TITLE= Audit trail, XWIN-NMR		Version 3.5
$$ ##JCAMPDX= 5.01
$$ ##ORIGIN= Bruker BioSpin GmbH
$$ ##OWNER= she
$$ F:/spectra/data/she/nmr/H-F/1/audita.txt
$$ ##AUDIT TRAIL=  $$ (NUMBER, WHEN, WHO, WHERE, WHAT)
(   1,<2021-10-28 10:26:10.37 +0400>,<she>,<DPX200>,
      <created by zg, POWCHK disabled, PULCHK disabled
       configuration hash MD5:
       00 E9 B6 7A A2 85 ED C7 34 08 36 98 17 FE 4E 26
       data hash MD5: 16K
       B4 6B 26 13 69 3A 2D 53 40 8F CC B9 58 D5 E0 68>)
$$ ##END=
$$ 
$$ hash MD5
$$ 41 96 9E 60 00 FC 43 20 6E EE FF 64 4B 44 E7 8C
##$RELAX= 
##$RELAX= 
##$RELAX= 
##$RELAX= 
##$RELAX= 
##$RELAX= 
$$ Bruker specific parameters
$$ --------------------------
##$DU= <F:/spectra>
##$EXPNO= 1
##$NAME= <H-F>
##$PROCNO= 1
##$TYPE= <nmr>
##$USER= <she>
##$AMP= (0..31)
100 100 100 100 100 100 100 100 100 100 100 100 100 100 100 100 100 100 
100 100 100 100 100 100 100 100 100 100 100 100 100 100 
##$AQSEQ= 0
##$AQ_mod= 1
##$AUNM= <au_zg>
##$AUTOPOS= <>
##$BF1= 200.13
##$BF2= 200.13
##$BF3= 200.13
##$BF4= 200.13
##$BF5= 200.13
##$BF6= 200.13
##$BF7= 200.13
##$BF8= 200.13
##$BYTORDA= 1
##$CFDGTYP= 0
##$CFRGTYP= 5
##$CHEMSTR= <none>
##$CNST= (0..31)
1 1 145 1 1 1 1 1 1 1 1 1 1 1 1 1 1 1 1 1 1 1 1 1 1 1 1 1 1 1 1 1 
##$CPDPRG= <>
##$CPDPRG1= <>
##$CPDPRG2= <>
##$CPDPRG3= <>
##$CPDPRG4= <mlev>
##$CPDPRG5= <mlev>
##$CPDPRG6= <mlev>
##$CPDPRG7= <mlev>
##$CPDPRG8= <mlev>
##$CPDPRGB= <>
##$CPDPRGT= <>
##$D= (0..31)
0 1.2 0 0 0 0 0 0 0 0.06 0 0.03 0 0 0 0 0.0002 0 0 0 0 0 0 0 0 0 0 0 0 
0 0 0 
##$DATE= 1635402369
##$DBL= (0..7)
120 120 120 120 120 120 120 120 
##$DBP= (0..7)
150 150 150 150 150 150 150 150 
##$DBP07= 0
##$DBPNAM0= <>
##$DBPNAM1= <>
##$DBPNAM2= <>
##$DBPNAM3= <>
##$DBPNAM4= <>
##$DBPNAM5= <>
##$DBPNAM6= <>
##$DBPNAM7= <>
##$DBPOAL= (0..7)
0.5 0.5 0.5 0.5 0.5 0.5 0.5 0.5 
##$DBPOFFS= (0..7)
0 0 0 0 0 0 0 0 
##$DE= 6
##$DECBNUC= <off>
##$DECIM= 32
##$DECNUC= <off>
##$DECSTAT= 4
##$DIGMOD= 1
##$DIGTYP= 9
##$DL= (0..7)
0 120 120 120 120 120 120 120 
##$DP= (0..7)
150 150 150 150 150 150 150 150 
##$DP07= 0
##$DPNAME0= <>
##$DPNAME1= <>
##$DPNAME2= <>
##$DPNAME3= <>
##$DPNAME4= <>
##$DPNAME5= <>
##$DPNAME6= <>
##$DPNAME7= <>
##$DPOAL= (0..7)
0.5 0.5 0.5 0.5 0.5 0.5 0.5 0.5 
##$DPOFFS= (0..7)
0 0 0 0 0 0 0 0 
##$DQDMODE= 0
##$DR= 18
##$DS= 0
##$DSLIST= <SSSSSSSSSSSSSSS>
$$ [...]
##$SUBNAM2= <"">
##$SUBNAM3= <"">
##$SUBNAM4= <"">
##$SUBNAM5= <"">
##$SUBNAM6= <"">
##$SUBNAM7= <"">
##$SUBNAM8= <"">
##$SUBNAM9= <"">
##$SW= 18.0517286264689
##$SWIBOX= (0..15)
0 0 2 0 0 0 0 0 0 0 0 0 0 0 0 0 
##$SW_h= 3612.71676300578
##$TD= 16384
##$TD0= 1
##$TE= 0
##$TE2= 300
##$TE3= 300
##$TEG= 300
##$TL= (0..7)
0 120 120 120 120 120 120 120 
##$TP= (0..7)
150 150 150 150 150 150 150 150 
##$TP07= 0
##$TPNAME0= <>
##$TPNAME1= <>
##$TPNAME2= <>
##$TPNAME3= <>
##$TPNAME4= <>
##$TPNAME5= <>
##$TPNAME6= <>
##$TPNAME7= <>
##$TPOAL= (0..7)
0.5 0.5 0.5 0.5 0.5 0.5 0.5 0.5 
##$TPOFFS= (0..7)
0 0 0 0 0 0 0 0 
##$TUNHIN= 0
##$TUNHOUT= 0
##$TUNXOUT= 0
##$USERA1= <user>
##$USERA2= <user>
##$USERA3= <user>
##$USERA4= <user>
##$USERA5= <user>
##$V9= 5
##$VALIST= <valist>
##$VCLIST= <CCCCCCCCCCCCCCC>
##$VD= 0
##$VDLIST= <DDDDDDDDDDDDDDD>
##$VPLIST= <PPPPPPPPPPPPPPP>
##$VTLIST= <TTTTTTTTTTTTTTT>
##$WBST= 1024
##$WBSW= 4
##$XGAIN= (0..3)
0 0 0 0 
##$XL= 0
##$YL= 0
##$YMAX_a= 130922
##$YMIN_a= -172112
##$ZGOPTNS= <>
##$ZL1= 120
##$ZL2= 120
##$ZL3= 120
##$ZL4= 120
##$ABSF1= 10
##$ABSF2= 0
##$ABSG= 5
##$ABSL= 3
##$ALPHA= 0
##$AQORDER= 0
##$ASSFAC= 0
##$ASSFACI= 0
##$ASSFACX= 0
##$ASSWID= 0
##$AUNMP= <proc_1d>
##$AZFE= 0.1
##$AZFW= 0.1
##$BCFW= 1
##$BC_mod= 2
##$BYTORDP= 1
##$COROFFS= 0
##$CY= 11.3945322036743
##$DATMOD= 1
##$DC= 2
##$DFILT= <>
##$DTYPP= 0
##$F1P= 2.36226072786647
##$F2P= -0.459571619588291
##$FCOR= 0.5
##$FTSIZE= 0
##$FT_mod= 4
##$GAMMA= 1
##$GB= 0.15
##$INTBC= 1
##$INTSCL= 1
##$ISEN= 128
##$LB= 0.24
##$LEV0= 0
##$LPBIN= 0
##$MAXI= 10000
##$MC2= 0
##$MEAN= 0
##$ME_mod= 0
##$MI= 1.114404
##$NCOEF= 0
##$NC_proc= 0
##$NLEV= 6
##$NOISF1= 3.799351
##$NOISF2= 2.8
##$NSP= 1
##$NTH_PI= 0
##$NZP= 0
##$OFFSET= 15.70392
##$PC= 1
##$PHC0= -15158.74
##$PHC1= 12.40082
##$PH_mod= 1
##$PKNL= yes
##$PPARMOD= 0
##$PSCAL= 0
##$PSIGN= 0
##$REVERSE= no
##$SF= 200.130013532006
##$SI= 16384
##$SIGF1= 3
##$SIGF2= 2
##$SINO= 400
##$SIOLD= 16384
##$SREGLST= <1H.CDCl3>
##$SSB= 0
##$STSI= 0
##$STSR= 0
##$SW_p= 3612.71676300578
##$SYMM= 0
##$S_DEV= 0
##$TDeff= 0
##$TDoff= 0
##$TI= <>
##$TILT= no
##$TM1= 0
##$TM2= 0
##$TOPLEV= 0
##$USERP1= <user>
##$USERP2= <user>
##$USERP3= <user>
##$USERP4= <user>
##$USERP5= <user>
##$WDW= 1
##$XDIM= 8192
##$YMAX_p= 0
##$YMIN_p= 0
$$ End of Bruker specific parameters
$$ ---------------------------------
##NTUPLES= NMR FID
##VAR_NAME=  TIME,          FID/REAL,        FID/IMAG
##SYMBOL=    X,             R,               I
##VAR_TYPE=  INDEPENDENT,   DEPENDENT,       DEPENDENT
##VAR_FORM=  AFFN,          ASDF,            ASDF
##VAR_DIM=   8192,          8192,            8192
##UNITS=     SECONDS,       ARBITRARY UNITS, ARBITRARY UNITS
##FACTOR=    0.0002768,     1,               1
##FIRST=     0,             0,               0
##LAST=      2.2672688,     0,               0
##MIN=       0,             -172112,         0
##MAX=       2.2672688,     130922,          0
$$ Real data points
##PAGE= N=1
##DATA TABLE= (X++(R..R)), XYDATA
0 0 0 0 0 0 0 0 0 0 0 0 0 0 0 0 -8 8 -8 8 -8 16 -16 24 -24 32 -32 40 -48 56 -63 72 -80 92 -104 120 -135 151
36 151 -168 188 -212 236 -263 292 -324 358 -396 439 -483 535 -589 648 -715 787 -867 958
54 958 -1059 1172 -1299 1447 -1619 1819 -2062 2357 -2729 3212 -3868 4816 -6318 9077 -15813
69 -15813 72481 33437 -96659 -66058 -90998 -79382 2973 83070 91190 84305 22557 -42989
81 -42989 -63645 -75305 -86498 -11256 72613 86752 79506 54899 -36506 -93120 -75897 -67431 -36276
94 -36276 76330 130922 68917 8978 -22739 -80359 -100755 -51455 10144 64079 91655 56565
106 56565 14267 -8170 -63390 -106768 -54721 17319 44681 76301 88002 26235 -37600 -63222
118 -63222 -87528 -69407 14506 70629 71277 66249 32561 -38880 -78617 -72839 -46640 9357 60374
131 60374 64365 55742 38855 -25522 -84092 -71402 -35013 -3778 48552 82838 59678 18406
143 18406 -22976 -69398 -77575 -37039 5504 42693 77558 67637 14370 -33739 -64222 -71726 -36589
156 -36589 13463 42971 63447 63466 18150 -34830 -56568 -61117 -45789 4323 51582 65206 55394
169 55394 20088 -31969 -61822 -58774 -39671 1121 50643 68224 50187 16125 -28036 -62517
181 -62517 -60082 -30940 5822 44371 64358 47473 12834 -23092 -55368 -62129 -33740 7181
193 7181 42917 62519 50498 10793 -28443 -52738 -57937 -33974 9122 44087 58025 48231 12893
206 12893 -28575 -53710 -54794 -31505 8478 43369 55643 44516 14158 -26433 -53496 -53478 -31007
219 -31007 6778 43621 57870 42670 10681 -26460 -52336 -52099 -27043 8257 40575 54796
231 54796 42181 10113 -25693 -50705 -51444 -26772 8740 39717 53655 41677 9014 -26241
243 -26241 -49028 -50193 -26898 9980 40854 51934 39620 8874 -26360 -48577 -47839 -24950 9254
256 9254 39211 50921 38914 8138 -26550 -47706 -46463 -24218 9634 39406 50099 36630
268 36630 7268 -25458 -46820 -46163 -23205 10284 38752 48801 36059 6870 -25607 -46270
280 -46270 -44814 -22115 10065 37800 47731 35324 5928 -25408 -44979 -43416 -21572 10348 37740
293 37740 46801 33878 5256 -25249 -44563 -42464 -20455 10876 36935 45503 33025 5072 -25333
306 -25333 -43797 -41641 -19835 10884 36377 44953 32248 4220 -25086 -42385 -40255 -19565 10717
319 10717 36265 44116 31089 4050 -24957 -42257 -39598 -18204 11551 35255 42520 30497 4104
332 4104 -24766 -41509 -38510 -17371 11434 35119 42322 29572 2792 -24532 -40420 -37526 -17320
345 -17320 11201 34309 41179 28357 2562 -24607 -40250 -36588 -15726 11981 33610 39771 27948
358 27948 2511 -24352 -39454 -35919 -15652 11594 34140 39865 26629 1456 -23720 -38323
370 -38323 -34579 -15166 11388 32984 38980 26069 1368 -23688 -38321 -34254 -13777 12487 32734
383 32734 37552 25104 1398 -23128 -37197 -34188 -13984 12879 32397 36571 24589 618 -23875
396 -23875 -36445 -32100 -13054 12291 31360 35999 24860 888 -24276 -36484 -30824 -12465 12044
409 12044 31584 35183 22831 887 -23180 -36294 -30486 -11324 11681 30923 35843 22253 -870
422 -870 -22738 -34744 -29541 -10745 10967 29838 35918 22389 -2441 -22877 -32922 -30588 -11323
435 -11323 13543 30052 33264 21821 -1752 -23482 -32488 -28875 -11730 13629 31204 32181 19605
448 19605 -1805 -23239 -31836 -26607 -11776 11569 31545 32420 18366 -653 -21628 -34929 -27866
461 -27866 -7628 13538 29411 31856 17392 -2621 -20740 -32411 -27754 -7160 13926 27241
473 27241 31375 18892 -4122 -21232 -29844 -27896 -9151 15031 28012 29530 20447 -2422 -25676
486 -25676 -31713 -23876 -7480 15292 29412 26878 15514 -1920 -22280 -30332 -22560 -8096 11057
499 11057 28647 29917 15179 -1954 -20629 -32802 -24684 -4665 12616 27041 31328 15447 -6386
512 -6386 -21181 -28681 -24293 -4341 15636 24655 26232 16286 -4605 -20727 -27012 -24338 -7741 15377
526 15377 26759 25651 17342 -3076 -24936 -29235 -19546 -5740 13589 28319 25657 12517 -3556
539 -3556 -21368 -29240 -19425 -3468 11613 25918 27134 13038 -4305 -19641 -29583 -22208 -2197
552 -2197 13574 24531 27975 13929 -8661 -21525 -24621 -20495 -4041 14849 24059 24206 14277 -5973
566 -5973 -22444 -24775 -19500 -5880 14691 26897 23067 11835 -4903 -21982 -25808 -17197 -4319
579 -4319 12966 27127 24093 9170 -5187 -18743 -26521 -18738 -1879 12881 24277 24770 10549
592 10549 -7080 -19306 -25475 -19346 -1455 15361 23184 22073 10718 -7016 -19275 -23074 -18898
605 -18898 -3152 15444 23592 20938 11525 -4876 -21089 -24813 -16784 -2407 14181 24347 21005
618 21005 9597 -5869 -20507 -24320 -15549 -740 13062 22834 21115 8708 -5916 -18448 -24139
631 -24139 -16973 -582 14086 22464 21642 9390 -8070 -20179 -22608 -14933 -391 14165 21693
644 21693 19476 8776 -6888 -19296 -21969 -15029 -1190 13954 22472 19790 8442 -6668 -19730
657 -19730 -22842 -14593 -162 13946 22098 19731 7132 -8214 -18709 -21348 -13875 448 13614
670 13614 20888 18430 7674 -7251 -18436 -21024 -13882 -162 14488 21290 18327 7126 -7954
683 -7954 -19049 -21000 -12857 616 14015 21045 17662 6450 -7625 -18443 -20455 -12344 727
696 727 13149 20615 17898 5876 -8072 -17811 -20078 -12648 1450 14188 19677 17010 6118 -8295
710 -8295 -18159 -19432 -11860 1431 14142 19418 16427 5526 -8505 -18415 -18714 -11324 716 13833
724 13833 20206 15975 4871 -7848 -17780 -19058 -11243 2003 13784 19656 15392 4510 -8179
737 -8179 -17580 -18782 -10427 2376 13550 19059 15606 4061 -8915 -16906 -17703 -11014 2351 14292
751 14292 18817 14512 3970 -8614 -17277 -17938 -10024 2966 14023 18109 14188 4149 -8897 -17468
765 -17468 -17423 -9316 2775 13705 18212 13871 3294 -8656 -16873 -17451 -8701 3281 13604 17752
779 17752 13763 3071 -8873 -16846 -17025 -8762 3237 13602 17463 13143 2775 -9216 -17007 -16224
793 -16224 -8276 3407 13705 17563 12979 2686 -9383 -16569 -15670 -7966 3535 13697 17349 12491
807 12491 1887 -9357 -16229 -15655 -7570 3920 13232 16904 12145 1838 -9620 -16277 -15081 -7337
821 -7337 4215 13300 16601 11757 1265 -9515 -15963 -14852 -7392 4170 13788 16246 11257 1099
835 1099 -9351 -15785 -14447 -6469 4613 13305 15852 11149 1039 -9756 -15766 -14422 -5914 4741
849 4741 13442 15721 10742 667 -9484 -15401 -14079 -5725 4756 13220 15574 10492 418 -9778
863 -9778 -15118 -13301 -5315 4902 12782 14879 10237 335 -9698 -14879 -12988 -5221 5101 13194
877 13194 15169 9760 -80 -9659 -14821 -12900 -4895 5032 13062 14791 9283 -85 -9669 -14558 -12711
892 -12711 -4669 5370 12814 14160 8919 -353 -9378 -14601 -12311 -4234 5526 12588 14308 8415 -974
907 -974 -9424 -13487 -11932 -4208 5599 12418 13588 8501 -923 -9850 -14047 -11433 -3860 5872 12769
922 12769 13409 8102 -1040 -9985 -13844 -10908 -3549 5551 12621 13305 7307 -1201 -9532 -13642 -10976
937 -10976 -3446 5810 12287 13202 7397 -1503 -9423 -13680 -10846 -2850 5891 12036 12703 7364 -1679
952 -1679 -9802 -12788 -10446 -3071 6235 12107 12348 7205 -1768 -9921 -12795 -10247 -3093 6078 12280
967 12280 12163 6322 -1740 -9632 -12867 -9764 -2295 6302 11976 11548 6080 -1646 -9250 -12793 -9827
982 -9827 -2015 6184 11745 12220 6131 -2427 -9703 -12569 -9520 -1593 6630 11515 11169 5828 -2456 -9522
998 -9522 -12204 -8913 -1677 6445 11284 10958 6183 -2134 -10002 -12386 -8587 -1647 6447 11388 11005 5462
1014 5462 -2853 -9462 -11852 -8187 -1407 6299 11307 10968 5276 -2793 -9237 -11721 -8673 -1277 6543
1029 6543 11262 10714 5259 -3380 -9697 -11140 -7835 -803 6555 11008 10046 4490 -2848 -9107 -10800
1044 -10800 -7782 -1337 6285 11255 10029 4632 -3000 -9344 -11670 -7698 -345 7049 10798 9938 3716
1059 3716 -3460 -9238 -10881 -7232 -305 6288 10346 9857 4402 -3693 -9259 -10442 -7513 -471 7274
1074 7274 10482 9261 4034 -3790 -9529 -10362 -6467 -225 6845 10395 8590 3547 -3358 -9179 -10393
1089 -10393 -6332 -121 6646 10656 9509 3086 -3795 -8972 -10819 -6540 830 6759 9951 8756 2711
1104 2711 -4366 -8463 -9628 -6641 566 7077 9699 8497 3298 -4042 -9250 -9554 -6551 450 7533
1119 7533 9949 7764 2982 -4144 -9592 -9624 -5036 514 6597 10162 8005 2200 -3793 -8525 -9892
1134 -9892 -5638 945 6829 9823 8071 2374 -4250 -8862 -9525 -5208 1787 6861 9092 7963 2628
1149 2628 -4410 -8681 -8790 -5349 862 6939 9472 7307 2448 -4556 -9101 -8912 -4865 1046 7019
1164 7019 9492 6831 1913 -4158 -9062 -8841 -4563 1418 6565 9435 7544 1535 -4583 -8529 -8798
1179 -8798 -4454 1823 6738 9076 7428 1140 -4904 -8239 -8476 -4423 1927 7326 8900 6271 1659
1194 1659 -4584 -8610 -8083 -4107 1672 7148 8952 6250 943 -4708 -8636 -7920 -3618 1826 6939
1209 6939 9051 6168 571 -4587 -8378 -8175 -3780 2345 7027 8569 6216 730 -4680 -8007 -8039 -3602
1225 -3602 2501 7059 8402 5912 862 -4882 -8088 -7634 -3715 2238 7255 8384 5468 603 -4879
1240 -4879 -8249 -7250 -2930 2164 6773 8161 5443 178 -5015 -7808 -7104 -2767 2340 6835 8196
1255 8196 5273 189 -4842 -7893 -7226 -3040 2985 6939 7805 5169 41 -4878 -7658 -6527 -2674
1270 -2674 2671 6617 7648 5009 50 -5467 -7778 -6444 -2741 2759 7107 7621 4696 -230 -5264
1285 -5264 -7619 -6514 -2491 2782 6552 7175 4808 -285 -5221 -7454 -6423 -2275 3171 6580 7250
1300 7250 4250 -746 -5225 -7477 -6212 -2179 3237 6617 7283 4355 -575 -5358 -7281 -5836 -1836
1315 -1836 3036 6687 7071 3892 -772 -5479 -7282 -5708 -1822 2886 6530 6952 3812 -904 -5123
1330 -5123 -7226 -5822 -1681 3281 6559 6586 3662 -615 -5381 -7019 -5761 -1305 3090 6520 6578 3578
1346 3578 -1058 -5372 -6646 -5450 -1332 3452 6891 6511 3505 -1231 -5545 -6681 -5102 -1040 3385
1361 3385 6142 6114 3256 -1024 -5498 -7060 -4829 -915 3570 6298 6503 3384 -1326 -5299 -6435 -4814
1377 -4814 -912 3656 6332 6296 3143 -1373 -5177 -6590 -4854 -704 3405 6183 6154 2848 -1787 -5255
1393 -5255 -6219 -4421 -640 3638 6314 6304 2515 -1717 -5049 -6112 -4404 -769 3847 6361 5656 2343
1409 2343 -1673 -5010 -6425 -4505 -444 4198 6267 5329 2568 -1615 -5373 -6076 -4194 -95 3900
1424 3900 5865 5523 2394 -2037 -5134 -5948 -4093 -228 3820 5984 5029 2343 -1420 -5038 -6415 -3823
1440 -3823 -20 3711 5706 5395 2292 -2144 -5392 -6043 -3653 -58 3716 5729 5522 2015 -2112 -4982
1456 -4982 -5575 -3593 181 3942 5726 4766 2048 -2093 -5132 -5864 -3683 139 4084 5906 4706 1949
1472 1949 -2233 -5344 -5340 -3121 77 3711 6106 4544 1428 -2269 -5173 -5545 -3428 386 3855 5488
1488 5488 4539 1408 -2270 -5278 -5687 -3207 717 3778 5514 4614 1078 -2657 -4793 -5210 -3388 425
1504 425 3807 5574 4324 1464 -2422 -5274 -5248 -2980 641 4049 5300 4068 1153 -2544 -5040 -5240
1520 -5240 -2581 490 3857 5519 4185 848 -2434 -4674 -5383 -2719 923 3922 5235 4338 674
1535 674 -2843 -4541 -5070 -2588 1117 3885 4970 3973 1011 -3071 -4972 -4835 -2678 958 4170 5149
1551 5149 3746 940 -2634 -5199 -4887 -2453 920 4023 5200 3471 423 -2946 -4974 -4635 -2098
1566 -2098 1192 3670 5323 3708 407 -2949 -5019 -4674 -2246 1618 3888 4988 3655 168 -3090
1581 -3090 -4517 -4250 -2196 1632 4464 4577 3451 417 -3058 -4934 -4264 -2149 1228 4364 4993 3152
1597 3152 294 -2914 -5024 -4280 -1512 1271 4208 5029 3163 -82 -2761 -4585 -4329 -1544 1660 3767
1613 3767 4768 3490 92 -3048 -4570 -4418 -1857 1810 4033 4419 3043 175 -3084 -4683 -3946 -1806
1629 -1806 2073 4020 4213 2888 237 -3087 -4866 -3584 -1553 1449 4292 4412 2697 -271 -2817
1644 -2817 -4617 -4064 -859 1752 3860 4616 2712 -509 -3065 -4122 -4028 -1253 2191 3606 4373 3054
1660 3054 -309 -3366 -4339 -3741 -1493 1977 4258 4136 2490 -716 -3268 -4666 -3324 -1284 1974 4023
1676 4023 4198 2233 -468 -3067 -4355 -3386 -882 1585 3903 4288 2074 -744 -3164 -4148 -3410 -945
1692 -945 1842 3858 3983 2164 -855 -3177 -3899 -3376 -1207 2301 3927 3687 2144 -633 -3047 -4274
1708 -4274 -3470 -885 2008 3992 3854 1787 -566 -3348 -4404 -3185 -700 1965 3969 3933 1831 -599
1724 -599 -3180 -4249 -2897 -187 2110 3948 3793 2083 -1138 -3305 -3793 -3069 -566 2183 3762 3858
1740 3858 1850 -859 -3165 -3953 -2814 -443 2335 3978 3537 1995 -995 -3297 -3859 -2625 -333 1943
1756 1943 3780 3457 1477 -869 -3051 -3880 -2617 -435 2109 3491 3541 1425 -1312 -3277 -4020 -2642
1772 -2642 -250 2127 3691 3812 1650 -1336 -3247 -3341 -2587 -196 2153 3845 3326 1418 -1026 -3633
1788 -3633 -3714 -2648 -216 2513 3679 3145 1215 -1186 -3438 -3690 -2343 -5 2463 3490 3356 1184
1804 1184 -1429 -3215 -3726 -2338 -73 2374 3623 3056 1274 -1075 -3230 -3776 -2369 117 2325 3475
1820 3475 3106 1216 -1177 -3287 -3460 -2107 100 2195 3622 2899 978 -1454 -2983 -3416 -2318 229
1836 229 2298 3588 3002 1278 -1495 -3040 -3319 -2005 319 2734 3374 2968 768 -1289 -3104 -3540
1852 -3540 -1723 221 2237 3590 2783 891 -1559 -3134 -3124 -2055 414 2391 3445 2704 890 -1562
1868 -1562 -3219 -3423 -1851 439 2509 3274 2768 680 -1664 -3182 -3225 -1798 479 2482 3242 2308 541
1885 541 -1694 -3034 -3202 -1682 489 2325 3397 2628 544 -1585 -2949 -3029 -1548 810 2559 3426
1901 3426 2502 773 -1558 -3143 -2829 -1638 617 2586 3429 2436 274 -1729 -3270 -3047 -1635 684
1917 684 2561 3238 2411 448 -1863 -3286 -3044 -1388 938 2639 3115 2296 368 -1577 -3075 -2836 -1343
1934 -1343 680 2381 2999 2191 247 -1627 -2970 -2743 -1306 770 2617 3094 2149 196 -1572 -3101
1950 -3101 -2872 -1461 925 2695 3231 2019 236 -1715 -2962 -2846 -1373 799 2457 3008 2096 516
1966 516 -1897 -2854 -2610 -1151 1071 2578 3098 2060 5 -1684 -2845 -2788 -1254 851 2473 2733 1779
1983 1779 143 -1897 -2863 -2432 -934 1190 2371 2849 1734 112 -1742 -2761 -2504 -960 959 2535
1999 2535 2749 1585 -207 -1688 -2817 -2551 -1044 1000 2332 2687 1731 -199 -1897 -2746 -2336 -814
2015 -814 1164 2482 2445 1585 -71 -1888 -2510 -2190 -791 948 2459 2680 1559 -227 -1988 -3037 -2445
2032 -2445 -847 1172 2561 2727 1427 -264 -1834 -2607 -1972 -338 1063 2262 2339 1572 -483 -1789
2048 -1789 -2737 -2470 -579 1255 2562 2370 1547 -364 -2112 -2464 -1997 -601 1096 2539 2597 1223 -414
2065 -414 -2095 -2496 -1920 -499 1199 2589 2649 1265 -326 -1853 -2735 -2066 -427 1058 2525 2534 1274
2082 1274 -609 -1728 -2420 -2145 -499 1416 2390 2341 1119 -513 -1890 -2404 -2162 -757 1471 2302 2440
2099 2440 1209 -492 -1945 -2464 -1605 -241 1492 2531 2058 1384 -356 -1751 -2379 -1589 -382 1253
2115 1253 2251 2076 1037 -352 -1921 -2467 -1973 -22 1204 2507 2456 967 -690 -1954 -2229 -1874 -220
2132 -220 1441 2340 2064 928 -603 -2015 -2211 -1617 -436 1344 2267 1927 450 -528 -1979 -2404 -1466
2149 -1466 -160 1271 2666 2292 842 -333 -1883 -2333 -1457 32 1361 2145 2202 703 -700 -2039
2165 -2039 -2335 -1580 41 1624 2270 2031 1092 -558 -1990 -2082 -1673 -15 1694 2244 1781 949 -676 -1905
2183 -1905 -2033 -1482 93 1244 2103 1956 606 -912 -2138 -2076 -1119 1 1509 2353 2147 612 -774
2200 -774 -1738 -2233 -1547 313 1377 2164 1989 664 -859 -2073 -2124 -1433 291 1283 2117 1908 596 -914
2218 -914 -2105 -2315 -1358 173 1441 2066 1557 488 -928 -1642 -2198 -1288 87 1299 2372 1786 438
2235 438 -898 -1920 -2249 -1198 254 1317 2057 1629 640 -1136 -1895 -2047 -1423 211 1750 2054 1484
2252 1484 531 -1061 -2161 -1839 -1210 255 1478 2095 1505 271 -1049 -1966 -1852 -1210 410 1626 2219
2269 2219 1497 216 -763 -1816 -1987 -812 206 1761 2048 1635 281 -985 -2008 -1695 -925 324 1595
2286 1595 2195 1461 238 -1093 -1842 -1665 -981 336 1676 1943 1518 289 -1076 -1858 -1719 -758 375
2303 375 1588 1753 1370 224 -1024 -1928 -1809 -1015 259 1584 2100 1396 185 -1007 -1878 -1704 -790 390
2321 390 1237 1822 1171 382 -1052 -1953 -1421 -681 356 1462 1840 1451 172 -1014 -1877 -1784 -877 371
2339 371 1677 1777 1052 -183 -1105 -1505 -1559 -697 425 1547 1858 1058 103 -1065 -1886 -1586 -628 518
2357 518 1521 1836 1216 -81 -1081 -1595 -1673 -743 510 1583 1839 1010 3 -1317 -1881 -1371 -388 619
2375 619 1459 1930 1042 334 -1360 -1673 -1394 -737 429 1382 1517 1062 43 -1155 -1618 -1306 -483 654
2393 654 1497 1397 1071 -36 -1093 -1903 -1415 -486 762 1538 1475 819 -124 -1083 -1672 -1389 -575 554 1518
2412 1518 1766 1234 -33 -1110 -1498 -1315 -550 459 1574 1677 768 -214 -1041 -1737 -1383 -497 799 1313
2430 1313 1615 821 -326 -964 -1592 -1369 -421 521 1524 1433 753 -117 -1240 -1568 -1299 -341 858 1377 1660
2449 1660 897 -89 -1159 -1336 -1297 -456 689 1325 1537 814 79 -1108 -1559 -1355 -325 764 1437 1540
2467 1540 798 -230 -1176 -1619 -1230 -454 822 1237 1385 806 -228 -1094 -1655 -1154 -393 692 1355 1293 807
2486 807 -263 -901 -1605 -1105 -409 927 1603 1296 819 -225 -1185 -1589 -1219 -206 831 1457 1219 485
2504 485 -392 -1156 -1463 -1094 4 856 1261 1483 780 -420 -1122 -1476 -924 -243 657 1203 1155 610 -465
2523 -465 -1368 -1382 -905 -230 635 1171 877 614 -227 -1171 -1142 -1020 -418 527 1500 1287 615 -244 -1225 -1293 -935
2544 -935 -311 806 1239 1271 482 -310 -948 -1522 -838 -29 855 988 1049 631 -546 -1068 -1260 -1123 63 821
2564 821 1432 936 352 -409 -1100 -1383 -1037 -152 662 1233 1371 686 -170 -1148 -1279 -1011 -74 601 1224 1280
2584 1280 572 -244 -1369 -1336 -574 80 852 1360 1242 228 -339 -1064 -1142 -974 -102 776 1126 941 443 -345
2604 -345 -1005 -1203 -780 -42 943 1059 945 378 -551 -1061 -1207 -766 -16 942 1132 1094 262 -419 -1084 -1059 -654
2625 -654 225 830 1195 1211 582 -357 -1126 -1206 -567 58 778 970 1056 203 -711 -1139 -1169 -885 -7 679 1204
2646 1204 821 304 -540 -1110 -1114 -585 181 1051 1090 879 253 -230 -1023 -1163 -811 140 729 1175 1080 337 -523
2667 -523 -893 -1024 -449 284 773 1156 811 244 -583 -800 -1071 -534 224 841 918 849 142 -537 -723 -1086 -516
2688 -516 210 945 1044 904 308 -573 -967 -749 -806 92 688 1240 977 185 -613 -1237 -1222 -433 111 892 1108
2709 1108 683 109 -346 -1068 -968 -563 442 718 1042 1007 229 -463 -1038 -1076 -365 303 964 974 982 199 -652
2730 -652 -1115 -986 -358 273 885 1169 1210 -3 -661 -886 -1035 -619 260 763 1073 780 160 -522 -695 -900
2750 -900 -286 491 700 844 828 26 -784 -915 -1063 -382 342 781 900 679 221 -581 -938 -965 -744 126 633
2771 633 967 606 11 -645 -999 -722 -438 170 681 994 596 -72 -431 -1047 -555 -438 185 585 736 470
2791 470 57 -530 -1337 -701 -312 401 803 787 497 36 -532 -813 -768 -257 439 759 943 351 -45 -522 -910
2812 -910 -615 -311 598 388 834 534 -3 -671 -931 -728 -302 541 677 866 603 105 -584 -812 -635 -231
2832 -231 217 763 846 649 -97 -822 -920 -813 55 237 856 631 463 -211 -631 -882 -854 -140 610 821 699
2853 699 436 35 -575 -677 -647 -232 517 978 679 566 -124 -630 -471 -494 -140 558 674 635 223 84 -544
2874 -544 -881 -614 21 313 750 768 457 -104 -483 -539 -732 -359 366 732 787 360 8 -489 -599 -509 -156
2895 -156 284 435 347 322 -226 -508 -610 -709 -46 383 571 866 449 -149 -689 -765 -539 -136 368 871 704
2916 704 332 5 -477 -760 -271 147 412 619 773 215 -188 -632 -870 -703 -37 191 691 662 279 -214
2936 -214 -460 -933 -757 -146 313 474 596 310 -221 -452 -952 -754 -167 392 632 545 340 -158 -649 -481
2956 -481 -326 -124 401 842 571 252 -171 -532 -610 -577 -100 266 772 502 200 -69 -575 -574 -487 -71 283 707
2978 707 551 -19 -83 -656 -518 -524 59 215 282 461 336 -241 -377 -671 -392 -246 212 691 653 307 -267 -524
3000 -524 -608 -236 -52 371 432 460 277 -186 -619 -419 -414 -73 496 540 746 316 -431 -510 -597 -400 -90 258 477
3023 477 393 229 -203 -454 -573 -485 122 255 426 566 172 -20 -737 -513 -293 205 385 494 545 105 -404
3044 -404 -732 -510 -170 -2 193 335 482 161 -216 -746 -406 -324 -351 551 545 398 108 -167 -683 -534 -150
3065 -150 -133 343 280 457 169 -321 -542 -647 -166 38 262 585 394 164 -259 -537 -395 -215 -51 652 433
3086 433 386 232 -390 -543 -567 -138 65 154 673 561 147 -221 -619 -381 -281 116 493 385 479 273 -398
3107 -398 -610 -374 -241 291 485 292 407 274 -431 -604 -586 -95 275 518 594 567 -37 -342 -294 -367 -112 -22
3129 -22 538 591 567 -81 -145 -435 -254 -246 0 385 458 61 11 -281 -512 -378 -114 198 196 332 363 77 -204 -410
3153 -410 -513 -139 42 461 253 255 -20 -375 -505 -526 -216 -112 218 583 292 166 -196 -352 -484 -214 62
3174 62 527 453 243 -121 -226 -366 -259 -166 1 366 341 138 246 -275 -297 -440 -67 301 321 192 223 -149
3196 -149 -299 -408 -441 -93 186 365 358 287 -232 -316 -418 -424 -100 154 338 400 450 -28 -312 -359 -100 -256 74
3219 74 256 179 197 2 -212 -369 -444 -175 232 211 214 167 -277 -161 -441 -172 97 148 191 320 335 -210 -180 -413
3243 -413 -198 -110 70 153 204 155 -120 -227 -92 -341 47 397 179 373 107 -265 -64 -176 -205 -167 255 382
3265 382 444 172 -83 -378 -367 -236 -360 233 220 255 7 -212 -72 -157 -91 -37 298 471 210 48 83 -48 -295
3288 -295 -196 -155 212 163 181 126 -240 -511 -246 -36 47 164 389 348 102 -27 -453 -496 -123 -53 76 191 313
3311 313 164 -90 -278 -450 -305 97 68 321 389 213 -33 -274 -208 -80 -229 -15 326 257 188 -70 -174 -205
3333 -205 -117 -106 9 535 203 33 -142 -265 -72 -238 -123 307 375 334 139 -308 -158 -305 -161 140 285
3354 285 398 128 206 88 72 -116 -272 60 -37 165 84 90 42 -267 -319 -178 67 239 190 378 -94 68 -211
3377 -211 -244 -111 -99 231 309 352 89 24 -238 -480 -52 105 198 194 -1 23 42 -258 -298 55 28 -63 272 350 -18
3402 -18 -3 -210 -141 -83 65 62 291 272 -185 101 -122 -281 -46 -65 180 248 246 44 -150 -166 -215 -124 -124 101 220
3427 220 221 -32 -290 -106 -407 -93 -277 110 314 358 180 137 -56 -366 176 13 77 167 71 98 61 -547 -127
3450 -127 2 61 69 309 81 19 -17 -392 -305 -247 128 58 335 12 -34 18 30 54 -44 -45 163 -63 208 89 -267
3475 -267 -144 85 -284 76 184 362 120 80 -42 -116 -40 -273 39 -25 43 84 -136 -60 -106 -134 231 -81 175
3498 175 273 293 53 41 -52 110 -111 -68 333 240 27 134 36 40 -110 -168 6 -5 280 195 -172 -166 56 -135 -96
3523 -96 -152 186 -151 258 123 -166 -187 -154 11 0 105 27 36 94 59 -88 -470 38 55 207 184 -37 27 -125
3547 -125 -269 24 124 59 57 125 61 94 109 -77 5 -132 81 22 146 296 -85 -268 -194 -58 -162 155 73 -28
3571 -28 254 -48 13 165 -117 -44 162 -13 153 330 85 -266 -485 -4 6 150 -10 144 10 60 184 -244
3593 -244 -61 79 -192 -173 119 158 -77 101 -127 -93 -126 11 58 250 -101 -49 308 -215 -100 -48 82 93 369
3616 369 110 52 6 120 -380 178 -149 -40 198 39 -94 2 -84 14 15 54 262 -117 153 -284 0 -87 -308
3639 -308 -15 -146 -114 209 -89 112 -32 -180 53 -34 89 56 153 161 -319 -91 -112 -114 258 -65 -93 4 174 -53
3663 -53 -193 195 42 97 -188 -117 72 -204 64 -206 -157 -419 69 216 81 77 12 56 99 -98 -34 66 31 109
3687 109 122 204 -75 -201 -104 -237 62 -10 13 92 106 282 -204 97 -172 -202 324 424 231 89 -79 319 -7
3710 -7 -48 -59 37 238 21 -37 -55 -120 -153 -42 -104 -58 -3 26 80 -75 -268 53 240 -75 -215 19 140 1 37
3735 37 -184 -89 209 -213 -83 -25 -77 90 93 -149 -104 -93 18 18 -73 110 3 -168 74 208 27 -208 111 19
3759 19 173 -91 21 54 -122 39 2 2 47 -20 174 -36 53 -51 35 171 29 151 217 -14 -75 -200 -54 169
3783 169 -46 -296 20 -53 -118 105 -81 -185 120 14 206 219 -114 -53 -55 -102 -200 139 190 -25 -191 -77 -2
3806 -2 114 42 -14 -158 -35 82 280 5 -116 -9 -108 39 -34 186 40 -138 -155 53 5 174 106 -36 -54
3829 -54 -31 22 -30 -39 71 40 -85 -3 54 -113 -60 86 9 -14 -210 8 42 -96 -231 170 217 -125 -102 45 226
3854 226 59 347 227 126 112 -21 -4 69 121 -84 -69 -258 11 -3 -206 100 -16 -48 84 -47 128 -72
3876 -72 -267 -61 -111 -45 -17 -52 -195 -12 -57 -117 -121 -126 -131 -53 -405 -255 238 -45 143 24 -3 177 -36 -104 -150 10
3902 10 -37 -11 15 150 -65 -41 293 97 78 -61 -114 -85 105 -63 166 133 177 -81 43 -53 -115 192 -106 141
3926 141 32 -22 -25 115 -34 330 -43 -114 144 -216 312 -4 -39 0 -151 220 152 142 138 -120 77 183 27
3949 27 39 -44 -99 -48 143 175 -119 -149 -58 59 -75 34 45 164 167 -60 181 51 318 95 6 -227 93 -76
3973 -76 264 -156 -137 31 117 42 20 -29 18 -377 -89 -48 -121 84 -25 85 61 105 -68 -39 -278 -94 4 -246
3997 -246 148 -33 -54 -29 -21 -77 131 -172 118 296 -147 -47 -159 187 -208 -159 44 -1 152 197 74 -83 -282
4020 -282 -206 -201 138 192 57 -253 -45 0 -203 -62 -321 -255 259 -132 -110 75 -336 99 -151 -6 -77 68 47
4043 47 -120 49 -164 -101 -274 -179 33 -5 116 -67 -35 13 -153 -17 57 -49 55 120 -77 -49 -220 -94 -191
4066 -191 89 -121 -10 143 19 122 -9 -194 -155 -77 -37 105 -20 -34 -197 -55 8 -40 -50 92 -46 60
4088 60 173 162 -125 -121 -128 70 47 -88 121 182 -132 -153 -342 14 212 54 -18 20 -95 241 -14 67 -238 137
4112 137 -146 142 168 -218 -82 -153 -87 86 38 17 -20 -39 51 29 -123 6 160 -80 118 91 106 -100 -235 -4
4136 -4 -93 -109 91 79 283 180 29 -54 -46 -61 -22 362 121 138 37 81 23 -286 0 -76 253 169 72 15 53 103
4162 103 -242 126 -215 38 87 -53 -157 -39 10 -65 -189 -88 187 -54 126 128 -190 -170 -56 84 -74 33
4184 33 93 273 -200 -173 -99 -198 178 -320 160 149 231 -57 -23 15 -197 -126 177 143 128 49 -28 -44 -112 12 21 -176
4210 -176 109 -212 127 112 58 -66 -64 14 77 107 21 132 -57 234 -28 -303 -201 101 -140 141 17 -237 99
4233 99 -295 -119 -142 -40 -298 153 99 14 88 -332 -410 -28 115 -52 126 -14 -60 -488 -64 -222 -178 -92 100
4256 100 -95 20 149 -13 -291 -34 38 -11 88 -120 44 13 -106 -110 -158 -99 211 -105 73 168 43 -191 -97
4279 -97 -245 17 -243 18 224 -218 45 -48 -40 -110 -287 -197 5 -91 200 -55 -109 -39 -98 -155 131 149 197 58
4303 58 -20 163 -147 -194 101 156 201 -40 153 -55 -31 103 -96 189 25 213 159 38 -45 124 -193 233 164
4326 164 -157 -12 133 85 -18 66 -275 -125 29 -26 72 258 14 -279 -268 -146 -156 109 -73 263 118 -39
4348 -39 51 -45 -208 -17 -242 -13 -19 -64 458 -43 33 17 -228 -118 -246 29 -47 136 30 -80 -150 -151 64 -49
4372 -49 70 13 244 131 -49 -7 7 -318 -254 54 -70 -56 50 -262 -130 -125 -70 -61 214 136 -51 67 -16 -15 -166
4397 -166 -156 -54 3 134 121 101 -116 -139 -276 -130 108 235 273 -68 -111 19 -37 -11 -317 -58 265 -8 245
4420 245 61 -15 -243 -174 -319 -54 124 -81 75 -9 17 -146 45 202 -72 333 -134 -18 -90 -112 -145 27
4442 27 128 -151 -81 164 100 104 52 -102 -120 -17 68 91 147 223 -207 4 -221 -229 -151 212 86 389 27 -18 60
4467 60 -176 -127 150 91 148 92 -25 13 -214 89 -353 -41 172 254 254 270 -6 292 -419 -4 287 -165 161
4490 161 41 15 -42 -198 -248 -93 -143 -13 104 92 276 -4 -70 42 -174 -129 -16 90 -4 -98 54 -62 -361
4513 -361 -286 141 55 -45 284 -59 -214 -113 -166 -21 -200 215 128 54 53 -115 -302 -148 -205 14 144 80 262
4536 262 85 293 -351 -98 123 61 176 248 -5 56 -185 80 52 -36 140 -52 42 332 90 174 -427 -18
4558 -18 14 -137 298 79 241 -109 -54 10 -86 -147 -56 196 12 398 -20 115 -68 -85 -69 12 325 204 135 -34
4582 -34 -174 -64 -45 -237 -64 110 1 -156 -2 126 -114 -87 -138 32 6 169 180 -49 -129 -36 45 -104 79
4605 79 256 123 182 -109 -44 -29 -116 -226 -244 129 46 295 177 -123 -263 -460 -371 67 97 260 -42 -202 5
4628 5 73 -192 -468 17 92 -119 109 -35 -152 -186 -62 -187 -144 24 200 27 205 306 -269 -46 -64 42
4650 42 14 110 176 -5 -307 -123 -216 -47 37 -79 98 327 -22 -117 -178 -190 73 100 107 198 1 -86 -31 94 -190
4675 -190 -160 104 72 50 218 -83 -122 -174 -85 -191 11 18 212 45 -300 114 -99 -17 -41 0 235 108 -106 125
4699 125 -94 -225 212 -77 -92 215 377 -29 6 -214 -62 -41 -45 85 -12 269 192 0 -67 -333 -100 -250 158
4722 158 195 285 218 112 -79 24 -167 -33 125 172 2 -19 -149 129 -260 -279 -263 160 200 477 240 -199 10
4745 10 -106 -248 -345 27 143 367 104 84 -89 -201 -235 -140 146 230 -93 320 -113 -59 -184 96 -172 40
4767 40 192 -12 82 26 -497 -155 184 -253 -182 301 193 119 65 -115 -42 -301 -37 129 -2 162 62 36 -135
4790 -135 -264 -442 36 156 -5 383 138 134 -282 -331 -359 189 217 -143 3 109 -250 -75 -163 -10 -129 -7
4812 -7 97 238 111 -113 -78 -368 -273 -137 242 89 280 323 200 -192 64 -129 -78 42 234 -16 280 154
4834 154 -106 17 -321 -63 146 94 210 127 -72 -81 -166 -106 -159 206 102 139 -17 -237 -255 41 69 -21 1 219
4858 219 19 -15 -51 -96 -197 -224 48 113 -1 228 159 -71 -137 -114 -24 237 78 96 12 52 20 -198 -129 -308 40
4883 40 146 188 104 124 19 -51 -73 -23 -126 -83 282 21 -235 -33 -110 -148 -45 195 195 155 61 37 -2 -115 -218
4908 -218 103 234 160 194 324 3 -36 -247 -311 -203 -33 -19 311 198 34 -188 -33 -5 20 48 14 -53 297
4931 297 241 -122 -304 -352 -130 -156 200 238 47 25 -10 -183 -151 -166 -105 -90 186 199 1 14 -19 -96 -12 51 195
4956 195 116 67 271 -16 -306 -271 -340 109 195 259 104 43 -300 -103 -215 -333 -230 254 168 115 138 -2 37 -292
4980 -292 4 176 190 144 4 -7 -58 -301 -198 -212 208 303 78 99 -32 -85 -97 57 -12 -53 193 42 95 212
5004 212 -211 -294 -25 -5 -74 7 34 101 11 -73 -144 -50 -14 -83 108 65 144 19 -94 -177 -265 164 56 7 207 59
5030 59 40 -87 -54 -154 -163 134 -12 211 162 84 -51 -93 -165 169 -23 314 -39 192 -132 -281 -9 -137 -298
5053 -298 129 118 218 292 -31 -207 -373 119 11 -83 -15 93 39 -102 -61 -92 -267 -80 249 282 46 -39 12
5076 12 161 -125 -208 -260 0 288 251 142 -291 -28 -348 -239 -70 -105 241 189 12 -93 -113 -122 -41 -75 87 108
5100 108 59 103 -166 -309 -28 -124 23 99 286 211 54 -319 118 35 7 -206 -152 3 68 -30 -95 -236 -60 -87
5124 -87 170 77 198 186 165 -45 -179 -336 -74 11 179 -209 190 54 6 135 -372 -173 82 150 258 262 21
5147 21 152 -105 -400 -374 -273 -273 333 175 27 112 -218 -29 -110 -245 156 28 -23 11 45 -180 -156 39 -30 100
5171 100 33 254 128 70 -1 -247 -205 11 83 144 281 226 312 -390 -139 -243 74 174 110 25 3 -15 -85 -354
5195 -354 -148 6 7 90 -5 -16 -112 90 -94 -172 -98 17 234 321 -95 -146 -2 -48 -108 -5 87 103 35 -65 -71 -186
5221 -186 -6 28 4 -25 129 93 17 -64 -253 -72 -123 72 82 10 -18 174 -106 -243 -83 -89 48 170 200 143 -20
5246 -20 -214 -306 -223 -35 296 114 167 -8 -44 -151 -180 -222 192 -77 -50 248 217 -107 11 -326 -247 -163 85 151
5270 151 201 218 13 -3 -215 -205 -152 -89 298 183 -18 238 47 -368 -93 -151 11 124 172 87 -49 -76 -46 -134
5294 -134 10 172 55 364 129 223 234 -135 -176 -224 -183 1 150 150 94 -145 -229 -301 -73 291 308 337 90 -86
5318 -86 -221 -25 -378 -67 41 59 174 37 -8 -238 -59 57 7 252 220 159 395 -234 -328 52 -183 -5
5340 -5 2 45 155 177 -190 -175 32 -168 -150 -81 56 295 59 -213 -211 -266 -195 68 30 -165 150 129 -81 -331 -205
5365 -205 8 118 207 163 477 68 -28 -34 -148 -77 -104 192 -6 13 47 186 -20 -82 -288 -215 243 -122 174 185
5389 185 -76 -26 -141 -179 -361 -30 221 351 384 69 -114 -85 130 -95 82 231 20 143 -238 -336 -115 3
5411 3 -205 128 36 203 73 34 -361 -243 -245 76 118 190 206 -33 42 105 -203 -76 -270 238 -164 -59 134 25
5435 25 -127 -195 187 64 278 308 -28 160 -47 -59 -19 -153 107 -45 344 213 -46 -152 113 -193 -127 -213
5457 -213 61 140 14 174 120 -241 -181 -137 -117 70 235 22 28 223 141 -78 21 93 -161 58 344 -38 -155
5480 -155 -222 -75 -375 -109 147 72 -13 20 67 -57 -119 36 184 120 148 380 5 159 -46 -383 -180 -18 1
5503 1 55 37 10 -162 -257 -142 -125 189 97 114 125 -122 -286 -171 -235 -29 -34 -38 124 148 0 76 -78 -554 -320 -67
5529 -67 -151 89 38 209 -91 106 -133 -30 -69 104 -14 271 122 -218 -106 -88 -81 68 104 29 222 -11 -133
5552 -133 33 -48 -8 -105 296 69 358 70 -173 -235 -157 -129 -143 59 188 164 161 55 -237 113 17 31 189 246
5576 246 94 48 -94 -87 -69 -308 108 229 229 226 53 -39 -40 -22 52 5 144 238 276 2 -161 -81 -380 -247 105 -114
5602 -114 232 97 144 -182 -106 79 -210 -12 123 115 -93 -67 -88 -174 -295 -5 -45 -132 167 211 8 -4 -110 -125
5626 -125 -141 -238 -42 219 203 457 -11 -224 -72 -77 -244 137 53 -132 150 -57 -225 -146 -78 305 -28 215 108
5649 108 -117 -29 -51 -221 -139 -26 228 297 420 -92 -57 -242 -137 -204 299 -25 315 85 -47 30 -350 -10
5671 -10 -228 82 -45 116 105 69 -242 -199 -82 -103 34 220 296 182 125 -169 -61 -149 -3 -262 98 18 239
5694 239 -124 167 -319 -232 -159 -203 140 86 477 -2 -88 -34 -366 -113 104 113 -58 -17 -264 -33 -179 136 -128
5717 -128 136 55 63 -30 205 -233 -108 -74 -49 153 31 313 150 -142 -3 -134 -220 -157 47 172 344 322 -2
5740 -2 20 -221 -222 -75 121 107 107 254 206 -124 -246 -273 -26 21 55 309 2 207 -129 -215 -233 -147 196 385 64
5765 64 -158 -61 46 -246 -200 -3 -189 340 363 -91 27 -35 -101 -271 81 408 364 84 164 -40 -140 -137 -108 102
5789 102 173 87 350 98 -145 -130 -268 -158 184 10 -16 40 61 -239 -216 -223 -118 37 0 -120 305 137 -45
5812 -45 -255 -179 -29 -41 76 114 163 -16 -392 -124 -290 -427 -204 -99 175 37 -305 140 -140 -190 -255 -46
5834 -46 134 76 401 -39 18 -32 -138 -322 61 202 141 468 175 -387 -72 -272 55 -141 -13 340 -16 -59
5856 -59 -64 -332 -155 -326 -50 -67 105 92 121 103 -54 -173 -120 57 183 106 112 166 -228 -189 -67 83 250 158 263
5881 263 453 299 -300 -52 8 91 -24 -64 155 -35 124 32 -79 -33 -138 54 59 260 281 146 -105 -272 -322
5904 -322 -63 79 -9 372 54 214 -219 -372 -298 57 -1 182 239 144 102 -58 -24 -193 -340 -33 181 192 215
5927 215 -31 -118 -271 -244 -440 57 75 263 515 -17 0 -365 -329 -104 -127 -182 -11 208 109 -351 -324 -322 -100 -45
5951 -45 -21 42 -98 134 138 -292 -257 -3 12 -6 323 142 175 -357 -70 -114 -209 -65 241 193 73 -158 26 80
5975 80 -228 -54 246 224 290 58 140 -39 -72 -140 -11 -103 307 227 -79 -132 -390 57 -86 58 193 224 40
5998 40 49 -102 48 -253 -290 -192 66 -41 221 232 188 69 -11 -194 -130 108 59 170 89 32 78 -106 -19 -110 247
6023 247 360 156 62 64 -188 70 -14 4 -135 -121 55 53 66 -181 -74 -202 31 140 312 349 -189 -233 -106 -259
6047 -259 -308 275 -85 71 177 -89 -23 -109 -218 10 4 58 -108 236 -60 -146 -337 -289 36 -50 -10 77 155 207
6071 207 -119 -114 -224 -251 -44 29 -75 -136 104 -78 0 -45 -83 82 32 683 83 -150 88 -136 -112 -179 -13 -120
6095 -120 333 230 255 -56 -185 -219 -179 -105 165 344 217 -120 -20 -103 -197 -27 -231 159 115 288 59 -30 1
6118 1 -68 -347 89 31 272 88 1 10 277 -217 34 63 -12 133 253 163 -115 -382 -200 7 14 386 142 216
6142 216 10 -222 -254 -119 -348 5 237 229 268 25 -121 -235 -503 -488 -179 147 251 64 -249 -194 -186 -106 49
6165 49 96 124 303 339 -2 33 43 -346 25 131 267 249 250 101 -189 71 -186 -20 -121 -75 -47 28 -193 -97
6189 -97 -257 -169 -181 72 98 495 117 212 -57 -51 -32 -193 -114 -82 99 -82 -233 314 84 -403 -206 -55 181
6212 181 183 15 -48 278 -41 -180 -253 28 301 22 334 224 220 -68 -164 6 -211 -10 304 216 108 25 -116
6235 -116 38 -8 -76 41 106 76 -98 -121 -205 -249 -306 -9 228 472 261 -68 64 -161 -199 75 -21 129 194 -16
6259 -16 257 -101 121 -405 -35 117 304 454 179 103 -102 111 -293 -128 249 91 241 105 160 -101 -134
6280 -134 88 -42 -78 178 172 218 -67 -133 -382 -149 -127 -10 337 -71 245 180 -71 -310 -128 -45 34 147 118
6303 118 157 -102 -108 -104 -479 -54 -101 115 19 127 152 -56 -97 166 212 -72 21 86 334 18 -499 -322 -178 -78
6327 -78 -69 155 -11 146 56 22 -168 -91 17 105 19 78 -36 44 -157 207 -156 -58 -43 251 273 192 -76 -151 -94
6352 -94 -5 175 30 -126 78 242 -146 -88 -139 -107 -78 61 16 85 260 -88 -41 -309 -84 -161 -317 -223 13 337
6376 337 33 96 -414 -201 167 -64 201 171 -34 -27 88 -254 -46 -152 174 122 115 6 42 -161 35 -124 -135
6399 -135 99 301 289 -6 -52 -214 -230 175 -25 113 66 -206 192 137 -173 115 -141 84 -22 212 134 44
6421 44 -335 -139 -188 48 93 40 202 -122 206 -248 -170 158 1 -93 80 287 71 -189 437 209 -503 -218
6443 -218 -4 -84 85 4 -9 -8 -437 -240 -208 -84 -66 -50 70 137 -244 -203 -348 -231 146 21 178 346 126
6466 126 -9 -72 -165 -310 -78 397 176 137 128 204 -84 -116 -279 -173 77 126 56 -123 8 -130 -68 -212 -55
6489 -55 226 234 1 64 -188 -120 159 -80 43 218 -33 17 55 -104 -111 65 -241 54 95 239 50 44 -23 -239
6513 -239 -107 103 -80 124 264 260 122 -27 -179 -232 -64 363 -32 453 258 107 315 -204 -101 -65 36
6534 36 101 179 160 54 -254 -143 47 68 27 -107 314 244 -11 -19 -52 -328 -123 -116 39 253 134 187 -203 -254 -277
6559 -277 55 142 217 121 75 113 -87 -4 11 -132 -196 111 194 109 -126 -134 -51 -258 -65 -125 4 135 -67 40 -90
6584 -90 -162 -158 -24 210 206 80 109 6 -182 -174 49 87 115 93 104 92 -9 -53 -1 -106 310 -48 112 74 159 85
6610 85 78 -89 -282 75 -6 192 -82 -44 212 134 -242 -243 32 20 131 210 45 -199 -31 -340 -148 -98 87 -89
6634 -89 236 167 -11 -19 -133 -310 39 28 259 296 -104 -214 -139 45 60 -37 -21 276 198 167 -60 64 -217 75
6658 75 152 147 108 378 23 29 26 -367 -125 -103 111 90 -16 257 92 -268 48 63 -204 215 83 -119 26 -182
6682 -182 -178 -222 -157 -125 51 177 467 152 -44 5 99 -69 -128 291 207 -120 198 30 -129 -287 -135 -50 107
6705 107 418 521 22 345 -234 -111 123 34 -221 -64 60 26 92 -154 39 35 -475 60 317 235 354 -89
6727 -89 53 -178 -322 -197 -56 439 59 43 -23 45 -188 61 -65 0 266 284 239 -159 -174 -114 -185 -128 -102 -108 71
6752 71 347 -49 -134 -119 -232 -100 77 247 166 -79 -66 47 -419 -136 -116 23 113 126 105 -70 -125 -199 -12 30
6776 30 230 313 129 337 -200 -317 -90 -309 -136 -275 62 -81 237 6 -180 -207 -330 -10 22 -32 52 29
6798 29 126 -12 -91 -199 -211 97 400 -80 102 -57 -105 -211 -138 -160 -13 -31 376 258 26 66 -338 -42 -140
6821 -140 172 104 -32 82 28 -7 -125 -155 -16 -5 312 376 181 -140 10 110 -73 -96 113 157 208 102 -14
6844 -14 -140 -137 -178 -83 275 166 33 113 3 -167 -119 20 -34 318 126 18 -64 123 -100 -126 117 85 128 76
6868 76 174 41 -77 -141 94 -203 -177 200 207 146 -60 -214 -303 -121 -124 -140 278 199 142 93 -152 -50 -13 218 -176
6893 -176 108 148 44 -36 68 -244 -160 -104 65 212 481 414 180 -44 -37 -350 -207 95 101 29 133 -39 -131 -64
6917 -64 -194 -27 -2 193 -117 122 -58 -268 -165 -276 -120 -189 113 116 272 44 -194 4 -150 24 86 -80
6939 -80 165 32 29 -10 -162 30 79 63 -25 139 -85 -94 -9 57 -17 21 -49 29 345 8 81 80 19 -365 -96 31
6965 31 416 257 -76 111 -112 -15 -124 3 -48 75 179 125 70 -122 -213 -135 -48 218 214 -10 -96 -74 -103 -182 -26
6990 -26 -352 59 -84 295 182 -78 112 -87 -140 -132 150 -110 138 82 -9 46 -177 -283 -302 -354 124 205 104
7013 104 -41 -263 39 -329 -148 -126 160 278 210 169 -114 -394 -176 -213 9 -79 -23 64 -2 -46 81 -48 -205
7036 -205 -143 -179 244 233 -87 -108 -299 -319 -80 -50 77 8 -53 -54 194 -182 -268 32 -91 191 78 222 194 -24
7060 -24 -66 -217 -161 141 117 262 -106 61 86 -97 -55 -203 -24 -110 -112 112 148 -2 -77 -187 127 -60 237 167
7084 167 41 -9 -158 151 -202 107 -98 46 46 165 -15 34 -378 -59 107 -19 135 86 83 203 68 -100
7106 -100 -104 205 -224 199 159 206 -133 -408 -95 -269 111 325 271 -98 101 114 21 -61 -195 -169 27 395 104
7129 104 126 50 -139 -122 -141 -27 18 325 35 -39 160 -118 -474 -165 -72 135 -99 60 23 127 -135 -99 35
7152 35 -13 70 446 143 51 345 -102 114 116 118 261 264 -7 170 -343 -110 -476 -36 -51 22 8 138 2 86 -404
7177 -404 -129 -169 -166 390 14 119 255 -18 -105 -122 -30 -139 139 255 56 -70 176 -5 -17 -54 100 95 235
7200 235 71 -8 -44 -46 -101 -62 -201 -133 172 90 101 -81 82 -234 -72 56 157 42 51 -164 -39 -12 4 89 135
7225 135 76 16 147 -85 161 -87 -190 -69 -69 23 46 128 242 1 -41 -168 -145 39 332 231 55 283 -149
7248 -149 -218 27 -181 9 91 65 153 37 -74 -116 -209 5 37 209 178 283 242 108 -132 -278 -272 -387 -137 233
7272 233 26 189 15 -153 -130 -157 357 339 215 181 -8 -142 -58 -29 -111 260 32 100 146 240 -341 -201 -206 -41
7296 -41 35 36 60 -76 57 -87 -114 -64 -135 -16 78 -145 263 -86 -73 -86 48 -154 195 5 207 167 37 -5
7320 -5 -436 28 -163 237 -34 127 -111 266 -186 72 -96 -217 24 12 119 80 55 -198 -21 -241 -295 -112
7342 -112 48 57 120 47 -21 -69 -387 -211 130 143 123 109 62 -20 -151 20 261 -7 162 49 49 -189 -16 -54 -2
7367 -2 -122 293 100 67 120 205 125 -388 -53 12 5 119 210 -147 132 -16 4 108 138 16 79 46 330 107 -17
7392 -17 -125 -3 -255 71 118 184 41 -53 79 -227 -101 -71 -237 107 45 115 101 -124 -243 -48 62 24 245
7415 245 71 26 -150 49 -215 -114 -117 43 141 193 -57 11 -201 148 -199 11 11 46 219 257 -148 -21 28 -25
7439 -25 -118 -145 126 -14 26 109 -78 -173 -61 -124 92 453 -6 173 -48 77 -76 18 -81 -234 -4 297 146
7462 146 -121 47 31 -42 -100 -21 -109 116 135 -82 -172 -142 -316 6 38 134 132 151 111 -6 -65 -327 49 199 -46
7487 -46 197 153 -40 156 39 -100 -201 -38 324 -76 174 70 161 -52 -202 24 -240 261 210 62 -35 15
7509 15 -215 -33 11 -48 -46 37 154 -93 -119 -237 -33 30 -125 156 97 -102 118 125 -68 -47 -72 121 206 178 90
7534 90 90 -118 284 -62 151 92 88 78 -27 4 -74 -143 4 -5 128 233 84 134 53 -114 -209 -100 -151 67 -74
7559 -74 165 172 31 46 -210 -116 -216 239 415 110 225 -98 -115 -67 -169 47 288 -62 243 241 49 -39 -69 -155
7583 -155 155 216 342 22 65 -62 -110 -271 -198 -130 103 -51 133 255 -26 -180 -232 -58 -35 -58 155 174 190
7606 190 47 7 -107 114 179 12 127 75 -22 -231 74 -223 155 -155 -142 -34 120 -6 140 -310 81 -142
7628 -142 -119 -19 80 141 18 17 -185 -286 -6 -146 228 71 123 0 -194 -279 -101 70 -102 -25 -156 190 -128
7651 -128 -257 4 -243 -1 -79 -22 92 154 53 -234 -8 109 -130 99 205 21 -92 51 6 129 -102
7672 -102 -120 123 157 234 -45 35 3 82 -377 -355 242 -7 -5 91 10 -111 -328 150 43 -34 91 176 93 -72 38
7697 38 -148 -64 -75 -19 140 -68 104 30 -200 -126 -145 -46 -258 70 87 157 -161 -159 -15 -75 -301 259 74 142 233
7722 233 63 22 -44 2 214 38 321 109 -172 78 -237 -160 -211 111 -57 122 295 269 -197 -127 76 -141
7744 -141 -106 -59 142 151 155 122 -47 -235 -90 -44 -36 170 205 153 18 -97 -184 -23 -116 44 183 226 106 0 48
7769 48 -196 73 -69 126 -51 392 124 -50 48 -48 -430 -33 17 64 207 -139 -150 -41 -8 -290 -203 222 38
7792 38 131 171 89 -27 248 -75 -211 -109 -106 90 125 123 -129 44 -116 -186 91 -58 235 85 11 -23 -231 199
7816 199 94 -35 40 122 -59 8 -193 225 -82 101 96 241 119 188 -27 -159 54 -160 165 138 174 134 344
7839 344 -75 -306 -150 -62 -88 86 100 21 45 6 -113 -31 -260 -253 41 3 -133 233 266 -85 -75 -162 198 174 -75
7864 -75 201 -74 311 -105 -292 -190 105 214 192 312 56 10 -240 -438 -164 -43 -16 163 240 -82 -164 161
7886 161 108 -54 63 -28 -81 111 131 -133 -64 -206 -19 241 41 112 -10 -102 -75 -206 -126 -137 207 364 195
7909 195 1 120 64 -140 -30 -338 253 -48 102 137 -26 -27 222 -59 -85 -6 118 19 121 74 -82 157 -141
7932 -141 -103 -187 242 78 137 -7 -190 -19 13 -17 -64 47 -138 290 70 59 -28 78 -179 -20 -152 101 139
7955 139 -12 -193 176 -105 9 -175 103 255 -94 9 77 -87 13 -197 59 62 -112 108 -150 -109 -63 -158
7977 -158 -149 19 55 197 34 162 -103 -126 -188 -179 -18 109 283 113 -65 82 -46 -175 -156 -74 -214 26 -63
8000 -63 45 85 -83 -92 -200 -160 155 -12 -92 -156 115 -132 -140 -238 -80 342 75 -74 68 -22 -131 -42 -127 106
8024 106 -64 38 178 -6 -178 -77 -27 -104 56 121 9 133 -32 -244 -191 -206 -31 41 115 189 266 178 -4
8047 -4 -180 -133 19 12 -90 76 11 -34 -138 8 47 -23 121 151 26 -191 -14 175 15 -66 15 -8 29 -43 68
8072 68 163 -5 -167 -242 7 66 -64 -125 343 48 38 -6 -44 -146 48 248 234 20 -61 -79 -83 -65 24 -52 -84 10
8098 10 -2 30 85 -42 -141 202 -173 9 -77 -121 -76 22 -242 -161 -39 -31 208 200 371 44 -111 -221 -25 -65 -125
8123 -125 161 110 224 142 -96 -259 -188 -58 -58 63 282 30 -48 11 -113 -64 -208 244 112 -1 197 75 -11
8146 -11 -81 -61 -100 146 80 65 -70 94 -338 -207 10 -59 46 -76 92 194 5 105 16 -50 45 158 61 77
8170 77 296 123 -139 129 5 -5 158 141 2 100 -10 -109 -324 -131 -73 31 36 191 59 -275 -14
8191a4
$$ Imaginary data points
##PAGE= N=2
##DATA TABLE= (X++(I..I)), XYDATA
0 0 0 0 0 0 0 0 0 0 0 0 0 0 0 0 0 0 8 -8 8 -8 8 -11 16 -16 17 -24 24 -32 32 -40 44 -49 57 -65 73 -81 92 -104
38 -104 115 -129 143 -158 175 -195 213 -237 262 -289 317 -350 385 -424 470 -517 572 -635 704 -788
58 -788 883 -996 1134 -1306 1524 -1817 2225 -2834 3855 -5857 11293 -58807 -172112 -76306
72 -76306 -22000 2990 74574 120779 67872 8058 -52027 -95751 -76220 -31456 -8529 56381
84 56381 114083 76928 9990 -29753 -90175 -108514 -38652 18409 44853 107740 111903 1707
96 1707 -79506 -77091 -76469 -54888 22413 81666 88745 64395 664 -55808 -60855 -66032 -65249 9202
110 9202 86204 79682 51972 27881 -40340 -92296 -72553 -39577 2428 75741 100928 49774
122 49774 1450 -34681 -81073 -82611 -28808 22686 63020 81888 47435 163 -26916 -66361
134 -66361 -87506 -35279 30980 55137 68801 63675 8821 -47142 -66502 -68441 -40046 22734
146 22734 63002 65780 55588 15785 -46715 -75967 -62107 -30281 20165 63588 64613 41886
158 41886 12512 -36439 -72647 -59084 -23463 10929 52345 72943 47417 4316 -35800 -66902
170 -66902 -62962 -23301 17004 48890 68562 50160 1148 -39893 -61671 -60362 -25049 22603
182 22603 51448 59835 45033 2951 -39275 -56700 -53713 -28693 16767 52983 60005 42703 5434
195 5434 -38878 -60933 -51114 -23438 15583 51621 60058 38892 3249 -34939 -58844 -51915 -20667
208 -20667 17273 48816 58171 37146 1216 -32855 -55164 -52053 -21562 17202 47230 57600
220 57600 38983 -103 -36088 -54160 -49100 -20217 18695 47058 53291 36260 1181 -34518
232 -34518 -52950 -47619 -19819 18359 46392 52210 34912 1073 -34278 -52501 -45542 -18771 17235
245 17235 46464 52238 33061 -782 -33563 -51279 -44616 -16748 18280 44563 50003 32255 -287
258 -287 -33105 -50660 -43797 -15765 18202 43626 49294 31435 -1765 -33070 -48527 -42123 -15981
271 -15981 18221 43588 48000 30010 -2034 -32671 -48108 -40963 -14621 18665 42678 46352 29253
284 29253 -1867 -32237 -47217 -39841 -14026 18126 42195 46190 28321 -2581 -32027 -45875
296 -45875 -38846 -13366 18571 41450 44696 26959 -2951 -30965 -45388 -37985 -12627 18397 40481
309 40481 43663 26283 -3226 -31331 -44557 -36740 -11978 18026 39774 43345 25717 -3614 -30905
322 -30905 -43665 -35995 -11546 18677 39527 41679 24342 -3779 -30174 -42894 -35312 -11179 18415
335 18415 38753 40732 23869 -4160 -30279 -41837 -33532 -10231 18009 37706 40097 23302 -4387
348 -4387 -29887 -41341 -33334 -9548 18713 37463 38670 21973 -4614 -29121 -40567 -32428 -9192
361 -9192 18069 37340 38613 21543 -5788 -29594 -39348 -31175 -8672 18111 35550 37272 21187
374 21187 -5325 -29155 -39137 -30919 -7921 18886 35893 36088 19962 -5667 -28171 -37598 -29629
387 -29629 -8486 18230 36403 35735 18946 -5584 -28110 -37584 -28805 -6828 17919 34277 34479
400 34479 18400 -5162 -27354 -37871 -29015 -5580 18587 33486 34219 18048 -6614 -26693 -35778
413 -35778 -28475 -6276 18970 33013 32874 18345 -6563 -28129 -35285 -26410 -5592 17987 31920
426 31920 31794 18704 -5552 -28754 -35287 -24708 -5296 17162 33735 32334 15706 -6617 -27156
439 -27156 -34785 -24352 -4587 16687 32879 32639 14644 -8465 -25798 -33187 -24227 -3300 16514
452 16514 30453 32679 15872 -9163 -26102 -31835 -25795 -4473 20080 31588 29240 14509 -9008
465 -9008 -26649 -30438 -23101 -4866 19335 31633 27443 13613 -6830 -26740 -31495 -20671 -4462
478 -4462 16383 32406 28834 11992 -6419 -25369 -34134 -22305 185 18544 30348 28461 9959
491 9959 -10040 -23007 -29668 -21716 -725 17696 27004 28285 13944 -9544 -25117 -28951 -22665
504 -22665 -2543 20583 28995 25299 13348 -8932 -28013 -28958 -18367 -2099 18488 30204 23599
517 23599 9020 -7282 -24200 -28710 -17965 -2260 15541 30250 26282 8797 -7834 -23078
529 -23078 -31732 -19870 2821 18264 26420 25855 9415 -11368 -23166 -26721 -19523 986 18931
542 18931 25146 23391 11386 -9920 -24398 -25922 -19150 -1339 19963 27785 21737 10168 -9060
555 -9060 -26882 -27066 -13609 868 16404 27149 22171 7870 -8106 -23409 -27843 -14940 1678
568 1678 15451 26577 24628 6980 -10966 -22342 -26235 -16231 2675 16989 24354 23558 8351
581 8351 -12791 -22779 -22472 -16136 169 18509 24792 20870 8471 -10117 -23939 -23952 -14476 425
595 425 18362 26553 19558 5813 -9798 -22776 -23619 -12952 1066 16111 25920 20785 4789 -9807
609 -9807 -20948 -24862 -14762 3445 17646 24330 20445 5317 -11292 -21447 -23135 -14116 3412
622 3412 17768 22666 18414 5996 -10565 -21118 -21825 -13803 1597 18049 23740 18162 5548 -10195
636 -10195 -22672 -23122 -11567 3668 17146 22811 17351 4138 -10288 -20933 -21706 -11757 3179
649 3179 16159 22272 18136 4775 -10747 -20563 -21342 -12264 3833 17570 22246 17332 4079 -11663
663 -11663 -21142 -20440 -10307 3995 16736 21316 16118 3624 -10458 -20255 -20196 -10705 3462 16296
677 16296 21969 16764 2826 -11166 -20068 -20522 -10156 4641 16917 20860 15796 2699 -11476
690 -11476 -19582 -19120 -9718 4450 16637 20056 15377 3253 -11449 -19838 -18703 -9429 4161 16675
704 16675 20921 14735 2421 -11070 -19959 -18868 -8967 4915 16268 20110 14244 1977 -10833
717 -10833 -19621 -18417 -8058 5399 15492 19672 14690 1490 -11835 -18754 -17477 -8273 4992
730 4992 16068 19314 13742 1414 -11334 -18876 -17497 -7805 5513 16325 18868 12876 1631 -11756
744 -11756 -18892 -16258 -7161 5138 15580 19593 12689 233 -11234 -18031 -16415 -7366 5458 16009
758 16009 18568 12013 321 -11207 -17899 -16525 -6926 6256 15512 17984 12036 332 -11627 -17823
772 -17823 -15891 -6530 6019 15851 17561 11501 -21 -11468 -17292 -15422 -6136 6326 15710 17452
786 17452 10801 -130 -11119 -17464 -15192 -5553 6557 15191 17094 10718 -556 -11612 -17204 -14642
800 -14642 -5150 6571 14962 16689 10479 -549 -11446 -16953 -14091 -5012 6706 14962 16336 9835
814 9835 -1104 -11821 -16828 -13988 -4558 7011 14864 15952 9804 -1456 -11625 -16583 -13381 -4217
828 -4217 6834 14935 15908 9594 -1496 -11600 -16028 -13071 -4133 7041 14664 15503 8764 -1726
842 -1726 -11583 -15858 -12753 -3369 7095 14645 15215 8495 -1932 -11436 -15546 -12338 -3206 7217 14557
857 14557 14822 8435 -2453 -11704 -15557 -12178 -2781 7505 14454 14298 7897 -2351 -11232 -15443 -11790
872 -11790 -2875 7461 14587 14401 7723 -2665 -11495 -15164 -11341 -2343 7205 13766 14020 7457 -2829
887 -2829 -11509 -14474 -10973 -2309 7615 13840 13648 6924 -2941 -11162 -14579 -10703 -2115 7901 13606
902 13606 13130 6618 -3161 -11482 -14283 -9991 -2116 7396 13810 13122 6306 -3208 -11109 -14209 -10280
917 -10280 -1459 7776 13561 12813 5933 -3469 -10831 -14102 -10166 -1037 7985 12889 12554 6006 -3773
932 -3773 -11220 -13330 -9630 -951 8013 12844 12214 6139 -3721 -11387 -13328 -9249 -1126 8334 13116
947 13116 11457 5112 -3821 -11176 -13346 -8649 -582 7651 12883 11453 4891 -3819 -11180 -13131 -8262
962 -8262 -107 7758 12606 12075 4855 -4439 -11120 -12603 -8520 18 8102 12477 11042 4148 -4365
977 -4365 -10807 -12151 -8539 86 8437 12210 10838 4312 -4516 -11093 -12365 -7653 2 8273 12292
992 12292 10392 3732 -4487 -10781 -11836 -7498 235 7903 11861 10096 3533 -3940 -10399 -12506 -7556
1007 -7556 918 8377 11709 10260 3547 -4991 -10563 -11507 -7061 897 7927 11342 9692 3555 -4458
1022 -4458 -10600 -11280 -7057 492 8204 11736 9732 3381 -4743 -10823 -11357 -6443 1277 8102 11591
1037 11591 9170 2448 -4971 -10318 -10737 -6078 1083 7754 11094 9553 2821 -4939 -10216 -10820 -6667
1052 -6667 1281 8615 11414 8764 2395 -5033 -10282 -10354 -5549 1599 8170 10816 8402 2339 -4946
1067 -4946 -10266 -10324 -5400 1287 8047 11501 8751 1852 -5298 -10020 -10359 -5425 2273 7973 10431 8090
1083 8090 1449 -5179 -9453 -9821 -5450 1680 8151 10119 8423 2069 -5568 -10224 -9476 -5015 2046
1098 2046 8345 10164 7338 1343 -5414 -9989 -9187 -4300 1769 7808 10581 7286 1119 -5114 -9854
1113 -9854 -9638 -4511 2198 8061 10242 7465 684 -5512 -9389 -9548 -4310 3156 7908 9235 7344
1128 7344 767 -5862 -9180 -8481 -4574 2488 8240 9438 6796 1020 -5616 -9628 -8542 -4039 2634
1143 2634 8693 9370 6011 646 -5211 -9770 -8504 -3466 2478 7722 9763 6276 260 -5483 -9061
1158 -9061 -8672 -3259 3132 7895 9429 6357 44 -6067 -8872 -8251 -3537 3513 8104 8899 6429 299
1174 299 -6157 -9057 -7956 -3356 2556 8129 9006 5636 117 -5870 -9349 -7538 -2852 3300 7937
1189 7937 9097 5495 -447 -5572 -8756 -7993 -2676 3395 7786 8760 5693 -709 -6147 -8552 -7280
1204 -7280 -2602 3571 7917 8198 5458 -482 -6243 -8566 -7036 -2641 3258 8125 8214 4675 -461 -5853
1220 -5853 -8620 -6949 -2343 3364 7868 8508 4604 -861 -5915 -8602 -7041 -1469 3477 7412 8293
1235 8293 4581 -1179 -5863 -8024 -6715 -2068 3761 7444 7777 4504 -1162 -5838 -8190 -6536 -1599
1250 -1599 4140 7611 7558 4473 -1095 -6338 -7859 -6128 -1639 3959 7516 7371 3949 -1254 -6035 -8140
1266 -8140 -6290 -1156 3962 7154 7341 3608 -1528 -6119 -7906 -6064 -1144 4172 7499 7260 3712
1281 3712 -1515 -6156 -7506 -5670 -1008 4190 7222 7089 3434 -1951 -5830 -7624 -5411 -1015 3995
1296 3995 6957 6827 3291 -1742 -6001 -7542 -5116 -717 4179 7091 6794 3154 -1772 -6066 -7238
1311 -7238 -5008 -731 4312 7022 6425 3023 -1846 -6127 -7434 -4921 -235 3930 6928 6639 2790
1326 2790 -2172 -6083 -7079 -4919 -299 4188 7010 6438 2705 -2150 -5737 -6799 -4700 -400 4631
1341 4631 7043 5909 2711 -2229 -6082 -6884 -4650 -190 4411 6753 5983 2510 -2284 -5584 -6672
1356 -6672 -4556 95 4455 7002 5785 2153 -2144 -5638 -6591 -4344 247 4599 6538 5831 2262
1371 2262 -2493 -6082 -6613 -4078 180 4649 6491 5606 2000 -2728 -5856 -6290 -3934 323 4407 6491
1387 6491 5597 1967 -2833 -6016 -6613 -3981 417 4251 6498 5339 1774 -2855 -6077 -6107 -3563 508
1403 508 4338 6183 5314 1470 -2887 -5610 -5919 -3682 571 4528 6558 4821 1349 -2831 -5427 -5870
1419 -5870 -3560 503 4680 6221 4887 1351 -2824 -5840 -5957 -2935 863 4657 6104 4875 1021
1434 1021 -2801 -5455 -5785 -3493 905 4862 5995 4564 1092 -2670 -5485 -5773 -2851 925 4643
1449 4643 5959 4589 1118 -3166 -5692 -5536 -2807 1031 4686 5937 4403 943 -2741 -5477 -5484 -2731
1465 -2731 1433 4655 5690 4229 801 -3292 -5789 -5365 -2480 1361 4038 5386 4267 563 -3519
1480 -3519 -5207 -4975 -2595 1332 4456 5475 4117 469 -3334 -5305 -4879 -2411 1468 4616 5347 3795
1496 3795 496 -3243 -5267 -4729 -1802 1185 4300 5488 3735 31 -3144 -5271 -4898 -2263 1599
1511 1599 4685 5374 3674 341 -3082 -5096 -4946 -1981 1895 4408 5182 3532 518 -3495 -5333 -4803
1527 -4803 -2303 1796 4598 5151 3197 180 -3223 -5250 -4528 -1750 1724 4497 5066 2928 -181 -3231
1543 -3231 -5197 -4445 -1580 1680 4227 5534 3476 -273 -3241 -5332 -4638 -1542 2044 4492 5168 3326
1559 3326 -95 -3589 -4904 -4161 -1642 1967 4573 4529 3310 -284 -3754 -4963 -4045 -1867 1898 5034
1575 5034 4762 2613 -332 -3505 -5225 -3948 -979 1941 4502 4881 2508 -564 -3164 -4820 -4035 -1052
1591 -1052 2073 4262 5025 2618 -909 -3797 -4711 -4044 -1126 2692 4413 4401 2722 -672 -4001 -4396
1607 -4396 -3332 -1375 2453 4429 4165 2377 -329 -3835 -4812 -3610 -905 2009 4772 4637 2185 -942
1623 -942 -3417 -5022 -3740 -411 2304 4434 4558 2059 -1121 -3331 -4590 -3646 -471 2486 4059 4173
1639 4173 2399 -1126 -3713 -4489 -3469 -660 2711 4424 3735 2212 -850 -3608 -4462 -2973 -688 2200
1655 2200 4409 3911 1921 -799 -3726 -4836 -3053 -148 2317 4116 4362 1801 -1395 -3436 -4458
1670 -4458 -3160 78 2629 4109 4256 1660 -1453 -3406 -4315 -3101 -73 2946 4143 3713 1868 -1358
1686 -1358 -3927 -4258 -2743 -255 2615 4320 3489 1568 -1193 -3624 -4298 -2806 -181 2402 4213 3679
1702 3679 1249 -1494 -3701 -4178 -2670 223 2629 3987 3841 1176 -1715 -3342 -4103 -2663 -101 2898
1718 2898 4083 3336 1532 -1729 -3729 -3832 -2831 -140 3029 4012 3279 1378 -1670 -3868 -4222 -2271
1734 -2271 2 2528 4298 3334 959 -1285 -3579 -4137 -2416 460 2761 3799 3233 1008 -1448 -3566
1750 -3566 -3741 -2426 272 2706 3912 3338 1303 -1817 -3487 -3959 -2288 366 3010 3974 2966 1087
1766 1087 -1575 -3701 -3523 -2096 283 2713 3776 3033 900 -1749 -3466 -3462 -2025 551 2546 3913
1782 3913 3098 575 -2004 -3420 -3443 -1962 529 2759 3715 3245 587 -1603 -3403 -3546 -2088 498
1798 498 2966 3681 2514 713 -1759 -3556 -3479 -1756 491 2855 3607 2619 789 -1855 -3477 -3363 -1939
1815 -1939 865 3059 3708 2649 634 -1902 -3441 -3332 -1850 800 2734 3410 2492 395 -1960 -3666
1831 -3666 -3381 -1506 715 2816 3402 2465 182 -1894 -3190 -3076 -1667 667 3002 3485 2476 382
1847 382 -1956 -3208 -3377 -1734 1062 2862 3614 2481 237 -1943 -3248 -3006 -1355 951 2763 3087
1863 3087 2151 45 -2058 -3183 -3159 -1565 948 2954 3490 2155 15 -1882 -3074 -3029 -1163 1082
1879 1082 2872 3307 2219 -133 -2144 -3199 -2914 -1059 1006 2874 3210 2402 171 -2171 -3282 -2833
1895 -2833 -1222 1334 2778 3364 2044 -167 -2183 -3286 -2681 -1186 1104 2602 3361 1868 14 -2047
1911 -2047 -3116 -2678 -1054 1076 2659 2949 2090 -183 -2165 -3021 -2810 -928 1385 2669 3037 1978
1927 1978 -169 -2079 -3195 -2565 -921 1415 2924 2957 1752 -117 -2297 -2932 -2755 -772 1064 2401
1943 2401 2964 1639 -515 -2145 -3158 -2616 -625 1595 2815 3039 1733 -653 -2020 -2937 -2426 -577
1959 -577 1448 2883 3106 1505 -252 -2286 -3158 -2469 -694 1465 2649 2817 1689 -460 -2242 -2767
1975 -2767 -2082 -531 1378 2575 2980 1548 -563 -2328 -3040 -2318 -288 1344 2503 2758 1535 -609
1991 -609 -2207 -2910 -2355 -297 1607 2914 2814 1600 -820 -2258 -2609 -2041 -606 1480 2572 2595 1346
2008 1346 -337 -2139 -2971 -1837 -507 1416 2832 2353 1283 -801 -2135 -2714 -1945 -43 1500 2737
2024 2737 2620 1293 -640 -2290 -2778 -1856 -190 1386 2622 2419 1061 -787 -2330 -2471 -1807 -130
2040 -130 1559 2782 2572 1206 -604 -2217 -2664 -1694 -112 1701 2651 2405 1204 -596 -2259 -2743 -1732
2057 -1732 -136 1558 2721 2463 980 -728 -2171 -2737 -1778 43 1563 2368 2323 946 -964 -2116
2073 -2116 -2308 -1793 -51 1722 2417 2067 1082 -984 -2554 -2707 -1583 -7 1578 2650 2189 869 -685
2090 -685 -2099 -2645 -1633 56 1614 2614 2301 807 -988 -2298 -2617 -1482 -121 1404 2156 2220 632
2107 632 -1153 -2092 -2101 -1510 86 1667 2173 2150 758 -942 -2212 -2334 -1498 140 1963 2542 1985 796
2125 796 -925 -2220 -2293 -1104 173 1926 2499 1826 525 -972 -1968 -2297 -1256 245 1634 2247 2182
2142 2182 603 -988 -2248 -2594 -1325 366 1632 2251 2021 422 -968 -2166 -2129 -1546 421 1846
2158 1846 2178 1825 432 -1113 -2114 -1890 -1033 298 1974 2129 1695 445 -918 -2299 -2093 -945 313
2175 313 1823 2031 1711 210 -1035 -1968 -2220 -1209 369 1337 2281 1544 112 -1240 -2170 -2069 -1134 330
2193 330 1819 2113 1569 659 -1161 -2280 -1791 -1022 450 1777 2338 1567 466 -1216 -2106 -1936 -891
2210 -891 584 1688 2191 1723 57 -1157 -2112 -1946 -856 400 1745 2257 1752 -29 -987 -1853 -1707
2227 -1707 -874 543 1676 2237 1666 183 -1143 -2097 -1781 -721 607 1816 2183 1534 351 -1508 -2219
2244 -2219 -1734 -798 549 1829 1941 1202 57 -1200 -1974 -1682 -923 394 1840 2071 1372 51 -1315
2261 -1315 -1722 -1895 -713 556 1863 1815 1386 -9 -1602 -2202 -1670 -596 902 1852 2084 1222 -369
2278 -369 -1355 -1946 -1629 -877 783 1974 2057 1289 91 -1390 -2137 -1642 -565 738 1631 1748 1289 236
2296 236 -1219 -1864 -1559 -510 651 1849 2043 1348 76 -1193 -1883 -1207 -486 740 1754 1720 1105 -330
2314 -330 -1227 -2018 -1837 -633 722 1551 1784 1241 -329 -1263 -1811 -1442 -496 1023 1914 1811 895 -94 -1342
2333 -1342 -1934 -1595 -431 919 1479 1986 1196 -237 -1310 -1823 -1317 -671 917 1552 1904 1127 -145 -1336
2351 -1336 -1716 -1335 -254 734 1539 1794 759 -9 -1557 -1805 -1467 -396 725 1771 1967 901 -177
2368 -177 -1475 -1776 -1250 -158 919 1539 1787 849 -311 -1377 -1797 -1257 -192 933 1821 1642 899 -408
2386 -408 -1334 -1693 -1222 -35 985 1599 1628 715 -328 -1373 -1646 -1424 -209 743 1582 1381 626 -340 -1390
2405 -1390 -1643 -1166 -252 1084 1604 1515 719 -399 -1212 -1673 -1243 95 865 1493 1487 821 -530 -1346 -1693
2424 -1693 -1143 -258 865 1565 1543 824 -275 -1136 -1616 -1141 -162 921 1531 1368 568 -141 -1258 -1600 -1256
2443 -1256 -329 993 1383 1232 646 -602 -1317 -1538 -923 167 871 1650 1313 419 -320 -1317 -1450 -1222 -313
2462 -313 924 1364 1423 613 -559 -1218 -1472 -852 -33 826 1363 1384 467 -645 -1338 -1474 -949 -235 1036
2481 1036 1529 1212 842 -430 -1263 -1518 -1047 92 946 1504 1367 577 -404 -1225 -1517 -854 123 793 1486
2500 1486 1122 334 -488 -1371 -1512 -1148 140 976 1358 1348 415 -628 -1380 -1266 -1058 69 795 1408 1180
2519 1180 180 -704 -1326 -1331 -842 334 877 1203 1283 579 -902 -1119 -1450 -733 94 956 1467 945 280 -470
2539 -470 -1348 -1201 -908 108 1129 1164 1214 568 -545 -1148 -1243 -788 100 920 1177 972 422 -463 -1202 -1165
2559 -1165 -648 -29 939 1456 945 152 -769 -1414 -1318 -788 414 759 1120 761 398 -570 -1382 -1567 -770 489
2579 489 1010 1307 964 211 -749 -1229 -1090 -558 23 1064 1159 1018 277 -469 -1332 -989 -935 198 1018 1394
2599 1394 1029 63 -690 -1376 -1208 -749 193 1005 1147 1163 179 -620 -1182 -1352 -414 336 896 1289 883 243
2619 243 -656 -1260 -1043 -430 426 1055 1211 728 154 -652 -1176 -1105 -660 428 1066 1138 562 -36 -707 -1055
2639 -1055 -1322 -597 140 886 1221 682 286 -813 -1324 -978 -648 256 974 1184 865 4 -363 -781 -1028
2658 -1028 -667 392 902 985 787 237 -722 -1247 -1009 -564 10 823 1114 916 33 -647 -1078 -1016 -245 365
2678 365 940 1123 670 94 -617 -1111 -908 -346 311 1094 1015 592 -74 -949 -1174 -1053 -298 284 897 969 707
2699 707 0 -643 -970 -937 -315 463 980 1041 418 -174 -749 -901 -676 -170 600 742 931 499 -123 -757 -1082
2720 -1082 -735 -160 419 897 829 678 -126 -1012 -970 -978 -225 606 854 693 854 143 -774 -955 -717 -288 148
2741 148 817 977 447 28 -894 -1063 -642 -263 342 953 807 685 49 -793 -952 -813 -525 425 636 902
2761 902 581 -174 -705 -684 -975 -190 424 869 880 276 60 -507 -938 -654 -244 497 770 1013 476 -125 -1064
2782 -1064 -918 -562 -359 401 850 934 402 -69 -744 -755 -626 -233 661 857 697 308 85 -682 -991 -597
2802 -597 -310 462 747 391 277 -307 -729 -634 -800 99 422 774 749 205 -270 -635 -776 -685 -77 615 732
2823 732 795 485 -48 -745 -902 -514 -50 641 908 954 417 -190 -741 -769 -520 -53 528 750 634 508 -181
2844 -181 -526 -999 -573 84 586 872 463 67 -401 -581 -879 -708 -343 450 775 868 170 -428 -888 -823 -448
2865 -448 76 677 739 388 127 -72 -650 -830 -524 50 502 789 774 310 -411 -672 -973 -548 -79 452 625
2886 625 689 527 -14 -855 -625 -366 58 378 708 568 246 -171 -481 -608 -793 82 470 758 722 266 -123
2907 -123 -744 -646 -442 -46 462 571 614 209 -238 -299 -639 -395 133 648 676 461 124 -193 -747 -536 -318
2928 -318 -117 595 739 509 190 -296 -751 -571 -586 39 600 906 396 66 -241 -612 -807 -220 -171 492 754
2949 754 504 143 -144 -692 -649 -405 -242 357 897 464 311 -201 -358 -704 -583 195 322 735 596 139
2969 139 -371 -486 -463 -329 -32 351 558 611 -28 -375 -582 -562 -88 -9 471 694 717 188 -266 -560 -909 9
2991 9 133 530 736 445 73 -462 -572 -714 -348 71 563 366 524 -38 -326 -692 -626 -334 352 504 706
3012 706 477 136 -509 -517 -724 -634 82 380 816 260 342 -463 -238 -171 -37 162 491 370 299 306 -295 -602 -632
3035 -632 -366 -57 566 339 438 64 -330 -282 -751 -308 132 379 525 252 -36 -274 -480 -522 -145 129 454
3056 454 433 392 100 -332 -567 -473 -485 -35 510 411 502 24 -444 -439 -483 -162 74 593 553 353 206 -434 -453 -436
3080 -436 -265 17 341 339 459 48 -381 -621 -655 -376 252 447 514 264 196 -222 -420 -427 -144 314 650 556 386
3103 386 -16 -384 -416 -394 -174 209 463 496 89 -141 -430 -243 -417 -167 97 469 575 244 2 -298 -456
3124 -456 -465 -280 270 461 489 79 -292 -385 -508 -545 34 -83 346 578 319 -145 -388 -400 -259 -283 144 523
3146 523 517 368 50 -339 -365 -78 -135 95 519 476 68 -26 -231 -541 -434 -146 271 459 509 225 -133 -204 -380
3169 -380 -133 -33 147 722 362 255 -153 -112 -353 -446 -191 5 224 650 333 -159 -393 -426 -248 21 188
3190 188 350 407 199 185 -304 -411 -234 -194 174 280 326 68 -344 -411 -374 -158 -40 195 245 339 357 -323 -423
3213 -423 -172 -295 29 274 486 318 171 -233 -153 -577 -388 -62 359 380 300 166 -84 -272 -134 -359 -15
3234 -15 427 432 151 315 62 -205 -361 2 217 177 340 152 40 282 -148 -539 -125 38 183 403 86
3255 86 -45 -246 -134 -333 -213 -23 202 297 152 172 40 -447 -219 -187 87 351 187 473 177 -6 -364
3276 -364 -353 -221 210 425 35 247 204 -130 -310 -438 -106 359 217 250 364 79 -4 -127 -552 -536 26 272
3298 272 195 332 143 -312 -224 -57 -202 39 246 103 64 -282 -66 -196 -312 -390 40 175 313 84 -92
3319 -92 -55 -324 -254 -90 12 136 223 167 -154 262 -202 -378 -92 -44 128 241 136 1 -63 -411 -48 -155
3341 -155 7 336 271 142 205 -174 -240 -228 -6 170 344 311 102 -15 -226 -294 -154 -106 -51 85 373 301 -37
3364 -37 22 -181 -502 -52 -122 296 373 279 -114 -275 -101 -211 -17 26 402 266 278 131 -211 -120 -128 50 -74
3387 -74 47 340 132 -40 22 -278 -283 -5 203 155 54 158 -35 -349 -244 -193 -61 19 210 237 143 72 -313
3410 -313 -338 -244 -292 -44 200 101 205 -28 2 -57 -250 -288 170 357 61 170 21 2 -156 -52 100 -35 65
3433 65 157 265 8 -265 -289 -170 24 -126 160 45 172 158 -163 -155 -289 -219 78 263 -10 308 -95 -18 -276
3456 -276 -163 26 110 84 242 81 -35 -60 -89 -479 37 136 97 160 186 -68 -96 -193 -350 -64 150 317 57
3479 57 -236 57 -198 -398 -279 -203 178 -3 174 153 60 -173 10 -80 19 33 187 304 491 143 69 -164 31
3502 31 153 37 339 20 -96 -91 46 -151 -440 -40 120 27 178 -3 -204 54 -179 -326 331 169 36
3523 36 296 80 263 63 -225 -64 -97 124 118 284 165 -51 -230 -185 35 -80 -165 -80 39 -39 78 -255 -272
3546 -272 -14 -146 32 88 114 -57 187 47 -119 255 60 144 229 -22 13 -173 -227 276 11 -54 -141 -84 105
3569 105 197 76 -11 33 -37 12 173 89 25 23 190 -88 -174 -15 241 335 129 193 248 -26 -127 -202 -161 -9 16
3594 16 62 -21 114 -72 72 -37 -140 -177 145 -8 84 42 43 -53 -244 156 -64 177 39 112 -4 0 -98 -152 1
3619 1 -148 341 141 -63 53 -167 102 41 -138 -31 -225 61 18 165 8 -236 -104 -263 58 123 -1 317
3641 317 -11 -84 -45 -44 -216 -112 -22 -39 244 167 61 -224 26 91 -70 -74 243 -98 44 -25 -13 -346 -181 -45
3665 -45 117 142 34 14 -18 -88 -169 27 32 61 179 40 -16 108 55 20 24 110 -142 -8 162 -173 -41 -187 188
3690 188 -242 -217 -66 21 49 -23 -103 94 -69 35 -161 20 353 229 74 221 -173 35 -123 -15 -3 35
3712 35 -144 123 -252 -334 53 -155 -131 -106 68 113 116 -32 35 -75 95 -155 110 32 51 155 -155 -114 -25 280
3736 280 152 19 55 -144 116 -114 -254 136 14 164 230 126 -76 -167 -143 19 -275 -34 -73 -16 249 -59
3758 -59 -242 172 -131 205 -105 -127 31 -39 -256 -7 92 147 147 -176 270 50 9 64 136 -133 -181 -28 75 78
3782 78 68 27 -94 17 -58 -184 209 -80 -38 125 54 306 -20 210 297 73 122 -235 79 178 150 -56 -44 142
3806 142 -45 197 149 -114 60 150 -77 194 127 -23 90 195 -262 86 -17 -27 -165 -76 27 51 -105 84
3828 84 66 -3 -183 88 112 -158 -21 453 -155 75 11 -103 -142 -3 -135 -38 -50 -85 298 175 -49 131 100
3851 100 92 -49 -64 173 49 -89 -228 -11 -201 7 86 85 -40 -60 57 -150 376 167 -40 -59 161 -234 -407
3874 -407 -13 -234 91 123 -77 53 -130 -26 32 184 -266 4 -90 50 -77 20 -7 83 11 211 243 81 -78
3897 -78 138 -234 -329 -174 -13 -108 94 -81 -57 -128 -35 -196 -66 -71 -3 -75 17 -125 -172 -33 150 68 -151 184
3921 184 -89 131 90 109 -70 194 -217 91 -119 198 163 -71 42 -263 -111 -24 -118 141 25 117 -123 1
3943 1 83 52 -46 -88 288 21 -281 -58 -228 106 -70 -96 86 -27 49 -169 -80 272 -60 -250 -196 92 124 -66
3967 -66 -44 322 -24 -92 102 -194 -96 -36 43 112 163 -142 53 -167 -88 -151 51 -128 45 -43 -176 -248 -94 121
3991 121 33 111 76 108 12 -67 -171 -171 -61 18 6 208 151 34 -55 -144 -157 68 167 11 169 24 129 -50 -155
4016 -155 32 -60 -100 -142 71 55 -72 160 -51 -126 -28 -175 -46 -240 123 51 -105 20 -14 -239 81 60 -16
4039 -16 92 169 -190 -207 114 -31 50 64 75 71 71 -105 30 -23 -26 -45 96 138 176 60 137 39 57 -213 -132 91 98
4066 98 113 -1 -32 -64 -111 164 20 -10 37 283 4 -94 155 -154 -135 9 153 218 -66 360 -40 32 -163 -83
4090 -83 -89 -72 -75 -3 116 -166 -68 -61 31 -222 14 27 121 7 223 -164 -135 49 -68 223 139 -66 8 -211 -336
4115 -336 93 -9 -315 226 79 141 105 -22 46 -114 -139 -288 98 217 16 197 96 -119 16 49 369 -228
4137 -228 84 59 9 78 -234 81 -52 -104 102 73 55 -75 -106 128 -103 -289 45 -14 91 -92 21 -90 34
4160 34 -422 -102 -215 -101 183 14 -23 -50 -213 -83 -200 -66 170 -89 -62 44 -77 -217 -149 -149 -32 26 165
4183 165 -134 147 9 -210 -350 -196 -51 -182 246 -25 136 203 106 -93 -331 -95 -91 183 62 154 -4 -74
4205 -74 -183 -21 370 22 37 42 50 29 -7 -59 69 -60 -38 88 93 -47 321 -145 -151 -37 -127 83 140 63 -104 192
4231 192 -5 21 -19 34 -36 10 -139 114 -264 -103 -151 -78 60 7 108 146 116 -49 -52 -274 -84 -224 -15 252
4255 252 145 173 -73 -92 11 74 -38 -14 52 180 38 -6 -120 -26 44 38 -98 198 72 73 34 -28 104 7 -42
4280 -42 115 142 10 127 -113 -153 -97 32 109 181 112 50 -59 102 -5 -222 -346 -58 183 -50 78 119 -2
4303 -2 -37 251 -272 -237 372 -74 76 -53 -69 -137 -270 -184 23 -33 130 -172 -118 -4 -167 -167 157 -184 -165 173
4327 173 -53 172 176 45 -82 22 47 8 -21 72 -112 -109 -126 -47 -24 98 49 -12 84 -89 -61 -124 28 -45 -28 102
4353 102 266 138 -459 98 2 -184 -333 250 311 425 216 84 4 -253 -148 28 -77 114 120 104 -134 -81
4375 -81 -205 111 -73 -75 -42 -81 40 -1 -198 -131 -66 -53 -64 61 61 -46 211 -90 -247 -154 -158 247 -55 286 311
4400 311 -8 -70 -54 -128 247 -10 114 203 121 -123 -48 -68 -169 -114 68 85 211 109 181 -121 74 216 -9
4423 -9 -87 -120 51 235 70 -53 -8 -85 -111 -123 103 126 229 -102 -145 -41 -154 -22 41 -84 84 214 -54 -239
4447 -239 114 58 -59 -1 267 -118 105 -104 -2 -271 -67 10 345 27 84 -91 26 -82 -48 -102 26 -45
4469 -45 7 184 97 -3 -40 -127 -111 -113 329 178 164 48 -9 -18 312 -205 64 190 2 205 117 59 3 -13 -19 211
4495 211 135 61 12 31 -107 -173 136 297 -214 2 146 263 -79 -9 -190 -175 190 -125 -299 98 -25 277
4517 277 -274 -167 -261 -192 216 -18 -45 -43 -37 48 -77 -115 88 81 285 2 328 111 83 58 148 -84 37 -118 224
4542 224 96 41 -170 -21 -69 -88 -2 -148 32 171 188 -232 -297 -61 -63 159 -64 -72 302 58 -41 -269 -27 -93
4566 -93 107 117 95 246 -162 -27 -221 -21 -149 -313 163 225 262 267 94 -97 -386 -129 -46 221 93 59 -177
4589 -177 -238 85 -183 -198 117 161 144 135 -100 -187 -106 -326 -195 67 145 47 44 1 -53 -151 -283 -77 70 -52 145
4614 145 -109 83 -99 -123 -105 83 -18 171 304 262 -133 -199 -201 -121 -210 40 78 350 -174 -199 38 -102 -120 -286
4638 -286 -165 94 -18 397 -190 36 101 -3 -134 -96 307 88 105 -134 -277 155 -87 113 -101 72 194
4659 194 68 -64 -73 -258 54 -140 -54 84 225 127 -26 -124 -163 -62 -261 -117 -76 402 148 45 -149 81
4681 81 -249 52 175 73 15 334 -7 -222 -379 -257 -209 139 119 258 155 -245 -197 -160 -185 -40 144 2
4703 2 63 39 -163 117 27 -193 112 72 -93 139 -140 115 -455 -198 -12 68 97 187 147 217 -147 1 -12 -261
4727 -261 262 242 93 169 78 187 -215 73 -313 -160 352 84 239 245 -122 -297 -86 -324 -180 -219 48 39 343
4750 343 156 31 -182 -220 107 154 179 -41 134 57 54 -9 -301 16 61 212 310 36 86 -37 -124 -22 -212 227
4774 227 99 150 128 -44 -80 -150 -150 -132 -76 104 -41 -109 145 -114 -154 72 -62 115 140 278 -149 -179 91 -154
4798 -154 -114 -137 -52 113 -111 118 -157 -35 -156 -343 103 141 220 212 156 -207 -64 -291 -342 -65 170 144 1
4821 1 71 35 124 -131 -3 111 86 397 22 170 -263 -194 -225 -81 330 134 183 23 -18 -354 -175 -318 -305 68
4845 68 -26 49 227 -62 -142 -131 -334 -145 102 141 -104 276 119 171 -87 -145 -39 -43 383 321 362 -2 -308 19
4869 19 -166 -246 87 -96 -39 -147 183 -18 -82 -21 81 35 -31 151 -51 1 20 -149 -91 -4 146 193 57 209
4893 209 262 -44 -197 -450 89 -77 52 -5 168 71 -155 -463 -151 -160 -44 -108 222 122 16 32 -242 147
4915 147 -89 53 28 -64 312 -19 -166 -253 -178 -101 -279 132 43 389 235 -266 -199 -116 172 13 126 91 248
4938 248 -168 -106 -302 -309 -118 88 -66 194 100 -94 -285 -391 -191 -61 153 160 152 47 -90 -31 -77 -122 -10 13
4962 13 -28 97 250 350 -168 -154 -182 187 165 -90 106 -42 -64 87 -211 -271 -84 157 -62 250 221 218 118
4985 118 -236 -116 -137 -109 105 191 419 235 58 24 -251 -31 93 116 57 338 -93 -243 -173 -62 76 -162
5007 -162 243 143 124 -2 -171 -502 -434 -104 -26 149 99 237 47 37 -125 -23 38 13 294 192 194 -82 -402
5030 -402 -467 3 55 159 17 69 30 -121 -216 -362 -124 -20 -73 174 93 30 -93 -40 15 -146 -68 62 11 -52
5054 -52 70 -24 -156 -42 -319 -95 89 213 381 45 -7 -42 -126 39 -62 31 124 644 80 -42 -244 -58
5076 -58 -242 -228 122 -102 -71 223 -192 -256 -260 0 84 86 97 81 69 140 -43 -66 138 35 7 73 422 22 -85
5101 -85 -33 -210 -96 42 204 314 423 172 -73 -119 -79 -73 -292 -90 361 41 143 170 110 -370 -1 -73 190
5124 190 260 46 184 -198 29 -375 -292 -71 -25 325 188 229 -157 -278 -138 -149 -114 -91 -24 142 114 178 -163
5147 -163 -204 -69 -61 56 244 81 -57 -150 -17 -89 -63 -40 174 99 17 -257 -128 -72 -210 -71 -45 106 116 233
5171 233 137 -10 -470 -3 -189 -69 221 203 267 -260 -101 -95 -90 -205 203 -22 83 35 59 78 -134 -46 -143 43
5195 43 185 391 355 -127 -125 -169 -86 -23 132 -87 457 43 98 -17 -328 -105 -46 28 231 51 132 132 -27 -106 -93
5220 -93 29 -160 123 424 371 -334 0 28 -201 -269 -35 140 30 153 38 -46 -61 -157 -7 103 41 173 12
5243 12 77 -233 -452 4 13 -66 -3 224 211 189 -260 -301 78 172 -152 -13 278 345 -38 148 -50 -308 -334 -181
5267 -181 -25 -10 324 44 -33 39 -406 19 170 121 -20 95 -57 -83 116 -146 -147 19 157 36 93 -12 -191
5290 -191 -159 -95 -431 235 75 350 83 80 -120 124 -473 -21 79 241 97 316 21 151 -220 -182 240 -125
5312 -125 194 338 114 42 -154 60 18 -309 43 50 132 229 -168 123 -119 -130 59 -86 -35 192 -197 208 -102
5335 -102 -266 -76 4 -43 189 -43 80 -362 -150 19 -115 -122 244 227 133 120 -126 -309 210 -222 -3 207
5357 207 -160 346 212 -112 -76 -54 -201 -24 71 131 -27 129 -63 7 -194 -98 -262 181 83 180 200 61 -8
5380 -8 -309 -53 -135 177 39 205 -101 -13 -32 -90 -175 -252 189 313 354 -11 -176 -256 -288 -75 92 69 70 117 11
5405 11 50 -78 -190 -129 -236 5 171 225 166 -105 -129 -91 -60 -23 177 25 219 -63 216 -140 -184 -211 4 58
5429 58 340 210 -27 31 -172 -51 -104 119 -33 408 260 149 -121 -52 -102 -100 -59 -85 213 36 142 -37 -242
5452 -242 15 -19 -212 147 4 286 138 -2 -57 -280 -74 -150 385 147 162 24 -70 -103 -19 103 -70 429
5474 429 244 -51 -105 -65 -58 -206 -342 -9 -30 119 17 144 11 -289 -183 -128 274 11 189 27 44 28 -188
5497 -188 -144 -271 32 39 160 213 -77 29 127 -62 21 73 79 29 155 115 -119 -163 -32 -145 22 368 125 153
5521 153 65 -142 -155 -93 157 -63 110 209 146 51 -253 51 -181 214 -209 -64 123 274 95 -200 -412 -78
5543 -78 -26 -70 369 120 178 201 -280 -313 -209 108 5 116 190 31 119 -62 -160 -179 -117 26 100 258 98 97 -39
5568 -39 -281 -131 28 -22 450 159 -46 101 -36 -196 -124 -66 74 163 -163 416 114 -291 -57 -88 -305 11
5590 11 225 300 -138 132 58 -362 -228 -5 324 55 -26 283 111 -140 -265 -317 -194 -19 408 167 168 176 -37
5613 -37 89 45 -199 226 100 -81 218 -308 -54 -301 -18 -225 74 250 140 105 -95 -295 -97 -173 -138 -17
5635 -17 43 131 156 -135 -61 -155 -5 61 65 240 265 171 -31 -114 -33 -238 -89 61 54 44 -17 79 -46 -311 -91 70
5661 70 59 237 -54 110 -99 -11 -468 -140 -84 66 100 590 -16 81 -150 -200 -29 -148 56 248 202 207 -8
5684 -8 -90 -96 -241 -205 107 166 185 167 14 78 -183 -65 86 -218 161 263 16 -117 53 -91 -116 -108 0 101
5708 101 42 -47 44 -320 -131 -171 -165 -127 364 138 132 65 -272 71 -121 -1 25 -46 180 212 -115 -287 -85 -190
5732 -190 -153 165 366 30 -166 132 -259 -241 -248 64 -69 77 376 -156 -11 -141 -181 -63 -70 224 84 59 7
5755 7 -139 -190 -166 -159 -109 333 259 129 53 25 -36 -109 -99 26 -107 -22 187 -78 -100 -184 -128 -166 -170 -97 -20 144 -24
5782 -24 153 -252 -302 -63 -36 -81 321 -95 7 98 146 -245 -38 -133 -31 126 152 -2 -202 -201 -133 -163 -182 267
5806 267 301 55 190 -121 -23 -96 -62 187 57 299 -39 -54 1 -229 -123 -70 70 168 154 -71 -62 -21 11 -215
5830 -215 -214 146 13 422 219 -61 29 -38 -245 -109 117 124 73 82 245 279 -163 -26 -189 197 -70 125 285
5853 285 -93 296 -189 -349 29 81 38 221 -29 81 53 -125 -117 -71 264 167 163 172 40 -273 -117 -264 -291 10
5877 10 64 429 133 122 -151 73 -331 105 197 273 147 243 27 -55 30 -193 120 -36 219 33 199 -20 85
5900 85 -146 -388 64 65 39 0 224 -76 211 -141 -167 -124 -58 312 126 59 34 -169 -162 -38 -284 -58 348 62
5924 62 29 -65 -121 -287 -154 -168 -63 137 270 103 78 -81 -154 -147 -115 -341 7 39 99 -67 7 -175 -110 -171 38
5949 38 40 1 106 96 -75 -77 -40 -166 145 115 90 28 237 -161 -64 -119 -12 34 280 -60 112 -86 -73 -256 -189
5974 -189 -77 68 363 201 279 -169 8 -56 -170 -90 -90 155 -73 370 -120 -128 -111 -207 21 -142 177 109 -15
5997 -15 -271 -40 -19 -302 97 178 -103 67 149 74 -169 13 -30 26 -71 310 28 67 46 -67 -315 -191 -18
6020 -18 -76 198 180 227 -115 -15 -142 -253 -121 13 51 308 -35 -141 67 -477 -157 -185 20 306 151 106
6042 106 -105 -44 211 -103 -107 152 39 96 58 110 -167 -185 -79 125 79 416 15 31 -58 -143 -211 -27 -205 -25
6066 -25 153 253 129 71 98 -181 -28 39 -90 331 374 -70 312 -162 -199 64 232 234 -64 -178 113 -92 -58
6089 -58 -155 -314 111 26 246 46 320 -143 80 49 -192 35 -41 267 176 248 -39 -156 -210 -231 6 -104 192
6112 192 104 -344 53 -50 -383 -134 -210 5 -42 605 21 88 -117 -360 1 126 -38 251 107 -241 -124
6133 -124 -86 -136 -12 -96 384 -263 -29 -42 63 -232 -127 -71 -69 173 141 134 -179 104 55 -43 119 63 -129 153
6157 153 72 69 42 -108 -161 -116 263 118 88 314 -17 7 -157 -416 67 199 43 295 174 34 -133 -349 -179
6180 -179 -9 37 112 -137 23 353 -46 -37 -426 -209 -187 -208 310 241 4 -189 -218 -165 7 18 25 -26 88 59 4
6205 4 -153 -20 -99 -55 280 7 304 -12 -218 70 -39 -202 50 174 21 35 -144 -203 -88 -5 -134 -123 143
6228 143 -52 30 32 -19 -303 -39 -52 67 292 216 78 -33 -56 -95 -301 0 245 -91 214 -32 48 -152 -241
6251 -241 -343 -306 103 183 330 131 231 -161 -166 -296 -121 104 -73 320 128 34 -178 10 -36 -164 87 367
6273 367 228 86 143 2 -281 -159 28 232 267 215 -29 104 -172 76 -3 -219 -45 -76 252 78 -18 -388
6295 -388 -278 -40 -51 110 71 148 195 118 61 -332 -103 -169 17 85 -153 2 -205 -235 -84 -158 -381 -28 343
6318 343 310 221 -254 104 -17 -106 -40 -82 199 192 6 -101 -66 -211 -259 108 231 188 272 204 -8 -198 -186 -201 -98
6343 -98 98 166 -27 253 -42 -276 -193 -71 -74 -97 194 251 191 -97 -164 -243 -118 -87 132 -13 101 -17 -129 -3
6367 -3 -173 -34 -38 -6 231 172 113 -50 -114 -117 46 198 -18 165 203 102 221 27 -112 -62 72 179 -68 530
6391 530 94 81 -267 -193 -363 -167 133 109 235 74 -138 19 -256 -301 -67 53 251 -20 -194 22 -43 -155
6413 -155 -283 -118 128 -43 183 103 21 -223 -125 -17 132 -113 235 155 -50 -47 -146 -179 -53 -118 58 28 -19 34
6437 34 -132 -59 -6 134 21 119 86 206 -37 -221 -216 -263 -159 -15 125 161 274 288 211 -17 233 -19 -90 -12
6461 -12 236 99 171 -68 -122 -32 30 -17 44 80 -52 -145 -286 -166 -244 -173 -195 10 150 73 -56 -110 -83 -153 -119 -22
6487 -22 75 205 -88 -104 109 -254 -154 -184 -140 66 234 266 -139 26 -109 -360 -26 75 134 415 140 61 -41
6510 -41 -273 -93 -327 -100 161 2 85 -49 -136 -414 -53 -312 168 346 274 99 45 -84 -167 -192 -225 -3 33
6533 33 208 139 18 -66 -200 -53 -121 75 401 -25 99 80 -84 -230 -152 118 -145 102 -70 -14 76 116 -65
6556 -65 -125 -390 -58 -20 154 137 -259 14 -66 -382 44 205 -8 44 3 -77 -2 -196 -36 -89 263 -22 78
6579 78 37 25 104 -141 28 -90 -20 115 256 138 51 -260 120 -220 -9 115 -31 110 207 -5 -218 -360
6601 -360 -136 -198 -20 -128 148 217 58 -46 -239 33 -69 -59 -2 -96 14 157 -167 2 -6 -218 80 -59
6623 -59 31 347 -16 -89 -212 -105 -5 -13 148 384 5 -153 -147 -251 -10 -93 116 225 243 106 62 -314 -204
6646 -204 -73 -110 -5 184 476 -82 -229 -155 -174 -98 -56 125 147 145 236 -25 -194 -407 -361 36 145 105 298 143
6670 143 178 -92 -264 -96 -93 163 -31 51 94 92 -241 -178 71 -190 49 84 118 -63 172 -5 -147 -284 20
6693 20 129 -3 124 184 -20 -156 -141 -97 19 94 236 222 102 -89 -331 -191 65 -148 84 55 13 96 39
6716 39 -251 -184 -14 -229 11 200 295 176 -127 -397 -477 -153 -9 193 60 17 -11 121 -377 104 -105 -153
6738 -153 197 5 146 153 -7 -273 29 145 -133 70 142 156 -29 -188 -252 111 181 139 87 82 339 196 326
6761 326 -340 -24 -89 -150 225 134 55 75 43 -79 -131 -303 -4 -112 121 70 119 -272 -124 18 -341 47 225
6784 225 313 79 40 29 -214 -31 -104 75 235 159 80 331 -134 -384 -79 -289 34 229 43 102 50 -140 -243
6807 -243 -90 -236 11 132 188 111 -223 -50 -220 -149 -54 -332 49 -107 -21 -61 103 3 -108 -70 27 274 200
6830 200 188 315 -121 1 -187 -9 172 111 22 241 2 122 -198 -152 -51 11 345 58 217 31 -142 -307
6852 -307 -465 -105 -75 -175 24 -19 1 -78 -297 -300 -173 33 -30 247 -4 -36 -73 -236 -215 51 -57 51 158
6875 158 33 191 -216 -81 -124 -226 105 162 258 133 -19 206 -290 -231 -53 -1 125 135 153 43 -261 -117
6897 -117 116 -59 33 -6 133 26 75 -54 225 115 136 -120 23 -102 -55 36 -144 -81 -175 68 190 105 232
6920 232 125 3 -146 -97 8 -203 3 194 142 76 -237 -239 -43 -153 64 0 209 167 60 207 33 -221
6942 -221 -152 -128 238 -63 59 132 -139 -35 -74 3 -162 128 -49 -36 -62 -25 -314 36 -327 63 229 35 329
6965 329 105 -175 -82 53 -9 -8 201 9 130 287 41 -143 -303 -67 -23 267 37 130 156 247 -193 -196 -158 -234
6989 -234 248 219 42 183 308 -92 -229 -69 173 209 347 242 313 150 -356 -109 31 -105 186 112 170 163
7011 163 -105 19 -249 -185 249 -141 62 175 398 -74 -155 -243 -100 -83 142 120 114 68 74 -93 -28 -426 59 -11
7035 -11 128 246 288 -83 22 -203 -109 2 -137 202 364 -30 -73 -20 -186 -101 -85 136 268 239 179 -3 -314
7058 -314 -271 -401 2 130 116 282 -14 -32 -121 -230 -63 153 137 219 135 -235 -97 107 -195 4 -74 245 145
7081 145 -6 128 1 -147 122 -65 133 158 106 67 148 -1 -91 -7 -126 -94 31 178 -94 65 7 -152 -160
7104 -160 -130 -140 -315 4 45 -88 74 47 -172 -233 59 161 271 -167 -17 115 -51 -192 -230 -78 418 74
7126 74 -54 -64 36 -161 -121 -41 89 178 307 90 68 -123 -123 -82 -149 36 107 29 142 196 -230 -204 -23 -70 -7
7151 -7 -33 337 355 21 -112 -33 22 -14 -87 256 69 49 20 -135 -48 -123 -107 131 181 -33 -56 271 97 21 -145
7176 -145 -52 -22 154 -8 85 -73 57 -140 -118 -158 343 196 183 123 162 -14 -93 -150 -174 49 26 287 97 227
7200 227 98 -108 -86 7 136 198 157 184 -64 -92 -86 -70 130 -150 94 256 286 -89 -15 -177 -343 -50 -84 122
7224 122 214 175 87 88 -49 86 -154 56 250 15 164 -18 -109 -31 -25 -219 -146 180 272 176 6 2 -90 43 49 -3
7250 -3 100 188 100 -116 37 -166 173 -5 -48 -183 -51 -35 454 -202 -193 -124 129 279 42 234 170 34 -26 -79
7274 -79 -436 -198 4 9 73 43 169 63 61 -186 -198 -98 108 126 82 -42 -34 -149 -196 -96 131 -87 -30 172 25
7299 25 -54 -45 -249 -339 231 -117 244 121 43 34 -346 -69 136 185 287 261 -97 -47 35 -45 -204 -143 53 158 256
7324 256 -102 265 60 -134 -236 -109 -112 143 128 136 110 -137 -205 -352 122 -94 185 88 117 52 -98 -162 -223 -115
7348 -115 21 -80 4 21 -22 -72 -258 20 -264 112 17 74 76 164 -5 272 -129 -139 97 97 153 -94 160 -129
7372 -129 -240 162 100 -57 145 389 104 -21 -115 23 -289 -3 -80 73 -121 -411 196 34 -117 -213 159
7393 159 56 112 -64 63 -171 94 -85 -200 140 -54 138 -129 23 18 -62 -27 -341 -245 54 80 64 252 -379
7416 -379 61 -140 -255 -22 -26 -85 -173 -104 -163 -150 -5 -101 157 63 -32 163 271 99 -110 -277 -165 -16 -251
7439 -251 277 7 -60 80 -92 -245 17 213 178 -5 -76 107 6 45 -190 -48 152 148 43 -65 132 41
7461 41 -14 -184 -294 -14 27 87 61 164 -203 -65 -14 151 34 8 331 -27 -62 -77 13 38 -141 207 101 328
7485 328 363 -128 -88 49 -68 100 94 199 102 2 -147 77 62 -149 -82 199 177 16 -171 28 -186 -356 34
7508 34 -369 222 23 18 103 -4 97 -108 -4 72 218 36 222 180 8 -7 1 -209 60 -37 -72 289 158 -163
7532 -163 -185 -232 -103 -237 -313 271 -52 117 234 -174 -127 -247 -19 -8 252 80 -24 134 -134 -101 145 -124
7554 -124 30 -28 307 43 125 -1 -16 -175 56 77 208 266 294 108 -52 -122 -130 -153 -155 155 228 257 -224 13 -233
7579 -233 -168 50 104 -85 119 130 180 -164 -61 -99 -218 202 184 219 -141 -175 -135 -222 -71 -79 131 74 240 46
7603 46 -191 -7 6 -51 142 333 106 -110 180 34 -3 -10 -15 -54 102 150 149 12 291 107 -92 -254 -15 80
7627 80 385 -81 165 -125 -323 -85 -277 -131 -199 78 99 83 -28 -123 -78 -219 37 66 130 286 15 -130 59
7650 59 -179 -302 51 -116 -45 -25 191 52 -34 -163 -225 -290 94 72 143 -10 79 38 -88 -38 -359 81 133 91
7674 91 78 137 -177 -165 -228 137 -72 355 229 181 -4 -291 -213 -367 -97 130 118 -75 -46 -75 -242 42 -81
7697 -81 -65 -50 176 262 133 83 58 85 -184 -3 -167 -67 95 237 -194 -183 -65 -148 107 29 78 274 -50 -225
7721 -225 -43 -227 23 173 -2 -27 196 -46 22 -90 -235 77 -66 81 148 156 129 51 1 56 -119 382 -167
7744 -167 -54 98 285 -29 95 122 -185 -33 109 17 209 154 -56 41 -194 156 -74 154 11 24 16 82 -139
7767 -139 -10 -148 -157 -11 328 -21 -40 -206 -145 -7 -125 -103 89 132 90 227 45 -204 -141 -62 -224 81 134
7790 134 3 120 149 -167 -191 -184 208 113 74 189 8 214 107 109 -73 119 -42 188 -17 62 -153 97 -85
7813 -85 -205 -172 37 -189 5 109 107 47 69 -120 -10 -143 -178 180 150 -189 -19 -40 38 -116 -145 437 144 46
7837 46 -73 174 -273 -182 287 -13 4 -63 46 -1 -126 -220 -52 -34 246 129 -81 -109 -34 -205 -33 2 -42 8
7861 8 98 30 86 -225 -316 -204 -1 119 326 5 189 92 -77 -202 -72 -168 -10 96 -124 44 80 -43 -99
7884 -99 -168 17 140 -73 332 249 146 106 -211 -208 -60 301 131 105 76 -89 159 -91 -150 -5 79 200 335
7907 335 290 95 -46 -9 -186 2 59 -40 30 -7 -119 -131 190 -58 -19 157 196 -15 -30 1 107 -38 142 -73
7931 -73 214 208 42 32 -166 34 -7 -129 -256 223 -90 92 381 -80 -186 -47 91 119 109 -201 226 106
7953 106 -92 -227 -288 -186 73 -80 51 102 13 27 110 -111 -83 -30 200 335 77 233 -39 -81 76 56 -265
7976 -265 -18 -41 188 0 34 33 -103 -41 -201 76 125 167 120 31 39 -121 310 -9 -11 -34 264 97 -76 -3 -141
8001 -141 -54 158 9 122 39 265 24 -57 -190 -104 18 -236 410 90 -29 205 -76 -79 -60 114 186 21 -129
8024 -129 260 -274 -161 85 -236 23 -367 212 174 195 122 89 -197 0 157 -212 -88 -70 99 147 40 -175
8046 -175 -257 -170 -69 3 295 96 120 2 -118 193 -16 -23 -60 252 -131 57 -233 -223 -231 116 69 129 177 89 -3
8071 -3 -219 -10 -299 24 99 11 36 -67 -35 -45 185 -240 -203 -154 -35 55 12 93 -150 -2 -67 52 0 77 -119
8096 -119 -107 13 -4 -179 194 248 122 279 139 80 -172 -423 -24 113 -210 71 212 124 -43 -37 -37 -60 -2 -90
8120 -90 104 259 24 -61 294 95 -54 -105 53 38 257 76 -46 23 -326 -72 -24 183 81 193 135 219 -240
8143 -240 9 -185 116 42 52 -5 -237 143 42 -280 175 35 37 12 99 -129 247 1 73 147 23 -249 95
8166 95 115 -19 -31 -34 -170 -341 -208 -159 33 27 110 112 -165 -154 -182 39 -152 69 59 -268 13 -74 -382 -15 -79
8191g9
##END NTUPLES=NMR FID
##END=
