##TITLE=1H_SR94_oil
 d2O,8 sc, 
 26.10.2021
##JCAMPDX= 6.0         $$ Bruker NMR JCAMP-DX V2.0
##DATA TYPE= NMR FID
##DATA CLASS= NTUPLES
##ORIGIN= UXNMR, Bruker Analytische Messtechnik GmbH
##OWNER= root
$$ XWIN-NMR		Version 3.5
$$ Tue Oct 26 12:11:34 2021 Russian Standard Time (UT+4h)  she@DPX200
##.OBSERVE FREQUENCY= 200.1313468511
##.OBSERVE NUCLEUS= ^1H
##.DELAY= (6, 6)
##.ACQUISITION MODE= SIMULTANEOUS
##.ACQUISITION SCHEME= undefined
##.AVERAGES= 8
##.DIGITISER RES= 18
##SPECTROMETER/DATA SYSTEM= spect
##.PULSE SEQUENCE= zg30
##.SOLVENT NAME= D2O
##.SHIFT REFERENCE= (INTERNAL, D2O, 0, 15.7039)
##AUDIT TRAIL= $$ (NUMBER, WHEN, WHO, WHERE, WHAT)
$$ ##TITLE= Audit trail, XWIN-NMR		Version 3.5
$$ ##JCAMPDX= 5.01
$$ ##ORIGIN= Bruker BioSpin GmbH
$$ ##OWNER= she
$$ F:/spectra/data/she/nmr/H-F/1/audita.txt
$$ ##AUDIT TRAIL=  $$ (NUMBER, WHEN, WHO, WHERE, WHAT)
(   1,<2021-10-26 12:09:52.81 +0400>,<she>,<DPX200>,
      <created by zg, POWCHK disabled, PULCHK disabled
       configuration hash MD5:
       00 E9 B6 7A A2 85 ED C7 34 08 36 98 17 FE 4E 26
       data hash MD5: 16K
       2C E2 19 C6 3F 3E 70 DB D0 D7 C7 03 05 CB B7 6B>)
$$ ##END=
$$ 
$$ hash MD5
$$ 4E 99 21 03 67 47 65 76 CF DA 2C FC E9 DA 2B 04
##$RELAX= 
##$RELAX= 
##$RELAX= 
##$RELAX= 
##$RELAX= 
##$RELAX= 
$$ Bruker specific parameters
$$ --------------------------
##$DU= <F:/spectra>
##$EXPNO= 1
##$NAME= <H-F>
##$PROCNO= 1
##$TYPE= <nmr>
##$USER= <she>
##$AMP= (0..31)
100 100 100 100 100 100 100 100 100 100 100 100 100 100 100 100 100 100 
100 100 100 100 100 100 100 100 100 100 100 100 100 100 
##$AQSEQ= 0
##$AQ_mod= 1
##$AUNM= <au_zg>
##$AUTOPOS= <>
##$BF1= 200.13
##$BF2= 200.13
##$BF3= 200.13
##$BF4= 200.13
##$BF5= 200.13
##$BF6= 200.13
##$BF7= 200.13
##$BF8= 200.13
##$BYTORDA= 1
##$CFDGTYP= 0
##$CFRGTYP= 5
##$CHEMSTR= <none>
##$CNST= (0..31)
1 1 145 1 1 1 1 1 1 1 1 1 1 1 1 1 1 1 1 1 1 1 1 1 1 1 1 1 1 1 1 1 
##$CPDPRG= <>
##$CPDPRG1= <>
##$CPDPRG2= <>
##$CPDPRG3= <>
##$CPDPRG4= <mlev>
##$CPDPRG5= <mlev>
##$CPDPRG6= <mlev>
##$CPDPRG7= <mlev>
##$CPDPRG8= <mlev>
##$CPDPRGB= <>
##$CPDPRGT= <>
##$D= (0..31)
0 1.2 0 0 0 0 0 0 0 0.06 0 0.03 0 0 0 0 0.0002 0 0 0 0 0 0 0 0 0 0 0 0 
0 0 0 
##$DATE= 1635235792
##$DBL= (0..7)
120 120 120 120 120 120 120 120 
##$DBP= (0..7)
150 150 150 150 150 150 150 150 
##$DBP07= 0
##$DBPNAM0= <>
##$DBPNAM1= <>
##$DBPNAM2= <>
##$DBPNAM3= <>
##$DBPNAM4= <>
##$DBPNAM5= <>
##$DBPNAM6= <>
##$DBPNAM7= <>
##$DBPOAL= (0..7)
0.5 0.5 0.5 0.5 0.5 0.5 0.5 0.5 
##$DBPOFFS= (0..7)
0 0 0 0 0 0 0 0 
##$DE= 6
##$DECBNUC= <off>
##$DECIM= 32
##$DECNUC= <off>
##$DECSTAT= 4
##$DIGMOD= 1
##$DIGTYP= 9
##$DL= (0..7)
0 120 120 120 120 120 120 120 
##$DP= (0..7)
150 150 150 150 150 150 150 150 
##$DP07= 0
##$DPNAME0= <>
##$DPNAME1= <>
##$DPNAME2= <>
##$DPNAME3= <>
##$DPNAME4= <>
##$DPNAME5= <>
##$DPNAME6= <>
##$DPNAME7= <>
##$DPOAL= (0..7)
0.5 0.5 0.5 0.5 0.5 0.5 0.5 0.5 
##$DPOFFS= (0..7)
0 0 0 0 0 0 0 0 
##$DQDMODE= 0
##$DR= 18
##$DS= 0
##$DSLIST= <SSSSSSSSSSSSSSS>
$$ [...]
##$SUBNAM2= <"">
##$SUBNAM3= <"">
##$SUBNAM4= <"">
##$SUBNAM5= <"">
##$SUBNAM6= <"">
##$SUBNAM7= <"">
##$SUBNAM8= <"">
##$SUBNAM9= <"">
##$SW= 18.0517286264689
##$SWIBOX= (0..15)
0 0 2 0 0 0 0 0 0 0 0 0 0 0 0 0 
##$SW_h= 3612.71676300578
##$TD= 16384
##$TD0= 1
##$TE= 0
##$TE2= 300
##$TE3= 300
##$TEG= 300
##$TL= (0..7)
0 120 120 120 120 120 120 120 
##$TP= (0..7)
150 150 150 150 150 150 150 150 
##$TP07= 0
##$TPNAME0= <>
##$TPNAME1= <>
##$TPNAME2= <>
##$TPNAME3= <>
##$TPNAME4= <>
##$TPNAME5= <>
##$TPNAME6= <>
##$TPNAME7= <>
##$TPOAL= (0..7)
0.5 0.5 0.5 0.5 0.5 0.5 0.5 0.5 
##$TPOFFS= (0..7)
0 0 0 0 0 0 0 0 
##$TUNHIN= 0
##$TUNHOUT= 0
##$TUNXOUT= 0
##$USERA1= <user>
##$USERA2= <user>
##$USERA3= <user>
##$USERA4= <user>
##$USERA5= <user>
##$V9= 5
##$VALIST= <valist>
##$VCLIST= <CCCCCCCCCCCCCCC>
##$VD= 0
##$VDLIST= <DDDDDDDDDDDDDDD>
##$VPLIST= <PPPPPPPPPPPPPPP>
##$VTLIST= <TTTTTTTTTTTTTTT>
##$WBST= 1024
##$WBSW= 4
##$XGAIN= (0..3)
0 0 0 0 
##$XL= 0
##$YL= 0
##$YMAX_a= 585169
##$YMIN_a= -978846
##$ZGOPTNS= <>
##$ZL1= 120
##$ZL2= 120
##$ZL3= 120
##$ZL4= 120
##$ABSF1= 10
##$ABSF2= 0
##$ABSG= 5
##$ABSL= 3
##$ALPHA= 0
##$AQORDER= 0
##$ASSFAC= 0
##$ASSFACI= 0
##$ASSFACX= 0
##$ASSWID= 0
##$AUNMP= <proc_1d>
##$AZFE= 0.1
##$AZFW= 0.1
##$BCFW= 1
##$BC_mod= 2
##$BYTORDP= 1
##$COROFFS= 0
##$CY= 11.3945322036743
##$DATMOD= 1
##$DC= 2
##$DFILT= <>
##$DTYPP= 0
##$F1P= 2.36226072786647
##$F2P= -0.459571619588291
##$FCOR= 0.5
##$FTSIZE= 0
##$FT_mod= 4
##$GAMMA= 1
##$GB= 0.15
##$INTBC= 1
##$INTSCL= 1
##$ISEN= 128
##$LB= 0.24
##$LEV0= 0
##$LPBIN= 0
##$MAXI= 10000
##$MC2= 0
##$MEAN= 0
##$ME_mod= 0
##$MI= 1.114404
##$NCOEF= 0
##$NC_proc= 0
##$NLEV= 6
##$NOISF1= 3.799351
##$NOISF2= 2.8
##$NSP= 1
##$NTH_PI= 0
##$NZP= 0
##$OFFSET= 15.70392
##$PC= 1
##$PHC0= -15164.9
##$PHC1= 23.00083
##$PH_mod= 1
##$PKNL= yes
##$PPARMOD= 0
##$PSCAL= 0
##$PSIGN= 0
##$REVERSE= no
##$SF= 200.130013532006
##$SI= 16384
##$SIGF1= 3
##$SIGF2= 2
##$SINO= 400
##$SIOLD= 16384
##$SREGLST= <1H.CDCl3>
##$SSB= 0
##$STSI= 0
##$STSR= 0
##$SW_p= 3612.71676300578
##$SYMM= 0
##$S_DEV= 0
##$TDeff= 0
##$TDoff= 0
##$TI= <>
##$TILT= no
##$TM1= 0
##$TM2= 0
##$TOPLEV= 0
##$USERP1= <user>
##$USERP2= <user>
##$USERP3= <user>
##$USERP4= <user>
##$USERP5= <user>
##$WDW= 1
##$XDIM= 8192
##$YMAX_p= 0
##$YMIN_p= 0
$$ End of Bruker specific parameters
$$ ---------------------------------
##NTUPLES= NMR FID
##VAR_NAME=  TIME,          FID/REAL,        FID/IMAG
##SYMBOL=    X,             R,               I
##VAR_TYPE=  INDEPENDENT,   DEPENDENT,       DEPENDENT
##VAR_FORM=  AFFN,          ASDF,            ASDF
##VAR_DIM=   8192,          8192,            8192
##UNITS=     SECONDS,       ARBITRARY UNITS, ARBITRARY UNITS
##FACTOR=    0.0002768,     1,               1
##FIRST=     0,             0,               0
##LAST=      2.2672688,     0,               0
##MIN=       0,             -978846,         0
##MAX=       2.2672688,     585169,          0
$$ Real data points
##PAGE= N=1
##DATA TABLE= (X++(R..R)), XYDATA
$$ plain form
0 0 0 0 0 0 0 0 0 8 -8 8 -8 16 -16 24 -32 40 -48 56 -72 88 -104 120 -144 168 -200 236 -272 319 -366 422
30 422 -480 547 -623 706 -796 899 -1010 1131 -1266 1411 -1572 1746 -1937 2145 -2374 2625
46 2625 -2894 3193 -3519 3878 -4272 4705 -5187 5722 -6320 6996 -7762 8640 -9660 10857
60 10857 -12292 14043 -16241 19090 -22947 28493 -37191 52873 -90108 372469 -5392 -652134
72 -652134 -106910 -301589 -330822 188601 369754 139565 235325 12672 -195388 29986
82 29986 -89384 -512650 -112933 312132 139896 254463 431812 -133354 -401968 -134385
92 -134385 -306018 -339656 386938 585169 100565 18503 14614 -342613 -323985 -60171 -13359
103 -13359 178480 298592 -7726 22925 293835 -108538 -513834 -173889 28353 -59594
$$ packed form
0@%%%%%%%Qj6J6j6K4l2M0n6P2q8J04j28J60j92K24k64L12l68M36n08N91o85P88
30D22r02J027j170J329j502J695j909K141k397K677k983L318l683M082m519M999
46B625n519O087o712P397q150Q977r892J0909j2042J3316j4758J6402j8300K0517
60A0857k3149K6335l0284L5331m2037N1440o5684R0064j42981M62577l77861o46742
72f52134N45224j94679k9233N19423J81153k30189R5760k22653k08060K25374
82B9986j19370m23266L99717M25065j72236J14567J77349n65166k68614K67583
92a34385j71633l3638P26594J98231m84604q2062l889l57227J8628K63814M6812
103a3359J91839J20112l06318L0651K70910m02373m05296L39945K02242q7947
$$ plain form
113 -59594 269757 472642 105894 -113408 -176202 -393435 -236906 166368 147526 103685 289883
124 289883 132784 -157749 -117251 -153116 -261458 -21626 156117 73572 214974 301145 -58932
135 -58932 -268902 -149919 -185331 -162500 140211 269111 196998 174867 -19214 -281003 -212670
146 -212670 -80441 -97257 71079 280206 170055 33483 31117 -102360 -227144 -148878 -79016
157 -79016 3206 215882 270467 98540 -12423 -106496 -255527 -205703 -6067 82525 151187
168 151187 227508 119383 -49075 -101246 -167542 -213298 -68393 110885 159280 169513 131578
179 131578 -9798 -122493 -156785 -169999 -91054 69045 154837 172428 158074 26173 -153756
190 -153756 -200322 -141776 -65582 58844 172570 165697 91619 17218 -85301 -171761 -163423 -77103
$$ packed form
113e9594L29351K02885l66748k19302o2794k17233J56529M03274j8842m3841J86198
124B89883j57099k90533M0498l5865j08342K39832J77743q2545J41402Q6171l60077
135e8932k09970J18983l5412K2831L02711J28900p2113k2131j94081k61789O8333
146b12670J32229j6816J68336K09127j10151j36572k366j33477j24784P8266O9862
157g9016Q2222K12676N4585j71927j10963r4073j49031M9824J99636Q8592O8662
168A51187P6321j08125j68458n2171o6296m5756J44905J79278M8395J0233l7935
179A31578j41376j12695l4292j3214P8945J60099Q5792J7591j4354j31901j79929
190a53756m6566N8546P6194J24426J13726o873p4078p4401j02519q6460Q338Q6320
$$ plain form
202 -77103 42624 151670 181280 120078 13134 -104525 -178885 -150192 -52038 40825 122105
213 122105 174558 131729 7883 -103195 -155875 -149322 -75316 46271 142054 155833 100774
224 100774 16214 -75321 -145268 -152207 -80774 33760 127069 159199 123730 27473 -92821 -163991
236 -163991 -139582 -55384 32475 112621 154483 112596 13696 -74257 -128853 -140878 -83933 25390
248 25390 119523 148838 109906 26003 -67798 -136940 -145232 -72299 33502 103276 131492 120638
260 120638 40442 -76777 -139307 -124825 -71876 8875 103122 148254 109657 22853 -62708 -117451
272 -117451 -127902 -85225 8988 105372 136232 103081 39130 -48623 -130077 -137738 -67260 16926
284 16926 83262 128187 115973 36582 -57126 -113877 -121050 -81668 -2092 89815 136384 106247
$$ packed form
202g7103J19727J09046K9610o1202j06944j17659p4360K8693R8154R2863Q1280
213A22105N2453m2829j23846j11078n2680O553P4006J21587R5783J3779n5059
224A00774q4560r1535o9947o939P1433J14534R3309L2130l5469r6257j20294p1170
236a63991K4409Q4198Q7859Q0146M1862m1887r8900q7953n4596j2025N6945J09323
248B5390R4133K9315l8932q3903r3801o9142q292P2933J05801O9774K8216j0854
260A20638q0196j17219o2530J4482N2949Q0751R4247M5132l8597q6804q5561n4743
272a17451j0451M2677R4213R6384L0860l3151o3951q7753q1454p661P0478Q4186
284A6926O6336M4925j2214p9391r3708n6751p173L9382P9576R1907M6569l0137
$$ plain form
296 106247 30986 -44357 -104885 -129824 -84587 11141 86998 114522 105081 50534 -42486 -116218
308 -116218 -121772 -70897 -414 70939 121337 112479 40267 -46225 -100245 -112469 -82951 -8830
320 -8830 78940 120225 97840 40856 -28759 -96071 -122184 -80975 -319 69950 107639 104486
332 104486 50465 -35492 -100393 -109509 -72571 -12056 59571 111704 105063 43265 -29960 -85616
344 -85616 -110213 -85517 -10452 68862 104343 92572 48660 -18754 -86301 -112207 -77210 -9053
356 -9053 53026 95137 104052 56575 -28039 -88958 -98627 -73054 -22029 49514 102708 98074 45834
369 45834 -19538 -73030 -98903 -83071 -21796 54656 97125 89576 50392 -9978 -75207 -103432
381 -103432 -74846 -16942 42490 88585 95676 52696 -14398 -70251 -93877 -77193 -26741 41907
$$ packed form
296A06247p5261p5343o0528k4939M5237R5728P5857K7524r441n4547r3020p3732
308a16218n554N0875P0483P1353N0398q858p2212q6492n4020j2224K9518P4121
320h830Q7770M1285k2385n6984o9615o7312k6113M1209Q0656P0269L7689l153
332A04486n4021q5957o4901r116L6938O0515P1627N2133o641o1798p3225n5656
344h5616k4597K4696P5065P9314L5481j1771m3912o7414o7547k5906L4997O8157
356i053O2079M2111Q915m7477q4614o0919r669K5573N1025P1543N3194m634n2240
369D5834o5372n3492k5873J5832O1275P6452M2469p549l9184o0370o5229k8225
381a03432K8586N7904N9432M6095P091m2980o7094n5853k3626J6684N0452O8648
$$ plain form
393 41907 93113 92260 45542 -9918 -59067 -94600 -83674 -20303 45092 78077 84336 60154 -126
406 -126 -68721 -100419 -74104 -15999 36464 74060 89477 56141 -11500 -61393 -77321 -73609 -37160
419 -37160 31014 83083 88516 55212 -2100 -60122 -89665 -75921 -22986 37808 70829 77007
431 77007 59927 4179 -64082 -85894 -63606 -30555 21757 78626 85882 45463 -2066 -45081
443 -45081 -74958 -73867 -38891 21338 77586 86356 52470 6256 -51287 -95802 -72219 -10179
455 -10179 28045 55493 77850 52100 -2868 -39345 -64578 -73912 -39109 18016 62687 84673
467 84673 61127 310 -45853 -70630 -78936 -35908 34200 62898 65940 61536 9407 -58691 -71880
480 -71880 -53296 -32691 13994 61716 65356 47150 17121 -34720 -67372 -63262 -46463 2180
$$ packed form
393D1907N1206q53m6718n5460m9149l5533J0926O3371O5395L2985O259k4182o0280
406a26o8595l1698K6315N8105N2463L7596J5417l3336o7641m9893j5928L712L6449
419c7160O8174N2069N433l3304n7312n8022k9543J3744N2935O0794L3021O178
431G7007j7080n5748o8261k1812K2288L3051N2312N6869P256m0419m7529m3015
443d5081k9877J091L4976O0229N6248Q770l3886m6214n7543m4515K3583O2040
455a0179L8224K7448K2357k5750n4968l6477k5233r334L4803N7125M4671K1986
467H4673k3546o0817m6163k4777q306M3028P0108K8698L042m404n2129o8098j3189
480g1880J8584K0605M6685M7722L640j8206l0029n1841l2652M110J6799M8643
$$ plain form
492 2180 71220 84417 46054 11410 -34848 -83855 -69852 -15355 17771 47892 71520 46237
504 46237 3040 -24795 -58706 -70293 -30999 10297 39626 74319 65535 4171 -35946 -51981
516 -51981 -72435 -46305 22758 55902 57590 56032 17024 -40397 -60133 -58608 -40200 14461 55236
529 55236 51809 46811 27735 -32805 -65620 -47727 -35307 -11052 49492 74634 45280 15953
541 15953 -19126 -64617 -66335 -28979 5041 42737 66478 44061 12752 -11860 -57016 -74264
553 -74264 -27236 14302 28307 58201 63243 11075 -32859 -43322 -52757 -40581 2203 33872
565 33872 52565 60740 25305 -28783 -50552 -56750 -47195 4419 50766 51763 43320 24882 -24579
578 -24579 -56547 -44261 -29320 -10908 32352 59543 47196 20468 -15205 -48947 -52559 -35038
$$ packed form
492B180O9040J3197l8363l4644m6258m9007J4003N4497L3126L0121K3628k5283
504D6237m3197k7835l3911j1587L9294M1296K9329L4693q784o1364m0117j6035
516e1981k0454K6130O9063L3144J688j558l9008n7421j9736J525J8408N4661M0775
529E5236l427m998j9076o0540l2815J7893J2420K4255O0544K5142k9354k9327
541A5953l5079m5491j718L7356L4020L7696K3741k2417l1309k4612m5156j7248
553g4264M7028M1538J4005K9894N042n2168m3934j0463r435J2176M2784L1669
565C3872J8693Q175l5435n4088k1769o198R555N1614M6347R97q443j8438m9461
578b4579l1968J2286J4941J8412M3260K7191j2347k6728l5673l3742l612J7521
$$ plain form
590 -35038 -11606 31654 66220 50035 11794 -14273 -42626 -61027 -38171 5422 35742 49805
602 49805 42999 15459 -12663 -35353 -51230 -40579 -4714 28154 47372 51840 28221 -14909
614 -14909 -45995 -53463 -39668 -3649 36907 51607 38928 17304 -8728 -38614 -51430 -33191
626 -33191 -2275 23130 40598 45486 29355 -4775 -41566 -55934 -36092 -3461 23001 46244
638 46244 53514 22393 -20520 -37851 -41554 -36474 -6512 27706 39182 38804 27122 -6309 -36033
651 -36033 -42268 -36603 -14962 22607 44913 43952 30621 -5518 -45408 -46304 -28645 -13126 20831
664 20831 52887 39447 10843 -2877 -25820 -46155 -32647 -8036 12173 39306 46482 22854
676 22854 -1105 -26147 -52258 -40275 -2192 17671 34307 49884 25594 -14719 -27701 -35246
$$ packed form
590c5038K3432M3260L4566j6185l8241k6067k8353j8401K2856M3593L0320J4063
602D9805o806k7540k8122k2690j5877J0651L5865L2868J9218M468k3619m3130
614a4909l1086p468J3795L6019M0556J4700j2679k1624k6032k9886j2816J8239
626c3191L0916K5405J7468M888j6131l4130l6791j4368J9842L2631K6462K3243
638D6244P270l1121m2913j7331l703N080K9962L4218J1476l78j1682l3431k9724
651c6033o235N665K1641L7569K2306r61j3331l6139l9890q96J7659J5519L3957
664B0831L2056j3440k8604j3720k2943k0335J3508K4611K0209K7133P176k3628
676B2854k3959k5042k6111J1983L8083J9863J6636J5577k4290m0313j2982p545
$$ plain form
688 -35246 -41286 -11317 25023 33360 35790 28637 -3676 -29844 -34890 -36614 -17826 20465 36652
701 36652 34145 32448 4121 -37947 -42595 -26326 -16455 11937 43716 38969 17580 1088 -23759
714 -23759 -41203 -31110 -12878 8728 37036 41274 19237 2268 -18213 -44323 -37388 -6086
726 -6086 11340 26629 42559 28543 -4088 -23201 -33931 -36715 -14867 14432 30586 37283 26200
739 26200 -2112 -22260 -30758 -35524 -18114 15510 30904 29724 28005 8332 -25266 -38087 -28981
752 -28981 -14884 7435 30818 35987 24616 4045 -21116 -34508 -29640 -16177 5597 30980
764 30980 36710 21421 3998 -15479 -35153 -34039 -12188 8402 23385 34335 27498 4204 -18800
777 -18800 -32016 -31512 -15573 6595 24992 34580 26199 2562 -17806 -28292 -31069 -18551 7074
$$ packed form
688c5246o040K9969L6340Q337K430p153l2313k6168n046j724J8788L8291J6187
701C6652k507j697k8327m2068m648J6269R871K8392L1779m747k1389j6492k4847
714b3759j7444J0093J8232K1606K8308M238k2037j6969k0481k6110O935L1302
726f086J7426J5289J5930j4016l2631j9113j0730k784K1848K9299J6154O697j1083
739B6200k8312k0148q498m766J7410L3624J5394j180j719j9673l3598j2821R106
752b8981J4097K2319K3383N169j1371k0571k5161j3392M868J3463K1774K5383
764C0980N730j5289j7423j9477j9674J114K1851K0590J4983J0950o837k3294k3004
777a8800j3216N04J5939K2168J8397R588q381k3637k0368j0486k777J2518K5625
$$ plain form
790 7074 26668 31020 24515 7009 -16090 -31216 -29513 -15705 4710 23805 31524 24919 6714
803 6714 -15774 -29803 -28575 -16648 2664 23660 32327 23306 5510 -12814 -27676 -30643 -17034
816 -17034 4506 22743 29741 23722 7629 -12439 -27987 -29560 -15839 3343 19679 28860 25444
829 25444 7921 -13775 -26564 -27109 -16907 1673 20408 29445 23247 7208 -10842 -24542 -28263
842 -28263 -18175 2494 20508 27252 22905 9584 -10281 -26311 -27283 -15464 938 16798 27607
855 27607 24657 8209 -11329 -23389 -25636 -17429 -555 18462 28086 22062 7272 -7759 -21888
868 -21888 -28023 -17875 2062 17202 23791 22922 10949 -9391 -23927 -25116 -15283 -702 14648
881 14648 25123 24309 8883 -9994 -20674 -22843 -18581 -3014 17333 25830 20426 9239 -5209
$$ packed form
790G074J9594M352o505j7506k3099j5126J703J3808K0415J9095P719o605j8205
803F714k2488j4029J228J1927J9312K0996Q667r021j7796j8324j4862k967J3609
816a7034K1540J8237O998o019j6093k0068j5548j573J3721J9182J6336R181l416
829B5444j7523k1696j2789n45J0202J8580J8735R037o198j6039j8050j3700l721
842b8263J0088K0669J8014O744m347j3321j9865j6030r72J1819J6402J5860J0809
855B7607k950j6448j9538j2060k247Q207J6874J9017R624o024j4790j5031j4129
868b1888o135J0148J9937J5140O589q69j1973k0340j4536j189R833J4581J5350
881A4648J0475q14j5426j8877j0680k169M262J5567K0347Q497n404j1187j4448
$$ plain form
894 -5209 -21203 -26393 -16732 -245 14319 22834 21925 10898 -6706 -20892 -23871 -15569 -3274 12289
908 12289 25669 23033 7003 -6623 -15878 -24241 -19960 -997 15634 20849 19497 11904 -3535
921 -3535 -19418 -25406 -17088 -74 12565 18804 21688 13749 -6889 -20269 -19945 -15511 -6170 12129
935 12129 23965 19871 9678 -2867 -17771 -23144 -15177 -2830 9939 19985 20220 11659 -1931
948 -1931 -17891 -23814 -14258 -2985 6664 21264 25140 8434 -7708 -12731 -18970 -19138 -4167 11255
962 11255 18890 19775 10657 -3935 -13308 -19070 -19350 -4830 12244 16842 17752 15165 -2441 -18227
976 -18227 -18344 -15242 -7840 10667 21954 16029 9221 479 -14754 -20439 -13729 -6185 6589 19894
990 19894 17426 8877 2868 -12494 -24581 -15076 -1268 5001 15922 22537 10105 -3872 -11161
$$ packed form
894e209j5994n190R661J6487J4564Q515r09j1027j7604j4186k979Q302J2295J5563
908A2289J3380k636j6030j3626r255q363M281J8963J6631N215j352p593j5439
921c535j5883n988Q318J7014J2639O239K884p939k0638j3380L24M434R341J8299
935A2129J1836m094j0193j2545j4904n373P967J2347J2769J0046K35q561j3590
948a931j5960n923R556J1273R649J4600L876j6706j6142n023o239j68J4971J5422
962A1255P635Q85r118j4592r373n762k80J4520J7074M598R10k587j7606j5786
976a8227j17L102P402J8507J1287n925o808q742j5233n685O710P544J2774J3305
990A9894k468q549o009j5362j2087R505J3808O269J0921O615j2432j3977p289
$$ plain form
1003 -11161 -18764 -16826 -2797 6809 13404 20779 12383 -4142 -10315 -15318 -19777 -6870 10688 14774
1017 14774 15738 14603 -1184 -15279 -15270 -13944 -8255 7661 16082 14307 12683 2911 -13558 -17359 -12668
1032 -12668 -9279 3883 19538 17411 7806 2482 -9977 -20697 -14140 -3194 4102 14079 17411
1045 17411 9088 875 -7581 -17281 -15144 -4436 2379 10485 20212 14539 -1435 -9763 -15372 -17913
1059 -17913 -7172 7955 14331 15590 10876 -1357 -10919 -12700 -13112 -7697 4765 11399 13010 13163
1073 13163 4645 -9859 -15740 -13717 -9136 2346 15648 17592 10230 972 -9645 -16242 -13173 -5635
1087 -5635 3659 13115 14640 7849 1653 -5392 -13887 -14585 -6081 1750 9407 15898 13764 2669 -8392
1102 -8392 -14925 -15334 -7144 4241 12336 15183 10404 171 -7557 -11728 -13218 -8201 3249 10986
$$ packed form
1003a1161p603J938J4029R606O595P375q396j6525o173n003m459J2907J7558M086
1017A4774R64j135j5787j4095RJ326N689J5916Q421j775j624r772j6469l801M691
1032a2668L389J3162J5655k127r605n324j2459j0720O557J0946P296R977L332
1045A7411q323q213q456r700K137J0708O815Q106R727n673j5974q328n609k541
1059a7913J0741J5127O376J259m714j2233r562j781m12N415J2462O634J611J53
1073A3163q518j4504n881K023M581J1482J3302J944p362r258j0617o597L069P538
1087e635R294R456J525o791o196p045q495o98Q504P831P657O491k134j1095j1061
1102h392o533m09Q190J1385Q095K847m779j0233p728m171j490N017J1450P737
$$ plain form
1116 10986 12581 11535 4946 -7056 -14530 -13279 -6843 1643 10545 14573 11650 3023 -7712 -13247
1130 -13247 -12210 -7728 1163 11322 14163 9025 2577 -4974 -12878 -13855 -6531 2089 8868 13131 11885
1145 11885 3913 -6231 -13258 -12747 -6451 916 8498 14039 11326 1985 -5383 -10688 -13348 -9074 1773
1160 1773 10067 13184 10868 3616 -5537 -12037 -12857 -7063 2069 8136 11209 11516 4345 -6074 -10945
1175 -10945 -11132 -8317 -524 9689 13248 9858 3817 -4288 -11365 -12480 -7948 499 9272 11794 9393
1190 9393 4578 -3954 -12380 -11872 -5378 -130 6235 12378 10905 3251 -4009 -9623 -12008 -8045 -700
1205 -700 7498 12906 10621 2821 -3683 -9111 -12314 -8061 1290 7255 9924 10890 4844 -4697 -9527
1220 -9527 -10836 -7855 -538 6941 10664 10250 4192 -4020 -8781 -10291 -8371 -1276 7703 10971 9074
$$ packed form
1116A0986J595j046o589j2002p474J251O436Q486Q902M028k923q627j0735n535
1130a3247J037M482Q891J0159K841n138o448p551p904r77P324Q620O779M263j246
1145A1885p972j0144p027N11O296P367P582N541k713r341p368n305k660M274J0847
1160A773Q294L117k316p252r153o500q20N794R132O067L073L07p171j0419m871
1175a0945j87K815P793J0213L559l390o041q105p077j115M532Q447Q773K522k401
1190I393m815q532q426N08O494N248O365O143j473p654p260n614k385L963P345
1205g00Q198N408k285p800o504n428l203M253R351N965K669R66o046r541m830
1220i527j309K981P317P479L723m14o058q212m761j510J920P095Q979L268j897
$$ plain form
1235 9074 4922 -2265 -9953 -11239 -6730 -583 6219 10343 9593 4808 -2253 -9205 -10633 -7058 -1203
1250 -1203 5405 10910 10032 3759 -2806 -7864 -11045 -8071 -669 6208 9703 9343 4748 -2215 -8147
1265 -8147 -10467 -7542 -768 5390 8962 9324 5133 -2522 -8475 -9423 -7396 -2093 5249 9891 9151 4595
1281 4595 -2050 -7496 -10020 -7474 -1608 5354 9006 8615 5144 -1441 -7608 -10173 -6878 -1171 4165
1296 4165 8668 9420 5017 -2349 -7180 -8861 -7126 -2442 4588 9213 8778 4175 -1245 -6171 -8993
1311 -8993 -7803 -1912 4700 7898 8097 5191 -815 -7262 -9077 -6663 -1795 3306 8099 9173 4767
1326 4767 -1342 -5962 -8139 -7364 -2780 4196 8494 7835 4346 -175 -5589 -9221 -7249 -1614 3914
1341 3914 6863 7921 5601 -714 -6528 -8325 -6277 -2418 2764 7503 8543 4721 -1028 -5438 -7857
$$ packed form
1235I074m152p187p688j286M509O147O802M124p50m785p061o952j428L575N855
1250a203O608N505q78o273o565n058l181K974P402O877L495l60m595o963n932
1265h147k320K925O774O158L572L62m191p655n953r48K027N303P342M642p40m556
1281D595o645n446k524K546N866O962L652l91l471o585o167k565L295N707N336
1296D165M503P52m403p366m831j681J735M684P030M625m35m603n420m926k822
1311h993J190N891O612L198J99k906o006o447j815K414M868N101M793J074m406
1326D767o109m620k177P75M584O976M298o59l489m521n414l632J972N635N528
1341C914K949J058k320o315n814j797K048L859N182M739J040l822n749m410k419
$$ plain form
1356 -7857 -7241 -2622 3693 7781 7183 4770 175 -5279 -8460 -6873 -1841 2873 6739 8159 5715
1371 5715 -692 -5572 -7528 -6308 -3054 2534 7420 7772 4094 -236 -4358 -7641 -7218 -2475 3304
1386 3304 6429 6803 5279 510 -4940 -7784 -6426 -2341 2187 6268 8051 5392 -507 -4906 -6482
1401 -6482 -6556 -3384 2365 6737 7020 4352 732 -4183 -7429 -6999 -2506 2270 5981 7137 5208 779
1417 779 -4521 -6845 -6146 -2619 1466 5875 7499 4642 35 -3484 -6299 -6843 -3267 2207 5848 6590
1433 6590 5093 859 -3711 -6831 -6729 -2539 2204 5311 6452 5067 627 -4442 -5794 -5335 -3480
1448 -3480 1398 5553 6350 4822 1330 -3550 -6778 -6138 -3280 1116 5592 6865 4175 990 -3370
1463 -3370 -6397 -5891 -2423 917 4297 6699 4659 570 -2826 -5427 -6165 -3219 840 4366 6779
$$ packed form
1356g857O16M619O315M088n98k413m595n454l181J587N032M714L866J420k444
1371E715o407m880j956J220L254N588M886L52l678m330m122l283M23M743N779
1386C304L125L74j524m769n450k844J358M085M528M081J783k659n899m399j576
1401f482p4L172N749M372K83k668l620m915l246M30M493M776L711J156j929m429
1417G79n300k324O99L527M085M409J624k857m607l519k815n44L576N474L641P42
1433F590j497m234m570l120J02M190M743L107J141j385m440n069j352M59J855
1448c480M878M155P97j528l492m880l228O40K858M396M476J273k690l185m360
1463c370l027N06L468L340L380K402k040m089l396k601p38K946M059L526K413
$$ plain form
1478 6779 5440 463 -3565 -5033 -6397 -3686 2291 5216 5093 4745 1378 -3327 -5097 -4985 -3529 583
1494 583 4602 5263 4797 2406 -3091 -6068 -4838 -3445 -47 5186 6781 3578 1072 -1882 -6091 -6071
1510 -6071 -2293 585 3604 5839 4219 1199 -1713 -5074 -6205 -2701 590 3125 6028 5867 500
1525 500 -3089 -4302 -5685 -4068 1510 4337 4511 4529 1968 -2603 -4416 -4978 -4150 261 4019 4706 4856
1542 4856 2908 -2710 -5936 -4244 -2547 -651 4097 5993 3530 1185 -1140 -4542 -5452 -3085 -356
1557 -356 2930 5655 4374 1254 -1054 -4670 -6269 -2621 1184 2376 4913 5683 1253 -2859 -3187 -4254
1573 -4254 -3833 402 3744 3987 3995 2362 -1855 -3821 -4470 -4420 -494 4424 4835 3365 2826 -1599 -6159
1590 -6159 -4098 -1636 -1108 2387 5705 3429 1012 -247 -3989 -5100 -2674 -609 1764 5471 4885
$$ packed form
1478F779j339m977m028j468j364K711N977K925j23l48l367m705j770J12J456M112
1494E83M019O61m66k391n497k977J230J393L398N233J595l203k506k954m209K0
1510f071L778K878L019K235j620l020k912l361j131L504L291K535K903j61n367
1525E00l589j213j383J617N578K827J74J8k561m571j813n62Q28M411L758O87J50
1542D856j948n618l226J692J697J896M748J896k463k345k325l402r10K367K729
1557c56L286K725j281l120k308l616j599L648L805J192K537P70m430m112l28j067
1573d254M21M235L342K43Qj633m217j966o49N0L926M918M11j470n39m425m560
1590f159K061K462N28L495L318k276k417j259l742j111K426K065K373L707n86
$$ plain form
1605 4885 644 -911 -2918 -6185 -3444 949 1910 3652 5491 1556 -2927 -2849 -3830 -3944 -160 3256
1621 3256 3283 4205 2896 -1729 -3737 -3605 -4325 -1609 4159 4441 2635 2902 -460 -5099 -4190 -2256 -1258
1638 -1258 1936 5084 3354 1699 26 -3782 -5065 -2078 -391 1252 5087 4287 880 -522 -2334
1653 -2334 -5465 -3352 800 1408 3193 5129 2103 -1937 -2714 -4027 -3861 -104 2673 2837 4060 2906
1669 2906 -1748 -3532 -3030 -3348 -1255 2941 3742 2895 2657 -356 -3689 -3643 -2714 -1763 1791 4539 3301
1686 3301 1993 358 -3544 -4823 -2487 -465 1174 3937 4285 1274 -345 -2248 -4033 -3129 -472
1701 -472 1685 3328 4007 1934 -746 -1645 -3673 -3903 -664 2094 2687 3425 2808 -526 -3216 -3318 -3045
1718 -3045 -1386 1953 3727 2959 2206 -67 -2944 -3330 -2704 -1457 1655 3708 3210 1920 500 -2428
$$ packed form
1605D885m241j555k007l267K741M393R61J742J839l935m483P8r81j14L784L416
1621C256K7R22j309m625k008J32p20K716N768K82j806K67l362m639R09J934R98
1638a258L194L148j730j655j673l808j283K987J687J643L835q00l407j402j812
1653b334l131K113M152O08J785J936l026m040p77j313J66L757K777J64J223j154
1669B906m654j784N02l18K093M196Q01q47k38l013l333M6R29R51L554K748j238
1686C301j308j635l902j279K336K022J639K763L48l011j619j903j785R04K657
1701d72K157J643O79k073k680q99k028k30L239K758N93P38o17l334k690j02K73
1718c045J659L339J774p68p53k273k877l86O26J247L112K053m98j290j420k928
$$ plain form
1734 -2428 -4037 -2805 -643 1319 2975 4074 1983 -346 -2196 -3480 -3004 -868 1053 3025 3934
1749 3934 1924 -613 -1940 -3077 -3156 -1090 2018 2620 3032 2344 271 -2530 -3557 -2791 -1205 926
1765 926 2809 3559 2292 83 -2403 -2938 -2287 -1651 884 3324 3029 1754 412 -1914 -3577 -2918 -892
1782 -892 1124 2449 3172 2369 220 -2270 -3436 -2643 -1183 747 2451 3332 2259 -302 -1597 -2604
1798 -2604 -3037 -1342 903 2596 2915 2154 223 -1574 -3193 -2863 -1093 1114 2358 2690 2449 23
1814 23 -1843 -2868 -2300 -1350 733 2698 3050 1958 184 -1498 -2745 -2934 -1469 1037 2214 2760 1897
1831 1897 512 -1568 -3130 -2714 -953 682 2353 2867 2312 140 -2025 -2563 -2709 -1348 576 2213
1847 2213 3048 1875 440 -1201 -2516 -2841 -1202 937 1849 2614 2261 578 -1528 -2897 -2440 -1088
$$ packed form
1734b428j609J232K162J962J656J099k091k329j850j284M76K136J921J972R09
1749C934k010k537j327j137p9K066L108O02M12o88k073k801j027P66J586K131
1765I26J883P50j267k209k486n35O51O36K535K440k95j275j342k326j663O59K026
1782h92K016J325P23q03k149k490j166P93J460J930J704Q81j073k561j295j007
1798b604m33J695K245J693L19p61j931j797j619L30J770K207J244L32k41k426
1814B3j866j025N68R50K083J965L52j092j774j682j247j89J465K506J177N46q63
1831A897j385k080j562M16J761J635J671N14n55k172k165n38j46J361J924J637
1847B213Q35j173j435j641j315l25J639K139R12P65l53j683k106j369M57J352
$$ plain form
1863 -1088 430 2132 2904 1984 427 -1289 -2334 -2816 -1607 360 2342 2664 2062 546 -1153 -2438
1879 -2438 -2356 -1214 403 1847 2541 2357 658 -1277 -2280 -2337 -1382 236 1851 2695 1851 323 -1109
1896 -1109 -2234 -2643 -1366 236 2031 2391 1962 570 -1061 -2424 -2400 -1528 507 2007 2236 2197 647
1913 647 -1229 -2312 -2093 -1368 148 1767 2442 1942 821 -1056 -2323 -2610 -1492 -104 1613 2290 1780
1930 1780 1071 -788 -2419 -2561 -1182 128 1332 2262 2019 682 -1113 -2368 -2206 -1331 290 1535
1946 1535 2388 1886 694 -1076 -1956 -2150 -1512 350 1444 1919 1892 808 -729 -2227 -2217 -1274 -206 1483
1964 1483 2241 1981 952 -1048 -1933 -2107 -1653 -213 1514 2252 1610 657 -374 -1632 -2339 -1407 -63
1981 -63 1463 2043 1724 654 -571 -2059 -2366 -1204 -111 974 2260 2240 199 -830 -1387 -2074 -1532
$$ packed form
1863a088J518J702P72r20j557j716j045m82J209J967J982L22o02j516j699j285
1879b438Q2J142J617J444O94j84j699j935j003n7R55J618J615Q44q44j528j432
1896a109j125m09J277J602J795L60m29j392j631j363K4Q72K035J500K29l9j550
1913F47j876j083K19P25J516J619O75n00j121j877j267k87J118J388J717O77n10
1930A780p09j859j631j42J379J310J204R30k43j337j795j255J62Q75J621J245
1946A535Q53n02j192j770q80j94O38J862J094M75k7j084j537j498J0R43J068J689
1964A483P58k60j029k000q85j74M54J440J727P38o42r53j031j258p07R32J344
1981f3J526N80l19j070j225j488l07J162J093J085J286k0k041j029n57o87N42
$$ plain form
1998 -1532 -130 1614 1676 1806 989 -734 -1530 -2231 -1595 15 1270 2028 2084 1001 -681 -1972 -1912 -1275
2016 -1275 -307 1350 2124 1367 824 -394 -1546 -2205 -1488 -109 1057 1982 1725 1021 -350 -1911 -1919 -965
2034 -965 -112 610 2158 2091 466 -561 -1344 -2042 -1557 -15 1159 1838 2068 756 -574 -1235 -1997 -1726
2052 -1726 -348 1088 1543 1774 986 -307 -1610 -1715 -1344 -557 929 1890 1821 803 -239 -1533 -1934
2069 -1934 -1411 -470 1167 1874 1640 753 -163 -1302 -1917 -1221 -88 484 1364 1899 840 -459 -1003 -1926
2087 -1926 -1634 -209 909 1587 1744 1261 -622 -1229 -1365 -1325 -415 1161 1595 1229 1106 99 -1421 -1631
2105 -1631 -1036 -657 571 1780 1236 931 29 -1397 -2024 -1310 -341 537 1576 1621 528 -41 -776 -1974
2123 -1974 -1230 95 554 1255 1718 640 -420 -500 -1372 -1494 -186 502 1216 1927 1214 -375 -1367 -1385 -1747
$$ packed form
1998a532J402J744O2J30q17j723p96p01O36J610J255P58N6j083j682j291O0O37
2016a275R68J657P74p57n43j218j152o59P17J379J166R25k57p04j371j561qR54
2034i65Q53P22J548o7j625j027p83o98M85J542J174O79K30j312j330o61p62K71
2052a726J378J436M55K31p88j293j303j05L71P87J486R61o9j018j042j294m01
2069a934N23R41J637P07k34q87r16j139o15O96J133N72Q80N35j059j299n44r23
2087a926K92J425J118O78J57m83j883o07j36M0R10J576M34l66j23j007j520k10
2105a631N95L79J228J209n44l05r02j426o27P14R69Q78J039M5j093n69p35j198
2123a974P44J325M59P01M63j078j060q0q72j22J308O88P14P11p13j589r92j8l62
$$ plain form
2142 -1747 -892 773 1323 1299 1124 233 -886 -1204 -1158 -820 703 1534 1183 1004 399 -1126 -1553 -818 -454
2161 -454 277 1458 1573 744 29 -717 -1471 -1259 19 437 1378 1749 667 -143 -433 -1243 -1419 -316 618
2180 618 1053 1509 1306 18 -874 -1409 -1133 -430 513 1587 1647 1198 93 -786 -1016 -1446 -866 309 1569
2199 1569 1138 431 130 -849 -1330 -1197 -463 232 1242 1285 665 0 -838 -1429 -1250 -724 375 1320 1343 1046
2219 1046 17 -539 -1086 -1468 -430 611 918 1017 1180 257 -847 -1386 -1150 -465 377 842 1272 885 -18
2238 -18 -584 -1012 -1069 -606 324 1135 1302 581 212 -502 -1239 -1194 -252 193 1020 1102 969 103 -751 -1240 -920
2259 -920 -511 15 978 1433 1036 184 -446 -967 -1277 -712 437 816 1077 1103 220 -987 -915 -1006 -386 179
2279 179 937 926 1102 -45 -638 -957 -942 -669 -82 1051 1187 715 178 -324 -1106 -1178 -508 303 914 1082
$$ packed form
2142a747Q55J665N50k4j75q91j119l18M6L38J523Q31l51j79o05j525m27P35L64
2161d54P31J181J15q29p15p46p54K12J278M18R41L71j082q10k90q10j76J103R34
2180F18M35M56k03j288q92n35K76P03R43J074O0m49j105q79k30m30N80J175J260
2199A569m31p07l01r79m81J33P34O95J010M3o20o65q38n91J79N26J099R45K3k97
2219A046j029n56n47l82J038J041L07R9J63r23j104n39K36O85Q42M65M30l87r03
2238a8n66m28n7M63R30Q11J67p21l69p14p37M5R42M45Q27Q2j33q66q54m89L20
2259i20M09N26R63M55l97q52o30n21l10N65J149L79K61K6q83j207P2r1O20N65
2279A79P58j1J76j147n93l19J5K73N87J133J36m72n37n02p82p2O70Q11O11J68
$$ plain form
2299 1082 783 315 -404 -1049 -1017 -315 118 701 1075 957 190 -495 -969 -1437 -720 194 987 1092 879 285
2319 285 -663 -1214 -1205 -487 548 839 979 800 407 -328 -1251 -1003 -722 274 674 1166 742 224 -584 -1210
2339 -1210 -1073 -463 -49 838 1256 925 441 -445 -890 -807 -653 -22 749 1050 1129 415 -454 -1061 -1036 -688 -97
2360 -97 515 1040 1214 357 -433 -821 -801 -629 -154 1000 1089 751 394 -349 -758 -791 -582 10 659 938 838
2381 838 336 -339 -853 -825 -542 -52 468 900 748 182 -436 -534 -897 -669 275 770 803 449 427 -182 -941
2402 -941 -914 -381 -10 395 708 848 363 -230 -879 -596 -608 -155 831 1009 862 392 -82 -961 -798 -678 -86
2423 -86 524 819 783 445 -122 -954 -973 -642 -222 487 1077 852 678 -273 -706 -1137 -869 -182 427 1038 747
2444 747 386 -98 -483 -991 -732 -237 451 607 833 449 -364 -640 -541 -625 -211 566 742 988 241 -87 -691
$$ packed form
2299A082k99m68p19o45L2P02M33N83L74j18p67o85m74m68P17R14P93J05k13n94
2319B85r48n51RP18J035K91J40j79l93p35r23K48K81R96M00M92m24n18q08o26
2339a210J37O10M14Q87M18l31m84q86m45Q3J54O31P71L01P9p14q69o07K5L48N91
2360i7O12N25J74q57p90l88K0J72M75J154Q9l38l57p43m09l3K09N92O49K79j00
2381H38n02o75n14K8K83M90N20M32j52n66o18r8l63K28R44M95L3l54k2o09p59
2402i41K7N33L71M05L13J40m85n93o49K83j2M53R86J78j47m70m74q79J63J20N92
2423h6O10K95l6l38n67q32j9L31M20P09N90k25j74r51m33m31K68O87O09O11k91
2444G47l61m84l85n08K59M95O88J56K26l84q13k76R9q4M14P77J76K46p47l28o04
$$ plain form
2465 -691 -844 -633 -373 550 891 576 642 48 -807 -1077 -605 -94 345 789 1139 154 -125 -465 -648 -674 -40
2486 -40 286 855 580 303 37 -574 -669 -750 -64 426 724 766 519 -351 -706 -705 -514 -267 366 818 641 471
2508 471 5 -519 -613 -428 -496 265 654 739 212 190 -596 -667 -511 87 70 842 825 202 -143 -329 -622 -659 -330
2531 -330 418 666 786 546 -130 -528 -672 -786 -42 647 699 859 338 -107 -719 -644 -754 -339 408 676 649
2552 649 666 72 -539 -789 -589 -372 322 598 544 463 -115 -331 -562 -552 -590 171 669 453 382 82 -465 -714
2574 -714 -571 -130 226 591 773 319 -194 -254 -585 -721 -220 228 647 648 613 161 -261 -463 -784 -175 238
2595 238 741 432 553 -63 -623 -765 -696 -345 -96 364 938 642 99 -484 -281 -335 -240 33 941 566 358
2616 358 99 -200 -690 -824 42 65 722 442 429 14 -411 -382 -576 -266 180 659 741 306 30 -248 -478
$$ packed form
2465f91j53K11K60R23L41l15O6n94q55k70M72N11M39M44L50r85k79l40j83k6O34
2486d0L26N69k75k77k66o11r5q1O86M90K98M2k47q70l55JJ91K47O33M52j77j70
2508D71m66n24r4J85o8P61L89Q5n27k2p86p1J56N98j7P72j7o23l45j86k93l7L29
2531c30P48K48J20k40o76l98j44j14P44O89N2J60n21m45o12P5j10M15P47K68k7
2552F49J7n94o11k50K00K17O94K76n4q1n78k16k31J0l8P61M98k16p1l00n47k49
2574g14J43M41L56L65J82m54n13o0l31j36N01M48M19Jl5m52m22k02l21O09M13
2595B38N03l09J21o16n60j42O9L51K49M60N74k96n43n83K03n4R5K73R08l75k08
2616C58k59k99m90j34Q66K3O57k80j3m15m25K9j94L10M46M79Q2m35k76k78k30
$$ plain form
2637 -478 -575 -385 164 576 554 377 42 -389 -487 -505 -297 24 228 393 405 7 -328 -909 -531 -364 15 546
2659 546 758 354 124 -234 -580 -573 -516 126 459 608 462 347 -346 -617 -434 -323 254 295 428 818 46
2680 46 -238 -422 -349 -279 91 542 439 427 180 -319 -643 -683 -335 -100 420 624 679 175 -382 -437 -311 -373 -177
2703 -177 358 630 247 225 -92 -593 -613 -240 310 440 533 404 -8 -117 -870 -654 -353 -70 276 572 447
2724 447 -68 -166 -664 -547 -40 194 223 483 534 403 -343 -194 -254 -629 67 452 295 379 67 -163 -418 -538
2746 -538 -442 295 435 351 576 524 -71 -518 -387 -256 -28 322 329 240 117 -389 -697 -455 -353 -129 383 449
2768 449 306 166 -316 -318 -519 -535 -96 272 499 340 194 4 -539 -705 -8 -171 296 471 505 165 -202
2789 -202 -13 -258 -535 0 376 500 327 146 -324 -360 -519 -378 -157 436 399 206 428 35 -492 -386 -88
$$ packed form
2637d78r7J90N49M12k2j77l35m31r8j8K08L21K04J65J2l98l35n81L78J67L79N31
2659E46K12m04k30l58l46PN7O42L33J49j46j15o93k71J83J11N77M1J33L90p72
2680D6k84j84P3P0L70M51j03j2k47m99l24m0L48K35N20K04N5n04n57n5J26o2J96
2703a77N35K72l83k2l17n01k0L73N50J30R3j29m12j09p53K16L01K83L46K96j25
2724D47n15r8m98J17N07K34K9K60N1j31p46J49o0l75O96L85j57Q4l12k30k55j20
2746e38R6P37J40q4K25n2n95m47J31J31K28L50Pq9j23n06l08K42J02K24N12O6
2768D49j43j40m82kk01j6M39L68K27j59j46j90n43j66O97j63M67J75L4l40l67
2789b02J89k45k77N35L76J24j73j81m70l6j59J41K21N93l7j93K22l93n27J06K98
$$ plain form
2810 -88 -5 124 420 321 304 34 -643 -566 -507 265 200 324 242 142 14 -362 -675 -163 85 39 293 532 264
2833 264 -49 -238 -338 -536 -20 66 303 393 97 223 -263 -395 -705 -70 311 268 304 172 -113 -460 -637
2854 -637 -297 -246 305 433 276 -7 -292 -209 -396 -480 -113 -40 421 331 94 -365 -586 -549 -386 -48 196 341
2876 341 574 144 -209 -330 -221 -153 -302 376 281 422 272 21 -353 -357 -535 -246 132 410 417 141 -231 -315
2898 -315 -445 -263 81 154 250 605 342 -207 -286 -460 -286 -184 157 237 367 344 86 -51 -333 -378 -137 170
2920 170 327 487 127 -124 -241 -165 -66 -126 4 435 508 153 -139 -383 -229 -191 -59 248 181 289 219 148 -207
2943 -207 -372 -101 -289 156 228 216 196 32 -42 -352 -326 -283 139 204 452 456 -154 -292 -144 -336 162 -29 421
2966 421 379 43 -258 -219 -596 -232 -183 316 349 204 186 -22 -251 -95 -191 -29 52 390 317 304 -65 -161 -277
$$ packed form
2810h8Q3J29K96r9j7k70o77P7N9P72o5J24q2j00j28l76l13N12K48m6K54K39k68
2833B64l13j89j00j98N16Q6K37R0k96J26m86j32l10O35L81m3L6j32k85l47j77
2854f37L40N1N51J28j57k83k85Q3j87q4L67P3M61r0k37m59k21L7J63L38K44J45
2876C41K33m30l53j21J09O8j49O78r5J41j50k51l74mj78K89L78K78Pk76l72q4
2898c15j30J82L44P3R6L55k63n49p9j74J74J02L41Q0J30k3k58j37k82m5K41L07
2920A70J57J60l60k51j17P6R9o0J30M31P3l55k92k44J54L8J32L07o7J08p0p1l55
2943b07j65K71j88M45P2j2k0j64p4l10K6M3M22O5K48Mo10j38J48j92M98j91M50
2966D21m2l36l01L9l77L64M9M99L3j45j8k08k29J56r6J62Q1L38p3j3l69r6j16
$$ plain form
2989 -277 -71 -98 -210 300 264 249 -29 -36 -395 -579 -182 40 2 394 214 -60 -214 -189 -363 -351 -63 268 321
3012 321 307 -58 -27 -232 -236 -59 132 -143 212 383 97 -85 -290 -290 -215 123 362 530 322 72 -109 -391
3034 -391 -130 -132 -31 412 275 56 -79 61 -153 -379 -159 182 -6 383 355 -60 -8 122 -286 -143 164
3055 164 229 241 282 -55 -259 -204 -152 -344 65 206 195 284 8 -76 -626 -128 -303 122 30 428 238 -65 -96
3078 -96 -216 -340 -327 11 340 351 -51 180 -171 -363 -161 -167 -9 160 173 384 -72 29 -254 -346 -34 50 101
3101 101 230 139 201 -188 -194 -198 -41 54 166 315 108 73 69 -288 -396 -124 -18 73 357 225 -122 -227 -171 -224
3125 -224 -94 -51 216 202 177 4 -198 -214 -111 -100 -7 34 -46 209 387 -155 14 -112 -324 175 84 252 286
3148 286 55 132 -461 -259 -297 -217 114 179 148 159 60 -360 -498 -209 -37 -39 409 1 230 95 -112 35 -85
$$ packed form
2989b77K06k7j12N10l6j5k78pl59j84L97K22l8L92j80k74j54K5j74J2K88L31N3
3012C21j4l65L1k05mJ77J91k75L55J71k86j82k05%P5L38K39J68k08k50j81k82
3034c91K61kJ01M43j37k19j35J40k14k26K20L41j88L89k8m15N2J30m08J43L07
3055A64O5J2M1l37k04N5N2j92M09J41j1Q9k76q4n50M98j75M25r2L98j90l03l1
3078i6j20j24J3L38L29J1m02K31l51j92K02oJ58J69J3K11m56J01k83r2L12Q4N1
3101A01J29r1O2l89omJ57R5J12J49k07l5ml57j08K72J06R1K84j32l47j05N6n3
3125b24J30M3K67j4k5j73k02j6J03J1R3M1q0K55J78n42J69j26k12M99r1J68L4
3148B86k31P7n93K02l8Q0L31O5l1J1r9m20j38K89J72kM48m08K29j35k07J47j20
$$ plain form
3171 -85 -275 215 410 257 -91 9 -337 -257 -112 -89 35 372 442 -133 112 -148 -286 -204 -192 234 -153 208
3193 208 160 -75 -175 -309 -510 -190 230 247 -29 238 48 -47 -259 -337 -119 112 322 -129 126 13 -156
3214 -156 -197 -117 132 -173 154 70 32 96 -20 -251 27 103 34 14 130 45 -104 -525 -387 -161 -195 -321 207
3237 207 455 -183 -57 -98 -405 -317 109 -62 304 86 83 72 24 -99 34 77 42 367 166 55 -131 -192 -198 -274
3261 -274 -82 231 197 195 27 207 -291 -228 154 -90 159 140 67 22 -21 -330 -131 -219 95 115 146 287 213 -3
3285 -3 -175 -296 -65 8 41 -141 236 187 -216 -127 -279 -163 38 279 491 307 212 23 -145 -371 -309 -58 59
3308 59 12 70 71 7 -173 -356 -44 162 -51 310 199 279 107 -89 -153 -53 5 -60 295 120 172 38 -10 -347
3332 -347 -258 47 127 56 205 176 -87 -2 -231 -61 3 75 306 292 -35 -39 -93 -250 -169 -79 30 -38 418 39 41
$$ packed form
3171h5j90M90J95j53l48J00l46Q0J45K3J24L37P0n75K45k60j38Q2J2M26l87L61
3193B08m8k35j00j34k01L20M20J7k76K67j90r5k12p8K18K31K10m51K55j13j69
3214a56m1Q0K49l05L27q4l8O4j16k31K78P6o9k0J16q5j49m21J38K26l4j26N28
3237B07K48o38J26m1l07Q8M26j71L66k18lj1m8j23J33M3l5L25k01j11j86o1op6
3261b74J92L13l4kj68J80m98O3L82k44K49j9p3m5m3l09J99q8L14K0L1J41p4k16
3285cj72j21K31P3L3j82L77m9m03Q9j52J16K01K41K12j84r5j89j68k26O2K51J17
3308E9m7N8Jo4j80j83L12K06k13L61j11Q0j72j96o4J00N8o5L55j75N2j34m8l37
3332c47Q9L05Q0p1J49k9k63Q5k29J70O4P2K31j4l27mn4j57Q1R0J09o8M56l79K
$$ plain form
3357 41 -274 -186 120 32 221 228 404 30 194 -165 -189 -107 -133 -90 353 143 125 352 104 11 -122 -136 166 -26
3381 -26 116 323 251 -143 0 -31 -118 17 250 130 18 59 -123 -205 -49 -79 -29 283 163 -120 -110 -147 -190 -186
3405 -186 -442 15 132 76 -11 45 -227 -200 173 -61 -73 253 267 -65 2 94 -80 -209 -202 -126 132 139 105 -19 -78
3430 -78 -55 -12 -35 102 -12 109 230 143 44 -79 -195 -54 4 137 106 56 61 97 47 -66 -123 -27 181 -35 129
3455 129 7 27 -210 -220 -183 -35 109 13 135 -73 -38 -225 -6 -150 -101 -62 85 115 -290 -105 -5 -60 213
3478 213 23 298 84 118 -133 -215 -175 -111 75 193 211 315 -191 71 49 -129 -54 -1 -133 33 124 -103 -170
3501 -170 138 44 -157 -140 -107 -113 85 131 96 137 -90 -132 -67 71 36 117 6 229 -145 39 83 -131 53 95 115
3526 115 132 186 142 68 -50 15 116 84 103 145 177 -84 -229 -166 86 152 95 13 -286 177 -8 -133 -234 124
$$ packed form
3357D1l15Q8L06q8J89PJ76l74J64l59k4Q2k6M3M43k10j8K27k48r3j33j4L02j92
3381b6J42K07p2l94J43l1q7J35K33j20j12M1j82q2J56l0N0L12j20k83J0l7m3M
3405a86k56M57J17n6q7N6k72K7L73k34j2L26J4l32O7R2j74j29PP6K58Pl4j24n9
3430g8K3M3k3J37j14J21J21q7r9j23j16J41N8J33l1n0NL6n0j13n7R6K08k16J64
3455A29j22K0k37j0L7J48J44r6J22k08L5j87K19j44M9L9J47L0m05J85J00n5K73
3478B13j90K75k14L4k51q2M0O4J86J18J8J04n06K62k2j78P5N3j32J66R1k27o7
3501a70L08r4k01J7L3oJ98M6l5M1k27m2O5J38l5Q1j11K23l74J84M4k14J84M2K0
3526A15J7N4m4p4j18O5J01l2J9M2L2k61j45O3K52O6n7q2k99M63j85j25j01L58
$$ plain form
3550 124 -13 155 261 113 -89 -173 -239 -223 3 -73 -107 79 -99 -80 -238 6 4 101 -101 -165 115 376 -256
3573 -256 124 78 -124 -281 3 191 96 199 22 -99 -88 -97 102 -38 -23 295 -173 309 160 -73 -90 -146 -191
3596 -191 20 378 68 -114 -123 -183 88 -341 -101 73 189 100 39 187 -23 73 67 31 109 -70 164 -85 140
3619 140 112 -97 -114 114 139 99 -210 51 48 -174 -204 -212 -204 93 170 205 130 -154 -15 140 -92 -73 -141 -76 -183 125
3645 125 -106 48 -133 -58 -77 141 65 52 -114 203 80 -72 -112 -146 189 -17 -35 298 -59 -224 98 12 -38
3668 -38 24 156 -114 9 -27 -69 -154 -86 23 62 131 -33 -200 12 -35 -106 -30 -38 -14 371 122 98 11 -124 -6
3693 -6 -172 14 62 87 127 230 -88 -34 -133 -49 148 67 68 189 33 136 -78 111 -181 15 48 233 29 -63
3717 -63 29 -5 33 -133 -295 55 92 -114 -79 -168 -34 -281 -172 79 119 77 -58 60 -169 73 -76 -389 110
$$ packed form
3550A24j37J68J06j48k02q4o6J6K26p6l4J86j78J9j58K44kR7k02o4K80K61o32
3573b56L80m6k02j57K84J88r5J03j77j21J1rJ99j40J5L18m68M82j49k33j7n6m5
3596a91K11L58l10j82ro0K71m29K40J74J16q9o1J48k10R6ol6P8j79K34k49K25
3619A40k8k09j7K28K5m0l09K61lk22l0qQK97P7L5p5k84J39J55k32J9o8O5j07L08
3645A25k31J54j81P5j9K18p6j3j66L17j23j52m0l4L35k06j8L33l57j65L22q6n0
3668c8O2J32k70J23l6m2q5O8J09L9O9j64j67K12m7p1P6qK4L85k49k4q7j35J18
3693fj66J86M8K5M0J03l18N4r9Q4J97q1JJ21j56J03k14J89k92J96L3J85k04r2
3717f3R2l4L8j66j62L50L7k06L5q9J34k47J09K51M0m2j35J18k29K42j49l13M99
$$ plain form
3740 110 63 -51 -69 -35 69 52 -103 -58 -66 90 -14 -45 136 -12 -169 -210 -143 57 385 -18 66 161 -132 -113
3764 -113 -272 4 35 128 184 -150 -46 101 191 -34 -194 -120 41 153 84 3 -202 -346 -132 -333 -127 39
3786 39 195 35 0 -269 41 -81 186 19 -364 149 198 8 -143 -309 -52 174 -164 0 -17 90 -91
3807 -91 63 -199 -80 -245 205 120 101 255 148 -107 4 31 -65 46 163 75 -122 68 15 93 142 -97 -28
3830 -28 256 265 -12 -16 -39 -167 -138 -77 -13 244 166 -156 -125 -25 89 -2 -223 -106 -130 12 124 254 59 -53
3854 -53 75 -342 -69 24 169 134 145 -207 -251 90 162 -32 199 195 301 96 -113 142 -277 159 -68 -215 -161
3877 -161 197 -109 -68 53 -12 20 -151 13 -3 76 69 102 -184 -5 -220 -108 30 35 34 -65 -25 -189 -2 -270 -35
3902 -35 206 145 77 -111 247 40 -335 -226 149 -73 -256 139 78 65 -24 -214 -42 -186 -28 -170 70 0
$$ packed form
3740A10m7j14j8L4J04j7j55M5qJ56j04l1J81j48j57m1O7K00L28m03Q4R5k93J9
3764a13j59K76L1R3N6l34J04J47R0k25j60P4J61J12o9q1k05j44K14k01K06J66
3786C9J56j60l5k69L10j22K67j67l83N13M9j90j51j66K57K26l38J64j7J07j81
3807i1J54k62J19j65M50q5j9J54j07k55J11K7r6J11J17q8j97J90n3P8M9k39O9
3830b8K84Rk77mk3j28K9O1O4K57p8l22L1J00J14r1k21J17k4J42J12J30j95j12
3854e3J28m17K73R3J45l5J1l52m4L41P2j94K31mJ06k05k09K55m19M36k27j47N4
3877a61L58l06M1J21o5L2j71J64j6P9pL3k86J79k15J12J38Njr9M0j64J87k68K35
3902c5K41o1o8j88L58k07l75J09L75k22j83L95o1j3q9j90J72j44J58j42K40p0
$$ plain form
3924 0 123 -46 -69 -22 -9 -31 119 -95 -120 -114 -199 -88 -81 -88 -77 -84 113 59 -212 60 -147 -6 33 60 -240 -286 -26
3951 -26 -59 -236 90 -14 -1 -84 121 112 -22 126 -301 -132 -24 85 68 -33 42 33 -184 67 -7 -275 205 134
3975 134 95 -244 -247 235 87 34 16 1 30 -39 -34 133 31 53 -19 32 82 200 25 239 -27 -10 -44 45 -166 -93
4001 -93 0 52 171 -108 -108 -207 37 -243 99 206 26 301 94 109 91 -102 -102 71 -13 25 -75 196 137 132 -205
4026 -205 164 -147 7 13 -197 -31 -230 43 -220 -69 97 137 44 17 1 -60 -74 -108 -134 -324 -45 102 -26
4049 -26 395 137 -73 3 55 116 35 -273 57 156 14 -183 148 44 71 309 -4 310 -232 42 -96 -47 -8
4072 -8 103 -179 482 -132 -161 221 -34 155 71 -151 43 70 36 216 49 -1 144 27 -97 225 -101 181
4094 181 32 -16 -82 -208 -216 -67 18 -38 74 54 -105 93 -234 -250 -46 -14 -101 78 85 32 -211 -87 54 -64
$$ packed form
3924@J23j69k3M7J3k2J50k14k5Oq5J11PpJ1pJ97n4k71K72k07J41L9K7l00m6K60
3951b6l3j77L26j04J3q3K05rj34J48m27J69J08J09j7j01P5rk17K51p4k68M80p1
3975A34l9l39lM82j48n3j8j5K9o9NJ67j02K2p2N1N0J18j75K14k66J7l4Q9k11P3
4001i3R3N2J19k79%r9K44k80L42J07j80K75k07J5j8j93%J73q4L8j00K71n9nl37
4026b05L69l11J54Ok10J66j99K73k63J51J66M0r3k7j6o1j4l4k6j90K79J47j28
4049b6M21k58k10P6N2O1q1l08L30R9j42j97L31j04K7K38l13L14n42K74j38M9L9
4072hJ11k82O61o14k9L82k55J89q4k22J94K7l4J80j67n0J45j17j24L22l26K82
4094A81j49m8o6j26qJ49Q5n6J12k0j59J98l27j6K04L2q7J79Pn3k43J24J41j18
$$ plain form
4118 -64 -118 67 46 96 3 53 -114 24 168 214 -3 91 55 -197 -29 -242 -104 148 -187 114 132 -112 38
4141 38 2 -51 -114 -64 47 -131 58 219 -107 -180 4 -101 -55 -65 -146 122 16 6 12 1 97 203 -65 123 58
4166 58 244 67 155 -349 168 44 -42 -9 26 -76 -66 83 -30 49 123 -137 70 104 192 19 -112 -111 72 -139
4190 -139 -17 14 -89 -13 55 -111 16 43 -114 -6 159 -78 -44 -3 22 211 -56 109 -159 52 -39 -159 227
4213 227 -213 38 30 99 115 48 -221 210 130 -87 -7 187 81 175 60 -16 21 53 63 -39 -18 -217 109 136 78
4238 78 -214 -41 349 107 23 -95 44 31 -64 0 116 -135 -91 -54 119 -31 69 120 119 151 211 26 48 31 -191
4263 -191 168 18 -36 242 33 52 295 -70 150 53 -12 -93 -129 -82 -54 -172 -122 87 -92 -104 119 307 -210
4286 -210 50 -246 216 -24 90 96 131 -40 32 -128 -36 -47 -34 231 -260 -17 72 116 53 107 130 21 386 13
$$ packed form
4118f4n4J85k1N0r3N0j67J38J44M6k17R4l6k52J68k13J38K52l35L01J8k44J50
4141C8l6n3o3N0J11j78J89J61l26p3J84j05M6j0q1K68j06j0Oj1R6J06k68J88o5
4166E8J86j77Q8n04N17j24q6L3L5j02J0J49j13P9P4k60K07L4Q8j73j31JJ83k11
4190a39J22L1j03P6O8j66J27K7j57J08J65k37L4M1K5J89k67J65k68K11r1j20L86
4213B27m40K51qO9J6o7k69M31q0k17Q0J94j06R4j15p6L7L2J0j02K1j99L26K7n8
4238G8k92J73L90k42q4j18J39j3r5O4J16k51M4L7J73j50J00N1jL2O0j85K2j7k22
4263a91L59j50n4K78k09J9K43l65K20r7o5q1l6M7K8j18N0K09j79j2K23J88n17
4286b10K60k96M62k40J14OL5j71P2j60R2j1J3K65m91K43Q9M4o3N4K3j09L65l73
$$ plain form
4310 13 -56 359 -100 -150 -171 100 163 -320 -39 199 -65 -3 -72 117 117 -163 -75 -113 -18 186 -130 50 -204 -236
4334 -236 -64 -302 -117 121 46 170 142 83 -94 100 -11 -40 -21 28 121 159 -57 100 -86 21 65 -64 8
4357 8 155 -287 -79 132 -190 -16 166 7 -305 -79 -223 33 -51 280 0 -151 -334 214 -300 -111 -55
4378 -55 -66 -63 35 47 23 106 -121 -124 -66 -87 -257 164 -60 -126 -78 -12 -5 -23 -196 -57 166 192 222 109 136 -157 14
4405 14 -16 -85 -114 121 300 176 38 22 8 184 110 64 196 179 44 -41 -135 -110 64 -50 78 -83 39 140
4429 140 -10 -62 207 -221 -42 75 -16 -42 149 -50 -7 23 -249 -28 249 -202 -253 220 -28 -189 -164 -239 195
4452 195 -42 -146 14 -141 -71 -6 -149 123 17 146 -7 74 55 21 5 -21 -57 -24 43 -88 -8 14 55 -22 18
4477 18 -172 28 -123 -28 11 32 -5 -21 84 -273 -251 44 201 -29 -158 169 28 -11 -11 -10 -120 84 -192 -92
$$ packed form
4310A3o9M15m59n0k1K71O3m83K81K38k64O2o9J89%k80Q8l8R5K04l16J80k54l2
4334b36J72k38J85K38p5J24k8n9j77J94j11k9J9M9R3L8k16J57j86J07M4j29P2
4357HJ47m42K08K11l22J74J82j59l12K26j44K56q4L31k80j51j83N48n14J89N6
4378e5j1LR8J2k4Q3k27lN8k1j70M21k24o6M8O6Pj8j73J39K23K6L0j13K7k93J71
4405A4l0o9k9K35J79j24j38j6j4J76p4m6J32j7j35q5r4K5J74j14J28j61J22J01
4429A40j50n2K69m28J79J17r1k6J91j99M3L0k72K21K77m51n1M73k48j61K5p5M34
4452A95k37j04J60j55P0O5j43K72j06J29j53Q1j9l4j6k6l6L3O7j31Q0K2M1p7M0
4477A8j90K00j51R5L9K1l7j6J05l57K2K95J57k30j29L27j41l9%Jj10K04k76J00
$$ plain form
4501 -92 34 33 -64 -64 -101 1 88 -93 -11 -194 -281 -140 -465 88 75 -9 -179 105 -54 274 33 17 -216 -305 125
4526 125 51 35 -86 -25 -65 -165 -7 -102 108 236 -43 -81 -86 -56 -28 -64 -44 -236 174 191 -167 -109 -260 175 -82
4551 -82 43 -85 146 21 305 -128 -1 -9 -320 -10 53 -106 -54 7 139 103 111 -235 -162 -60 361 60 87 -106
4575 -106 59 -212 188 134 135 89 -42 18 -191 -81 -206 68 -163 36 -7 -20 -55 -87 -151 -13 32 -124 -128 -29 -4
4600 -4 21 -218 106 -78 129 18 203 181 2 -64 85 34 117 260 92 121 141 16 -20 23 -179 -18 -148 215
4624 215 -33 175 -320 -18 113 69 -165 -169 -120 168 -118 48 160 -128 -210 -23 -22 79 -3 -7 28 -170 -69 -100
4648 -100 93 199 244 -11 -100 178 -183 277 -65 -13 -17 -125 -69 -57 304 -10 -65 -52 -172 -4 -126 -16 -75
4671 -75 206 -68 -49 -75 20 -72 -100 183 -33 122 -67 -201 -160 14 -105 11 49 -42 31 -164 -294 -45 -48 121
$$ packed form
4501i2J26jr7%l7J02Q7j81Q2j83q7J41l25N53j3q4j70K84j59L28k41j6k33q9M30
4526A25p4j6j21O1m0j00J58r5K10J28k79l8nL0K8l6K0j92M10J7l58N8j51M35k57
4551h2J25j28K31j25K84m33J27ql11L10O3j59N2O1J32l6Ql46P3J02M21l01K7j93
4575a06J65k71M00n4Jm6j31O0k09J10j25K74k31J99m3j3l5l2o4J38M5j56mR9K5
4600dK5k39L24j84K07j11J85k2j79o6J49n1Q3J43j68K9K0j25l6M3k02J61j30L63
4624B15k48K08m95L02J31m4k34mM9K88k86J66J12k88q2J87JJ01q2mL5j98J01l1
4648a00J93J06M5k55q9K78l61M60l42N2mj08N6J2L61l14n5J3j20J68j22J10n9
4671g5K81k74J9k6R5r2k8K83k16J55j89j34M1J74j19J16L8r1P3j95j30K49lJ69
$$ plain form
4695 121 -51 -56 -78 314 -77 -199 36 102 -155 -26 72 -40 80 -28 77 -196 -7 -7 31 -139 -70 -53 -212
4718 -212 3 1 36 -220 -169 -8 -5 74 -332 322 -30 26 -140 178 42 -108 -51 150 -118 -23 180 -83 119
4741 119 238 5 -108 10 -180 -193 -88 61 98 241 -68 -92 178 -185 123 75 43 -141 19 116 256 46
4763 46 1 43 -50 -132 103 -107 -14 68 -101 -307 -104 -41 -47 -238 224 174 -83 -167 44 -62 -39 248 -58 -162
4787 -162 189 -15 211 -53 -105 -103 18 -201 89 -168 -72 31 33 -6 -116 -255 207 39 -89 5 183 -122 -80
4810 -80 -74 -142 241 105 26 141 -135 136 138 -48 -25 69 -65 41 32 -85 -160 0 -36 -206 -41 73 141 52 16
4835 16 -154 97 -101 -115 133 -125 -118 -88 -121 33 82 -69 -373 56 -158 -150 179 139 -246 27 -134 -104 29 99
4859 99 236 140 92 21 -187 -187 23 234 73 299 39 120 -168 31 -139 -186 319 181 227 -46 179 -67 40
$$ packed form
4695A21j72nk2L92l91j22K35O6k57J29R8j12J20j08J05k73J89%L8j70O9J7j59
4718b12K15kL5k56N1J61LP9m06O54l52N6j66L18j36j50N7K01k68R5K03k63K02
4741A19J19k33j13J18j90j3J05J49L7J43l09k4K70l63L08m8l2j84J60R7J40k10
4763D6m5M2r3q2K35k10R3Q2j69k06K03O3oj91M62n0k57q4K11j06K3K87l06j04
4787a62L51k04K26k64n2KJ21k19K90k57R6J03Kl9j10j39M62j68j28R4J78l05M2
4810h0Oo8L83j36p9J15k76K71Kj86K3R4j34J06rj17p5J60l6j70J65J14O8q9l6
4835A6j70K51j98j4K48k58PL0l3J54M9j51l04M29k14QL29m0l85K73j61L0J33P0
4859I9J37r6m8p1k08%K10K11j61K26k60Q1k88J99j70m7N05j38M6k73K25k46J07
$$ plain form
4882 40 70 130 -90 -85 -23 -219 -139 38 -161 -318 -155 18 23 100 217 247 41 76 177 -119 88 -28 67 128 -137
4907 -137 82 -156 -44 283 -37 -135 126 3 -248 75 -48 -102 -44 2 42 -38 109 -217 153 -37 240 -40
4929 -40 124 -11 -144 170 -141 160 -101 93 104 4 38 41 -53 9 289 -22 -148 119 -165 -14 48 125 -152
4952 -152 -34 -254 -151 -136 27 -166 -73 184 -236 -91 -31 -185 -186 -59 25 -168 79 244 -332 -14 -85 -27 -283
4975 -283 -70 -74 -45 35 -246 -117 193 52 -29 9 176 -79 -21 -31 35 127 -60 1 -185 -122 -77 -104 -72 -168 -170 295
5001 295 -138 140 6 -52 63 -202 -33 114 -216 -9 167 92 133 -22 -32 -189 -135 -142 -227 69 64 129 13 -240
5025 -240 -172 49 96 -36 -31 -225 -3 -50 -98 -185 -56 -61 -187 -274 178 -36 83 43 -11 134 -48 -192 -65 -352
5049 -352 57 30 64 -90 -164 -53 -47 239 54 -110 -23 -321 -43 150 -140 200 -57 -91 -34 -127 15 -88 267
$$ packed form
4882D0L0O0k20NO2j96Q0J77j99j57J63J73NP7J17L0k06L5J01k96K07j16R5O1k65
4907a37K19k38J12L27l20r8K61j23k51L23j23n4N8M6M0q0J47l26L70j90K77k80
4929d0J64j35j33L14l11L01k61J94J1j00L4Lr4O2K80l11j26K67k84J51O2P7k77
4952a52J18k20J03J5J63j93R3K57m20J45O0j54jJ27Q4j93K47J65n76L18p1N8k56
4975b83K13mK9Q0k81J29L10j41q1L8J67k55N8j0O6R2j87O1j86O3M5k7L2r6kM65
5001B95m33K78j34n8J15k65J69J47l30K07J76p5M1j55j0j57N4pq5K96nO5j16k53
5025b40O8K21M7j32Nj94K22m7m8q7J29nj26q7M52k14J19m0n4J45j82j44J27k87
5049c52M09k7L4j54p4J11OK86j85j64Q7k98K78J93k90L40k57l4N7r3J42j03L55
$$ plain form
5072 267 -134 118 -158 71 -94 -71 -127 -91 -69 98 164 139 -20 -98 -215 -66 165 64 -29 -226 -176 -14 89
5095 89 -135 118 -53 -166 -186 -103 -62 -157 29 20 258 -143 -85 -96 -47 -83 -30 61 193 72 -14 -33 46 -144 -31
5120 -31 29 30 76 -63 106 -56 -173 -195 -73 54 -60 346 -136 -180 -138 -138 28 -71 -282 180 -308 -78 71 -12
5144 -12 -142 150 -92 43 161 -174 -42 -60 37 8 -52 72 2 40 189 42 114 133 -34 54 9 258 315 180
5168 180 -182 -365 145 -211 85 9 -155 134 223 134 -199 -159 -218 -107 -12 -79 30 204 -57 222 12 -91
5190 -91 201 23 140 -14 -25 -32 99 -38 -220 -47 109 -186 306 162 93 -55 -38 -127 -54 -74 195 185 102 -110
5214 -110 17 16 66 137 87 149 -44 156 -124 -26 -129 29 -174 -131 133 -34 194 -245 -114 0 -95 150 -26
5237 -26 12 169 -54 -88 74 141 -92 102 -90 123 111 -3 -81 -84 -91 215 -190 154 -144 17 -174 -127 35 249
$$ packed form
5072B67m01K52k76K29j65K3n6L6K2J67O6k5j59p8j17J49K31j01r3j97N0J62J03
5095H9k24K53j71j13k0Q3M1r5J86rK38m01N8j1M9l6N3R1J32j21q6j9P9j90J13
5120c1O0JM6j39J69j62j17k2J22J27j14M06m82m4M2%J66r9k11M62m88K30J49q3
5144a2j30K92k42J35J18l35J32j8R7k9o0J24p0L8J49j47P2J9j67Q8m5K49N7j35
5168A80l62j83N10l56K96p6j64K89Q9q9l33M0n9J11R5o7J09J74k61K79k10j03
5190i1K92j78J17j54j1pJ31j37j82J73J56k95M92j44o9j48J7q9P3k0K69j0q3k12
5214a10J27jN0P1n0O2j93K00k80R8j03J58k03M3K64j67K28m39J31J14r5K45j76
5237b6L8J57k23l4J62O7k33J94j92K13j2j14p8lpL06m05L44k98J61j91M7J62K14
$$ plain form
5261 249 176 -78 -35 61 -125 105 98 -177 15 -262 129 -90 -53 -206 166 117 -78 -86 35 -90 -65 -5 -185 172
5285 172 26 198 149 60 -8 52 -89 58 20 -191 57 7 -282 -69 -60 -98 32 52 -193 -118 13 -69 -80 199
5309 199 -178 108 101 33 13 -33 31 -110 73 151 22 -102 81 26 -11 -157 -11 33 26 28 119 8 -211 -202 46 115
5335 115 -365 133 -200 -119 -43 120 17 -189 34 48 -10 -244 188 -94 -131 68 -312 44 -29 79 13 145
5357 145 -346 -104 -55 -3 115 -28 2 -123 193 -27 53 -86 135 -105 -40 -164 -22 73 30 112 -82 -6 16
5380 16 -181 99 -88 221 372 -258 265 129 -239 32 -108 -81 52 -16 -111 41 -86 -222 -74 179 32
5401 32 -92 36 143 -128 78 -176 158 34 -145 -96 261 2 -263 -322 -313 40 -273 -164 -13 152 49 28
5423 28 176 15 122 -92 -45 14 67 171 24 -32 94 7 -26 -65 -128 -146 106 -52 107 -66 52 26 205 -3
$$ packed form
5261B49p3k54M3R6j86K30pk75J92k77L91k19L7j53L72m9j95qJ21j25K5O0j80L57
5285A72j46J72m9q9o8O0j41J47l8k11K48n0k89K13Rl8J30K0k45P5J31q2j1K79
5309A99l77K86po8k0m6O4j41J83P8j29j24J83n5l7j46J46M4pKR1j11k19RK48O9
5335A15m80M98l33Q1P6J63j03k06K23J4n8k34M32k82l7J99l80L56p3J08o6J32
5357A45m91K42M9N2J18j43L0j25L16k20Q0j39K21k40O5j24J42R5m3Q2j94P6K2
5380A6j97K80j87L09J51o30N23j36l68K71j40K7J33o8r5J52j27j36J48K53j47
5401C2j24J28J07k71K06k54L34j24j79M9L57k59k65n9RL53l13J09J51J65j03k1
5423B8J48j61J07k14M7N9N3J04j47n6J26q7l3l9o3j8K52j58J59j73J18k6J79k08
$$ plain form
5447 -3 -60 12 226 -108 -265 148 39 -185 -109 -26 -24 183 98 -116 155 281 -277 80 22 -23 72 192 2 60
5471 60 97 -147 45 56 151 -8 -52 -176 -212 -175 -110 53 -38 150 83 7 -61 2 5 54 -52 100 127 25 56 -189
5497 -189 89 -32 113 -73 -214 101 -153 -133 -119 -249 -76 -61 92 -29 87 199 177 -196 50 49 -93 -86 180
5520 180 114 41 144 155 63 6 47 59 146 -38 -22 7 -98 31 -166 313 179 172 111 -314 -43 52 -154 21 -90
5545 -90 -1 163 296 166 22 -154 244 129 -208 -84 10 -161 222 240 120 85 182 31 109 164 16 242 46
5568 46 192 109 -261 -112 185 120 72 -247 -24 5 73 -64 273 -22 28 40 -103 -99 88 -60 107 255 -126
5591 -126 5 138 200 43 235 -24 -142 -264 9 -67 -96 -26 -235 -151 -78 -23 72 -43 2 -5 47 -253 28 299
5615 299 76 111 -15 -243 223 83 -39 47 35 -92 121 102 143 233 169 81 -129 37 245 -60 -32 147 79
$$ packed form
5447cn7P2K14l34j57M13j09k24P6Q3KK07q5k14K71J26n58L57n8m5R5J20j90N8
5471F0L7k44J92J1R5j59m4j24l6L7O5J63r1J88o7p6o8O3LM9j06J52K7j02L1k45
5497a89K78j21J45j86j41L15k54K0J4j30J73J5J53j21J16J12k2l73K46jj42PK66
5520A80o6p3J03J1r2n7M1J2Q7j84J6K9j05J29j97M79j34po1m25K71R5k06J75j11
5545i0Q9J64J33j30j44j76L98j15l37J24R4j71L83J8j20l5R7j51P8N5j48K26j96
5568D6J46q3l70J49K97o5m8l19K23K9O8j37L37k95N0J2j43MJ87j48J67J48l81
5591a26J31J33O2j57J92k59j18j22K73p6k9P0k09Q4P3N5R5j15M5pN2l00K81K71
5615B99k23L5j26k28M66j40j22Q6j2j27K13j9M1R0o4q8k10J66K08l05K8J79o8
$$ plain form
5638 79 172 7 56 -136 -137 -9 -87 -88 124 -283 -99 59 -137 11 270 107 -174 311 -8 125 186 -72 -45
5661 -45 127 -106 47 86 59 -50 74 -231 -11 112 -169 140 -99 271 13 -56 36 -50 93 131 6 -77 -38
5684 -38 -47 42 28 62 -143 70 49 170 -133 -85 223 -66 -20 -8 112 98 -28 144 -43 108 -27 -17 -75 -40 322
5709 322 163 19 19 19 -90 67 -229 -112 27 107 -240 -37 -47 -97 -145 -78 -7 13 13 120 150 -133 16 -211 -163
5734 -163 -43 8 -42 200 -54 -1 68 -168 71 -103 -130 67 143 43 176 -1 147 -42 99 137 -45 191
5756 191 -111 203 -1 -104 -2 -89 2 52 89 36 -33 -99 19 -122 150 -120 -72 156 52 115 -123 289 -182
5779 -182 51 -26 -369 -20 10 -136 35 -188 -50 -185 178 -209 9 177 124 -22 217 248 -144 149 -117
5800 -117 -88 -148 -11 -127 84 -49 255 -1 -144 213 -101 -45 7 212 -31 38 -114 103 -108 20 74 -64
$$ packed form
5638G9R3j65M9j92jJ28p8jK12m07J84J58j96J48K59j63k81M85l19J33O1k58K7
5661d5J72k33J53L9k7j09J24l05K20J23k81L09k39L70k58o9R2q6J43L8j25q3L9
5684c8rQ9j4L4k05K13k1J21l03M8L08k89M6J2J20j4j26J72j87J51j35J0n8L5L62
5709C22j59j44%%j09J57k96J17J39Q0l47K03j0n0m8O7P1K0%J07L0k83J49k27M8
5734a63J20N1n0K42k54N3O9k36K39j74k7J97P6j00J33j77J48j89J41L8j82K36
5756A91l02L14k04j03J02q7R1N0L7n3o9o6J18j41K72k70M8K28j04O3k38M12m71
5779a82K33p7l43L49L0j46J71k23J38j35L63l87K18J68n3j46K39L1l92K93k66
5800a17K9o0J37j16K11j33L04k56j43L57l14N6N2K05k43O9j52K17k11J28N4j38
$$ plain form
5822 -64 47 -215 -53 99 379 54 104 -112 -157 -114 91 134 137 82 166 -304 39 113 36 -124 -104 -189 -53 99
5846 99 14 -128 43 -16 65 33 -228 161 220 26 -118 32 -3 116 -28 -175 37 111 288 -173 -158 12 51
5869 51 55 -154 156 17 -163 -35 -22 -4 -38 85 155 196 -80 -216 115 -79 -146 -131 203 -114 72 161 56 -204
5893 -204 -267 124 -66 43 -58 165 143 -124 -74 127 144 -176 -111 27 -14 131 -68 14 40 72 86 -51 -232
5916 -232 -61 89 -132 159 40 -66 -226 118 6 -126 54 161 -157 33 -42 -46 -217 -95 190 223 -153
5937 -153 -152 -268 -4 95 -113 -56 -151 97 106 -64 20 2 144 -52 -153 -140 174 -117 180 108 27 -212 37 -75
5961 -75 19 31 -349 -4 -76 -241 -296 -17 45 8 49 127 252 16 84 -47 122 135 164 60 131 -12 -115 198
5985 198 -258 33 -74 98 168 70 1 43 78 311 26 -19 253 -205 103 -89 -11 -93 59 353 132 -169 -72
$$ packed form
5822f4J11k62J62J52K80l25N0k16m5M3K05M3Ln5Q4m70L43P4p7j60K0q5J36J52
5846I9q5j42J71n9Q1l2k61L89N9j94j44J50l5J19j44j47K12P4J77m61J5J70L9
5869E1Mk09L10j39j80J28J3J8l4J23P0M1k76j36L31j94o7J5L34l17J86Q9j05k60
5893b04o3L91j90J09j01K23k2k67N0K01J7l20O5J38m1J45j99Q2K6L2J4j37j81
5916b32J71J50k21K91j19j06j60L44j12j32J80J07l18J90p5mj71J22K85L3l76
5937a53Jj16K64R9k08N7r5K48Rj70Q4j8J42j96j01J3L14k91K97p2q1k39K49j12
5961g5R4J2l80L45p2j65n5K79O2l7M1P8J25k36O8j31J69J3K9j04P1j43j03L13
5985A98m56K91j07J72P0r8o9M2L5K33k85m5K72m58L08j92P8q2J52K94k21l01R7
$$ plain form
6008 -72 -149 -200 165 -112 -54 -5 140 83 -281 71 213 -316 -54 38 -78 63 115 -57 -18 -104 -64 -141 -65 150
6032 150 -175 -13 -173 -177 132 68 19 17 -240 -33 139 -183 -4 -38 175 103 181 -124 -50 -30 -75 -168 -68 -7 196
6057 196 239 222 -23 -112 -39 175 84 84 -58 86 -49 -27 310 -109 229 -148 -243 -16 51 14 -217 140 112 21
6081 21 -69 -96 78 -254 -72 -23 53 214 -12 -37 67 -136 -153 -98 -91 220 6 -69 143 -72 25 -143 -3 83
6105 83 -27 -79 -124 43 -240 -205 -39 67 98 -1 -40 260 -148 203 256 -330 16 -118 -60 99 45 -62 -117 -47
6129 -47 283 100 -149 -85 65 11 -32 -269 -4 -133 -49 5 -24 35 15 -97 -37 183 -62 3 96 204 -134 -211
6153 -211 278 79 34 -83 39 -229 -69 -19 129 -11 18 -83 -36 158 2 -25 127 104 -3 59 -46 154
6175 154 -23 -236 290 8 12 11 61 -109 116 36 63 83 230 -16 0 96 -7 147 -98 -203 184 -34 -135
$$ packed form
6008g2p7n1L65k77N8M9J45n7l64L52J42n29K62R2j16J41N2j72L9q6M0p7P6K15
6032A50l25J62j60mL09o4m9kk57K07J72l22J79l4K13p2P8l05P4K0m5r3J00O1K03
6057A96M3j7k45q9P3K14r1%j42J44j35K2L37m19L38l77r5K27O7l7k31L57k8r1
6081B1r0k7J74l32J82M9P6J61k26k5J04k03j7N5PL11k14p5K12k15R7j68J40Q6
6105H3j10n2m5J67k83L5J66J06L1r9l9L00m08L51N3n86L46j34N8J59n4j07n5P0
6129d7L30j83k49O4J50n4m3k37K65j29Q4N4k9N9k0j12O0K20k45O5R3J08l38p7
6153b11M89j99m5j17J22k68J60N0J48j40K9j01M7J94j56k7J52k3j07O2j05K00
6175A54j77k13N26k82MjN0j70K25q0K7K0J47k46J6R6j03J54k45j05L87k18j01
$$ plain form
6198 -135 -184 145 126 -45 31 99 179 157 128 -26 85 -113 124 331 -70 -141 -171 -39 -117 149 -2 -303 -101
6221 -101 -122 242 -43 71 -150 90 -108 -74 -159 -110 -14 23 102 165 166 89 -16 -190 -143 -114 -128 192 135 -168 -21
6246 -21 34 -9 171 -65 330 190 99 27 -63 -170 -57 -20 -9 -69 70 -203 -104 34 60 105 21 55 39 16 118
6271 118 54 122 120 -82 -23 27 -178 -54 15 -201 -83 160 4 57 -23 112 -46 -60 -192 16 243 120 -79
6294 -79 120 -75 181 -119 252 -86 117 90 -29 194 14 -117 -197 -47 -183 135 -42 -137 -63 233 -1 -173
6316 -173 18 -168 -19 91 -106 -124 137 -15 -150 -101 232 -151 -149 0 -18 85 -50 151 56 -268 -15 -260
6338 -260 31 -180 158 79 337 110 50 -29 -8 -169 -302 -183 173 168 -100 -104 188 121 28 149 -52 -31 4 50
6362 50 129 80 166 -59 92 -52 -163 36 -6 -96 77 130 37 -37 -19 102 -69 -264 167 163 -135 87 100 46 23
$$ packed form
6198a35m9L29j9j71P6O8Q0k2k9j54J11j98K37K07m01p1l0J32p8K66j51l01K02
6221a01k1L64k85J14k21K40j98L4q5M9R6L7P9O3Jp7j05j74M7K9j4L20n7l03J47
6246b1N5m3J80k36L95j40r1p2r0j07J13L7J1o0J39k73R9J38K6M5q4L4j6k3J02
6271A18o4O8kk02N9N0k05J24O9k16J18K43j56N3q0J35j58j4j32K08K27j23j99
6294g9J99j95K56l00L71l38K03k7j19K23j80j31q0J50j36L18j77r5P4K96k34j72
6316a73J91j86J49J10j97j8K61j52j35M9L33l83KJ49j8J03j35K01r5l24K53k45
6338b60K91k11L38p9K58k27o0p9K1j61j33J19L56nk68mK92o7r3J21k01K1L5M6
6362E0P9m9Q6k25J51j44j11J99m2r0J73N3r3p4J8J21j71j95M31mk98K22J3n4k3
$$ plain form
6387 23 -22 -144 175 108 153 129 0 30 23 91 -177 -169 88 148 108 -47 -177 244 -168 -143 58 -27 -112 -22 75 -15
6413 -15 12 36 4 -30 134 105 -39 -50 -147 16 163 -38 -262 132 -374 54 97 53 49 -61 191 -139 -52 -25 93
6438 93 -62 70 -43 259 -52 -25 73 -165 87 352 70 145 -11 -2 128 249 108 103 183 67 86 -35 17 272
6462 272 -15 104 91 116 146 -55 31 22 93 105 -114 -152 -23 38 -37 -84 129 140 51 105 65 -48 -203 142 50 -67
6488 -67 6 -36 110 206 -94 -21 -39 -34 -112 -59 210 -226 90 -72 -5 57 89 -6 -77 130 -39 44 -130 -95 -45 138
6514 138 64 -84 44 78 -149 74 -14 94 -182 -100 -77 177 64 -11 173 56 -294 -108 18 4 129 -1
6536 -1 59 -85 -2 -114 -137 -134 -151 228 27 65 -68 239 -149 -103 -168 -166 72 -279 56 237 16 68 84 -117 213
6561 213 0 20 -20 -228 -118 -6 123 -23 70 244 69 -69 141 -4 -56 205 -76 -62 45 211 -85 -52
$$ packed form
6387B3m5j22L19o7M5k4j29L0pO8k68QK57O0m0j55j30M21m12K5K01q5q5R0R7r0
6413a5K7K4l2l4J64k9j44j1r7J63J47k01k24L94n06M28M3m4mj10K52l30Q7K7J18
6438I3j55J32j13L02l11K7R8k38K52K65k82P5j56RJ30J21j41nQ0j16J9j21N2K55
6462B72k87J19j3K5L0k01Q6rP1J2k19l8J29O1p5m7K13J1q9N4m0j13j55L45r2j17
6488f7P3m2J46R6l00P3j8Np8N3K69m36L16j62O7O2L2r5p1K07j69Q3j74L5N0J83
6514A38p4j48J28L4k27K23q8J08k76Q2K3K54j13p5J84j17l50J86J26j4J25j30
6536aO0j44Q3j12k3Lj7L79k01L8j33L07l88M6o5KK38l51L35J81k21N2J6k01L30
6561B13k13K0m0k08J10J12J29j46R3J74j75j38K10j45n2K61k81J4J07J66k96L3
$$ plain form
6583 -52 152 -29 -188 81 66 -23 3 148 -113 -159 -112 167 92 271 62 7 -206 316 23 -123 -105 -339 -12
6606 -12 -53 -265 -113 337 3 176 164 -46 17 39 -101 -32 -107 285 -8 48 -144 -166 148 6 -157 -78 75
6629 75 13 -74 119 -55 -76 402 51 77 114 3 54 176 181 -179 173 9 -75 172 -231 -6 66 -74 59 -119
6653 -119 136 2 100 66 -95 -143 107 -23 180 -75 -14 21 193 82 74 228 -118 -127 42 -21 110 -117 38
6676 38 -120 -219 -164 -34 75 -73 14 -27 -84 -100 -273 50 -155 -29 -147 162 -103 6 156 17 -141 85
6698 85 69 -231 37 -102 -18 -253 -54 67 -52 36 183 -6 107 58 -157 -33 112 15 145 44 37 -52 173
6721 173 62 -88 -213 -147 -8 -18 84 -55 354 43 8 -86 -201 -270 52 -87 0 -174 -23 -160 87 -132
6743 -132 270 -185 -110 -6 48 -91 -161 269 -275 -58 25 -29 30 -51 -74 56 51 32 -29 107 -14 86 -20 22
$$ packed form
6583e2K04j81j59K69j5q9K6J45k61m6M7K79p5J79k09n5k13N22k93j46J8k34L27
6606a2m1k12J52M50l34J73j2k10O3K2j40O9p5L92k93N6j92k2L14j42j63P9J53
6629G5o2q7J93j74k1M78l51K6L7j11N1J22Nl60L52j64q4K47m03K25P2j40J33j78
6653a19K55j34R8l4j61m8K50j30K03k55O1L5J72j11qJ54l46rJ69o3J31k27J55
6676C8j58r9N5J30J09j48Q7m1n7j6j73L23k05J26j18L09k65J09J50j39j58K26
6698H5j6l00K68j39Q4k35J99J21j19Q8J47j89J13m9k15J24J45r7J30j01pq9K25
6721A73j11j50j25O6J39j0J02j39M09l11l5r4j15o9L22j39Q7j74J51j37K47k19
6743a32M02m55P5J04N4j39p0M30n44K17Q3n4N9q1k3J30nj9o1J36j21J00j06M2
$$ plain form
6767 22 92 62 33 -235 -172 -56 -49 -109 -187 113 -83 16 97 -184 222 47 153 14 9 -133 154 -81 -216 -78
6791 -78 -91 58 5 -128 -58 -112 73 0 -19 22 126 119 -107 -4 20 -65 124 26 -103 12 -75 109 -152 224 201
6816 201 149 15 179 30 30 -295 246 -92 22 -154 -134 120 -80 -137 -201 -228 -166 75 -70 0 317 -40 -134
6839 -134 -11 -373 50 -77 -163 -106 -50 -154 -129 -198 -32 -281 -66 -112 -81 122 -49 -62 -170 36 -120 105 22
6862 22 -5 -61 -172 -159 -40 176 -109 33 23 -14 64 131 -2 -2 -91 -32 -216 102 107 -18 -140 23 109 -241 -74
6887 -74 -216 -176 -77 99 -74 245 64 -222 111 -144 -40 124 -38 -107 165 46 265 -206 -6 -127 59
6908 59 41 -181 -146 67 265 56 129 147 -146 81 258 279 -197 141 -342 -29 131 -165 253 135 22 -80
6930 -80 5 -70 -65 -151 75 -39 -99 151 -19 -16 -38 145 193 188 185 -27 88 140 -79 -29 58 -93 47 -65 34 81 -200
$$ packed form
6767B2P0l0k9k68O3J16Po0p8L00j96R9Q1k81M06j75J06j39nj42K87k35j35J38
6791g8j3J49n3j33P0n4J85p3j9M1J04pk26J03K4q5J89r8j29J15q7J84k61L76k3
6816B01n2j34J64j49%l25N41l38J14j76K0K54k00n7o4k7O2K41j45P0L17l57r4
6839a34J23l62M23j27q6N7N6j04K5o9J66k49K15m6L1K03j71j3j08K06j56K25q3
6862B2k7n6j11J3J19K16k85J42j0l7P8O7j33%q9N9j84L18Nj25j22J63Q6l50J67
6887g4j42M0R9J76j73L19j81k86L33k55J04J64j62o9K72j19K19m71K00j21J86
6908E9j8k22L5K13J98k09P3J8k93K27J77K1m76L38m83L13J60k96M18j18j13j02
6930h0Q5p5Nq6K26j14o0K50j70Lk2J83M8nlk12J15N2k19N0Q7j51J40j12R9M7k81
$$ plain form
6957 -200 118 111 112 -41 129 24 -102 -17 129 179 -20 -141 -118 76 181 3 -166 -95 59 149 -50 213 80
6980 80 127 -314 -46 -164 -120 166 98 -108 -236 -34 54 -74 127 346 217 90 -135 -40 36 -22 -302 -106 144
7003 144 -4 -150 -69 -178 -168 138 94 40 199 -60 -122 39 -173 -200 84 -22 -134 -149 5 85 80 182 -180
7026 -180 129 -73 157 41 -42 19 52 -44 -26 -116 183 19 41 105 -37 -53 -142 117 53 -1 143 -100 -119 180
7050 180 109 -45 -23 80 95 67 68 108 -70 170 -42 123 30 117 115 184 -60 75 49 -41 -60 -11 89 16 -176 92
7076 92 341 -201 105 -60 -95 154 -209 -214 -265 -92 -109 -50 10 -27 47 -137 92 -82 199 164 48 -22 179 151
7100 151 59 -65 45 31 -179 -224 -63 72 142 -67 189 -101 -88 -14 17 -82 83 77 84 21 149 213 49 111 -79
7125 -79 -325 97 101 -112 117 -95 -77 42 -89 12 -3 29 42 -21 36 -113 124 145 75 89 9 -57 22 87 -13
$$ packed form
6957b00L18pJj53J70j05j26Q5J46N0j99j21K3J94J05j78j69P1J54R0j99K63j33
6980H0M7m41K68j18M4K86o8k06j28K02Q8j28K01K19j29j27k25R5P6n8k80J96K50
7003A44j48j46Q1j09J0L06m4n4J59k59o2J61k12k7K84j06j12j5J54Q0nJ02l62
7026a80L09k02K30j16q3O1L3r6J8r0K99j64K2O4j42j6q9K59o4n4J44k43j9K99
7050A80p1j54K2J03J5k8JM0j78K40k12J65r3Q7kO9k44J35k6r0j9M9J00p3j92K68
7076I2K49n42L06j65l5K49l63nn1J73j7N9O0l7P4j84K29j74K81l5j16p0K01k8
7100A51r2j24J10j4k10m5J61J35P0k09K56k90J3P4L1r9J65oPo3J28O4j64O2j90
7125g9k46M22Mk13K29k12J8J19j31J01j5L2J3o3N7j49K37K1p0J4q0o6P9O5j00
$$ plain form
7150 -13 -6 -6 -302 -1 -100 126 35 175 -97 46 -53 40 -213 -101 7 -88 141 -72 -114 4 43 22 -29 313 135
7175 135 272 -107 150 -192 -58 151 -262 -26 -91 -123 184 -53 -75 -48 229 -51 -134 109 51 149 -3 172
7197 172 18 -189 155 88 53 -30 -56 -35 -54 -277 -68 130 -128 23 -310 194 -126 27 -109 177 6 -194
7219 -194 92 8 -245 -118 -51 3 160 -63 209 -179 277 -230 128 -49 -201 -34 61 -267 65 40 -155 -20
7241 -20 93 39 -138 83 187 -21 -259 19 116 -17 183 127 269 -29 -99 -38 -86 -196 -32 46 -159 34 55
7264 55 22 148 147 52 -159 -100 115 -70 102 100 -22 -60 65 -190 -151 252 26 -7 187 -141 88 -200 -5 21
7288 21 152 61 -13 190 179 145 -3 68 -358 -232 -18 -45 39 -81 59 -61 182 -26 -91 14 -17 89 -144
7311 -144 253 82 -102 82 -283 123 -266 29 -185 -179 82 -112 -99 73 204 -93 -77 -47 -93 220 -48 -8
$$ packed form
7150a3P%k96L01r9K26r1J40k72J43r9R3k53J12J08r5K29k13m2J18L9k1n1L42j78
7175A35J37l79K57l42J34K09m13K36o5l2L07k37k2K7K77k80q3K43n8R8j52J75
7197A72j54k07L44o7l5q3k6K1j9k23K09J98k58J51l33N04l20J53j36K86j71k00
7219a94K86q4k53J27O7N4J57k23K72l88M56n07L58j77j52J67R5l28L32k5j95J35
7241b0J13n4j77K21J04k08k38K78R7j33K00n6J42k98p0O1m8j10J64P8k05J93K1
7264E5l3J26jr5k11N9K15j85J72kj22l8J25k55L9M03k26l3J94l28K29k88J95K6
7288B1J31r1p4K03j1l4j48P1m26J26K14k7Q4j20J40j20K43k08o5J05l1J06k33
7311a44L97j71j84J84l65M06l89K95k14OK61j94J3J72J31k97J6L0m6L13k68M0
$$ plain form
7333 -8 91 -25 244 -17 17 -85 2 83 118 -48 -81 66 45 -32 70 -203 51 -262 63 -144 -27 -151 -77 162
7357 162 44 152 -35 -111 88 160 -34 -155 -168 -19 118 48 98 57 26 80 -63 133 -208 88 52 -172 107
7380 107 -115 235 -177 61 8 102 167 20 -180 -77 -213 -44 -321 271 -126 -166 -35 -138 -94 188 -176 61
7402 61 20 66 29 -293 184 -40 -4 72 128 76 -217 219 92 -34 19 -77 126 110 -164 183 104 31 37 -22 -70 58
7428 58 252 -16 -33 -57 111 93 108 -168 -65 -132 -255 62 -53 -225 26 262 88 -20 24 -198 -32 50 43
7451 43 66 53 16 157 -98 72 -14 -155 7 26 77 139 -36 6 224 8 -233 -107 62 -54 112 73 -47
7474 -47 -199 -44 5 -82 -10 -208 76 138 -139 -9 45 -100 -21 -125 -84 33 51 148 47 177 95 -91 -19 209
7498 209 -188 -70 -81 271 -114 -91 256 -104 58 92 -81 27 -34 -83 64 180 218 -100 -143 59 -39 -65 240
$$ packed form
7333hR9j16K69k61L4j02Q7Q1L5j66l3J47k1p7J02k73K54l13L25k07J17j24P4K39
7357A62j18J08j87p6J99P2j94j21j3J49J37p0N0m1l1N4j43J96l41K96l6k24K79
7380A07k22L50m12K38n3R4O5j47k00J03j36J69k77N92l97m0J31j03M4K82l64K37
7402F1m1M6l7l22M77k24L6P6N6n2k93M36j27j26N3r6K03j6k74L47p9p3On9m8J28
7428E8J94k68j7k4J68j8J5k76J03o7j23L17j15j72K51K36j74j08M4k22J66Q2p
7451D3K3j3l7J41k55J70q6j41J62J9N1O2j75M2K18k16k41J26J69j16J66l9j20
7474d7j52J55M9q7P2j98K84O2k77J30N4j45P9j04M1J17J8R7j01J30q2j86P2K28
7498B09l97J18j1L52l85K3L47l60J62L4j73J08o1m9J47J16L8l18m3K02r8k6L05
$$ plain form
7521 240 -38 -28 -80 -183 -121 79 88 300 122 91 26 200 -112 -208 -107 -91 -94 -27 -55 128 373 109 122 -139 -65
7546 -65 42 -21 73 -36 70 -210 -229 51 50 -162 -49 4 38 -199 178 -189 -220 -7 26 -150 32 11 11 -10 -166
7571 -166 118 95 86 114 -20 -80 204 -95 126 114 251 57 -135 93 232 -48 90 -13 -8 77 -37 72 -119
7594 -119 173 222 137 2 -31 -33 -106 -97 -130 216 -49 -47 201 184 7 71 -55 89 -31 15 -98 1 -79 -98 150 128
7620 128 22 126 62 116 232 238 -4 60 55 168 -71 -93 -74 -197 11 -3 7 34 290 -71 48 174 -86 -68
7644 -68 271 24 189 -98 -48 -16 -233 -280 19 13 64 302 -255 295 8 -214 40 12 -32 -70 -163 -86 43 -4
7668 -4 174 -123 54 -47 0 -105 47 55 -92 -167 -128 132 65 -151 -59 36 -281 160 -70 -92 -34 250 -2 1 277
7693 277 -129 27 22 33 50 -107 -28 69 -119 -70 -146 -50 160 -168 -256 25 -97 -56 -127 214 -32 121 -38 -234
$$ packed form
7521B40k78J0n2j03O2K00RK12j78l1o5J74l12r6J01J6lO7k8J83K45k64J3k61P4
7546f5J07o3R4j09J06k80j9K80jk12J13N3L4k37L77l67l1K13L3j76J82k1%k1j56
7571a66K84k3rK8j34o0K84k99K21j2J37j94j92K28J39k80J38j03NQ5j14J09j91
7594a19K92M9q5j35l3kp3Rl3L46k65KK48j7j77O4j26J44j20M6j13R9q0j9K48k2
7620A28j06J04o4N4J16Ok42O4nJ13k39k2J9j23K08j4J0K7K56l61J19J26k60J8
7644f8L39k47J65k87N0L2k17m7K99oN1K38n57N50k87k22K54k8m4l8r3P7J29m7
7668dJ78k97J77j01M7j05J52Qj47p5L9K60o7k16R2R5l17M41k30k2N8K84k52LK76
7693B77m06J56nJ1J7j57P9R7j88M9p6R6K10l28q8K81j22M1p1L41k46J53j59j96
$$ plain form
7717 -234 -82 -266 -36 -20 -118 11 -87 -19 126 331 -10 -96 -82 -194 -44 210 -91 -63 -76 55 164 82 68
7740 68 93 -33 47 39 197 -103 261 121 25 46 -7 -89 300 -63 94 23 99 37 20 52 112 195 -73 -352 -269 -43
7766 -43 -130 37 -126 60 0 166 -87 170 -179 90 119 -9 -170 168 -234 -19 -142 -214 149 -136 23 17
7788 17 237 36 -117 194 -176 229 -193 190 10 10 -44 -52 73 -148 -153 354 102 36 19 -111 -3 115 137 93
7812 93 -144 -48 -83 95 176 132 32 10 102 -156 -6 60 -43 -5 -108 -78 148 -36 107 -146 -131 26 -202 -151
7836 -151 -39 -103 -127 -192 20 -85 -93 32 -15 -11 12 37 183 26 -181 50 131 -118 -58 -26 143 -327 27 -19 -97
7861 -97 -143 -389 45 -176 -73 -36 -51 55 -103 -213 67 133 -25 -66 -217 -54 64 22 114 33 43 37 -17 -101 86
7886 86 25 -2 160 -71 -64 -19 3 51 -42 -36 -50 -59 95 111 158 -282 16 30 52 119 -38 18 117 7 13 15 44 -158 13
$$ packed form
7717b34J52j84K30J6r8J29r8O8J45K05l41q6J4j12J50K54l01K8j3J31J09q2j4
7740F8K5j26Q0qJ58l00L64j40r6K1n3q2L89l63J57p1P6o2j7L2O0Q3k68k79Q3K26
7766d3q7J67j63J86o0J66k53K57l49K69K9j28j61L38m02K15j23p2L63k85J59o
7788A7K20k01j53L11l70M05m22L83j80%n4qJ25k21nN07k52o6j7j30J08J18K2m4
7812I3k37R6l5J78Q1m4j00k2R2k58J50O6j03L8j03L0K26j84J43k53J5J57k28N1
7836a51J12o4k4o5K12j05qJ25m7MK3K5J46j57k07K31Q1k49O0L2J69m70L54m6p8
7861i7m6k46M34k21J03L7j5J06j58j10K80O6j58m1j51J63J18m2R2q1J0on4q4J87
7886H6o1k7J62k31PM5K2M8r3Oj4rJ54J6M7m40K98J4K2O7j57N6R9j10OKK9k02J71
$$ plain form
7915 13 124 -32 33 8 -85 -78 -83 -3 -25 -43 -153 212 -130 -105 -126 88 -200 202 85 -150 -29 34 69 187 164
7940 164 1 -191 -47 150 195 129 198 71 75 -100 116 38 221 38 68 -169 -52 133 101 -169 84 260 -8
7963 -8 18 -34 -24 286 96 -15 94 57 100 -226 -147 16 -8 66 209 149 178 -59 -21 -209 -50 80 -71 -107 23
7988 23 54 -59 -40 -17 -54 -117 177 -128 -14 -13 87 -182 76 227 37 -161 -179 -185 -118 -10 -90 56 -20 205 -190
8013 -190 -70 -68 -8 36 218 158 -57 -49 -25 99 -48 -202 -143 253 27 -7 139 -303 -167 -122 118 -4 143 1
8037 1 64 -201 -52 154 -36 29 -98 -28 168 92 246 66 136 -147 -131 132 -157 -65 -8 -111 48 -264 160
8060 160 -54 -160 9 -48 149 -75 -164 -104 68 -147 -153 17 67 -84 268 11 -189 -62 16 25 94 44 30 -86
8084 -86 -136 -132 -176 231 387 -69 26 99 17 92 -83 -84 164 -13 141 -48 75 -150 32 75 5 135 20 103 70
$$ packed form
7915A3J11j56O5k5r3PnQ0k2j8j10L65l42K5k1K14k88M02j17k35J21O3L5J18k3
7940A64j63j92J44J97M5o6O9j27Mj75K16p8J83j83L0k37J17J85l2k70K53J76k68
7963hK6n2J0L10j90j11J09l7M3l26P9J63k4P4J43o0K9k37L8j88J59J30j51l6J30
7988B3L1j13J9K3l7o3K94l05J14JJ00k69K58J51j90j98j8oO7J08q0J46p6K25l95
8013a90J20KO0M4J82o0k15QK4J24j47j54N9L96k26l4J46m42J36M5K40j22J47j42
8037AO3k65J49K06j90O5j27P0J96p6J54j80P0k83J6K63k89R2N7j03J59l12M24
8060A60k14j06J69n7J97k24q9O0J72k15oJ70N0j51L52k57k00J27P8RO9n0j4j16
8084h6n0Mm4M07J56m56R5P3q2P5j75jK48j77J54j89J23k25J82M3p0J30j15Q3l3
$$ plain form
8109 70 16 30 -96 -89 -96 -446 187 -65 -90 -36 173 70 27 30 -65 57 199 -281 55 53 94 -225 -53 285 -104
8134 -104 -14 128 78 137 -351 -25 -144 -93 51 -78 54 96 55 142 177 0 -202 25 186 -15 -125 106 73
8157 73 6 210 -324 -104 -232 163 -31 -106 -168 -289 -93 110 -165 -66 -100 -85 -105 49 171 60 -13 28 -109
8180 -109 -141 94 -277 -88 -187 31 -169 122 93 -82 115
$$ packed form
8109G0n4J4j26Ppl50O33k52k5N4K09j03m3Lr5J22J42m80L36kM1l19J72L38l89
8134a04R0J42n0N9m88L26j19N1J44j29J32M2m1Q7L5j77k02K27J61k01j10K31l3
8157G3o7K04n34K20j28L95j94p5o2j21J96K03k75R9l4J5k0J54J22j11p3M1j37
8180a09l2K35l71J89r9K18k00K91k9j75J97
8191A15
$$ Imaginary data points
##PAGE= N=2
##DATA TABLE= (X++(I..I)), XYDATA
$$ plain form
0 0 0 0 0 0 0 0 8 0 0 -8 8 -8 8 -16 16 -24 24 -32 40 -48 56 -69 80 -96 112 -128 149 -172 196 -228 255 -292
32 -292 333 -374 423 -474 531 -596 664 -740 822 -912 1009 -1119 1237 -1364 1504 -1657 1826
49 1826 -2012 2215 -2440 2693 -2971 3290 -3650 4058 -4533 5089 -5755 6563 -7568 8863
63 8863 -10590 13020 -16689 22832 -34977 67935 -343687 -978846 -123950 85630 -65703
74 -65703 355624 487594 20406 -47944 -112488 -311661 -83667 16340 -290951 43546 526099
85 526099 223951 7704 134645 -295167 -551687 -75682 53720 -36551 479237 576159
95 576159 -125839 -342734 -138255 -294124 -224752 175512 226648 199105 236942 -69158 -176434
106 -176434 90382 -146298 -485078 -45619 329493 144579 217372 323495 -120387 -392312
$$ packed form
0@%%%%%%Qq%qJ6j6J6k4L2m0M8n6P2q8J04j25J49j76K08k40K77l21L68m24M83n47
32b92O25p07P97q97J005j127J260j404J562j734J921k128K356k601K868l161L483
49A826l838M227m655N133n664O261o940P708q591R622j0844J2318j4131J6431
63H863j9453K3610k9709L9521n7809J02912m11622o35159Q54896K09580j51333
74f5703M21327J31970m67188o8350o4544j99173K27994J00007l07291L34497M82553
85E26099l02148k16247J26941m29812k56520M76005J29402r0271N15788R6922
95E76159p01998k16895K04479j55869O9372M00264N1136k7543L7837l06100j07276
106a76434K66816k36680l38780M39459L75112j84914P2793J06123m43882k71925
$$ plain form
116 -392312 -236979 -207556 -31940 360064 289882 33982 99191 -15772 -307207 -202877
126 -202877 -42441 -81870 112065 294806 116885 62255 103694 -206470 -378299 -103867
136 -103867 32298 35565 252471 301029 58770 -71056 -176424 -318071 -153968 104923
146 104923 106443 150219 262364 77985 -148659 -125336 -138545 -187576 -32608 113592 142195
157 142195 220128 176765 -75007 -204052 -178296 -181802 -62800 169882 216778 144393 108650
168 108650 -30395 -198288 -180831 -110627 -69476 85926 231072 177888 61872 -24164 -142437
179 -142437 -196242 -124337 -37723 61524 182743 188618 87353 -6377 -122673 -226215 -167366
190 -167366 -6130 99710 162240 182007 87037 -50492 -119818 -150718 -145722 -54257 74426
$$ packed form
116c92312J55333K9423J75616L92004p0182k55900O5209j14963k91435J04330
126b02877J60436l9429J93935J82741j77921n4630M1439l10164j71829K74432
136a03867J36165L267K16906M8558k42259j29826j05368j41647J64103K58891
146A04923J520M3776J12145j84379k26644K3323j3209m9031J54968J46200K8603
157A42195P7933m3363k51772j29045K5756l506J19002K32682M6896p2385l5743
168A08650j39045j67893J7457P0204M1151J55402J45146n3184j16016q6036j18273
179a42437n3805P1905Q6614R9247J21219N875j01265r3730j16296j03542N8849
190a67366J61236J05840O2530J9767r4970j37529o9326l0900M996R1465J28683
$$ plain form
201 74426 159697 175503 105948 -22488 -129982 -174642 -146948 -38025 90604 151135 145070
212 145070 102025 191 -126150 -177262 -130796 -39049 65463 151782 165605 88456 -24863
223 -24863 -108893 -144626 -128635 -55626 53225 143009 159989 98165 -3415 -104600 -165220
234 -165220 -143676 -40215 76201 135405 137339 94691 -1308 -106302 -146109 -117049 -51729
245 -51729 40544 129400 154375 96378 -4196 -95099 -141154 -127466 -57387 48899 134060 139256
257 139256 82952 10746 -76782 -149172 -135007 -43365 49439 109633 138120 103871 5649 -92400
269 -92400 -134272 -114350 -52773 29121 108413 144033 98272 2889 -76583 -122973 -128891 -65404
281 -65404 43564 116511 122763 89659 21982 -71715 -131476 -118282 -53490 26167 96255 132182
$$ packed form
201G4426Q5271J5806o9555j28436j07494m4660K7694J08923J28629O0531o065
212A45070m3045j01834j26341n1112M6466R1747J04512Q6319J3823p7149j13319
223b4863q4030l5733J5991P3009J08851Q9784J6980o1824j01580j01185o0620
234a65220K1544J03461J16416N9204J934m2648r5999j04994l9807K9060O5320
245e1729R2273Q8856K4975n7997j00574r0903m6055J3688P0079J06286Q5161N196
257A39256n6304p2206q7528p2390J4165R1642R2804O0194K8487l4249r8222r8049
269i2400m1872J9922O1577Q1894P9292L5620m5761r5383p9472m6390n918O3487
281f5404J08968P2947O252l3104o7677r3697n9761J3194O4792P9657P0088L5927
$$ plain form
293 132182 103927 14767 -77384 -119201 -110516 -64674 18928 105652 131048 85539 16459 -54524
305 -54524 -115841 -125009 -61863 30440 94508 115250 94909 29024 -61704 -119671 -111560 -55749
317 -55749 15077 83886 123570 98186 18276 -59352 -102309 -109057 -69458 12062 91357 117387
329 117387 87497 27153 -46851 -107760 -114869 -59734 17957 77745 106614 95367 33285 -50994
341 -50994 -103667 -103374 -63541 2706 77304 116591 90170 22760 -43254 -90455 -105473 -70349
353 -70349 6227 77556 103490 85061 37599 -33130 -99471 -109926 -59232 8615 62935 98003
365 98003 94267 36522 -41172 -90432 -95690 -63664 -5399 61302 104713 91060 30603 -34680
377 -34680 -80290 -97948 -70472 -1007 65124 93194 83983 40315 -28081 -84146 -95860 -63796
$$ packed form
293A32182k8255q9160r2151m1817Q685M5842Q3602Q6724K5396m5509o9080p0983
305e4524o1317r168O3146R2303O4068K0742k0341o5885r0728n7967Q111N5811
317e5749P0826O8809L9684k5384p9910p7628m2957o748L9599Q1520P9295K6030
329A17387k9890o0344p4004o0909p109N5135P7691N9788K8869j1247o2082q4279
341e0994n2673K93L9833O6247P4598L9287k6421o7410o6014m7201j5018L5124
353g0349P6576P1329K5934j8429m7462p0729o6341j0455N0694O7847N4320L5068
365I8003l736n7745p7694m9260n258L2026N8265O6701M3411j3653o0457o5283
377c4680m5610j7658K7476O9465O6131K8070r211m3668o8396n6065j1714L2064
$$ plain form
389 -63796 -5651 53885 92747 90651 39114 -33269 -79392 -85966 -66018 -15515 56240 96581
401 96581 79647 34436 -16812 -69484 -97619 -73938 -6430 60811 87051 74827 40729 -16456
413 -16456 -76215 -90634 -56475 -10605 36429 82335 89950 43944 -19757 -70320 -90087 -67462
425 -67462 -12060 49594 86493 76131 34494 -11569 -60053 -92511 -68394 -4795 42905 70913
437 70913 83027 47001 -22002 -66179 -74679 -59945 -20500 31901 74818 87073 49206 -16906
449 -16906 -62436 -81578 -74287 -15839 58133 77274 58991 39652 -5179 -60896 -72863 -53029
461 -53029 -24952 24131 71409 78091 49667 -2311 -62195 -82414 -58464 -23561 29179 82508
473 82508 76511 31158 -3207 -47477 -87592 -62579 -3184 30680 56701 72533 40447 -8864
$$ packed form
389f3796N8145N9536L8862k096n1537p2383m6123o574J9948N0503P1755M0341
401I6581j6934m5211n1248n2672k8135K3681O7508O7241K6240j2224l4098n7185
413a6456n9759j4419L4159M5870M7034M5906P615m6006o3701n0563j9767K2625
425f7462N5402O1654L6899j0362m1637m6063m8484l2458K4117O3599M7700K8008
437G0913J2114l6026o9003m4177q500J4734L9445N2401M2917J2255l7867o6112
449a6906m5530j9142P291N8448P3972J9141j8283j9339m4831n5717j1967J9834
461e3029K8077M9083M7278O682k8424n1978n9884k0219K3950L4903N2740N3329
473H2508n997m5353l4365m4270m0115K5013N9395L3864K6021J5832l2086m9311
$$ plain form
485 -8864 -40461 -66137 -65026 -23025 19325 55111 86184 58874 -13785 -54794 -66632 -70269 -25026
498 -25026 45789 66603 55504 42246 -1678 -50994 -58882 -51329 -31939 21527 61387 58709 48527
511 48527 14830 -50754 -75605 -49358 -27389 10001 69295 75939 32818 765 -34943 -72352
523 -72352 -59359 -17058 17060 56242 71156 33989 -3866 -24855 -61758 -67914 -16801 21405
535 21405 36131 65364 60001 -236 -42441 -53965 -61712 -33660 24329 54445 57975 47210 2797
548 2797 -40121 -49000 -54431 -41836 20080 62580 49374 37103 20552 -35418 -68717 -45968 -19592
561 -19592 5171 44046 58339 40786 17740 -23399 -65665 -58252 -24530 5190 47239 70967
573 70967 39144 -1660 -24228 -53035 -60117 -19440 17467 31178 50580 51149 10941 -28450 -48653
$$ packed form
485h864l1597k5676J111M2001M2350L5786L1073k7310p2659m1009j1838l637M5243
498b5026P0815K0814j1099j3258m3924m9316p888P553J9390N3466L9860k678j0182
511D8527l3697o5584k4851K6247K1969L7390N9294O644m3121l2053l5708l7409
523g2352J2993M2301L4118L9182J4914l7167l7855k0989l6903o156N1113L8206
535B1405J4726K9233n363o0237m2205j1524p747K8052N7989L0116L530j0765m4413
548B797m2918q879n431J2595O1916M2500j3206j2271j6551n5970l3299K2749K6376
561a9592K4763L8875J4293j7553k3046m1139m2266P413L3722K9720M2049K3728
573G0967l1823m0804k2568k8807p082M0677L6907J3711J9402N69m0208l9391k0203
$$ plain form
586 -48653 -54227 -29592 9857 35031 53277 55668 14016 -36840 -50554 -46162 -34344 5158 48184
599 48184 55862 37253 8111 -26352 -44827 -42716 -30029 -1809 36269 53249 41497 17549
611 17549 -16818 -50361 -55710 -30278 4849 38684 57392 42827 5530 -25181 -40135 -45097
623 -45097 -31566 3761 36215 45494 36479 16930 -12042 -40492 -52931 -37113 2810 38467
635 38467 47754 39719 20923 -18349 -52971 -47056 -20348 1319 28608 48980 36730 10429 -11042
648 -11042 -36569 -48440 -28963 -775 23477 46193 45431 16922 -12193 -38812 -55150 -31749
660 -31749 8727 27502 40511 47411 14863 -26738 -34608 -33532 -32328 -4254 28415 37169 37454
673 37454 24270 -12245 -37039 -40076 -36843 -8599 34439 44438 32272 22925 -8325 -45657 -41820
$$ packed form
586d8653n574K4635L9449K5174J8246K391m1652n0856j3714M392J1818L9502M3026
599D8184P678j8609k9142l4463j8475K111J2687K8220L8078J6980j1752k3948
611A7549l4367l3543n349K5432L5127L3835J8708j4565l7297l0711j4954m962
623d5097J3531L5327L2454R279r015j9549k8972k8450j2439J5818L9923L5657
635C8467R287q035j8796l9272l4622N915K6708K1667K7289K0372j2250k6301k1471
648a1042k5527j1871J9477K8188K4252K2716p62k8509k9115k6619j6338K3401
660c1749M0476J8775J3009O900l2548m1601p870J076J204K8074L2669Q754K85
673C7454j3184l6515k4794l037L233K8244M3038R999j2166r347l1250l7332L837
$$ plain form
686 -41820 -20568 -8246 20524 48248 35490 11270 -5357 -31947 -44435 -26010 -5331 15566
698 15566 42797 41579 13514 -5011 -26585 -50444 -34747 4102 20808 32913 44115 20478
710 20478 -16668 -29719 -34750 -32297 -5909 21285 32561 38157 23850 -11560 -30303 -32273 -34404
723 -34404 -12813 26360 37495 29234 22816 -627 -33940 -39547 -25266 -10239 16090 38382 35316
736 35316 18512 -3554 -29942 -37880 -24741 -9552 11918 37513 37463 14177 -2221 -19717 -39987
749 -39987 -34092 -4552 17034 29790 35805 21821 -4642 -24872 -35148 -29751 -7811 14154 28617
762 28617 35848 23060 -5673 -25250 -30470 -29875 -13249 16459 32226 29499 20507 1471 -23032
775 -23032 -35395 -28510 -10297 12696 29485 32023 21427 326 -23889 -33920 -25505 -10406 8612
$$ packed form
686d1820K1252J2322K8770K7724j2758k4220j6627k6590j2488J8425K0679K0897
698A5566K7231j218k8065j8525k1574k3859J5697L8849J6706J2105J1202k3637
710B0478l7146j3051n031K453K6388K7194J1276N596j4307l5410j8743j970k131
723c4404K1591L9173J1135q261o418k3443l3313n607J4281J5027K6329K2292l066
736C5316j6804k2066k6388p938J3139J5189K1470K5595n0k3286j6398j7496k0270
749c9987N895K9540K1586J2756O015j3984k6463k0230j0276N397K1940K1965J4463
762B8617P231j2788k8733j9577n220N95J6626K9708J5767k727q992j9036k4503
775b3032j2363O885J8213K2993J6789K538j0596k1101k4215j0031Q415J5099J9018
$$ plain form
788 8612 29174 34280 19513 -1066 -18985 -31841 -29517 -10535 11691 26810 31193 20730 576
801 576 -19289 -31586 -28213 -10600 10168 25286 31078 22245 350 -20347 -28859 -26442 -13075
814 -13075 8281 26635 30791 19962 985 -17498 -28684 -27374 -12899 8921 25319 28734 20289
827 20289 4013 -16588 -30219 -26991 -11056 7389 22776 29436 21536 2324 -16941 -27149 -25462
840 -25462 -13246 5670 23469 29685 19946 2312 -14363 -26133 -27151 -12835 7740 21946 26015
853 26015 20757 5284 -14702 -27422 -25311 -12053 4826 20054 27702 21553 3278 -14973 -23872
866 -23872 -23545 -14755 3489 22331 26915 18313 4644 -11183 -24839 -26525 -12776 5624 19426
879 19426 24331 19948 6775 -12541 -25539 -23610 -11426 2223 16610 26773 21649 3348 -12306
$$ packed form
788H612K0562N106j4767k0579j7919j2856K324J8982K2226J5119M383j0463k0154
801E76j9865j2297L373J7613K0768J5118N792q833k1895k0697q512K417J3367
814a3075K1356J8354M156j0829j8977j8483j1186J310J4475K1820J6398L415q445
827B0289j6276k0601j3631L228J5935J8445J5387O660p900j9212j9265j0208J687
840b5462J2216J8916J7799O216r739j7634j6675j1770j018J4316K0575J4206M069
853B6015n258j5473j9986j2720K111J3258J6879J5228P648o149j8275j8251q899
866b3872L27Q790J8244J8842M584q602j3669j5827j3656j686J3749J8400J3802
879A9426M905m383j3173j9316j2998J929J2184J3649J4387J0163n124j8301j5654
$$ plain form
892 -12306 -21094 -23885 -15390 3194 19570 24394 18917 5675 -9868 -22140 -24431 -13407 3585
905 3585 16258 22102 21413 7805 -13272 -22420 -19841 -13926 -1326 17294 26276 18017 4344 -7973
919 -7973 -18957 -23741 -15690 1613 18178 22925 16653 7133 -5516 -21537 -25258 -11531 2693
932 2693 12523 21917 21933 6394 -9970 -18128 -21532 -15399 1585 15416 20110 18213 7717 -7056
946 -7056 -17927 -22360 -16234 1698 15441 18045 18862 12340 -8826 -23355 -18174 -10441 -3360 12141
960 12141 22605 17668 7109 -6131 -18162 -19361 -12515 -3410 11377 23483 17361 5596 -2614
973 -2614 -16523 -24421 -13081 954 8864 20194 21387 5335 -8310 -13472 -19176 -15251 -106
986 -106 10993 16830 19720 8670 -7177 -12858 -17706 -18804 -2314 15862 16619 15407 12129 -4880
$$ packed form
892a2306q788k791Q495J8584J6376M824n477j3242j5543j2272k291J1024J6992
905C585J2673N844o89j3608k1077r148K579N915J2600J8620Q982q259j3673j2317
919g973j0984m784Q051J7303J6565M747o272r520j2649j6021l721J3727J4224
932B693R830R394J6j5539j6364q158l404O133J6984J3831M694j897j0496j4773
946g056j0871m433O126J7932J3743K604Q17o522k1166j4529N181P733P081J5501
960A2141J0464m937j0559j3240j2031j199O846R105J4787J2106o122j1765q210
973b614j3909p898J1340J4035P910J1330J193j6052j3645n162n704L925J5145
986a06J1099N837K890j1050j5847n681m848j098J6490J8176P57j212l278j7009
$$ plain form
1000 -4880 -18849 -17246 -12478 -3998 11972 18422 13880 10314 -1897 -17658 -18024 -10320 -5559 7688
1014 7688 21647 16963 5153 -1150 -13509 -21793 -11976 -269 6599 16631 18320 6224 -2797
1027 -2797 -10445 -19808 -15030 -268 7317 14091 20992 9915 -7157 -12042 -15111 -16448 -3045 12123
1041 12123 14599 14312 9979 -3697 -12754 -14022 -13974 -5731 9337 14228 12784 12500 1715 -15258 -18129
1056 -18129 -12028 -5601 7254 18652 16451 6529 -2336 -12732 -16441 -10037 -2478 4601 14040 14950
1070 14950 7137 708 -7564 -17410 -15246 -3376 5543 13318 18470 11341 -3067 -12182 -15401 -13366
1084 -13366 -3232 7763 13439 14798 8605 -3129 -9851 -11780 -12239 -6462 5718 12640 12911 10579
1098 10579 2322 -10204 -16671 -13613 -5131 5833 14678 15292 8573 -1273 -11183 -14257 -10058 -4545
$$ packed form
1000d880j3969J603M768Q480J5970O450m542l566j2211j5761l66P704M761J3247
1014G688J3959m684j1810o303j2359q284R817J1707O868J0032J689j2096r021
1027b797p648r363M778J4762P585O774O901j1077j7072m885l069j337J3403J5168
1041A2123K476k87m333j3676r057j268M8Q243J5068M891j444k84j0785j6973k871
1056a8129O101O427J2855J1398k201r922q865j0396l709O404P559P079R439R10
1070A4950p813o429q272r846K164J1870Q919P775N152p129j4408r115l219K035
1084a3366J0134J0995N676J359o193j1734o722j929m59N777J2180O922K71k332
1098A0579q257j2526o467L058Q482J0964Q845O14o719r846r910l074M199N513
$$ plain form
1112 -4545 3624 12502 14645 7969 289 -6989 -14189 -14350 -4948 5441 11827 14152 9597 747 -9070
1127 -9070 -14567 -12679 -4342 4548 11283 14664 9693 -898 -9192 -11905 -12085 -6554 4339 11909 12655
1142 12655 9033 1780 -7532 -13965 -12995 -5092 4748 10805 12339 9809 1853 -8710 -13085 -10584 -5953
1157 -5953 1667 11290 14265 9025 425 -7584 -12488 -11798 -5481 3676 11326 11850 7571 2074 -5710
1172 -5710 -12954 -12048 -4432 2465 8621 13490 10158 834 -7126 -11500 -11731 -5992 2656 9850 13160
1187 13160 8899 440 -5939 -10758 -12638 -5615 4155 9152 10212 9342 3041 -6686 -11211 -10469 -6259
1202 -6259 1359 8969 12064 10096 2194 -6862 -11062 -9988 -6662 1219 10013 11862 7378 2589 -4461
1217 -4461 -11516 -11131 -5241 1477 8044 11601 8685 2482 -4848 -10753 -10502 -5264 615 7289 12117
$$ packed form
1112d545Q169Q878K143o676p680p278p200j61R402J0389O386K325m555q850r817
1127i070n497J888Q337Q890O735L381m971j0591q294k713j80N531J0893P570P46
1142A2655l622p253r312o433R70P903R840O057J534k530p956j0563m375K501M631
1157e953P620R623K975n240q600q009m904O90O317R157P650N24m279n497p784
1172e710p244R06P616O897O156M869l332r324p960m374k31N739Q648P194L310
1187A3160m261q459o379m819j880P023R770M997J060q70o301r727m525P42M210
1202f259P618P610L095j968p902r056m200J074L326P881Q794J849m484m789p050
1217d461p055L85N890O718O567L557k916o203p330n905K51N238N879O674M828
$$ plain form
1232 12117 9446 1134 -5032 -9281 -11117 -6890 1967 8411 10342 8516 2729 -4490 -9365 -10517 -6589
1247 -6589 1180 7438 9944 9104 3514 -5257 -9716 -9333 -6266 -53 7594 10657 8220 2806 -3686
1262 -3686 -9066 -10213 -6246 690 7727 10128 8206 2880 -3347 -8948 -10368 -5722 591 6162 9915
1277 9915 8859 2975 -4291 -8553 -9898 -6285 -56 6403 9621 8264 2531 -3380 -7838 -9615 -6762
1292 -6762 335 6841 8931 8080 3698 -2791 -8861 -9544 -5804 -48 5407 9116 8490 3326 -3360 -7970
1308 -7970 -8552 -5933 -974 5530 9475 8008 2965 -2311 -6966 -9374 -6291 -11 5330 8179 7902
1323 7902 3997 -2491 -7905 -8704 -5789 -985 4577 8772 8644 3314 -2952 -6730 -8144 -6859 -1237
1338 -1237 5743 8743 7070 3412 -1438 -6582 -9419 -6012 -70 4637 7560 7866 4366 -2088 -7261
$$ packed form
1232A2117k671q312o166m249j836M227Q857O444J931j826n787p219m875j152L928
1247f589P769O258K506q40n590q771m459L83L067O213P647L063k437n414o492
1262c686n380j147L967O936P037K401j922n326o227n601j420M646O313N571L753
1277I915j056n884p266m262j345L613O229O459L218j357n733n911m458j777K853
1292f762P097O506K090q51m382o489o070o83L740N756N455L709o26n164o686m610
1308g970n82K619M959O504L945j467n043n276m655k408L083O280N341K849k77
1323G902l905o488n414p99K915M804N562M195j28n330o266l778j414J285N622
1338a237O980L000j673l658m850n144k837L407N942M707K923L06l500o454n173
$$ plain form
1353 -7261 -8079 -5374 -1429 4138 8326 8149 3069 -2124 -5864 -7995 -6703 -866 4823 7523 6774 4261
1369 4261 -1129 -6594 -8240 -5674 -687 3690 7171 7582 4177 -2228 -6249 -7165 -5714 -1924 3863
1384 3863 8063 6921 3211 -937 -5290 -7755 -6226 -1161 4035 6511 6591 4406 -724 -6125 -7769
1399 -7769 -5116 -1300 2649 6860 7491 3496 -1343 -5010 -6800 -6150 -1749 3597 6901 6468 3776 -667
1415 -667 -5105 -7376 -5956 -1174 3087 5887 6651 4496 -884 -5312 -6660 -5147 -2333 2862 6780
1430 6780 6839 3522 -707 -4733 -6867 -5961 -1785 3173 6760 6199 3559 -45 -4298 -6924 -5193 -1170
1446 -1170 2207 5553 7056 4250 -834 -4107 -6361 -6111 -1912 2659 5739 6653 4221 -769 -4520
1461 -4520 -6006 -5691 -1895 3039 5259 5125 4410 281 -4799 -5521 -4777 -2429 2034 5378 5917 4300
$$ packed form
1353g261q18K705L945N567M188j77n080n193l740k131J292N837N689K700p49k513
1369D261n390n465j646K566M987M377L481M11l405o405m021r16J451L790N787
1384C863M200j142l710m148m353k465J529N065N196K476Q0k185n130n401j644
1399g769K653L816L949M211O31l995m839l667j790O50M401N346L304m33k692m443
1415f67m438k271J420M782M261K800P64k155n380m428j348J513K814N195L918
1430F780N9l317m229m026k134R06M176M958L587n61k640l604m253k626J731M023
1446a170L377L346J503k806n084l273k254K50M199M571L080R14k432m990l751
1461d520j486L15L796M934K220j34p15m129n080p22P44K348M463L344N39j617
$$ plain form
1477 4300 798 -4524 -6823 -4675 -2368 1518 6202 6601 2917 -60 -3445 -6243 -5013 -1491 1675
1492 1675 4591 6170 3866 147 -2624 -6108 -6406 -1795 2032 4425 6699 4995 -1026 -3813 -4493
1507 -4493 -5582 -2777 2585 4883 4942 4155 733 -3802 -4852 -5047 -3428 1844 5091 4393 4210 1911
1523 1911 -3826 -6622 -4171 -2075 527 5330 6448 2643 265 -2332 -5534 -5156 -2040 681 4256
1538 4256 5711 3521 663 -2095 -5517 -6326 -1413 2329 3046 5311 5236 14 -3689 -3920 -4813 -3095
1554 -3095 1178 4076 4941 4533 1064 -3356 -4676 -4610 -3640 1391 5198 4554 3364 2041 -2546 -6147
1570 -6147 -3815 -1399 7 3544 5495 3094 763 -1468 -4525 -5133 -2242 194 3176 6296 4049
1585 4049 -252 -1764 -4133 -6123 -1907 2611 2972 3734 4597 708 -3109 -3217 -3970 -3803 912 3632
$$ packed form
1477D300l502n322k299K148K307L886M684L99l684k977l385k798J230L522L166
1492A675K916J579k304l719k771l484k98M611L827K393K274j704o021k787o80
1507d493j089K805N362K298N9p87l422m535j050j95J619N272L247o98j83k299
1523A911n737k796K451K096K602M803J118l805k378k597l202L78L116K721L575
1538D256J455k190k858k758l422q09M913L742P17K265p5n222l703k31q93J718
1554c095M273K898Q65m08l469m420j320O6R70N031L807o44j190j323m587l601
1570f147K332K416J406L537J951k401k331k231l057o08K891K436K982L120k247
1585D049m301j512k369j990M216M518L61P62Q63l889l817j08p53J67M715K720
$$ plain form
1601 3632 3806 4816 1897 -2976 -4175 -3409 -3851 -105 4903 4357 2539 2122 -1539 -5707 -3839 -1510
1617 -1510 -351 2881 5468 2801 994 -758 -4304 -4945 -1789 -146 1910 5812 4416 -375 -1114
1632 -1114 -2782 -5753 -2844 1966 2187 3541 4770 1259 -2280 -2920 -4100 -3807 843 3417 3266 4066
1648 4066 2268 -2750 -3756 -2916 -3629 -923 3891 3855 2663 2315 -809 -4936 -3719 -2104 -725 2860
1664 2860 4786 2676 1316 -472 -4244 -4832 -1631 11 1564 4982 3779 494 -1137 -2879 -4557
1679 -4557 -2624 442 1795 3711 4522 1335 -1819 -2827 -3863 -3427 437 2875 2989 3584 1964 -1824
1695 -1824 -3572 -2855 -2823 -712 2626 3675 2993 1807 -1123 -3624 -3366 -2272 -985 2402 4286 2976
1711 2976 984 -128 -3215 -4488 -2393 69 1685 3664 3590 1043 -1114 -2508 -3982 -2549 114
$$ packed form
1601C632J74J010k919m873j199P66m42L746N008n46j818m17l661m168J868K329
1617a510J159L232K587k667j807j752l546o41L156J643K056L902j396m791p39
1632a114j668k971K909M810K21J354J229l511l539o40j180K93M650K574j51Q00
1648D066j798n018j006Q40p13K706M814l6j192l48l124m127J217J615J379L585
1664B860J926k110j360j788l772n88L201J642J553L418j203l285j631j742j678
1679d557J933L066J353J916Q11l187l154j008j036M36L864K438J14N95j620l788
1695a824j748P17L2K111L338J049o82j186k930k501K58J094J287L387J884j310
1711B976j992j112l087j273K095K462J616J979p4k547k157j394j474J433K663
$$ plain form
1726 114 1752 3266 3723 1535 -1260 -2337 -3480 -3372 -341 2635 2962 3104 2081 -671 -3094 -3475
1742 -3475 -2603 -491 2032 3071 3147 2139 -698 -3259 -3037 -2104 -732 1419 3871 2979 1082 -71
1758 -71 -2322 -3783 -2637 -276 1554 3114 3219 1589 -444 -2608 -3495 -2541 -387 1243 2886 3616
1774 3616 1701 -908 -2378 -2951 -3086 -701 1647 3061 2794 1610 -401 -2335 -3335 -2701 -374 1837
1790 1837 2619 3048 2040 -560 -2766 -3162 -2109 -1148 1107 3022 3066 1514 -395 -2129 -3117 -2557 -722
1807 -722 1782 2917 2545 1498 -52 -2024 -3272 -2436 -329 1155 2548 3192 2170 -276 -2576 -2962
1823 -2962 -2429 -1072 1065 2777 3154 1633 -305 -1709 -2743 -2657 -873 1539 2561 2398 1958 217
1839 217 -2438 -3129 -2153 -787 845 2641 3179 1620 -42 -1845 -2616 -2298 -908 1216 2449 2784 1733
$$ packed form
1726A14J638J514M57k188k795j077j143J08L031K976L27J42j023k752k423l81
1742c475Q72K112K523J039P6j008k837k561K22R33J372K151K452q92j897j153
1758g1k251j461J146K361J830J560J05j630k033k164q87R54K154J630J643P30
1774C616j915k609j470n73j35K385K348J414k67j184k011j934j000O34K327K211
1790A837P82M29j008k600k206l96J053R61K255J915M4j552j909j734r88N60J835
1807g22K504J135l72j047j550j972j248Q36K107J484J393O44j022k446k300l86
1823b962N33J357K137J712L77j521j938j404j034Q6J784K412J022j63m40j741
1839B17k655o91R76J366J632J796N38j559j662j803p71L18J390K124J233L35j051
$$ plain form
1856 1733 -91 -1810 -2985 -2603 -761 1073 2414 2566 1678 -55 -1823 -2691 -2309 -948 777 2318
1872 2318 2663 1816 -178 -1398 -2664 -2590 -1016 1111 2164 2531 1791 92 -1777 -2491 -1912 -925 861
1889 861 2016 2396 1911 34 -1519 -2475 -2231 -1058 524 2239 2803 1836 -90 -1645 -2289 -2069 -1053
1906 -1053 522 2304 2400 1542 135 -1574 -2450 -1986 -1097 714 1993 2847 1782 140 -1212 -2112 -2187
1923 -2187 -1003 454 2021 2473 1584 121 -1597 -2273 -2481 -1147 827 2345 2207 1386 286 -1280
1939 -1280 -2530 -2063 -760 411 1824 2177 1778 421 -1604 -2352 -1904 -935 237 1947 2381 1657 406
1956 406 -851 -2093 -2385 -902 351 1752 2481 1735 292 -1122 -2241 -2069 -696 716 1344 2401
1972 2401 1787 21 -1503 -1563 -1881 -1543 196 1729 2276 1640 330 -1181 -2002 -2137 -1259 258 1770
$$ packed form
1856A733j824j719j175L82J842J834J341J52q88j733j768q68L82J361J725J541
1872B318L45q47j994j220j266P4J574K127J053L67p40j699j869p14N79R87J786
1889H61J155L80m85j877j553r56K44J173J582J715N64r67j926j555o44K20J016
1906a053J575J782R6q58j407j709q76M64Q89J811J279Q54j065j642j352r00p5
1923b187J184J457J567M52q89j463j718o76k08J334J974J518j38q21j100j566
1939a280j250M67J303J171J413L53l99j357k025p48M48R69J172J710M34p24j251
1956D06j257j242k92J483J253J401P29p46j443j414j119J72J373J412O28J057
1972B401o14j766j524o0l18L38J739J533N47o36j310j511q21j35Q78J517J512
$$ plain form
1989 1770 1866 1853 604 -1722 -2309 -1307 -982 -154 1569 2438 1450 402 -618 -2146 -2547 -1112 39
2006 39 1604 2086 1684 545 -834 -2012 -2190 -585 307 1311 1844 1767 465 -919 -1293 -1856 -1432 188
2024 188 1300 1764 1835 369 -1016 -1493 -2125 -1471 356 1288 1677 1639 991 -1067 -2072 -1708 -918 -18 1489
2043 1489 1871 1505 687 -847 -1750 -1774 -1085 -47 1304 2065 1223 394 -458 -1689 -2206 -841 48 1126
2061 1126 2110 1895 842 -591 -1614 -1874 -1266 98 1149 1781 1936 313 -882 -1275 -1327 -1301 -68 1455
2079 1455 1398 1224 794 -410 -1967 -1624 -909 -259 1119 1961 1922 571 -330 -1828 -1799 -919 -271 876 2052
2098 2052 1378 297 -427 -967 -1773 -1158 182 629 1480 1683 753 -259 -1392 -1640 -1315 333 1096 1328
2116 1328 1706 801 -915 -1298 -1197 -1378 -279 1094 1377 1223 825 -354 -1297 -1183 -1268 -586 775 1666
$$ packed form
1989A770R6j3j249k326n87J002L25Q28J723Q69r88j048j020j528m01J435J151
2006C9J565M82m02j139j379j178j78J605Q92J004N33p7j302j384l74n63M24J620
2024A88J112M64P1j466j385m77o32O54J827R32L89l8o48k058j005L64P90R00J507
2043A489L82l66q18j534r03k4O89J038J351P61q42q29q52j231n17J365Q89J078
2061A126R84k15j053j433j023k60O08J364J051O32J55j623j195l93n2K6J233J523
2079A455n7j74m30j204j557L43P15O50J378Q42l9j351r01j498K9Q80O48J147J176
2098B052o74j081p24n40q06O15J340M47Q51K03r30j012j133k48L25J648P63K32
2116A328L78r05j716l83J01j81J099J373K83j54l98j179r43J14q5O82J361Q91
$$ plain form
2134 1666 1329 625 -73 -1682 -1604 -726 -237 690 1792 1672 474 -386 -944 -1831 -1213 -194 459 1691
2152 1691 1752 478 -442 -779 -1863 -1410 132 903 1142 1635 841 -209 -1417 -1444 -1049 -397 1291 1394
2170 1394 1290 870 -500 -1313 -1086 -1248 -500 775 1389 1037 740 87 -875 -1795 -1262 -242 625 1190 1374
2189 1374 836 -213 -1117 -1443 -1048 -141 167 1355 1643 664 -167 -886 -1216 -1197 -41 831 1117 957 872
$$ packed form
2134A666l37p04o98j609P8Q78M89R27J102j20j198q60n58q87O18J019O53J232
2152A691O1j274r20l37j084M53J542P71K39M93p94j050j208k7L95O52J688J03
2170A394j04m20j370q13K27j62P48J275O14l52k97o53r62r20N33J020Q67N65J84
2189A374n38j049r04l26L95R07L08J188K88r79q31p19l30J9J156Q72K86j60q5
$$ [...]
8191c9
##END NTUPLES=NMR FID
##END=
