##TITLE=1H_SR92_oil2
 cd3Od
 8 sc, 
 28.10.2021
##JCAMPDX= 6.0         $$ Bruker NMR JCAMP-DX V2.0
##DATA TYPE= NMR FID
##DATA CLASS= NTUPLES
##ORIGIN= UXNMR, Bruker Analytische Messtechnik GmbH
##OWNER= root
$$ XWIN-NMR		Version 3.5
$$ Thu Oct 28 11:27:26 2021 Russian Standard Time (UT+4h)  she@DPX200
##.OBSERVE FREQUENCY= 200.1313468511
##.OBSERVE NUCLEUS= ^1H
##.DELAY= (6, 6)
##.ACQUISITION MODE= SIMULTANEOUS
##.ACQUISITION SCHEME= undefined
##.AVERAGES= 8
##.DIGITISER RES= 18
##SPECTROMETER/DATA SYSTEM= spect
##.PULSE SEQUENCE= zg30
##.SOLVENT NAME= D2O
##.SHIFT REFERENCE= (INTERNAL, D2O, 0, 15.7039)
##AUDIT TRAIL= $$ (NUMBER, WHEN, WHO, WHERE, WHAT)
$$ ##TITLE= Audit trail, XWIN-NMR		Version 3.5
$$ ##JCAMPDX= 5.01
$$ ##ORIGIN= Bruker BioSpin GmbH
$$ ##OWNER= she
$$ F:/spectra/data/she/nmr/H-F/1/audita.txt
$$ ##AUDIT TRAIL=  $$ (NUMBER, WHEN, WHO, WHERE, WHAT)
(   1,<2021-10-28 11:26:10.75 +0400>,<she>,<DPX200>,
      <created by zg, POWCHK disabled, PULCHK disabled
       configuration hash MD5:
       00 E9 B6 7A A2 85 ED C7 34 08 36 98 17 FE 4E 26
       data hash MD5: 16K
       1A 8C E2 33 19 67 47 93 FD CB D4 61 13 2D E3 A4>)
$$ ##END=
$$ 
$$ hash MD5
$$ 3D 93 98 D4 DD EC 1B 63 52 6D 83 BE FF AD E4 57
##$RELAX= 
##$RELAX= 
##$RELAX= 
##$RELAX= 
##$RELAX= 
##$RELAX= 
$$ Bruker specific parameters
$$ --------------------------
##$DU= <F:/spectra>
##$EXPNO= 1
##$NAME= <H-F>
##$PROCNO= 1
##$TYPE= <nmr>
##$USER= <she>
##$AMP= (0..31)
100 100 100 100 100 100 100 100 100 100 100 100 100 100 100 100 100 100 
100 100 100 100 100 100 100 100 100 100 100 100 100 100 
##$AQSEQ= 0
##$AQ_mod= 1
##$AUNM= <au_zg>
##$AUTOPOS= <>
##$BF1= 200.13
##$BF2= 200.13
##$BF3= 200.13
##$BF4= 200.13
##$BF5= 200.13
##$BF6= 200.13
##$BF7= 200.13
##$BF8= 200.13
##$BYTORDA= 1
##$CFDGTYP= 0
##$CFRGTYP= 5
##$CHEMSTR= <none>
##$CNST= (0..31)
1 1 145 1 1 1 1 1 1 1 1 1 1 1 1 1 1 1 1 1 1 1 1 1 1 1 1 1 1 1 1 1 
##$CPDPRG= <>
##$CPDPRG1= <>
##$CPDPRG2= <>
##$CPDPRG3= <>
##$CPDPRG4= <mlev>
##$CPDPRG5= <mlev>
##$CPDPRG6= <mlev>
##$CPDPRG7= <mlev>
##$CPDPRG8= <mlev>
##$CPDPRGB= <>
##$CPDPRGT= <>
##$D= (0..31)
0 1.2 0 0 0 0 0 0 0 0.06 0 0.03 0 0 0 0 0.0002 0 0 0 0 0 0 0 0 0 0 0 0 
0 0 0 
##$DATE= 1635405970
##$DBL= (0..7)
120 120 120 120 120 120 120 120 
##$DBP= (0..7)
150 150 150 150 150 150 150 150 
##$DBP07= 0
##$DBPNAM0= <>
##$DBPNAM1= <>
##$DBPNAM2= <>
##$DBPNAM3= <>
##$DBPNAM4= <>
##$DBPNAM5= <>
##$DBPNAM6= <>
##$DBPNAM7= <>
##$DBPOAL= (0..7)
0.5 0.5 0.5 0.5 0.5 0.5 0.5 0.5 
##$DBPOFFS= (0..7)
0 0 0 0 0 0 0 0 
##$DE= 6
##$DECBNUC= <off>
##$DECIM= 32
##$DECNUC= <off>
##$DECSTAT= 4
##$DIGMOD= 1
##$DIGTYP= 9
##$DL= (0..7)
0 120 120 120 120 120 120 120 
##$DP= (0..7)
150 150 150 150 150 150 150 150 
##$DP07= 0
##$DPNAME0= <>
##$DPNAME1= <>
##$DPNAME2= <>
##$DPNAME3= <>
##$DPNAME4= <>
##$DPNAME5= <>
##$DPNAME6= <>
##$DPNAME7= <>
##$DPOAL= (0..7)
0.5 0.5 0.5 0.5 0.5 0.5 0.5 0.5 
##$DPOFFS= (0..7)
0 0 0 0 0 0 0 0 
##$DQDMODE= 0
##$DR= 18
##$DS= 0
##$DSLIST= <SSSSSSSSSSSSSSS>
$$ [...]
##$SUBNAM2= <"">
##$SUBNAM3= <"">
##$SUBNAM4= <"">
##$SUBNAM5= <"">
##$SUBNAM6= <"">
##$SUBNAM7= <"">
##$SUBNAM8= <"">
##$SUBNAM9= <"">
##$SW= 18.0517286264689
##$SWIBOX= (0..15)
0 0 2 0 0 0 0 0 0 0 0 0 0 0 0 0 
##$SW_h= 3612.71676300578
##$TD= 16384
##$TD0= 1
##$TE= 0
##$TE2= 300
##$TE3= 300
##$TEG= 300
##$TL= (0..7)
0 120 120 120 120 120 120 120 
##$TP= (0..7)
150 150 150 150 150 150 150 150 
##$TP07= 0
##$TPNAME0= <>
##$TPNAME1= <>
##$TPNAME2= <>
##$TPNAME3= <>
##$TPNAME4= <>
##$TPNAME5= <>
##$TPNAME6= <>
##$TPNAME7= <>
##$TPOAL= (0..7)
0.5 0.5 0.5 0.5 0.5 0.5 0.5 0.5 
##$TPOFFS= (0..7)
0 0 0 0 0 0 0 0 
##$TUNHIN= 0
##$TUNHOUT= 0
##$TUNXOUT= 0
##$USERA1= <user>
##$USERA2= <user>
##$USERA3= <user>
##$USERA4= <user>
##$USERA5= <user>
##$V9= 5
##$VALIST= <valist>
##$VCLIST= <CCCCCCCCCCCCCCC>
##$VD= 0
##$VDLIST= <DDDDDDDDDDDDDDD>
##$VPLIST= <PPPPPPPPPPPPPPP>
##$VTLIST= <TTTTTTTTTTTTTTT>
##$WBST= 1024
##$WBSW= 4
##$XGAIN= (0..3)
0 0 0 0 
##$XL= 0
##$YL= 0
##$YMAX_a= 246634
##$YMIN_a= -324214
##$ZGOPTNS= <>
##$ZL1= 120
##$ZL2= 120
##$ZL3= 120
##$ZL4= 120
##$ABSF1= 10
##$ABSF2= 0
##$ABSG= 5
##$ABSL= 3
##$ALPHA= 0
##$AQORDER= 0
##$ASSFAC= 0
##$ASSFACI= 0
##$ASSFACX= 0
##$ASSWID= 0
##$AUNMP= <proc_1d>
##$AZFE= 0.1
##$AZFW= 0.1
##$BCFW= 1
##$BC_mod= 2
##$BYTORDP= 1
##$COROFFS= 0
##$CY= 11.3945322036743
##$DATMOD= 1
##$DC= 2
##$DFILT= <>
##$DTYPP= 0
##$F1P= 2.36226072786647
##$F2P= -0.459571619588291
##$FCOR= 0.5
##$FTSIZE= 0
##$FT_mod= 4
##$GAMMA= 1
##$GB= 0.15
##$INTBC= 1
##$INTSCL= 1
##$ISEN= 128
##$LB= 0.24
##$LEV0= 0
##$LPBIN= 0
##$MAXI= 10000
##$MC2= 0
##$MEAN= 0
##$ME_mod= 0
##$MI= 1.114404
##$NCOEF= 0
##$NC_proc= 0
##$NLEV= 6
##$NOISF1= 3.799351
##$NOISF2= 2.8
##$NSP= 1
##$NTH_PI= 0
##$NZP= 0
##$OFFSET= 15.70392
##$PC= 1
##$PHC0= -15153.09
##$PHC1= 8.40082
##$PH_mod= 1
##$PKNL= yes
##$PPARMOD= 0
##$PSCAL= 0
##$PSIGN= 0
##$REVERSE= no
##$SF= 200.130013532006
##$SI= 16384
##$SIGF1= 3
##$SIGF2= 2
##$SINO= 400
##$SIOLD= 16384
##$SREGLST= <1H.CDCl3>
##$SSB= 0
##$STSI= 0
##$STSR= 0
##$SW_p= 3612.71676300578
##$SYMM= 0
##$S_DEV= 0
##$TDeff= 0
##$TDoff= 0
##$TI= <>
##$TILT= no
##$TM1= 0
##$TM2= 0
##$TOPLEV= 0
##$USERP1= <user>
##$USERP2= <user>
##$USERP3= <user>
##$USERP4= <user>
##$USERP5= <user>
##$WDW= 1
##$XDIM= 8192
##$YMAX_p= 0
##$YMIN_p= 0
$$ End of Bruker specific parameters
$$ ---------------------------------
##NTUPLES= NMR FID
##VAR_NAME=  TIME,          FID/REAL,        FID/IMAG
##SYMBOL=    X,             R,               I
##VAR_TYPE=  INDEPENDENT,   DEPENDENT,       DEPENDENT
##VAR_FORM=  AFFN,          ASDF,            ASDF
##VAR_DIM=   8192,          8192,            8192
##UNITS=     SECONDS,       ARBITRARY UNITS, ARBITRARY UNITS
##FACTOR=    0.0002768,     1,               1
##FIRST=     0,             0,               0
##LAST=      2.2672688,     0,               0
##MIN=       0,             -324214,         0
##MAX=       2.2672688,     246634,          0
$$ Real data points
##PAGE= N=1
##DATA TABLE= (X++(R..R)), XYDATA
$$ [...]
1989a791K358J310K49m74n05j82j293j938r19N49K258K249O50n27q23q70k4j604
$$ -1791 567 1877 2126 1652 1147 965 -328 -2266 -3185 -2636 -378 1871 2521 1994 1171 301 277 -1327
2007a327r03n10J545K612J414j99j263j428o53k75r36n67N64K103K402N03j293
$$ -1327 -2230 -2740 -1195 1417 2831 2632 1369 -59 -712 -987 -1923 -2490 -1926 177 2579 3082 1789
2024A789j626j083o4o38k96j36J447K179J491n59j857j451p56L75l07q3P19J688
$$ 1789 163 -920 -984 -1622 -1918 -2054 -607 1572 3063 2504 647 -804 -1560 -1185 -1492 -1575 -856 832
2042H32J883L24j370k304j370J85O62M62j19R93J483J318l02k453k067m21P18
$$ 832 2715 3039 1669 -635 -2005 -1820 -1158 -696 -815 178 1661 2979 2677 224 -1843 -2264 -1546
2059a546Q15L69L27Q69J637J41j247k548j647K29J488J463J25J33Q30J118p00
$$ -1546 -731 -362 -35 834 2471 2612 1365 -1183 -2830 -2601 -1113 350 475 608 1438 2556 1856
2076A856k023k432m98J471J489J155p5K25P26J04j483j875j641N02J758J643O77
$$ 1856 -167 -2599 -3097 -1626 -137 1018 943 1168 1894 1998 515 -1360 -3001 -2499 -741 902 1579
2093A579m10j06N74q04j097k307m20J420K247J210q8p61j44k98o81j375j353M04
$$ 1579 1169 1063 1637 833 -264 -2571 -2991 -1571 676 1886 1798 1037 893 595 -86 -1461 -2814 -2410
2111b410K182K014O31r15q20m50J63j034j574o70J758K352J476k42j690r18k19
$$ -2410 -228 1786 2417 1502 682 232 395 -639 -2213 -2883 -1125 1227 2703 2461 771 -147 -366
2128c66k21r63p99P23J926J811R90j336j931r18N67k74m35m88R70K270J477n49
$$ -366 -587 -1550 -2349 -1626 300 2111 3101 1765 -166 -1084 -517 -791 -1226 -1714 -744 1526 3003 2454
2146B454k108j476l39M50K12j57r7J284J988O75j391k031j014k19J099J73k49
$$ 2454 346 -1130 -1469 -1019 -807 -964 -1061 223 2211 2886 1495 -536 -1550 -1769 -670 -497 -746
2163g46N43J770Q39o4j972k204l43R83R72k32J20R99J172M56j100k255j636O31
$$ -746 -203 1567 2406 2342 370 -1834 -2177 -1194 -222 -454 -334 665 1837 2293 1193 -1062 -2698 -2067
2181b067J406Q66J51J94P78O71j49j849k132n10J275J434J143o63J26L72Q13r17
$$ -2067 -661 205 356 550 1328 1999 1850 1 -2131 -2641 -1366 68 1211 548 674 1046 1859 942
2199I42k199j303L92J692J652J38o13K93J56k06j198j846o60J248K334Q96k67
$$ 942 -1257 -2560 -2168 -476 1176 1314 701 994 1150 944 -254 -2100 -2760 -1512 822 1718 1451
2216A451q36j13J45l23j254j440K32K168J694K89j073n17q1p2p06j512n20J348
$$ 1451 615 502 647 324 -930 -2370 -2138 30 1724 2013 940 423 342 270 -436 -1948 -2468 -1120
2234a120K185J113k25j436r05k1K39j083n59K69J635J818N42j119j624o19K59
$$ -1120 1065 2178 1953 517 -388 -409 -170 -1253 -1812 -1543 92 1910 2452 1333 -291 -910 -651
2251f51K15r23k01R80J346J566o63j268j165l65L12K56n45J99J040J831L87q12
$$ -651 -436 -1359 -1560 -580 766 2332 1669 401 -764 -1129 -817 -561 -1106 -907 133 1964 2351 1539
2269A539k176q39J04R34O6m98P75Q67J329l8j837j900k23R80N94jM34K70J381
$$ 1539 -637 -1476 -1372 -438 -372 -870 -95 772 2101 2063 226 -1674 -1897 -917 -323 -324 110 380 1761
2288A761L05j073k251r57M10J235R11m6k24Q63Q18k62j462j914m12J103J740K97
$$ 1761 2066 993 -1258 -2215 -1805 -570 341 295 71 934 1752 1490 28 -1886 -2298 -1195 545 842
2306H42j39k52N13K48q59j424j318N04J481J478J14m62l16K79Q1j078j479m15
$$ 842 703 451 964 1212 353 -1071 -2389 -1885 -404 1074 1188 726 410 689 770 -308 -1787 -2202
2324b202J110J920N25k90o12k73N21m78q91j221L1J402J727N71r06o79k19L21
$$ -2202 -1092 828 1353 1063 451 178 699 221 -670 -1891 -1860 -458 1269 1840 934 255 36 357
2342C57p14q59n26Q54J783J231n39j238n53Q1J38p10p16O7J392J328O10j088r67
$$ 357 -357 -1216 -1742 -888 895 2126 1587 349 -204 -123 15 -695 -1411 -1344 48 1376 1986 898 -69
2361f9o62K7L27m29n87Q35J312J520p04j347j148m4K48M94o85K28R46J423Q6p88
$$ -69 -731 -704 -377 -806 -1393 -558 754 2274 1570 223 -925 -969 -721 -227 -912 -684 262 1685 1771 983
2381I83j452q07J82O89J08l01N39J047Q38l66j428j459j39P71O56J63r2J59J229
$$ 983 -469 -1276 -1094 -405 -297 -598 -59 988 1826 1460 32 -1427 -1566 -795 -139 24 -68 91 1320
2400A320J1o56j601o63K97R45O13r6R8M48O46k19j147j566m35J048J379K54k34
$$ 1320 1331 675 -926 -1589 -1292 -347 266 170 268 716 1362 1143 -4 -1570 -2005 -957 422 676 442
2419D42n9N09K80o60j388r97L80J156J039L43n16j77P3O3p49j024k56Q05J442
$$ 442 383 892 1172 512 -876 -1873 -1493 -337 702 1045 529 352 425 488 -261 -1285 -1541 -736 706
2438G06L31k76m79o0L63m24q73q60J57J295J578j66p83l67j03j10k05p54m95N97
$$ 706 1037 761 282 222 585 161 -712 -1572 -1415 -120 1458 1292 509 142 39 -71 -276 -1030 -1525 -928
2458i28J441J020n29o96m53j56K00p22l81p4J315J207N17j030j101j6k04K75m69
$$ -928 513 1533 1004 308 -145 -301 -101 -823 -1204 -1278 37 1244 1761 731 -370 -386 -590 -315 -784
2477g84k55N71J223P89k22j237r13k1L73K86m45L01P09R48L3n80j308n04K11N25
$$ -784 -1039 -468 755 1544 1322 85 -828 -849 -476 -190 -635 -334 375 1323 1356 776 -532 -1036 -825 -300
2497c00K79l21J37Q00N52j53r14j160k30O02N01M15L4Q0M67M40o56j090q50M03
$$ -300 -21 -342 -205 595 1147 994 80 -1080 -1310 -708 -207 208 242 322 789 1229 573 -517 -1367 -964
2517i64Q18J61M18m61Q95j27N4j201p22j86M09J271J00j35L7K47J62l58j059n83
$$ -964 -146 15 433 -28 867 740 794 -407 -1129 -1315 -906 365 465 330 367 614 776 418 -641 -1224
2537a224K16Q03O95K92j42k86J10J7l59j124l87R97N81O02n4l68j35N8j59q61
$$ -1224 -1008 -205 490 782 640 354 464 481 122 -1002 -1389 -392 189 791 737 369 234 292 133 -728
2557g28n36M03P07R47M72o23m83J28k28m70l22l94N54R51O95k27o41n94R1j61
$$ -728 -1264 -861 -154 793 1265 642 159 287 59 -411 -733 -1127 -573 378 1073 846 205 -389 -298 -459
2577d59p6l28M02N57R15N2n72n94l37n4N9k20nL87O90P12l73m54q54N5j1J60j31
$$ -459 -535 -863 -461 96 1011 1063 491 -103 -440 -494 -435 -655 -660 -273 417 1129 756 302 -552 -497 -508 -348 -479
2600d79R1Q68M66K20o28q30n53R3M59L21k25M49L89J56k99m67o97m65P15L84K64
$$ -479 -388 480 946 1166 538 -292 -845 -752 -293 28 -197 252 641 797 498 31 -666 -1131 -416 -32 232
2621B32k07O3O97j05l07r37m01K40M74K99M74k29K51J57j61r46l38j11L57N76
$$ 232 25 88 785 680 373 -564 -965 -725 -251 48 522 293 544 701 540 -406 -744 -855 -498 78
2641G8K12K11j70L83l97l53m41m35J39M98O94K31k31j82J51k45m29l04k73L03
$$ 78 290 501 331 714 317 -36 -477 -912 -773 -275 419 650 419 237 388 143 -286 -590 -863 -560
2661e60R08N66m57k50n4j68k28Ro09p9P86M96L55K1n48o24L81k74k56lO56L70
$$ -560 348 914 457 207 153 -15 -243 -234 -843 -922 -136 360 715 736 188 -436 -55 -329 -585 -588 68 438
2683D38M54j46p91M8j58j29q0l50L36N64K97L03o68k03j72j01k58M63j9M1M38
$$ 438 892 746 -45 3 -155 -284 -364 -714 -378 186 483 786 118 -85 -257 -358 -616 -153 -172 -131 307
2704C07J39J16l97m77k52L5J07K14J13L31L54K65o17l95n94l7M81O3M04J52L84
$$ 307 446 562 165 -312 -564 -529 -422 -208 -95 236 590 855 238 -157 -751 -788 -307 -244 160 312 696
2725F96j55k51l24p48J75K94J69q5L38L28J8q5j47m97l11l1O45J6jN26k36j8j72
$$ 696 541 290 -34 -782 -607 -313 -144 -229 109 437 455 370 223 -274 -585 -616 29 45 44 570 334 316 144
2748A44l16n32l0M97K47M08K7J43k83o3m22m40J4L56M22P4K72j48q6m9j24k21
$$ 144 -172 -704 -734 -237 10 418 445 588 305 242 -180 -620 -606 -250 172 246 518 370 284 235 111 -110
2770a10n89J86L48J98M82j08j42Ql88M0m49k19L71L77M03Q6j66Q7l96l93o1l3
$$ -110 -699 -513 -165 33 515 407 265 273 -115 -75 -524 -743 -372 5 408 494 328 415 19 -374 -435 -468
2792d68J51K39K99N53k28m05j16j86k70l7P4K34L27L64k5q3l71j17l04l6P6PL18
$$ -468 -317 -78 221 774 546 141 25 -161 -431 -468 -394 -160 167 531 506 423 52 -65 -369 -405 -329 -322 -4
2815dK95L06l63K87q92m7p0L4O26j61L71O5k12j88j20m28J18L02l69L74O21j76
$$ -4 291 597 234 521 -371 -418 -488 -454 172 11 382 447 235 47 -73 -501 -383 -81 -450 -76 545 369
2837C69j2j59k04n55P0K18L26J43J9K04kk00j95n62J38k01L57L56K21K70l59o3
$$ 369 357 198 -6 -561 -491 -273 53 196 215 419 417 217 22 -540 -402 -603 -246 110 331 601 242 179
2859A79J59r77L03K6R0M57o1J10J83l49K00j75o43K55k69M56P5K61J62J34p43
$$ 179 338 -639 -336 -310 -220 237 176 286 469 120 320 145 -498 -243 -512 -56 19 280 442 576 -167
2880a67J59l29k86K23K84J52J07L66k85j28k47k76K81k38J57K45L54J81j34L0
$$ -167 -8 -337 -623 -400 -116 36 143 509 224 96 -151 -427 -146 -384 -227 18 372 553 419 449
2900D49n04j52J57l98K24J20R9L45k23J81m46p2k22J52K68J55L07n5m30L94l88
$$ 449 -55 -207 -50 -448 -224 -104 -5 340 117 298 -148 -220 -442 -290 -22 133 440 385 -45 349 -39
2921c9k58J07m32O20j1K78M3J72j77k94k38l94M03q7K51K35K55m6JQm35j3m49
$$ -39 -297 -190 -622 -2 -13 265 308 480 303 9 -229 -623 -220 -307 -56 179 434 388 389 397 -38 -51 -500
2944e00M03j05K12N93l21j81L3p0m50p6N0M35J12N7L46m7l27l45l0l0j64J59M17
$$ -500 -97 -202 10 603 282 101 134 64 -386 -462 -412 23 135 192 538 491 164 -181 -211 -241 -405 -246 171
2967A71l4L21k16r5k81m1k17O8K08K05L55j25P0m09k4k04J39k71L9J82K22K46
$$ 171 137 458 242 147 -134 -175 -392 -324 -116 89 444 319 389 -20 -44 -248 -109 -380 -341 -159 63 309
2989C09J96k41k64k03k40N1J81J08J50J99j20K12k59O4n35m4J01R3L79K92j52
$$ 309 505 264 0 -203 -443 -392 -211 -103 47 246 126 338 79 143 -392 -436 -335 -242 137 429 277
3010B77P9j12k79j55j69J63K4K70K59q2J23k48k29o0q8j21r4O51l2J29Mj90L0
$$ 277 356 244 -35 -190 -359 -196 -172 98 357 275 398 150 -79 -139 -227 -348 -442 209 177 306 310 120 150
3033A50k73k31N9p3K00L51L4N4k87J24j28j71k27J56K66P1K74k54Q4r3k04j93
$$ 150 -123 -354 -295 -368 -168 183 217 271 -16 108 -20 -191 -418 -262 4 75 349 95 179 86 -118 -311
3055c11K21j64L43L2L47r0n4k68l90K44l87L34l3K51J61J21j69k34J06l42k4M0
$$ -311 -90 -254 89 121 468 378 324 56 -334 -90 -477 -143 -176 75 236 357 188 -46 60 -282 -306 -266
3077b66J45L25K8J35K3k91k23l26J85jK67M8J04K06k71J32j43k09k86j63L53J30
$$ -266 -121 204 232 367 390 99 -124 -450 -265 -266 1 49 153 359 88 220 77 -132 -418 -581 -228 -98
3099i8K34j32K87k38j43k20j13L4J15K54RJ88l6j23J95l81m28L53o6K93L81r3
$$ -98 136 4 291 53 -90 -310 -423 -389 -274 -20 -11 177 141 18 213 -168 -596 -243 -309 -16 365 272
3121B72J47l66J02k09k2l93K78J13J34J13r7O7j40k73J80k17K8K49M8J57K91j85
$$ 272 419 53 155 -54 -76 -469 -191 -78 56 169 72 139 -1 -274 -94 -311 -283 -34 14 171 462 277
3143B77K2o01L39n69J92J30L9K63L10k79k5j59l50J13j1K98l6N9J81L63m01k5
$$ 277 299 -302 37 -532 -340 -210 -171 92 402 123 98 -61 -411 -298 -309 -11 -47 12 193 556 155 130
3165A30o39K06j9K87J99j96J76J84m7l73J05j68o3l2M78j86K20K09k76k76J07
$$ 130 -509 -303 -322 -35 164 -32 144 328 281 -92 13 -155 -218 -250 228 42 262 471 195 -81 26
3186B6k60L2L31l22J66J91n9J51N3j31o16R9L38r9J79K20K4K7m40L18l01j88j61
$$ 26 -234 -202 129 -193 -27 164 105 256 309 178 -438 -339 -1 -100 79 299 323 350 -90 228 -73 -261 -422
3209d22K98K3K41NM3J30r3j48m53M01P1M3K1J59P4q5j22l93l6L36k27J45L35k63
$$ -422 -124 -101 140 145 188 318 225 77 -376 25 96 139 160 319 393 308 186 -207 -243 93 -134 11 346 83
3233H3K41m9m67m7l9J55j33K63j07K88P1O8m56l1J52j11O3q8K72M6N5k6j69j28
$$ 83 324 275 -192 -239 -278 -123 -256 7 -100 188 259 327 -129 -160 -8 -119 -56 -144 128 174 229 203 34 -94
3257i4j48j80L32q0M2J17O3K41j52q9m13MJ81O1K22R6j53Q0K31k16l76J56k9o6
$$ -94 -242 -422 -90 -170 -128 -11 52 293 141 52 -361 -357 -176 -115 107 203 50 130 361 145 -231 -75 -104 -170
3281a70L08R9m51M69l25K56k71n9q2J40R9J09K30l76K0j63O0L7k48K22J03R0J05
$$ -170 138 237 -214 255 -70 186 -85 -144 -226 -86 13 122 352 -24 -4 -167 -107 -70 -318 -96 7 97 202
3304B02N0m53J43J15k11J0j02K93J24m8J48n6l38M74m47k11K4L14J60L4M2j9k50
$$ 202 252 -201 -58 57 -154 -144 -246 47 171 123 271 215 -123 351 -96 -307 -283 31 191 225 267 248 -2
3327bJ4M0j30p5J23L8J7L38j05k71K38k09J3j74j11J49J97J90k9k3n9k44j91J58
$$ -2 12 52 -78 -153 -30 8 25 363 258 -13 225 16 29 -145 -256 -107 90 280 251 228 169 -75 -266 -108
3351a08k36R2M03M5J9k34M3k83P3n3L54Nj22N0K90m5l75k07L9j05K21j9J95j5
$$ -108 -344 -252 151 196 215 -19 24 -259 -186 -239 115 120 -2 48 338 293 -82 -289 -250 -355 -134 -153 42 27
3375B7J84P0l37Q8l36J59j56L45j77M58j4j87J5j41rj42n5Q6J63M3J05j92J69
$$ 27 211 281 -56 32 -304 -145 -301 44 -133 325 311 124 139 -2 -11 -153 -208 -122 41 84 189 -3 166
3398A66n4k14k27L2K31J80Q8J6j8l39L65l15R5l6j7j11K40N2k32N6Q3k19m5p0
$$ 166 112 -102 -329 -297 -66 114 202 218 200 -139 226 -89 6 -30 -47 -158 82 134 -98 -42 41 -178 -223 -293
3422b93Q5MJ97K63M7k28K5m12K78M0j86rM34j05M3l72L04j28k49K27Q2j26J06
$$ -293 -208 -204 -7 256 303 75 100 -312 -34 6 -180 -189 245 140 183 -189 115 -13 -262 -35 47 -79 27
3445B7J54J01j73j00j84n9K59m41L57j24K59L22j54l05Q4l35K41j02J08j02L37
$$ 27 181 282 109 9 -175 -234 25 -416 -59 -183 76 398 244 -61 23 -312 -71 -173 -65 -167 170
3466A70Q4r8j73L3%k85J12J47J33o9j15L55l18J26r1n2q6J27r1J26J46k9lj16
$$ 170 254 156 -17 16 16 -269 -157 -10 123 54 -61 294 -24 102 11 -41 -127 0 -91 35 181 152 149 33
3490C3j64l6j32K50J06k5J28k91L21j08k60l1o5j45K06K91J04O7Pq5k1m43J09
$$ 33 -131 -167 -299 -49 57 32 160 -131 190 82 -178 -209 -274 -419 -213 78 182 249 256 171 150 -293 -184
3513a84R8q5Q7J69L32l2j76k18j96R3m9o1K08K40j78R5K11m30j97J02Jr6L21P8
$$ -184 -86 -171 -84 85 417 385 209 -9 -205 -112 -161 -222 -14 226 48 143 354 -76 -273 -171 -170 -266 55 133
3537A33KM6n4j15m9l0k64j7L42K47l70M53j36j36Q1m04J33L1j19J43J51k64M30
$$ 133 135 181 127 12 -37 -67 -331 -348 -6 241 -129 324 188 52 133 -271 -138 -107 -226 -83 68 -196 234
3560B34k94J34j46p2o0N1L76K3L7j53j69k3j67R8o1J14M3J15n5m2k7L7r3pn6R4
$$ 234 -60 74 -72 -144 -204 -153 223 246 283 130 -39 -62 -229 -131 -192 -78 -35 80 25 -17 -44 -7 -100 -107 -163 -69
3586f9J08L0q3L77j82r1j29L7j45j93M27k79N30j68r3j62K03k39Q4MO3P2K37j12
$$ -69 39 69 -14 363 181 90 -39 -2 -147 -340 87 -192 338 170 77 -85 118 -121 -37 -33 30 102 339 227
3610B27j25k10J52j58J24l1K70j40J0O1R1j42o3k56o6L63n3J73k12K37j33L9j45
$$ 227 102 -108 44 -114 10 -21 249 109 119 180 271 129 66 -190 -256 107 54 227 15 252 119 158 13
3633A3r2m6J26JJ2k36K41J24o7J32k23l38K20r0K44n9R9K74j34k23Q3k22J96j46
$$ 13 -79 -125 1 2 14 -222 19 143 76 208 -15 -353 -133 -223 21 -38 61 335 201 -22 61 -161 35 -111
3657a11K44k84M66o0k90k29K38m6N9O3m0O9J52l06O2K35k31l2j34M3J58n3N8J03
$$ -111 133 -151 315 255 -35 -264 -26 -72 -13 50 10 79 231 -75 -13 222 -9 -41 -175 -132 26 -27 31 134
3681A34L7j07J29n19Q2J40j09J82l0L13J03k88L9k38j21J57j99K95N0K7J06r0
$$ 134 171 64 193 -326 -244 -104 -213 -31 -61 252 355 67 106 -132 -253 -96 -295 0 50 77 183 93
3703I3o6j4k23l0K29j05K57J0Q8j4q5j85l6m9J18q3K51j71m4K03mk18J7L6j53
$$ 93 27 13 -210 -240 -11 -116 141 151 239 225 140 -45 -81 -130 -12 -95 156 -15 -59 144 140 -78 -61 -25 -178
3728a78j58J70M3M38j96l1j97K30l25n1M18j30J14J81j88r9j37O1J5r2n5R6J93
$$ -178 -336 -166 -123 315 119 88 -109 121 -204 -255 163 33 147 328 140 41 -96 -35 -20 -112 -167 -71 122
3751A22m7N7J76j44l96p2Q6l5L63j10K14P8j51j8k04k13J28K4K54j11J76O6k99
$$ 122 75 132 308 164 -232 -304 -218 -253 110 0 214 292 141 123 -81 -294 -166 -142 112 1 177 243 -56
3774e6j4R1m7n5M6j1J6l6J56J98j75j2J82l00r0l6K23N9o0j48J11j38K36j05P0
$$ -56 -70 21 -26 -81 -35 -46 -30 -66 90 288 113 101 283 -17 -107 -143 80 139 79 -69 42 -96 140 35 105
3799A05l04M79l44n1O3J46l5k97K33j29L03m41J62J97l2q7K40m26J73p8J68P0
$$ 105 -199 280 -64 -115 -52 94 59 -238 -5 -134 169 -272 -110 87 55 -32 208 -218 -45 -123 45 115
3821A15j21J99NL1l24j4N0p6k10M31J1j41K48j17j87Q0j11J49l4r0MK9J24L47
$$ 115 -6 193 198 229 -95 -109 -59 -135 -345 86 97 -44 204 87 -100 -20 -131 18 -16 -106 -102 -73 51 398
3845C98k49j38j57J24r6m0K29M5Q9k01p8J66j52j09o8K41j42K41n0n7Q6j35m3
$$ 398 149 11 -146 -22 -118 -158 71 116 205 4 -74 92 -60 -169 -237 4 -138 103 53 -4 82 -53 -96
3868i6q1J64k42K22J25J29k30r2N7O7K2m7j64K16p5QN2J39k8m3l2k72J71q2K9
$$ -96 -177 -13 -255 -33 92 221 -9 -101 -44 23 45 -2 -166 50 -25 -17 35 174 146 103 71 -201 -30 -112 -83
3893h3rL64q9l66N1K23j50k1J90P6k09K90j12k5k55J0k26L75o4j79O7K82j48J75
$$ -83 -92 272 183 -183 -132 91 -59 -80 110 186 -23 267 155 130 -125 -115 -341 34 -30 -209 -142 140 -8 167
3917A67Rk45P3k24J92j54M24j72J07j27J4k02K75j72n4j42M58j75K29m79J01r8
$$ 167 176 -69 4 -220 -28 -182 242 70 177 50 64 -138 137 -35 -89 -231 227 52 281 -198 -97 -195
3939a95J14k0J4l3Q6J79k08R4N4l20rJ37nM1O1O0N4k18K69l5k57J00j04R0k07
$$ -195 -81 -101 -87 -120 -34 145 -63 31 85 -235 -244 -107 -112 -71 -10 50 104 -114 155 120 -137 -37 -141 -51 -258
3964b58K56J50j4q1j05J36j57j43R2Q4R8P7o6p4p6K23l33K24j82O0K06K22j30
$$ -258 -2 148 134 53 -52 84 -73 -216 -124 -40 58 135 69 -5 -81 142 -191 33 -149 -89 117 339 209
3987B09j87o3RN0j70M3j83L72j42J95L1j43L4o1L6K9j18J73m3K3k08K45j92J78
$$ 209 22 -41 -32 18 -152 -109 -292 80 -62 133 164 21 55 -6 30 59 -59 114 71 94 -114 131 -61 117
4011A17j81k5K91n1n1N4k47K5j83L61j64J18l25K10K69k17K57l38J55j68JJ24
$$ 117 -64 -89 202 151 100 154 -93 -68 -251 110 -54 64 -261 -51 218 1 258 -80 75 -93 -92 32
4033C2M1J0K00r0j87J46j86p4O7j26J66L7j2j53J29R2j02j04P7N9N2j26M5k06
$$ 32 73 83 283 193 6 152 -34 -108 -41 -167 -1 36 24 -129 0 92 -10 -114 -37 22 74 -52 -7 -213
4057b13J47K23p4m1l0r2nm0J10K2k46K65O1j95K37k72mN9M0K67j87M1j35L38j44
$$ -213 -66 157 83 42 12 -80 -85 -125 -15 7 -239 26 87 -108 129 -143 -147 -88 -48 219 32 73 -62 276 132
4082A32j85n1N7P6o0K13qo7k73J99j7k01l4L9L24n9M7l8p3P8J02k17o5l09L27
$$ 132 -53 -104 -47 29 -31 182 174 107 -166 33 16 -185 -219 -180 144 85 132 94 21 99 201 -16 -81 -390 -63
4107f3K32j71j48Q0K04j08m5m9k2j55L32J4Pl60J66p2m8J78j11Q2J20J9J78j87
$$ -63 169 -2 -150 -70 134 26 -19 -68 -90 -245 87 101 108 -252 -86 -158 -206 -28 -139 -57 63 82 260 73
4131G3k09J67j29M7K29k25J3j23J36Q5K3k19rm9L65l60j81N09j13j6p8L4j68k7
$$ 73 -136 31 -98 -51 178 -47 -34 -157 -21 64 87 -132 -141 -190 175 -185 -366 143 30 14 -64 -30 -198 -225
4155b25L65K36l82J98J01l97K86k00l5l25M41J61j04k29m0Q5M0J12k39M7J71j35
$$ -225 140 376 -6 192 293 -104 182 -18 -53 -378 63 224 120 -109 -149 -64 -24 88 -151 -104 67 -68
4177f8L98l33k30L6J69J49q0J81l63K44N4j03l75L58k22K02j8j16j75L18j47J69
$$ -68 330 -3 -233 -197 -28 121 41 222 -141 103 157 54 -321 37 -185 17 -1 -117 -292 26 -121 48
4199D8r0m0k4J54j21L14k51J4K34k14J0k25K47k55J36K19l88K49r3J48K04j22
$$ 48 -42 -82 -106 48 -73 241 -10 4 238 24 34 -191 56 -199 -63 156 -232 17 -76 72 276 154
4221A54l18qK4K21q2J0Oj99J85K20M1k11k2J0j48j2J03K1n5J37J97k01j86o1M16
$$ 154 -164 -172 -148 73 -9 1 7 -192 -7 213 254 43 21 31 -117 -129 -26 -5 -60 77 274 73 -113 -174 242
4246B42jj85q8M5O8R9J85l47j23K01R0R1j17k76o9M45k07J83l97j0R1k3J07k91
$$ 242 241 56 -32 13 81 180 365 18 -105 96 186 277 160 -116 -185 260 53 236 -161 -171 -80 -103 4 -287
4270b87K64j71L95K41l56l62P5pJ41K38j06P7p7J74n4l15O9k25K09L55k72N1o
$$ -287 -23 -194 201 442 86 -276 -201 -208 -67 171 65 142 65 239 185 -130 -61 -286 -77 278 6 57 51
4293E1M3P2k58k7P6j44J25Q4j50NN0J51J03j99o0k46J79L04k63L1J4k38M64o3
$$ 51 94 166 -92 -119 -43 -187 -62 22 -128 -123 -73 78 181 -18 -78 -324 -145 159 -104 -73 -59 -297 167 104
4317A04j43j02N9K59J07l3k84r9K05K0j7k51M9j58M15m5j48j40L72l25L44j44
$$ 104 -39 -141 -82 177 284 251 -33 -132 73 93 76 -175 -126 -284 131 86 -62 -202 170 -155 189 45
4339D5k96L4L34J19l92j38M21j55P0R7m5j78o0L79r4k50j1j62K58j47P9j35J71
$$ 45 -251 -217 117 236 -156 -294 127 -28 42 139 94 -84 -144 235 141 -109 -120 -282 -24 -171 -92 -227 -56
4362e6J43K16l14K9k70L37j89K47k93J59J62r5j14K74m79M0J80J35K9j18j89J25
$$ -56 87 303 -11 18 -252 85 -104 143 -150 9 171 76 -38 236 -243 -203 -23 112 141 23 -166 -41
4384d1K16LQ0m38L6K67K2k8k33L0M8L62j21l23j87J58n5M02j0l56J36J7K47q9
$$ -41 175 178 258 -180 -144 123 145 117 -116 -86 -38 324 203 -120 -307 -149 -204 198 188 -168 -32 -15 232 143
4408A43p1m3j91J76P5J42m51M15k34J74R7l65K63Rm7J26l38J70l5j55L43k72J28
$$ 143 72 29 -162 14 89 231 -220 195 -39 135 232 -133 130 139 92 218 -120 50 15 -140 203 -69 59
4431E9k39K74l01O56m98j9L7Q6J08m23L0K48J07q6m3j62K14j32J09j4o1j25J21
$$ 59 -180 94 -207 449 -49 -68 -31 55 163 -260 -230 18 125 39 -4 -166 48 -84 25 11 -50 -175 -54
4454e4Q9Np3j28R1R3K62k68rj00L7k8k32K29j15K72k39L52m59J65L02j35K69m93
$$ -54 35 40 -33 -161 -70 23 285 17 8 -92 -55 -83 -315 -86 -201 71 -168 184 -275 -110 192 57 326 -167
4478a67K08Q6K32j92n8j20M0K33k18l1k38N6K28L0j6j68K90j75M8n9j03J57j71
$$ -167 41 127 359 167 109 -11 29 262 44 13 -225 -169 59 89 73 -95 195 20 68 9 -94 63 -108
4501a08K3K87m5k33j27K3J49J22J64j39l45M34k23l15M30k16q5L00J14k48l42
$$ -108 -85 202 157 -76 -203 -180 -31 91 255 116 -229 205 -18 -333 97 -119 -204 96 210 -38 -380
4522c80M23J44k32m9M6J29k89Q6J27j82m8K60J54k40k1j14M6J14J22k99J25L30
$$ -380 43 187 -45 -94 -48 81 -208 -122 5 -177 -225 35 189 -51 -72 -186 -140 -26 96 -203 -78 252
4544B52k7k16N1k47K80j09J75K2l17o2J05N16l86p1j31J07O7J64l86K43j62K30
$$ 252 225 9 60 -187 93 -16 159 181 -136 -198 -93 423 37 -34 -165 -58 9 173 -213 30 -132 98
4566I8j8J12k11j34J50J36Pl47l3J57Q4Q9j11j11K89R6k30m1m4k9J34J06j16j89
$$ 98 80 192 -19 -153 -3 133 140 -207 -240 -83 1 90 -21 -132 157 253 23 -18 -62 -91 43 149 33 -156
4590a56O8J02J53l80K31k27K2L06J43l66J10j2j71p1K33p1J46J9K1L2j54l00J85
$$ -156 -88 14 167 -213 18 -209 -187 119 262 -104 6 -6 -177 -248 -15 -86 60 79 100 132 -22 -322 -137
4613a37J52K70j90l28L22j67J24j13Q6R4r2J88L7k92p5L1L5L02k32m35L32o9L00
$$ -137 15 285 95 -233 89 -78 46 -67 19 113 21 209 246 -46 -121 -90 -55 247 15 -420 -88 -157 143
4636A43o0m6j9j31q4K83J46k86j92L12P5k12K1n1NK39k47R6j83L9o1J66J23l9
$$ 143 83 37 18 -113 -197 86 232 -54 -246 66 141 -71 -50 -101 -96 143 -104 -8 -191 -152 -213 -47 76 37
4660C7m5J20r9J59k34k27L16J28k30q3L26l00J20O7j59J92j53K74l38P7J44q8
$$ 37 -8 112 13 172 -62 -289 27 155 -75 -158 168 -132 -12 55 -104 88 -65 209 -129 -52 92 4
4682DQ9q1K14j93k45l1K91o2J41o4j54k2K57k9j57J01M8l72L77nj12J36j94k3
$$ 4 93 12 226 33 -212 -243 48 -14 127 63 -91 -113 144 115 -42 59 107 -265 112 107 -5 131 -63 -86
4706h6j64J32L8J97m2j57mL14k14j10n1K20M1M7p6j45K01o9k04K54m1n6J17j66
$$ -86 -250 -118 -80 117 75 -82 -86 228 14 -96 -147 73 114 161 85 -60 141 72 -132 122 81 25 142 -24
4730b4j12QQ5j97R8Q2J10j35J56l9j5q4m4J86j11k27J63J03n4J10r9J55P3j16
$$ -24 -136 -128 -43 -240 -142 -60 50 -85 71 32 17 -67 -111 75 -36 -263 -100 3 -51 59 -40 115 188 72
4754G2q9K17k36k7R5j66lJ27j71L14j59m2O0j14N72n53m7L08j36n0J49j6k06j82
$$ 72 -17 200 -36 -63 32 -134 -137 -10 -181 133 -26 -68 -8 -122 450 -103 -150 158 22 -28 121 105 -101 -283
4778b83K23K99j69J33k30k10N66m52J74l58L42LOL8m8j16K01k12Q9n6K8j87L20
$$ -283 -60 239 70 203 -27 -237 329 -123 51 -307 35 38 44 82 34 -82 119 -93 -4 -60 -32 -219 101
4801A01K58m23K40k15K4M8K33n40K20m9L9j3J79j31j30O9J33M5j53L00k57N1k00
$$ 101 359 -64 176 -39 -15 33 266 -274 -54 -103 -64 -77 102 -29 -159 -90 43 88 -65 235 -22 29 -171
4824a71K70j55m8L2m4Q7K9O2j19m9o7K58l51L61r9L06k92rJ3P9l12K27j10K27
$$ -171 99 -56 -104 -72 -116 -29 0 62 -57 -106 -173 85 -266 95 -4 302 10 1 14 93 -219 8 -102 125
4848A25l00J56o3J0J46p4Q5j73r5J14J01m3l2p8K3J11J01l54L48P1k83j79nL19
$$ 125 -175 -19 -82 -72 74 0 85 -88 -183 -69 32 -11 -43 -121 -98 13 114 -240 108 179 -104 -283 -288 31
4872C1J02j70n1Q0L3n6M8j78L83k17L44m68J83k96J52j5R8J03j78l6M2l9J6J16
$$ 31 133 -37 -88 -8 25 -31 17 -161 222 5 349 -119 64 -232 -80 -95 3 106 -72 -108 -66 -105 -89 27
4896B7J23j16Nk65J36K7j06K00RJ77l53L68j49J83l26K56j00j4j06j40p2J68L39
$$ 27 150 34 39 -226 -90 -63 -169 31 40 217 -136 232 83 266 -60 196 96 82 -24 -164 -236 -68 271
4919B71l96M1J0J61j57J92j43m2k12L20j22lj18L09J0L1k17p3q2J98j57L34k17
$$ 271 -125 -84 -74 87 -70 122 -21 -63 -275 45 -77 -80 -198 111 121 152 -65 -138 -220 -22 -179 155 -62
4942f2K7J22Q0j99Q0l5k93L8L02O4k23R0j20J65m8k66K74p1k1J28k44K84Oo2j29
$$ -62 -35 87 167 -32 48 13 -280 -242 60 124 -99 -9 -129 36 -12 -278 -4 -75 -96 32 -212 72 78 16 -113
4967a13K4J81qk47%OK35j49j9O2n1jK9j1J88l75O2J53P6J69l0m4m9j44Rj02K14
$$ -113 -89 92 84 -163 -163 -157 78 -71 -90 -28 -79 -80 -51 -62 126 -249 -187 -34 42 211 181 137 88 -56 -47 -149 65
4994F5k18J44J19k39MlJ32J49j34j78N3K43m08K29j71N01j41l3M2p4j44K71k21
$$ 65 -153 -9 110 -129 -125 -128 4 153 19 -159 -106 137 -271 -42 -213 288 147 114 156 82 -62 209 -12
5017a2j40J86K3j90J6K28o2J06j97k7l7K3j78M45m38M15N0p6j65o3J20J1J96J
$$ -12 -152 34 57 -133 -117 111 49 155 -42 -69 -106 -83 -261 184 -254 161 211 135 -30 -93 27 38 234 235
5041B35r3l86L74l21J3j47J42l8J12K62K8k6o8j06j6J88j47j92R5pL3J39J24k90
$$ 235 142 -244 130 -191 -178 -325 -183 -221 -109 153 181 155 87 -19 -35 153 6 -186 -91 -98 -65 74 198 -92
5065i2rJ48J9m5n7L1Ko9J5o1K29PM5k38k9O4N5Q0j45kJ3j43R2jn5J15K9J8k2j36
$$ -92 -101 47 66 21 -36 -5 -3 -72 -57 -118 111 118 163 -75 -104 -40 15 95 -50 -52 -39 -182 -90 -91 -146 -31 -2 16 -6 -142
5095a42L13j65O4R2k57K10Mj17J1q8J18l8q4oj05L46m04J75L74k26j19qJ41l65
$$ -142 171 6 70 162 -95 115 119 2 13 -75 43 5 -79 -85 -190 156 -248 -73 301 75 -44 -52 89 -276
5119b76J95J09o7P1j3K01l37J25j28K21j08o9P4o4N2J07o1j05K09j26P2j28J36
$$ -276 -81 28 -39 32 19 220 -117 8 -120 101 -7 -76 -2 -66 -14 93 32 -73 136 10 82 -46 90
5142I0o4o9L0j3J77o0P0k00p0K17j88J85l11k2P9K10p5j95L33K8k76JK21k26Q2
$$ 90 26 -43 -13 -26 151 91 161 -39 -109 108 -80 105 -206 -228 -149 61 -14 -209 124 152 -124 -123 98 -128 -46
5167d6K4j0k17j08K03J03j40J92j5J41j49o4J41k28K63K6j55m5K00k37L51j97
$$ -46 -22 -32 -249 -357 -154 -51 -191 1 -14 127 -22 -86 55 -173 90 116 -39 -84 116 -121 230 33
5189C3j66P9k8J44j66M3J55j28J40k18J56J00n2j54K02l30P2J41l9k06K31k13
$$ 33 -133 -54 -82 62 -104 -61 94 -34 106 -112 44 144 92 -62 140 -190 -118 23 -16 -222 9 -204
5211b04J58J32j53J64k27K3K69j92J22j68r9O9o3o8K57M3j88K23p4K02k54O3L9
$$ -204 -46 86 -67 97 -130 -107 162 -30 92 -76 -175 -106 -169 -237 20 63 -125 98 24 226 -28 35 74
5234G4mLm4n8j80K25J69m30K33j9j52J14Q4q6L2J47l30R4J50K5k5J0L0j04j35
$$ 74 70 73 29 -29 -209 16 185 -245 -12 -31 -183 -69 15 -71 -39 108 -222 -128 22 47 22 32 62 -42 -177
5259a77K53p9j48J48j64K93l1k35l6L13l6k2j02J47j73J9N4j04J14k5k14K95k2
$$ -177 76 -3 -151 -3 -167 126 95 -140 -176 137 101 79 -23 124 -49 -30 24 -80 34 9 -205 90 68
5282F8j77KM8K54k44L6mj77J84l9J85j65J73lj10l00J49k0N0K7j72PL45k8r7j13
$$ 68 -109 -107 -59 195 -49 -13 -17 -194 -10 -49 136 -29 144 141 31 -269 -120 -140 -90 -63 -235 -228 117 89 -8 -121
5308a21L71l60K0J82k86L53K5k89L20k43K83l15M8N4j49J67P2j10K3J14r0j26
$$ -121 250 -110 -90 92 -194 159 184 -105 215 -28 255 -60 -12 42 -107 60 132 22 45 159 69 -57
5330e7j24O8j58K96j60L32m2k52R4Q7j18L9R8k25K4k37N00k19j52J41K03L0q7
$$ -57 -181 -113 -271 25 -135 197 155 -97 -3 84 -34 5 103 -122 -98 -335 165 -54 -206 -65 138 168 81
5353H1k54K06K01k36J22j9L0n7m02K61R7K6J51l94J45j1m4l2K45K6m21L26J51
$$ 81 -173 33 234 -2 120 101 131 74 -328 -67 30 56 207 -187 -42 -53 -97 -129 116 142 -279 47 198
5376A98j18o7L23l41JmK78l41K5kk63J24J59j10J27K7q4R3r2j73J88j58o5K46
$$ 198 80 13 336 -5 -4 -8 270 -71 -46 -48 -311 -187 -28 -138 -11 16 -68 25 -67 -240 -52 -210 -275 -29
5400b9J13P7j54N1P2k55K17k60L29k82J4J20NL5l06L66j61q0J06J47o5R0o6o2
$$ -29 84 161 7 58 130 -125 92 -168 161 -121 -107 13 18 53 -253 113 -48 -128 -22 125 60 150 84 22
5424B2M8j97l0L29j57k01K23l04K78J27jj07P7J45m69L16j22r2J98J4j98J55p
$$ 22 70 -127 -157 172 15 -186 37 -267 11 138 137 30 107 252 -217 99 -23 -115 83 97 -101 54 47
5447D7l61M70k42p6J09P9j53K5J73k01P9j04N6N4M5J15N7J05j18p5q1l4n5J3Q9
$$ 47 -314 156 -86 -162 -53 26 -127 -102 71 -130 -51 -155 -99 -45 0 115 172 277 159 84 3 -31 -86 -73 16
5472A6n4QR6J21j20k23L56m44K38l5k07K50K8j2r4L45l11j92K20J01j07j50K28
$$ 16 -38 -30 66 187 67 -156 200 -244 -6 -41 -248 2 30 18 -76 269 -42 -234 -14 87 -20 -170 58
5495E8j16O6j02o6K16N8J08k48m6j75L37j68J84O2k0j16j19Q9j14K15k03J90o2
$$ 58 -58 8 -94 -160 56 114 222 -26 -72 -247 90 -78 106 168 148 32 -87 2 -112 103 -100 90 28
5518B8j17K57m6j73J14k90K23M6l5k3J59p7J7k55J40J12J7M9j92O4K3k63K66p1
$$ 28 -89 168 122 -51 63 -227 -4 42 7 -16 143 66 83 -172 -32 80 97 146 -46 18 41 -222 44 -27
5542b7N4nj56P1j08J80l8M1J1L8J23L3k60J47l1j12J21j89q8M17l6j10n7J70k59
$$ -27 27 22 -134 -63 -171 9 -29 12 23 61 184 217 -43 104 73 -39 82 -107 -195 222 186 76 19 189 -70
5567g0R1j89J31pO6K34j49p3J97P2l20mp1L06k31j2J04J18l07j25M55k14Q1l0
$$ -70 21 -168 -37 -44 22 256 107 34 231 303 -17 -21 -92 214 -17 -29 75 193 -114 -239 216 2 83 53
5591E3J24l21J33o8K6J19n3l0J14j14P1j16N7O9j43j09J80M7q7J43J72n20L24
$$ 53 177 -144 -11 -79 -53 66 13 -17 97 -17 54 -62 -5 64 -79 -188 -8 39 -48 95 267 -253 71
5614G1n5N8q4Q3k53J81l2j0J73j5r0P1p2N5k40K2K33k09J76N6k66K9K06k22kJ90
$$ 71 16 74 -10 73 -180 1 -31 -41 132 117 27 98 26 81 -159 -137 96 -113 63 119 -147 -118 88 -134 -136 54
5640E4n2M5Q6j91K2j55L70k20K2p0Q6J56Q9k88j33J35J96J79m85K9J03n3j53p6
$$ 54 2 47 133 -58 -36 -191 179 -41 -19 -89 -3 153 242 -46 -179 -44 152 331 -154 -125 -22 -75 -228 -304
5664c04K76J74j17q6K05r6j10n9J05j44J87k08O4J97k80L79k77J62J77m22J47
$$ -304 -28 146 29 -57 148 52 -58 -117 -12 -156 31 -177 -113 84 -196 183 -94 68 245 -177 -30
5685c0r4K6J18J37J22j80j67m9o4P8J7q6J50Mn8J55r4R4l3K19j97P3O4j95K89
$$ -30 -124 -98 20 157 279 99 -68 -117 -181 -103 -86 -172 -22 -18 -76 79 -15 79 46 265 68 141 205 10 299
5710B99l44K38l15j83L06K2j66O4k08K44J02j32j02J7J04q5j95K43J09J28k9m5
$$ 299 -45 193 -122 -305 1 23 -143 -79 -287 -43 59 -73 -175 -158 -54 -139 -334 -91 18 146 117 72
5732G2r6L6l4k8M7Q7j34P8J34j50K14k7j73j78L29q7l10N52k70j79L1J96r0q9
$$ 72 -24 12 -22 -50 -3 84 -50 28 162 12 226 199 26 -152 177 90 -220 332 62 -117 -86 110 20 -69
5756f9K89l02J6M8J12j84K59r8k74n2J02n2K00Q2j88J75q6j20K78j32l9j00J03
$$ -69 220 -82 -66 -18 94 -90 169 71 -203 -255 -153 -205 -5 77 -111 64 -22 -142 136 4 -35 -135 -32
5779c2K98k36j8J92j85k17L29k61K64j96K92j44L6m51M56k17J09Q6J32j87k00
$$ -32 266 30 12 204 19 -198 131 -130 134 -62 230 86 122 -329 127 -90 19 105 237 50 -150
5800a50K79m6o7P1O8k80q4K0L44j78M4J62k28J02j04j2m3L08O6k69l5K71n1k44
$$ -150 129 83 16 87 155 -125 -209 -189 155 -23 21 183 -45 57 -47 -59 -102 206 272 3 -32 239 188 -56
5824e6kN1J37L5k03o9K18J4J01m52J13J75l38K92n8O2j10P8j66L3J44j01j5J41
$$ -56 -58 -7 130 165 -38 -107 111 125 226 -226 -113 62 -276 16 -42 20 -90 -12 -178 -145 -1 -102 -117 24
5848B4j3j28J70j19K68n02J93J73R4j17J1R1j03L6q3k37K16M1N4j51n2j45L57
$$ 24 11 -117 53 -66 202 -300 -107 66 160 43 54 145 42 78 -5 -242 -26 15 69 -82 -134 -279 78
5871G8k17M29m25J62J32j74K00l30k4N4P5J60l66J84J56k22J84J55j93o0j95n3
$$ 78 -139 290 -135 27 159 -15 185 -145 -169 -115 -40 120 -246 -62 94 -128 56 211 18 -42 -237 -290
5893b90L27P9j02Q4O4l44J25J10j02J22J65k51j42J18K64j40k9k19K17l01L19
$$ -290 37 116 14 98 162 -182 -57 53 -49 73 238 -13 -155 -37 227 87 58 -161 56 -245 74
5914G4k57J67Nj26L60k4m14L00o3k08R5J48r4k41Q1L54l93J79k09J91J46p4K08
$$ 74 -183 -16 -11 -137 223 199 -215 85 22 -186 -91 57 -37 -278 -197 157 -236 -57 -266 -75 71 -3 205
5937B05k36k5J47N7l44L13o0r9M0O9j07k30J51r9M1P5l4L21l55K04O5j99K09l99
$$ 205 -31 -56 91 148 -196 117 57 -42 -2 67 -40 -270 -119 -218 -177 -102 -136 185 -170 34 99 -100 109 -290
5961b90K4M36j58qj36K52L7k59J66j9m4q6j82J86J11L7j3p2L8O9l44M46l61K12
$$ -290 -266 170 12 4 -132 120 157 -102 64 45 1 -85 -267 -81 30 67 54 -18 20 89 -255 191 -170 42
5985D2m8l9P3l0Kk2oj5J07k16M1K59l6k96J89q1K55r0K4j14j15mL49p7j49o3o8
$$ 42 -6 -45 28 -2 0 -22 -28 -43 64 -152 -111 148 112 -184 5 -76 179 89 113 -1 -116 -120 229 152 3 -60 -128
6012a28J86N4j23J98k34N2j63J02J50L3l22K75J25m7j63N4pj12K49k69K0k3j39
$$ -128 58 112 -11 187 -47 5 -158 -56 94 127 -195 80 205 158 -5 49 42 -70 179 -90 -70 -93 -232
6035b32K90k32L89q5k96j31J56K31j52J4MlJ76l39K48k20O4J45j66Q9P9k01K06
$$ -232 58 -174 215 130 -166 -297 -141 90 -62 -48 -44 -47 129 -210 38 -182 -118 27 -139 -50 29 -172 34
6058C4j54R9J22K8j76j78J50L44p9k21K49j52o9LK95j57l04N0R1j34K45O9l4j76
$$ 34 -120 -21 101 129 -47 -225 -75 269 190 -31 218 66 -3 0 295 138 -166 -116 -25 -159 86 155 121 -55
6082e5%JJ35j39pJ94k53M29j86p0q7l5o1J24J11Mj20k50K76r9J27kl0j79Q8K18
$$ -55 -55 -54 81 -58 -65 129 -124 305 119 49 -38 -73 -134 -10 101 105 -15 -265 11 -88 39 37 7 -172 -84 134
6108A34j66nj01J34o7k8RR2K25l40J52j06m7J19o8P6j10Q7J15j9j23j4J55q1K37
$$ 134 -32 -37 -138 -4 -71 -99 -90 2 227 -113 39 -67 -114 5 -63 13 -97 -10 105 86 -37 -51 104 23 260
6133B60n1k55j43L01k8j25m9j9L4l8L33m35N2J3K9K9J07m6J43j51J6K19k62Q3
$$ 260 209 -46 -189 112 84 -41 -90 -109 -75 -113 220 -215 -163 -150 -121 -92 15 -31 112 -39 -23 196 -66 17
6157A7P4k74M64j20R6l78K09j88J45o7J07j84L37l19Q1oo5J05J65k25K66l96K42
$$ 17 91 -183 281 161 257 -121 88 -100 45 -22 85 -99 238 -81 0 -6 -71 34 199 -26 240 -156 86
6180H6Q7j26j92l6J55k70K68K81l39J35q3k22K97j70K00n0j29J74j80OL9l2J99
$$ 86 173 47 -145 -181 -26 -296 -28 253 -86 49 -34 -256 41 -129 71 21 -108 66 -114 -108 -69 -101 98
6203I8j00K9J30J1m42L91o3k21J13r6J57o2r5L36j78j44K32j75J25j25K4K9m8
$$ 98 -2 27 157 168 -274 117 54 -167 -54 -150 7 -55 -150 186 8 -136 96 -79 46 -79 -55 -26 -74
6226g4k0K51l40J70J30mj97l9K3R6J92j70N5j9j24L03j81o5M8j23L71m04P1N2
$$ -74 -94 157 -183 -13 117 113 -84 -123 -100 -4 188 18 73 54 -70 233 52 -13 35 -88 283 -121 -50 2
6250BJ27n8j55m2J17l8m4n4J28Q3n6K54l94J26l0M5k08R8J96j33m7J6K43q5O0
$$ 2 129 71 -84 -126 -9 -47 -91 -145 -17 66 10 264 -130 -4 -34 11 -197 -99 97 -36 -83 -67 176 91 151
6275A51r2k85L50Lj65J58l57L10k1L4j04m2J16J92m64K12kJ65j67mQ2j73j98M54
$$ 151 59 -226 124 127 -38 120 -237 73 52 86 -18 -60 56 248 -216 -4 -6 159 -8 -12 70 -103 -301 153
6299A53l4j67r7J89r4M6K39k66J56k16Q8K36l41J03j6J90K4j69j14m8J66r3L48
$$ 153 119 -48 -145 44 -50 -4 235 -31 125 -91 -3 233 -108 -5 -21 169 193 24 -90 -138 28 -65 283
6322B83k35K22j68j84J35m9k07K70p0M3L01k38j80L4O9j44K13j67k2R2J79k14
$$ 283 48 270 102 -82 53 4 -203 67 -3 40 341 103 -77 -43 26 -118 95 -72 -94 -2 177 -37
6344c7K76j82l2l8Q9j32J27j08K03jl19K23j37J68j98J89j19J8Q7L0r4R1k77K82
$$ -37 239 57 25 -13 76 -56 71 -37 166 165 -154 69 -68 100 -98 91 -28 -10 77 107 13 104 -173 109
6368A09Q0j12k48K92J7Nj80P1J15k62j12J18K37l8j71M6Q3M6k10K43L9m58K37
$$ 109 189 77 -171 121 138 143 -37 34 149 -113 -225 -107 130 92 -79 -33 50 96 -114 129 168 -290 -53
6391e3l25O08k92k5j04K42K0j10j13Q1Q0j18P6K0j46N5N9KJ22l0M2J11r8k64K37
$$ -53 -378 230 -62 -87 -191 51 71 -39 -152 -71 9 -109 -33 -13 -159 -104 -45 -43 79 49 91 202 104 -160 77
6416G7k15K27J58k35K8J27l68Q2M17k57j8j9r6L1N3J21j01l2N8q7pJ63r7J29K9
$$ 77 -138 89 247 12 40 167 -201 -119 298 41 23 4 -92 -61 -8 113 12 -20 38 -49 -56 107 10 139 168
6441A68kk20J95r5J1N7j13J24J52l36J77k10NJ33l7k19J09J02L46l06j12K70n02
$$ 168 166 -54 141 46 57 114 1 125 277 -59 118 -92 -87 46 9 -210 -101 1 347 41 -71 199 -303
6464c03K92M4J45k52J65P5K68k95j01o3O8j53kJ21r8P6m0L36k78j38J30j8P5k95
$$ -303 -11 33 178 -74 91 166 434 139 38 -25 43 -110 -112 9 -89 -13 -53 283 5 -133 -3 -21 54 -241
6488b41J25j1n5K72m2P1l94J88J11K32k45m8J19J85n22K09p6K4R3J09j10j29J02
$$ -241 -116 -127 -182 90 48 119 -275 -87 24 256 11 -37 82 267 -255 -46 -122 -98 -5 104 -6 -135 -33
6511c3p1j4K02j07j94j5K46l60K33j0l6K1K13j17qk59L31R1m39K75Q0P7j04j11
$$ -33 -104 -118 84 -23 -217 -232 14 -346 -113 -123 -159 -138 75 -42 -50 -309 22 113 -326 -51 29 106 2 -109
6535a09O8M9m61M82j34kK48k31j1J47j40J1J64o6n6J44O8k8k25K8JP9k1j50J25
$$ -109 -41 8 -453 29 -105 -107 141 -90 -101 46 -94 -83 81 15 -41 103 171 143 -82 -54 -53 26 5 -145 -20
6560b0n3K37k37J17k97O7L27j49m0NK40j95p7L2k42K31mK58l33l0P4l2K9l6m8
$$ -20 -73 164 -73 44 -253 -186 141 -8 -48 -43 197 2 -75 -43 -285 -54 -58 200 -133 -163 -89 -121 -92 -128 -176
6585a76K23n6N2j19R1q9K8L04l62K09j80P9p3o8J29j38q9j11M77r8M6l28J2L75
$$ -176 47 -9 43 -76 15 -74 -46 258 -104 105 -75 4 -69 -137 -8 -146 -235 -346 131 33 79 -249 -237 138
6609A38j08j36J97k41J18J59n8J5j77k58M52Oj23J1K53q2n5J0j93J53J1J53l27
$$ 138 30 -106 91 -150 -32 127 69 84 -93 -351 101 107 -16 -5 248 166 111 121 -72 81 92 245 -82
6632h2J77l13K37j57%K37m18K87r9k2J60l03M36j94J62j91P3Q5k88R6n6J30r2
$$ -82 95 -218 19 -138 -138 99 -319 -32 -131 -153 7 -296 140 -54 108 -83 -10 75 -213 -117 -173 -43 -135
6655a35j0L17k81J96L3k45J26n5K83m85n2L39k2N1N4O7k88J72j29O3O0j54J38
$$ -135 -145 172 -109 87 120 -125 1 -54 229 -256 -308 31 9 60 114 181 -107 65 -64 -1 59 -95 43
6678D3J39k62K62j48k7R6k90J64o9L9L9J06j69J42j71K23ql29L0K30j72K5K37
$$ 43 182 -80 182 34 7 103 -187 -23 -92 -53 -14 92 -77 65 -106 117 109 -220 -190 40 -132 -107 130
6701A30j97O6J32k17l0o3k9O0K28n6J82j17J00k34J68kk80K82l40L33j31J38l15
$$ 130 -67 -1 131 -86 -116 -179 -208 -148 80 24 206 89 189 -45 123 121 -159 123 -217 116 -15 123 -192
6724a92J62K43k22J31l08k02M77j5n0J22J8K3j51n3j29J72Jn6k2J87l8p2O9j07
$$ -192 -30 213 -9 122 -186 -388 89 74 24 146 164 187 36 -17 -146 26 27 -29 -51 136 98 26 95 -12
6748a2J1R8k60n9L98n2j59K70l27K05J37j95K2j07J04p6j61j11o8L71r1J93q3
$$ -12 -1 97 -163 -222 176 124 -35 235 -92 113 250 55 77 -30 74 -2 -163 -274 -342 29 -62 131 48
6771D8k32o3L09j05n0Oj16J31k2M6N3J09J7k36p0K00n1J09l36L40J22k2l65P3
$$ 48 -184 -247 62 -43 -93 -87 -203 -72 -94 -48 5 114 131 -105 -175 25 -26 83 -253 87 209 187 -178 -105
6795a05j8L63k30j52J56K26j62p7j16j10K95j04K3j42L5R0j13L05K0n3j80P0O5
$$ -105 -123 240 10 -142 14 240 78 1 -115 -225 70 -34 -11 -153 -118 -28 -141 164 184 131 -49 21 86
6818H6k02K96m89J54K98J11l98J98o4K71l61OK13M2l40Q1l2nnN25n16j4L68P7
$$ 86 -116 180 -309 -155 143 254 -144 54 -10 261 -100 -94 119 161 -179 -98 -130 -135 -140 385 -131 -145 223 300
6842C00l66L25k03K0Kj26J37k84K13n7Q2j34K24K9k96K13k32J35N5j3j04j98R8
$$ 300 -66 259 56 76 78 -48 89 -195 18 -39 43 -91 133 162 -134 79 -153 -18 37 24 -80 -278 -180
6865a80J33k2R9k03K63J09j44k20p1R6k1K99j71J49k36K46k12P7P3p5J39j59p9
$$ -180 -47 -69 30 -173 90 199 55 -165 -236 -140 -161 138 -33 116 -120 126 -86 -9 64 -11 128 -31 -110
6888a10K9J6J50k79J96k89J60J62K2p8J04k4j34L9J08j69L43j30%j02M1J20j32
$$ -110 -81 -65 85 -194 2 -287 -127 35 57 -21 83 59 -75 -36 72 -97 246 116 116 14 55 175 43
6911D3K46j91j40J40j07j62M10k31j63L25j08j24M3L0J0p7j21J39r4J39J00n25
$$ 43 289 98 -42 98 -9 -171 239 8 -155 170 62 -62 -19 11 21 -56 -177 -38 -132 7 107 -418
6933d18M01j97J92K1q0L2O7k6Pj28M09j84k4j06k17J97l6l4K45k80Q6O1m6m5J07
$$ -418 -17 -214 -22 -1 -81 -49 18 -8 -1 -129 280 96 72 -34 -251 -54 -90 -124 121 -159 -73 -12 -58 -103 4
6958DJ37j46k3L64l72n9p2m0J49M47m39o6j07J45J74k70L37l08N4K95j88j79J42
$$ 4 141 -5 -28 336 -36 -95 -167 -207 -58 389 -50 -116 -223 -78 96 -174 163 -145 -91 204 16 -163 -21
6981b1J03j29q3p8L53J8J7l74J08J15k43L7J00N3J07j21j17k8J92K53k04j60N1
$$ -21 82 -47 -130 -208 145 163 180 -194 -86 29 -214 -177 -77 -24 83 -38 -155 -183 9 262 58 -102 -51
7004e1J98l51J86M4j65J20N6Np7L2M8j34q7Q4K00k26P0j20n5K61l9J70k51o6J43
$$ -51 147 -204 -18 26 -139 -19 37 42 -35 -3 45 -89 -176 -92 108 -118 -48 -168 -223 38 -1 169 -82 -148 -5
7029eJ98k3k31k06L67k71J83jo2k10K11j11K45J06j42N2j76J63k59qr8L72l3K2
$$ -5 193 170 -61 -267 100 -171 12 11 -51 -261 -50 -161 84 190 48 100 -76 87 -172 -180 -278 94 61 83
7053H3l07J78J13N7j21L9o8R6p7K33k14l3K2J08kj3n1n7j0j59K70j54L83l07J51
$$ 83 -224 -46 67 124 3 42 -26 70 -7 226 12 -21 1 109 107 94 43 -14 -24 -183 87 -67 316 9 160
7078A60j57R0K1k22L6K53rr9o3K0R4M1l51K88k35P8j37K3J19j52J26m3O0j33L81
$$ 160 3 93 114 -108 -72 181 172 73 10 30 124 165 -186 102 -133 -55 -192 -169 -50 -202 -76 -119 -59 -192 189
7103A89k52j16N2K79k45j60K99J0Lj07P0nm6K28k15j92K16o0k21M38k27j34Q0
$$ 189 -63 -179 -127 152 -93 -253 46 56 59 -48 22 17 -29 199 -16 -208 8 -52 -273 165 -62 -196 -116
7126a16m6J79N8j29j36P9m4K56k71N8J00j9J70r8J35k20J1J09p3R5j02o5Q1l42
$$ -116 -162 17 75 -54 -190 -111 -155 101 -170 -112 -12 -31 139 41 176 -44 -33 76 3 98 -4 -69 12 -330
7150c30J89M2LJ70j69J59rK6k15J55J52j17Q1k94L52j41l02J46lK32J3j76K94
$$ -330 -141 -99 -96 74 -95 64 55 81 -134 21 173 56 137 -157 195 54 -248 -102 -105 127 140 -36 258
7173B58k11q2j36J64k6J17L9j48p9J44j32K2J38r9j38P2L26k86L16j33l9R6q8
$$ 258 47 -35 -171 -7 -33 84 123 -25 -104 40 -92 -70 68 -31 -169 -97 229 -57 259 126 87 183 95
7196I5l31N15j07p6j85K2J4m5j2M3N3O0Rj33R6k7k75L05j12j23K56p9j95j7J86
$$ 95 -236 279 172 96 -89 -67 -53 -98 -110 -67 -14 46 55 -78 18 -9 -284 21 -91 -214 42 -37 -232 -249 -63
7221f3N8p2K45k84L06k8k24l7J10r0j48K24K81n34J82p4J23K2M3k62J59M3K74
$$ -63 -5 -77 168 -116 190 162 -62 -99 11 -79 -227 -3 278 -256 -74 -148 -25 -3 40 -222 -63 -20 254
7244B54k94k3R0K9o6J16m8m71N33j10n8kN2J1K9j7n6r6K51L4n4m3O5n8mk0J67
$$ 254 -40 -63 27 56 -10 106 58 -413 120 10 -48 -50 2 13 42 25 -31 -127 124 158 104 61 126 68 64 44 211
7271B11l60l5L23p4r9PO4j71j8K65k03K57j63mk61M60l02L5R1o5j44J91J57k46
$$ 211 -149 -184 139 65 -34 -27 37 -134 -152 113 -90 167 4 0 -261 199 -103 -68 23 -42 -186 5 162 -84
7295h4K90l28K57k42N2L39k89J8J37k56L68j44j26J13j20j09L8K48m57L58L4J3
$$ -84 206 -122 135 -107 -55 284 -5 13 150 -106 262 118 -8 105 -15 -124 -86 162 -295 63 97 110
7317A10o3j14K40k62J3k49K40N9j98J16J91j04k23O4K29k27J77k18K75r2o6R8
$$ 110 47 -67 173 -89 -76 -325 -85 -26 -224 -108 83 -21 -244 -180 49 -178 -1 -219 56 -36 -102 -4
7339dJ64l86K87nj10K09l3J3j1j04l6o0J01Q9k17J67q3k6j42K18j59K0K5J11j63
$$ -4 160 -226 61 56 -54 155 122 135 124 20 -16 -76 25 114 -103 64 -19 -45 -187 31 -128 -108 -83 28 -135
7364a35K80l55O5p9J25J59j04J17k61M60m17P7L4Q3k33j36L04j1j02K02j1N5K5
$$ -135 145 -210 -145 -224 -99 60 -44 73 -188 272 -145 -68 -34 49 -184 -320 -16 -27 -129 73 62 117 142
7387A42m7J84k14L5Pj49j08L71r2p5l00J40n4J69j37K37J08R4j15n34M75k31p5
$$ 142 95 279 65 100 107 -42 -150 221 129 54 -246 -106 -160 9 -128 109 217 311 196 -338 137 -94 -169
7410a69L05o4k89J2K09q6O2M8L5k67K36mqL05k89O6n3N5oj1n1K4r8J8L75k51P9
$$ -169 136 72 -217 -205 4 -82 -20 28 63 -204 32 28 20 325 36 102 49 104 98 87 36 60 -38 -20 355 104 183
7437A83j99J5l3PR7q6M1o6P3R6j1j21j44J93j57K89k86jM11l49O7j41J61j43J67
$$ 183 -16 -1 -34 -27 70 -16 25 -41 32 128 117 -4 -148 45 -112 177 -109 -110 301 -48 19 -122 39 -104 63
7462F3P3m5k11K19r5o2Q7j13J30m4j58L16j9l01K03J3J78l09O4j42J10N6J1j09
$$ 63 136 91 -120 99 4 -58 29 -84 46 2 -156 160 141 -160 43 56 234 -75 -11 -153 -43 13 24 -85
7486h5r5L05k04K06l51K93J37j40l7M6j58J21n6J59k26l0M7K51j05l52L9L10k84
$$ -85 -180 125 -79 127 -224 69 206 66 29 75 -83 38 -18 141 -85 -115 -68 183 78 -274 -235 75 -209
7509b09K45K57l73K42l15K13Q9j56J99j33k13J74r0O6Kl08K47k74P0L50P8l36
$$ -209 36 293 -80 162 -153 60 149 -7 192 59 -154 20 -70 -4 -2 -310 -63 -337 -267 83 161 -175
7531a75K88k33K7O9o5J95r6j70J57l6O2K5P6k02J15Q1q4j45N1J97r5q3j07J59
$$ -175 113 -120 -93 -24 -89 106 10 -160 -3 -39 23 48 124 -78 37 118 34 -111 -60 137 42 -41 -148 11
7555A1o8Q7Q1j55N3m2J00pQ6j75Q1Ok38K45j48J89M9k6j70K6J72r6j90o5J09J70
$$ 11 -57 30 111 -44 9 -33 67 60 146 -29 52 58 -180 65 -83 106 155 129 -41 -15 157 61 -129 -194 -85 85
7581H5j80j43K29j1J64l54J42l1J12J46j09j50K27J03j91N7L6Pk48M8q7K67r0
$$ 85 -95 -238 -9 -20 144 -210 -68 -99 13 159 50 -100 127 230 39 96 132 139 -109 -61 -148 119 29
7604B9o3P0j64K22j71j7J83o2J05k13M07l66K02j27O3R0j60rp9J65%M6k67J60
$$ 29 -34 36 -128 94 -77 -94 89 27 132 -81 326 -40 162 35 98 188 28 19 -60 105 105 151 -116 44
7628D4j95L22J5j81n1K27k68K24q2o3R1j63K29j97Q4K8j48o2M8J37Q4j27M9j18
$$ 44 -151 171 186 5 -46 181 -87 137 55 -8 83 -80 149 -48 36 64 -84 -146 -98 39 123 -4 45 -73
7652g3J53m4o4j97K28J04l60J74K37r6k09Q8l9j58K71PJ13l50L50k32K35j0l07
$$ -73 80 36 -28 -225 3 107 -253 -79 158 62 -147 -59 -98 -256 15 22 135 -215 135 -97 138 128 -179
7675a79K56k43L50k38j72J3K36o0j35R7k0k0J80j1j21J03j70J51R2j11k05K33
$$ -179 77 -166 184 -54 -226 -213 23 -37 -172 -75 -95 -115 65 54 -67 36 -134 17 109 -2 -207 26
7697B6n6M0j34J49K4jL6j47J80j69K16k28P0Lq3j27L23%KN5k07K03k84J5J68j93
$$ 26 -30 10 -124 25 49 48 84 -63 117 -52 164 -64 6 9 -74 -201 122 122 124 179 -28 175 -109 -94 74 -119
7723a19K56M8j13l35M51j55j68J84j25N8L1k6L3J4o1J1r1j39K11q8J13R5k07J90
$$ -119 137 185 72 -263 188 33 -135 49 -76 -18 13 -13 20 34 -27 -16 -107 -246 -35 -123 -10 85 -122 68
7747F8k06J19L1j53L88m05J81n7%K35m7j90N6P4K83l51J41l56J84P4o5J78l73
$$ 68 -138 -19 12 -141 247 -158 23 -34 -34 201 154 -36 20 94 377 26 167 -189 -5 69 4 182 -191
7770a91K59k49L85k68l3J16m2J71q8r1j89J43m7M92m92j45K64J44j60P3j44l9
$$ -191 68 -181 204 -64 -97 19 -23 148 60 -31 -220 -77 -124 368 -124 -269 -5 139 -21 52 -92 -131
7792a31L78k99j40L35o3O6l29q0K12p7k4K26k8j23J11%mK5o9J06l7P2J01l13K32
$$ -131 247 -52 -192 143 80 146 -183 -263 -51 -128 -152 74 46 -77 34 34 30 55 -14 92 55 127 228 -85 147
7817A47k32Mk27K67J36l00J30j0j45O0K79j28O2nn4J46km0L5j40J00k28M21l04
$$ 147 -85 -81 -308 -41 95 -205 -75 -85 -230 -170 109 -19 43 38 -16 130 128 88 123 -17 83 -145 276 -28
7841b8j53L09k64kJ57J1R2r8r8J22k63K75Nj05J09l8J47j55Kj30J58r1P3pJ64
$$ -28 -181 128 -136 -138 19 30 122 24 -74 48 -215 60 65 -40 69 31 178 23 25 -105 53 -38 35 28 192
7866A92j39J14k36J95j47j99L96l3j57N9K5k69J85J77k39J30l43L08J61k10J16
$$ 192 53 167 -69 126 -21 -220 176 143 -14 45 70 -199 -14 163 -76 54 -289 19 180 -30 86
7887H6Q7j58q9M1M3O8Q3o3J08l10j2j17K19p1K66k44Q4r7L5j28O0p3J57N8j21
$$ 86 173 15 -74 -33 10 78 161 98 206 -104 -116 -233 -14 -85 181 -63 21 -76 -41 -169 -109 -182 -25 33 -88
7912h8l2kj84K16M5M9k12J40Q1lo3O6j66J23J41j7m01K07L64k34Q5k09l0R1J30
$$ -88 -120 -122 -306 -90 -45 4 -208 -68 13 10 -53 13 -153 -30 111 94 -307 -100 264 30 115 -94 -124 -33 97
7937I7M5j39J96o3r5j11J67J2R2n4j41m5l6q8J02L6pj07J81j51J62P4j55k2K98
$$ 97 142 3 199 136 41 -70 97 109 201 147 6 -39 -75 -163 -61 -25 -32 -139 42 -109 53 127 -28 -50 248
7962B48l16L27m33J13nM5l5j46J68M1K66k53j02J46k44q0P9O5L2O2j08K65l02
$$ 248 -68 259 -174 -61 -66 -21 -56 -202 -34 7 273 20 -82 64 -180 -260 -181 -116 -84 -22 -130 135 -167
7985a67J11J68K04k24j39q8K36j31J39j66m3J70j66J49J6M2K75l99p5o2K54J37
$$ -167 -56 112 316 92 -47 -135 101 -30 109 -57 -100 70 -96 53 69 111 386 -13 -88 -150 104 241
8007B41r9M2m8q4j88J05k0N1M37m40n3O3K80j93j17j01J57N3k17K50j50k38K63
$$ 241 142 184 136 52 -136 -31 -51 0 437 -3 -56 7 287 94 -23 -124 33 86 -131 119 -31 -269 -6
8030fj3J29Ll31K71q5J20R1j15j16K24n1l43L76m5j13n1R2k3K46j08o7r1L01n87
$$ -6 -19 110 113 -218 53 -32 88 179 64 -52 172 121 -222 154 109 -4 -55 37 14 260 152 85 -6 295 -292
8055b92M77j93r2M3j64K11P5K15k40o1Q0k7O1j2k5j56J43o8n0l6K52q7p8L16j79
$$ -292 185 -8 -100 -57 -221 -10 65 280 40 -21 59 32 93 81 56 -100 43 -25 -75 -111 141 54 -24 292 113
8080A13r1o6p8J35j98K60k6O1j63J33j43K60l93J83K6N7n1j03J65l9m7k06K82
$$ 113 22 -44 -122 13 -185 75 49 110 -53 80 -63 197 -196 -13 13 70 19 -84 81 42 -5 -211 71
8103G1k35J98k15K36j18m4L11l63J42J69q1l10J31Pk6Q4L23l49rQ8qR2N3L2k84
$$ 71 -164 34 -181 55 -63 -107 204 -159 -17 152 71 -239 -108 -101 -127 -43 280 -69 -78 10 2 94 147 179 -105
8128a05L6L9l0K77k99R5j61L09p4q9pq1Q7L03l75K00O0k76r3J16J14k45N2n1K27
$$ -105 -69 -30 -60 217 -82 13 -148 161 87 -2 -9 -90 -3 300 -75 125 185 -91 -184 -68 46 -199 -147 -198 29
8153B9l6o2P9q0LO2p7L2J9R4J58k86o8m5K06k30K77L2l46K43k0O9j43K3J7p9J73
$$ 29 -7 -69 10 -70 -67 -5 -82 -50 -31 63 221 -65 -133 -178 28 -202 75 107 -239 4 -16 53 -90 -67 -50 -129 44
8180D4m4J7K0J5r5J50k4l65K25qJ96
$$ 44 0 17 37 52 -43 107 83 -282 -57 -65 131
8191A31
$$ Imaginary data points
##PAGE= N=2
##DATA TABLE= (X++(I..I)), XYDATA
0@%%%%%%%%%%%%%qJ6j6J6j6J7k5L2l4M2m9N7p0P9q9J04j20J37j55J76k00K25k54
$$ 0 0 0 0 0 0 0 0 0 0 0 0 0 0 -8 8 -8 8 -8 9 -16 16 -18 24 -25 32 -38 41 -48 56 -64 73 -82 94 -106 119 -135
36a35K87l20L59m00M42m95N49o06O71p43Q22r04R94j097J210j330J464j618J789
$$ -135 152 -168 191 -209 233 -262 287 -319 352 -391 431 -473 521 -576 634 -696 768 -850 939
55I39j981K202k453K743l087L501m008M647n484O628q294J0960j5912K8198j16001
$$ 939 -1042 1160 -1293 1450 -1637 1864 -2144 2503 -2981 3647 -4647 6313 -9599 18599 -97402
70i7402k26812R5634J02715Q9111J20047J10730R647j9083q1449j62115j49517
$$ -97402 -324214 -228580 -125865 -36754 83293 194023 203670 184587 103138 -58977 -208494
81b08494l9656M9321J36788J52914P2948R591J3337n3885j50526j49793p1239
$$ -208494 -248150 -198829 -62041 90873 163821 173412 186749 132864 -17662 -167455 -238694
92b38694J2706J21881J77482J02272N679j5125n1428j19835j21190o7278j9348
$$ -238694 -225988 -104107 73375 175647 181326 166201 114773 -5062 -126252 -193530 -212878
103b12878O9803J65788J39620K4455l3719m6536p9255j04052r3752m8203N6106
$$ -212878 -143075 22713 162333 186788 153069 106533 27278 -76774 -170526 -218729 -162623
114a62623J51271J35271N9344L15o3750j09059q5024n6446n2085J2729J16869
$$ -162623 -11352 123919 183263 183578 119828 10769 -74255 -130701 -182786 -170057 -53188
125e3188J40484Q5075J4448n9973j02097q2557n6193m5314o6P4884J20588J14405
$$ -53188 87296 172371 186819 126846 24749 -57808 -114001 -159315 -159381 -84497 36091 150496
137A50496N0250m9790j10080r6778n8123k8905M104M6798R0985J12498P6109j6846
$$ 150496 200746 150956 40876 -55902 -114025 -142930 -138826 -92028 -1043 111455 187564 170718
149A70718r9918j10799o9812k6734N313M0236P4714R3614P8307J7460o5840j16239
$$ 170718 70800 -39999 -109811 -136545 -131232 -90996 -16282 77332 155639 173099 107259 -8980
161h980r9081l7897J8975M6548N6712P1772P9520L9130m1392j02152j06635o1819
$$ -8980 -108061 -145958 -126983 -80435 -23723 48049 127569 166699 125307 23155 -83480 -145299
173a45299L838N3712O7518O2150N8203L9768q298p2795j10454q6351j3583N2030
$$ -145299 -141461 -87749 -20231 41919 100122 139890 131592 58797 -51657 -138008 -151591 -99561
185i9561P3623O4148M9081L3538K869m9339r3653r2118l9959L0222P6213Q0061
$$ -99561 -25938 38210 87291 120829 123698 74359 -19294 -111412 -151371 -121149 -44936 35125
197C5125N3706K3177k797l3618o8989q7536o1889O678P1874Q8212O0380K3720
$$ 35125 88831 112008 109211 75593 6604 -80932 -142821 -136143 -64269 23943 84323 108043
209A08043n097k8511n4710p4335o5709j6515M7759Q6661P9861L6639r636l4664
$$ 108043 102946 74435 19725 -54610 -120319 -136834 -89075 -2414 77447 114086 104450 69786
221F9786m6603n9453o1153l1646K5325P7218Q8294N1798k965l7918m8810n1720
$$ 69786 23183 -36270 -97423 -129069 -103744 -26526 61768 113566 110601 72683 23873 -27847
233b7847n0407l4160N232N6492Q6258O8649J6030l4339n7210n5016m2636k7915
$$ -27847 -78254 -112414 -107182 -50690 35568 104217 120247 85908 28698 -26318 -68954 -96869
245i6869m353L5832P4822P7366L5843k2183n9807o4163m3856k0855k120K3198
$$ -96869 -101222 -65390 9432 86798 122641 100458 40651 -23512 -67368 -88223 -90343 -67145
257f7145N6682P2665N0316j927n1899p0899n3727k2600K577K2014M3956O1174
$$ -67145 -10463 62202 112518 110591 58692 -12207 -65934 -88534 -85957 -63943 -19987 41187
269D1187N4631J7779l5493p2361o6707l0997N126K5631L8270M9951N0483K8493
$$ 41187 95818 113597 78104 5743 -60964 -91961 -86835 -61204 -22934 27017 77500 105993
281A05993j8158o1180p1805m5639k684K8108M2412M4882M1599K8697k124m4715
$$ 105993 87835 26655 -45150 -90789 -93473 -65365 -22953 21929 63528 92225 90101 45386
293D5386p0808n8536j6430K6141M7333M6404L6854K5072L690l0412o0214o2775
$$ 45386 -25422 -83958 -100388 -74247 -26914 19490 56344 81416 85106 54694 -5520 -68295
305f8295l1272J3915M7384N3702L8818K0227K724j9776m6785n9423m3360k116
$$ -68295 -99567 -85652 -38268 15434 54252 74479 77203 57427 10642 -48781 -92141 -94257
317i4257M1477N9289M6314K0563j08j7697l6741n1127m6242j5685K8066N7659
$$ -94257 -52780 6509 52823 73386 73278 55581 18840 -32287 -78529 -94214 -66148 -8489
329h489N4905K8573n36k0318l3733m1510m1981k3812J1986M8882O0015M0048N342
$$ -8489 46416 74989 74453 54135 20402 -21108 -63089 -86901 -74915 -26033 33982 74030 79372
342G9372k2098l5223l7618l5934k5636R35L6520N7639M8190J6232j7490l7917
$$ 79372 57274 22051 -15567 -51501 -77137 -76202 -39682 17957 66147 82379 64889 26972
354B6972m0431l2988k1532l353K4005M8403N1863K9269q469l8157m5062l3801
$$ 26972 -13459 -46447 -67979 -71332 -47327 1076 52939 82208 73739 35582 -9480 -43281
366d3281j8842m938J6560L9507M9675L6318L549l1070m7873m0055k1139k509J5110
$$ -43281 -62123 -67061 -50501 -10994 38681 74999 78548 47478 -395 -40450 -61589 -64098 -48988
379d8988L1348M1763L9088J5802k0669m6964m6147k6222l181J5445K8160L6115
$$ -48988 -17640 24123 63211 79013 58344 11380 -34767 -60989 -64170 -48725 -20565 15550
391A5550L6164K1797r074l9959m8711l4941q597J6355K9386L2958L2028K2410
$$ 15550 51714 73511 64437 24478 -24233 -59174 -67771 -51416 -22030 10928 42956 65366
403F5366p46k8883m6257m1879j7921J2893L1431L3854K9208K0923L722j9643m0170
$$ 65366 64620 35737 -10520 -52399 -70320 -57427 -25996 7858 37066 57989 61711 42068 1898
416A898m3785k6565N219L0140L7080L0512J9368L856j4899l1683m0998l1832m680
$$ 1898 -41887 -68452 -63233 -33093 3987 34499 53867 57723 42824 11141 -29857 -61689 -66369
429f6369K4126L8413L5862K0958K048j2594k5287l6276l4475j2598J7074L6153
$$ -66369 -42243 -3830 32032 52990 55038 42444 17157 -19119 -53594 -66192 -49118 -12965
441a2965L8990K4835M532j1790k4417l1923l1410j6219O783K9633M1380L1046
$$ -12965 26025 50860 55392 43602 19185 -12738 -44148 -60367 -53584 -23951 17429 48475
453D8475Q581j1687k4163k9172k8139j8756l98K3733L9515L4955J4161p689k3521
$$ 48475 57056 45369 21206 -7966 -36105 -54861 -55259 -31526 7989 42944 57105 49416 25895
466B5895l0516k7269j7669k480J6432L2394L6089K3004j435k3723l2134k7107
$$ 25895 -4621 -31890 -49559 -52039 -35607 -3213 32876 55880 54445 30722 -1412 -28519
478b8519j6686m756J1995K8096L4752K5427M239j7539l1025l0893j9242l643J0078
$$ -28519 -45205 -49961 -37966 -9870 24882 50309 54548 37009 5984 -24909 -44151 -47794 -37716
491c7716K3445L0464K7211J1000j1443k9961l3011k1771n759Q410K1327K8092
$$ -37716 -14271 16193 43404 54404 42961 13000 -20011 -41782 -47541 -39131 -17804 10288
503A0288K6124J4476m786k5798l3722k5199r418P579K1003K6148K3306J5469J143
$$ 10288 36412 50888 46102 20304 -13418 -38617 -48035 -40456 -19453 6695 30001 45470 46613
516D6613j9533l2225k8950j3552M762J9817K6484K2621J5026L935j3627k8732
$$ 46613 27080 -5145 -34095 -47647 -42885 -23068 3416 26037 41063 44998 31371 2639
528B639k9735j8795p82J8692K8361K3095J4274M911j0432k4949k6783k0103p242
$$ 2639 -27096 -45891 -46673 -27981 380 23475 37749 42660 32228 7279 -19504 -39607 -46849
541d6849J3458K8373K4533J6001P058r172k2894k3649k0986j2197R029K6727K5463
$$ -46849 -33391 -5018 19515 35516 42574 33402 10508 -13141 -34127 -46324 -37295 -10568 14895
554A4895J8479R034p869k1254k1954k0912j3901N827K2041K3577K1214J3064o591
$$ 14895 33374 42408 34539 13285 -8669 -29581 -43482 -37655 -15614 7963 29177 42241 35650
567C5650j9405j9830k0361j6608R39J8535K4032K3198J4667m171j7570j9892j9960
$$ 35650 16245 -3585 -23946 -40554 -39615 -21080 2952 26150 40817 36646 19076 -816 -20776
580b0776j6059o65J4294J9744K3249J8406K80j5688j9738k0508j6426k498J0058
$$ -20776 -36835 -37500 -23206 -3462 19787 38193 38473 22785 3047 -17461 -33887 -36385 -26327
593b6327J7538K3525K1031L136j2935j8715k1850j8087k627R431J4955K1136K0037
$$ -26327 -8789 14736 35767 38903 25968 7253 -14597 -32684 -35311 -25880 -10925 10211 30248
606C0248N985p312j6169k2708j9281m693N908J3059K1305K0120Q310l264j4866
$$ 30248 36233 28921 12752 -9956 -29237 -33930 -28022 -14963 6342 26462 34772 31508 16642
619A6642k3424j9947o626L662J3019K0480J9137Q670p69j1022k1762k0194r533
$$ 16642 -6782 -26729 -33355 -29693 -16674 3806 22943 31613 30844 19822 -1940 -22134 -31667
632c1667R29J1733J9276J8114J0464K501r195k0085j9630j2380j995J0370J9471
$$ -31667 -30738 -19005 271 18385 28849 31350 22155 2070 -17560 -29940 -31935 -21565 -2094
645b094J8129J1172L319p489j7490j8747j3518m624P297J7722J8879J2658M825
$$ -2094 16035 27207 30526 23037 5547 -13200 -26718 -31342 -24045 -6323 12556 25214 30039
658C0039o302j5625j7622j4086p111N510J5781J7854J4224O605l860j4608j7154
$$ 30039 23737 8112 -9510 -23596 -30707 -25197 -9416 8438 22662 29267 25407 10799 -6355
671f355j4601q345L659J3482J7049J5082Q885l261j2665j6287j5048r216J321
$$ -6355 -20956 -29301 -25642 -12160 4889 19971 28856 25595 12930 -3357 -18405 -27621 -26300
684b6300J1582J6647J5086R844j589j0370j4345j5591j0689l10R743J4261J6365
$$ -26300 -14718 1929 17015 26859 25270 14900 555 -15036 -25725 -26035 -16292 -2031 14334
697A4334J0923R81r081j4553j5636j0465j901P024J3794J5901J1660K611o758
$$ 14334 25257 26238 17157 2604 -13032 -23497 -25398 -18374 -4580 11321 22981 25592 18834
710A8834j3376j5559j1366l547N501J2494J4910J2186M883m350j2545j5071j2666
$$ 18834 5458 -10101 -21467 -25014 -19513 -7019 7891 20077 24960 20610 8065 -7006 -19672
723a9672m983M174J1722J4399J1987O150k700j0698j4562j2860n956J906R758
$$ -19672 -24655 -20481 -8759 5640 17627 23777 21077 10379 -4183 -17043 -22999 -21093 -11335
736a1335J4187J2757O865j078r364j3327j3107p607L33Q648J3455J2904Q186m0
$$ -11335 2852 15609 22474 21396 12032 -1295 -14402 -22009 -21676 -13028 427 13331 21517 21477
750B1477p856j2663j2703q867o44O857J2370J2754Q995J656o324j2146j2472r219
$$ 21477 13621 958 -11745 -20612 -21256 -14399 -2029 10725 19720 21376 15052 2906 -9566 -18785
764a8785k179N216J1080J2828J0064K870n152j0424j2348j0587l393M665R820
$$ -18785 -20964 -15748 -4668 8160 18224 21094 15942 5518 -6830 -17417 -20810 -16145 -6325
777f325J2361J0063L976l239r393j2401j0450m349L023Q747J1481J0522N522k212
$$ -6325 6036 16099 20075 16836 7443 -4958 -15408 -19757 -16734 -7987 3494 14016 19538 17326
791A7326q518j1105j0727n632J107P722J1398J0775N938q41o906j0818j0950o486
$$ 17326 8808 -2297 -13024 -18656 -17549 -9827 1571 12346 18284 17443 10537 -281 -11231 -17717
805a7717N4P097R905J0637P217M22n835j0235j0604p367j087N301R739J0491P562
$$ -17717 -17663 -10566 -661 9976 17193 17615 11780 1545 -9059 -16426 -17513 -12212 -2473 8018 15580
820A5580J932m958r518j0217p852k043L987Q934J0457P890K368l356q274r904
$$ 15580 17512 12554 3036 -7181 -15033 -17076 -13089 -4155 6302 14192 16560 13204 4930 -4974
834d974q117l558L012Q098R788Q518L490k487p317r939q242m068J862O882R147
$$ -4974 -13091 -16649 -13637 -5539 4249 12767 16257 13770 6453 -3486 -11728 -15796 -13934 -7052 2095
849B095R002M885j601o917r176q713m702R02N932R179Q700N386q44n314q644r062
$$ 2095 11097 15982 14381 7464 -1712 -10425 -15127 -14225 -8293 886 9586 14972 14128 8814 170 -8892
865h892n578L15N124Q186Q671N611R64m701q257q742n901q55M112P815Q630O176
$$ -8892 -14470 -14155 -9031 -845 7826 13437 14401 9700 1443 -7299 -13200 -14055 -9943 -2128 6502 12678
881A2678J152l760p147q210o554k091L371P069Q556O467K095k686o606q132p260
$$ 12678 13830 10070 2923 -5287 -11841 -13932 -10561 -3492 5064 11531 13626 10940 4334 -3798 -11058
896a1058k741K902O362Q115P043K530j944o235p763p071k541R41N609P903P360
$$ -11058 -13799 -10897 -4535 3580 10623 13153 11209 4974 -2789 -9860 -12401 -11460 -5851 2052 9412
911I412L249j320n161p508p178l688M73M687P764P232L989k10m801p278o627m373
$$ 9412 12661 11341 6180 -1328 -8506 -12194 -11721 -7034 730 7962 11951 11741 6940 -338 -6965 -11338
927a1338j02M167O596P236M677M07l995p009o704m496q92L608O397O789M828J577
$$ -11338 -11440 -7273 -677 6559 11236 11643 7648 639 -6065 -10561 -11453 -7845 -1448 5341 10169 11746
943A1746l538o177o901n000j530K925N952O292N487K511k682o012o776n452k156
$$ 11746 8208 2031 -4870 -9870 -11400 -8475 -2523 3769 9256 11767 9085 3073 -3703 -9155 -11311
958a1311K665N535N862N154L206j663n540o320n784k975J941N261N874N539L241
$$ -11311 -8646 -3111 2751 7905 11111 9448 3908 -2412 -8196 -11171 -9230 -3969 1905 7444 10685
973A0685j486m475n497o290l862J357M828N732N647L405r43l610n188o276m057
$$ 10685 9199 4724 -773 -7063 -10925 -9568 -4740 992 6639 10044 9101 5491 303 -5973 -10030
988a0030M28L762N401O239L800n25l345m979n878m215j35K889N239O844L827p6
$$ -10030 -9602 -5840 -439 5800 9600 9075 5730 751 -5127 -9342 -9477 -6588 -1349 5495 9322 9246
1004I246k967m746n768m014j092K180N182N786M372R89k042m830n461m506j506
$$ 9246 6279 1533 -4235 -8249 -9341 -7161 -1979 3807 8179 9168 7126 2296 -3165 -7671 -9177
1019i177J479M652N830N175J433k162m934m927l811k143J167L963N177M968K383
$$ -9177 -7698 -3046 2784 7959 9392 7230 2296 -2631 -6442 -8585 -7418 -3455 1722 6690 9073
1034I073j338m458n168m492j982J325K952M310N493L387p04l949n579m795k797
$$ 9073 7735 3277 -1891 -6383 -8365 -7040 -4088 222 5715 9102 8398 4449 -1130 -5925 -8722
1049h722J617K970M199M295L448n9k643m818n175l357N94K936M195M528L398K10
$$ -8722 -7105 -4135 64 4359 7807 7748 5105 287 -4888 -8245 -7651 -4715 -520 4008 7406 7616
1065G616k384l525n774m104N9L197L901M556L519M45j757l239n838l796n41J892
$$ 7616 5232 1707 -4067 -8171 -8112 -4915 -1014 3542 7061 7506 5749 2510 -3328 -7124 -7665 -5773
1081e773L930N165L240L26j056l060m965m194j239J372L436N523L476L67o47k762
$$ -5773 -1843 3322 6562 6888 5832 2772 -2193 -6387 -7626 -6254 -2818 2705 6181 6548 5901 3139
1097C139m784l787j469j18L630N449L648J230n52l092m711l225j926o28K877N362
$$ 3139 -1645 -5432 -6901 -7019 -3389 2060 5708 6938 6386 3294 -1417 -4642 -6568 -7196 -4319 1043
1113A043M074J938m60l034m487l267j929o03K335M673L917K337N63l041m716l025
$$ 1043 5117 7055 6595 3561 -926 -4193 -6122 -6725 -4390 283 4200 6537 7100 4059 -657 -3682
1129c682k005j303K486M306L607K455J517k740m618l295k006j535J469M235L726
$$ -3682 -5687 -6990 -4504 -198 3409 5864 7381 4641 23 -3272 -5278 -6813 -5344 -1109 2617
1144B617L541J218k123m639l351k890q82J720L387K949L439K398j583m115l718
$$ 2617 6158 7376 5253 614 -2737 -5627 -6509 -4789 -1402 1547 4986 7384 5801 1686 -2032
1159b032l454j664K418L006K833L136K401r46k839l844m099j835J285L541L153
$$ -2032 -5486 -7150 -4732 -1726 1107 4243 6644 5698 2859 -985 -5084 -6919 -5634 -2093 1060
1174A060L120K103p98k375l397m092k453J010K827L839L114J986n80j773l214
$$ 1060 4180 6283 5485 3110 -287 -4379 -6832 -5822 -2995 844 3958 5944 5364 3591 377
1189C77l798k904L42K212L763L928J614J06j766l147l736k917k15J767L699M145
$$ 377 -3421 -6325 -5983 -3771 -8 3920 5534 5640 3874 727 -3009 -5926 -6141 -4374 -675 3470
1205C470K199k7j758k802l631k814o84J353L458L917K482M36j501k663l477k634
$$ 3470 5669 5642 3884 1082 -2549 -5363 -6047 -4694 -1236 2681 5163 5599 4098 1435 -2042 -4676
1221d676j387J084K936L945L286R14j386l218l103k583j515Q48K229L631L288
$$ -4676 -6063 -4979 -2043 1902 5188 6102 4716 1498 -1605 -4188 -5703 -4855 -2626 1005 4293
1236D293J576q67k891l430k719j355L4K796K965L361K168n44k376l915l179j491
$$ 4293 5869 5002 2111 -1319 -4038 -5393 -5359 -2563 402 3763 5931 5387 3011 -904 -4083 -5574
1252e574Q29J874K999L152K363o3k222l185l492k044R2K005K891K859K623M46
$$ -5574 -4745 -2871 128 3280 5643 5580 3358 173 -3319 -5363 -5271 -3266 -375 2484 5107 5553
1268E553j482l385l576k553j9J979K885K934K278Q95j372k746l731k848k73J505
$$ 5553 4071 686 -2890 -5443 -5462 -3483 -598 2336 4614 5509 4137 1391 -2340 -5188 -5461 -3956
1284c956K479L301K793O45q30k779l353k714j384J137K669L687K507R39l63k434
$$ -3956 -1477 1824 4617 5262 4432 1653 -1700 -4414 -5798 -4661 -1992 1695 4202 5141 4778 2344
1300B344l486l051j364Q67K472L133K907J364n88j907l304k650j776r2J989L563
$$ 2344 -1142 -4193 -5557 -4690 -2218 915 3822 5186 4598 2691 -613 -3263 -5039 -5131 -3142 421
1316D21L222J567l68k029k586l027k287l93J915L228L458K079j8k101k582l331
$$ 421 3643 5210 4842 2813 227 -2800 -5087 -5480 -3565 -337 3121 5200 5182 3081 499 -2832
1332b832j728l32J243K788L312K114N35j578k557l198k002p64J192K376L197K616
$$ -2832 -4560 -4892 -3649 -861 2451 4565 5100 3522 965 -2233 -4235 -4999 -3807 -1431 1766 4382
1348D382R30j469k629l164k140q16R35K162L153K582J293q91k332l330k657j098
$$ 4382 5312 3843 1214 -1950 -4090 -4906 -3971 -1809 1344 3926 5219 4328 1996 -1334 -3991 -5089
1364e089J001K005K985K489J641k62k286l210l005j140M28J948K892K710J474
$$ -5089 -4088 -2083 902 3391 5032 4770 2484 -726 -3731 -4871 -4443 -2495 397 3107 4581
1379D581L17j917l048l060j637K36J566L019K844J812J11j501k937l379j446k56
$$ 4581 4898 2981 -67 -3127 -4764 -4528 -2962 57 2901 4713 4824 3323 386 -2993 -4439 -4695
1395d695J506K721K788K095M58j137k648k848k749k02J210K669K925J825P87r63
$$ -4695 -3189 -468 2320 4415 4873 3736 1088 -1760 -4509 -4711 -3501 -832 2093 3918 4705 3742
1411C742k105l150k378j375J058K852L160K178Q72p34k299k760k546j262L60K470
$$ 3742 1637 -1513 -3891 -5266 -4208 -1356 1804 3982 4854 4120 1821 -939 -3485 -4747 -4387 -1917
1427a917K690K878J415q16k128k672k498j523r2J877L308K683J505l00j935k729
$$ -1917 773 3651 5066 4250 2122 -550 -3048 -4571 -4663 -2786 522 3205 4710 4410 2475 -254
1443b54k203j954o5J612K571K877J757M71k043k399k653j949k57J377K236K676
$$ -254 -2457 -4411 -4476 -2864 -293 2584 4341 4812 2769 370 -2283 -4232 -4489 -3112 -876 1800
1459A800K462Q89j924k320k506k558l16R60K533K451K544P20j126k332k486k766
$$ 1800 4262 5151 3227 907 -1599 -4157 -4473 -3513 -980 1471 4015 4735 3609 1277 -1209 -3975
1475c975p59R46K239K461K809P54o46j678l201k525q78N00J823K858K567J116
$$ -3975 -4734 -3788 -1549 912 3721 4475 3829 2151 -1050 -3575 -4453 -3953 -2130 728 3295 4411
1491D411j44k003k604k918j195J89J886K641K533J192j0j157k653k731j640j42
$$ 4411 4267 2264 -340 -3258 -4453 -4264 -2378 263 2796 3988 3978 2821 168 -2563 -4203 -4345
1507d345J483K669K807J632M0j211k622k749j685k06Q96K621K642K178K30j010
$$ -4345 -2862 -193 2614 4246 4286 3075 453 -2296 -3981 -4187 -3291 -670 1972 4150 4380 3370
1523C370k553k751j500j084R21K235K983J915R89q35k316l010k000n77N14K328
$$ 3370 817 -1934 -3434 -4518 -3597 -1362 1621 3536 4525 3690 1374 -1636 -3636 -4213 -3699 -1371
1539a371K182K371J278m90k200k561k210j368N14J770K659K488J261m90j514k411
$$ -1371 811 3182 4460 3970 1770 -791 -3001 -4369 -3855 -2085 574 3062 4323 3833 2319 -92
1555i2l128j001K05J823K296K299J746l10j142k497k484j685n6J225K140K547
$$ -92 -3220 -4221 -4016 -2193 103 2402 4148 3838 2696 199 -2285 -3970 -4026 -2801 -661 1886
1571A886J937N57j516k116k995j393n70R86K558K574J734L55o99k150k749j648
$$ 1886 3823 4380 2864 748 -2247 -3640 -4210 -3224 -666 1908 3642 3997 3298 1148 -1601 -3249
1587c249p25M37K213K664J738J076m70j907l120j855p41J23K257K486K159R09
$$ -3249 -3974 -3537 -1324 1340 3078 4154 3684 1777 -1343 -3198 -3939 -3816 -1559 927 3086 3995
1603C995k35j946k674j865j278J8J793L019J794J214J07j932j963k360j436m22
$$ 3995 3760 1814 -860 -2725 -4003 -3985 -2192 827 2621 3835 3942 2010 47 -2313 -3749 -4171
1619d171J802K539K122J474L82j719k304j769j651p99J390K243K021K271M93j774
$$ -4171 -2369 170 2292 3766 4148 2429 125 -1644 -3295 -4094 -2704 -461 1560 3831 4324 2550
1635B550j905k063k023n46J027J967K323K222M38r52j985j977k502p29J081J647
$$ 2550 645 -1418 -3441 -3987 -2960 -993 1330 3552 3990 3038 1053 -924 -3426 -4155 -3074 -1427
1651a427K339K041J086r61j516k150k139j393P37J695K452K441R42r23j398k014
$$ -1427 912 2953 4039 3078 1562 -588 -2727 -4120 -3383 -1688 764 3205 4147 3224 1826 -188
1667a88k437j305N31J119K067K977J258m11j235k293k547q42J48P25J762K682
$$ -188 -2625 -3930 -3399 -2280 -213 2764 4022 3611 2376 83 -2464 -3306 -3158 -2433 -671 2011
1683B011J403M61j405k125k378j317j64O82K372K031J611L99n37k238k399j404
$$ 2011 3414 3875 2470 345 -2033 -3350 -3514 -2832 -460 1571 3182 3581 3044 806 -1593 -2997
1699b997o66P80K013J881J644J213p93j714k331k157o18R86J238K453J557R99
$$ -2997 -3663 -2883 -870 1011 2655 3868 3075 1361 -970 -3127 -3745 -2759 -1521 932 2489 3488
1715C488j44j702k283j888j034M31J511K329J849N96J58j188j598k891j250PJ408
$$ 3488 3344 1642 -641 -2529 -3563 -3132 -1621 708 2557 3153 3311 2123 525 -2366 -3616 -3609 -2201
1732b201K400J662J274q0o90j935k255j939o7J661J790K057J354P5r17j452j679
$$ -2201 199 1861 3135 3055 2365 430 -1825 -3764 -3831 -2170 -380 1677 3031 3106 2189 737 -942
1749i42k151m91N65K100K572J768q0j086j300j736j779r50O53J672K238J927K93
$$ -942 -3093 -3584 -3019 -919 1653 3421 3341 2255 955 -781 -2560 -3510 -2857 -1185 1053 2980 3273
1766C273n35j519j990j437q12k28J357K240K327J126q00j355k302j616m80k23
$$ 3273 2738 1219 -771 -2208 -3020 -3248 -1891 349 2676 3802 3002 1647 -655 -2271 -2751 -2974
1782b974Q67K015K435J136k35j517j977j621j105K86P97J091K252J767L02j080
$$ -2974 -2107 -92 2343 3479 3244 1727 -250 -1871 -2976 -2690 -1893 -802 1450 3217 3519 2439
1798B439k244k133j065k2R40J135J949J414J231q86j802k497j358j13J008J263
$$ 2439 195 -1938 -3003 -3025 -2085 -950 999 2413 3644 2758 956 -1541 -2899 -3012 -2004 -741
1814g41J507J612N17K28j673k473j957m82P71J872J489J107J305j97j048k383
$$ -741 766 2378 2895 3123 1450 -1023 -2980 -3462 -2691 -819 670 1777 3082 2885 1837 -546
1830e46k006r49P12J351K097J128Q67j5o21j597k449j429J72J764K163J387N36
$$ -546 -2552 -3501 -2789 -1438 659 1787 2654 2639 2018 421 -2028 -3457 -3285 -1521 642 2029 2565
1847B565j65m90j213j978j644r26J624K021K267Q03l94n64j253j210j812q46M65
$$ 2565 2400 1910 697 -1281 -2925 -3851 -2227 -206 2061 2864 2470 1906 653 -557 -2369 -3215 -2750
1864b750J912K402J370q0j119j354p38j411r63m17J680K609J906N10j509j564
$$ -2750 -838 1564 2934 2854 1735 381 -357 -1768 -2731 -3148 -1468 1141 3047 3557 2048 484
1880D84j142q31r17k98R81J856K332J074q37j906j246j059o80J2K49J206K362
$$ 484 -658 -1489 -2406 -2704 -1723 133 2465 3539 2702 796 -450 -1509 -2189 -2177 -1928 -722 1640
1897A640J887k56j583k396j424K9j33O74P06J685J694Q61j226j964k097p13P01
$$ 1640 3527 3271 1688 -708 -2132 -2103 -2236 -1562 -856 829 2523 3384 2158 194 -1903 -2616 -1915
1914a915M16Q76J003J651J264q92j678k007j785M80J302R36Q94R61J174K58j293
$$ -1915 -1499 -623 380 2031 3295 2403 725 -1282 -3067 -2587 -1285 -349 545 1506 2680 2938 1645
1931A645k687j875k61J019J795R57P79O40L13j54k015k643r38Q58J895J401J019
$$ 1645 -1042 -2917 -3178 -2159 -364 593 1372 2012 2325 2171 156 -2487 -3425 -2567 -672 729 1748
1948A748o9K39r2j258j935j842J78J628K112J485j88m08n9o44j583j958q71J019
$$ 1748 1679 1918 1826 568 -1367 -3209 -3031 -1403 709 2194 2006 1598 1539 895 -688 -2646 -3517 -2498
1966b498K598K010J41j89q37l73j159j428j138L6K155K402J066k55j393j109m84
$$ -2498 100 2110 2251 2062 1225 852 -307 -1735 -2873 -2837 -682 1720 2786 2531 1138 29 -455
1983d55o42j121p01J427K307J859N19j564j572q48k13q86n52N53J744K389R23
$$ -455 -1097 -2218 -2919 -1492 815 2674 3193 1629 57 -791 -1004 -1890 -2442 -1889 -145 2244 3167
2000C167o19k092j663j97k33k7k91R98K198K078k40j713k182j229K3L72M24M12
$$ 3167 2548 456 -1207 -1404 -1637 -1664 -1955 -957 1241 3319 3079 1366 -816 -2045 -2022 -1650 -1226 -814
2018h14J275J759R93r84k323j956l06Q45O60J77P30J415J340k20j796k439j147
$$ -814 461 2220 3213 2229 -94 -2050 -2356 -1511 -851 -674 56 1471 2811 2591 795 -1644 -2791
2035b791Q21R54R09K76P45J190O27j109k438k131N0J452J460R00m4P06O53k76
$$ -2791 -1970 -1016 -107 169 914 2104 2731 1622 -816 -2947 -2897 -1445 15 915 871 1577 2230 1954
2053A954j499k546j114O91K266J417K32l76N57J18p22j837k184J18J824K076R84
$$ 1954 455 -2091 -3205 -2514 -248 1169 1401 1025 1582 1700 978 -859 -3043 -2925 -1101 975 1959
2070A959o07l47K76m34j058j637j347J057K155K073J26o99j000K12m95j570j310
$$ 1959 1352 1005 1281 847 -211 -1848 -3195 -2138 17 2090 2216 1517 517 729 234 -1336 -2646
2087b646j17K119K022J193k86j587q18j5l62j396n50Q66K410J670N5j368j346
$$ -2646 -2763 -644 1378 2571 2285 698 -120 -135 -497 -1893 -2443 -1577 833 2503 2558 1190 -156
2104a56m71o5l90p99k50K079J847J172j178j358j412l83M39m30m01N87K256J579
$$ -156 -627 -692 -1082 -1881 -2131 -52 1795 2967 1789 431 -981 -1364 -925 -1355 -1756 -1169 1087 2666
2122B666M0j429k341q49P43N59m26k67J498J531R80m69k331k121N5J265L56Q4
$$ 2666 2706 1277 -1064 -1913 -1170 -611 -1037 -1304 194 1725 2705 2236 -95 -2216 -2161 -896 -540 -456
2140d56K70J278J393R7j611k603j179J342Q08N43K98J70J027Q02o72k128j549
$$ -456 -186 1092 2485 2582 971 -1632 -2811 -1469 -661 -118 180 350 1377 2179 1507 -621 -2170
2157b170k35J241J562O41n63M36J044k33j551j796j301J018J913J214j43L6N6
$$ -2170 -2405 -1164 398 1039 476 912 1956 1723 172 -1624 -2925 -1907 6 1220 1077 1113 1169
2174A169L90r25j571j826j45J875K083M67m33n82L05nj001j865n16R04K107J360
$$ 1169 1559 634 -937 -2763 -2908 -1033 1050 1517 1084 502 807 802 -199 -2064 -2580 -1676 431 1791
2192A791K00j000o74m8K4j171j459L7J507K106J008q06j406l41L15n20j190n04
$$ 1791 1991 991 317 269 293 -878 -2337 -2300 -793 1313 2321 1515 109 -232 83 -437 -1627 -2131
2210b131P62J839J861R5j248j066p72P3k02j067J10J598J995P80q58j848p95L
$$ -2131 -1369 470 2331 2426 1178 112 -660 -587 -789 -1856 -1746 -148 1847 2627 1769 -79 -874 -871
2228h71J32q9o14M81J947J486J47j990j631m53L60L76m24l7J094J479J215q47
$$ -871 -739 -828 -1442 -961 986 2472 2619 629 -1002 -1455 -1095 -719 -1143 -1180 -86 1393 2608 1761
2246A761k076j475K1J040M20k63L15Q92J204K79j494j715j083O66J120Q01k47
$$ 1761 -315 -1790 -1769 -729 -309 -572 -257 635 1839 2118 624 -1091 -2174 -1508 -388 413 166
2263A66J91P85R52o07j956j485l31J493J305q8k21N47O78J11j224j767r57P37
$$ 166 357 1142 2094 1487 -469 -1954 -2285 -792 513 425 204 751 1429 1540 316 -1451 -2408 -1671
2281a671J599R74j02k77R6N06l37j468j171m21J536J761L12l51p36L89N35j206
$$ -1671 -72 902 800 523 619 1125 788 -680 -1851 -2272 -736 1025 1337 986 250 639 1174 -32
2299c2j511p40J043J724J036J67j021n74M22j03j016j319J48J279J728P55o51
$$ -32 -1543 -2283 -1240 484 1520 1687 666 92 514 411 -605 -1924 -1776 -497 1231 1986 1335
2316A335j161n18M64l31p67q27M01J742J534K0j311o60o26O03m44o94j98J067
$$ 1335 174 -344 120 -211 -978 -1805 -1404 338 1872 1892 581 -79 -705 -102 -546 -1240 -1438 -371
2334c71J681R36j031j284p56p1N66n20k39L54J285J308L24j627j457k03J91M80
$$ -371 1310 2246 1215 -69 -825 -896 -330 -850 -1089 -735 550 1858 2182 555 -902 -1105 -914 -434
2352d34r2j64N91J349P77n94j964j009L46Q24L10j94O3P95R51K38j351j738m64
$$ -434 -526 -690 -99 1250 2027 1433 -531 -1540 -1194 -370 -60 -254 -191 604 1555 1793 442 -1296 -1760
2371a760N61J040N07m55J86J257J30m59j436j359m2J413Q31L83p03L49N13L96
$$ -1760 -1199 -159 348 -107 79 1336 1466 1007 -429 -1788 -1830 -417 414 797 94 443 956 1352
2389A352q81j768o40M50J508R18k72l26L34L63m19j285j039K3J135J132P36n99
$$ 1352 471 -1297 -1937 -1487 21 939 667 341 675 1038 619 -666 -1705 -1682 -547 585 1321 722
2407G22n04M40r3q10r42n92N40J640R11j1q75l37K65k98m03r53k71J113J182P06
$$ 722 218 658 565 -245 -1187 -1779 -1239 401 1312 1301 426 89 354 56 -347 -1300 -1571 -458 724 1430
2427A430m37q23m72M01k97o16p94O36J216J270K35j035r87k42J46j68m41n1P81
$$ 1430 993 170 -302 99 -198 -814 -1608 -972 244 1514 1749 714 -273 -515 -369 -537 -978 -1029 -248
2446b48J562M06p34j027n23J84J94k31m58L95O80J316Nj073j385J56K89K59J05
$$ -248 1314 1720 986 -41 -564 -380 -186 -417 -875 -480 200 1516 1521 448 -937 -781 -492 -233 -128
2465a28n41J033L54Q28o34j014p75k74O76N14j32k55P62R01j87o76j343m54M92
$$ -128 -669 364 718 1546 912 -102 -877 -1151 -475 39 -93 -348 414 1315 1128 452 -891 -1345 -853
2484h53O42L67O7L2P98j13k35j186r34l0Q13P68M69p3l2K96P3q52j202l13L62
$$ -853 -211 156 223 255 1053 940 705 -481 -1415 -1445 -632 136 605 532 500 796 869 17 -1185 -1498 -1136
2505a136J234N73m2k52L41N0k85j107o29J49L47J322N22l12n21%K56n55p29m72
$$ -1136 98 671 629 377 718 768 483 -624 -1253 -1104 -757 565 1087 775 254 254 510 -45 -774 -1246
2525a246K03J130R79p5p37q4p6j30j49q52p3Q72R15L88l02m22n78K68m92m05k06
$$ -1246 -1043 87 1066 991 254 170 94 -36 -185 -1037 -1110 -238 677 1065 763 341 -237 31 -461 -866 -1072
2546a072M60J051L99K15n79p55m4O0j04m13K78L08R42M96k72q27n52j6r4J75k2
$$ -1072 -612 439 838 1053 474 -281 -325 -265 -369 -782 -504 -196 746 1242 970 143 -409 -425 -519 -344 -366
2567c66j46R52M96J82r51m45o34K63M39j48J42K86P13L28n04q79o46j35P18L28
$$ -366 -512 440 936 1118 167 -278 -912 -649 -210 -358 -216 70 783 1111 607 -272 -918 -1053 -335 -7
2587gn7O1N26L48o3p93p58k63J98M24O97k42L09K23M76p16n01o88k79Q42O35J23
$$ -7 -64 -3 523 871 808 15 -743 -1006 -808 -384 313 71 380 603 1079 363 -138 -826 -1105 -263 372 495
2609D95L8j32K72k65m88o88j70P2Q86K25P6l0J24J06n31l30o79J20N76Q02L21
$$ 495 533 401 673 408 -80 -768 -938 -866 20 245 321 291 415 521 -10 -340 -1019 -899 -323 479 800
2630H00j65k37j30k05J13r65k57P54N35N11m0l35j76n6l13m34j82l8O30O83M60
$$ 800 635 398 268 63 176 -789 -1046 -292 243 754 714 379 203 147 -166 -600 -782 -820 -190 493 953
2651I53n19n20k4Jl45Jm2o9Q80K52L15n85l72k00m39K09M2kM37Q34m6j96l85n00
$$ 953 434 -86 -110 -109 -454 -453 -495 -564 316 568 883 298 -74 -274 -713 -504 -462 -464 -27 807 761 565 180 -320
2675c20k87K28k6K5L55N16L48j60m35m08m38J26L03q9K97N1O59J33n66m30n74
$$ -320 -607 -379 -405 -380 -25 491 839 679 244 -164 -602 -476 -173 -262 35 86 745 878 312 -118 -692
2696f92J6K08K92J25K75J23j3J64n32o53n1L30M33k53L87J94K26j04n37k53n52
$$ -692 -676 -468 -176 -51 224 347 334 498 -34 -687 -738 -408 25 -228 159 353 579 475 -62 -315 -867
2717h67J59M18L52L84j66K33o9k75np39l14M28M24M25J11k3l15R6k37m97q0k08
$$ -867 -708 -290 62 446 280 513 444 169 164 -575 -889 -461 -37 388 499 476 161 257 20 -477 -557 -765
2739g65N28N56n3K25l9k74j64k49m44KJ38P42K60k5K9l51j10m34j23j61L24M50
$$ -765 -237 319 266 491 452 178 14 -235 -679 -677 -539 203 463 438 467 116 6 -428 -551 -712 -388 62
2761F2K81M51m76j88l87K02k93j60P7K38N91M05j14m81k57j71k68J01k0L09L25
$$ 62 343 794 318 130 -257 -55 -348 -508 -431 -193 398 803 689 208 -49 -220 -488 -387 -407 -98 227
2782B27K15J47q6l45o20m7L04l8P2L04K75Lj02j17n35k50J95P9J53N46N2J28j39
$$ 227 442 589 503 158 -462 -509 -205 -243 -171 133 408 411 309 192 -343 -593 -398 -319 -166 380 432 560 421
2805D21p9m83j84k45J50L48K46K75J33j80j57o09q4J62k47M83K14L95j87K68m66
$$ 421 342 -141 -325 -570 -420 -72 174 449 582 402 245 -364 -448 -286 -533 -50 164 559 372 640 174
2826A74l00j70j8k15L08N6O00j64j59K92k14k24l31o8K09J98L80l5P1q4q1k87
$$ 174 -126 -296 -314 -529 -221 -165 435 271 112 404 190 -34 -365 -433 -224 -26 354 319 390 306 225 -62
2848f2j74k58J51K44K47L14j85j3q5l10m30O7j69L31N23Q0J68R7k83m75n4r9j5
$$ -62 -236 -494 -343 -99 148 462 277 264 179 -131 -561 -494 -663 -332 191 271 439 536 253 -222 -276 -375 -390
2871c90L9M87J60J13M0j76l52j86k81K83j09L84J84J97J28j87m12q8j19k53K26
$$ -390 -351 136 296 409 449 273 -79 -265 -546 -263 -372 12 196 393 521 334 -78 -166 -285 -538 -312
2892c12L85J97r4J57k76R5k86l06J29r4K44J86K77J66J59n68k78P2l66Q7L03Q3
$$ -312 73 270 176 333 57 152 -134 -440 -311 -405 -161 25 302 468 627 59 -219 -147 -513 -426 -123 -40
2914d0L14K66j96k67r2m74K50o3K95k7M45O8L2l52l91k7j01J53qL96j67L55p0
$$ -40 274 540 344 77 -15 -489 -239 -302 -7 -34 411 479 511 159 -232 -259 -360 -207 -215 181 14 369 299
2937B99j55l25nk28j9L64J08J14RJ94j15j84l61p3Q3J01J69K97r3l7J35j56k21
$$ 299 144 -181 -186 -414 -433 -69 39 153 162 356 241 57 -304 -377 -294 -193 -24 273 180 143 278 122 -99
2960i9k07R2l9J81J39L24J71o52L66j99k03j19L8K74J42J21R4j83l23j67J92m06
$$ -99 -306 -214 -253 -72 67 391 562 -90 276 77 -126 -245 -207 67 209 330 424 241 -82 -249 -57 -463
2982d63M4K44O09m4J93j21n15K9k32k05L6L25J48K86j23J76k17j39m18L2m0J12
$$ -463 -419 -175 434 390 583 462 -53 -24 -256 -461 -425 -100 48 334 211 387 170 31 -387 -355 -395 -283
3004b83K57K76J28j92J32m27q0J00o44M35M27J92k89K85j40j46k81j2o9J02J07
$$ -283 -26 250 378 186 318 -109 -189 -89 -733 -298 129 321 32 317 177 31 -250 -262 -331 -229 -122
3025a22J80R1L28j15l56L0l98J45j96K85J57P2L65k47r6m09O2j31j23M39J05K55
$$ -122 58 149 477 362 6 36 -362 -217 -413 -128 29 101 466 219 123 -286 -224 -355 -478 -39 66 321
3047C21J14j33j42r6l28O1n9K77k41L89N71l94l59K15l39k42p2J48M45R1L64j86
$$ 321 435 302 160 64 -264 -203 -262 15 -226 163 734 340 -19 196 -143 -385 -457 -309 136 227 591 405
3069D05k34l75k9J40k20J13K07L80J23k87R2k96O5l79L09j75K11J50K14p7m47
$$ 405 171 -204 -233 -93 -313 -200 7 387 510 223 315 19 84 -295 14 -161 50 200 414 337 -110
3090a10K0J86m88O2j5JN06j11N51l67J11o40K17r0J61j21M2K13M7k11K51k79j34
$$ -110 -90 96 -392 -330 -345 -344 162 51 602 235 346 -294 -77 -167 -6 -127 -85 128 175 -36 215 -64 -198
3113a98J25l45K66R1kL17K08l60m49j91K24J9OK97L60M3l33L78n18n8m27p5M90
$$ -198 -73 -418 -152 -61 -63 254 462 102 -347 -538 -314 -295 -289 8 368 411 78 456 -62 -120 -547 -622 -132
3136a32M9K63M4J14m4R0n56Mm1J16j19L19J93lN3j89l09k13J4n0M40J50j17K78
$$ -132 -83 180 224 338 294 384 -172 -168 -209 -93 -212 107 300 297 350 161 -148 -361 -347 -397 43 193 76 354
3160C54l89J55k16k30M6o1N08M6l2J78l08k1R2l45m5OJ46K30J6jP8P5m01R0k95
$$ 354 -35 120 -96 -326 -280 -341 167 213 181 359 51 30 122 -223 -268 -262 -116 114 130 129 207 282 -119 -29 -324
3185c24K55j34M63j31k5j6Q4l93j36R7L7J60jK40K91l75N2l0l95J6R6k74M04L34
$$ -324 -69 -203 260 129 104 88 172 -221 -357 -260 -223 -63 -64 176 467 92 144 114 -281 -265 -169 -443 -39 295
3209B95j0N0J9k23k91j45k54N90k88L55M3%L9J62k13l31M0J57l42L70P8J48N2
$$ 295 285 335 354 131 -160 -305 -559 31 -257 98 141 141 180 342 129 -202 -162 -5 -347 23 101 249 301
3232C01l74J02l72L37j92J74J80J42k3k64M5N6m44J46K0K04j03J97J24K15m27
$$ 301 -73 29 -343 -6 -198 -24 156 298 275 11 56 112 -332 -186 -166 38 -65 132 256 471 44
3253D4J43m92J30j23L4K35L96k10k09J11j1M5l55L29j01J1n5J18J34L0j49j45
$$ 44 187 -305 -175 -298 -264 -29 367 157 -52 59 48 93 -262 67 -34 -23 -78 40 174 204 55 -90
3275i0j88m0J80R8J99k7K44l76J08j73N5l27OJ5N18%r4R1k50j05k5J78l94L02
$$ -90 -278 -318 -138 -40 159 132 376 0 108 -65 -10 -337 -331 -316 202 202 108 199 -51 -156 -181 -3 -397 -95
3299i5j9N99j01j75k03k84k3J19J09J58k01M85j38n3N4j21l71j07rK63J92p5m8
$$ -95 -114 485 384 209 6 -278 -301 -182 -73 85 -116 369 231 178 232 111 -260 -367 -376 -113 79 4 -44
3322d4M12l89j04r9J56q4R9J03J0N4K08j49q2k10j3Q9l4l8P2Q2N7K20l71k6j53
$$ -44 368 -21 -125 -224 -68 -152 -53 50 60 114 322 173 91 -119 -132 -43 -77 -115 -43 39 96 316 -55 -81 -234
3347b34J21k94N94k79K73l4R2k22J21k89lm7O8L02J40j50k1k39P1j90j81LL10
$$ -234 -113 -407 187 -92 181 147 239 17 138 -151 -154 -201 -133 169 309 159 138 -101 -30 -220 -401 -398 -88
3370h8L8K70qj68k9J39k33l88L49k27K90K32J05m3k63j19J89J5k32P1J32L9M6
$$ -88 -50 220 212 44 15 154 -79 -467 -118 -345 -55 177 282 239 -24 -143 46 61 -171 -100 32 71 117
3393A17r8P2J48l35o4p8J29L8NK68J59k95n7j26K73l51K11M5j09P9PJ41L0j86
$$ 117 19 91 239 -96 -160 -238 -109 -71 -66 202 361 66 9 -117 156 -195 16 61 -48 31 38 179 209 23
3417B3j60p0P4k7j09L21P3j3n7p8q7o5J50K2k1K05j76J94m2j04k6j25q2J19lP6
$$ 23 -137 -207 -133 -160 -269 52 125 112 55 -23 -110 -175 -25 -3 -24 181 5 199 157 53 27 -98 -180 -61 -64 12
3443A2J82l0p5j95L4j97J95l15L17Q2P2J88l5P1j33k99o5j01L34J35K49k60j67
$$ 12 194 164 89 -106 -72 -269 -74 -389 -72 10 82 270 235 306 173 -126 -191 -292 42 177 426 166 -1
3466aK20l72p0J02k12K46j7J56j28L25l16J00j4m09L21j0L8K62O0k30M9j59j51
$$ -1 219 -153 -223 -121 -333 -87 -104 52 -76 249 -67 33 19 -390 -69 -79 -41 221 281 51 100 -59 -210
3489b10n6J44k13L88J92j98J61k78J83j09O9l53J69L04l5L9P3k41J46k88R7l16
$$ -210 -266 -122 -335 53 245 47 208 -70 113 4 73 -280 -111 193 158 197 270 29 175 -113 -16 -332
3511c32L2M19N8J37Ll48qj51m3M9r9K34J65R1oo8k11n3J81l85K79M6K20j53K80
$$ -332 -300 119 177 314 317 -31 -39 -190 -233 -184 -283 -49 116 207 201 133 -78 -131 50 -335 -56 -10 210 57 337
3536C37k30J5k39L2m3J19o2oJ15j72M23l82J99J08l98j3K36J18L5j25P7j66j8
$$ 337 107 122 -117 -85 -128 -9 -71 -77 38 -134 289 -93 106 214 -184 -197 39 157 192 67 144 -22 -40
3559d0l4J99m31J29K70j29K06m0J02j99j35L05n10J33L8J94O6%L7k6j92j20%j41
$$ -40 -74 125 -306 -177 93 -36 170 130 232 33 -102 203 -307 -174 -136 58 124 124 161 135 -57 -177 -177 -318
3583c18K37K08N5P2K4n5k82J61m16J19J52j4J48j62K46k51K0j9p7J08Q3k3J04
$$ -318 -81 127 182 254 278 223 -59 102 -314 -195 -43 -57 91 -71 175 -76 -56 -75 -152 -44 39 16 120
3606A20k6J04j66L11m62k73J39R9pL7L06j72J43j37k05Q3n4j68N7L30P0k76K63
$$ 120 94 198 32 343 -119 -392 -253 -154 -161 -124 182 10 153 16 -189 -106 -160 -328 -271 59 129 -147 116
3629A16p1j52O0J84l26J53J42j56J97o2j44L07l19j75K86j16MK28r3J17l0k49
$$ 116 45 -107 -47 137 -189 -36 106 -50 147 85 -59 248 -71 -246 40 -76 -72 156 63 180 150 -99
3651i9M1L6j13m0P7J77J14o6L1k21p6K76k61J16Q2J3n5K0J22j04k34n2M0R4J44
$$ -99 -58 -22 -135 -175 -98 79 193 127 158 -63 -139 137 -124 -8 74 87 32 52 174 70 -164 -216 -176 -82 62
3676F2n7mR3j64J39j43j21J69j34K73q0n5K77j06k24j24K08m2m3K23n5k2r6L96
$$ 62 5 1 94 -70 69 -74 -195 -26 -160 113 33 -22 255 149 -75 -199 9 -33 -76 147 92 70 -26 370
3700C70l70J78j83J9j39r2R3j11K47K48k28m6r7k06KN8L31l22L49oj52k4N6K31
$$ 370 0 178 -5 14 -125 -217 -124 -235 12 260 32 -14 -111 -317 -315 -257 74 -248 101 95 -57 -81 -25 206
3724B06k28k58M67j02J17p1j13O8k33o2L7R6q3J48J20J23q9j73P6r1k3p6RJ30
$$ 206 -22 -280 187 85 202 131 18 86 -147 -209 -172 -76 -159 -11 109 232 143 -30 46 -45 -68 -144 -135 -5
3748eQ2k0J23k16J13R5l72O3R3m5L60j01K0j7k24P0J8k55M6K11J9K64m09P8J43
$$ -5 77 57 180 -36 77 172 -200 -137 -44 -89 271 170 190 173 -51 19 37 -218 -172 39 58 322 -87 -9 134
3773A34j96j05L17r3k01K29J43j87R5m6j11jj47J55K1n5J50j4N1k01J6M8j01o0
$$ 134 -62 -167 150 57 -144 85 228 41 136 90 -21 -22 -169 -14 7 -48 102 88 139 -62 -46 2 -99 -159
3797a59J84r2J95Q3l11M0j76O1j0l31L93l6J27J56j40j9K39k97J00p8k36N50p6
$$ -159 25 -67 128 211 -100 -60 -236 -175 -185 -516 -123 -159 -32 124 -16 -35 204 -93 7 -71 -307 243 167
3820A67O2j43okk69o6j27L86m7%J89K06j55m8j87k2J78n8j13N9k8P2J33k39j57
$$ 167 229 86 80 78 -191 -257 -384 2 -45 -45 144 350 195 147 -40 -62 116 58 -55 4 -24 48 181 -58 -215
3845b15J27R9P1o7P6J0j16Q5J00p3j20m4K79k59j55K88J14l5k02J4n3K09l75K19
$$ -215 -88 11 82 15 91 101 -15 70 170 97 -23 -67 212 -47 -202 86 200 165 -37 -23 -76 133 -242 -23
3869b3R0O8K4o7J33j92j18J50m39K55k64K69L53k92K28m32L55k33R2q3J21o9J18
$$ -23 67 135 159 92 225 33 -85 65 -374 -119 -383 -114 239 -53 175 -257 98 -135 -43 -126 -5 -74 44
3892D4J45N7Qm24oJ09j58K48Jl7P8j30M1j08OJ28j24K11J54j97N8n3J41k6l60
$$ 44 189 246 254 -170 -176 -67 -225 23 24 -13 65 -65 -24 -132 -126 2 -122 89 243 46 104 51 192 166 -194
3917a94L4K28P2kr1N2j00m9m4m5m0Q2j34M38r6l8J2r6N0l37N13k39Q1k17L37j90
$$ -194 -160 68 140 138 47 99 -1 -50 -94 -139 -179 -97 -231 207 111 73 85 -11 39 -298 215 -24 57 -160 177 -13
3943a3J82mj94J98k05j67j25N83o4M4j38j11k4j06J94j02l10K74L66k34J5j28
$$ -13 169 165 -29 169 -36 -203 -328 255 191 235 97 -14 -38 -144 50 -52 -362 -88 278 44 59 -69
3965f9j49J73k29L76l49P4J65Q5P1n0j0L4ok92R0Rj07J50L47p0k77j26o0K24r0
$$ -69 -218 -45 -274 102 -247 -173 -8 77 148 98 88 122 116 -176 -86 -77 -184 -34 313 243 -34 -160 -220 4 -86
3990h6K67j80j81K73L3k05R5l61K29J98o4j48K42k45K92p8n1j63P3j95J15M40
$$ -86 181 1 -180 93 126 -79 16 -345 -116 82 18 -130 112 -133 159 81 30 -133 -60 -255 -140 300
4012C00m58K2M74j14l66J03k04O2k9K12R3J72p4j64J61j67j35j41J63N0R9j6j33
$$ 300 -158 -136 338 224 -142 -39 -243 -181 -210 2 95 267 193 29 190 23 -112 -253 -90 -40 59 43 -90
4035i0O7J82r5j21l3O0j12J31j11J08k24L17j74j68J45r5J14N7l1J24j14Q6J37
$$ -90 -23 159 64 -57 -90 -30 -142 -11 -122 -14 -238 79 -95 -263 -118 -213 -99 -42 -73 51 -63 23 160
4058A60j68J65l42L15m1o5p0n8J38K60k06j94R7k72L03k7J37J7k33K33q5j18K65
$$ 160 -8 157 -185 130 89 24 -46 -104 34 294 88 -106 -9 -281 22 -5 132 149 -84 149 64 -54 211
4081B11j72k47J87K39k1m8j58K4J71Rj63o5j69L07P6K46p57L20l27K56K02n7p2
$$ 211 39 -208 -21 218 197 149 -9 15 186 195 32 -33 -202 105 181 427 -330 -10 -337 -81 121 64 -8
4104hl6J20OJ70l78L5J99p5K2n2j34J45K19J7k59r9l23K62L32j22M3j49K24K3
$$ -8 -44 76 82 252 -126 -91 108 33 55 3 -131 14 233 250 -9 -108 -431 -169 163 41 84 -65 159 182
4128A82j98R3j54L3K72j3k05Q6j46K72m36L1J47j65O6L53P7m51O3oK35L3J34m19
$$ 182 -16 77 -77 -44 228 215 10 96 -50 222 -214 -183 -36 -201 -135 218 295 -156 -93 -99 136 169 303 -116
4152a16M5M9J65O8j8l67K51Q0M8l87J19l8P8J6J25j62J40J46k13ol3p6J73J51
$$ -116 -71 -22 143 211 193 -174 77 157 205 -182 -63 -101 -23 -7 118 -44 96 242 29 23 -10 -86 87 238
4176B38k06K7l9m7J90j24j84o8L13n9J47j45j74K2R4J01j12o8O9J3K20j75j45
$$ 238 32 59 20 -27 163 39 -145 -213 100 41 188 43 -131 -109 -15 86 -26 -94 -25 -12 208 33 -112
4199a12l3k05L37J26l21O9k2K62j62M4P2Ok21J17K45k77j3J56k4J09M0m00pO7
$$ -112 -145 -350 -13 113 -208 -139 -161 101 -61 -17 55 61 -160 -43 202 -75 -88 68 44 153 193 -207 -214 -147
4223a47J39j11J48R4j56J15M0%l22J14K17j71n2J39j42J82k7K03j09o07L19L5
$$ -147 -8 -119 29 123 -33 82 122 122 -200 -86 131 -40 -92 47 -95 87 60 263 154 -453 -134 -99
4245i9J1J45k8k59P6K09n9j49K14J1n2J40j97nj43K62O6k05j22J05k0K51j44j26
$$ -99 -88 57 29 -230 -154 55 -4 -153 61 72 20 160 -37 -42 -185 77 143 -62 -184 -79 -99 152 8 -118
4269a18PJ66J6J01l75K92k27L09r4l27K90l13J77K08k66J51q6J56L15m04J35l75
$$ -118 -111 55 71 172 -203 89 -138 171 77 -250 40 -273 -96 112 -154 -3 -89 67 382 -22 113 -262
4291b62K18m5K59p7l18J00M78l6l99J04j20p8L02L4k10J40j30J41o9l8P7j94j67
$$ -262 -44 -89 170 93 -225 -125 353 317 -82 22 -98 -176 126 160 -50 90 -40 101 32 -6 71 -123 -290
4314b90J69K07l69j05K70J32J22k57K24k19q0J74l7O7l1J19Q9o2l88K60J07k10
$$ -290 -121 86 -283 -388 -118 14 136 -121 103 -116 -196 -22 -59 8 -23 96 185 123 -265 -5 102 -108
4336a08J04J70l43l1L77J5j89j40k76L47L94l29j66K02j73J61L7j00n0k15N73
$$ -108 -4 166 -177 -208 169 184 -5 -145 -421 -74 320 -9 -175 27 -146 15 52 -48 -98 -313 260
4357B60lk56M2j7l9P7k96K18j75o0O8K35R3j15j06Jo8M3P2p4L02o8R9j09p1J45
$$ 260 257 1 43 26 -13 64 -232 -14 -189 -249 -181 54 147 32 -74 -73 -141 -98 -26 -100 202 134 233 124 53 198
4383A98l72K24j26j02o9O6M07k11O4j86PJ70k22k9j7J99K62L9l59j87K79j46K56
$$ 198 -174 50 -76 -178 -247 -181 226 15 79 -107 -100 70 -152 -181 -198 1 263 302 -57 -244 35 -111 145
4406A45k88L5N1K5L0K05m46J72PR1J07k76J93k24L92j42j49q3J8K87K64m30P7
$$ 145 -143 -108 -57 -32 -2 203 -243 -71 -64 27 134 -142 51 -173 219 77 -72 -155 -137 150 414 -16 61
4429F1q0pK89j96k01j21J10K79k81J0j17M0K25o4K15l54kJ46P0J37j16P4j87K
$$ 61 -19 -26 263 67 -134 -255 -145 134 -147 -137 -254 -214 11 -53 162 -192 -194 -48 22 159 43 117 -70 -68
4453f8kP4j90K16J77k0j17p7J40k53K11n8q2o6lM47l58J19k45L35l15K95J6j27
$$ -68 -70 4 -186 30 207 187 70 -7 133 -120 91 33 -49 -115 -118 329 -29 90 -155 180 -135 160 176 49
4477D9l03M10l6k50Ok98M74J86j39p9k72l5J39K77k67Q3J64Q7J12j67j90P8k14
$$ 49 -254 156 120 -130 -124 -422 52 238 99 20 -252 -287 -148 129 -138 -55 109 196 308 141 -49 29 -185
4500a85J68N5M8p1j4K11o1j29j8J0o0L84l44j60N8L1o9K59M4l35N9L23o7j57j60
$$ -185 -17 38 86 15 1 212 151 22 4 14 -46 338 -6 -166 -108 -77 -146 113 157 -178 -119 204 137 -20 -180
4525a80J25RK44k79L8J91k26L01j14l74Q8L3M5R1J32j40k33K24K05p4J02k41o3
$$ -180 -55 -46 198 -81 -43 148 -78 223 109 -265 -177 -144 -99 -8 124 -16 -249 -25 180 106 208 -33 -96
4548i6L4j36K07j23K2L21j14K3j79j56J14J96p3m0j30J20J31qq7j81J67k34M25
$$ -96 -62 -198 9 -114 -92 229 115 138 -41 -197 -83 113 40 0 -130 -10 121 113 26 -155 12 -222 203
4571B03mj82j41K49J27j95k25j10K55q5L48p0k78j12M06k32QKJ27P5K47k24l56
$$ 203 199 17 -124 125 252 57 -168 -278 -23 -108 240 170 -108 -220 186 -46 -38 -36 91 166 413 189 -167
4594a67J21j51K59j08J41l7R2l60k1J76j5M6L3O5lj36r4M14k0l35L44l66K08j64
$$ -167 -46 -197 62 -46 95 58 150 -210 -231 -55 -70 -24 9 74 71 -65 -159 255 235 -100 244 -122 86 -78
4618g8R0m5Rj21J07J73rj26k13K40L8k3r2j13j5K48m7J74k16l75N74n8j74%k3
$$ -78 12 -33 -24 -145 -38 135 126 0 -213 27 65 42 -50 -163 -178 70 23 197 -19 -394 180 122 -52 -52 -75
4643g5l3L29mm4M4p9o79N59pK1m2M3N3j52p1N8M5k76K48J88r7k37K22J16Mk81
$$ -75 -108 221 217 173 217 138 -541 18 11 32 -10 33 86 -66 -137 -79 -34 -310 -62 126 29 -208 14 130 134 -147
4669a47J24J23J00k5k58J65j07j4R7k7j62k24O10k5l72L31j63qJ56Q1j81p8J9
$$ -147 -23 100 200 175 -83 82 -25 -39 58 31 -131 -355 255 230 -142 189 26 18 174 255 74 -4 15
4692A5l5m0N0k10K04N5J48k57J51q1m6JJ50j45N4P3L6k28K21j19N9l3k0J15j74
$$ 15 -20 -60 -10 -220 -16 39 187 -70 81 0 -46 -45 105 -40 14 87 123 -105 116 -3 56 23 3 118 -56
4717e6n9L99j82k07l1j71M57r7J39l96qK7R3J55Q1k44r4K02J12j30J53j69o7J93
$$ -56 -115 284 102 -105 -136 -307 150 53 192 -204 -212 -185 -92 63 144 -100 -194 8 120 -10 143 -26 -93 100
4741A00k03J45R2k67J1J86J13j41J1oj78K39k28J79k17L90j30m1j30Q7M4q8m3
$$ 100 -103 42 134 -133 -122 64 177 36 47 41 -137 102 -126 53 -164 226 96 55 -75 12 56 -32 -75
4764g5o2R9n4L7o3J00n9j04J47R1n4k47K57j89K44K29k94O2q6K58j51Pj67J09
$$ -75 -137 -38 -92 -55 -118 -18 -77 -181 -34 57 3 -244 13 -176 68 297 3 65 -21 237 86 93 -74 35
4788C5J26k66J3K1J65L2k4l3l9j19N7J58P2l36J69j40J71q1N6q9J76m5j2j23L70
$$ 35 161 -105 -92 -71 94 126 102 69 30 -89 -32 126 198 -138 31 -109 62 -19 37 -52 124 79 67 -56 314
4813C14m93K67m7J20j80L0kq4L7K38n22K53P4K15k55K3L05k94o1K17N7j33Orj58
$$ 314 -179 88 41 161 -19 11 9 -75 -38 200 -322 -69 5 220 -35 -12 293 -1 -62 155 212 79 85 76 -82
4838h2L37k76O0J48L7o6p4l46K6L56k60J59l19J29P7K57Ql94J52K25p9k09jO5
$$ -82 255 -21 39 187 224 158 84 -262 -236 120 -140 19 -300 -171 -94 163 171 -223 -71 154 75 -134 -135 -70
4862g0J69l42J65K6Q8j36k7L91k35Q0k99K23J29j3n32K41K18K23k52m2j99K32
$$ -70 99 -243 -78 -52 36 -100 -127 264 29 109 -190 33 162 149 -383 -142 76 299 47 5 -194 38
4884C8M4j06mJ19K8Rj32J39J64n56J14J18J27j07p6L8r9j42J67L64k73j34J85
$$ 38 82 -24 -28 91 119 128 -4 135 299 -257 -143 -25 102 -5 -81 -43 -142 -284 -117 247 -26 -160 25
4907B5k10K26j73J19L6K53j58p4J00p2q5j81L74k73K18k80M00j65r1L9p9L84%
$$ 25 -185 41 -132 -13 23 276 118 44 144 72 -13 -194 180 -93 125 -155 245 80 -11 28 -51 333 333
4930C33l66L1J22nO5j51J47l92K97r2N8qo3l8K59m79M39L4M0m76L49P9j47j65
$$ 333 -33 -2 120 115 180 29 176 -216 81 -11 47 39 -24 -62 197 -282 157 191 231 -245 104 183 36 -129
4954a29Q5Q3j14Q5Q6j07J39Rk38nP4O4j02MJ89k35l2L07l44j43J91M03m44L58
$$ -129 -44 39 -75 10 96 -11 128 137 -101 -106 -32 32 -70 -66 123 -112 -144 163 -181 -324 -133 270 -174 184
4978A84k08l7k6K63j25k48J52O5m4J23L4k81J63K1m2N5J22j55j05J95J02k53K5
$$ 184 -24 -61 -87 176 51 -197 -45 20 -24 99 133 -148 15 36 -6 49 171 16 -89 106 208 -45 -20
5001b0J00j41J67q8Jj30o7K50%j40l69L75K15j79Q0j22L4K8J19r8J2j74nJ01j5
$$ -20 80 -61 106 18 19 -111 -178 72 72 -68 -437 -62 153 -26 54 -68 -34 -6 113 15 27 -147 -152 -51 -66
5026f6J3K00j21k1j42R7K84l88R8K76l59J99q0N5k09K88j18J12k2N1q1k60J03
$$ -66 -53 147 26 5 -137 -40 244 -144 -46 230 -129 70 -10 45 -164 124 6 118 96 147 66 -194 -91
5049i1l4J67Oj28J46P7j5q8j16K37p6k19J84Nn1q3J2J35p4R4J6J0m4J70k17N8
$$ -91 -125 42 48 -80 66 143 128 40 -76 161 85 -134 50 55 4 -79 -67 68 -6 88 104 114 70 240 23 81
5075H1j68N6Q7J28r4j49j02J77l8j01J46J01p6j0J18m36J96N3P7j32J45p0j4J18
$$ 81 -87 -31 56 184 90 -59 -161 16 -22 -123 23 124 48 38 156 -280 -84 -31 46 -86 59 -11 -25 93
5099I3Rk35J05P4R2j16J8j65L42j85j06n5K02j52L7p0K07l33J67K73m04P6J89
$$ 93 102 -133 -28 46 138 22 40 -125 217 32 -74 -129 73 -79 -42 -112 95 -238 -71 202 -202 -126 63
5122F3k8Kj02M5k2J88n1j81J34o7n7p4J23j6r7J11J86k8K7j62J04k74J31qK87
$$ 63 35 37 -65 -20 -42 146 95 -86 48 -19 -76 -150 -27 -43 -140 -29 157 129 156 -6 98 -176 -45 -53 234
5147B34l26J42J48j94q8o8O9L94j13l56J23L1M4k5j58K10k2r0j25J94o4L5l9M3
$$ 234 -92 50 198 4 -84 -152 -83 311 198 -158 -35 -4 40 15 -143 67 45 -45 -170 24 -40 -5 -44 -1
5171a%k8K89m64K08k9p8J89k39j01M27p3q7K9L2j93J49m2k8j96K70J08j98K53
$$ -1 -1 -29 260 -204 4 -25 -103 86 -153 -254 173 100 13 42 74 -119 30 -12 -40 -236 34 142 -56 197
5195A97r9n3j7l9J43r5j37J83k56M80k39p5j15J28q9K26j38j05K08l29J78L5Q7
$$ 197 98 45 28 -11 132 37 -100 83 -173 307 68 -7 -122 6 -83 143 5 -100 108 -221 -43 -8 79
5218G9K7q3N8K69m12K25k40n6K90k12o1n7L14k44J14l31K61j1q2J09P4pj02LQ4
$$ 79 106 23 81 350 -62 163 -77 -133 157 -55 -116 -173 141 -103 11 -320 -59 -70 -152 -43 31 24 -78 -75 9
5243InR2j05QP2J03k78J89o2j11J75K0k32J40l0J02r7K3J0l4J43j60R4kj26j94
$$ 9 4 96 -9 -1 71 174 -104 85 23 -88 87 107 -125 15 -15 87 -10 13 23 -11 132 -28 66 64 -62 -256
5269b56J46J10k02NJ64J29o7l31N3J63o8N9K6K32j45J62m90L48L0k7OoJ81l58
$$ -256 -110 0 -202 -197 -33 96 29 -302 -249 -86 -154 -95 -69 163 18 180 -310 38 68 41 47 41 222 -136
5293a36q1K69N7j71l9l9K62r8J73j76j6j40J00J6J2j59J9K40k06K56j86o5j54
$$ -136 -217 52 109 -62 -101 -140 122 24 197 21 5 -135 -35 -19 -7 -166 -147 93 -113 143 -43 -108 -262
5316b62K69L4J39k97K81l59K47k36o2J90j16J12K1R2j01K9J03n7M9m4O2l04O7
$$ -262 7 41 180 -117 164 -195 52 -184 -246 -56 -172 -60 -39 53 -48 -19 84 27 76 32 94 -210 -143
$$ [...]
8191a17
##END NTUPLES=NMR FID
##END=
