##TITLE=1H_SR92_V
 D2O,8 sc, 
 26.10.2021
##JCAMPDX= 6.0         $$ Bruker NMR JCAMP-DX V2.0
##DATA TYPE= NMR FID
##DATA CLASS= NTUPLES
##ORIGIN= UXNMR, Bruker Analytische Messtechnik GmbH
##OWNER= root
$$ XWIN-NMR		Version 3.5
$$ Tue Oct 26 13:35:02 2021 Russian Standard Time (UT+4h)  she@DPX200
##.OBSERVE FREQUENCY= 200.1313468511
##.OBSERVE NUCLEUS= ^1H
##.DELAY= (6, 6)
##.ACQUISITION MODE= SIMULTANEOUS
##.ACQUISITION SCHEME= undefined
##.AVERAGES= 8
##.DIGITISER RES= 18
##SPECTROMETER/DATA SYSTEM= spect
##.PULSE SEQUENCE= zg30
##.SOLVENT NAME= D2O
##.SHIFT REFERENCE= (INTERNAL, D2O, 0, 15.7039)
##AUDIT TRAIL= $$ (NUMBER, WHEN, WHO, WHERE, WHAT)
$$ ##TITLE= Audit trail, XWIN-NMR		Version 3.5
$$ ##JCAMPDX= 5.01
$$ ##ORIGIN= Bruker BioSpin GmbH
$$ ##OWNER= she
$$ F:/spectra/data/she/nmr/H-F/1/audita.txt
$$ ##AUDIT TRAIL=  $$ (NUMBER, WHEN, WHO, WHERE, WHAT)
(   1,<2021-10-26 13:33:53.00 +0400>,<she>,<DPX200>,
      <created by zg, POWCHK disabled, PULCHK disabled
       configuration hash MD5:
       00 E9 B6 7A A2 85 ED C7 34 08 36 98 17 FE 4E 26
       data hash MD5: 16K
       8B 66 79 5B CF 3F 8A B4 7A 60 01 8D 21 C4 8C 94>)
$$ ##END=
$$ 
$$ hash MD5
$$ D2 DB 48 43 FA D5 12 67 D1 01 9C 89 16 96 F8 34
##$RELAX= 
##$RELAX= 
##$RELAX= 
##$RELAX= 
##$RELAX= 
##$RELAX= 
$$ Bruker specific parameters
$$ --------------------------
##$DU= <F:/spectra>
##$EXPNO= 1
##$NAME= <H-F>
##$PROCNO= 1
##$TYPE= <nmr>
##$USER= <she>
##$AMP= (0..31)
100 100 100 100 100 100 100 100 100 100 100 100 100 100 100 100 100 100 
100 100 100 100 100 100 100 100 100 100 100 100 100 100 
##$AQSEQ= 0
##$AQ_mod= 1
##$AUNM= <au_zg>
##$AUTOPOS= <>
##$BF1= 200.13
##$BF2= 200.13
##$BF3= 200.13
##$BF4= 200.13
##$BF5= 200.13
##$BF6= 200.13
##$BF7= 200.13
##$BF8= 200.13
##$BYTORDA= 1
##$CFDGTYP= 0
##$CFRGTYP= 5
##$CHEMSTR= <none>
##$CNST= (0..31)
1 1 145 1 1 1 1 1 1 1 1 1 1 1 1 1 1 1 1 1 1 1 1 1 1 1 1 1 1 1 1 1 
##$CPDPRG= <>
##$CPDPRG1= <>
##$CPDPRG2= <>
##$CPDPRG3= <>
##$CPDPRG4= <mlev>
##$CPDPRG5= <mlev>
##$CPDPRG6= <mlev>
##$CPDPRG7= <mlev>
##$CPDPRG8= <mlev>
##$CPDPRGB= <>
##$CPDPRGT= <>
##$D= (0..31)
0 1.2 0 0 0 0 0 0 0 0.06 0 0.03 0 0 0 0 0.0002 0 0 0 0 0 0 0 0 0 0 0 0 
0 0 0 
##$DATE= 1635240832
##$DBL= (0..7)
120 120 120 120 120 120 120 120 
##$DBP= (0..7)
150 150 150 150 150 150 150 150 
##$DBP07= 0
##$DBPNAM0= <>
##$DBPNAM1= <>
##$DBPNAM2= <>
##$DBPNAM3= <>
##$DBPNAM4= <>
##$DBPNAM5= <>
##$DBPNAM6= <>
##$DBPNAM7= <>
##$DBPOAL= (0..7)
0.5 0.5 0.5 0.5 0.5 0.5 0.5 0.5 
##$DBPOFFS= (0..7)
0 0 0 0 0 0 0 0 
##$DE= 6
##$DECBNUC= <off>
##$DECIM= 32
##$DECNUC= <off>
##$DECSTAT= 4
##$DIGMOD= 1
##$DIGTYP= 9
##$DL= (0..7)
0 120 120 120 120 120 120 120 
##$DP= (0..7)
150 150 150 150 150 150 150 150 
##$DP07= 0
##$DPNAME0= <>
##$DPNAME1= <>
##$DPNAME2= <>
##$DPNAME3= <>
##$DPNAME4= <>
##$DPNAME5= <>
##$DPNAME6= <>
##$DPNAME7= <>
##$DPOAL= (0..7)
0.5 0.5 0.5 0.5 0.5 0.5 0.5 0.5 
##$DPOFFS= (0..7)
0 0 0 0 0 0 0 0 
##$DQDMODE= 0
##$DR= 18
##$DS= 0
##$DSLIST= <SSSSSSSSSSSSSSS>
$$ [...]
##$SUBNAM2= <"">
##$SUBNAM3= <"">
##$SUBNAM4= <"">
##$SUBNAM5= <"">
##$SUBNAM6= <"">
##$SUBNAM7= <"">
##$SUBNAM8= <"">
##$SUBNAM9= <"">
##$SW= 18.0517286264689
##$SWIBOX= (0..15)
0 0 2 0 0 0 0 0 0 0 0 0 0 0 0 0 
##$SW_h= 3612.71676300578
##$TD= 16384
##$TD0= 1
##$TE= 0
##$TE2= 300
##$TE3= 300
##$TEG= 300
##$TL= (0..7)
0 120 120 120 120 120 120 120 
##$TP= (0..7)
150 150 150 150 150 150 150 150 
##$TP07= 0
##$TPNAME0= <>
##$TPNAME1= <>
##$TPNAME2= <>
##$TPNAME3= <>
##$TPNAME4= <>
##$TPNAME5= <>
##$TPNAME6= <>
##$TPNAME7= <>
##$TPOAL= (0..7)
0.5 0.5 0.5 0.5 0.5 0.5 0.5 0.5 
##$TPOFFS= (0..7)
0 0 0 0 0 0 0 0 
##$TUNHIN= 0
##$TUNHOUT= 0
##$TUNXOUT= 0
##$USERA1= <user>
##$USERA2= <user>
##$USERA3= <user>
##$USERA4= <user>
##$USERA5= <user>
##$V9= 5
##$VALIST= <valist>
##$VCLIST= <CCCCCCCCCCCCCCC>
##$VD= 0
##$VDLIST= <DDDDDDDDDDDDDDD>
##$VPLIST= <PPPPPPPPPPPPPPP>
##$VTLIST= <TTTTTTTTTTTTTTT>
##$WBST= 1024
##$WBSW= 4
##$XGAIN= (0..3)
0 0 0 0 
##$XL= 0
##$YL= 0
##$YMAX_a= 157871
##$YMIN_a= -238285
##$ZGOPTNS= <>
##$ZL1= 120
##$ZL2= 120
##$ZL3= 120
##$ZL4= 120
##$ABSF1= 10
##$ABSF2= 0
##$ABSG= 5
##$ABSL= 3
##$ALPHA= 0
##$AQORDER= 0
##$ASSFAC= 0
##$ASSFACI= 0
##$ASSFACX= 0
##$ASSWID= 0
##$AUNMP= <proc_1d>
##$AZFE= 0.1
##$AZFW= 0.1
##$BCFW= 1
##$BC_mod= 2
##$BYTORDP= 1
##$COROFFS= 0
##$CY= 11.3945322036743
##$DATMOD= 1
##$DC= 2
##$DFILT= <>
##$DTYPP= 0
##$F1P= 2.36226072786647
##$F2P= -0.459571619588291
##$FCOR= 0.5
##$FTSIZE= 0
##$FT_mod= 4
##$GAMMA= 1
##$GB= 0.15
##$INTBC= 1
##$INTSCL= 1
##$ISEN= 128
##$LB= 0.24
##$LEV0= 0
##$LPBIN= 0
##$MAXI= 10000
##$MC2= 0
##$MEAN= 0
##$ME_mod= 0
##$MI= 1.114404
##$NCOEF= 0
##$NC_proc= 0
##$NLEV= 6
##$NOISF1= 3.799351
##$NOISF2= 2.8
##$NSP= 1
##$NTH_PI= 0
##$NZP= 0
##$OFFSET= 15.70392
##$PC= 1
##$PHC0= -15151.35
##$PHC1= 3.000824
##$PH_mod= 1
##$PKNL= yes
##$PPARMOD= 0
##$PSCAL= 0
##$PSIGN= 0
##$REVERSE= no
##$SF= 200.130013532006
##$SI= 16384
##$SIGF1= 3
##$SIGF2= 2
##$SINO= 400
##$SIOLD= 16384
##$SREGLST= <1H.CDCl3>
##$SSB= 0
##$STSI= 0
##$STSR= 0
##$SW_p= 3612.71676300578
##$SYMM= 0
##$S_DEV= 0
##$TDeff= 0
##$TDoff= 0
##$TI= <>
##$TILT= no
##$TM1= 0
##$TM2= 0
##$TOPLEV= 0
##$USERP1= <user>
##$USERP2= <user>
##$USERP3= <user>
##$USERP4= <user>
##$USERP5= <user>
##$WDW= 1
##$XDIM= 8192
##$YMAX_p= 0
##$YMIN_p= 0
$$ End of Bruker specific parameters
$$ ---------------------------------
##NTUPLES= NMR FID
##VAR_NAME=  TIME,          FID/REAL,        FID/IMAG
##SYMBOL=    X,             R,               I
##VAR_TYPE=  INDEPENDENT,   DEPENDENT,       DEPENDENT
##VAR_FORM=  AFFN,          ASDF,            ASDF
##VAR_DIM=   8192,          8192,            8192
##UNITS=     SECONDS,       ARBITRARY UNITS, ARBITRARY UNITS
##FACTOR=    0.0002768,     1,               1
##FIRST=     0,             0,               0
##LAST=      2.2672688,     0,               0
##MIN=       0,             -238285,         0
##MAX=       2.2672688,     157871,          0
$$ Real data points
##PAGE= N=1
##DATA TABLE= (X++(R..R)), XYDATA
$$ [...]
1822e79Q1N7M49M13J07k21j56l89l14J16M19j09O19j60J16n75M0j53k08P5K82
1843i0M93K90m79l03Oj98jP9L17l5R1J2k87m41K04K15o4J07M13R1j27k26k20j13
1867b66j61K47L94L75p9j61k96l84N2k9K35M89P5k44O9m83J76m58q3M31K60K82
1889D41j06j46k55r4k14o1K02L35J21J48l9m04l63K04o3K38N41q6M7k41k07k87
1911b89q1J82J31N8K24K42m86N7o36L76r7M77M2J10j62J32k20l25m3J61K0M81
1933C54n7j41K8k58j50k09J17L37K83J0Rk54j26j37l7j09M87j26J40L70l29q0
1955A22q3m97M65N1n6K42J06l65j25j57l38N79j59N22P2k9l45l23J04N4O7J27
1977C4M15k46L56n20j87j63J70m9J44K38KL2l25p2m5K11J99J2kJ11j34k3l19j12
$$ plain form
1822 -579 -498 -441 8 421 528 307 151 -238 -552 -436 -17 -126 493 333 449 -126 -86 -239 -447 -372 -90
1843 -90 403 693 214 -89 -83 -281 -282 -203 114 79 170 182 -105 -546 -342 -127 -191 -84 329 420 293 67 -153 -266
1867 -266 -427 -180 214 589 510 349 53 -331 -279 -308 -73 416 491 247 316 -167 9 -449 -532 -101 159 441
1889 441 335 189 -66 -160 -374 -435 -233 102 223 371 332 -72 -435 -231 -294 -56 485 399 446 205 -2 -289
1911 -289 -370 -188 -57 1 225 467 -19 38 -598 -222 -319 158 200 310 148 280 60 -265 -308 -147 -127 354
1933 354 297 156 184 -74 -224 -433 -316 21 304 314 323 69 -57 -194 -231 -340 147 21 161 531 202 122
1955 122 39 -458 7 58 2 244 350 -15 -140 -297 -635 -56 -215 307 379 350 5 -318 -214 -160 -93 34
1977 34 449 203 559 39 -148 -311 -141 -190 -46 192 194 226 -99 -171 -216 -5 194 206 204 315 181 158 -161 -273
2001b73j2P3L52L16j10ml30K61o71J32J52R7N4N37k49l29n6j49L3J03J31j71N11
2024C98j21m65J2j22J84j89K72K45k02K94k52j51j49J8J86o4M57j39j12J5l71
2045b56n8j85M12K21L03M6m61J1k63k02K75P2L56Q9M7k06l08J09k06K1J31j24
2067a76N18K7j24l39Q0l77J78O3M33N5q8J88m51l60O6M3J77k00O48m0j00j83j79
2090a41k05L96j2K02j9K5J1j35r5p04M25M31L5m5L5k01r6j17K6j12J23O34%k92
2114A69M3l04k0l29K32J02R1L48j8j48q9l06n6qL69J06N2j15K15m33q6k36J93
2137b28L9K09o6J93j66K0m09K26j58m8Q16j88l3j60o1k21J4m4J75L65k72L55k15
2160A43j39j95j6J85k27N14j6j55l12L06k56J3L9j03K40N3K99l72k95Q3j2J78
$$ plain form
2001 -273 -285 -212 140 456 346 342 12 273 -398 -266 -114 -17 37 574 325 -4 -60 -209 -176 -73 58 -113 398
2024 398 277 -188 -176 -298 -114 -303 -31 214 12 306 54 -97 -246 -228 -42 -106 351 212 100 115 -256
2045 -256 -314 -499 -87 134 437 483 22 33 -230 -432 -157 -85 271 360 407 201 -107 2 -204 -183 -52 -176
2067 -176 342 369 245 -94 -14 -391 -213 -150 283 338 250 438 -13 -373 -307 -264 -87 -287 361 321 221 38 -141
2090 -141 -346 50 38 240 221 246 257 122 27 -677 -252 179 214 169 204 3 -93 -210 -184 -296 -173 461 461 169
2114 169 212 -92 -112 -441 -209 -107 -16 332 314 166 77 -229 -285 -293 76 182 234 119 334 -99 -185 -421 -228
2137 -228 -189 20 -46 147 -19 1 -408 -182 -340 -388 428 240 207 47 -14 -235 -221 -265 -90 275 3 358 143
2160 143 4 -191 -207 -22 -249 265 249 94 -218 88 -168 -155 -116 -219 21 74 373 1 -294 -211 -223 -45
2182d5l8L57j6k25j9j31P6k83J31J74L28J0Q1l80k36Mp2J03k9L27K67j74J09o94
2206c75J58p5J00M06L6Q4j53m2k11l90J95Q6J36J48J53l80K62j17m15L29m4K15
2228A06k1J50j78J32j39m43K31J13L9oJ03L20l47J6j50j78J48J33K57m3K8j85
2250H6m01M2R5J25K32j03J12k5l06P8l04Q5L15O4Q7M75l41k31j83j49J45Q7QJ65
2274A58P0j7k7l69j33J66QK09J42K8o0k53j73l9O5K74J27k79K70k21P4k5l12k02
2298e19O02K13q3n1j62R1k63j4k52M10j9P1J43J4k85j58n2M5N41l34M37l20O8
2321A23n5k01J23k18L56o3K31j66J85l20R5m02K69L8K9K04O3j02k67J53l59K04
2343h0K1K31j13O7j50L7m11p2M02j51K27J54J8l9j56k43J50LJ3j6L54q3J52p04
$$ plain form
2182 -45 -83 274 258 33 14 -117 -41 -324 -193 -19 309 319 400 20 -216 -212 -284 -181 -210 117 384 210 319 -375
2206 -375 -217 -292 -192 214 250 334 181 139 -72 -462 -267 -181 -45 103 256 -124 138 21 -394 -65 -109 106
2228 106 85 235 57 189 50 -393 -162 -49 -10 -16 87 407 60 76 -74 -252 -104 29 286 243 271 86
2250 86 -315 -273 -178 -53 179 76 188 163 -143 -65 -369 -284 31 95 182 657 316 85 -98 -247 -102 -15 -7 158
2274 158 228 211 184 -185 -318 -152 -144 65 207 235 175 -78 -251 -290 -225 49 176 -103 167 -54 20 -5 -317 -519
2298 -519 83 296 213 162 0 91 -172 -186 -438 -28 -47 24 167 181 -104 -262 -314 -269 272 -62 375 55 123
2321 123 68 -133 -10 -228 128 65 296 130 315 -5 90 -312 -43 -5 24 228 291 189 -78 75 -284 -80
2343 -80 -59 172 59 126 -24 13 -398 -470 -68 -219 8 162 180 141 -15 -258 -108 -105 -92 -108 246 163 315 -389
2367c89K64J1p4L12k2K05j23l32N9J70k78LJ63j52M14j84j15j0R9m85L60P7J09
2390H2K29k62J41o5k93j19J33J55o8L48k82J10k30p2K00j04L13k54M2n5J71l78
2412b58K0L73j15Q0k43J88J02n1k29m8p1J84K15m1K10m05j45K65m02J87K10j30
2434a04J90o6P5M0l24J00q1l7K28Q8o6M01l62N3j97j08L49m65L62k38J95j99K93
2457A27m10J96J35J02j72o5K14j23k66K75k15J9O1R2M15k78K06l98r3J47j14L89
2479B44r0P4j14O0o4p4l38M31j12K75j62p5n7l0j54r1J09o4N82m42K20P0l34j44
2503b80K37o7M4J09M13j20m43Q6j50k1RL66kj88K9n9j22J84j91J60p7m3J46J77
2527A97j33k20M0K24k47K44p6K44k09J70l37k17L5J50n0L7J01J95l21J03k07J73
$$ plain form
2367 -389 -125 -114 -188 124 102 307 184 -148 -89 81 -197 -194 -31 -183 231 47 -68 -78 21 -464 -104 -27 82
2390 82 311 49 190 125 -168 -287 -154 1 -67 281 -1 109 -121 -193 7 -97 216 -38 4 -51 120 -258
2412 -258 -238 135 20 100 -143 45 147 96 -133 -181 -252 -68 147 106 316 -89 -234 31 -371 -184 26 -104
2434 -104 86 20 95 135 -189 -89 -170 -207 21 109 43 444 82 135 -62 -170 179 -286 76 -162 33 -166 127
2457 127 -283 -87 48 150 -22 -87 127 4 -262 13 -202 -183 -122 -30 385 107 313 -85 -178 -31 -145 244
2479 244 154 228 114 174 110 36 -302 129 17 292 130 55 -2 -32 -186 -277 -168 -232 350 -92 128 198 -136 -280
2503 -280 -43 -110 -66 43 456 336 -107 -21 -171 -192 -183 183 181 -7 22 -37 -159 25 -166 -6 -83 -126 20 197
2527 197 64 -156 -116 108 -139 105 29 273 64 234 -103 -320 -285 -135 -185 -148 -47 148 -173 -70 -277 -104
2549a04K87k00L04j43J55k31j55PJ40j80K99j46m9r4O7l7qK6N0l6K49J8k2p4l76
2574b53J22k11L21J72J25J26k50m53L11M7l23J98o0K27O0r3o4l05Q2K4J32n9L89
2597B65k85K37j50l28k8jJ49J40J33J7k08q9L17j86j11L59j08m6m3J75j45m8l8
2620b2m8M7R1j50J66J66j54k53k53L76q8J51J55J16k96J02k77j55K82O8K5j38
2642h9J79l29L69k52o8L87k64K68J07l6j37j65J46j93J60k68K17K1J21J63m21
2663h4j06L9J04J92J07l26M49j01j81j13N7k4p8J64Q7j34j3j58rJ51j78J12j87
2686b30O30l12N0N6k86j92O3P6J96q9N1Oj00n8nK29o4J77j09N4L1j54l81l4L98
2711Cj6J22j6J71j33j68j5N8o1J46J80k9K6k66Jk04J66j44P7J73J80j51O0M1j08
$$ plain form
2549 -104 183 -17 287 144 299 68 -87 -80 60 -120 179 33 -16 -110 -43 -80 -88 -62 -12 -48 201 219 197 123 -253
2574 -253 -131 -342 -21 151 276 402 152 -301 10 57 -266 -68 -128 99 159 66 2 -303 -221 -197 -65 -124 265
2597 265 -20 217 67 -261 -289 -290 -141 -1 132 149 -59 -148 169 -17 -128 231 123 77 34 209 64 16 -22
2620 -22 -70 -23 68 -82 84 250 96 -157 -410 -34 -122 29 184 300 4 106 -171 -326 -44 24 49 -89
2642 -89 90 -239 130 -122 -190 197 -67 201 308 272 135 -30 116 -77 83 -185 32 53 174 337 -84
2663 -84 -190 -151 -47 145 252 -74 375 274 93 -20 37 13 -65 99 186 52 39 -119 -128 23 -155 -43 -230
2686 -230 400 88 138 194 -92 -284 -221 -145 51 -38 13 19 -81 -139 -144 85 21 198 89 143 174 20 -361 -395 3
2711 3 -13 109 93 264 131 -37 -52 6 -55 91 271 242 268 2 3 -201 -35 -179 -102 71 251 100 160 201 93
2736I3k22K26k72L0K98l0N0j12k71N1k8K81J48k49J03q9%L4R0p2p1K71p1r6K6
2761A18j40o6J27K25k58K50k09L4R4j89m3J6k28K21O9j98L82k10j54J23J23j34
2783d7NNJ95n5j3j47p9J30O4R3n6j15J59o8j47L5k58J59J57L4J27k08k04Q4J26
2808b4j83J12K89k33K99M9l26J73n32K35J11o2L12k18K59j55k29n1J83j40L82
2829B51k26K03J20k66k61J63m7k6K10j26J08k5r1R9P3j70O3p1J0K72j00l5ll1
2853I4k58L55o3Q6m9k06j4K01l68RL10R4k20K2J65l77J06j62J26L56j47p9J20
2876A01qk13K76j90q7K64j36q5K18o6r4k9j19j9K53p4K6K00j39j77j83J99p5m4
2900b01J11K0j48J48J97j0j27r6K18K47k65m4N0Pk79K03j0O4q2J89j29k21J95
$$ plain form
2736 93 -129 97 -175 -145 153 123 173 61 -210 -159 -187 94 242 -7 96 7 7 41 131 59 -12 259 188 92 118
2761 118 -22 -88 39 264 6 256 47 81 175 -14 -57 -41 -269 -48 21 -177 205 -5 -159 -36 87 -47
2783 -47 -42 -37 158 103 90 -57 -136 -6 58 151 95 -20 139 71 -76 -41 -299 -140 17 51 178 -30 -234 -150 -24
2808 -24 -207 -95 194 -39 260 309 -17 156 -376 -141 -30 -92 220 2 261 106 -123 -174 9 -131 251
2829 251 25 228 348 82 -179 -16 -63 -89 121 -5 103 78 -13 86 159 -11 52 -19 -9 263 163 128 125 94
2853 94 -164 191 128 214 165 -41 -55 146 -222 -213 97 191 -29 -7 158 -219 -113 -275 -149 207 60 -19 101
2876 101 93 -120 156 -34 -121 143 7 -78 140 74 -20 -49 -168 -187 66 -8 18 218 79 -98 -281 -82 -157 -201
2900 -201 -90 -70 -218 -70 127 117 -10 -106 112 359 94 50 100 107 -172 31 21 85 3 192 63 -158 37
2923C7N1k8J02l97L69K9l19Q1Q4k79K19l7J53K12k07j48K83j81m2n3q7K11l1M1
2947F3J21m08k0J08R2J16j00M6j3j5k40M24k59ML2K83j12MJ55j54l4p2r5Q6j74
2972a62K84jN0k20J42k04l7R9l1J06J9J4ll35L05K3q1jK44r8k4j72k3K42j86J56
2998A06m6j09p6K54j16j6p4J19j19R7J6R3j48j18K73k21j09K71k4O9M5k35N5k5
3022c8n4J53m9q5M8J33L7j78J05j54K8n9K17j92J9L16M2n11O1N6o2J97O5j16J43
3047A22j81J2j41J64l4o1L46j36r7m6o7L69m15K09L4M5pnq2o4q7J31J87j2j71
3072A3R3K14k76j44K1K72k18J40J64k16j49KJ98N6k64J44Rj20m2J61kk90j09L28
3096a5j60J06J97p8j77L1j22K21Mp3J57l5jJ67j81p7P9j01M1oM3L20m81n5J19
$$ plain form
2923 37 88 60 162 -235 134 163 -156 -75 9 -270 -51 -88 65 277 70 -78 205 24 -18 -71 -158 53 22 63
2947 63 184 -224 -244 -136 -44 72 -28 18 5 -10 -250 174 -85 -81 -49 234 122 126 281 127 93 21 -74 12 -162
2972 -162 122 121 171 -49 93 -111 -148 -49 -80 26 45 59 56 -279 26 49 -32 -33 211 113 89 -83 -106 136 -50 106
2998 106 60 -49 -125 129 13 -3 -77 42 -77 20 36 129 -19 -137 136 -85 -194 77 53 122 167 -68 -13 -38
3022 -38 -92 61 12 -73 -25 108 145 -33 72 -82 -54 -113 104 -88 -69 247 289 -222 -161 -105 -167 30 95 -21 122
3047 122 -59 -47 -188 -24 -58 -119 227 91 -6 -52 -119 250 -165 44 78 123 116 111 29 -35 -122 9 196 184 13
3072 13 106 320 44 -100 -79 193 -25 115 279 63 -86 -84 114 170 -94 50 59 -61 -103 58 56 -234 -343 -15
3096 -15 -175 -69 128 50 -127 -96 -218 3 7 -66 91 56 55 222 41 -36 43 -58 -17 -23 20 340 -141 -196 -77
3121g7j06J18K22q3k06L7J63r4P7k54J09p7L34j20n7L1o2Q3L9k73K81n9l6k11
3145b21K83l8k50K3J78JK09j99qn9L1K10j73n9L3O4m1R4r8k03J22J20j06J66K3
3170A02P3j01j79J21m0Jl63J91J63J15R2q1o4o2K4l1O5J57J19j96j72n3q1J73
3194b7j27J47J1J96k77J60J2K04k33p1L5P6r6j5J11M6l52jK36J66o6o4j61K57
3218A67k24j40%K72q2j50O7L6M5p7J33L5p1k49J92J01l3l2J67j15o0Q5l0k0L23
3243C40lm33M9n6J27k27J88l5N3J24n6j12k08M04k71k9J34J08j5j10j25P3J35
3266E5j68J68j7N9q0J5j82J99j17J40j21j35L99Pl89Rk2M1K05q9J7p5q0J71j24
3291a14L32k63P3P1K41Jk80k7P0j12O6j82L39k12J88l23J74L0k43j5O7P7J31K
$$ plain form
3121 -77 -183 -65 157 74 -132 -95 68 -26 51 -203 -94 -171 163 43 -14 17 -45 38 77 -196 85 26 -10 -221
3145 -221 62 24 -226 -203 -25 -24 185 -14 -22 -81 -50 160 -13 -72 -39 25 -16 78 -20 -223 -101 19 -87 79 102
3170 102 175 74 -105 16 -24 -23 -386 -195 -32 83 175 94 30 -32 -8 -39 26 183 302 106 -66 -119 -200 -27
3194 -27 -154 -7 4 200 -77 83 95 299 66 -5 30 106 10 -5 106 152 -200 -201 35 201 135 71 -90 167
3218 167 -57 -197 -197 75 -7 -157 -90 -54 -9 -86 47 82 11 -238 -46 55 22 -10 157 42 -18 67 37 17 340
3243 340 337 -96 -47 -103 24 -203 -15 -50 3 127 71 -41 -249 155 -116 -145 -11 97 82 -28 -153 -80 55
3266 55 -113 55 38 97 17 32 -150 49 -68 72 -49 -184 215 222 -167 -158 -180 -139 66 -23 -6 -81 -161 10 -114
3291 -114 218 -45 28 99 340 341 61 34 104 -8 58 -124 215 3 191 -132 42 72 -171 -186 -119 -42 89 91
3315I1R7k45l88N15K7p3j40L79k59Q9l27J73J94j73R9J49j65m1P1p3n0K4J11r2
3339gm4o3J81j25q8O1K09j16j66KK64K9k1k13j18K23j74K29j28n0J59nj57nJ1
3364a12J19R2j92J22p5j41K06j00pK93r3l2J32k71Q2J66j67j70L07r7k30K23l24
3387b69R3OL8L17j17j72J57k8m1M7j17k8J09%J69k44K89m94K67o1o9l8MJ22K0
3412d0o6K77J32k86k37J4L17p3j58J23n5m0P6j84K52j41o7J47Oj28N7p9J47N7
3436E1j95P8L1K30k78J6J8q2N2M9J34k26K75l3J65m59P8K49j23j64K95J9m11J94
3460c7j7J98k59K21j62K44K4q5k50J80j26m1J7O3J41j3J13k75J03Nj05n9K07Q3
3484A70j80O3J89j45q2k90M1L53k20M19m97K6O5K20j61r3K98k08J21j2j55l7j7
$$ plain form
3315 91 188 -57 -445 70 97 24 -116 263 4 93 -234 -61 133 -40 59 208 43 2 73 0 -50 -26 85 -7
3339 -7 -51 -114 67 -58 -146 -85 124 8 -158 -156 108 137 116 -97 -215 8 -166 63 -65 -115 44 39 -118 -123 -112
3364 -112 7 99 -93 29 -46 -187 19 -81 -88 205 112 80 212 -59 23 189 22 -148 159 62 -168 55 -269
3387 -269 -176 -170 -132 185 68 -104 53 25 -16 31 -86 -114 -5 -5 164 -80 209 -285 -18 -79 -148 -186 -182 -60 -40
3412 -40 -106 171 303 17 -220 -206 111 38 -120 3 -52 -92 -16 -200 52 -89 -156 -9 -3 -131 -74 -153 -6 51
3436 51 -144 -66 -35 195 -83 -67 -49 -131 -79 -30 104 -122 153 120 285 -174 -96 153 30 -134 161 180 -231 -37
3460 -37 -54 144 -115 106 -56 188 212 127 -123 57 -69 -110 -93 -30 111 98 211 -64 39 44 -61 -120 87 170
3484 170 -10 53 242 97 15 -275 -234 119 -101 318 -179 -153 -88 132 -29 -122 176 -32 89 77 -78 -115 -132
3507a32K20j09R3j71K75l95K22l1k86M76k57J06J23p2J87m48L53J2j47J04o3j0
3529E0N1m8k28K05j35M8N7K7K66k08o8k03K40Pq8J77p9k42J38RO3j4n6P6N8N6
3555A59j80oK39l80L26m02N2J28p0j6K2M67m96K12l3M2J14l70J14j9J19j18K13
3578A17j68LJ53j13j64K36J14k38K3j28K33j81K54L6j40q9J90m8j47J6p1O2K1
3601b9K22l25M44m27j23K02K12j03J77N3k25n7n6N1O4r9M1k9o2lO1l3L9n3P4j5
3627AL49l62K5R6K2J20p0j66j57m4K25J12j99n6K60K32m76J87j77R2j63R0j21
3650a80P8J25J20j83Q9p7J95J16l12L26l46L63k18k26K24j31rpR4n3j22K21ko9
3674A6j27J53p2R3l15O4K72m6K65j26r4jo8k57J81K4K33j16r8P0r5n3j45J16Q5
$$ plain form
3507 -132 88 -21 72 -99 176 -219 3 -28 -314 162 -95 11 134 62 249 -199 154 166 19 123 60 50
3529 50 101 53 -175 30 -105 -57 0 27 293 85 17 -186 54 61 -27 150 71 -171 -33 -24 39 25 -31 45 103 159
3555 159 -21 -27 212 -168 158 -244 -192 -64 -134 -150 -128 339 -157 55 22 64 178 -192 -78 -97 22 -96 117
3578 117 -51 -48 105 -8 -172 64 178 -60 -37 -165 68 -113 141 177 37 -52 138 90 -57 -41 -112 -50 -29
3601 -29 193 -132 312 -115 -238 -36 176 73 250 303 78 21 -35 16 80 -19 22 -7 -69 -72 -11 -44 -5 -58 16 1
3627 1 350 -12 13 109 131 251 181 15 -142 -186 39 151 -48 -104 156 388 -88 99 -78 14 -149 -59 -180
3650 -180 -102 23 143 -40 49 -28 167 283 -29 297 -49 314 96 -130 94 -37 -46 -53 41 -12 -134 87 85 16
3674 16 -111 42 -30 63 -252 -188 84 38 303 177 83 82 14 -243 -62 -38 195 79 -19 51 -44 -97 -242 -126 -41
3699d1J25K0j52J09R2l84J03K76J03j82J4j14k9j6K77l34L76l56R2j16J49K34
3721B46m14R9r3R2K75j62K86j62j76j01J31N0R7j80j20k0Q5n3J54L8j05J5j2n2
3745h2L0K89k65l3m9J4j06N8O5K58j97j7K24j95J32j93M7j55K49k41L70l34j36
3768b67M24m74N63l42J30j05j56L66k17K70R7k45L3J6j23R2k5L1L6j75J39L6j57
3791e3J11np9J41nk01L52k65l1o0J48N9l10M65l14K06l53J41j58K20J95j95K49
3814B58m16K15j85N8J07p5K47k44j53K76M7l48J64K03j07rL3J25k06J03k49J96
3836D0Jj55j13M74j73k1r6k58L13k04K41j43L52l26P7q4l1J5J06j24J42j9k79
3859b65K06J41m6J46k61J22M7j24P4K07k12k35L24O7j9k55K09%r1o1j19J70o0
$$ plain form
3699 -41 84 104 -48 61 153 -231 -128 148 251 69 83 -31 -60 -76 201 -133 243 -113 -21 -137 12 246
3721 246 -168 -69 -162 -70 205 43 329 167 -9 -110 21 71 168 -12 -132 -152 -67 -120 34 72 -33 -18 -30 -82
3745 -82 -52 237 -28 -61 -110 -96 -202 -144 -79 179 -18 -35 189 -6 126 -67 -20 -175 74 -167 203 -131 -267
3768 -267 157 -317 246 -96 34 -71 -227 139 -78 192 289 44 77 93 -30 62 37 68 104 -71 68 104 -53
3791 -53 58 53 -26 115 110 -91 261 -4 -35 -95 53 112 -198 267 -47 159 -194 -53 -211 9 204 9 258
3814 258 -158 57 -128 -70 37 -38 209 -35 -188 88 135 -213 -49 154 47 38 71 196 -10 93 -156 40
3836 40 41 -114 -227 247 74 53 -43 -301 12 -192 49 -94 258 -68 9 -75 -106 -91 15 -109 33 14 -265
3859 -265 -59 82 36 182 -79 43 90 -34 40 247 35 -200 124 191 172 -83 126 126 35 -26 -145 25 -35
3882c5k1O7J36j97K4r2J6P4P5j88O8K4L4K38j77J34k1p6j88P3J19R6k99J01N5
3907D0L3l03J59J40j28l8L36m75K02q4j15L44k14M8m8n3L13k0k31P1j5m6j9j17
3931b20J73J09j14J58l04L06j88K78j15K8m8M0k06K61k34J61j66P4R5k16K3J48
3953D3J9j20M9k6N1R4j02LO3K3R8l22J32q3J39m1Rn4j09M6J86R1l33m0L3J54K78
3980B81l03p1L4mO8M5Pj6r3J65r6J13j96J8j04L65o5j20M1m9j03K71j43P5k52
4005a32J93k09J72J18j27k34L02J66l46R5q3k24M04J65k66j14r8K63J6p8J09r5
4027cJ51Qj62j79K85k2q1N3n1Q9n1j17Q1J7k3j39J83J73l40K26J71k81O2Ln2J55
4053A56k29o7K60l16M32j04m05K84l7k41M29j64j06n7K3M14k84K61k89K5J2m0
$$ plain form
3882 -35 -56 11 147 -50 -26 -118 -102 -28 47 -141 -73 -49 -15 223 46 180 159 83 -105 -32 87 183 -116 -15 40
3907 40 73 -230 -71 69 -59 -97 239 -236 -34 -118 -233 111 -103 -55 -103 -156 157 137 -94 -23 -38 -84 -103 -220
3931 -220 -47 62 -52 106 -198 108 -80 198 83 111 63 103 -103 158 -76 85 -81 -7 88 -128 -105 43
3953 43 62 -58 -9 -35 16 110 8 11 74 97 195 -127 5 -78 61 20 29 -25 -134 -88 98 189 -144 -184 -151 3 281
3980 281 -22 -93 -59 -63 5 50 57 41 -52 113 17 130 -66 -48 -152 213 148 28 69 20 -83 188 45 120 -132
4005 -132 61 -148 24 142 15 -219 83 249 -97 -2 -85 -309 95 260 -6 -120 -218 45 61 -17 92 -3
4027 -3 148 156 -6 -185 100 78 -3 50 -1 88 37 -80 1 18 -5 -144 39 212 -128 98 269 -12 50 53 1 156
4053 156 -73 -140 120 -196 236 132 -273 11 -26 -267 162 -2 -108 -165 -142 272 -12 249 -40 -15 -3 -43
4075d3m8K05L4j01N9p0k02K47j5k63M6J67q9L8n4K24k9j54k2J45j8j0j41J51j49
4100i2J92j70j7N1j68M99j30j8k34m6N55m57q6K4J99j87m9j0j4K52j67p7Q0J42
4124G2R3k93J90J77l20K2j34L46j7q2j32NK16l4m2pJ15k37P7M3J04l42M48j76
4148I2O2l78L4J4jJ36J93l8k78J25r5K83j88J27L85o89L5K20j89J27L2j68K17
4171E8j63K09O0r7R8j56p5r9K8J2K8K2J34o1K8j00J9r5J13K00l10J35J52j10j10
4196h0j39K18J79J55k65j07L41l76k1K24j33K15m32K01nJ57q0j09K79j48L7k11
4218a00l5J72nJ32m5l5k74J67J82Rk08j2K89l25J12oj00M9P9l5K5K1q3k03L66
4243A37k74j1K53j40J42k73L05K5l5k5k81L47q6k23K44r9n5l5l3L04k92N4No2
$$ plain form
4075 -43 -91 114 148 47 106 36 -166 81 66 -197 -151 16 -73 -35 -89 135 106 -48 -70 75 57 47 -94 57 -92
4100 -92 100 -70 -87 -36 -204 295 165 147 -87 -133 422 -35 -121 -97 102 -85 -134 -144 -158 94 -73 -150 -70 72
4124 72 165 -128 62 239 -81 -59 -193 153 136 54 -78 -73 143 109 67 60 175 -62 15 58 162 -180 268 92
4148 92 154 -224 -190 -176 -177 -41 152 114 -164 -39 -134 149 -39 88 473 -216 -181 39 -150 -23 9 -159 58
4171 58 -105 104 164 67 165 9 -66 -165 -137 -125 -97 -75 59 -2 26 -74 -55 -150 -37 163 -147 -12 140 30 -80
4196 -80 -219 -1 178 333 68 -39 302 -74 -95 129 -4 211 -221 -20 -25 132 52 -57 222 74 111 -100
4218 -100 -135 37 32 164 119 84 -190 -23 159 168 -40 -52 237 -88 24 18 -82 -33 46 11 36 57 -26 -229 137
4243 137 -137 -148 105 -35 107 -166 139 164 129 104 -177 170 84 -139 105 6 -49 -84 -117 187 -105 -51 -46 -108
4267a08m0j17J55J94j86J24J05j1k1k63M4P8q4PK64l10L5J81N9m9r8K3J00j72
4291i0J21O9k10Q5J11n5R0r9q2J23q3M3k60N01k14j07J64j72P0n5J74j88P2m6
4315c8Q7k09K23j66j34L77l40L25o9k06J20k4L14j23k5j12O4J5J9m9J05k79L26
4338B01l30J6J12R5J7j11L0K8j14J14k44K41q7K1K59l13J84j82P6Pj33L17j50
4361E4k05O9K12k21K42l17K50pk67K48mO4o3k1Jj62K86O6l21j13J60J97m9l08
4385b09J22o3k7J98M7Kj44m8J66J43k30L4j46K31q2k31K50q0P3r4L83k07k21J06
4409b7Qj86M04k28P9K3J06n7k16j38J30J07j61K70k84P0K16j87R2j14j63J96K16
4432A56J10l89J62m7J5p6J93k31L46j63M3k01J36or6O3Q1j33j65J55q4K69j97
$$ plain form
4267 -108 -148 -265 -110 84 -102 22 127 116 95 -168 -124 -46 -130 -123 141 -169 -134 47 106 57 -41 -18 82 -90
4291 -90 31 100 -110 -25 86 31 121 22 -60 63 -20 23 -237 264 50 -57 107 -65 5 -50 124 -64 8 -38
4315 -38 49 -160 63 -103 -237 140 -200 125 56 -150 -30 -54 260 137 112 0 64 79 98 49 154 -125 201
4338 201 -129 -113 -1 94 111 0 30 58 -56 58 -186 55 -32 -11 248 -65 119 -63 13 20 -113 204 54
4361 54 -151 -82 130 -91 151 -166 84 77 -190 58 54 118 55 34 35 -127 159 225 -96 -209 -49 148 99 -209
4385 -209 -87 -150 -177 21 68 70 -74 -122 44 187 -43 -9 -155 76 -6 -237 13 -67 6 -88 295 88 -133 -27
4409 -27 -19 -205 199 -29 50 73 179 122 -94 -232 -102 5 -156 114 -170 -100 116 -71 21 -93 -256 -60 156
4432 156 266 -123 39 -8 7 -69 124 -107 239 76 119 -82 54 48 -48 15 96 -37 -202 -47 -131 138 -59
4455e9j48M0K54p5O0kL7k63K04k37J95q1o7K12q7j28M7M7j33L09K4Q0m37N35k91
4480C6l9j50N25l45j95k0oL31K44j72m5j68k75J80K5J46K14k03L4l52J07J11K10
4503A93j07m5j13J95k0Q0j9l18J20J05J66k55nO9l2o1N1r0Q0P4o0Q8j21p9J12
4528HO3J4lK3k27K29K0k80oJ04R3k86L22j13Oj08R8O9J04j50K41L5l16J32J43
4553B15l11j09L37j23j03P6R8P9k06j06o0l7L66j97r1M47k71L2l28M02n9J8L6
4576A05o3o8j95J23J46J50k05j45J20J26Ro9J8j29j84N39k97k12L96l27K30Q0
4598A48Q9p3k38J75j05j01R5m6O7K02k69P5J30k84n3J45j56J86K83k56j5j19L29
4621B09j83j21OM18l51r2J74l7j81m8J81O5r5J83l05K31M0j84m5m3L39j39o4P4
$$ plain form
4455 -59 -207 -167 87 12 72 70 107 -156 48 -189 6 -75 -142 70 -17 -145 -98 -51 -184 125 149 229 -208 327 36
4480 36 -3 -153 372 27 -168 -188 -194 137 381 209 164 -4 -279 -99 -74 72 286 83 117 -235 -128 -17 193
4503 193 86 41 -72 123 103 183 164 -154 -34 71 237 -18 -23 46 14 -47 4 -86 -6 68 8 96 -25 -104 8
4528 8 71 85 82 105 -122 107 127 -153 -159 -55 38 -248 74 -39 -33 -141 -43 26 130 -20 221 256 -60 72 215
4553 215 -96 -205 132 9 -94 -18 80 159 -47 -153 -213 -250 116 -81 -172 275 4 36 -292 110 51 69 105
4576 105 42 -26 -221 -98 48 198 -7 -152 -32 94 103 34 52 -77 -261 278 -19 -231 165 -162 68 148
4598 148 237 164 -74 101 -4 -105 -10 -56 11 213 -56 19 149 -135 -188 -43 -199 -13 270 14 -1 -120 209
4621 209 26 -95 -89 329 -22 -114 60 23 -158 -206 -25 40 -55 128 -177 54 94 -90 -135 -178 161 22 -42 32
4645C2k61K15K59k78k1J00k06J93r1J90k29L92k37j50j15J68L1j59J21P1J36j47
4667A4P1lj39r8K28J49k34K2j72L08j77K86p7k82RJ30k76P5J4J25J25j75R4k0
4691ck87K39k3K30j81J4j5j47K12O8j15p4L84m52K55Pk27J76j60L71k13j11J27
4714G5l2O8j05j33J2J37N7J33J8q3j98J82k33j32K39J46O0q6j00k52J76k8K47
4737A68l18O6J94l38J97j5J38j55j34K30j1r6J44j18J19p5J90k34k31K68J25j63
4759d9Q2J75k57O9n9J38n6j3k08N7R2k14K25K74j14J6j96k43K38O4j51K46j43
4782b7J30L6l27K61l3J14o3j11j12J64K6O1j84M5K32o2o4k70K51k54L18J32k57
4805Fn7j30N7%L03l54J4K25o9n4j7K35k09R1J59j72J1j57M5J92l57J20P3p7M6
$$ plain form
4645 32 -229 -14 245 -33 -54 46 -160 33 -58 132 -97 295 58 -92 -207 -39 -8 -167 -46 25 161 14
4667 14 85 82 -57 -155 73 222 -12 10 -162 146 -31 255 178 -104 -95 35 -241 -166 -152 -27 98 -77 17 -3
4691 -3 -290 -51 -74 156 -25 -11 -26 -173 39 107 -8 -82 302 -150 105 112 -115 61 -99 272 59 -52 75
4714 75 43 111 6 -127 -115 22 79 212 230 147 -51 131 -102 -234 5 151 211 125 25 -227 -51 -79 168
4737 168 -150 -84 110 -228 -31 -46 92 -63 -197 33 22 -74 70 -48 71 -4 186 -48 -279 -11 114 -49
4759 -49 33 208 -49 20 -39 99 43 30 -178 -121 -29 -243 -18 256 142 158 -38 -281 -43 21 -130 116 -27
4782 -27 103 139 -188 73 40 154 91 -20 -132 32 58 119 -65 -20 212 150 86 -184 67 -187 131 263 6
4805 6 -51 -181 -124 -124 179 -175 -161 64 -5 -59 -76 159 -50 41 200 28 39 -118 -73 119 -238 -118 -45 -122 -76
4830g6J38J91m10M6K64k85K29j3L30p04L04o5m7K0k8M3j05M19j78j97L8q2J7M1
4854a10J52j25L04J10l38m0J36j27N4M26l51m36M89o5j83Q2m6L07k79Q5K9J45
4876B19k18L8j91K47k35K51j44KM3j09R3J38k7o8j11j85M05m8k64L58k21j76O5
4899a38M0K15K3n6j60K38j27j55L22l5j06j49K56k33J82M8j92k7J02l2l9l4j78
4922b35O5J60J13l3j33j7J24j95J90J52k49J62N6k41L49k21k16K61k76K90n8m3
4944El5K21j53l1Jj84L6L28m30K37J6O3k64K9L07k18K55l17J08J58k43P5J01j66
4968a01K81l21J26P4j1m32M66P3J10l82P8P5k1r5J8J67j08k40J70J27k1j08J82
4991A07O2j60J51l49Q2o3L54l45j46K76l1K0l8Ro5R1L6q5K8M7j71R5j3J96k43
$$ plain form
4830 -76 62 253 -157 -111 153 -132 97 84 414 -290 14 -51 -98 -78 -106 -63 -168 251 73 -124 -86 -168 -151 -110
4854 -110 42 -83 221 331 -7 -47 89 -38 16 442 91 -345 144 79 -104 -22 -68 239 -40 45 74 219
4876 219 1 39 -152 95 -140 111 -33 -31 12 -97 -4 134 107 39 -72 -257 148 100 -164 194 -27 -203 -138
4899 -138 -98 117 140 84 -76 162 35 -120 202 167 61 -88 168 -65 117 165 -27 -54 48 16 -23 -57 -235
4922 -235 -170 -10 103 70 -63 -80 44 -151 39 191 -58 104 160 -81 268 47 -169 92 -184 106 48 5
4944 5 -30 191 38 7 8 -176 -140 188 -242 -5 11 74 -190 -161 146 -72 183 -134 -26 132 -111 -36 65 -101
4968 -101 180 -141 -15 59 48 -384 82 155 265 -117 -39 36 15 -80 -62 105 -3 -243 -73 54 33 -75 107
4991 107 169 9 160 -189 -107 -170 184 -161 -307 -31 -62 -42 -80 -71 -136 -45 -9 -94 -66 -19 -190 -95 -108 88 -155
5016a55L4Q7J5o3m5L15J37n23K05O2J17k49K13j12J05r5K72l94k5J89l38K31J2
5039en6j65J81P8Q8j72J46P8p9k8j5l42L70J21j71j7j52J20k8J80o1j4J01mn6
5064I8j35J85k99K81P1k71J16J09k14j28K24k6J37k10j4K32Q9k49j40J67o4J63
5086A22k53J65J1Nj23J82j62m1l0K28j24J98l70J13q6J77r0J63j82K5o2J32K87
5109B85k85L9J95k22o9J82l52L20O9l53L03M1p4l64K64L11j30k52J8pJ04Q4k78
5132a71N65k41K4j20j74M9O1J98q2j85Q6j62L61k3j2k12j8l6J25L6o0K4j8m9K3
5157a1j16N2O4q4j50L31r0Nj34m1M9M4N8n1m7r0K00j26J56J07k02N3R8j60J4m
5183g5J44K86k94J77m0j1l23J50K02j21q1kn4o9K27j66K42k80J29J55l68p1K18
$$ plain form
5016 -155 -121 -34 -19 -82 -127 188 325 -198 7 69 186 -63 150 38 143 48 320 -74 -99 90 -248 -17 -5
5039 -5 -61 -226 -45 33 121 -51 95 173 94 66 51 -291 79 200 29 12 -140 -20 -48 132 71 57 158 154 98
5064 98 -37 148 -151 130 201 -70 46 155 -59 -187 37 11 148 -62 -76 156 245 -4 -144 23 -41 122
5086 122 -131 34 45 50 -73 109 -53 -94 -124 104 -20 178 -192 -79 -165 12 -78 85 -97 -72 -134 -2 285
5109 285 0 39 234 12 -57 125 -227 93 162 -191 112 153 79 -285 -21 290 160 -92 -74 -81 23 107 -171
5132 -171 394 153 177 57 -117 -68 -7 191 109 -76 10 -152 209 186 174 -38 -56 -92 33 69 9 33 15 -34 -11
5157 -11 -127 -75 -11 -95 -245 86 -4 1 -133 -174 -125 -81 -23 -74 -121 -211 -11 -137 19 126 -76 -23 75 -85 -71 -75
5183 -75 69 355 61 238 198 187 -136 14 216 95 14 12 -42 -111 116 -50 192 -88 41 196 -172 -243 -25
5206b5pp9j0J17Pj85K63j49J90j57P0j62J19j92K08j10Mo5J72J40l66J36j13K10
5230A6pO4l8L51m28j01j99L97j06n4N1K97k43N7k9L5j03J34j9p6j25MM13m19J86
5255E8m1j50K06j51L0Q1l47M38pk37p0K30o2J70k73p7M19k10N5j86L00l80K06
5278BJ34k70J60j53R6j91M00l37K4M0l2J44M5J4k10J22q1qJ69k05K71l8j64K89
5302B21l30m3J38j34K66j2k13P3J9j99J82J02j07J70k28P8J15k00m8K0o6K46p1
5325b1J67j85J24J17l11O8J66k50J59m1j58J94J81n1Qj38j15K99k47o4R1q6J10
5348A7n7J27k03J36j6o2L28o0k49r8J10n0M0J69k90K62j13J39q9j73J76J52j58
5371C8lL6n7L62n34K73n7J32m75M59k7j14O3o4j83l8J68j72M59k65j56k4Q3OJ18
$$ plain form
5206 -25 -32 -111 -121 -4 3 -182 81 -68 122 -35 35 -127 -8 -200 8 -102 -98 -163 9 149 -217 -81 -194 16
5230 16 9 73 35 386 -42 -143 -342 55 -51 -105 -54 243 0 57 28 63 -40 94 75 -1 -126 -122 291 -128 58
5255 58 17 -133 73 -78 -48 33 -314 124 117 -120 -190 40 -22 148 -125 -202 217 7 62 -124 176 -204 2
5278 2 136 -134 26 -127 -31 -222 178 -159 -135 -95 -127 17 62 76 -134 -12 -93 -101 68 -137 134 96 -68 221
5302 221 -109 -152 -14 -148 118 106 -107 -34 -15 -214 -32 70 -37 133 -95 -17 98 -102 -150 -130 -196 50 -21
5325 -21 146 -39 85 202 -109 -41 125 -125 34 -7 -165 29 210 159 167 29 -86 213 -34 -98 -7 -93 17
5348 17 -40 87 -116 20 4 -58 270 210 -39 -137 -27 -77 -37 132 -158 104 -9 130 41 -132 44 196 38
5371 38 35 71 14 376 -158 115 58 190 -285 174 147 33 96 32 -151 -189 -21 -193 266 1 -155 -179 -96 -90 28
5396B8J16m66K79p0m5K00j87R6Q2J82j77p5o7J41Oj21J82J99l93K56p7j44j33
5419a88K81j60r9J19L40l04J64l60K47M1k59J90k60L17j22K14k13L05k83K07j83
5440fjp9k61K65L2l2J57p9N6pkj7k0J76k72N8r3j3K47R2k12jj53r2N63j82j67
5467d3L43l79J11Q2P5j45QR0j33P7q0r7JO3R1L5J5k21j52K32K28j06j62J08%l0
5493A1m6k36M77k53K38k69M0j4p2J40m7j93J85p0QK35l47K19M1r4j58K96l33J10
5517a32K83O4P9m3m79L57np1j53M5O0J67k22K05j43r7P7M7j22J84Q2j68m5k67
5541b97L73q5J29q5O9r6n5OJ86j01j30J6Q4J75l60M0L42l72J59k11K93j40L6k22
5565b46L12l9o2L9J49j78p2K51j70j03Q2j14J08k8J17J33k89l9qL36j07k20J26
$$ plain form
5396 28 144 -322 -43 -113 -158 42 -145 -49 33 215 38 -37 -104 37 43 -78 104 303 -90 166 89 -55 -188
5419 -188 93 -67 -166 -47 293 -11 153 -207 40 81 -178 12 -248 69 -53 161 -52 253 -30 177 -6
5440 -6 -7 -86 -347 -82 -50 -82 75 -4 52 45 43 26 6 182 -90 -32 -125 -138 109 201 -11 -12 -165 -257 306 124 -43
5467 -43 300 -79 32 114 189 44 52 142 9 86 6 -91 -90 -27 64 99 114 -107 -259 -27 201 95 -67 41 41 11
5493 11 -35 -271 206 -47 191 -78 -38 -52 -124 16 -31 -224 -39 -109 -101 134 -213 6 47 -47 -205 91 -242 -132
5517 -132 151 215 294 251 -228 129 124 53 -100 -55 5 172 -50 155 12 -85 -8 39 -83 101 183 15 -30 -297
5541 -297 76 -9 120 35 104 8 -47 -41 145 44 -86 -70 14 189 -171 -131 211 -161 -2 -213 80 -60 -24 -246
5565 -246 66 27 -35 4 153 -25 -97 154 -16 -119 -37 -151 -43 -71 46 179 -110 -149 -157 179 72 -148 -22
5588b2J00k02K71j30j09kJ75k85O0M3j53M3M10k64M8m6K30k16j41L15p6p6j67
5611a94P3j8K87o8J0k10J88k35J80l4j11qM39k42J96m1j90J05K7j27mK2K0M8K7
5636A40j07Q6j50j04p1oJ20j15J73K16k07K1nj28M2Q7j17L1J47k16n4r2J97p8
5660a90R6j5J59Qm9R6R3k43N4j41J9j7j29L90J5j05Kr5j5j37O09k39k61J11q5
5685f9R5m44O14o6m66L27j13K5K79k34L06k39J15Q4l47J52J70k73J09r1P0j4n5
5708f5J42K3N9m2k36j9K17j12l2j65l7K71J56k74M78l98J55O7J27m84J3K30l4
5731D0qJ42j25l8J5J17j94j62J78K32k90K99m0N5l26J39K30k59q5K78l10j69J12
5754a69J19J95q1k28K66O0l22R9j71N80l11J19l10J88m3j42J15R6L3k88K56k50
$$ plain form
5588 -22 78 -124 147 17 -92 -94 81 -204 -144 -101 -254 -211 199 -65 -17 -63 167 -49 -190 125 49 -27 -194
5611 -194 -121 -139 148 80 90 -120 68 -167 13 -21 -132 -140 299 57 253 212 22 127 154 27 23 45 65 113 140
5636 140 33 119 -31 -135 -206 -212 -92 -207 -34 182 -25 -4 -9 -137 -95 -8 -125 -94 53 -163 -217 -309 -112 -190
5660 -190 -94 -109 50 58 9 105 198 -45 9 -132 -113 -130 -259 131 146 41 43 -52 -67 -204 405 166 -95 16 -69
5685 -69 26 -418 196 130 -336 -9 -122 -97 182 -52 254 15 130 214 -133 19 189 -84 25 -66 4 -10 -65
5708 -65 77 100 159 117 -119 -138 79 -33 -65 -230 -267 4 160 -114 364 -34 121 188 315 -169 -156 74 40
5731 40 32 174 49 11 26 143 -51 -213 -35 197 -93 206 166 221 -105 34 264 5 -80 198 -112 -281 -169
5754 -169 -50 145 64 -164 102 162 -160 -61 -232 348 37 156 -154 34 -9 -151 -36 60 93 -195 61 -189
5776a89L58j67o1M0n6K91L6k20rJ29j30j3N9K25k66K7k6Q8O3p9l25J70N6Qj44
5801a35N5L05k92P9k6M8r6O1j5n7L22k77J25R8k67Q6R8P4k09j3M21n00J46J38
5825A69j46%j2J1M11l44J2j40J44KK3j77P5l9k94K85N1P2k04J62k7j97J37K89
5849B63k79J58k63N8M11k55R1j57j0J7rm6J09k3Q1k84N3L20j08o2j7k28J72J52
5873A44l66J06K19k06K45j48r8m6K84j10k81M38n5j80J83j22J46j90K9K33k79
5894e4K9j01K13R2l23L48l08L71k16%j03P1j46K53j10l1p7O3k48M17j03R0o6k65
5918b04m7K17j14J43J63l33K96j9q7m7Q5j56Kr5L18m7r9k69J47P8k8k28L41R1
5942A08j0P6k62R6p0O5L14k03j42J62j00j21J93k80J32N4j17L75k41K5O5j98J79
$$ plain form
5776 -189 169 2 -59 -19 -75 216 252 32 23 152 22 9 68 293 27 54 28 116 179 100 -225 -55 1 9 -135
5801 -135 -80 225 -67 12 -14 34 -62 -1 -16 -73 249 -28 97 195 -72 14 112 186 -23 -36 385 -115 31 169
5825 169 23 23 11 22 433 89 101 -39 105 107 130 -47 28 -11 -305 -20 31 103 -101 61 34 -163 -26 263
5849 263 -16 142 -121 -63 348 93 184 27 17 34 25 -21 88 65 146 -138 -85 235 127 65 48 -180 -8 144
5873 144 -222 -116 103 -103 142 -6 -104 -150 134 24 -257 181 126 -54 129 7 153 -37 -8 225 -54
5894 -54 -25 -126 87 179 -144 204 -104 267 51 51 -52 19 -127 126 16 -15 -92 -29 -277 140 37 127 61 -204
5918 -204 -251 -34 -148 -5 158 -175 121 102 15 -32 53 -103 -101 -196 122 75 -24 -293 -146 -68 -96 -324 17 108
5942 108 98 174 -88 8 -62 3 317 114 -28 134 34 -87 106 -174 -42 12 -105 270 29 54 119 -79 100
5965A00j53J23r9o4K69j80q6L13j57k13L15l88P0J18o7J68m0k44M50k31o2p6J79
5988D5r8J73p5O4l58K52J84j61j09m2J63J32p5r2n4j68K43k12R5J71k7j40J20
6011C1l15K40M7Oj23J66n3n9j39J71R9J04l48M22j50k28J24r8N2K9Q2Q9l78K03
6035b6K9l5J51j80J27j67J09j96M23k84N4O4%q3j38J56O4p1j56K84j6j04M7P4
6059A26N3r0j30K7j12K05k07J3J22N1k33K55n4k12K46r2P6j22j34J01j5L05j57
6082B2J45j61n1J03P6j59J28j25j25J55j27J52Q4j32k49J86K75j52r7j49N8J48
6104Ep3M5j9J27p8J57l45K79j00J25k67J78j22K82k68m5K74N3k95R5j78L34l00
6127a36J57j05j12L86r4J45j14l6L1LP3k61o2J87k10K2R9r9J74J44j04j49MO7
$$ plain form
5965 100 -53 70 -29 -93 176 -4 -90 223 66 -147 168 -220 -150 -32 -99 69 29 -215 235 4 -58 -134 45
5988 45 -53 120 45 109 -249 3 187 26 -83 -125 38 170 95 3 -51 -219 24 -188 -93 78 51 -89 31
6011 31 -284 -44 3 9 -114 52 -1 -60 -199 -28 71 175 -173 249 99 -129 -5 -103 -51 -22 60 149 -229 -26
6035 -26 3 -32 119 -61 66 -101 8 -188 235 -49 5 69 69 -14 -152 4 68 -3 -159 125 109 5 52 126
6059 126 179 89 -41 -14 -126 79 -128 -115 7 58 -175 80 26 -186 60 -32 44 -78 -212 -111 -126 179 22
6082 22 167 6 -45 58 134 -25 103 -22 -147 8 -119 33 117 -15 -264 -78 197 45 -52 -201 -143 5
6104 5 -68 -23 -42 85 7 164 -181 98 -2 123 -144 34 -88 194 -74 -119 155 208 -87 8 -170 164 -136
6127 -136 21 -84 -196 190 96 241 127 91 122 125 198 -63 -125 62 -148 -126 -27 -126 48 192 88 -61 -57 10
6151A0m8R5n1J65j48nj31l4L40r9q2lJ68k14j50P5P3L08k41L0P1r8Q5q4j74J38
6177dK5j89m7M16j82J1mK75k62j09mL8J4P6p4J08j89O1J8J3R5j57J25n5n9K45
6203A85K7m79K34M8j15K3J34j04l3J93k70J13L15j69j31nO8K6k3k59J38K10J21
6226B47m65K88k58J66J28l4j35o9K90k56M8J01J21l42L01m5J57k08K0o4l1P7N5
6249I2l09M27k59P5l17K69k7j18mN4J71j74L12l01L7J73k46K6J30j44L97m53K30
6272D1r9J55m5j17J93k87K95o0k68K14K7r1M8j7o7n1N7%L34j62j57J33p8n4j86
6297b42K50K21m98J88J69N1j50lj8J7J35k42j84J25K68j46R4N7jk38K0J63k0k49
6321b33K61k1P3j17K52j08m3Nl8M30l77j23r2J33J6m1jK26l28o0j9P0N5mJ02j61
$$ plain form
6151 10 -38 57 6 171 23 18 -113 -147 193 94 12 9 177 -37 -187 -112 -39 269 28 58 129 31 116 32 -142 -4
6177 -4 21 -168 -215 201 19 30 26 301 39 -70 -74 -36 -22 54 -20 88 -101 -40 -22 -9 86 -71 54 -1 -60 185
6203 185 212 -267 -33 15 -100 -77 57 -47 -80 113 -157 -44 271 102 -29 -34 34 60 37 -222 -84 126 247
6226 247 -218 70 -188 -22 106 72 -63 -132 158 -98 -50 51 172 -170 131 86 243 35 55 -9 -40 37 92
6249 92 -217 210 -49 26 -291 -22 -49 -167 -171 -117 54 -120 192 -109 -72 101 -145 -119 11 -133 264 -189 41
6272 41 -58 97 52 -65 128 -159 136 76 -192 22 49 -42 6 -11 -78 -129 -72 -72 262 100 -57 76 -2 -56 -242
6297 -242 8 229 -269 -81 88 139 -11 -14 -32 -15 120 -122 -306 -181 87 -59 35 92 91 -147 -127 36 16 -233
6321 -233 28 7 80 -37 215 107 64 69 31 461 84 -39 -131 2 18 -23 -24 202 -126 -186 -205 -135 -80 -84 18 -143
6347a43Q2j88J95l6K52j09j5J0qN3n7J49j71j10L55l02m2J13J8K2N9p0P8J54l01
6372a2J30J13j58pk7m22M34k03J67J92j00l0j82K12j38M9j75J31K14j97n9K2L3
6395a3N4P1J36k29J3j3j47J77j73Q3K30k92J42N1j87K2jQ6j08J12j63L51j06p0
6419B6l11J42K52J4k21K01k37K88k42Q6Kj09L05j74K12o9K9l39j11K93k75N56
6441C18l93j0R6n9J96o7l76L45o8j17J47m1R9J5j43J1K98k12p7M0M1j21K51j69
6465Do0N9J48k05p8J27k2K2p5J34l0l9J48nm5m7Q0j93l10K96L51n39J92k15N05
6490B03j57M0M3J04m00K39j98J45j49K17o1k82J06J86j23J61K4j26J83r8k8j09
6512h0r2Q6p1K83l0l7r3k09N2K34j94M8K05k18J76J21k67J60j29O0j29O4Q7q2
$$ plain form
6347 -143 -61 -249 -54 -90 162 53 38 48 40 93 36 185 14 -96 259 -43 -85 28 46 68 127 57 135 289 -12
6372 -12 118 231 73 66 39 -383 51 -152 15 207 107 77 -105 107 -31 18 -157 -26 188 -9 -68 -46 -13
6395 -13 41 112 248 19 32 19 -128 49 -124 -41 189 -103 39 90 -97 -75 -76 10 -98 14 -149 202 96 26
6419 26 -285 -143 109 123 -98 103 -134 154 -88 -2 0 -109 196 22 234 165 194 -145 -256 37 -238 318
6441 318 -75 -85 11 -48 148 81 -295 50 -18 -135 12 -29 70 85 -58 -47 251 39 -38 2 43 -78 173 4
6465 4 -56 3 151 -54 -132 -5 -27 -5 -80 54 24 -15 133 128 83 36 116 -77 -387 -91 260 -279 -87 -302 203
6490 203 46 86 129 233 -167 72 -126 19 -130 87 26 -256 -150 36 -87 74 98 -28 155 57 29 -80
6512 -80 -172 -86 -157 126 96 59 -34 -243 -191 43 -151 -103 102 -116 60 181 -86 74 -55 5 -124 -60 27 -55
6536e5j62J1R3J55m9m3J17J23j89j45Q1J66N4l80K57m9K8j56M4kJ10j70J32J6
6560a3K07n18K07K45j70j22K91j45MJ29l8k90L21r0R7K3p5k31L63J2q9j58%L97
6584C57j24j00j95J17l06K68k39L93m24K75L9j99K31m52L78O2k9k86M89m47K91
6605I9j57P9m2J15O8k1l29qK50Nn7o3R0Pj77J81J07q5m5J76r1j05m9r8K71j90
6631f9J18l7J31n1m1O1o3p3J10j20l03M54q1j32J12L4j22L53m94J70J37k25L87
6654B56l84J67k29J55KK7l43M15k45M00p0k15J88j9l05J99o7Q4J90n8N4J1j89
6677B4k2J55k08N6m2r9J76k53K36k00K70k35n0K34j36R7K5k16K08J07j55m0K67
6700A99l22K70k39K25k67P3P6q7qJ7j50N5M44m08Q6J7k3j07J92j27L81l05j01
$$ plain form
6536 -55 -217 -206 -113 42 -7 -50 67 190 1 -144 -63 103 157 -223 34 -15 13 -143 -99 -101 9 -161 -29 -13
6560 -13 194 -324 -117 128 -42 -164 127 -18 -14 115 77 -213 108 18 115 138 63 -168 195 207 118 -40 -40 357
6584 357 233 133 -62 55 -251 17 -222 171 -253 22 61 -138 93 -359 19 81 52 -234 255 -192 99
6605 99 -58 21 -21 94 162 141 -188 -196 54 59 2 -61 29 36 -141 40 147 62 17 193 102 -3 -52 -150 121 -69
6631 -69 49 12 143 92 51 112 49 -24 86 -34 -337 117 36 -96 16 50 -72 281 -213 -43 94 -131 256
6654 256 -128 39 -190 -35 -33 -6 -349 66 -179 221 151 -64 124 105 -200 -1 -68 16 206 148 202 213 24
6677 24 2 157 -51 5 -37 -136 40 -213 23 -177 93 -142 -192 42 -94 3 28 -188 20 127 -28 -68 199
6700 199 -123 147 -92 133 -134 -61 15 -72 -80 -63 -213 -158 286 -122 -36 -19 -42 -149 43 -84 297 -8 -109
6723a09L05m26J81M1K0J18j1J31j90J91l52M1m8N4Q2Q5l3j59K05m19L70k96K79
6746F0rK7j75J27J18l8P4o2n3k02J48j78L02j70J74J0l16P5J31k32R1J35k19J46
6770c6K03M0n0j61J67k02o6R2q4O2k1J6n4Q3j2N2j76J88p3MM8Q7j28J22J1po8
6797C7j0Q9Q9l66p5J31Q8P3k04P0J38K10l36K9O5R0m7k60M28l74k8L48j88O9q8
6822b2K3J85j52j16oL7L27j84k3J12m33P7K57k00L9K27j15j27N9K4j78J98p3J80
6846A16k04k22J62K50l62M27r2j02J76j25J13k87J03q9J62j78J03K9j62J95N6
6867F9j7l33M08j51j18K64o5K69l32N7R7j82K6j03R0l9J99k88K07m3Q7n2j12J56
6891I4O7j04K1j49L43k87J01m9K4R5k53j0R6k03L81o8l0j66P5Q4m4l29M27P0p2
$$ plain form
6723 -109 196 -230 -49 -8 12 130 119 250 60 251 -101 -60 -108 -54 28 113 80 -79 126 -293 77 -219 60
6746 60 51 78 -97 30 148 110 184 122 69 -133 15 -163 139 -31 143 153 -163 -88 43 -189 -98 37 -182 -36
6770 -36 167 207 157 -4 163 -39 -105 -13 -97 -35 -56 -40 -94 -11 -23 29 -147 41 -32 -28 20 107 -21 101 112 105 37
6797 37 27 116 205 -161 -236 -105 -17 56 -148 -78 60 270 -66 -37 28 118 71 -189 239 -135 -163 185 -3 66 -22
6822 -22 1 186 34 -82 -88 -51 276 92 69 181 -252 -175 82 -118 -79 148 33 -94 -35 -11 -189 9 -64 116
6846 116 -88 -310 -148 102 -260 167 75 -27 149 24 137 -150 -47 -136 26 -152 -49 -20 -182 13 69
6867 69 52 -281 127 -24 -142 122 57 326 -6 51 148 -34 -8 -111 -21 -60 139 -149 58 15 102 50 -62 94
6891 94 161 57 78 -71 272 -15 86 37 61 156 -97 -107 -11 -214 167 99 69 -97 -22 62 18 -311 116 186 114
6916A14J12k45J57r2Rj84K94nr5j86P4m2M6k01L39k55p3K77l45N16k30J38j24
6939aQ4k50K78j49Mn8k8J25mn3Q2o9N7k7j03J71K22mk08l4j24J04k45M19k78P9
6965a0k01N35l10P2OJ22k23K34j24j55J62k38K7K17O1k98P2q7J66m4J20L0j2l73
6989b51J31j0O8l7jK4M0L5j7j25J12l5k0J9O4L8k27Q7J04o4J50p4j48J93q4J97
7015A69k38K11m09J51K55k43J1L44m74K74Q8J32l45J19k33L62J20r5j33J85q0
7036A71k09j86L88m9mPk31K3M0k42J49J60mK03j53j71q7K49k29K30J31j04p1Q6
7060I7m1j56N5J43j19K58n9l98L93j18lJ63k07l4m8J56j30M0J76p1j60J39l79
7083c03K31J02j0J6K8r6k66K30J48p1j41K37j69j27j53M42k41L14k61J07N0K57
$$ plain form
6916 114 226 -19 138 46 55 -129 165 160 65 -121 -47 -89 -43 -244 95 -160 -233 44 -301 215 -15 123 -1
6939 -1 83 -167 111 -38 -34 -92 -120 5 1 -52 30 -39 18 -9 -112 59 281 277 69 35 -89 15 -230 189 -89 -10
6965 -10 -211 324 14 86 92 214 -9 225 101 -54 108 -130 -103 114 175 -123 -51 -138 28 -16 104 134 122 -251
6989 -251 -120 -130 -62 -99 -100 -76 -36 -1 -18 -143 -31 -66 -86 -67 -3 35 -192 -105 -1 -65 85 11 -137 56 -28 169
7015 169 -69 142 -267 -116 139 -104 -93 251 -223 51 139 271 -74 45 -188 174 294 199 66 251 171
7036 171 -38 -224 164 115 111 118 -113 -90 -50 -292 -143 17 13 216 63 -108 -195 54 -175 55 186 82 11 97
7060 97 56 -100 -45 98 -21 237 178 -220 173 55 52 215 8 -26 -74 82 -48 -8 168 97 -63 76 -303
7083 -303 -72 30 20 36 64 -32 -298 -68 80 9 -132 105 -64 -191 -344 98 -143 171 -90 17 67 324
7105C24m75L11o8J72l50L07q3j72M9J41R0k54J19j19O0n0j20J15J62l64J14J62
7127G1p1l15K72J82j6m3r2l4J51j57p3j44J48J46Q9j23j6k5k20K90K56l13J20
7150H3R7k31n8J61l08L33j32R4k24J98j33J4L74m06J34j01J87j42K42k80J61J43
7172B06l12nM2M0O1K6O5J82n36J49L20j58r7J14kk3j25J20r4q2R6j53Q7K4r9J36
7198a8J72L2q6k17J09j92K01m9J83l80L13j53m6J9K10k5l47L92r8N6Rq0k6j30
7222a51L12k00j67J99l0M8k44K02L5J48r1j07L75m57K35j86M4L3J0J57k02J74
7244A37j33L9J50l41J3K22l9k21K60n7K6o0k62J93K33k68N4J45J15k58k08M71
7266B11j01o7nM7k19K34j61Q3k89K39J88k20K8K55Kj71l7l0M5Nj72P9j3J52j03
$$ plain form
7105 324 -151 160 92 264 -86 221 138 -34 15 156 246 -8 111 -8 52 2 -118 -3 159 -205 -91 71
7127 71 0 -315 -43 139 123 80 -12 -46 105 -52 -125 -269 -121 25 114 -9 -25 -50 -270 20 276 -37 83
7150 83 180 -51 -109 52 -256 77 -55 39 -185 13 -120 -106 268 -138 -4 -105 82 -60 182 -98 63 206
7172 206 -106 -111 -69 -29 32 58 123 305 -231 -82 238 80 -17 97 95 72 -53 67 -27 -109 -13 -166 -79 -55 -154 -18
7198 -18 154 186 100 -117 -8 -200 1 -48 135 -245 68 -85 -131 -112 98 73 -274 118 20 76 85 5 -21 -151
7222 -151 161 -39 -206 -7 -37 11 -233 -31 4 152 61 -46 329 -128 107 -79 -35 -2 8 165 -37 137
7244 137 4 43 193 -148 -135 87 48 -173 87 30 56 -4 -266 -73 160 -108 -54 91 206 -52 -260 211
7266 211 110 43 38 85 -134 100 -61 22 -267 -28 160 -60 -32 223 225 54 17 -13 32 37 -135 -56 -69 83 -20
7291b0o0L7N6r7L46m55L92k28l2J48k35K27j88K04ll36J45J2J39P9n6L1j57K09
7315A58k19L1nR2M5j33J82l81K01J1O9K8j39j00J56J54k04j12J37P9j1k02J0J51
7339bj03K49k62J9M8L4j0k22M2L00Q4l09J82K86l78K19l77O0J75Q0J85r4l38O1
7363g1J23rL5j10K18Q8l88J87o9k2j90L00j47J72ol08r5J63j87N07k26j20K25
7386G0j88l2M45n39R2m0J67m3J19J75j75l0L7rj05P9K77l92M5Q1k29M33k49J8
7410Gj66L39k13l4J74l30K85L4k56O0J93r1L6JO9k08J98J68n11j59N75l01J62
7433C2J68j63J65j40k19K55Kl6k9l22L12p1K58l0l16J32j80J4J10p2K7j2J70J25
7457A80k09j8O6n2J26l2k61L08j37R0L1l2p0J0j88L49m74L17j85j22J59jJ39R4
$$ plain form
7291 -20 -80 -43 13 -84 262 -193 199 -29 -61 87 -148 79 -109 95 92 -244 -99 -87 52 131 75 106 -51 158
7315 158 -61 -30 -35 57 102 -31 151 -230 -29 -18 51 79 -60 -160 -4 150 -54 -166 -29 50 39 -163 -153 -2
7339 -2 -105 144 -118 -99 -51 -17 -27 -249 -207 93 177 -132 50 336 -42 177 -200 -140 35 115 300 206 -132 -71
7363 -71 52 43 78 -32 186 274 -114 73 4 -18 -208 92 -55 117 111 -197 -292 -129 -316 191 -35 -155 70
7386 70 -118 -150 295 -244 -152 -192 -25 -68 51 226 51 21 58 49 -56 23 300 -92 -47 34 -195 238 -11 7
7410 7 -159 180 -33 -67 107 -223 62 96 -160 -100 93 2 38 39 108 -100 98 266 -245 -404 171 -130 32
7433 32 200 37 202 62 -157 98 100 64 35 -287 25 -46 212 182 -134 -2 -182 -168 -58 -130 -103 -115 55 180
7457 180 -29 -47 19 -33 93 61 -200 108 -29 61 92 60 -10 0 -188 161 -313 4 -181 -303 -144 -145 -6 88
7481H8j80O0P3j76K27r7p1J77O9j18J04L1j10P8LK0k99J96r6j30K89k29k91K93
7505h9K92l70J93L00m59L07l24K2r1K95k61M23k23P6q0k4k4J52j81N9j04R0j56
7528a77R7K92k70J46j9Q1m43J81L37k9r9j14j53K08r7R5j59K82m28J54L1J32p0
7551b2J6J42J10l49K53l7j07J29j20m0M1J74r7j19l9N7J31l18L9L24j54J82lm41
7575b48K80K3Q0m3l1k44J66J85l08L09l26L78k07K3j59R1K58l11M07j35j02r8
7597a2%L08m93K33r1r8K41o9M4j9k5m1K27j99M6l8N6k7k5j81K49r2L8J2p9k1j7
7624g3R6l25L75j02l01K65J39j23l5R8%P3L01n22q8J37k7K55l38K15J92j90K1
7647D3Q0j67J22k66J66j23Q7J76k25r9M58j44k47K91k58N1J57r1j57J65k8J36
$$ plain form
7481 88 -92 -32 41 -135 92 -5 -76 101 170 52 156 187 77 155 158 178 -121 75 -21 -151 138 -91 -382 -89
7505 -89 203 -167 26 326 -133 174 -150 -128 -219 76 -185 238 15 91 11 -13 -37 115 -66 -7 -111 -21 -177
7528 -177 -80 212 -58 88 69 150 -293 -112 225 196 97 -17 -170 38 -59 36 -123 159 -269 -115 -84 48 -22
7551 -22 -6 136 246 -103 150 113 6 135 15 -25 16 190 93 -26 -65 -8 123 -195 -156 168 14 196 193 -248
7575 -248 32 55 135 92 61 -183 -17 168 -140 169 -157 221 14 37 -122 -31 227 -84 323 188 86 -12
7597 -12 -12 296 -197 36 -55 -153 88 19 63 44 19 -22 205 6 52 14 70 43 18 -163 86 -6 32 44 -35 -56 -73
7624 -73 23 -302 73 -29 -330 -65 74 -49 -84 14 14 87 388 -134 -222 -85 -112 143 -195 20 212 22 43
7647 43 123 -44 78 -188 -22 -145 -58 118 -107 -206 252 108 -139 152 -106 -55 102 11 -146 19 -9 127
7669A27j65L9J07p7n6j2l8j44M65k39M0j63L75Rk26p1j33J61k1K06j91j28Q7j06
7693a54K6J83oJ04m21K55j16L00k47l5n2J94j30N7J75k50k02K05N0L62l88R4r7
7716i3o1L14l87K39j19j03L06j63J19n5K10k67J0J02Q2Kr3J02r4Ol0M0J5j27M9
7741Dj69K63m5j23j24J21L9o4J52k05J61K57n04J91P3K09m15J36K74k66r2L62
7763B35k20j91K66k8j05Pj2K1M5J2J74k04r4Q7M6j19J88J08o6k32jm4J41n1L7
7788@j60o3K86j2k93M5qK48j56j02K88m7k29J47J14l8k1m1P2rK72m20j48J93N6
7813b6j08J38n6J69R9n6j66K20K35m52o0K7J84k91J14J35j98l9R2P2j56O6J30
7836G3J28l01r2NO1K05J6k38L65q1j28J45k81J9O0K17k49P9P0k37j0J91J21k69
$$ plain form
7669 127 -38 1 108 31 -25 -37 -75 -219 246 7 47 -116 259 268 42 -29 -162 -1 -22 184 -7 -135 -48 -154
7693 -154 -128 55 49 153 -268 -13 -129 171 -76 -111 -163 31 -99 -42 133 -117 -319 -114 -64 298 -90 4 -93
7716 -93 -154 160 -227 12 -107 -210 96 -67 52 -3 207 -60 -50 52 134 136 43 145 51 57 27 67 82 -45 4
7741 4 -165 98 53 -70 -194 -73 -34 -98 54 -151 10 267 -237 -46 27 236 -179 -43 231 -35 -127 235
7763 235 15 -176 90 62 -43 -36 -48 -27 18 30 204 0 -94 -7 39 -80 108 216 150 -82 -83 -127 14 -37 0
7788 0 -160 -223 63 51 -242 -197 -205 43 -113 -215 73 26 -203 -56 58 20 -1 -42 30 21 293 -127 -275 -82 -26
7813 -26 -134 4 -52 117 216 160 -6 214 449 -3 -63 -36 148 -143 -29 106 -92 -131 -39 33 -123 -57 73
7836 73 201 -100 -192 -187 -126 79 95 -143 222 141 13 158 -123 -104 -44 173 -76 3 73 -164 -174 17 138 -131
7860a31M26j38J10l08l24L53K13k13r0N7K66j21l35j60L77K18k28J39p0J38j41
7881C8p4K65j5Oj31k86K34j64J45r3m0K19j50m7O9K87m32q9J80J80j93L11o2j15
7905D3j2J46k86j49L70j16j66M35l36J81J34l27J82o5L3j63K04k50J68L4k10J25
7927b5K04n31M64r0P1n2k26J96j6j50K07L13m22J30j58o6K11J33k72j19K58k65
7949b05K33oJ50l71K84k92L72j26r1l9k7k0K87k41J06j71K44j20r7K06k17Q6j00
7972a55J21J27o4k53K87p5J64k46j1l8P8l6l0K04j10j10P9R5R5k39J74m5j11J38
7996C9j4p3M68m96rK04p4p4K6J34j57j15K37K75m20j18J75J77k41J58o6k42QL41
8020A43p0J41n41J76J85R4Pm4Jr7P2n4N2J59l99J9K82k11Q9o6q8L46l18K33k55
$$ plain form
7860 -131 295 157 267 -41 -365 -12 201 -12 -102 -45 221 100 -235 -395 -18 200 -28 111 41 179 38
7881 38 -36 229 214 220 89 -197 37 -127 18 -75 -115 104 -46 -93 -24 263 -169 -258 -78 102 -91 220 158 43
7905 43 31 177 -109 -258 112 -4 -170 265 -71 110 244 -83 99 34 67 -96 108 -142 26 60 -150 -25
7927 -25 179 -352 112 22 93 41 -185 11 -5 -155 52 365 -57 73 -85 -151 60 193 -79 -198 60 -205
7949 -205 28 22 172 -199 85 -207 165 39 -52 -91 -118 -138 149 -92 14 -157 87 -33 -130 76 -141 -55 -155
7972 -155 -34 93 29 -224 63 -12 152 -94 -105 -143 -65 -101 -131 73 -37 -147 -68 27 122 -117 57 12 -99 39
7996 39 25 -48 420 -76 -85 119 45 -29 -3 131 -26 -141 96 371 -49 -167 8 185 -56 102 36 -206 -198 143
8020 143 73 214 -327 -151 34 128 135 91 92 -5 67 13 65 224 -175 -156 126 -85 4 -62 -150 196 -122 111 -144
8045a44j1lO1K31k20L8j1J99q0j6K1j91K94M5k01J96j8k54K23j33J75k61P8r6
8069g8K84j66l1q4n9R9k5J57n7J12m3p1k6j08K06l2j27J44l8j56o3K18k04K20
8093G2k94J05M2J3j88M15p7j81L63l99J10l03J34J58q9j9J18O4k56oJ06K06j10
8116a6j25J93j2J51k9k7j8l13J77P0N8r8J96l06oM1j30k7R4R3M9r4o4J63j50J92
8142F2j44r3J49R0J41l14J5K36P7j16j56J1m7J21L5m9j18K7j6J89j55L0n8K04
8166A21l42K54j9J58j54N3j30p0J67k44K32j30n7L78l41J08j28j00J72j34K2J83
8188aJ63ql79
$$ plain form
8045 -144 -155 -158 -97 134 -86 -48 -59 140 60 44 65 -126 168 213 12 208 190 -64 159 26 201 -60 18 -78
8069 -78 206 40 9 -75 -134 -35 -60 97 40 152 109 38 12 -96 110 78 -49 95 57 -99 -162 56 -148 72
8093 72 -222 -117 -75 -62 -250 165 88 -93 270 -129 -19 -322 -188 -30 -119 -138 -20 44 -212 -218 -112 94 -16
8116 -16 -141 52 40 191 162 135 117 -196 -19 51 109 11 207 -99 -105 -64 -194 -221 -127 -34 15 -79 -143 20 -130 62
8142 62 -82 -175 -26 64 205 -109 -94 142 219 103 -53 -42 -89 32 67 18 -100 -73 -89 100 -55 -25 -83 121
8166 121 -221 33 14 172 18 71 -59 -129 38 -206 26 -104 -161 217 -124 -16 -144 -244 -72 -206 -184 -1
8188 -1 162 154 -225
8191b25
$$ Imaginary data points
##PAGE= N=2
##DATA TABLE= (X++(I..I)), XYDATA
0@%%%%%%%%%%%%%%Qj6J6j6J6j8K6l2L4m2M9n7O9p7Q8j04J20j36J53j73J96k20
36a16K47k78L10l45L85m27M73n25N80o40P06p79Q59r45J043j150J266j396J543
55H11j712J901k116K370k669L029l472M029m758N761p226R572j3927K4657j00018
70h3768j54517J75813O8550k3823Q7708Q7908q3158r1921m2527k4482J0807L2618
82d0792K4437Q0139N7615n2308o0642k1655p2619l3548P6864N3685K3155Q5707
94A20038N751j31540o8665J1466l9750K0713J36173N6251n0726j3946j8027p6035
106d8297m2287J8184L8644O0022L7554r907O905j2353r4139n8528M2854L2255
118b9093J7797P5528M3427m7989n1614m9469o2593K0350Q5796K8693N450M1898
$$ plain form
0 0 0 0 0 0 0 0 0 0 0 0 0 0 0 0 8 -8 8 -8 8 -10 16 -16 18 -24 25 -32 37 -40 48 -56 64 -72 81 -92 104 -116
36 -116 131 -147 163 -182 203 -224 249 -276 304 -336 370 -409 450 -495 548 -602 664 -732 811
55 811 -901 1000 -1116 1254 -1415 1614 -1858 2171 -2587 3174 -4052 5520 -8407 16250 -83768
70 -83768 -238285 -62472 6078 -17745 69963 157871 74713 -17208 -59735 -84217 -73410 -40792
82 -40792 -16355 63784 121399 69091 8449 -13206 -85825 -119373 -42509 11176 34331 120038
94 120038 125789 -5751 -74416 -62950 -102700 -81987 54186 110437 59711 45765 27738 -48297
106 -48297 -90584 -72400 -33756 26266 63820 53913 60818 48465 -45674 -104202 -61348 -29093
118 -29093 -11296 64232 107659 59670 8056 -41413 -104006 -83656 2140 30833 36283 78181
130G8181q224p6740m7131n851J387K4993M2891M1149L3552k0033p4127l8161K240
143d5874j8949Q643P8221N3441j2632j6789k7481o3369l5885K0519L8682M4261
155B2788L8155p06k5112k6489m1529l3702J1658L4066L2781L6838J6631k2952
167D2427l5951l7504l5836N221M5949L5615K1179K2136j1279n3827m4235r858
179e5963Q820K5767L8565L0643J0690j8705m2265l4909j2863J024K3389M6037
191B0230L2733q08j9586l0694l6644j9028Q933K5202L5589L1987O248k1650l2519
204gl3447k0938Q091L1536L4924K4697M104j7631l0707l2821k0468P753L1627
217a3287L2512K3468Q099j8989l7141l0440j0465P043K4784L2600K4778L887j8220
$$ plain form
130 78181 69957 -6783 -53914 -59765 -58378 -33385 9506 50655 84207 64174 -9953 -48114 -45874
143 -45874 -64823 -56180 22041 75482 62850 46061 18580 -44789 -80674 -60155 -21473 22788
155 22788 60943 60237 35125 8636 -32893 -66595 -54937 -20871 11910 48748 65379 42427
167 42427 6476 -31028 -66864 -61643 -15694 19921 41100 63236 51957 -1870 -46105 -55963
179 -55963 -47143 -21376 17189 47832 58522 39817 -2448 -37357 -50220 -49196 -25807 20230
191 20230 52963 52155 32569 1875 -34769 -53797 -44864 -19662 15927 47914 54162 32512 -7
204 -7 -33454 -54392 -46301 -14765 20159 44856 48960 31329 622 -32199 -52667 -44914 -13287
217 -13287 19225 42693 50792 31803 -5338 -35778 -46243 -39200 -14416 18184 42962 46849 28629
230B8629l1645k9480j3470O191K5378L4097K3182J326j7313l0076k9056j3655
242d5892P880K6031L2411K1372M56j7914k7855k7827j3645R256K6119K8846J9937
255C9175K784j7253k9409k7491j1389J0297K4658K7007J9509L150j7957k9309
267f228k5312r964R035K3851K7519J9645J104j9086k8106k2525q326P384K2249
280h760K8423J8168p09j7927k5574k2616j0300Q353K4225K6970J6600j905j6763
293A8185k4763k2595r000R320K3280K5508J5514j740j5591k4548k2360q885J0391
306b7284K3416K3586J3648k91j5473k4993k1834o463J0899K0490K2321J5386j01
319C3307j7106k5072j9271n442Q895K0145K2836J4739j552j6799k3217j8266o085
$$ plain form
230 28629 -3016 -32496 -45966 -39775 -14397 19700 42882 44208 26895 -3181 -32237 -45892
242 -45892 -38012 -11981 20430 41802 42258 24344 -3511 -31338 -44983 -35727 -9608 19238 39175
255 39175 41959 24706 -4703 -32194 -43583 -33286 -8628 18379 37888 41038 23081 -6228
267 -6228 -31540 -41504 -32469 -8618 18901 38546 39650 20564 -7542 -30067 -38393 -31009 -8760
280 -8760 19663 37831 37122 19195 -6379 -28995 -39295 -30942 -6717 20253 36853 34948 18185
293 18185 -6578 -29173 -38173 -28853 -5573 19935 35449 33709 18118 -6430 -28790 -37675 -27284
306 -27284 -3868 19718 33366 33075 17602 -7391 -29225 -35688 -24789 -4299 18022 33408 33307
319 33307 16201 -8871 -28142 -33584 -24689 -4544 18292 33031 31479 14680 -8537 -26803 -32888
332c2888Q743K0256K2749J3379k508j6191k1594j7751n861Q529J9684K1658J3317
345C1522k549j6621k0897j6503n754Q642J9756K1131J1076k870j4898j9433j7230
358b4628o302R484K0603J9694R098k283j3507k0147j7370m141J0514J8564J7682
371A7261J0066j553j4240k0865j5897j961R833J6031J7771J1074k553j5154j9297
384i484j4530l018J0012J6809J6714J1244l881j5879j7774j2334l372Q117J7479
397A03J7305Q876l445j5351j7544j1501k909O871J8054J8301N962m747j1519j7018
411h562j4225k084R539J6730J6194O394m969j1336j5946j4363j548J1288J4396
424A508J4004Q149l598j3369j6072j2234j733J0809J4837J1890Q493j532j4935
$$ plain form
332 -32888 -24145 -3889 18860 32239 29731 13540 -8054 -25805 -31666 -23137 -3453 18205 31522
345 31522 28973 12352 -8545 -25048 -30802 -22160 -2404 18727 29803 26933 12035 -7398 -24628
358 -24628 -30930 -21446 -843 18851 27949 25666 12159 -7988 -25358 -29499 -18985 -421 17261
371 17261 27327 25774 11534 -9331 -25228 -27189 -17356 -1325 16446 27520 24967 9813 -9484
384 -9484 -24014 -27032 -17020 -211 16503 27747 23866 7987 -9787 -22121 -25493 -17376 103
397 103 17408 26284 22839 7488 -10056 -21557 -24466 -17595 459 18760 24722 19975 8456 -8562
411 -8562 -22787 -24871 -15332 1398 17592 23986 19017 7681 -8265 -22628 -24176 -12888 1508
424 1508 15512 23661 20063 6694 -9378 -21612 -23345 -12536 2301 14191 22684 21152 6217
437F217j7170r354n23P432J4729J4612O681m100j3525j5550q819j027O570J5313
451A486J5962N295o417j1409j4008j0960n94R297J3595J3678N793n922j1994j2328
465h526j0515j828R952J4713J1306M613l845j0861j3753j0835r56J0269J4258
478C992J0575N155k657j2637j6082p724J815Q532J1941J2089M806n361j2264j2043
492i863p483j21Q166J2441J1354M224m384j1718j2085p567p41P816J3402J2258
506A5699L674o168j1378j1512p567K91Q693J3010J0785J222m838q877j1851r278
520a8095J697J0107J0060Q988N138m559j1609j2005o741P50R420J1451Q971M231
534A7804n671j2274j0406m576O57P557J2158P620K542l488j0506j1829m666J448
$$ plain form
437 6217 -10953 -20307 -20830 -13398 1331 15943 22624 18524 4999 -10551 -19370 -20397 -13827 1486
451 1486 17448 22743 16326 4917 -9091 -20051 -20645 -11348 2247 15925 21718 15796 3802 -8526
465 -8526 -19041 -20869 -10917 3796 15102 19715 15870 5009 -8744 -19579 -20535 -10266 3992
478 3992 14567 19722 17065 4428 -11654 -19378 -17563 -9031 2910 14999 19805 14444 2180 -9863
492 -9863 -17346 -17467 -9301 3140 14494 18718 14334 2616 -9469 -17036 -17777 -9961 3441 15699
506 15699 19373 13205 1827 -9685 -17252 -16961 -8268 4742 15527 16749 11911 3034 -8817 -18095
520 -18095 -16398 -6291 3769 12757 17895 13336 1727 -10278 -17019 -16269 -6849 4602 13573 17804
534 17804 12133 -141 -10547 -15123 -14466 -6909 5249 12869 15411 11923 1417 -10412 -15078 -13630
548a3630N493J1650J1557J127o387q477j0411p973K279R702J0789Q410J276o550
562H855q908r000o884K739J0250Q125N584M188m669j0546q673m544n19Q393J1240
577E631O442J946l034j0979j1555k979L181O210J0488Q481l3n736r137r334k969
592a3377L220N345Q925R257m0o970o437p265o939J933R036Q579O657J943o006
607G861r166p419m787J540R449R472M128Q23m134r427p877k780J963O997R534
622F177M426Q20k958q975r923k419L965N426Q464P071O01o143q451p489l015L874
638h549O265P150P012j74o846p166n504l846K280P231P683N163O55n740p747n807
654g940l500J440P993Q788M264j054m345p725o866k249K600P253P911L638p38
$$ plain form
548 -13630 -8137 3513 15070 16197 9810 1333 -9078 -17051 -14772 -5070 5719 14129 15405 8855
562 8855 -53 -9053 -15937 -13198 -2948 5177 10761 14949 10280 -266 -8939 -13483 -14002 -5609 5631
577 5631 12073 14019 10985 6 -11549 -14528 -11347 -5137 5351 13832 13799 8063 -1074 -10408 -13377
592 -13377 -10157 -4812 4113 13370 13330 6360 -77 -7342 -14281 -12348 -3312 5267 11924 13867 7861
607 7861 -1305 -8724 -13511 -11971 -2522 6950 11078 11901 7767 -1660 -9537 -12317 -10354 -3357 6177
622 6177 10603 11423 8465 -510 -10433 -12852 -8887 -3461 5003 12074 12675 6532 -1919 -9408 -12423 -8549
638 -8549 -2284 4866 11878 11704 4858 -2308 -7812 -11658 -9378 -2147 5536 10699 11354 5614 -2133 -7940
654 -7940 -11440 -10000 -2007 6781 11045 9991 5646 -2079 -8945 -11194 -8594 -1341 6570 10208 9470
669I470l891p114p814j692L993N605O765M658R4m993p271o691k055L828O031O177
685E100N148K0n766p824m983j983K976O474O257M554o2n642p317n076j285J778
701g631O729P218L417j281m600o336n513j376K245O298P029L302j329m376o185
716b389n622j718L341O145O054L322j069m532o243n317j591L798N840N407L060
731H486j34n115o405m657q81L189N616N551K827j062m585o008m488o87K865N437
747e1N673K564q11m527o094m544l37L278N124N270K889j134n111n535l951p14
763h011K979N433N395K608j885m592n040l932p56L027N547N156K051j886m126
778A968n351m013l89L256N494N010J667j541m183n170l899j0L178M994M697J756
$$ plain form
669 9470 5579 -1535 -9349 -11041 -7048 -1443 5322 9980 10074 5081 -2190 -8881 -10936 -7108 -1077 5100
685 5100 10248 10268 4502 -3322 -8305 -10288 -7312 -838 5419 9973 9911 4269 -3048 -8124 -9409 -7631
701 -7631 -902 6316 9733 8452 3852 -2484 -7997 -9373 -7128 -830 6199 9501 8172 3796 -2389
716 -2389 -8011 -9729 -6388 -243 5811 9133 8064 3532 -2711 -8028 -9619 -5821 19 5426 8486
731 8486 8352 3237 -3168 -7825 -8706 -5517 99 5650 8477 7415 2830 -3178 -7666 -8353 -5488 -51
747 -51 5622 8186 7375 2848 -3246 -7790 -8127 -4849 275 5545 8434 7300 2189 -3346 -7297 -8011
763 -8011 -5032 401 5796 8404 6519 1927 -3113 -7045 -7801 -4774 773 5929 7980 6094 1968
778 1968 -3383 -7396 -7785 -4529 965 5975 7642 6101 1918 -3252 -7151 -7161 -3983 1011 5708 7464
794G464j619m159n407l312qL379N074L886J949j464m592m920k972P8K938M824
810A139M124J955j595m554m805l088P41K681M580M359J617j920m528m407k726
825f427p7L189M721L861J765k136m097m376k743J15L239M650L853R07j930l760
841G54m579k597L33L542M287L367J118j733l849m342k688P80L246M430L111Q35
857F015j783l793m480k165Q73K914M294L208J308k240l961l915k190Q90K844M005
873A824L135R02k127l895l786j791M77L263L888L059Q17k208l680l521j959O72
889d930L139L909L062M40k422l298l700j576O71K892L933K938M86k387l228l729
905c800j440O31L506L487K587l0j789l672l155j551P85L338L256K157O19j792
$$ plain form
794 7464 5845 1686 -3721 -7033 -7041 -3662 1412 5298 7247 5783 1191 -3729 -6701 -6623 -3685 1139
810 1139 5263 7218 5623 1069 -3736 -6824 -6083 -3402 1178 5537 7154 5234 706 -3701 -6427
825 -6427 -6504 -3315 1406 5267 7032 4896 799 -3577 -6320 -6205 -2966 1684 5537 6444 4514 754
841 754 -3825 -6422 -6089 -2547 1740 5107 6225 4492 643 -3699 -6387 -5607 -2361 2069 5180 6015
857 6015 4232 439 -4041 -6206 -5333 -2419 1875 5083 6391 4151 190 -3725 -5915 -5025 -2181 1824
873 1824 4959 5861 3734 -161 -3947 -5738 -5261 -1998 1890 4949 5766 3558 -122 -3643 -5602 -4930
889 -4930 -1791 2118 5180 5620 3198 -100 -3800 -5376 -4705 -1813 2120 5058 5544 3157 -71 -3800
905 -3800 -5240 -4609 -1103 2384 4971 4941 3152 -520 -3675 -5226 -4441 -1103 2153 4310 4929 3137
921C137l485l440j250R80L099L094K578j5j952l445l123j271J321K882L178K369
937D657J07k364l282k845j167J119K968L059K403r2k315l277k408r02O77K729
953i33L175K313J01k402l271k411j203O63L210L777J592n95k281k398k810j128
969d601J641K572K924J621k71j777k915k671q25J074K843K811J597j3j943l064
985i97k413r12J332K636L025J410n4k410l054k037k11J085K333K780J625m89k361
1002A288k574k088m47Q78K433K970J903p70k243k552j808j088J387K890K654P96
1018C629m96j820k800j922l84J483K558K371Q87m49j433k840k135l38J192K457
1034d0K349J585n32j857l051j884k08J705K281J949J486q11k316k331j750O4J323
$$ plain form
921 3137 -348 -3788 -5038 -4058 -959 2135 4713 4698 2746 -699 -3822 -5093 -3772 -890 2288 4657
937 4657 4764 2400 -882 -3727 -4894 -3775 -807 2252 4655 4563 2248 -1029 -3437 -4339 -3662 -933
953 -933 2242 4555 4656 2254 -1017 -3428 -4631 -3968 -758 3019 4611 4016 1735 -663 -3473 -4601
969 -4601 -2960 -388 2536 4157 3886 2109 -806 -3477 -4302 -3228 -385 2426 4023 4010 2067 -997
985 -997 -3410 -4322 -2990 -354 2671 4081 4027 1617 -1437 -3474 -3685 -2600 -267 2513 4138 3649 1288
1002 1288 -1286 -3374 -3821 -2943 -510 2460 4363 3593 1350 -1202 -3010 -4098 -2711 179 2833 3629
1018 3629 3133 1313 -1487 -3409 -3793 -2310 248 2619 3506 3057 1624 -1216 -3351 -3689 -2497 -40
1034 -40 2309 3894 3362 1505 -1546 -3430 -3638 -1933 348 2297 3783 2972 656 -1675 -3425 -3361 -2038
1051b038K193K122J070j64k375k498j436k63J095K743J953J120o61k105k453j678
1067c375J78J209K632K326N40j086j529k410j658lJ475J927K180P83r27j387k362
1084a487j511q0J542K143J796J196p97k278k131j484j95K163K009J331Q91p34
1100B374j930k241j209K33J234K352J870N78q79j802k402j177M67J129K004J918
1116B519M75q08j744k112j269L39J549J754J447R65j294j692j745j501L97J553
1132a167J777J664O41q19k107j817p77K80J104K266J440K77n89j971k084n96K19
1149b259J136K014J657j0r39j589j960p46M24J385J427J847L16j172j636j587
1165a692j159N10J725J546J297M01r84j805j592o41j3J732J721J243R4q07j846
$$ plain form
1051 -2038 155 2277 3347 3183 808 -1690 -3126 -3389 -2294 449 2402 3522 2861 756 -1697 -3375
1067 -3375 -3197 -1988 644 2970 3510 2424 895 -1515 -3173 -3176 -1701 226 2406 3189 2262 875 -1487
1084 -1487 -2998 -3078 -1536 607 2403 3599 2802 524 -1607 -3091 -3286 -1123 886 2217 3108 2374
1100 2374 444 -1797 -3006 -2773 -1539 813 2683 3261 2382 580 -1822 -2999 -2532 -1403 601 2519
1116 2519 2994 2186 442 -1670 -2939 -2600 -1051 703 2150 3115 1821 129 -1616 -3117 -2720 -1167
1132 -1167 610 2274 2915 2096 -11 -1828 -2605 -2325 -1221 1045 2485 2762 2173 202 -1882 -2478 -2259
1149 -2259 -1123 891 2548 2538 1599 10 -1950 -2696 -2272 -887 540 2387 2703 1531 -105 -1692
1165 -1692 -2851 -2341 -616 930 2227 2628 1644 -161 -1753 -2394 -2407 -675 1046 2289 2383 1576 -270
1182b70j301p03K63J202J760J491n9q99j756j636n93R21J105J544J121K14j400
1199A004j006j577j186P56J526J550J297Q7j355j637j336m91L13J656J588J083
1215B272j83r09j531j539l13M80J283J801M28M92j016j624j355l56L71J062J667
1232A030J097n0j025j291j481m07O80J268J180J116K06j225j789r76n27M57J622
1249a15J540M55L3r19j788r39j50J40J514J541O52q3j018j199j323k62P70J100
1267e1J290M78L16j300j453j025k07O65J099J462K74J65j206j277j028p5N83J161
1285a29J368O96j76j114j199j351K54M54J198J127M78J71j170j327q38k12O84
1302a086J123J194N07j98r41j224q63m21P32J542Q07Q20n41j112j144p57j37N61
$$ plain form
1182 -270 -1571 -2274 -2011 -809 951 2442 2383 1484 -272 -1908 -2501 -1580 -475 1069 2190 2404 1004
1199 1004 -2 -1579 -2765 -2009 -483 1067 2364 2451 1096 -541 -1877 -2368 -2055 -399 1189 2272
1215 2272 2089 1180 -351 -1890 -2203 -1723 -440 1361 1789 2281 1265 -359 -1714 -2070 -1699 -637 1030
1232 1030 2127 2077 1052 -239 -1720 -2127 -1447 -179 1001 2117 2323 1098 -691 -1667 -2194 -1737 -115
1249 -115 1425 1880 1913 994 -794 -1733 -1883 -1743 -229 1312 1964 1881 863 -336 -1659 -1921 -1151 -51
1267 -51 1239 1717 2033 733 -720 -1745 -1952 -1287 -188 1274 1548 1713 507 -770 -1798 -1873 -1290 -129
1285 -129 1239 1935 1759 645 -554 -1905 -1651 -1197 1 1128 1606 1777 607 -720 -1558 -1770 -1086
1302 -1086 37 1231 1738 1540 599 -625 -1488 -1909 -1177 365 1172 1992 1451 339 -805 -1562 -1699 -1138
1320a138J228J207M63m09j082q29j017r4P60P96J467K91n57p81j084p45k17O73
1338a068J130J268Q2j69o50j389o13O4N90R56R06L87k85j106j063l97j51P39R77
1357B08R83M15m17q98j167n72JQ58J013Q41M22n07q31j421k46Q8M81Q62J083L49
1377A545m97j037q16r66L44O55J149Q69K03l98r79q29o18J86L50J158P37J92l22
1396I26p20r49p36L18N44J059N65J44j41j120p71m83%Q47J050P57Q1o08r34n65
1416g36q08K15Q78Q64N46L95p22r09n28o15K40R12Q12N55L32o58q77q56lk92R82
1437b73Q34M34M58q97o05q50m94L93O02J064M21M5m33o36j097l30K06R23P39L06
1457H10M31n93q65o55k55L47M82O52Q52j61k04q72q83k60K44O92R61R7K40n47
$$ plain form
1320 -1138 90 1297 1760 1351 269 -560 -1577 -1671 -911 -115 1352 1643 1086 305 -779 -1524 -1741 -1068
1338 -1068 62 1330 1412 1243 593 -796 -1409 -1345 -755 201 1107 1494 1209 103 -960 -1357 -1508 -769 208
1357 208 1191 1606 1189 291 -876 -1448 -1447 -589 424 1265 1687 1180 349 -1072 -1318 -1230 -749 113 1196 1545
1377 1545 1048 11 -805 -1771 -1427 -772 377 1246 1449 1051 72 -757 -1375 -1189 -839 319 1056 1248 926
1396 926 206 -743 -1479 -1161 -617 442 1007 1151 1010 -110 -881 -1364 -1364 -517 533 1290 1371 763 -171 -736
1416 -736 -1544 -1329 -451 413 959 1354 632 -277 -805 -1420 -1180 -268 544 1099 1431 773 -104 -960 -963 -1255 -273
1437 -273 561 995 1453 556 -49 -899 -1393 -1000 -398 666 1087 1132 699 63 -1034 -1364 -1158 -235 504 810
1457 810 1241 648 -217 -872 -1127 -780 -298 354 1206 1045 841 -31 -914 -1174 -930 -238 723 820 1060 513
1477E13n64r67j48O11K64Q72J68K58o32n64m97m13J84P83P04N37j70m64n98p84
1497i07l3J23O98M97M69J36o11q73l79k68K27N52R40J63P3m67n54n77j31K70O72
1518B0N73N10k92j55j077o17J27K49O57Q68K29l91m21p51l25M2K44P64M16n5K65
1539H80m53p41m59j03K75P89J06N19L3o56o62n04N9M50O95N99K04l38l50p16m04
1560g77Q4L31L76O66J20j47q42J69n36l06L34N42N07K41j83l64n28k82l84O78
1580c01L08L46N08j30n59n50m38J44K05N57N03K98k30n35m79n68j00P50N38N47
1600H14Q3k59l98n69n43L31J72M88L34N04n09l51m32k01r2L32N62K66J68k43m85
1621b8n45k64K99L12M14N87j06l81m63l00k94K43L20K80M92R4k61k66k59p21K62
$$ plain form
1477 513 -51 -1018 -1166 -555 -291 581 749 1007 375 -189 -686 -1099 -915 -132 572 1109 939 475 -123 -907
1497 -907 -940 -817 -119 378 847 983 372 -501 -880 -1148 -921 -369 571 734 807 340 -214 -791 -922 -652 20
1518 20 593 1103 811 656 -421 -1038 -911 -662 -5 863 1092 701 280 -471 -796 -754 -510 254 670 615 880
1539 880 427 -314 -773 -876 -601 188 294 813 846 190 -472 -976 -917 -467 228 827 1031 693 343 -373 -777
1560 -777 -693 -362 14 680 800 653 -189 -20 -556 -862 -528 14 521 762 579 215 -313 -595 -979 -301
1580 -301 7 353 861 731 172 -378 -816 -672 -467 90 593 891 661 126 -353 -921 -1021 -271 267 814
1600 814 897 638 240 -329 -872 -541 -369 119 453 957 448 97 -335 -536 -628 -296 266 532 700 457 -28
1621 -28 -573 -837 -538 -226 188 775 669 288 -175 -475 -769 -526 -206 74 566 660 399 133 -126 -847 -585
1642e85L19M88L00R7l38l44k22k63o9K63Q39M7j68o0k51n70j38L94j45P28L77
1663F99K4l31m25l53k51K52K46K20L88J45n09m28l3k02K95J76K38N40P5l50o06
1684a90k44Oj49M65K35N16k82P4n85m73J24J58L64L51K64k89k46l37l78%K68M39
1706I1K53L64j8m70l80n99K24J41M19K46Q2M7k91k00n65J55K3O56J72QJ44l00
1728B02l77n83L37R6L12M59J00j82k07l98k84K8K38K70J50L58j40l58k33j75k48
1749f35M27L31L41n2L01n64n67o1k01N44N1K32M86jp64l3l07k8K91L81L19n7o6
1772C68k48l65o2j30J91M01J15L18j55j75p52P3j33L17K15N34p8j59O8p10J00
1793b67J51l5J45M66mj89j13n22P6j6L47J21J84J04j38n6m56l68L20j23O90JN8
$$ plain form
1642 -585 -266 222 522 619 281 -63 -285 -548 -617 -354 485 532 364 304 53 -517 -655 -261 -406 322 699
1663 699 723 392 -33 -386 -637 -385 -139 81 469 614 105 -323 -356 -558 -263 -87 151 691 766 416 -190
1684 -190 -434 -428 -577 -112 123 639 357 431 -154 -627 -503 -345 19 370 634 345 99 -238 -616 -616 -348 91
1706 91 344 708 690 220 -160 -759 -535 -394 25 271 353 400 109 -91 -656 -501 -478 178 350 358 502 202
1728 202 -175 -758 -421 -325 -13 446 546 364 157 -241 -525 -497 -259 11 161 519 379 21 -212 -387 -635
1749 -635 -208 123 464 412 713 149 -418 -479 -680 -136 -85 147 633 632 -132 -165 -472 -500 -209 172 491 434 368
1772 368 120 -245 -307 -437 -246 155 270 588 433 258 -494 -421 -554 -237 -22 512 434 275 343 -367 -267
1793 -267 -116 -151 -6 460 456 267 154 -368 -292 -308 39 160 344 448 310 254 -202 -570 -250 -373 317 318 376
1816C76j35j12m11lo2L10R7K22j2K11o38j99j18M8N19J84M7K72k11n70j70j77
1838e32K86L31J41L01k9q5l27k92l53K76M31O3j8K94k84l74l06R0n4K81N19J71
1860E30p9k56k32k55ok1M24J81J7Qp8k97j46m5J9n8L28M54j92j99N6n61j99L08
1884b99rP63L5l37K6l30j80J22K41Q5J80j81L21m54j10n5k56K15J86L31Q0j09
1906B65ll69k23K29l8pL04M67m55j25K8k92n4J18J14L04J37j98J0k98k03k5J07
1929b07J49M10M2j68k22j73k01k7K85PL84J20n8l58p6q8p8J66j30M63J81k4j00
1952B97l05j53j44J36L76m5J76k5l05k07k87J65J40M12l7J36R2m51o1j07KqL76
1975A73K00o9j50j0k8l85n8J80J98J06J51r4k57j03p1j86K27O56j75k01P0m8k04
$$ plain form
1816 376 241 129 -282 -285 -347 -37 60 282 270 481 -157 -356 -474 -426 93 277 324 596 385 -185 -355 -532
1838 -532 -246 85 226 527 498 413 86 -206 -559 -283 148 211 193 487 203 -171 -477 -387 -441 -160 359 530
1860 530 451 195 -37 -292 -298 -319 105 286 303 311 233 -64 -210 -255 -236 -294 34 488 296 97 153 -408 -607 -299
1884 -299 -308 455 490 153 179 -151 -331 -209 32 117 297 116 437 -17 -127 -182 -438 -223 -37 294 374 265
1906 265 262 -107 -330 -101 -139 -146 158 625 170 45 73 -219 -273 -155 -41 263 400 202 212 -86 -289 -314 -207
1929 -207 -58 352 394 226 4 -169 -370 -397 -112 -105 279 399 341 -17 -93 -181 -259 -93 -223 240 421 397 297
1952 297 -8 -161 -305 -169 207 162 338 313 8 -199 -486 -321 -181 231 194 330 422 -29 -90 -197 -195 -203 173
1975 173 373 304 154 144 116 -269 -327 -147 51 157 308 214 -43 -146 -217 -403 -176 480 305 104 174 126 -78
1998g8k47J69K77J93M1P1l29k44o1j98J5L53J73M3J9K2k09j98P3K9j50M21K29
2021D14j77M4l20rk82O9rK71M33jm13o3j90n4K73J04N2P7R1k27k91K40k73q6K15
2046a12K12O1K25m16J16k97L5j22K28K65K91j97r2l24q5KJ33j50L02L25j43k31
2068B6N6j71k57J81K11K2K43j2j80r4l23K91j32M48k63K45j80J43n04JN4j61N33
2091A77j24N8L76m58j63k51j09J17K84K91K69j27j17p9m79j55L31N0J06M23k13
2112B07k18k56j31j1L97K02l4l96N55j17j24m00p0K75J09J88l6L00l25j37l07
2133c29J47K7M08M0j21l6l08N6l65J35L55P6j94M30k73j39Q2k55J7K42Q1K3J53
2156B52n9k83p0K33l90K9K11J46n4r3L7O2k80PM4K04P3K27J7j60j13l59p7L31
$$ plain form
1998 -78 -325 -156 121 314 355 426 97 -147 -208 -406 -391 -38 135 178 197 219 10 -188 -115 -86 -236 185 414
2021 414 237 281 -39 -48 -330 -261 -270 1 434 433 20 -43 -233 -287 -14 90 142 219 310 83 -208 32 -241 -327 -112
2046 -112 100 161 386 -30 86 -211 -176 -298 -70 195 486 289 197 -127 -212 -210 -77 -227 75 400 257 26
2068 26 82 -89 -346 -165 46 68 311 299 119 25 -298 -7 -139 309 46 291 111 254 -250 -249 -195 -356 177
2091 177 53 111 487 29 -134 -385 -494 -377 -93 198 467 340 223 144 -335 -490 -159 -109 -3 420 207
2112 207 -11 -267 -398 -409 -12 190 156 -240 315 198 74 -326 -396 -121 -12 176 140 440 115 -22 -329
2133 -329 -182 -155 253 293 172 136 -172 -116 -481 -346 9 85 -109 321 48 -91 -9 -264 -247 -5 76 99 252
2156 252 193 -90 -160 73 -317 -288 -77 69 15 -78 -41 21 -259 -252 -208 -4 69 296 313 153 40 -319 -396 -65
2180f5j16M49M2r6n7l30L04o28P9M08l5L08j83O5j66k88J71j56K68N9K10k83J29
2203H9l47J42J44o6R4K63O8n82J40j98rM7l8O4K42M5N0k84J26r0j26jK41R1L33
2228D38m00ll69J70J1L03r9J57J54m09Q3p4q9j44N25j40O4o0q3j4k48J2Qj29L04
2253c2K68l7k36J14j67o6k33K86O1K28j57p3j6j13j60P8R9K16K01q7j2j94k81
2276c13K80j25J95J53r3K61n59K94l25l4j8K34K67J00j92R4l12k72J87P5M34k44
2298H7K78m24K1J6j58m07L28K32J52MJ61j83k81j37N1J27K61k5J46k67J77j79
2320b0m9Q5k85K9P8L34p1j80j0j50j19J81J11K59K6j53J32m9m11J39l1K88O2q4
2344A12QQ4l07P2j82p1J31M49K9pk80k2n1k20Q9J7L32N2r4j1j53j2k02j17K95
$$ plain form
2180 -65 -181 268 310 214 157 -173 131 -497 -418 -10 -45 263 80 145 -21 -309 -138 -294 -26 33 243 -40 89
2203 89 -258 -116 28 -38 56 319 387 -195 -55 -253 -262 -215 -253 -189 53 98 148 -136 -10 -100 -226 -227 14 105 438
2228 438 38 35 -334 -164 -153 150 51 208 362 -47 36 -38 -127 -271 254 114 178 118 35 21 -227 -215 -207 -336 -32
2253 -32 236 199 -37 77 -90 -156 -389 -103 -42 186 29 -44 -60 -173 -333 -255 -156 60 261 174 162 -32 -313
2276 -313 -33 -158 37 190 97 358 -201 93 -232 -266 -284 -50 217 317 125 219 -93 -365 -178 -103 331 87
2298 87 365 -59 -38 -22 -180 -587 -259 -27 125 129 290 107 -174 -311 -260 -133 128 103 249 -18 159 -20
2320 -20 -69 16 -269 -240 -162 172 101 -79 -89 -239 -358 -177 -66 193 219 66 198 149 -262 -123 -154 134 196 112
2344 112 120 204 -103 -31 -213 -284 -153 296 325 318 38 16 -35 -255 -166 -149 183 235 141 130 -23 -35 -237 -354 -59
2369e9K35J61j63O2l42k1j69J72J97K6RJ0Mj21J63l99J52R8J76P6k08N1l05Q1
2393a14j92K91l2J93O9qo2r6k75m1Q3L44k26M13j71K34o87R7L61l60J18J56J70
2416B65q9k20j85J30n4J69K09j09q6j44K39k22j86L00k88M70q3o8J50L8j91k08
2438a63j62J36O4J65K07J46m48L2j00lK56n4O8j76J63l33J61j36j05J46N1J7L24
2461B56j52j84k24J24j32O6L37o0J22q0j60k37P4Q3M1N8K96k25K51j92r7j42P6
2484a01K5M5O4J9L7o3N8l82J28J71J03J8N4j64j27p5J1J64j94K15J59j35k8J24
2508A26l71n2m9K22J54j4J09o4j46k4n5J11k69M12q6J49o4j68l36K33R8rJ29N0
2532H6p0k0j63k40N18n61N85j55P9J62jo12K82l7K1N6J11Q6J16j8k26o1R2p6J05
$$ plain form
2369 -59 176 337 174 236 -106 -127 -296 -124 73 99 108 118 122 1 164 -235 -83 15 191 267 59 110 -195 -114
2393 -114 -306 -15 -47 146 215 207 145 49 -226 -267 -184 160 -66 347 176 410 -277 -180 181 -179 -61 95 265
2416 265 176 -44 -229 -99 -153 16 225 116 30 -114 125 -97 -283 17 -271 199 116 48 198 236 45 -163
2438 -163 -325 -189 -125 40 247 393 -55 -23 -123 -126 130 76 144 -32 131 -202 -41 -177 -282 -136 -85 -68 256
2461 256 104 -80 -304 -180 -312 -246 91 31 153 73 -87 -324 -250 -167 -126 -68 228 3 254 62 -35 -177 -101
2484 -101 -76 -31 33 52 89 26 84 -298 -170 1 104 122 176 12 -115 -190 -179 -15 -209 6 165 30 2 126
2508 126 -245 -297 -346 -124 30 16 125 61 -85 -109 -164 -53 -322 90 4 153 89 -79 -415 -182 -84 -93 36 86
2532 86 16 -4 -167 -407 111 -450 135 -20 59 221 220 -392 -110 -147 -126 -70 41 127 243 225 -1 -62 30 -46 59
2557E9k0J81ml52j32K76l8J3K43n0p1O0k47J45j77r5J80KJ57k01K87Ok74L9j84
2582a97l3K29J80j15J22j14j43K32l5l15N4L26n9L5j91j64L70k40o6J09L99l20
2604F4K20m62L15k98O1j93M9J87L07N8l06Q2j87N8l4p2L80k61J42J2j40j27l0
2627a75j39NL94P7Q5m01Q4k03K40r9J24J57J21k15k45J48j06R4N1K15r3j74J81
2650A26k13L0r8O5o4K20J6M2q1Q2j80j43K20l6O5rL32k83Ql19J96j83p3J99J61
2675H0O6j07K13k86j06J5m6O8J99r0q8K36p9l66J80R8J4Q5N0Q2L2k76j98J94L
2700b7N0K49J8k63K8J20k81Oj62K25K76k20J61m33l0J29L66l13n3J74K58k86J1
2723CQ0k25QL7J7j7J44n8k91K84l21N80m47L58O6j10Lj04j07J49r6j38O7J55K7
$$ plain form
2557 59 39 220 216 -136 -268 8 -30 -17 226 176 105 165 -82 63 -114 -209 -29 -27 130 -71 216 222 -52 -13 -197
2582 -197 -230 -1 179 64 186 72 -71 161 126 -189 -135 191 132 167 -24 -188 182 -58 -124 -15 384 64
2604 64 284 -178 137 -161 -100 -293 -244 -57 250 308 2 84 -103 -45 -79 -151 229 -32 110 122 -18 -145 -175
2627 -175 -314 -309 85 162 247 -154 -70 -273 -33 -132 -8 149 270 55 -190 -42 -148 -54 -3 212 119 -55 126
2650 126 -87 -57 -155 -90 -154 66 82 124 43 125 -55 -198 22 -14 51 42 374 91 99 -220 -24 -207 -280 -81 80
2675 80 146 39 252 -34 -140 -125 -171 -103 96 6 -82 154 75 -291 -111 -13 1 86 136 218 250 -26 -224 -30 -27
2700 -27 23 272 290 27 55 175 -106 -100 -262 -37 239 19 180 -253 -283 -154 212 -101 -154 20 278 -8 3
2723 3 83 -142 -134 -97 -80 -97 47 -11 -302 -18 -339 241 -206 152 218 108 111 7 -100 49 -47 -185 -118 37 64
2748F4Rlj71k4L4J83k53L73j64j48P4k0p5o4K79l42M49k35K04m02L4L01k69K33
2772F7k05J62J37j11k54o0M39l53K28R8Q1l54K41p5j78K3M29l33j0n1K06k63K21
2795H5l89K02J75l42O56l00q8j49J72p1r7n0K52o0J01Q2q9k56j3K11j87J93q8
2818e0M43j98k10q8M6L7j30O6L45l63K04j00j0j04J01k18P7K26m9M4j20k6J72
2841I5q0N5q9J1J56P3j44j30n9L4j36J65K94K6r7n2n03N84k25J80o08L45J44L4
2865G3l2j1j09j61K86J39j67N13m95J0j34K53l13q2J16K24J06q4o0o1j18j00K08
2888Aj61K65m7Q7j86P6Qj6K9j60P8K5K92k81l26L15R8k90J83J75q0N9j80j15r
2913a60K27l39K75o3K28N8l37J04j30o8L62j93j37J61R5J42m06J64j54NK07J78
$$ plain form
2748 64 73 70 -101 -125 -91 92 -161 212 48 -100 -26 -46 -121 -185 94 -248 201 -34 170 -232 -198 103 -166 67
2772 67 -138 24 161 50 -204 -264 175 -178 50 148 229 -125 116 41 -137 -114 315 -18 -28 -79 127 -136 85
2795 85 -304 -102 73 -269 387 87 -1 -150 22 -49 -146 -196 56 -4 97 179 90 -166 -179 32 -155 38 -50
2818 -50 393 195 -15 -103 -57 -20 -150 -84 261 -102 102 2 -8 -112 -11 -229 -152 74 25 69 -51 -77 95
2841 95 15 70 -19 -8 148 221 77 -53 -112 -78 -214 -49 245 271 174 122 -381 203 -22 158 -450 -105 39 73
2865 73 41 30 -79 -240 46 185 18 531 36 46 -88 165 -148 -230 -114 110 216 132 72 11 -107 -207 1
2888 1 -160 105 58 145 -41 35 43 27 56 -104 -26 -1 291 10 -316 -1 97 -193 -10 165 85 144 -36 -151 -160
2913 -160 67 -272 3 -60 168 226 -111 -7 -137 -205 157 -36 -173 -12 83 225 -181 -17 -171 -166 41 219
2935B19j25J20k01j5l4m3J5K35k43K32j4N9j21k91M25ql86J85K00m25L90j92j29
2958a47k69K74K43p8j38K63j52O2m78K22L24j80R2j04j38L18l2k6k02L0J00J41
2980A25ln0M9q1j34J09k93J05M70m69K28j48P1K2j24K01j49K64k79L82m66J33
3002c7j02P0J7p%l5N7J51j37j6M2np3Q8n1j53J07ML4K9k2J08k6L7J08j54j4j51
3030a31JJ00r5J79K07j54j29j16J57N1j84M32m78J53R0j45O8j51J37J45k19R9
3052A7rJ74k75J4J03J5l02O27n95M89j3l22P0K12j66k14J92k34J38J04J72j44
3074E3l1l3o6j4K35J5l0j0o6L6l7j06J00K3L0l3j41k50J36J63R0j48L50k30Ql3
3100A1j31j1J02L5K9J9L9L6k84J03n0Q7L7M3j16J5L2L1J23r1n7L1j5p2J10j91
$$ plain form
2935 219 94 214 13 -2 -36 -79 -64 171 -72 160 146 205 84 -207 218 210 -176 9 209 -216 174 -18 -147
2958 -147 -416 -142 101 23 -115 148 -4 58 -420 -198 126 -54 38 -66 -204 114 82 56 -146 -116 -16 125
2980 125 122 72 121 40 -94 15 -278 -173 297 -172 56 -92 -21 1 -123 78 -71 193 -86 296 -170 -37
3002 -37 -139 -69 -52 -59 -59 -94 -37 114 -23 -39 3 -2 -75 13 -38 -191 -84 -80 -46 -17 -39 69 43 80 188 34 20 -131
3030 -131 -130 -30 -125 54 261 107 -22 -138 19 70 -114 318 -160 -7 83 -62 6 -145 -8 137 -82 17
3052 17 8 182 -93 -79 24 39 -263 364 -231 258 245 -77 -7 205 39 -175 17 -217 -79 25 197 53
3074 53 22 -11 -77 -91 144 159 129 119 53 89 52 -54 46 69 99 66 -75 -325 -189 -26 64 -84 266 36 44 11
3100 11 -120 -131 -29 6 35 54 93 129 -155 -52 -102 -15 22 65 -51 -36 -4 27 150 59 2 33 18 -54 56 -135
3126a35J50k61K59j06j0L31m65M48k0q1m2q0O2m5o4J01J74l3k41j33J00J35k3
3149B1k1J04K6j30q3Q3K20j41J39l41M2L23j46k88j29K73J17j56K57j07j10j70
3171b17L78j76k02J76q9M16k66J64l34K35P2n0m42N09k94K32nj06j63M5q6J98
3193enn3J90l18J48j01j56PK08K45l21L45l38j02K73r4j7L0Q3j6J36k36J04j11
3217a04J09n6P1MR5m5J5J39j51k15K55k5j18K41j11l2q2o3J17j52Q4MP7J10j08
3242E9M9j39j24n8J93k01J80N6M4m6k44K95j04J18o6q0K20j03O7o1N8l85K14L40
3266B82l06j61K55j49P1O7j21q6J95J85j80K7qj46n9J28k68J41R6J20k61M7L50
3289B19n5j28k28L00k05K4J10j06J31j79K18j52L3R3n1J14j90J61K3j01J05l0
$$ plain form
3126 -135 15 -246 13 -93 -103 228 -237 211 191 110 68 -12 50 5 -59 42 216 183 -58 -191 -91 44 21
3149 21 0 104 130 0 -83 0 220 79 218 -123 -81 242 96 -192 -321 -48 69 -87 170 63 -47 -217
3171 -217 161 -15 -217 -41 -130 286 20 184 -150 85 157 107 -335 174 -120 112 107 1 -162 -117 -203 -5
3193 -5 -10 -63 127 -191 -43 -144 -300 -293 -85 160 -161 184 -154 -256 17 -77 -94 -64 19 3 139 -97 7 -104
3217 -104 5 -51 20 24 119 74 89 228 77 -138 117 92 -26 215 104 72 -10 -73 44 -108 -24 -20 57 167 59
3242 59 108 -31 -155 -213 -20 -221 -41 15 59 13 -231 64 -40 78 12 -68 152 49 116 55 113 -272 -58 282
3266 282 -24 -185 70 -79 -8 59 -62 -148 47 232 52 79 71 -75 -134 -6 -274 -133 -37 83 -178 -131 219
3289 219 164 36 -192 108 -97 -73 37 -69 62 -117 101 -51 -18 75 24 138 -52 109 132 31 136 106
3311A06j00K06L4j82K1k26k6L45k76K59j85j85K64k96L45L0j66j67J50o2M9Ql3
3334h7J02L62l19o2R0j81j77K08P7k2P4j5J83l53J21K3L2j43n2L69j8m26N4K01
3358D1J17k61J18K1j91J65j11J30J57j17r9nj8Jk11L30j32o2L50k97J14J58k62
3381f4M9k3k73N72l91R4K42k59J37j73OQ2j9J17k38J46j99R6m6j0L61n2J30j54
3405A31j97j0Q1j30K76k66J19l6J08q0KJk3Q4NJ45j48n1k34J74K66l47J64j15
3429h1J55N1m9J4o6j00O2J66p3J2Q8k58j00J53j75J80O2J20j67J5p2J5M4K64k52
3454HO7J2J3j7j06K0K0Q2J88l04r2J62J07j63j00L3L9R5n9k7K1o7J93o2j86J45
3480B2j62K75K26m19m8J21J99k10j05R2pj98N86k65r7P9Rj76J0J59j85j85O0M9
$$ plain form
3311 106 6 212 246 64 85 -141 -167 178 -98 161 -24 -209 55 -241 104 134 -32 -199 -49 -111 -62 -54 -87
3334 -87 15 377 58 -4 86 -95 -272 -64 13 -9 65 50 233 -120 1 24 56 -87 -139 230 212 -214 -160 41
3358 41 158 -103 15 36 -155 10 -101 29 186 69 -30 -35 -53 -52 -263 67 -65 -127 223 -74 40 198 -64
3381 -64 -15 -38 -311 261 -130 -36 206 -53 84 -89 -83 -1 -20 97 -141 5 -194 -98 -144 -154 207 155 285 131
3405 131 -66 -76 5 -125 151 -115 4 -32 76 -4 -2 -1 -24 60 65 210 62 11 -223 -49 217 -130 34 -81
3429 -81 74 125 76 90 24 -76 -14 152 79 91 179 -79 -179 -26 -201 -21 41 161 -6 9 -63 -48 -4 260 8
3454 8 75 87 100 83 -23 -3 17 99 287 -17 -109 53 160 -3 -103 -70 -31 64 5 -22 -1 -68 125 63 -123 22
3480 22 -140 135 361 -58 -106 15 214 4 -101 -9 -16 -214 372 107 10 89 98 -78 -68 91 -94 -279 -219 -170
3504a70K36j33Q8J42M9k43J73J53o17N54m19L6K08k0j31P4P8Q2j89N8j39o4K49
3527E5p3n6K95j66qj59r0N8L17Jj77P8R7l06J99J13l31L47j16N4m15L69Q9r3k75
3552a93L31j60k05J22J61kj47J11q6m31L06M36m11K11j48P7J37j90K6j19J4K51
3574I1m0k01K07K35j94p8L2K3k08M3K59n3m7l0m0J34k85K78l24L99j14m6N5R9
3598A95m6K8j27l9M0j42p5J75m7J91j91K61l20k5N4J92L4k16L9R9K06o3j46j43
3622f6l5M1J87j02j74J16R0n7M5j14j2N7K00j41K2J17k27J41J6j94K56j55j51
3645a40R2o8J8J55o0K09m67L83j7k8K3r7k9M0J08j52J70j75m1NJ52J02n5j90p7
3670a39J98j99N7k4J92j89J30p9L8K1j31K87l11J61j83J00R3l6k62K34K36j29
$$ plain form
3504 -170 66 -67 21 163 212 -31 142 295 -322 232 -187 -151 57 37 -94 -20 58 140 -49 9 -130 -194 55
3527 55 -18 -74 221 55 47 -112 -202 -144 173 174 -3 75 172 -134 65 178 -153 194 78 132 -283 86 175 82 -193
3552 -193 138 -22 -227 -105 56 54 -93 18 -68 -499 -193 243 -168 43 -105 -28 109 -81 -55 -174 -160 91
3574 91 51 -150 57 292 98 20 52 75 -133 -90 169 116 69 39 -1 133 -152 126 -198 201 87 41 96 195
3598 195 149 177 50 11 51 -91 -166 9 -38 153 -38 223 -97 -122 -68 124 158 -58 -19 80 286 223 77 -66
3622 -66 -101 -60 127 25 -149 -33 57 0 45 -69 -81 -24 176 35 57 174 -53 88 104 -90 166 11 -140
3645 -140 -48 -116 -98 57 -3 206 -261 122 105 77 100 3 -26 14 122 -30 140 -35 -76 -71 81 183 128 -62 -139
3670 -139 59 -140 -83 -107 85 -104 26 -53 -15 6 -125 162 -149 12 -171 -71 22 -14 -276 -42 194 65
3692F5j99J64j63J49j68K07j83N9j82L84j9j57J95N2k57K66m21Q5J10jj32Jp7
3715b22N60l54m8j93J43J00J35j57j54K39Q8j63j84L10j18n3Q3k2j09M49l19j91
3737a80RJ62N2j59K39J92m76K44K35k52k68K91k44J36j82L23j20j26J48oK0j74
3759a36J82N1LJ92k72n8K90q9m8l0K7jm3q6o6J33j23N7J25j36k6J06l9m3j31J74
3785A3K19o7k06K88j93k6r5j50O1K66l43J16M3l6k4O7P6J08k39K36l1q5K7k54
3809b29L01k33K51j31n5J05L36n79L01o7j53J96J7J0p3P8l81L90k48L24k9k61
3831a30J28J77l39J94MM0j56l5K7M1r5J61M8O9m4j50L8n2M3JJ09j23o6K01j39
3856d8k67L66Q5K2l41J02J24j70M52l99N1q9K56n42L58K06l38p6J14j53L19j02
$$ plain form
3692 65 -134 30 -133 16 -152 55 -128 -69 -251 133 114 -43 152 204 -53 213 -208 -123 -13 -14 -146 -145 -222
3715 -222 338 -16 -64 -257 -114 -14 121 -36 -190 49 137 -26 -210 100 -18 -71 12 -10 -119 330 11 -180
3737 -180 -171 -9 43 -116 123 315 -161 83 318 66 -202 89 -155 -19 -201 122 2 -124 24 18 38 -136
3759 -136 46 97 100 292 20 -38 252 163 115 85 112 111 68 -18 -84 49 -74 -17 108 -28 -54 52 13 -30 -161 13
3785 13 232 165 -41 247 54 28 -67 -217 -156 110 -233 -117 -74 -110 -134 -67 9 117 -122 114 83 -2 25 -229
3809 -229 72 -161 90 -41 -96 9 345 -234 67 0 -153 43 60 70 -3 75 -306 84 -164 160 131 -130
3831 -130 -2 175 -164 30 34 74 -82 -117 -90 -49 -144 17 65 134 90 -60 -22 -74 -31 -30 79 -44 -110 91 -48
3856 -48 -315 51 136 158 -183 -81 43 -127 325 -74 -23 -112 144 -398 -40 166 -172 -248 -134 -287 32 -70
3878g0J96LqJ54l73K04j63O9L7rO2l9o0k5j79K94P3k20L0P6o6j82K55J95l84K05
3904G5KQ3k45R2K05k93q4P9O1l35K21J22j17Q9K43m5m0j57M5J9j15J64j95k9J14
3929d1J7k17M03j25p3k22K00L29k68L4N0r7j37J97l03J73K93j57O3k14j7J29J59
3952A76k4j03K9j51J20k9j95J41J26l1lJ90j44N4m1p7k08%M29n96M14Lj04J05
3976H1Ok13L40k15P7P0L7k03pP2N0p7j22P0rO2K07j61l10L24P7l70J10K39j67
4001c2J44k80M93k60j1k4j01OJ6j69L82j14R7n0K7k15k34L62n9K57k0l24L19l92
4025a82K81j12j6pJ93p5j35OK60m08L68jk73k0R7J38k11j03J01p4K41K6j70J0
4049f6M4n9R2j3L1j20K4J12k95K95J02j24J66m10L48J10k35M2j93K67j81l9J32
$$ plain form
3878 -70 126 129 121 275 -98 106 -57 12 49 40 102 63 3 -22 -201 93 166 -54 -24 52 -14 -196 59 254 -130 75
3904 75 77 160 -85 7 212 -81 -165 -86 -25 -360 -139 -17 -134 -45 198 153 113 -44 1 20 -95 69 -126 -155 -41
3929 -41 -24 -241 162 37 -36 -258 -58 271 3 37 87 -10 -147 50 -253 -80 213 56 119 -95 -112 17 176
3952 176 152 49 78 -73 47 18 -177 -36 90 59 56 246 102 156 115 38 -170 -170 259 -337 77 80 -24 81
3976 81 87 -126 214 -1 76 146 183 -20 -27 45 95 18 -104 -34 -43 19 226 65 -245 79 156 -214 -104 135 -32
4001 -32 112 -168 325 65 54 30 -71 -65 -49 -218 164 50 147 97 124 -91 -325 37 -22 235 215 -109 210 -182
4025 -182 99 -13 -29 -36 157 82 -53 -47 213 -195 173 172 -101 -121 -24 114 -97 -200 -99 -173 68 94 -76 -66
4049 -66 -22 -81 11 -2 29 -91 -67 45 -250 45 147 23 189 -221 127 237 2 44 -149 118 -63 -102 30
4072C0k4j6l1K31l52J58j32M52k82j97k2L27j37R9j60l2p7K66J3k24N8J52j66
4095f6J85j42m3pK7m5J75q3M7m0J31m06L48r8n2j4l6K78j15j58K22k1L3j11k02
4120a93J07K2j37J97J18j19k59K91P4k27P8J93j69R3j65J08r6Q2r1K16k0O6k61
4143i2R4K94k94P7P6j39m0OK45k34k66K75m6j16J67k48N35k12j54R3J11J29m55
4166a94K7K81k62P5J66j38j57K28L1o5n8%j92K51K05j06Jj0j44J00k55M3pJ89
4190Im3Q7J22l29P5J16Rj76J61J41m70L86o3J0j6p6Qo9K60j71j38j6J13J66P4
4215A70k95L8K38Mk3j29J34k7j1j24J84j49k3o9K72k07J71j30j30Q3J9p1J39J90
4239B54r4k74PK37j80M8L7k6N9p4J19l7l33K71j4O8p8O1j21k07M65k36M14m03
$$ plain form
4072 30 6 -10 -41 190 -162 -4 -136 316 34 -163 -185 142 5 104 -56 -88 -165 101 114 -110 -52 100 -66
4095 -66 119 -23 -66 -73 -46 -91 84 1 48 8 139 -267 81 -17 -69 -83 -119 159 44 -114 108 87 120 9 -193
4120 -193 -86 -64 -201 -4 114 -5 -264 27 101 -126 -48 145 -24 69 -96 12 -84 -2 -93 123 103 169 -92
4143 -92 2 296 2 79 155 16 -24 -18 227 -7 -273 2 -44 -160 7 -241 294 82 -72 21 132 261 -194
4166 -194 -167 114 -148 -73 93 -45 -202 26 57 -8 -66 -66 -258 -7 198 92 93 83 -61 39 -216 -173 -180 9
4190 9 -34 53 175 -154 -79 37 46 -130 31 172 -298 88 25 35 19 -57 -49 -118 142 -29 -167 -183 -70 96 170
4215 170 -125 -87 151 155 132 3 137 110 99 -25 159 10 -13 -82 190 -17 154 24 -106 -23 -4 -75 64 254
4239 254 160 -114 -107 130 -50 -2 35 9 68 -6 113 76 -257 14 0 68 -10 51 -70 -277 188 -48 366 -37
4263c7j0O2k23K54p3J1r6R3J85n0k09O2O5Q0Q0j79K05k11J5j71K30k11L50j9j75
4288B8OO3J38l61J73m8j64K93K9l05J81R4l87L43k36j14K13o0J78J15k95K4J11
4311A9j00N8n0N5J6K4J43r6j74K94o9k20J87M6k4j27J74l15q0K78J04r2j42L33
4335B42l65p8J70J53k74L11k86J17r9l1J49j79O5J87j35J72k34J31J92l70M94
4356C32l86Q5K44m83K38J36l18N09k34M4m21M57Rk65J13k37M00Qk90J21r6j44
4378a78L42k28j57J40J6O3j24L9K11j59m7RQ7K05k92m1l5J59m4J1j33J89O5Q9
4402A87j66j81J64r3l2K66l47J35n2J65k20K15j06j08K62l7K34l90P4L3Q0q6j72
4425a75J56j75J76O9k79K38J5K20k41J07j81QK88l59J76J50j68J51j63J16n4R
$$ plain form
4263 -37 -47 15 -208 46 -27 -16 -112 -19 166 116 -93 -31 34 114 194 15 220 9 24 -147 83 -128 222 203 28
4288 28 34 97 235 -126 47 -1 -165 128 157 -148 33 127 -260 83 -153 -267 -54 -114 64 179 -116 -92 19
4311 19 -81 -23 -73 -18 -2 22 165 69 -105 189 120 -100 87 133 109 -18 156 -159 -239 39 143 51 -91 242
4335 242 -123 -201 -31 122 -152 159 -127 -10 -109 -140 9 -170 -105 82 -53 119 -115 16 208 -162 332
4356 332 -54 31 275 -208 30 166 -152 357 123 167 -254 203 212 -53 60 -177 223 231 -59 62 -34 -178
4378 -178 164 -64 -221 -81 -65 -2 -126 -87 124 -35 -82 -73 14 219 -73 -114 -149 10 -34 -23 -156 33 98 187
4402 187 21 -160 4 -89 -121 145 -202 -67 -119 46 -174 41 -65 -173 89 52 286 -104 -30 3 83 -3 -175
4425 -175 -19 -194 -18 51 -228 10 25 245 4 111 -70 -62 226 -133 43 193 25 176 13 129 75 84
4447H4j94j30J61J04J00k05j8R5k03K44j53R2j78J01J23j1R7j44j68J65L3q1K51
4470A65o6l09K97K73l26J22N6m3o9j45K03K97n76M2J82j74J30J83k54K54l32Q5
4492ej5l2qJ06q7N3K81m20L34k02N5J76m09K78k28jj34N25j58N7K8j07L2k10K06
4517A15j31M2J01k35K8k19K84j4O7J12l64J69Q1k9n0K83l28M6o2K31j24k67P4
4540a90J94J8J07l5k40K60m3k74R9J32p5n3mP6P6k33J89j55KK70k31K9R3n6P1
4565B7j89J20jP6j9J57l14J77J3K3r6J03q3j00K79k36K64k14M9rm4JJ36j06j47
4590a33L6j12K99K5q1M7m3J06k20J45j56J51R2j67q8P7J53k56J43p8k7L3J31j35
4614e8K8r2M6pK5J40j10k9l5L49l52KJ93k99KJ92j22J92j12J05q8q3L8P0J14M7
$$ plain form
4447 84 -110 -240 -79 25 125 -80 -98 -3 -206 38 -115 -23 -201 -100 23 12 109 -35 -203 -38 -5 -86 165
4470 165 99 -210 87 360 34 156 212 169 100 -45 158 455 -121 -79 103 -71 59 242 -12 242 -90 -5
4492 -5 -20 -52 -60 46 -41 12 293 -127 207 5 60 236 -173 105 -123 -124 -258 267 109 166 194 87 119 -91 115
4517 115 -16 26 127 -108 -80 -299 -15 -29 38 150 -214 -45 36 7 -43 240 -88 -42 -104 127 3 -264 -190
4540 -190 4 22 129 94 -146 114 71 -203 -104 28 -47 -100 -104 -28 48 -185 4 -151 -149 121 -110 -81 12 -44 27
4565 27 -162 -42 -43 33 14 171 -143 34 47 70 -26 77 -6 -106 173 -63 201 -13 36 27 -17 -16 120 14 -133
4590 -133 -97 -209 90 115 34 81 38 144 -76 69 -87 64 156 -11 -99 -22 131 -125 18 -60 -87 -54 77 -58
4614 -58 -30 -122 -76 -83 -58 82 -28 -57 -92 257 -95 -93 100 -199 -197 -5 -127 65 -47 58 -30 -113 -75 -5 109 156
4640A56k42K68k28q9J35o1j55J71R0j78J26J4j15K82o4n57M15J64m56K28J83R
4662I6k78M5K13j50k16J09M45m37M8L54k14K03j65k8J1j0l8J38j85J32p4P2j45
4685g4q4L74k01K06k28J73k85k4J39J58j33K4R1m27L16J58k87q4K53n0l1p5k9
4708a20L18j26J22l44K79l29K46O2j40R1j12J55j31K3n2K0Ln3k8K44q2o7M6J00
4732A25j86K57Q7k43q5R2J36l08J29N0o3K9p6O7L2J85l84P7n4L87j71p7Ol27K01
4757a14O5J76M5l6k98p5L85j40O9M1j4k67J73j11N1M6P1p6R3j21l3J45O8k25n2
4782a34L06j46Q7k04k7K95q9n1k54K00J12K5r2K7k05L71k91Q0j87J2J26M7p8N6
4806a4l3J95K8j04n0J99j62o4pj65j1J13NN9k81J93O3j30K50j44R5j5L8k42K59
$$ plain form
4640 156 -86 182 -46 -135 0 -61 -216 -45 45 -133 -7 7 -108 174 110 -447 -32 132 -324 -96 87 96
4662 96 -182 -137 76 -74 -290 -181 264 -173 -125 229 15 218 53 25 36 26 -12 126 -59 73 -1 71 -74
4685 -74 -158 216 15 221 -7 166 -119 -143 -4 154 21 45 136 -291 25 183 -104 -188 65 15 -16 -91 -120
4708 -120 198 72 194 -150 129 -200 46 108 -32 59 -53 102 -29 -6 -58 -38 -35 -88 -116 128 46 -21 25 125
4732 125 -61 196 283 40 -45 47 183 -125 4 54 -9 20 -56 11 43 228 -156 -79 -133 254 83 6 12 -315 -114
4757 -114 -49 127 172 136 -162 -237 148 8 77 118 104 -163 10 -101 -50 -4 67 -9 84 -37 -70 75 143 -82 -134
4782 -134 172 26 113 -91 -118 177 88 37 -217 -17 95 120 28 55 -150 221 -70 10 -177 -165 -39 8 -70 -14
4806 -14 -47 148 176 72 22 221 59 -5 -12 -177 -188 -75 -70 -11 -292 -99 -36 -166 84 -60 35 20 58 -184 75
4831G5P2m55J60J41K65l50l0J22j34K77k69j51J44M38n42N30l87J22j96l3L02
4852A01l55L56j9k13M5K43j35j03J90j33j42K30j26Q3l30N97k8l6r9p8J5j25j0
4875g2l4QL43l85K6J58N2K2j52R1j63J43j86J7L43j67J09k58P4j4q9J5J38K2j56
4900a15Q9K11r7n3N6l3J28k23nK11n7Q5l43J23k5K7k8L7rj18P3K4k1J77o5j56
4926a07J31rJ11m36L19j00l6M41j14o9j47l1J95j30o9M05k88K23m3l14O4k11j
4949b16K80q4j90J32rK1Q3m7J55o3ol39K97o6k29L83m1mJ55k90Rk6oJ49j01O7
4975A4j25n8J57k05Q7K35j80L70m29Q4J29k08PQ5m1J98K15m44K10k87J27o8J66
4998C9k59r4K57r3K41k96L22k11j69M42j05l8j39K7j38J35j49K75m4NK04n34K71
$$ plain form
4831 75 147 -308 -148 -7 258 -92 -122 0 -134 143 -126 -277 -133 305 -237 293 -94 28 -168 -201 101
4852 101 -254 102 83 -130 -85 158 23 -80 110 -23 -165 65 -61 22 -308 289 261 225 126 48 63 -62 -72
4875 -72 -106 -98 245 -140 -114 44 96 118 -34 57 -106 37 -149 -132 211 44 153 -105 -31 -45 -134 -119 19 41 -115
4900 -115 -26 185 88 35 91 58 186 -37 -42 169 112 197 -146 -23 -48 -21 -49 -12 -21 -139 -66 -42 -63 114 49 -107
4926 -107 24 15 126 -310 9 -91 -127 314 200 131 -16 -47 148 18 -51 354 66 289 246 -68 -4 -215 -216
4949 -216 64 -20 -210 -78 -87 -66 17 -30 125 62 56 -283 14 -52 -281 102 61 57 212 -78 -69 -95 -101 48 -53 14
4975 14 -111 -169 -12 -217 -130 105 -75 295 -134 -50 79 -129 -122 -37 -78 120 335 -109 101 -186 -59 -127 39
4998 39 -220 -314 -57 -150 91 -205 117 -94 -263 179 74 36 -103 -76 -214 -79 -228 47 3 8 212 -322 -51
5021e1R1l7p6K13j65K0J66k5j54J3Q2j18K69k17J31j79j88J87J78L0n16M10R8
5044A62j89J72j12R1o5r5J08k57J03J28j12J11m1Q8o7k00K17o0m7M5j25K09j52
5067h8K74p3o9M6j30J28J10l83M52l30K3J33j15O4k6k17K98J5p3k60L64j27j09
5090i3J52j38o2j26K27j0M4N8R1O0j75rQ5k09j14K66o8QN8m7k58N3L01O1l01L07
5116A61k10J77j04j37K96j68k66J93p1k3K50k93J92lP8L7l81K18l1J64j64L5k6
5139g6N1q3K25j63k6q2J92j14L24k40n1n7J59M7k74J10o0J54k07L42k14O2k43
5162b24J39J62M5K4l46L88l26l6N9j8Q9K99k26j32K45j60Q3r1M1J64k81J17J59
5185A74Nk75K25J4k62J56J96l14K13l7j80po3Q9j9P7k7O4q4j7N7k2K04j68j32
$$ plain form
5021 -51 40 3 -73 140 -25 -5 161 136 -18 -5 77 -41 228 11 142 -37 -225 -38 140 170 -346 64 162
5044 162 -27 145 33 124 59 -36 72 -185 -82 46 -66 45 4 92 25 -175 42 -18 -65 -20 -145 64 -88
5067 -88 186 113 44 90 -40 88 198 -185 267 -63 -40 93 -22 42 16 -201 97 112 39 -221 143 16 -93
5090 -93 59 -79 -141 -267 -40 -50 -6 52 143 203 28 19 104 -105 -219 47 -21 -13 45 -2 -260 -207 94 155 -146 161
5116 161 -49 128 24 -113 183 15 -251 -58 -129 -152 98 -195 -3 -6 72 109 -272 -54 -85 79 -85 -50 -76
5139 -76 -25 -108 117 -46 -72 -154 38 -76 248 8 -43 -100 59 106 -168 -58 -118 36 -171 171 -43 19 -224
5162 -224 -85 77 122 146 -200 188 -138 -174 -115 -133 -44 255 29 -103 142 -18 65 -26 15 179 -102 15 174
5185 174 179 -96 129 143 -119 37 233 -81 132 95 -85 -92 -155 -66 -85 -8 -35 29 -55 -72 -15 -37 167 -1 -133
5210a33R4j44Q4J24j79j7j2K66J67o3l20L39j70J50j82j26p4K08J9R2J1J86m13
5233i3J78k00R5k14L33m3j39L91n63L47r5M0L5j56P4%k57M37k84p2L13o1j58K9
5257f3k9J03j83K86O4k14p4l1J51r9J77L7q9j14PK56J10j88O2r2J36l71J68J66
5281A76k39r8J40K00q4p5o0J0o8K01j01R9k4j1j13L9J58j06j63J80PN9j20n5j31
5306a79K28N2K0q1j55L6R3P0k66L52P1m36K63P9p2mm8q1O3j22K55k86O8J42J62
5331B24k79l7J69k15J96q0j64J75lJ27k68L47j18j2j86K25l5k70K97j3l51L68
5353I7l3p9K36k18N0l9N8K3j81J61p9K59k84j1K35k06k1Q8O0j93j70J07R2k41
5377b89M20m29N3P2J53K42l17J39n0N4L8j36pM7j16R8Q2k55J29K22j29R8r3O0
$$ plain form
5210 -133 -39 -183 -99 25 -154 -171 -183 83 250 187 -133 206 36 186 4 -122 -196 12 31 123 134 320 -93
5233 -93 85 -115 -20 -234 99 56 -83 308 -255 92 -3 37 72 -84 -10 -10 -267 170 -114 -186 127 66 -92 -63
5257 -63 -92 11 -172 114 178 -36 -110 -141 10 -89 88 125 36 -78 -71 185 295 107 169 77 213 -158 10 176
5281 176 -63 -161 -21 179 95 20 -40 -30 -98 103 2 101 77 66 -47 -8 150 44 -119 61 68 127 7 -48 -179
5306 -179 49 101 121 40 -115 -79 14 84 -182 170 241 -195 68 147 75 71 23 -58 5 -117 138 -148 -80 62 224
5331 224 -55 -92 77 -138 58 -22 -186 -11 -14 113 -155 192 74 62 -124 101 66 -204 93 80 -271 97
5353 97 64 -15 221 3 53 14 72 95 -86 75 -4 255 -29 -40 195 -11 -32 56 116 -77 -247 -140 -48 -289
5377 -289 131 -298 -245 -173 -20 222 -95 44 -6 48 86 -50 -57 -10 -126 -28 54 -201 -72 150 21 119 26 86
5401H6j07J67j61Q5m6q4J03J71k40l0j30J92R3k95L21n89N37Jk13M4N8J80l1j02
5425A0k01J71kJ98j83K06l06rK71l04J37p3J7O0o4P9J44J1l07J50M0k10R6q1L0
5450a20K23L7j25k7o8M4J36o7n2Rj30k02N02q4k17J03J67j39P8LO6k8O7l7l42
5475b03K03J87k06J73j30Q7m02K04nL77l40J75p3j08k46Q0J92R3o0k7L2k16kK62
5499D7j3j39J33q6qL4K48l95%K24k33n1K54l0j5j12K16J35k66J82l25K48j67J81
5523F2J8k43K65N2j86J04o6r3K76l38R4O4J09o6j12J86m18M80k13k67J0J12J11
5546e9R6j58j55J68m2R4J09n2O9K77j21k40J86k94q2J85J2j45J6J31q0J09J58
5569A82k20Q9J5n8j88Q5J62j80j40K56J5r8j15qK54M4k16J84pL4j03l4j2j12K45
$$ plain form
5401 86 -21 146 -15 70 24 -60 43 214 -26 -56 -186 6 99 -196 125 -464 73 74 -139 -95 -37 143 112 10
5425 10 -191 -20 -22 176 -7 199 -107 -116 155 -149 -12 -85 -68 -8 -72 7 151 162 -145 5 45 -165 -69 -150 -120
5450 -120 103 140 15 -12 -80 -36 100 33 -19 -10 -140 -342 160 76 -141 -38 129 -10 68 71 137 109 176 139 -203
5475 -203 0 187 -19 154 24 111 -291 -87 -92 285 -55 120 47 -61 -307 -227 -35 58 -2 -29 3 -213 -215 47
5499 47 34 -105 28 -58 -66 -32 216 -179 -179 45 -188 -239 15 -15 -30 -142 74 209 -57 125 -200 48 -119 62
5523 62 80 -163 102 154 -32 72 6 -87 189 -149 -55 9 118 52 -60 126 -292 188 -25 -292 -282 -170 -59
5546 -59 37 -121 -276 -108 -150 -56 53 1 70 347 226 -14 172 -122 -204 -19 -7 -152 -136 -5 -85 24 182
5569 182 -38 51 66 8 -180 -95 67 -113 -253 3 18 -80 -195 -203 51 95 -121 63 56 90 -13 -47 -59 -171 74
5594G4Mk43J79K39k72O3J6K27l01J37j75m8J12J52j57j12K89j93j3L2j6J58q7
5617F5j57jJ85o0J53n09K90J43j74L3k0p4J99j63K68k51J35QN6m6j89J90l50J76
5641i3or7P6L85k91J47j48lj7J14k28J11j70J37J57Pk51K58k33J64j03K65l33
5664a52J93j94L2P8J02l75K93oj22K38j20j23K49Q8j17n0Rq1j5J78p5N4k24M1
5688i9L2O1j40K13j14q2q9K59j61nJ55p6j38K67k32J04J5q0K38j85J50J49l73
5711a31O8K46k09J7J44j07J77Pj94K9O7k07K09m34K8K78J8j31K45k54J37J35j77
5734c9k3j6J10k09R6J48O6q1J97l10K3n7q8J63L7j81K08o9N3j48R3r4J39k83P7
5759a88j3N5K67l04K16J30J0j64J29j85M9K7L0j64J55r4K7Mm5M7o8J28O6m3P4
$$ plain form
5594 74 78 -165 14 253 -19 44 60 287 -14 123 -52 -100 12 164 7 -105 184 -9 -22 10 -6 152 65
5617 65 -92 -93 92 32 185 -324 -34 109 -65 -32 -52 -126 73 -90 178 -73 62 70 126 80 -109 81 -269 -93
5641 -93 -99 -196 -120 265 -26 121 -27 -30 -47 67 -161 -50 -220 -83 74 81 -170 88 -145 19 -84 181 -152
5664 -152 41 -153 -121 -43 59 -316 -23 -29 -151 87 -33 -156 93 181 64 14 23 -58 -73 105 30 84 -140 -99
5688 -99 -67 -6 -146 67 -47 -129 -218 41 -120 -125 30 -46 -184 83 -149 -45 -30 -110 128 -57 93 242 -131
5711 -131 -63 183 -26 -9 135 28 205 212 18 47 114 -93 116 -318 -290 -12 6 -125 120 -134 3 138 -39
5734 -39 -62 -78 32 -177 -81 67 133 52 249 -61 -38 -95 -183 -20 17 -164 44 -25 28 -120 -27 -121 18 -265 -188
5759 -188 -201 -146 121 -183 33 163 173 9 138 -47 2 29 59 -105 50 -44 -17 -13 -58 -11 -79 49 115 72 146
5784A46j15j15K57j57k05jK3J18P8j0k28J69r1K22m6j49P1L5K41k27j64L09k68
5807a07MNL6L15m34J44K44k04O2O7N4J53m61J33m8j71M5K51o6J57k22j20L47m37
5831b53K35O2j63j1L13j83j03J38RJ2l8l05L23J49j07q1K9l0k32P8L29k38q7L86
5855B32k70K2M0j42NL28K55n73N0K55l03K70r9j29K14k39q2J56J51j26Q3k79M12
5878B31k8l07K22j25j12L32m67K59jJ94j13m09J51K57n3j56J29J5J08J22j91k46
5900a88L27j52J84j82j54J81Rq3J2J82q0N9k91J28J41r4J59j27n2KK53k94K43
5923A83m38K27P0k75j22K78J63k15L46j40q9J23j85K45k78J35J11m5n5m9J65k37
$$ plain form
5784 146 31 -84 173 16 -189 -190 -167 -49 29 19 -209 -40 -131 91 45 -104 -33 2 243 16 -148 161 -107
5807 -107 -103 -98 -62 253 -181 -37 207 3 65 132 186 339 -122 11 -37 -208 -163 88 22 179 -43 -163 184 -253
5831 -253 -18 44 -119 -130 183 0 -103 35 44 56 18 -287 36 185 78 -3 26 -4 -236 -158 171 -67 -154 232
5855 232 -38 -16 24 -118 -113 215 470 -103 -53 202 -101 169 70 -59 155 -84 -166 -10 141 15 98 -181 231
5878 231 203 -104 118 -7 -119 213 -254 5 4 198 85 -324 -173 84 31 -125 4 19 127 249 58 -188
5900 -188 139 -13 171 -11 -165 16 25 -58 -46 136 56 115 -176 -48 93 -1 158 31 -21 -19 234 -60 183
5923 183 -255 -28 42 -233 -355 -77 86 -129 217 77 -12 111 -74 171 -107 28 139 94 39 -10 155 -82
$$ [...]
8191f9
##END NTUPLES=NMR FID
##END=
