##TITLE=1H_SR92
 dmso
 8 sc, 
 28.10.2021
##JCAMPDX= 6.0         $$ Bruker NMR JCAMP-DX V2.0
##DATA TYPE= NMR FID
##DATA CLASS= NTUPLES
##ORIGIN= UXNMR, Bruker Analytische Messtechnik GmbH
##OWNER= root
$$ XWIN-NMR		Version 3.5
$$ Thu Oct 28 10:38:54 2021 Russian Standard Time (UT+4h)  she@DPX200
##.OBSERVE FREQUENCY= 200.1313468511
##.OBSERVE NUCLEUS= ^1H
##.DELAY= (6, 6)
##.ACQUISITION MODE= SIMULTANEOUS
##.ACQUISITION SCHEME= undefined
##.AVERAGES= 8
##.DIGITISER RES= 18
##SPECTROMETER/DATA SYSTEM= spect
##.PULSE SEQUENCE= zg30
##.SOLVENT NAME= D2O
##.SHIFT REFERENCE= (INTERNAL, D2O, 0, 15.7039)
##AUDIT TRAIL= $$ (NUMBER, WHEN, WHO, WHERE, WHAT)
$$ ##TITLE= Audit trail, XWIN-NMR		Version 3.5
$$ ##JCAMPDX= 5.01
$$ ##ORIGIN= Bruker BioSpin GmbH
$$ ##OWNER= she
$$ F:/spectra/data/she/nmr/H-F/1/audita.txt
$$ ##AUDIT TRAIL=  $$ (NUMBER, WHEN, WHO, WHERE, WHAT)
(   1,<2021-10-28 10:37:55.46 +0400>,<she>,<DPX200>,
      <created by zg, POWCHK disabled, PULCHK disabled
       configuration hash MD5:
       00 E9 B6 7A A2 85 ED C7 34 08 36 98 17 FE 4E 26
       data hash MD5: 16K
       43 31 02 52 09 9D E2 43 AD 3E 1F BA 24 4D 44 42>)
$$ ##END=
$$ 
$$ hash MD5
$$ D3 87 9D 67 DA D3 B8 F9 6D 16 5F 6E 21 47 CF F8
##$RELAX= 
##$RELAX= 
##$RELAX= 
##$RELAX= 
##$RELAX= 
##$RELAX= 
$$ Bruker specific parameters
$$ --------------------------
##$DU= <F:/spectra>
##$EXPNO= 1
##$NAME= <H-F>
##$PROCNO= 1
##$TYPE= <nmr>
##$USER= <she>
##$AMP= (0..31)
100 100 100 100 100 100 100 100 100 100 100 100 100 100 100 100 100 100 
100 100 100 100 100 100 100 100 100 100 100 100 100 100 
##$AQSEQ= 0
##$AQ_mod= 1
##$AUNM= <au_zg>
##$AUTOPOS= <>
##$BF1= 200.13
##$BF2= 200.13
##$BF3= 200.13
##$BF4= 200.13
##$BF5= 200.13
##$BF6= 200.13
##$BF7= 200.13
##$BF8= 200.13
##$BYTORDA= 1
##$CFDGTYP= 0
##$CFRGTYP= 5
##$CHEMSTR= <none>
##$CNST= (0..31)
1 1 145 1 1 1 1 1 1 1 1 1 1 1 1 1 1 1 1 1 1 1 1 1 1 1 1 1 1 1 1 1 
##$CPDPRG= <>
##$CPDPRG1= <>
##$CPDPRG2= <>
##$CPDPRG3= <>
##$CPDPRG4= <mlev>
##$CPDPRG5= <mlev>
##$CPDPRG6= <mlev>
##$CPDPRG7= <mlev>
##$CPDPRG8= <mlev>
##$CPDPRGB= <>
##$CPDPRGT= <>
##$D= (0..31)
0 1.2 0 0 0 0 0 0 0 0.06 0 0.03 0 0 0 0 0.0002 0 0 0 0 0 0 0 0 0 0 0 0 
0 0 0 
##$DATE= 1635403074
##$DBL= (0..7)
120 120 120 120 120 120 120 120 
##$DBP= (0..7)
150 150 150 150 150 150 150 150 
##$DBP07= 0
##$DBPNAM0= <>
##$DBPNAM1= <>
##$DBPNAM2= <>
##$DBPNAM3= <>
##$DBPNAM4= <>
##$DBPNAM5= <>
##$DBPNAM6= <>
##$DBPNAM7= <>
##$DBPOAL= (0..7)
0.5 0.5 0.5 0.5 0.5 0.5 0.5 0.5 
##$DBPOFFS= (0..7)
0 0 0 0 0 0 0 0 
##$DE= 6
##$DECBNUC= <off>
##$DECIM= 32
##$DECNUC= <off>
##$DECSTAT= 4
##$DIGMOD= 1
##$DIGTYP= 9
##$DL= (0..7)
0 120 120 120 120 120 120 120 
##$DP= (0..7)
150 150 150 150 150 150 150 150 
##$DP07= 0
##$DPNAME0= <>
##$DPNAME1= <>
##$DPNAME2= <>
##$DPNAME3= <>
##$DPNAME4= <>
##$DPNAME5= <>
##$DPNAME6= <>
##$DPNAME7= <>
##$DPOAL= (0..7)
0.5 0.5 0.5 0.5 0.5 0.5 0.5 0.5 
##$DPOFFS= (0..7)
0 0 0 0 0 0 0 0 
##$DQDMODE= 0
##$DR= 18
##$DS= 0
##$DSLIST= <SSSSSSSSSSSSSSS>
$$ [...]
##$SUBNAM2= <"">
##$SUBNAM3= <"">
##$SUBNAM4= <"">
##$SUBNAM5= <"">
##$SUBNAM6= <"">
##$SUBNAM7= <"">
##$SUBNAM8= <"">
##$SUBNAM9= <"">
##$SW= 18.0517286264689
##$SWIBOX= (0..15)
0 0 2 0 0 0 0 0 0 0 0 0 0 0 0 0 
##$SW_h= 3612.71676300578
##$TD= 16384
##$TD0= 1
##$TE= 0
##$TE2= 300
##$TE3= 300
##$TEG= 300
##$TL= (0..7)
0 120 120 120 120 120 120 120 
##$TP= (0..7)
150 150 150 150 150 150 150 150 
##$TP07= 0
##$TPNAME0= <>
##$TPNAME1= <>
##$TPNAME2= <>
##$TPNAME3= <>
##$TPNAME4= <>
##$TPNAME5= <>
##$TPNAME6= <>
##$TPNAME7= <>
##$TPOAL= (0..7)
0.5 0.5 0.5 0.5 0.5 0.5 0.5 0.5 
##$TPOFFS= (0..7)
0 0 0 0 0 0 0 0 
##$TUNHIN= 0
##$TUNHOUT= 0
##$TUNXOUT= 0
##$USERA1= <user>
##$USERA2= <user>
##$USERA3= <user>
##$USERA4= <user>
##$USERA5= <user>
##$V9= 5
##$VALIST= <valist>
##$VCLIST= <CCCCCCCCCCCCCCC>
##$VD= 0
##$VDLIST= <DDDDDDDDDDDDDDD>
##$VPLIST= <PPPPPPPPPPPPPPP>
##$VTLIST= <TTTTTTTTTTTTTTT>
##$WBST= 1024
##$WBSW= 4
##$XGAIN= (0..3)
0 0 0 0 
##$XL= 0
##$YL= 0
##$YMAX_a= 161584
##$YMIN_a= -197283
##$ZGOPTNS= <>
##$ZL1= 120
##$ZL2= 120
##$ZL3= 120
##$ZL4= 120
##$ABSF1= 10
##$ABSF2= 0
##$ABSG= 5
##$ABSL= 3
##$ALPHA= 0
##$AQORDER= 0
##$ASSFAC= 0
##$ASSFACI= 0
##$ASSFACX= 0
##$ASSWID= 0
##$AUNMP= <proc_1d>
##$AZFE= 0.1
##$AZFW= 0.1
##$BCFW= 1
##$BC_mod= 2
##$BYTORDP= 1
##$COROFFS= 0
##$CY= 11.3945322036743
##$DATMOD= 1
##$DC= 2
##$DFILT= <>
##$DTYPP= 0
##$F1P= 2.36226072786647
##$F2P= -0.459571619588291
##$FCOR= 0.5
##$FTSIZE= 0
##$FT_mod= 4
##$GAMMA= 1
##$GB= 0.15
##$INTBC= 1
##$INTSCL= 1
##$ISEN= 128
##$LB= 0.24
##$LEV0= 0
##$LPBIN= 0
##$MAXI= 10000
##$MC2= 0
##$MEAN= 0
##$ME_mod= 0
##$MI= 1.114404
##$NCOEF= 0
##$NC_proc= 0
##$NLEV= 6
##$NOISF1= 3.799351
##$NOISF2= 2.8
##$NSP= 1
##$NTH_PI= 0
##$NZP= 0
##$OFFSET= 15.70392
##$PC= 1
##$PHC0= -15155.43
##$PHC1= 10.00082
##$PH_mod= 1
##$PKNL= yes
##$PPARMOD= 0
##$PSCAL= 0
##$PSIGN= 0
##$REVERSE= no
##$SF= 200.130013532006
##$SI= 16384
##$SIGF1= 3
##$SIGF2= 2
##$SINO= 400
##$SIOLD= 16384
##$SREGLST= <1H.CDCl3>
##$SSB= 0
##$STSI= 0
##$STSR= 0
##$SW_p= 3612.71676300578
##$SYMM= 0
##$S_DEV= 0
##$TDeff= 0
##$TDoff= 0
##$TI= <>
##$TILT= no
##$TM1= 0
##$TM2= 0
##$TOPLEV= 0
##$USERP1= <user>
##$USERP2= <user>
##$USERP3= <user>
##$USERP4= <user>
##$USERP5= <user>
##$WDW= 1
##$XDIM= 8192
##$YMAX_p= 0
##$YMIN_p= 0
$$ End of Bruker specific parameters
$$ ---------------------------------
##NTUPLES= NMR FID
##VAR_NAME=  TIME,          FID/REAL,        FID/IMAG
##SYMBOL=    X,             R,               I
##VAR_TYPE=  INDEPENDENT,   DEPENDENT,       DEPENDENT
##VAR_FORM=  AFFN,          ASDF,            ASDF
##VAR_DIM=   8192,          8192,            8192
##UNITS=     SECONDS,       ARBITRARY UNITS, ARBITRARY UNITS
##FACTOR=    0.0002768,     1,               1
##FIRST=     0,             0,               0
##LAST=      2.2672688,     0,               0
##MIN=       0,             -197283,         0
##MAX=       2.2672688,     161584,          0
$$ Real data points
##PAGE= N=1
##DATA TABLE= (X++(R..R)), XYDATA
0@%%%%%%%%%%%%qJ6j6J6j6K4l2L8m6N4o2P2q8J04j20J36j58J82k08K40k72L04
34A60l42L88m36M90n48O12o82P56q40R32j032J140j258J390j532J684j857K047
52A072k256K489k747L039l369L747m186M702n316O061o991Q190r803J2096j5632
67h904K1850l5898J25159l5557k63933J78419J80448j47888j66913J68751J23784
78A39318j58516j20586J68672R6134j58659p9805J64082L8465j56147n731J50839
89G8066l0490j23210N4342R4560q0950o2902R5048M6605j01779l4747R9821K7152
101F1516j02057j6735J09100Q555j20395P63J23592j3478j19514L1680J07991
112G1018m7089r4275N3674P5825n1104n4514M5575L4358m1137j8739M2171R205
$$ y = [0, 0, 0, 0, 0, 0, 0, 0, 0, 0, 0, 0, 0, -8, 8, -8, 8, -8, 16, -16, 22, -24, 30, -32, 40, -48, 56, -64, 72, -86, 96, -112, 128, -144, 160, -182, 206, -230, 260, -288, 324, -358, 398, -442, 490, -542, 598, -660, 730, -802, 882, -975, 1072, -1184, 1305, -1442, 1597, -1772, 1975, -2211, 2491, -2825, 3236, -3755, 4435, -5368, 6728, -8904, 12946, -22952, 102207, 66650, -197283, -18864, 161584, 13696, -153217, 15534, 139318, -19198, -139784, 28888, 125022, -33637, -113442, 50640, 89105, -67042, -72773, 78066, 47576, -75634, -21292, 73268, -7682, -70584, 24464, 71069, -30710, -65457, 34364, 61516, -40541, -57276, 51824, 60379, -60016, -59253, 64339, 50861, -68653, -36973, 71018, 23929, -70346, -16672, 59153, 8049, -46465, -890, 33468, -7669, -26408, 15763, 24968]
124B4968m4395j736M4373r595m3396K7600M2153m5403m0178N8017L3202o5780
136b0170k2880O9079J3711o9740r084O6927P487o0950o641N4839L972n0502Q98
149b3054M7956m966m2705Q163L4724j2567k3054J7357J1733k1331k600K2464o152
162E968k1306J4014K0973k0724k2607K4346K4344k5994k5220K7087K5833k8926
174b212k5504L0719K4224l0639k1617K8534J8349k5057j4194K0513J0743j5900
186b041p558J0656M092n062m34P58l584J838P277m293j0930O795J4489r251j7803
201a5051J1960J9928j3177k1454J3827K1808j3389k0985J2632J9481j0483j8912
213a3815Q190J7266n218j4999L001J2142k285q458J160M786J60j441j542k566
$$ y = [24968, -19427, -21163, 23210, 13615, -29781, -2181, 39972, -5431, -45609, 12408, 45610, -20170, -43050, 26029, 39740, -30000, -39084, 27843, 35330, -25620, -32261, 22578, 26550, -23952, -23054, 24902, 19936, -22769, -14606, 20118, 7551, -15503, 1854, 13587, -7744, -10344, 12120, 5968, -15338, -1324, 19649, -1075, -23682, 664, 25008, -986, -26206, 881, 26714, -2212, -27716, 3003, 27227, -3412, -25029, 3505, 21854, -3203, -17397, 3116, 13859, -2041, -9599, 1057, 5149, 87, -347, 411, -3173, -1335, 5942, 1649, -9281, -2486, 12003, 2752, -15051, -3091, 16837, 3660, -17794, -3967, 17841, 4452, -16533, -3901, 15580, 5097, -13815, -5625, 11641, 6423, -8576, -5575, 6567, 4282, -4176, -3016, 1770, 1930, 489, -1053, -3619]
227c619L234O510m718r695N333J2415n529j3900M668J5465l390j6463J719J7151
241I181j64j7220q21J6449J217j4973k245J3496K787j0936l725Q002M869n277
255F40n225K373N443L46n294k503M413M849l327p200J812R421p39j0638k59J1291
271E403J446j1783k962J2251L667j1518m554J0057N471q490o335O800O948n281
285A120o408L287N848o20n599j277N062K716l687m633K465O107j548p032M16P554
301C771P10p362k577P702L797p594m855O919N753n995n989M740O235l428o478
316d651K127O300q02n653r58N471J809m330k724L012L987j975m547O04N080N93
332C343n234k031N121L277n112l905M393M839l676n347K706N819j651o152J006
$$ y = [-3619, -385, 6125, 1407, -8288, -2955, 9460, 3931, -9969, -5301, 10164, 6774, -9689, -7970, 9181, 9017, -8203, -9024, 7425, 8642, -6331, -8576, 4920, 7707, -3229, -6954, 1048, 5917, 640, -4585, -2212, 3231, 3577, -1717, -4220, 193, 5042, 1715, -5485, -3673, 5748, 5009, -5629, -5888, 5403, 6849, -4934, -7896, 4355, 8022, -3496, -8050, 2007, 7478, -1012, -7347, -547, 6401, 1120, -5288, -2001, 3847, 3227, -2372, -3649, 1413, 4129, 442, -4191, -1726, 4381, 2833, -4199, -3783, 3771, 4481, -2881, -5458, 2244, 6041, -1553, -6408, 511, 6264, 269, -5720, -980, 5255, 1827, -4651, -2524, 3776, 2974, -2679, -3637, 1834, 3643, -687, -3411, -399, 3588, 1613, -2934, -2330, 2750, 3343, -1891, -3922, 1199, 4476, -636, -4541, -148, 4691, 1015, -4332, -1626, 4193, 2542, -3610, -2604]
347b604N766K24n549r84M761J629l847k589L072K736j602l650P83L862K63l868
363a597j224M085J999l702l039K876L749j882m428J251M838o63m923n6N109M50
379B843m280j628L960K249l089k687J882L695j702l803O63M335l03l958o77L481
395I81J500k887k230K172L459k106l798J379M049p49l772J01L483N84l001j313
411b148K466K397k482l159J838L604j307l358L11L421j6k829n53K674J466k133
427A92l087K210L561k055l369J913K741p73l052j77L183J569l267k581K547L172
443B727j956l380K072L168j896k782O90L119L55l111j316K882J823k566k327K879
459C81K385k885k084J374K411m32j879r81K036J439k337j489K717J840k642j971
$$ y = [-2604, 3162, 3386, -2163, -3147, 1614, 3243, -604, -3193, -121, 2615, 1013, -2637, -1854, 2008, 2271, -1597, -2821, 1264, 3263, -439, -3478, -602, 3147, 1265, -3163, -1912, 2926, 2263, -2660, -2716, 2393, 2843, -1437, -3065, 895, 3144, 55, -2632, -750, 2945, 1243, -2560, -1897, 2438, 2135, -1823, -2500, 981, 2481, -406, -2636, -464, 2995, 889, -2909, -1530, 2519, 1770, -2002, -1901, 1582, 2166, -835, -2148, 318, 2715, 233, -2926, -1088, 2516, 1209, -2149, -1838, 1583, 1567, -1262, -1815, 859, 2325, 192, -2895, -685, 2876, 821, -2548, -635, 2106, 1333, -1719, -1896, 1287, 2856, -411, -2992, -445, 2727, 771, -2609, -537, 2631, 735, -2047, -1357, 1762, 2117, -994, -2310, 572, 2395, -171, -2498, 381, 2766, -119, -2203, -829, 1582, 1150, -729, -1710, 326, 1765, -572, -2061, 656, 2496, -146, -2117]
475b117J549K190m24k123n22J970J196k701j124L273J057k882j230K012J208r65
491C67j002j38J369N90k272r30L557Q41l327j292J968J298p33n76m44J392J41
508H09k662M90L462l16k950n16K255J46o51Jm37J188J45k515j04L490N8l214L41
527i80J358o08k70O24kO38J8k451L76L029m03k655N99J705q08o18L86J9R16L87
547A260k307j77K355l07j977J586M93j457l77R01O4R51J21k438l40K780L01k249
565h17K75J026q69J99J76j31P59M76j859j7J903p63j289J142R86j539n77N16M89
584H6P97J12k187k33K125R9j122N61L4q14k1N47K86P62m79j806M74J748o83r60
604f74P24P96o22p75j50O67P93j56q34n8M57m53L0P49K50o00p08o6P23N46k42
$$ y = [-2117, -568, 1622, 1198, -925, -1447, 523, 1719, -982, -2106, 1167, 2224, -658, -1888, 124, 1332, 367, -635, -773, 596, 1186, -1086, -2016, 1541, 2382, -945, -2237, -269, 1029, 296, -280, -724, 668, 809, -1853, -1363, 2099, 1783, -1167, -1683, 572, 718, 67, 68, -369, 819, 964, -1551, -1655, 1835, 1893, -1321, -980, 378, -230, -500, 124, 122, 760, 778, -1673, -1297, 1732, 1329, -1326, -727, 978, 170, -448, -62, -43, 873, 1260, -1047, -1224, 1131, 824, -1153, 433, 926, -531, -908, -7, 57, 1008, 1129, -1309, -1649, 1131, 1432, -817, -542, 484, -385, -186, -10, -141, 618, 1094, -765, -782, 1121, 358, -931, 211, 1197, -342, -919, -403, 86, 883, 995, -1192, -1425, 700, 799, -323, 238, 272, -542, -563, -16, 270, 1032, 553, -1253, -779, 969, 286, -674, 50, 846, 224, -551, -701, -34, 759, 603, -231, -289, 168, -285, -255, 494, 744, 144, -564, -630, 93, 639, 397]
625C97j051P18N27o81k70J75R03l58o62n60P57N05k41n22O77j62o61Q9N02L95
645D77l8j092j47J121K49n01n07O03Q0o58L76J44J64m6p86M6O68J5l00p3O88k57
667B26p12J18K18P10m93j18J3n7L03J24m61J4K61q7k32o5O94l76n16M35%K15l66
690a52K20J7K23j37p12K84N29q3k07j20o1N6L15p0j50M89l76m36K70M51j61k97
712a08J24j76P2K60j64l66Q58q3j051J34O28k69k4J87q5J87K28n45j47P56J4o45
734b15K8K37K11l28k46J94J32M02n04l14Q89l73m98J48M09%m98K26r9M63j24k12
756g2O1K02K19p88j05P18M8k40j12K56M8k47l22K2O82o8n82L39K48l22j69J85
778Am0M42j02n09J30M47j68m56K52O0o5j64J0J19L48k86k10l6O26l09m54M70j18
$$ y = [397, -654, 64, 591, -90, -360, -185, 718, 360, -302, -862, -105, 400, 159, -363, 314, 152, -509, -420, 82, 477, 439, -653, -800, 321, 570, 69, -438, 165, 245, -413, -37, 107, 271, 225, -561, -515, 153, 168, -132, -205, 483, 226, -486, -368, -150, 560, 67, -51, -38, -95, 208, 332, -129, -115, 146, 59, -173, -238, 456, 80, -436, -1, -1, 214, -152, 68, 85, 308, 171, -541, -257, 272, 189, -18, -138, -199, -143, 172, 102, -48, 441, 65, -371, -101, 350, 189, -108, 16, -160, -88, 172, 8, -358, 500, 417, -634, -500, 128, -141, -165, 22, -63, 124, 352, -193, -340, 416, 430, -215, -187, 50, 261, -67, -313, -119, 13, 415, -89, -403, 486, 113, -385, -237, 172, 172, -326, -100, -199, 264, 140, -72, -11, 191, 410, -378, -483, 235, 283, 43, -69, 187, 235, -12, -334, -312, 370, 302, -280, 59, 307, -15, -184, 1, -39, 403, 301, -208, -78, 369, 201, -255, -3, 57, -8, -172, -162, -43, 305, 19, -191, -227, 399, 90, -364, 106, -12]
801a2k4k0j36J94R5j51j29m7N12j40l32L46J51k7k07k30K26j00K23k55K61j80
823A8L36m46J71R6j69Q1k47K66j0j3m15K46M2K5k15P8K76r5J11l53%K28M20m65
847c4j24K54j82M1q6J98J1j77r4J88K73j01k70Q0R9J6l22J87J01N7j28k66J56
870a23J59N0j85j6L99j35m39J77J61M5p0m20M81J12j32k30K51N4l6l22R5K46J08
893B30j93l69L39K06q1m98N52K78l43j87j82L53K03m84n8J15K28q0k96K88L31
914C52j24m76K27P9P4j09j83Q4K42j91m18L88K50K39m05l53J19M39k52j9J45K90
936C98n01j77J86L18k69j58J99J40N9k70k8Q5q5pn4K13J91j02j29j47L21j81m
959bk96M97n5m66K05J40M15l06j29k67L10N0j22j06O9J92L0j96l07O44j40l26
$$ y = [-12, -36, -56, -192, 2, 97, -54, -183, -230, 282, 142, -190, 156, 307, 280, 73, -157, 69, -31, 192, -63, 198, 18, 354, -92, 79, 175, 6, 87, -160, 106, 96, 83, -332, -86, -44, -19, -234, -156, 120, 25, 136, -217, -217, 11, 431, -34, -158, 96, -86, -45, -131, 67, 78, -99, -193, -5, 268, 167, -103, -23, 76, 92, -230, -43, 58, 115, -13, -279, -123, 36, 86, -99, -115, 284, 149, -290, -113, 48, 93, 23, -397, 84, 196, 64, -166, 85, 139, 103, -219, -124, 122, 230, 37, -332, 7, 213, 132, -366, 186, 464, 121, -66, -248, 105, 308, -176, -234, -119, 109, 29, -267, 21, 352, 228, -248, -21, 58, 132, 23, -160, -76, 166, -25, -443, -55, 195, 434, 29, -324, -205, 234, -18, -37, 108, 398, -103, -280, -94, 224, -45, -203, -4, 136, 195, -75, -103, -18, -103, -110, -164, 49, 240, 138, 9, -138, 183, 2, -2, -298, 199, 144, -322, -117, 23, 438, 132, 3, -264, 46, 96, -26, -132, -63, 129, 159, -37, -344, 300, 160, -166]
981a66o7N73n9m70r9N27l9j90k45q7M42O4m02O8L17j02j10m6J26K35k24m05M11
1004E2J74n5l42K22q9Q2m8l71N43L69m78l89LP19k82m61L48l1o6K0l3K46J66j24
1028A75n94L28O57m38n34N27J38l30P3j57L01K73n68k91M84L00n41kL21J50m98
1049b26J51j3R9M11l22m41L43L54o53J07O15k18m79J45J86j04O40o77o7N24L6
1070D11r59K84Q56L4o86o4j06L14J93kn67N11j55n44M62N14m76k14L97l01K41
1091A43L52m30m55N75k08l10J79O42k55q6j03j90P5L78q8m46L98l09j19L85K50
1112C78j88l39J99k22K58L5m28rN88l9n97J94J45k6K05k5k30j85L98l13J00M01
1134C00p5n57L21Q6k81M30n85O7K1O17n95K37k1j14M4rK66N7J23l49j76J70j6
$$ y = [-166, -233, 340, 281, -189, -288, 239, 200, 10, -235, -322, 120, 184, -218, -150, 167, 65, -45, -91, 35, 270, 46, -359, 52, 226, 171, -171, 51, -38, 44, -4, -375, 168, 537, 59, -330, -327, 392, 110, -351, -3, -34, -100, -80, -113, 133, 299, 175, -419, -91, 566, 128, -406, 121, 259, -71, 2, -155, 146, 419, -149, -440, 44, 344, -197, -199, 122, 272, -226, -75, -88, 11, 422, 100, -341, 2, 356, -297, -190, 425, 207, -272, -127, 59, -45, 595, -82, -149, 375, 411, -548, -264, 592, 626, -60, -124, -230, 84, 277, 275, -292, 219, 64, -480, -18, 496, 20, -194, 203, -98, 143, 495, 65, -390, 185, -23, -333, -154, 488, 233, 147, 44, -146, -71, 307, 219, -227, 171, -138, -257, 128, 378, 190, -149, 50, -172, 86, 121, -307, -316, 272, 233, -364, -170, -25, -51, 154, 129, -101, -286, 112, -201, -101, 300, 225, -332, -11, 75, -206, 224, -361, -294, -273, 344, -251, -14, -35, -149, -105, -114, 152, 209, 332, -17, -193, -23, -39]
1157c9j68K02J58J10n47L2K97L9O8j01rk44J55k9K20R7l04j62K14J62J27p2m71
1180b65J07J41K51l42r7K71Jl31R0L20J91j59m89J48J9K54k36Q5N6K47l03J1j1
1203d1m4j31K45O8j49R9Lo2J02P0j44L6K5j19o7P0l2K08m0k02n5L52kl16j3K43
1229A04Jk30J62j46K4M27j79m85J65L58k03J02m8r9J2j94L00k40N9r2N6R9J18
1252G1j24J6Q1RK4R9l55K18J48k57k57L48L69j88k90K41o2K8l19M1K79j50j62
1275a92j03K11pQK62l61K16o6j7k34L25N1k16J17J66l72J57k5Q7J82n9j66j24
1298a60L62j34l58L33K47k37k44J2L35j68Q6l66J16L43K6l29J35N8K28m07k96
1319d18L57L43r0j77j04K87j93j10K0K22Ol54J22J17k40M43r4k82N7M39k91j62
$$ y = [-39, -207, -5, 153, 263, -284, -252, 45, 84, 152, 51, 42, -202, -47, -76, 144, 241, -63, -225, -11, 151, 278, 206, -265, -158, -17, 234, -108, -205, 66, 67, -264, -174, 146, 337, 178, -311, -163, -144, 110, -126, -41, 15, 262, -41, -30, -41, -85, -216, 29, 97, -52, 47, 50, -12, 90, 160, 16, 52, 77, -42, -109, -39, -71, 137, 97, -105, -160, 192, 190, -126, -139, 104, 105, -125, 37, -109, -85, 342, 163, -322, -157, 201, -2, 100, 52, -47, -35, -229, 71, -169, -110, -202, -146, -47, 71, -53, -37, 44, 53, 77, 176, -179, 39, 187, -70, -327, 21, 390, 202, -88, 153, 91, 119, -200, -159, 120, -30, -192, -295, -84, -91, -83, 179, -182, 34, -32, -49, -283, 42, 93, -123, -6, 160, -212, -55, -80, 7, 189, 130, -36, -160, 202, 68, -290, 43, 290, 53, -191, -179, 156, -12, 74, -292, -176, 167, 193, -136, -1, 57, 285, -122, -418, -61, 282, 192, 15, -89, 198, 5, -105, -85, 137, 143, -211, -89, 28, -212, 231, 137, -145, -88, 351, 60, -102]
1341a02K11l4k92k4L85k63j26J14j40K88K2n0o4K40j19q8P6k03L40k84K6K00r7
1364A6k04J30N1Q6Q8j57k42M91l38K98l6k83N22m58J2j12J82J89k18ro1j6k8l1
1388a28m0%L33l49K24j81K14J9n9j84P1K61j47j00l2J82j01N6m9J32o3j67J71
1411F3Rl8k60J42J53O6j59j3J37M6k29l7R9K63p1q9JlJ15j59P8J26n8l95K08K30
1437B25q8j87j48J58J12l6j10r1J49R0l0k47K51K6j36o4K36L10k95k83J0J3N60
1460D25m44M5J01J6l29J36o2K24k06j5K78r1K8j78J17j05O1p8J7j10K96K48n85
1483b11L15n7k60m0K79J91m93L49j84R7Q9J90m26NL67m79L3J76K51l99J63k45
1505b89J31J62K99m08r6P9J65n40N59o1j02N3j49k2M29J45l94m25O97J4k54n3
$$ y = [-102, 109, 75, -217, -241, 144, -119, -245, -131, -271, 17, 39, -11, -75, 165, 46, -42, 34, -169, 171, -113, -87, 113, 16, -188, -58, -7, 79, 167, 10, -232, 259, -79, 219, 183, -100, 422, -36, -24, -136, 46, 235, 17, 8, -53, -69, -97, -128, -168, -168, 165, -184, 40, -141, 73, 92, 33, -151, -80, 181, 34, -66, -98, 84, -17, 39, -10, 122, 59, -108, 63, 72, 34, -226, -84, 69, 135, -24, -37, 100, 146, -83, -120, -21, 242, 171, 82, 83, 80, 195, 36, 114, 240, 182, -213, -5, 225, 137, -50, -198, -40, 72, 36, -74, -165, -16, 74, 44, -203, 48, 74, -62, -126, 110, 420, 125, -158, -148, -135, 425, -19, 26, 127, 143, -186, -50, -112, 112, -94, -109, 169, 78, 106, -72, 45, -60, 1, -77, -60, -170, 126, 374, -211, 104, 47, -213, -253, 26, 217, -276, 73, -111, -14, 75, 265, -161, -156, 211, -268, -235, -59, 192, -207, -44, -289, -158, 4, 303, -105, -201, -122, 43, -497, 62, 1, -101, -48, -197, -219, 210, 355, -39, -464, 233, 247, -7, -60]
1527f0L03k55J54r7k88N26l7l39J17K95j45k72J84J84m08J71K4k44M72j52j19
1548A4p3L95k46l95N84K0l33N1L6j55K65J3l92J16N80m45k24k4M7K80k7q7r5K95
1572B00j25m92L52K09m19n3L73J7j6Jj00j32M97m79k64M89L1k31j22K68p8K36
1594A62J8J7k28L3j98J47J31K71n03k28K65J95M4k8k38K14L22n42k49L56J76l41
1616b04q3J86j30J69N7M3K47k66O8O7m2O8N2l47J96j01j88J65QR4J38j18k30L91
1640B40j62m08M79Q1k44p5K50N5k66j90j48M00L6k35J92o2J64j48l7M7K10l35
1662a56K31j49J19L0q0p1l3K70q7o2k17L14j20j71jJ39J81q4j8m4J6m3p0k3K11
1687H2L9m57J60M9L80k36j05K19o0jj75K70M6j61j74J20K7j41r7L51k07L69j29
$$ y = [-60, 243, -12, 142, 45, -243, 283, 246, -93, 24, 319, 174, -98, 86, 270, -138, 33, 57, -187, 285, 133, 14, -59, 336, 90, -305, 279, 299, -34, 17, 53, -102, 163, 176, -216, -100, 480, 35, -189, -213, -166, 114, 87, 0, -95, 200, 75, -417, -65, 144, -275, -328, 45, 62, 46, 47, -53, -185, 312, -167, -431, 58, 89, -142, -264, 4, -74, 162, 180, 197, -31, 2, -196, -49, 82, 353, -150, -378, -113, 82, 126, 98, -140, 74, 396, -146, -395, -39, 137, -204, -287, -101, -231, -62, -5, 38, 285, 19, 87, 154, 112, 180, 232, -115, 81, -20, -208, -43, -35, 59, 197, 79, -151, 240, 78, -330, 149, 230, -14, -89, 161, 216, -50, -240, -388, 12, 48, -187, 5, -57, 107, -41, -78, -31, 179, -156, 75, -74, 45, 75, -5, -76, -109, 161, 74, 12, -205, 109, -11, -182, -183, -44, 137, 53, 35, -9, 7, -36, -106, -129, 82, 121, -336, -176, -127, 253, 17, -88, 131, 71, 70, -105, 165, 211, 50, -124, -4, 23, -118, -215, 136, -71, 298, 169]
1710A69l60J89k7K67k09N0r6J74j94Q4J60J4j58p3r0M90m11l51M25NJ51j10k5
1733G4j96Q2K68j96j93K03r5j01L36n8k40n2J56J4O0j08j39M65j02m14J10M97
1755C71k86l21L29Q3j41lM8r9LN3k16m2M19j22k11Q0P5K10j88l84L47J65q6n61
1779d77M37L28j16m25j4M91j98J57m70J48L02j16j12j12L05j13l46Q3J42M29n29
1800b06K41j85K80j46r2N6L35j30m52K67K27r0k06pK38J43j25l06J26J73n3q5
1822Cj35K84m6j45j76K73J05j48l79N94K4l91j32N7L09O3n44J99M54J28m55j06
1844a64K06L7k26q8J63J00m4l01J52R0J92j94j60K67K50m39M0M42Ql64q3Q9L66
1867C39k52l94J54N16n3n10q3M81j85l11J33j01L17p1j50k62O44j42l33m7L93
$$ y = [169, -191, -2, -29, 238, 29, 79, -17, 157, -37, 47, 207, 221, 63, -10, -100, 390, -21, -372, 53, 58, 209, 99, 74, -122, -40, 228, 32, -161, 42, -53, -154, 182, 124, -116, -168, -12, 2, 62, -46, -185, 280, 178, -236, -126, 371, 85, -236, 93, 176, 35, 32, 80, -19, -16, 37, -179, -221, 198, 76, -135, -55, 20, 230, 42, -342, 5, 170, 84, -477, -40, 288, 172, -253, -267, 224, 26, 183, -287, -139, 163, 47, -65, -177, 128, 15, -331, -248, -106, 323, -206, 35, -150, 130, -16, -108, -52, 283, 153, -299, -32, 195, 105, -101, -108, 130, 273, 148, -158, -32, 141, 88, 3, -132, 152, 106, -39, -215, 58, 163, 15, -364, 230, 254, -137, -269, -212, 97, 160, -384, -185, 269, 397, -58, -164, 42, 79, -147, -235, -72, 28, -16, -317, -165, -75, 117, -77, -237, 30, 280, -159, -119, 323, 331, -33, -116, -27, 339, 87, -307, -153, 363, 310, -200, -283, 198, 13, -298, -165, -266, 51, -20, -170, -432, 212, 70, -263, -310, 83]
1888H3J97o07J4L43L27l79k88J95L92k22j34j96L65K06p18M4N63K22n90k30L68
1909d5K63j09k06K0m8L50l32j18M06Q0l77m23M79Q2n4j35k4N29M0l60k09j1L52
1932A50l17k20M22J34k35k01M65l1J17l40k45L92O2j45k34K04J66l88N7n1L57
1953A19j63k20O8N68j0m95m04P69J72l71j41R6L81k80k07O7O3P6m49J21M28K21
1975D09o04k55N20J34j90k38J72K65l18N0n8J05J62j95k11M72M3m85O8J99L57
1996D02l68j67k70O22j22k3m0L26j48m04j72N27j08j09k70J49L80k71j38o4L89
2017A21p4l28k1L77K24l91j44J32K21K26l75j5K02j21k00P8M44o8m24j27R2Q5
2039h6J16n11L88K30N4l50k9M09j28m9j87M0J92r6k51K00L64J9o45J68L67q6l01
$$ y = [83, 280, -327, -313, 30, 357, -22, -310, -115, 277, 55, -79, -275, 90, 296, -422, -378, 185, 407, -183, -413, -45, 218, 109, -97, -77, -125, 225, -107, -225, 181, 261, -116, -539, -60, 22, -32, -167, -191, 338, 378, 18, -191, -202, 150, -167, -387, 35, 169, -66, -267, 198, 167, 284, -56, -301, 91, 153, 8, -226, -22, 144, -244, -187, -238, 119, -44, -264, -196, 372, 362, -133, -537, 232, 404, 33, -108, -12, 369, 89, -118, -51, 12, 88, -361, -240, 188, 409, -195, -450, 70, 204, 14, -224, -52, 213, -105, -55, -113, -8, 154, -41, -252, 220, 263, -222, -154, 45, 402, 34, -133, -403, 219, 97, 74, 34, 360, 212, -192, -364, 163, 55, -54, -324, -175, 205, -66, -204, -268, 121, 47, -281, -302, 75, 299, -92, -236, -104, 117, 343, -32, -47, 155, 34, -166, -88, 356, 288, -136, -263, -171, -86, 30, -481, -93, 137, 191, -159, -188, 221, 93, 44, -143, -103, 89, -7, -258, -58, 306, 325, -320, -152, 215, 129, -172]
2062a72Q9j06J39J18q1J33K73k38j66J23q5Q6k02j21N31p3l87L4J38M01k52j51
2084C1J35L2j49j66l2N08l3m66K72j26J57o2m92M53Q8q6l89M8M92j46r1j42K19
2107E5K01q3k97J77J87j16m33L40M2j32K8l57J16M64Rn23K33j87L92m64J64M42
2129B58k52j81M1J18J90j93N4j16O4m6m7J42J00jk68J10M3R3j87N6j61K50k32
2152a65J94j05J69m1l61M32k5r8J8K22J2l39J6k11K69K35l46l6K09r5R2N1k36
2175a39N50j13m34J23J49p0k70L79j67q0m8M7j59L53j02j14K38kj5k75P9P4l6
2198c2k75K32J4k7L41n18J07K88P8k46q8K04LR1k3q1j85J56k71K85N6j37l27L91
2222C6O6q0k20J24J02j31N2O4RJ53j99J15j39J32j89J3M5R6rK6j72j9L89l39j25
$$ y = [-172, -83, -189, -50, 68, -13, 120, 393, 155, -11, 112, 27, 113, -89, -210, 321, 248, -139, -105, 33, 434, 182, 31, 166, 198, 49, -117, -149, 359, 326, -140, 132, 6, 163, 101, -391, 62, 150, 64, -325, -277, 215, 69, -22, -164, 55, 256, 173, -124, 53, 240, 124, -309, 31, 73, -59, -31, -388, -272, 192, 201, -322, -89, -276, 116, -348, -184, 258, 6, -175, -134, -16, 174, -19, 35, -81, -17, -63, -110, 32, 132, 131, -137, -27, 16, 109, -78, -22, -183, 67, -165, 29, -76, 93, 52, -309, 123, 98, 0, 18, 240, 252, -87, -71, -282, -13, 222, -124, -160, 49, -46, 46, 97, -139, 411, 298, -136, -13, 136, 66, -204, 175, 8, -72, -120, -73, -232, 121, 19, -95, 143, 141, 126, -149, -70, 4, -32, -307, -75, -61, -88, 253, -265, -158, 130, 208, -38, -126, 78, 81, 172, 149, 68, -117, 39, -232, 53, 109, -28, -355, 36, 102, 22, -198, -74, 28, -103, -51, 13, 22, 175, -24, 91, -48, 84, -105, -92, -47, 49, 40, 66, -106, -125, 264, -75, -200]
2247b00J85J27o2L1k22K45k7l9J93l47L55k53l1l9M3j13K49n3n9Mj32RJ72k6r6
2272h6K81k61L59l32R5j79P0K76k90J70j92J83k05k11J54L63k64K61R9k35m3o4
2294e1k33L91m3K7l33K12M5J48l51J38L09j1m02J81J12j82J26j74mK11J17n17
2316b84J11K72O3n5k82J36J78l35L0L61o1m09J20L27l51L22Pk52P6J2l69K48K70
2339A35J3L6j35O2J22j63Q4j96J88j03j97K05O5k59J61PO7p8Q8K0k5j03Q3k07
2363a30J99Rj7l5l60L37M6j9k43R5j49P6L86k82Q1J1r2K09J79j81j12pN1k0j47
2388a15J37J66o0k11j37L98k68jO9M1J32n22M71j73L21k23J69K5j76K59n51J21
2410a28O3J32K9j72J42J05j35lj59L38j09j74K49j53m0j5J12k10l1L07k36J34
$$ y = [-200, -15, 112, 50, 81, -141, 104, 77, 38, 231, -116, 239, -14, -45, -84, -41, -154, 95, 42, -17, -13, -145, -136, 36, 10, -86, 195, -66, 293, -39, 56, -123, -53, 223, -67, 103, -89, 94, -111, -322, -168, 195, -69, 192, 291, 56, 13, -51, -284, 107, 64, 91, -242, -30, 15, 163, -188, -50, 259, 248, -154, 27, 139, -43, 83, -91, -95, 116, 233, -284, -173, 99, 162, 107, -175, -39, 139, -196, -166, 195, 134, -275, -155, 172, -179, 143, 150, -102, -26, -14, -383, -135, 135, 148, 184, 49, 111, 233, 70, 154, -42, 146, 43, -154, 51, 116, -143, 18, 25, 92, 14, 102, 122, 97, -6, 77, -130, 69, 78, 61, 26, -334, 3, 49, 30, -213, -118, -267, -191, 195, -87, -6, 5, -87, 122, 301, 120, 8, 1, 52, 32, -115, 22, 188, 128, -83, -220, 178, -90, -91, -22, 19, 151, -371, 100, -73, 248, 25, 194, 219, 43, 302, -249, -128, -65, 67, 96, -76, 66, 171, 36, 33, -126, 212, 103, -71, 178, 25, -15, -30, 82, -128, -159, 148, -88, 46]
2432D6j27R6J2J16j84N5P6o3J74k45L3kp7J66J0p9q0J67k37M71l51k98K49p2L04
2457A60k51K46p0KN3k00L8r5J57J62m79K98p5m8J89jO9k15R2J79j38l56L47J66
2481B30k95K14j02m2j72K70k80K00K05k10j87N5Q0j1P0kK48k97j82K38Qj10k31
2504c03L31%J8O5N5MK89k50j52O2J22k08J2m3J35j31j08O2k3p3R5J04j22K39j46
2529C4N4q8nJ43K05l67J12j71R5j3p5l5N7J22j5n8K76m62K39k34j36K41J68k09
2553a22J82J31j80j20m3N56m34K07l24N7J51o7R6O1k02q6J11J08l7j4l3O1r2K47
2577B14j38k21J93J57j60j65K3J82m8J4M3J51k38J03K3j00J11j20m1O2r8j49K22
2600B0m8j05J24P8k46K65k99L60J19j47k70J26k41M81k89J17j11j57K37P7k05
$$ y = [46, -81, 15, 27, 143, -41, 14, 90, 27, 201, -44, -11, -13, -90, 76, 86, 7, -73, 94, -143, 328, -23, -321, -72, -144, 160, -91, 155, 85, 87, 140, -60, -22, -117, 40, 202, -277, 21, -54, -102, 87, 86, 155, -60, 32, 211, 73, -283, 64, 230, -65, 149, 47, 5, -167, 103, -177, 23, 228, 18, -169, -114, -34, -45, 25, 23, 271, -26, -208, 30, 38, -72, -303, 28, 28, 46, 111, 166, 170, 459, 209, 57, 119, 241, 33, 45, 2, 137, 6, -102, -40, -63, -136, -41, 63, -59, 180, 34, 88, 0, -5, 138, 343, -24, 88, -83, 12, -1, -76, -111, -54, 68, 53, -5, 271, -191, 48, -186, -322, -81, 87, -122, 60, 191, 11, -109, -152, 404, -30, 177, -147, -90, 61, -6, 90, 151, -51, -137, -26, 82, 45, 31, -2, 59, -33, 214, 76, -145, 48, 205, 45, -120, -97, 85, 37, 51, 94, 245, 7, 110, 133, 33, 144, 24, -17, 45, -53, -202, 20, -28, -133, -9, 69, -177, 88, -211, 149, 268, 121, -149, -23, -264, 217, -72, 45, -66, -223, 14, 91, -114]
2621a14j17L77j42J4K9k47N0K89j19QNL8l79O1N20n4l19j2j14O9J75L1j18j24
2645a93J37o8J59j41K68L1l67K25j80J3K70j17Q6j87R6J49l6J12k87j1k6M3M5
2668B1j17K13J8k4j38J13Q9j10j31R1J79k54M0k75L38l2J86r9J27l78N6K01o9
2691D5j62J28j47l3K64Q7j48j63J60n7J25mj23K7R5j51j79k8N05M1k33j92K09
2714F6k60L62k56K50l9k46P9Q4j36J7J09J94l57O1K90q3j22R8r1o7Jj9M0L20k54
2739D1Q0m6M8k57J76l7J50k88J06J32k77J10Q0J86k0J00m46J32M5j56K5J50n1
2762a7K25j01o5J62r3j9k67K44K5q1m1n7J53l5j4N8j24J2J49j93J99o4KM4k4n6
2788B2J4K12j72N8K6k92j10L75l19O04k24J7j45KJ64o1j98K3m2J69j88Q5M5k5
$$ y = [-114, -231, 146, 4, 18, 47, -200, -150, 139, 20, 28, 33, 71, -308, -247, 273, 219, -100, -112, -226, -157, 18, 49, -69, -193, -56, -124, 35, -106, 162, 193, -174, 51, -129, -116, 154, 37, 123, -64, 32, 181, 145, 257, -30, -41, -67, -24, 21, -96, 117, 135, 111, -27, 86, 175, 65, -66, 25, 204, -50, -10, -285, 53, 21, 207, 108, 235, -143, -87, 114, 45, -117, 11, -136, -169, 95, 182, 34, -129, 31, -26, 99, 95, -28, -1, 94, -57, -236, -264, 241, 282, 49, -143, 66, -194, 168, -88, 162, 123, -123, -44, 40, -96, -79, 30, 224, -133, -72, 218, 135, 13, 111, 20, -47, -46, -65, -25, 295, 41, 121, 75, 123, -134, 42, 5, 155, -133, -27, 105, -172, -62, 18, 204, 184, 284, -162, -30, 15, -141, -116, 34, -17, 208, 107, 42, 204, 111, 92, -175, 69, 94, 13, -28, -85, 68, 33, 19, 77, -47, -35, 114, -79, 120, 56, 58, 102, 78, 22, 36, 248, 76, 134, 160, -132, -242, 133, -186, 418, 194, 211, 66, 68, 232, 171, -27, -4, -46, 123, -65, 20, 65, 40]
2812D0j01J87J89l19J6o7r0P2n7R1k2l6K75l10L01j24J3J48j89M7o4L6q5R5j78
2837a32J72j28M0K3J68l99L90J22k70j38jJ27O0k2M8J02p4J2k24L18k03J55j00
2860D6m8Q7j75R4p3P2r8L38l96m2M59r0j74k26L71j06K5jKK03l06p3J33j02R1
2885A1O2q9j4j02K54l1j71q1J56o2K46ml19J63n3J11j00n8R8Q9m4J2j43NN9J79
2911A74k61J71l9J64l40K86k35j8R5q0k2J55k00q4N56j45k10K7j32K17J93k14
2933E8J11k52ojJ04Q9l8N6j6p7J57M1j24p0oL8J47k82k5J15j88j19M53mJ18k51
2959B8l81M93%k18j45J31K05N4l01J77n2J61J1r3j7n5o7Q2J3J03j14P4k45K0J78
2984D2P0j00j86J25j13J14m9o3J12J25k32K89j99k3p6K83j84m8K72K7j27j15k1
$$ y = [40, -61, 126, 315, -4, 12, -55, -145, -73, -130, -39, -61, -97, 178, -132, 169, 45, 58, 206, 17, 64, 0, 36, -49, 46, -132, 40, -88, -48, -25, 143, -256, 134, 256, -14, -152, -153, -26, 34, 12, 60, 162, 88, 100, -124, 194, -9, 146, 46, -2, 85, -90, 4, -69, 3, -95, 243, -153, -195, 264, 174, 0, -226, 145, 39, 64, 63, 65, 268, -38, -111, 22, -80, 11, 73, -16, -30, -132, 122, 91, -80, -161, -5, -67, 179, 175, -144, 19, -34, 77, -23, -81, 17, 106, 62, 74, -69, -64, -5, 174, -87, 84, 45, 209, -131, 155, -80, -98, -3, -83, -105, 50, -150, -234, 322, 177, -33, -6, -138, 79, 272, 58, 169, -83, -89, -90, 14, 103, 65, 121, 105, 28, 185, 226, 102, 32, 26, 64, 211, -71, -96, 19, -169, -288, 165, 161, 279, 28, -353, 140, 140, -78, -223, -92, 113, 167, -134, 43, -9, 152, 163, 70, 53, -2, -69, 13, 26, 129, 15, 89, -156, -136, 42, 112, 12, -174, -49, -162, -48, -97, -160, -48, 77, -155, 134, -65, -88, -164, 119, -65, -113, 159, 186, 59, -56, -77]
3007g7N7j05L09k0j71J11r2j2O8J79q0j53jJ12k05J17M5j80n1L57m67K71P9J22
3031B13j17j34O6M0J2k49J81r7K54k24K33J12m49L21P0k69J13k98K96k22j56O14
3053C10m96K16KQ6k90K20j80K95Jj43o8k05K63j62K95q1J05m76K92l8J68j89R7
3076B2L2j70J36j18M5k27K34L40k88J73J04l57M1J31j23J13k7m2J21k51J47l3
3098CRN0j32J96m2j67JO9R0k56K80j19L00m06K30l74K23O7Q9J01j75k80K54j02
3122i1K72j43R1j31j88K86O7L5k25kN1N5J06k76R1K0JK49K83o99ko5J33K52k30
3147f0j32J39J45P2k48j39K10qK79k91Q5NJ87j68P4j25j33J20J73k80j04L42j98
3170e5K75l46J52J05k81K84l0l19L35l48LL88k1j33k0J31J39j64J0j4J7J81l63
$$ y = [-77, -20, -125, 184, 164, -7, 104, 12, 0, 68, 247, 167, 14, 13, 125, -80, 37, 82, -98, -149, 208, -259, 12, 91, 213, 96, -38, 28, 68, 80, -169, 12, -85, 169, -55, 178, 290, -159, 162, 232, -37, 76, -222, 74, -148, -304, 310, -186, 30, 32, 118, -172, 48, -132, 163, 164, 21, -47, -252, 11, -151, 144, 63, 168, -308, -16, -54, 114, -75, 22, 54, -116, 20, -98, -53, -280, -46, 294, 6, 179, 283, -74, -33, 98, -25, 88, 61, 19, 140, -111, 36, 3, 12, 62, -70, 126, 84, -83, -82, -13, 77, -179, 101, -18, 282, -124, 106, -268, -45, 22, 111, 212, 37, -243, 11, -91, 181, 38, 129, -2, -190, 96, 163, 198, -27, -29, 22, 77, 183, -93, -2, 18, 19, 268, 551, -148, -150, -215, -82, 170, -60, -192, -53, 92, 164, -84, -223, -13, -21, 258, -33, 52, 57, 244, 76, 150, 25, -108, 12, 185, -95, -199, 143, -55, 220, -126, 26, 131, -150, 134, 104, -215, 120, -228, -225, 163, 142, 9, -11, 120, 259, 95, 105, 91, 108, 289, -74]
3193g4K4Q9m7j26K9o5J00J87pK0j49jkL02l09p7J17l05K60J8j07K00L0n2j16j27
3219a88J42P8K5k6K2j68N1n6J63m0n6J44j84K11j92k8k9K27k52J60K5P1k72l2
3243b04K00K30k68k8m4J83l2o0L3j3j35J27K44k55P2k13l9K09J63k52J13j68J41
3266Dj59jK17J11m05J99M3l00M81j82m36M59j08J91J1j37P1j77K26j38j0OK02
3289A68r8J77k69J41j52k20L99r3k46J55J25k1l14L10J51k91J99%p5M0J82n08
3311b40L64q9L3N6j71m4R0k17L5LJ27r9K68P9k3l18MJ10N3J26k04M9j40K26k1
3336E7j3L93l17K8k18J18k31J69K44o0j33O1O2l04mK74p6j54K04k17R5n4K7p7
3360a26J21J24Q0l11j1J04m2J23j01L91k48j09J3q6L1L00l59K55m00J55J02J78
$$ y = [-74, -50, 39, -8, -134, -105, -170, -70, 117, 110, 130, -19, -20, -22, 280, -29, -106, 11, -294, -34, -16, -123, 77, 107, 55, -61, -188, -46, 32, 57, 31, 53, -115, -64, -120, 43, 3, -53, 91, -93, 118, -74, -102, -131, 96, -156, 4, 29, 100, -172, -204, -4, 226, -42, -70, -114, 69, 37, -23, 10, -3, -138, -11, 233, -22, 50, -163, -202, 7, 170, -82, 31, -137, 4, -155, -156, 61, 172, -233, -34, 9, -291, 190, 8, -428, 31, -77, 114, 125, -12, 59, -118, 108, -30, -40, -34, 168, 70, 247, -22, 119, -33, -253, 146, 53, -193, -38, 87, 66, -248, 62, 213, -78, 121, 121, 46, 86, 268, -240, 124, 35, 68, 124, -47, -91, -1, -218, -183, -180, -53, -152, 116, 195, 172, -146, -142, -32, 21, 147, -57, -8, -148, 78, 57, 44, 437, 120, 148, -70, 48, -183, -14, 230, 170, 37, 98, 160, -144, -148, 126, 50, -104, 100, -117, -22, -76, -49, -126, -5, 119, 199, -112, -123, -19, -61, 62, -39, 352, 104, -5, 8, -78, -47, 253, -106, 149, -251, -96, 6, 184]
3382A84k09J17k22lJ3J1k5l7L57j7j39M7K00m20K31j69J69j79K50m5k72J77k03
3405a84L0J0K78nk81J05O4Pj50J69j7j4R8j11j00J84j19K54j26J37j85N1k12N6
3429f1ol0j4J75k54J6L3M9l0L6K12Lj84K18q1L8j35R4K28l92K03o3J79k29K5m9
3455a9K7j60K97l68O9L43l40J5N6J2R0q1J36R7P1l32l7J84m9K0J10l64K21m6J37
3480H9o4m9J75j92O3k88J90K15j3j31j44N5J25P8R6k47p9N7Lq7K69j38k5J10j16
3505d8j82K97m06J37J31R8j4M6J44N1n7l65J05K14k03J28N3j59J30Q2j23J47k66
3528f0r2J00J2Q0J11n6j49Q4n5L8j68J82%M0j18J22o8k48P9J83j17J76J2ok83
3553b01K97k09J22m9L14l38Q7m8N8l16J18M07j95rr6k07K50L97n58m5J38J35l1
$$ y = [184, -25, 92, -130, -133, -120, -109, -134, -171, 186, 169, 30, 77, 277, -143, 88, -81, 88, -91, 159, 114, -158, 19, -184, -154, -144, 134, 129, -152, -47, 17, 24, -126, 43, 26, 12, 110, -1, -101, 83, -36, 218, 92, 229, 44, 95, -117, -61, -67, -97, -111, 64, -190, -174, -141, -92, -122, -86, 126, 129, -55, 163, 82, 120, -15, 79, 307, -85, 118, 55, 234, 5, 30, -19, 8, -152, 145, -223, -154, 189, -151, -136, -80, -68, 22, -59, 77, 174, 245, -87, -124, 60, 11, 31, 141, -223, -2, -48, 89, 25, -24, 151, -41, 22, -266, -76, 139, 126, -5, -149, -94, 31, 109, 205, -42, -121, -64, -61, -148, 121, -17, -42, 68, -48, -230, 67, -339, -202, -71, 27, 13, 59, 203, 254, 197, -168, -63, 151, -52, 76, 129, -30, 100, 182, 59, 206, -60, -152, -52, -40, 40, 151, 95, -54, 30, -25, 13, -155, 27, 27, 67, -51, 71, 3, -245, -166, 17, -100, 76, 88, 82, -201, 96, -113, 9, -40, 274, -64, 23, -25, 33, -283, -165, 242, 47, 38, -58, -265, -15, 382, -176, -221, -83, 52, 21]
3576B1j52J37J5k28J43j59N44m32k5K11j57K10k61P3O4n3o7M8o3M3M3r9K38j72
3600g8M4K68l25K67l34J57Q0j50n2J80n4K91l92K18j64Oj05J14p6J3O7p7K42l55
3624b15L35l73K81q1m0J31k2J2m6r3K73kk81J77l43M44j07j46L2J38K53k94J73
3647B06k05K8qJ55j31j22J39l9p1O6K67l78M13l24R9k06j03K63j44N1J82J4p8
3670G4k64j00K93O9j97J85q5l4M24m01Q1P9M2j95q9O3J55k77J85n5j01JJ41J53
3694A47j28j51J6J56mj91J53J41l9j51Q8k22O8J65j78K65j33k06J91R4j39J70
3716A12M1O4j50J96j75j33K38L8k93p4M35k17q3L7k68K01M6Q6o6J00m72M04j06
3739c9J4oQ8kO1L9k33K8N1j10J85Q8l18L25j30j04J53j66N6J56k30K12k3j8j9
$$ y = [21, -131, 6, 21, -207, -64, -223, 321, -111, -136, 75, -82, 128, -133, -60, 4, -49, -116, -68, -131, -88, -45, -144, 94, -78, -34, 234, -91, 176, -158, -1, 79, -71, -123, 57, 3, 294, -98, 120, -44, -38, -143, -29, -105, -92, -25, -102, 140, -215, 120, -253, 28, -53, -93, 38, 16, 28, -18, -111, 162, 160, -121, 56, -287, 157, 50, -96, -64, 74, 327, 33, 206, 1, 29, 21, 176, 45, -77, 62, 23, -48, 18, 285, -93, 320, -4, 95, -111, -214, 49, -95, -44, 138, 152, 74, -190, -290, 3, 72, -125, 60, -25, -59, 365, -36, 45, 124, 166, -29, -118, -55, 100, -177, 8, -47, -148, -147, -6, 147, 19, -132, -116, 40, 36, -155, -2, 139, 100, -51, 37, -185, -117, 48, -130, 135, 2, -204, -13, 81, -58, 112, 153, 217, 67, 263, 88, -45, 193, 231, -62, -136, 299, 82, -1, 36, -232, -31, 15, 101, 35, 135, -337, 67, -39, -25, -31, 57, 55, 116, 155, -78, -50, 1, -109, 76, 164, -154, 171, 41, -63, 90, -76, -20, 136, -94, 118, 95, 77, 58]
3764E8j11J16j6k21P5J21k54o1N33j16p8o1j89J83k92K67K06l40L2K77o5k35K51
3787H0R7K00j64k55K99l73J06J67k99K01j3j02M7J01r9L7R6j34J45L8l14J63J44
3810A68j99o8K06j25J23M0k86L19k65j37kM7Q3R9Q3j73L0J46J23l79L13j72M9
3833B3o7K18m03l2K48k2k6O8q6K09l56K31l2j62O19m54J94j16J2q8P2r6J19K7
3857A00l3k17J41LR0J14r0r3q7L4Q2J27k76l9l1J07J52l3J56l00J77k21O3O7j33
3882a40j3o0J61J97j77k58K08K08R0m05J11J02k36L96j76j89J65J32M5m63K85
3903a7k3Q4m3Q2n5l00J44J99Q4L6j15J18m10K40M0q6K40k14J45j03j08J31r6M07
3927C80k55Q5l04J89k20k0M23n07M35J43k96K05j19l53L01j10P3k29R7R4p2P0
$$ y = [58, -53, 63, 47, -174, -99, 22, -232, -293, 240, 124, 46, -15, -204, -21, -313, -46, 160, -180, -148, 129, 64, -171, 80, 177, 377, 213, -42, 257, -116, -10, 157, -142, 59, 46, -56, -9, 92, -7, 30, 126, -8, 137, 175, -139, 24, 168, -31, -99, 107, -18, 105, 145, -141, 178, -87, -224, -226, -179, -96, 3, 86, -87, -57, 89, 212, -167, 146, -26, 23, -44, 174, -229, -261, -13, -35, -61, 7, -79, 130, -226, 5, -27, -189, 430, -24, 170, 54, 66, -22, 50, -46, 73, 100, 67, -150, -9, -6, 84, 198, 108, 15, -72, -38, 44, 171, -105, -144, -175, -68, 84, 51, 207, -93, 84, -137, -74, -7, -140, -153, -213, -52, 145, -32, -290, -82, 126, 216, -189, -78, 24, -212, 184, 8, -181, -16, 116, 161, -302, -17, -40, 44, 1, 83, 28, -272, -128, 71, 155, 191, 76, 194, -216, 24, 64, -22, 218, 4, 149, 46, -62, 69, -27, 380, 125, 210, -94, 95, -125, -145, 278, -229, 206, 349, 53, 258, 139, -214, 87, -23, 50, -179, -82, 12, -60, 10]
3949A0j3J23N2m8q4J55l71J67J83k08J61r0p4jJ48j72l7J51K6j88J23k5OO6J7
3974G7J92k17j15J72m19M69K1j60J04k01K3q2L26l76o3J60P4J94q8p7J33p5j1
3997F1k3m1J03l19K1L05j1j12K25j76mK5n2j92K18mj4K71k80J0J15j3k30o7O5
4022a19J43k08J14J82k21K18J62j68p5k13K56j08j16J30m9M9o1J98j88L3O2J85
4044B06k90q7L63j04j22k65L36M7k15l1J73j55J69m5K07l13j17Q8K39k15L62j94
4066C7M6k25K33j35K30k13J39o7j87r8M80j13j03J8l4m2J31j72J78N8k16K89m14
4089a80R6k7N5J61k25J41p9N6j18k09J68J53J5J8j64Q7J6j08L23l9j6l0j75l5
4113a16L38j61N3K1q9k1l1j1K21k88k4K71k79J89%Oql11J86K4K9J30j2L9k18K06
$$ y = [10, -3, 120, 172, 124, 40, 195, -176, -9, 174, -34, 127, 37, -37, -38, 110, -62, -99, 52, 78, -110, 13, -12, -6, 60, 77, 269, 52, -63, 109, -310, 159, 180, 20, 124, -77, -54, -136, 190, -186, -249, -89, -15, 179, 91, 14, 147, 72, 61, 38, -3, 100, -219, -198, 107, 96, -16, 209, 33, 29, 54, 2, -190, 28, 24, 10, 281, 1, 11, 126, 113, -117, -184, -119, 24, -184, -70, 112, -109, 109, 271, 103, 28, -185, 71, -37, -153, -23, -72, -23, -84, 114, -74, -41, 21, 206, -84, -171, 192, 88, -34, -299, 37, 84, -131, -162, 11, -144, 25, -20, 187, -126, -243, -155, 84, -131, 231, 37, 83, -142, 91, -44, 186, -27, 112, 45, -142, -240, 240, 127, 24, 42, 8, -34, 97, -75, 103, 161, -55, 234, -180, -84, -111, -56, 105, -120, 21, -58, -2, -120, -329, -161, -8, 7, 25, -139, -52, -36, -144, 179, 140, 124, 94, -81, -116, 222, 61, 114, 135, 46, 25, -6, -17, 204, -84, -108, 163, -116, 73, 73, 79, 71, -240, -54, -30, -1, 129, 117, 156, -62, 144]
4139A44n9j28k06L33R0m02J33J41R6o3j37L7J39l28l4R7J38J48J7k57J86l93K93
4162a5K35k68M1j12J18J71l43K24l11L60k42Q7J30l2l0J56j57K27k29M8m3j02
4184h7N2J80m8j01J8M9j93K07j45K43N4n09L03J1N0m6p7k0J20j13K2R5q6l8R5
4209C6m9J03P3k87Q4j1K27k02q9J54J3j77J97k1J26k14K53k55J48m4j84K47k24
4232i6J08K9J23j33M0N6l26r0M50j59K56l85K34k49K25K13m24P4M4p5j3K9N0j00
4256a19m9J20j3Kj12J27J54l97K71L0k12K03L2P7j44j37L09J79l85J26j19P3J1
4279B7j12q3P1K19j98O1l5o3K23L5r7Q4k48P6M9k01L05l03o2K86n4R6j81J9J71
4304H5m8o7P3o8l1J13o8J0j28L13p9k25J22J79l20K95k67J12J23l00J87M3q1q0
$$ y = [144, 85, -43, -249, 84, 174, -228, -95, 46, 142, 79, -58, -21, 118, -210, -244, -147, -9, 139, 156, -101, 85, -308, -15, 220, -48, -7, -119, -1, 170, -173, 51, -260, 100, -142, -55, 75, 43, 13, 169, 12, 239, 10, 58, 15, -87, -35, 145, 97, -4, 14, 63, -130, 77, -68, 175, 229, -280, 23, 34, 84, 38, -39, -59, 61, -52, -30, 65, -21, -59, 36, -13, 90, 163, -124, -40, -51, 176, -26, -115, 39, 52, -125, 72, 51, 177, -37, 216, -39, 109, 65, -119, 128, -96, 12, 41, 164, 31, 71, 127, -199, -289, 161, 2, 258, -127, 107, -142, 83, 296, -128, -54, -10, -85, -98, -69, -19, -119, -168, -48, -61, -59, -171, -44, 110, -287, -16, 14, -198, 5, 37, 114, -30, -167, 142, 321, -64, 62, -57, 16, 27, -85, -168, -97, 122, -76, -15, -50, -113, 110, 145, 48, 132, -116, -40, 9, -192, 113, -190, -252, 34, -20, 76, -105, -86, 85, 37, -30, 43, -25, -56, 57, -11, -1, -129, 184, 105, -120, 2, 181, -139, 156, -111, 1, 124, -176, 11, 54, -27, -107]
4328a07N9pK17m18J67J02q3J31j27R8l36M32M3k42J62j40Q8l62M52p2p3M1j19
4351i4J62o1J9R9q0j10L87l99o2J23J2km8K5r1J88m1k9P1j03q4q3L55j08k21K93
4377A18j13N1P4q2L24m78J89j8k05J9J00J84j41K36k20j33J6Q5j05K28l34L07
4399A02j15M7k95N90k62o7k1j2l37J56K60k06K63j12J59qk29Q1P8l02J17K97m04
4422b20J25M4k9K19k40O2N2k01J92p5Q7j73n9J26m8K20j48p8L24l85J71K75j93
4445D8j8O3j82P2qP7k67J23K51j7k63J15K6j23Qj0M1O1k17K44L69m30J48p9K4
4470E6N5k42J05l8KL21k26J00k52K32j58J19K04l20K04j78j05L4P6J0j47J10J51
4493A13j30P8k4k1N7P6n1J4N2k79L18j10k98J06P2K22l60K44J80m63J18J09j48
$$ y = [-107, -48, -55, 162, -256, -89, 13, -70, 61, -66, 32, -304, 128, 171, -71, 91, -49, 39, -323, 129, 57, -16, 25, -94, 68, 7, 26, 125, 45, -65, 322, -77, -139, -16, -4, -6, -54, -29, -120, 68, 27, -2, 69, -34, -118, -201, 154, 46, -175, 118, 5, 56, 130, 48, 372, -106, 83, 65, -140, -121, -21, 163, 22, 258, 38, -95, -79, 6, -99, 129, -205, 102, -13, 34, -261, 329, 67, 0, -21, -33, -370, -214, 46, -160, 103, -9, 150, 142, -87, -6, 72, -230, -113, 184, -220, -95, -51, -80, 139, -101, -39, 13, -188, 4, -71, 16, -157, -216, -90, -138, 82, -66, -144, 180, -205, -34, 241, 48, 30, 93, -89, -17, -25, 52, -215, -92, 159, 142, -121, -6, 20, -103, -95, -105, -64, -3, -220, 24, 393, -37, 111, 32, 56, 111, -131, -26, -64, -62, 259, 33, 133, -119, 113, -45, 74, 278, -42, 162, -16, -121, -87, -11, -1, -148, -38, 113, -17, 61, 37, 16, 73, 149, 98, 112, 164, -115, 203, 93, -205, -99, -27, 195, -165, 79, 259, -204, -86, 23, -125]
4516a25M55j42k06O1k8J62m10J54K4l9J44n1j14p3J19M5q2M25n02K52k44%j0J70
4540a5J75m7J13j06n8p4L6M4J58m5j87q5J77l22L1K87M3j98j83L12L8q2j27K16
4564A01k6r0L4J0o5o8L43k52QK5n7M6P6j64K12j51j08j00K90j57j63J02J30n6
4588h0P0k1O4nJmrK44l02J00j31K22Q4l22K72l44n6J93P1J8j31J16j16j8J90j50
4614d4K75j73n4m3M7M0j0J29k32o3j25J38K33j37j59L42k28m2K83m19J69j18O4
4637a27J73J6l0o0M6j50J05l1K0J05M1j7j02l8L31o43M30rN4j12k5K02j09p6j37
4662a43M2M3J97N6k58kJ61o1j89J46j83K20L8KO8l51Q3K08j54J3k2J7P2q4pj35
4688b23K10M4K07m39K93J84l98%Q4J96j9j95k09M05l36K13Rj54K59j90R4j22K
$$ y = [-125, 330, 188, -18, 43, 15, 177, -233, -79, -55, -94, 50, -1, -115, -188, -69, -24, -106, 319, -183, 69, -175, -175, -185, -15, 160, 113, 226, 120, 62, -12, 24, 68, 226, 181, -6, -91, 86, -236, -205, 82, 125, -73, -256, 56, 94, 12, -115, 101, 75, -15, 19, 29, -36, -104, 239, -13, -5, 20, -37, 9, 85, -79, 133, -18, -126, -226, 64, -93, -256, -154, -24, -80, -10, -31, 33, 28, 29, 25, 16, 260, -42, 58, -73, 149, 233, -89, 183, -161, -217, -24, 47, 65, -66, 50, -66, -84, 106, -44, 231, 58, 4, -39, 8, 48, 38, 167, -65, -128, -253, -115, 118, -19, -178, 164, -64, -106, 177, -242, -73, -191, -127, 46, 62, 32, -28, 18, -132, -27, -58, -38, 67, 108, 91, -11, -49, 282, -361, 69, 60, 114, 2, -23, 179, 70, -6, -143, -101, -58, 139, 195, -63, -65, 96, 35, -154, -8, -191, 29, 67, 69, 137, -214, -131, 77, -77, -64, -86, -69, 3, -81, -88, -223, -13, 31, 238, -201, 92, 276, -122, -122, -38, 158, 139, -56, -265, 140, -196, 17, 26, -128, 131, -59, 35, -87, -85]
4711h5J81N1j05M3k24N1k06O05m77JJ51j84J32N2J03r7P2j39M6j69J38N5o2O7
4735@J02j59j3K36P8l02l0M1K9r2Q0J11j08j39K97j77J70k85mR3M1qJ69l64K89
4760E5Q5q7q8o3J21k59K23P6J41l52J54r0L04j29j29j33J46j17K81k47q5K23j71
4783a41J30j33J11J18m5J27j71j09R1L7j39K70O6r2j38r5j28n8L92k0K87q9l87
4806a16K47k49K35l11J02q1J18J80jk90J34r3N11n25N5M0k8L17l87J10P7J20M5
4829B10j91k19L92j27P6p8j96K01k13K45n5m8p7K2J70r7m3o1J59q3O4n0N9P2j03
4854B9K9q0R9j46J21r3r3L03k49j3J71r4k4Pj3K41k63lJ22J85l79K44J5j25J68
4879A59k45J4K55r9j26J66j69n9mK41k89K35o3j09P6j16j7J56k11J42j52pL47
$$ y = [-85, 96, 147, 42, 85, -139, -88, -294, 311, -166, -165, -14, -198, -66, -14, 89, -8, 64, -75, -29, -198, -60, -5, -67, 0, 102, -57, -70, 166, 244, -58, -88, -47, -18, -110, -30, 81, -27, -166, 131, -46, 124, -161, -165, -72, -31, -39, 130, -234, 55, 140, 53, -35, -98, 23, -236, -13, 63, 204, -148, 6, -84, 220, 91, -38, -171, -25, -142, 139, -108, -193, 30, -141, -11, -144, -33, 85, 40, 167, -4, -113, -22, 15, -124, 146, 212, 120, -18, -113, -241, -299, 93, 73, 360, 271, -116, 131, -118, 117, -194, -92, -173, -55, 125, 124, -166, -32, -125, 386, -139, -84, -44, -72, 245, -142, -32, 45, 165, 210, 19, -200, 192, 65, 141, 63, -133, 68, -145, 100, 45, -3, -80, -58, 112, 15, -28, -89, 70, -13, 51, 1, 60, 132, 29, 58, -22, 77, -69, 52, -41, -134, 169, -80, -93, 78, -16, -40, -33, -46, 195, -68, -71, 51, 236, -143, 101, 116, -9, 159, -86, -72, 183, 84, -42, 124, -45, -104, -108, 133, -156, 79, 16, -93, -17, -133, -150, 6, -205, -63, -215, -222, 125]
4902A25ol02P7J66L6O3l17L62k16K56k51m6j1J82n4M9O7j73J99j13P8k56NK1J09
4927E0l5N5M5l0k26J23K28l70L44j45k3j97L90j09k18L3J62j7j37K08j55J37k61
4950a48K05J8j37K4K32k70J95l23J48j57O0Q7Qj15K05j84L32j55l09L06j43J07
4972a4jJ64ok01J08j94J80j77K62J1j46Q9q6K49n70K63J17L2k1k63K55j5o0J18
4996I4k77k3K66k88J16MM59l12Lj10K3Qk8L2J5J90l21K13j32J94m41L59o6J30
5020A08pN0K0k5m4l26J95J34p5p9J22j32K63j47J04k55p8J77J00l38K31K81k78
5043AL6j9L3Q1k11ok9K79k53K24r2k25L80m35J92j43L08K5j07n7j55K54j52K19
5067A48j2j72Kl6J42r4P4J50m04J0K23j20J89r5j03K25j58Q8K5j50N7K04k23J32
$$ y = [125, 119, -183, -106, 60, 96, 159, -158, 204, -12, 244, -7, -53, -64, 118, 64, 113, 180, 7, 206, 93, 171, -85, -80, -59, 50, 15, 70, 115, 85, -141, -18, 210, -160, 184, 39, 16, -181, 209, 100, -118, -85, 77, 60, -77, 131, -24, 113, -148, 57, 75, -62, -38, 194, -76, 119, -204, -56, -213, -153, -66, -58, -173, 32, -152, 180, 25, -284, 22, -121, -14, -15, 149, 143, -58, 50, -144, 36, -141, 121, 132, -14, 75, -11, 238, -332, -69, 48, 80, 59, -204, 51, 36, -24, 94, -183, -206, 60, -228, -112, -108, 351, 39, 42, -68, -45, -37, -65, -33, -18, 172, -149, 64, -68, 126, -315, 44, -22, 108, 101, 151, 171, 146, 102, -224, -29, 105, 30, -49, 73, -59, 204, 57, 161, -94, -172, 5, 105, -233, -2, 279, 1, 37, 18, 51, 132, -79, -85, -114, 165, -88, 136, 44, -181, 199, -236, -44, -187, 121, 146, 39, -18, -173, 81, -71, 148, 136, -36, -34, -70, 72, -22, 52, 202, -202, -192, 31, -89, 100, 5, -98, 127, -31, 57, 82, -68, -11, 193, -30, 102]
5091A02j27J03L64n41J16q4J61n1J51l78m7K58N5l2n6K34j54ok42J67n2N0r6K12
5115A07m9J41n27K43K69k74J1K30m5n3j49q5K43r7L3K07j00p2m1p4J36j89J56
5138B1q4qj46L16j68M2K13m6k71J41p4L6Q5j65K39J18m77J94r4P0j3j12K98r8
5162A7j1J64j56P0J43k10LP5k12J10o8K08n4l9q5j04K56J03l08J30k80K87J19
5185A58j90K43l01m0K75k54J61O4J10j08K2k81j12M30k31nj00K40j21j29K15j16
5207g0P5J03q4l2R8q9Q4k25K77k56r8R2K92n1j47O7j43J79j86q9m0j3k2K92J45
5232A59J01k30J65k01l0q4J96R0k31K08n27N09M6j94kJ30P3l67M6K60M1k17J77
5255A18j6m4k3n9K17k70Q0p4J66j46K26j3O5k99N5N2p7k4M5J29j46j25K66q0k48
$$ y = [102, -25, 78, 442, -99, 17, -67, 94, 43, 194, -184, -231, 27, 82, 50, -6, 228, 74, 68, -174, -7, -59, -9, -105, 107, 58, 199, -328, -85, 184, -90, -79, 151, 106, 53, -96, -181, 62, -35, -2, 205, 105, 33, -8, -82, 54, -135, 21, -63, -71, -217, 99, -69, -27, 186, 140, -131, 10, -64, -28, 57, -108, 131, 249, -228, -34, -128, -58, -71, -183, 115, 17, 6, 170, 14, 84, 227, 17, 20, 95, -117, -7, -75, 133, 79, 40, -45, -149, 107, 210, -98, 32, -248, 39, 158, -32, 211, -90, -130, 145, -109, 52, 116, 226, 118, 140, -141, -253, 177, -54, -59, -159, 81, -40, -169, 46, -70, 5, 108, 24, -8, 90, 1, 85, -140, 137, -119, -217, -125, 167, 116, -31, 36, -107, 72, -114, -203, -243, -256, -278, 14, 159, 260, 30, 195, -6, -36, -120, 76, 166, -65, 143, -384, 125, 171, -23, -25, 105, 178, -189, -143, 117, 158, -59, 118, 102, 58, 35, -24, 193, -77, 3, -71, 95, -51, 175, 162, 227, -72, -17, 35, -42, -66, -21, 108, -38, -163, 103, 23, -225]
5280b25L65r9K6j88J48J33%l45l8M08k27K5K31j20j54j31K06r2J50Oj71J31q5
5303d6j26L53l56J2K60k66J51L0k0k8K18j96R6j56J30k14L56k82L9O1j1j46K31
5326I0o7j2K3M3p8j28K34P0LO1j60J2k63K92p1l22J65k5j2P4K37o4j88K3J38j47
5352g2Q6r6O9O5R1j17R3qk39L11l03R4P9L36m06K39k59L2m1L6l5J16p2p3J24j
5378D9k60L20j05j15J62j39P4M0J32k50K50k14J50k04L1J70M3l80K44M9j89K06
5400F4K5j23P4Q7l9q4k8J46j74J3j19J88l35J91p2J93L2J35O4k87J45l1L5k27
5424a27J26R8JJ82k92m1K98m53K55k2J21j31j54J12P2m2J17L7j57k7R8o8R4k63
5448a66O6J28J3J52l18K89j44j0n3L2Nn6M4p9J34j69Q5N2J08j56R5K6R5q5J0o2
$$ y = [-225, 140, 41, 67, -121, 27, 160, 160, -185, -223, 185, -42, -17, 214, 94, -60, -191, 15, -77, 73, 79, -92, 39, -46, -172, 181, -175, -163, 97, -169, -18, 12, -8, -36, 182, -14, 82, -74, 56, -158, 198, -84, -45, 16, 5, -141, 90, 23, 11, 34, 77, -1, -129, 105, 175, 178, 239, 79, 91, -172, 120, 49, -273, -108, -133, -145, -71, 166, 102, -86, -63, 75, -72, 14, -82, -13, 52, 143, 26, 119, 111, -128, 183, -120, -26, 53, 389, -17, 222, -37, -5, -46, -10, -45, 71, -1, -74, 50, 49, -211, 109, 4, -111, 51, -88, -14, 26, 158, -92, 158, -56, 94, -110, -79, 91, 134, -246, -2, 47, -142, 64, 89, -34, 40, 127, 88, 4, -24, 122, -52, -39, -158, 30, -305, -114, -186, 7, 39, 174, 238, -49, 96, 65, 100, -127, -1, 97, 98, 280, -12, -53, 245, -208, 47, 25, 146, 15, -139, -27, 45, 3, 120, 157, 0, -27, 71, 3, 97, -166, -100, 28, 41, 193, -125, 164, 20, 10, -43, -11, -6, -62, -18, -97, 37, -132, -47, 5, 113, -43, 52, 78, 173, 88, 98, 36]
5474C6lkr8qK6K6J0P5J74j13om21K55Mm2K50l07P3K36j48q3K11j05M7k70J05M
5501g4p7J70O7n4j44J47k25J43k1J14o1J62L1l2Rm0k30J10K11k09k9O7k58L12
5525H9M4k44R5K53j30j38l1J30j90J10r7r6L76l7j95kK79k76J55j45P6p8R4K5
5549F7M9k29M73l81N6k72j61L50Q6q4K2K23K5j02p0m5N5j12O7p6J01r5J36j45
5573f2M1L1j5L8L6k15J18j42J25P6j30M57k67J33j22l5k9N4k00J37J35k06N0Q4
5597I2k29p7L68l72J76J81l81K76N3Pj78J5J76J94l92K32k34O2J29l4Q5Qr7k76
5621b16J16oJ66J20j58k74J99P1J40j92J84j60O4Q2j91k06L07L8k07K11j13j2
5643c7M1J8q1l1K90j10k69l5K17J10Jr5p4j13J64k4Mj36J60m4j77J71p0J52K2
$$ y = [36, 33, 31, -67, -75, -49, -23, -13, 62, 236, 123, 117, -304, -49, -45, -87, 163, -144, -71, 165, 17, -66, 145, 40, 87, -183, -78, -74, -151, 19, 86, 32, -112, 35, -190, -47, -68, 46, -15, 147, 178, 146, 155, 115, -115, -5, 206, -3, -32, 35, -223, 89, 133, -111, -16, 237, 107, -31, -62, 68, -122, -12, -109, -205, 171, 134, -61, -63, 216, -60, 95, -50, 26, -52, 42, 67, 116, -113, 360, -21, 35, -237, -398, -48, 38, -46, -24, 199, 224, 122, 52, 7, 62, -50, 17, -59, 42, -53, 83, -62, -21, 10, -5, 33, 69, -146, -28, -170, -45, 31, -99, 358, 91, 224, 102, 67, 38, 92, -108, 29, 164, -42, 8, 92, -137, -214, 154, -218, -42, 139, -242, 34, 87, 94, -84, -69, 107, 301, -91, 141, -93, -31, 98, 64, 149, 157, 60, -216, -100, -106, 60, 180, 22, -252, -53, 18, 158, -34, 150, -10, 54, 136, -55, -261, 46, 84, -123, 88, -25, -37, 4, 22, -59, -90, 200, 90, -179, -214, 3, 113, 114, 19, -55, -168, -4, -28, -24, -160, 0, -44, -221, -50, -120, 32, 54]
5668E4k04M4L65m97L81o1j57K30l15j25L59k93K71K31l20K26j72J6j01L18j89
5689F1J08o7p9K3k70L20k69j75M62j89J49k39K34N8l3p1km5R2L4R7j70L7k1M5
5714I0q3l0m5q4NP7J74p0J10mJ09k52r5L7MN4k1m2K2k50K22R8J5K4l6l3R5j33
5742d2k07J90K34k52J07J08j46j65L20J2l25j1J58J79k76J38j78K70m8N3j13J58
5764A64k84K9m9K11J07j11k65L68j06k46L50k17O6j97K16JN5k09P3J43j87J63
5786G5J1n7O7j23Q4J67m39L41k33K12p9n3Nl25N46k64J39n0m5n0J13J79l65N2
5810i2K70R4k40O5o0K0j09J02j44lJ57J6%j39J22j83Q0j12L38o3j20L1j71kO0
5835h3j56J26j8J59Q1O3j88R1q1J65o8p2J98k81J48k4k52K24J43m08L57k10O1
$$ y = [54, -150, -106, 259, -238, 143, 82, -75, 155, -160, -285, 74, -219, 52, 283, -37, 189, 17, 33, -68, 250, 61, 169, 102, 23, 46, -224, 96, -173, -348, 114, -75, 74, -165, 69, 127, 94, 23, 21, -24, 68, 102, 199, 29, 66, 45, 90, 7, -23, -68, -152, -147, -70, 104, 34, 144, 140, 249, -3, -98, -61, -57, -3, -24, -66, -44, -294, -72, 26, 41, 65, 29, -4, 91, -42, -249, -59, 175, -77, 30, 138, -8, -173, 147, 159, -166, -177, -19, 160, -116, 22, -156, 114, 66, 119, 6, 164, -120, -91, -140, 71, 178, 67, -198, 170, 64, -182, 168, -49, 17, -180, 36, 37, 92, -117, -44, 99, -88, 75, 86, 29, 96, -27, 57, 224, -215, 126, -107, 105, 26, -27, -22, -347, 199, -65, 74, 24, -21, -71, 42, 221, -144, -92, 178, 272, 32, 97, 37, 57, -52, 50, -94, -97, 60, 76, 76, -63, 59, -124, -44, -156, 182, 119, -1, 30, -141, -143, -83, -239, -113, -131, 28, 109, 172, -16, 75, -6, 159, 91, 19, 217, -64, 84, 60, -192, 32, 175, -233, 124, -86, -25]
5858b5P4K36k87k18J34kQ0j24J22%j13K63j68n2L04l07R9Q9l01J75Ml3j06J26
5882c0j64K89j0P1m80L31P3j54l3K64k35k06M01o9K3l5M8j59J59J20k91L5L92
5905C40pm29J69P1k4k97O6Q0J82k16l1k05O35m66J29k3l0O6RJ13j16rj06L5m3
5930a07K08J25k88j00o3L15j30M8J65m69J00L19K7j23m1p9o1L33l71L58k60k4
5952a18L51j82k18R0J69n5M5j6N1l12L02j94k0K01K0l33K85jL2k07K46O7k9j47
5976B7m9j04r0N28l0k84J75k90M8J89j12j51L1J19J03k91J09L47l64J51j05N9
5998A6j88R9J20nl26M84l0j61M6Q3r8Q3k0k42L21j96m5J70O4j56n8L2K3N7P5n5
6024I3k72L09j75J12K10m22P1J37p3KL6j72J8J56m3j92J72q1J80o6j47K71j23
$$ y = [-25, 49, 285, -2, -220, -86, -88, -8, -132, -10, -10, -123, 140, -28, -80, 224, -83, 16, 105, -196, -21, -17, -50, -156, -30, -194, 95, 85, 156, -324, 7, 80, -74, -107, 157, -78, -284, 117, 48, 71, 36, 84, -75, 84, 204, -87, -52, 340, 333, -96, 73, 144, 120, -177, -111, -31, 151, -65, -96, -301, 334, -132, -3, -26, -56, 10, 19, 132, 16, 7, -99, -64, -107, 101, 226, -62, -162, -225, 90, -40, 8, 173, -296, -196, 123, 150, 27, -14, -93, -154, 179, -192, 166, -94, -118, 233, 51, -167, -77, 92, 37, 82, 66, 117, -195, 107, -87, -107, 94, 114, -219, 66, 65, 97, -110, 136, 203, 174, 27, -22, -126, -216, 312, 282, -2, 173, -117, -69, 120, 8, -143, -112, 7, 110, -181, -72, 275, -89, 62, -43, 16, -172, -73, 47, 42, -284, 200, 170, 9, 55, 138, 40, 123, 103, -139, 182, -14, -59, 111, 175, 19, -39, -7, 16, 73, 148, 93, -179, 130, -45, 67, 277, -145, -74, 63, -10, -8, 28, -144, -126, 30, -13, -205, -33, -114, 66, 0, -147, 124, 1]
6047Ap0Pn7L60m43L6K79j64J95j85k06M90j71k14J13lj68K98k68j5J02k7J24l9
6071b5K3J03j39j09r2K11J50j91L58j50k76L30k25J56m68M10k02K34K9o2m0l94
6093c69K57K11Q0j87j8J3pK23p8j87K15Ok83L11J7k52J07j48J24j74J93J78j83
6116D9J70k07o8j7J83j10m3J4J22j5K76m08K0j6M2O8k32J20k6m1R0q9M50p28J75
6141b21K25j13j52K74J04l07L21j62K38k28J6k39L11r0R0%j88M22j90L0j19J35
6163A57j15j77J62j65l8N0K7J76k20J75P7m88N12k89L1L1J08O6j60J05O4j12K17
6186A94j88j22J63J04k95Q8R2qr9J3J27j24N7K21j60l16K63ok34K78q3J47l45
6209b33K73K62j58o0j24k83K81P0J27k42J31j28J46j60P0kj31L02j51l9J49j57
$$ y = [1, -69, -62, -119, 241, -202, -166, 113, -51, 144, -41, -247, 243, 72, -142, -29, -32, -200, 98, -170, -185, -83, -110, 14, -25, -2, 101, -38, -147, -239, -28, 122, -69, 289, 139, -137, 193, -32, 124, -344, 66, -136, 98, 127, 65, 25, -369, -112, 99, 179, -8, -26, -13, -20, 203, 125, -62, 153, 159, -124, 187, 204, -48, 59, -89, 35, -139, 54, 232, 49, 219, 12, -56, -73, 110, 0, -43, -29, 93, 78, 354, -54, -34, -50, -8, 60, -172, -52, -78, -119, -29, -118, 332, -396, -221, 4, -109, -261, 13, 117, -190, 131, -31, 207, -21, -5, -244, 67, -23, 67, 67, -121, 301, 111, 141, 22, 157, 42, -135, 27, -138, -176, -126, -99, 77, -143, 32, 109, -379, 133, -156, -125, -94, 14, 80, -80, 25, 89, -23, 194, 6, -116, 47, 151, -144, -56, 36, 28, -71, -58, 69, -55, 2, 223, 63, -253, 10, 4, -230, 48, -35, 112, -233, 40, 302, 144, 84, -40, -323, -42, 28, 155, -87, 44, -84, 62, -98, -28, -30, -161, 141, -10, -49, 100, -57]
6231e7o8K67N2j66k59J94J23j76p1J30k4K54k91o1j5J17P4q0K46r5j02j40J20
6254b8j6R5J92j71J22r9N4q8J04k10oJ08J81k29j29J04J92j07P4m43L70p7M6l4
6278Ej79P2R5K18n03K36K34l7k31P1L44m00J34j87j30J83j65L24j85q3K33n1N6
6301E4r8q6n1K94P6l11K52j90j68K95r5nk15K00j9l7J83j86Q5Nq4M6M20k05l54
6326a94j38K12J46j83J12L56k78l8j56L22p8or6J44j57p2J46N4j08N1n8P2mq1
6350c2J97j75J39l2j37J69L0j01J6m5p9%P6J18k30K30m18J82K13q5o7J8j10K86
6374A63j92k2J1j12K90j23k04J47J02L20j57j81K20k82p2R8J81p6j44K6j31q7
6396b25L00j35J05r3J01P0j61m4L18k99J86j58J40k2k7p2j76L70k54K26j98Q2
$$ y = [-57, -125, 142, 194, 28, -231, -37, 86, -90, -161, -31, -55, 199, -92, -153, -168, -51, 23, -57, 189, 94, -8, -148, -28, -44, 51, 243, 72, 194, 95, 149, 61, 165, -45, -51, 57, 238, 9, -120, -16, 176, 69, 143, -300, 70, -7, 39, 5, -174, -102, -7, 211, -292, -56, 178, 141, -90, -19, 325, -75, 59, -128, -258, -75, -240, 84, -101, -184, 49, -2, 54, -44, -130, -181, 113, 189, -122, 130, -60, -228, 67, -28, -33, -248, -48, -67, -104, 79, -107, -22, -17, -101, -55, 365, 160, -194, -332, -120, 26, -157, -45, 311, 33, -5, -161, 161, 83, 77, -19, 125, -32, -104, 42, 96, -12, 39, -19, 53, 49, -32, 165, -10, 129, 97, -40, 129, 159, 58, 74, 29, -50, -50, 26, 144, -86, 144, -274, -92, 121, 36, -31, -13, -123, 163, -29, -51, -40, -152, 138, 15, -189, -42, 60, 380, 223, 42, 262, -20, -92, 6, 187, 111, -33, -7, -138, -225, 75, -60, 45, -48, 53, 123, -38, -82, 236, -63, 123, -35, 105, 83, 56, -16, -192, 178, -76, 150, -48, 34]
6418C4k58K30n7K4O%R3j20r7j13J51J02P9nk82J07o7K26n7J53j59N1j49J61J80
6443B33j79j2P9J2j01J26k28P4j61J87j41M8L9K9m4k5n0J71J1j66J5J44J25j91
6467ej20j9K13M0k50J25j2M3o6J12q3p0J41k1J7J7j5O6j50RRJ92k62N0O1Q6k69
6494a61K0J42j7n9l9J97q3j89L43j47j53M5j59L51j01O5k7j49J86q9J21l65L84
6517A16k86J19j27j1M16k67J01j41Q9o7J47n7j36j52L51N4n6k07Q5L9K34k53J70
6540A61L9m14J83j7k8K26K8m8k50L55r8j01k0j23J41j49k3K13j09J4j45K90o2
6563F3r0k43L77r8O3j44R0o3N3j67j11J68P3KoJ49k82J40n6j40M97l65jj36K68
6588D1n5P6J28k43r3O7J14k6N0M7k11P0j73N9O8K78j39j44J24L0Rq3K8R3P1j64
$$ y = [34, -224, 6, -51, -27, -21, -21, 72, -48, -145, -258, -107, -5, 74, 69, -213, -106, -173, 53, -4, 149, -10, 41, -108, 53, 233, 54, 42, 121, 133, 32, 158, -70, 4, -157, 30, -111, -63, -24, 5, -39, -64, -114, 57, 68, -98, -83, 61, 186, -5, -125, -144, 69, 109, -141, -16, -28, 15, -51, 61, -22, -92, 49, 28, 45, 62, 47, 113, -37, -28, -19, 173, -89, -39, 22, 108, -161, -141, 1, -16, -75, -114, 83, 0, -189, 154, 7, -146, -101, -260, 91, -10, 55, 28, -121, 65, -24, 97, -268, 116, -170, -51, -178, -189, 227, -40, 61, -80, 9, -58, 89, 32, -104, -256, 95, 149, 93, -114, -29, 10, 244, -9, 161, 200, -214, -31, -48, -76, 150, 178, 130, -120, 235, 137, 36, 16, -107, 34, -115, -138, 75, -34, -20, -165, 125, 63, -27, -270, 107, 9, 72, -72, 18, -45, 8, -159, -270, -102, -29, -27, -33, 116, -166, -26, -82, -222, 275, -90, -91, -227, 41, -14, 62, 190, -53, -146, -79, 35, 9, 59, 106, -105, -35, -208, -149, -81, 197, 58, -86, 38, 68, 77, -6, 22, 115, 186, 22]
6614B2J18j9J17j01j63K8l7K50j39k09K21q9Q1R3j28P2N7k54L38k35q6J93j24
6637FN1j83k5KK06k17J0J02j04L10k85O0J71J25l18L40k82J11k00J70L0m7m28
6660c95L63j3J6Q3L5j30k10L39r2R6j43N0r1J12jOk73L12jL7J16pj94m8N9j57
6686a31K54l27K12m1q2J31j8J3j78J45j4K9J4J07n1J8j9j91R7K08jj29J1j24L2
6711c5Q5J34k80p8K56k0j5K8O4J5M43o36Q5J27j12rj7J51r7L3k38m7o8J95N1o2
6737d7L4Q1r8K07j69k28J14J04L5k3po0o1K67j78j28J49j16j30L20j03oQ2K03
6761B42J45p2l20j60K78k29L5K01k76J48j50J06k1J30pj4r0K1L7O8J15k04jM8
6785C0q9J77N7r1l12J21K77k63L4P9QP1j38k06L59j38J9j86K75j21N14m29L7q6
$$ y = [22, 140, 121, 238, 137, -26, 2, -35, 215, 76, -133, 88, -1, 80, 173, 45, 117, 174, -80, 258, 23, -63, 130, 6, 57, -126, -151, -149, 57, -160, -150, -48, -152, 158, -127, -67, 104, 229, -89, 251, -31, 80, -120, 50, 80, 33, -395, -32, -45, -29, 54, 89, -41, -251, 88, -4, 92, -51, -1, -92, 20, 19, 25, -248, 64, 63, 100, 216, 209, 15, -33, 26, -131, 123, -204, 8, -33, -115, 16, -2, 11, -167, -22, -36, -7, 7, 114, 63, 81, 62, -129, -32, 176, 175, 46, 57, -67, -35, 50, 184, -96, -174, 82, 62, 47, 75, 139, 154, 597, -39, 46, 173, 61, 52, 35, 186, 89, 122, -116, -163, -231, -36, 15, -47, -13, 68, -30, 177, 8, -220, -106, -2, 33, 10, 3, -57, -118, 149, -29, -157, -8, -124, -254, 66, -37, -43, 39, 242, 387, 315, -5, -165, 113, -116, -81, 120, -156, -8, -158, -52, -73, 57, 50, 36, -54, -33, 4, 72, 187, -17, -18, 30, -59, 118, 175, 84, -228, -107, 170, -93, -59, 20, 28, 99, -39, -245, 114, -24, -5, -191, 84, -37, 477, 48, 85, -1]
6809aj4jk64M36k3k91J97L1l43K43J00k36J74J38k17K22mj50N5J01n1l6j61M1
6833e4K3k00J88p4q1K55n9J55j65j13n4R3J03j12J49J43j54N7j77K88l35L40j78
6856C8J31r2j08N0k04K46k91K14n2N2p5j31K47L10j79j09j37M22j42j29j89OM72
6879C50l74m6J85j04j72P0m5J1N9J64j59K37l00L69j56m6j5k89J94J74j01j04
6901i8K86k92L06l19j33L14k0j04j1J57p8l39K77k5J3m9j8QQ6Q3j41K66k63J61
6925F7Qj42j45L73l31J91pk48L39j94n5K80n9k45j3J46Q4P3k9k04L06p8j1L1q6
6950E1J8p2O0k28K29j30K90l78J96J9M8k3R7j38r8k6lJ77J50n2k78K9r3L86n4
6975A77l50O8K04j94J85p9p9J0K30r5j73L11k58K56l09o9L23m22K73l2j67K49
$$ y = [-1, -15, -16, -280, 156, 133, -158, 39, 70, -273, -30, 70, -166, 8, 146, -71, 151, 147, -3, 52, 153, 102, 66, -95, -54, -31, -231, -43, -117, -198, 57, -2, 153, -12, -125, -179, -86, 17, -95, 54, 197, 43, 100, -77, 211, -124, 216, 38, 169, 77, -31, 19, -185, 61, -230, -16, -68, -16, -91, -222, 25, 335, 156, 47, -90, 332, 190, 61, -128, -122, 350, -24, -70, 115, 11, -161, -91, -136, -125, -66, 98, -61, 176, -124, 245, 89, 43, 28, -261, -67, 107, 6, -98, 188, -104, 202, -117, -250, 64, 44, -60, -71, 86, 8, -331, -54, -79, -66, -115, -133, -125, -39, 44, -97, 169, -94, 67, 75, -67, -212, 161, -170, 21, 14, -234, 105, -89, -144, 136, 77, -168, -181, -35, 49, 122, 93, -111, 195, 117, 106, 137, 51, 69, -3, 57, -171, 58, -72, 218, -160, 36, 55, 103, 80, 177, 39, -59, -85, -88, 89, 239, 187, -91, -62, -155, 231, 177, -173, -105, 99, -95, 90, 11, -68, -58, 172, 77, -96, 215, -43, 213, -96, -165, 158, -264, 9, -23, -190, 59]
6997E9j99K83o9N3k9o0J54l08J61j41K48j57J03J33l02O6m3r4L08K9k12N6k9K02
7021B12j60lR7j27P4j73L1L0J92j77j19J50j97K48j44K23j74Q9j64K16Q5k4k98
7044a13J55l8j08K17l0O8N4m5k9o1R9k34n0J24O0N3k41P5j15J58n4r6%J19l4K77
7070B11k97J67o2q2J22K6O0l47K13q2J94l36K46M1j05L4j3j59J52m06L62j90N38
7093B87k57j46R9J02n2j74L28m17K34N9P2q9l34J63J59n6j04L13l0j14j45p1K77
7116A04k14K14k41M43j84k26M22l71k6L40l06O2j05N7J25k05K34j39k45L10KR1
7138A42m0l00J72Q8j65j27M85n15L68k04J47k14K37k2q1J72k11q6j92K86k1j16
7160a97M07l13K98j01J13j97J51k53K45l4l01K70j46RN0j48M9J6r5K92k17R4J53
$$ y = [59, -140, 143, 74, 127, 98, 38, 192, -116, 45, -96, 152, -5, 98, 231, -71, -5, -48, -142, 166, 195, -17, 39, 10, 212, 52, 49, 146, 19, 93, -80, -49, -19, 173, -4, -123, 27, -170, 78, -66, 157, -17, 72, -92, 124, 209, 185, -113, 42, 4, -104, 113, 83, 151, 205, 160, 131, 70, 169, -65, -115, 9, 69, 122, -119, -44, -159, -1, -55, -151, -151, -32, -66, 211, -86, 81, 19, -63, 59, 85, 145, -202, 11, -71, 123, -213, 33, 74, -31, 3, -10, -169, -17, -423, -61, -251, 287, 30, -116, -17, 85, 33, -141, 187, -230, 4, 63, 135, 46, -288, -125, 34, -22, -126, 187, 157, 43, -102, -173, 104, -110, 104, -137, 306, 122, -104, 318, -53, -79, 261, -45, 17, -88, -31, 94, -111, 123, -16, -261, 49, 51, 142, 102, -198, -26, 62, -103, -230, 255, -260, 108, -96, 51, -163, 74, 52, -29, 143, -68, -154, -346, -60, -81, -197, 210, -103, 195, 94, 207, 10, 161, -92, 153, 119, -182, 88, -58, -49, 1, -147, -98, -82, -177, 115, -102, -8, 145]
7183A45l57J65k7M6Q5l89K19l0K35l01NL02m6K59p2k04J02J03k09j83K67k06K3
7206f8J21K4M1m3j82K77l19O1K91j90Q7J46k63j06P5QJ2L6Oj22r3J76OJ07r4r4
7232a00L9o4K21j50K50l43L67k37j77L36L4p0l5j40l9J80K22k92j09J8J40k61
7254b10N3K03J14j85K06k14K6J22oj65J3O6j95J83o4K28j93J48l58J89m6j5O3
7277c7j40J66J03J17j84j17n0K16j49J52m6r2r5J89J34j59R6J16k16J02o3M9l9
7300E3q4np6J41l6k10M6L36m1jj46j13j2J06l0J5p0J32o8J84p2j44K49l18J54
7325a0J20K9k15J31K61n36K26K9M1j50O1K2p8Q8L8j70L05l56o2K26j9M1R0o0n8
7350fo3R2r4J31Pm33M18J2lm9j12k3J11M0k83J87J69m71N94l42J22j18N9J61n7
$$ y = [145, -212, -47, -74, -28, 57, -332, -113, -143, 92, -209, -204, 98, 52, 311, 239, 35, 137, 240, 31, -152, 115, -91, -68, 53, 77, 118, 75, -107, 170, -149, -88, 203, 13, 100, 246, -17, -123, -48, -40, -28, 8, 14, -108, -201, -25, -19, 88, -6, -100, -61, -125, 96, -54, 196, -147, 220, -17, -194, 142, 176, 106, 71, -69, -108, 72, 294, 2, -107, -89, 51, -210, -157, 46, 160, -25, 181, -33, -7, 115, 109, -56, -43, 23, -172, 11, -53, 175, -18, 130, -228, -39, -85, -100, -37, -177, -11, 92, 209, 25, -92, -142, 74, -75, 77, 31, -61, -156, 33, 167, 8, 104, 220, 4, 106, 43, 92, 53, -31, -36, -112, 29, -7, -217, -171, 165, 124, 123, -23, -136, -148, -42, -72, -57, -127, 5, -63, 121, 49, -95, 154, -164, -10, 110, 139, -76, 55, 316, -220, 6, 35, 76, -74, -13, 9, -69, 19, 57, -113, 192, -164, -226, 0, -19, 22, 112, 52, -6, -69, 23, -71, 60, 67, -366, 52, 64, 61, 12, -100, -123, -12, 28, -255, -68, 101, -370, 224, -118, 4, -114, -55, 106, 49]
7375D9J33q1k27Q8r0P9O5j57K44n1m7J65l22N8l8M0M19l68K23k68L0r3M4J14J46
7400A55p2j60R4j20K79q1n3l8L22j94j0j61p4k21L88q2l6J00j06O5j44j5J66J09
7424A11j52J24k16j0J97j43J10o1LQJ01q3J11J15k14k70J33K35n9J11l01K05J78
7447B33j93n4j72J37K89l53K34j09k99K42j2M2o6J88j37K36j3j27r5J49p8J38
7469A80k92n9L65k57O6j81K74j39J22l48L74l05K26J27j91J32j47J46j49J6j73
7490b13K25K6q2J77K7j99J67J37ll16m8J25J68j01k01J26j5p4j59M02r2j68N4
7513c7J15l04J3J42N6j89K91k39J94N5o2j26O1l17N67l32N9J00k49L54l11R8Q7
7536B6oK1N3j64J23J8n7K07j89p9R4k95Q0J48K1K03q7M1j02r2L6N9p2o7Qj34K83
$$ y = [49, 182, 101, -126, -38, -128, -49, 16, -141, 103, 52, 5, 170, -152, -94, -132, -92, 327, -41, 182, -86, -56, -149, -105, 9, 155, 83, -77, 17, -103, 176, 95, 42, 4, 326, 132, 122, -39, -113, -334, 54, -28, -64, 36, -70, -5, -149, -164, 2, 111, -41, 83, -133, -143, 54, -89, 21, -40, -37, -29, 72, -11, 100, 215, 1, -269, -136, 99, 40, 151, -150, 55, 233, 40, -14, -186, -49, 240, -113, 121, 12, -287, -45, -57, -15, -81, 107, -30, 206, 193, 66, -29, 120, 42, 180, -112, -171, 194, -63, 3, -178, 96, -43, 79, -269, 105, -200, 26, 153, -38, 94, -53, 93, -56, -40, -213, 12, 38, -44, 133, 160, -39, 128, 265, 262, -54, -102, 23, 191, 90, -111, 15, 0, -74, -233, 169, 77, -91, -37, 78, -226, -213, -71, -15, -204, 87, -152, 42, 97, 35, -91, -30, -347, 220, -112, -53, 47, -202, 152, -159, -61, 26, 20, 41, 94, -70, 53, 71, 14, 221, 32, -47, 47, -248, -168, -20, 1, 204, 117, 158, 56, -36, 0, 59, -13, -80, -72, -206, 77]
7563G7j46K70k65j79L94k36K03j47L9R5kJ15o5k72K0m7J26J25j72j10N69o01L38
7586A29m6l03L33j25J05J9qj39K7o1k9Nj13P1J55m8L10j52j41J3lL66l10J3m6
7611B2qK4l09P0O3J44J45k03r5LK92j43j31O6J23l11L99l31J03J04qJ56l20J23
7635b2J07j40m9L2J35q5J02j50KJ09k7L59l51j0k83K95QQ5j58m5K13j63k22L65
7659A07j23j95J99J70k43L25l77J65J22k95J55R2k63l3L00j70J44k89K46K09l09
7680f3J84J19k9l85K64l00K0J10J60P2j52k05K99k55R1o9J41p3J55J27k74N4j30
7703a39K11On9o9J04L1m0J03Mk56L21m19L03j90J05O3M6j17o5KJ88k32K61K26
7727C88n31J49PLk97J32j39Q6J49Q2J10l41J94o0K04k77J39N3J9J11l40L04J32
$$ y = [77, -69, 201, -64, -243, 151, -85, 118, -29, 10, 105, 103, 218, 153, -119, -99, -146, -20, 105, -67, -177, 392, -209, 129, 83, -220, 113, -12, 93, 112, 104, -35, -8, -69, -98, -93, -206, -135, 20, -28, 282, 130, -11, 2, -1, 365, 55, 68, 22, 14, 38, -271, -201, -138, 6, 151, -52, -147, -144, 148, 5, -126, -60, 63, -248, 151, -180, -77, 27, 19, 175, -145, -22, 85, -55, -104, -72, 63, -22, 80, -70, -68, 41, 14, 373, 22, 12, -271, 24, 32, 117, -41, -86, 127, -36, -258, 107, -16, -211, -12, 158, -85, 240, -137, 28, 150, -145, 10, 102, -161, -194, 106, -64, 80, -209, 37, 246, -63, 121, 240, 211, -174, 90, -210, -190, -80, 80, 152, 0, -205, 94, -161, -70, -139, 2, -71, 84, 211, -63, -9, -139, 72, 78, 19, -50, 54, 85, 45, 148, 152, -104, 217, -202, 101, -89, 16, 79, 125, 8, -57, -55, 133, -99, 162, 388, -143, 6, 13, 16, -281, -149, -288, -202, -53, 29, 139, -202, -8, -68, 136, -141, -2, 51, 70, 181, -159, 145, 277]
7750B77l95J54l06K26J46L4j34l5R0k21J48j49No0M45n21J9M08j81J54j8J95k74
7773Gj46R3j10Q5Nk2pK56k20J31k38R0K57l51M51m19J09LJ72K9O9o5k42J06n4
7798a1P1J6j17Q0j95J73k63M4L79k53N3M4m2K11n56N23n7j41p9K27L5j87K3nR
7823a8K10j64j64K20k3k1M2P0j59J36j51n2P2mL6j32P5q2j19K21K34j48J25k27
7847b3J33J12n8k26n4j0J18J36j16o8J17j17k7n1L01l22J74l2j45Q3j44K08k61
7870b72K89o2oJ11k3k68K94j36P6Q2j31r2J50j04j02M45l85J7J83j47k6j5K25
7893A03J57j48l13J79K92k17j15J3n1R3L7j57L40k41J94k07M3J02j22J54k15k1
7915a00J23QP4Q9j35L9j06K29j96j54L0K52o0j04m3kj82J95J63k59J43o5J01j5
$$ y = [277, -118, 36, -270, -44, 102, 136, 2, -33, 57, -164, -16, -165, -160, -220, 225, -296, -277, 131, -50, 104, 86, 281, 7, -139, -46, -156, -71, -66, -88, -95, 161, -59, 72, -166, -76, 181, -170, 281, -138, -29, -26, 146, 175, 244, 179, -63, 43, -11, 60, 76, -41, 39, -156, 17, -246, -202, 177, -76, -23, 21, -21, 190, -366, 157, 100, -41, -120, 107, 142, -45, -22, -27, -18, 192, 28, -136, 84, 61, 40, 82, 152, -7, 129, -22, -74, -2, -6, 30, -102, -27, -109, -228, -7, 227, 79, 204, -23, 110, 222, 164, -62, -116, -126, -8, 128, 12, -56, 61, -56, -83, -134, 167, -155, 19, -13, -158, -75, -219, -11, -272, 17, -45, -51, 60, 37, -231, 63, -73, 3, 85, -46, -138, 12, -92, -194, 251, -134, -117, 66, -81, -107, -122, 103, 260, 112, -201, -22, 270, 53, -62, -49, -100, -7, 30, -127, 213, -28, 166, -41, 2, 104, -18, 136, -79, -100, 23, 31, 105, 194, 59, 98, -8, 221, 25, -129, -99, 153, 93, -11, -54, -56, -238, -43, 120, -139, 4, -61, 40, 25]
7939B5r6R3P7o6n2J3k64J68J49l8K93j25J17j20l30J68j23p2K50rK79m73N6R4
7963A4PL07o02K78J00k96%K81p6l39M34j28J52k38j3k2J01k80M81k46J65l53L59
7986H6j40p8R1k30L11k09J09k9J78l02J86M0j42K27j14l8J59j95n4lL58j62j12
8009f3L0Q9r1R7j71QQ9m2ro5J52J32j66K10J1j56j32K48l02J28l77J91K52j04
8033d1O1k30rK09J99l35J36%k8J77R1k47m5J62K44j89j84O4n2j13J91L8l6k30
8057a67J62L3o8J06J6k52J02l6J63O9j51q5J82O1k30j5j3J42m9l3J4O5M8j15q7
8082a38K08o2n4K8J52j93J02R4k10J3J83n5o0N8m5r0J24p9l2n8R8K6n1P8j28K76
8108A85l95O4K45k1o8k16L37j17J71j70K04L0k54R6N4qk03K4K84m07L0j39L22
$$ y = [25, -71, 22, 99, 33, -19, -6, -270, -102, 47, 9, 302, 177, 294, 174, -156, 12, -111, -183, 67, 58, 337, -136, -80, 14, 21, 328, -274, 4, 104, -192, -192, 89, 13, -326, 108, -20, 132, -106, -119, -141, -40, -320, 161, -85, 80, -273, 86, -54, -132, -41, -271, 40, -169, -60, -89, 89, -213, -27, 13, -129, 98, -16, -54, 105, -90, -144, -147, 211, 49, -63, -33, 56, -35, 62, -109, -101, -12, -54, -63, -128, 24, 156, -10, 200, 211, 55, -77, 171, -131, -3, -380, -189, 63, -41, 20, -210, -219, -10, 189, -146, -10, -10, -38, 139, 230, -17, -62, 100, 344, 155, -29, 35, -17, -130, 61, 99, 63, -167, -5, 28, -40, 66, 82, -170, -68, -104, 59, 128, -23, -108, 74, 135, -95, -110, -123, 19, -30, -63, -49, 16, 64, -51, -138, 70, 8, -46, -18, 134, -59, 43, 137, -73, -60, 123, 68, 8, 66, 21, -69, 55, -24, -56, -114, -16, 10, -41, 37, -91, 185, -210, -146, 99, 78, 10, -206, 131, 14, 185, 15, 219, 249, -5, 91, 145, 137, -66, -42, 242, -165, -135, -274, 48]
8131D8L31o06K97K0Q7k80J38Jj72r0J05K11j24%J07l01L38j67j83K85k91J80J40
8154G4j81P6J72k51J42J60J0k41j0j4j47N7K74j12J9p1M5l6q5J40Q8J1k73K01
8178D8o1j72O9K60j56j98K27P8j76j97L93j14J17
$$ y = [48, 379, -227, 70, 90, 177, -103, 35, 36, -136, -226, -121, 90, -34, -34, 73, -228, 110, -57, -240, 45, -246, -66, 74, -107, -31, 141, -110, 32, 192, 202, -39, -49, -63, -210, -153, 121, 9, 28, -43, 2, -34, -119, 21, 109, 120, -153, 48, -13, -185, -116, 144, -12, -210, 17, 95, -81, -278, 115, 1, 118]
8191A18
$$ Imaginary data points
##PAGE= N=2
##DATA TABLE= (X++(I..I)), XYDATA
0@%%%%%%%%%%%%%%%qJ6j6J6j6K4l2L2l8M6n4O2p2Q6r5J05j20J38j60J82k05K30
37A21k58K89l22L60m01M44m93N47o05O68p37Q12q95R88j087J198j322J457j609
56h45J784j983K210k475K789l168L636m229N009o091P702j0384J5907m6487R1992
71E5367K3153j77367O0763J50055q9111j42102J29873R8193j45515o0021J65286
82F8574J5377j66844P146J65967k6347j55211L7861J51874n4087j51869O4529
93d3030J53076p6124j39509Q8136J15689j04264q4516J14461N4944j12949k5012
104e9098R8880j449q2372K3996O9370l7067o0594M4802N1264n4062m4500O8811
116A7981L9057q5365l4897R7816K6776j01432j4606R8350j700r0647J4673Q3565
$$ y = [0, 0, 0, 0, 0, 0, 0, 0, 0, 0, 0, 0, 0, 0, 0, 0, -8, 8, -8, 8, -8, 16, -16, 16, -22, 24, -30, 32, -40, 46, -49, 56, -64, 74, -86, 96, -109, 121, -137, 152, -170, 190, -211, 233, -260, 287, -318, 350, -387, 425, -470, 518, -569, 629, -693, 764, -845, 939, -1044, 1166, -1309, 1480, -1688, 1948, -2281, 2728, -3363, 4339, -6045, 9862, -36625, 55367, 78520, -98847, -38084, 111971, 22860, -119242, 10631, 108824, -36691, -96712, 68574, 83951, -82893, -75747, 90220, 63873, -91338, -53477, 98397, 44310, -107559, -43030, 110046, 33922, -105587, -17451, 98238, -6026, -90542, 23919, 78863, -34086, -59098, 39782, 38333, -44039, -20043, 49327, 12260, -48334, -3532, 47732, -6330, -50830, 17981, 57038, -28327, -63224, 34592, 61368, -40064, -54670, 43680, 41980, -48667, -33994, 49571]
128D9571j9163p3180J7281O1139j5892n0119J6953M2986j9788l5952K2486K5646
140B1968k5570j2417K9310k720l2658J5475L2621k4706k9135L1837K3518l8056
152a0533j9826M2221J9784m2955k0026M1562J9629m0912j6928M1335J4266m0462
164a2845j1914L6317Q228k9747k848K2272k879j5021O220Q159q714j475J0576
177F329m689j2257Q856J5761j2346j8683J5116K1231j7674k3402K0371K5407k1516
190B504k6426K1795K4411k0373k1754J8769J9309j6758j6934J3334J3915r585
202B207j1418O626Q011l892m159J655K68L10L795k319p900M581J2500o559j5639
217a1933P120J7621p196j8360P234J8368o412j8656N344J8441l680j8225J980
$$ y = [49571, 30408, -42772, -25491, 35648, 19756, -30363, -13410, 29576, 9788, -26164, -3678, 21968, -3602, -16019, 13291, 10571, -22087, -6612, 26009, 1303, -27832, 4005, 27523, -10533, -30359, 11862, 31646, -11309, -31335, 10227, 29856, -11056, -27984, 13351, 27617, -12845, -24759, 11558, 19786, -9961, -12809, 9463, 6584, -8437, -2217, 5942, -2772, -4247, 6329, 1640, -10617, -1761, 14000, 1654, -17029, -1913, 19318, 1644, -21758, -1387, 24020, 2504, -23922, -2127, 22284, 1911, -19843, -1074, 18235, 1477, -15457, -2123, 11792, 2207, -9211, -2585, 5426, 1534, -2625, -970, -702, -392, 3403, 1084, -6816, -2235, 10265, 3706, -11933, -4813, 12808, 5612, -12748, -5514, 12854, 6442, -12214, -6870, 11571, 7891, -10334, -8354]
230h354J6980o31j5197j90J2372P92q736j895N163L271j370m118k152M492N030
245E457m764o910M367R207l766j1510K673J3353j674j4387K77J4858J088j4890
259f621j850J4027K521j2377l636J0423M956q324n340N781N891l746o102J870
273b527N716M19n128k804M265M907l158o737K077P885o81r106o62R359K291r591
289c475l257Q935M995q560n966P756O756o936o682N023P188l927o564J903O333
304C522m41n273j482M860K698l696l837K392M580j149n495p2O097J432n998l190
320e052O205L881n715m780N236N500m223n911L361N770j835o222P49N841M14n163
336a944j752M857K511m040l172K570M026j334m360K33M571Q17m728j417M312K476
$$ y = [-8354, 8626, 7995, -7202, -7392, 4980, 5772, -2964, -4859, 304, 3575, 2205, -1913, -4065, 427, 5457, 693, -6217, -1850, 7357, 3591, -7919, -5246, 8107, 6433, -7954, -7677, 7181, 8269, -6621, -8471, 5556, 8077, -4300, -7936, 2487, 7443, -881, -6221, -440, 5451, 1705, -4397, -2527, 3189, 3608, -1520, -4324, -59, 4848, 1690, -5047, -2970, 4915, 4234, -4872, -5534, 3825, 6116, -3475, -6732, 2203, 7198, -1362, -7328, 428, 7184, 248, -6434, -1411, 5777, 1850, -4714, -2811, 3522, 3081, -2192, -3674, 1186, 3884, 188, -3649, -1257, 3323, 2174, -3321, -3393, 2704, 4136, -1862, -5052, 1153, 5034, -681, -5461, -225, 5275, 1052, -4859, -1498, 4272, 2437, -3785, -3036, 2805, 3219, -1944, -3696, 1161, 3672, -368, -3540, -970, 3056, 1722, -2638, -2405, 2166, 2983, -1745, -3162, 1150, 3626]
352C626m205l065L179M263k365n019J758N049o34n218j13N038Q32m594j705L823
368F50K398k760l263K256L231r99l976M89M122K93m024j267L536K026k474k975
384b737K117L436j297m285Q57M585l18m712n76M530J268l664j865K929K564k572
400B60l254J869L989j472m065Q01L835k99k981n95K558J466j902k751J344L892
416B695j082m040O04L768j53l228p12K965J739l021k388K581L217k177l338J762
432h08L143j570l025R37L041K85k771j465K200K679k297k648J517L175j873k995
448b475J500K869k88k872q97K720K010k537k545K707K409k752k438K424K172j055
464I52k138l38K144J340k100j654K360J720k793j942K390K071j432j806j16K088
$$ y = [3626, -579, -3644, -465, 3798, 1433, -3586, -1828, 3221, 2587, -2631, -2744, 2294, 3126, -1468, -3173, 650, 3048, 288, -2975, -719, 2512, 1513, -2463, -1974, 2148, 2441, -1583, -2850, 686, 2712, 238, -2737, -620, 2816, 1519, -2766, -1909, 2676, 2358, -2354, -2930, 1600, 2868, -796, -2661, 268, 2832, 260, -2994, -1125, 2864, 1392, -2673, -1872, 1963, 1664, -1317, -1912, 646, 2112, 210, -2541, -1197, 2695, 1613, -2427, -1823, 1945, 1792, -1436, -2148, 817, 2556, -465, -2853, -272, 2945, 768, -2570, -808, 2335, 765, -2260, -1323, 1718, 2003, -768, -2233, -33, 2646, 349, -2299, -782, 2393, 520, -2475, -975, 1894, 1606, -1266, -2163, 557, 2567, 30, -2515, 192, 2601, -151, -2589, -165, 2007, 952, -1186, -1524, 620, 1960, -140, -1794, 566, 2286, -507, -2449, -59, 2012, 580, -1226, -1342, 746]
480G46P85k294j213L053J218l247j296K502J352j247j210M00J156K47j844n16
496a408L291M87l648j241K864J109j271p75Q9Q57J15j393l86L146l0l795N0K590
514F51K56r34k41PL69M71j623l85L124K54l378j2K231l89p39Q83m38K64j88j505
534a322J76L019l06l122O07J988q23j137J045q6K18L20j457n03K631o2k149P19
552b44J497j772n46J860L6n18O4j472o72K927L43k356J75J270q83k11P53k75K72
571B48M52j871K83K125o36j571Q92J295j680n25J279rL44q7j939K05K004N50j790
590d31J64O31r51J82N01K94J61l68j493P92J718o37j443O97R25r47k96J67M10
609G6O49l21p63l20J122m55j12L25N27p42l27o0L37P68n01q04M18O34k98q91Q68
$$ y = [746, 1531, -763, -1976, 1077, 2295, -952, -2248, 254, 1606, 359, -851, -451, 705, 952, -892, -1408, 1883, 2370, -1278, -2519, 345, 1454, 183, -592, -503, 354, 469, -924, -1310, 1836, 1806, -1989, -1939, 651, 907, -27, -268, -261, 108, 579, -1044, -1429, 1695, 1949, -1429, -1441, 790, 401, -338, 545, 107, 371, 183, -1322, -1146, 1873, 1567, -1555, -948, 1040, 217, -920, 125, 39, 257, 577, -880, -1383, 1248, 1186, -963, -244, 1253, -519, -1065, 795, 831, 313, 377, -1095, -1767, 1160, 1503, -853, -678, 592, -291, -502, 251, -24, 248, 700, -1171, -888, 1237, 601, -970, -78, 1217, -463, -988, 291, 282, 626, 539, -1400, -1195, 809, 1359, -431, -267, 364, -587, -405, 96, 390, 551, 183, -1310, -518, 1200, 563, -880, -183, 742, -205, -501, -334, 76, 725, 404, -359, -679, 443, -12, -124, 201, 728, -14, -341, -401, -64, 704, 203, -601, -183, 451, 153, -738, 130]
630A30L71m59l86k08N79Q09p70l85M89j2q59L89Q57K07p43n67k09J080M66p79
650@n81O83n1k37m9K06L98m27n70N77K94K54n22k23L97k10l52L16M15j72p5l14
672b43J01o3M69k63M8j07P7N3j66K57J40j80m04J5M02M3l04P4P7L69m49k59K37
695g6M95n8l53j91J3lK85j63j24K34m9n38L83P59l25o52J67L45j70P4K2o9M56
718D62m97l74L37L67j17j42n7j35K7L60j95k03K95L93r68J7J071m40m24N1K94
739A22j05K20n50M9O42n3o80J4R18m05m98K66J65Qj23l8l12N93k70n12N86J53
761A90J29m79j21Q0M30j19m19K32M31j3m85k0M22Mn05M1L77q3mm75M59m3K24o61
785d08J50N19k21k36O3K67J46l87Rj0L28j46j98K0K20q1j2M0j58L35k37j27J34
$$ y = [130, 501, 42, -344, -552, 27, 836, 66, -319, 170, 158, -701, -312, 545, 752, 9, -558, -767, 313, 779, 0, -581, 102, 51, -186, -235, -29, 369, -58, -628, -51, 243, 497, -25, -248, 149, -61, -413, -97, 318, 146, 71, -243, -142, -205, 264, 1, 49, -58, 19, 72, -94, 163, 303, 123, -281, -266, 136, 179, -125, -51, 26, 395, -54, -313, -76, 419, 361, 8, -183, -170, -173, 112, -51, -175, 59, 10, -528, -145, 614, 289, -363, -196, 149, -21, 53, 75, 6, 462, -35, -409, -72, 295, 178, 36, -21, -156, -129, 231, 36, -167, 128, 521, -447, -430, 641, 201, -223, -172, 122, 17, 237, -313, -264, 378, 325, -355, -341, 577, 172, -326, -60, 105, 113, -10, -48, -360, 233, -37, -549, 37, 190, 319, -160, -281, -201, 229, 110, -309, -77, 354, 341, -144, -164, 258, 262, -243, -202, 175, 92, 88, -387, 72, 29, 253, -408, -258, 261, 40, -196, -133, 134, 280, -107, -98, -108, 220, 74, -124, -104, 116, 35, 23, 63, -95, 240, 3, -124, 10]
808A0L02l67k59k2M61j25k75J66O5K39kk46j4J39R6l85K45K5%k03kO5R2J65k53
833h3q0J29k51J75J0L24Jp8l29K43J80l26Kj30M33l42J72l25N28o0j6l87K21P7
857H8q1l88J27M48k50Jn3M54k59j59l89L53O77k46n57K35l0M34o62J24L93L2m00
880a08j43L84J7k88O5q4L02N4l65N4N22j55k13k59L65N9j55r3j54N38k31Kl47
903b33M79q5m26L17O2k8j65j40L76NQm11L21k32J37l92K94K10Mm93L03Q1K63j36
927A19k44j51N59r8k73k25M91K72o32p8M87J94l10j38j52M66N5m32k91M79k99
948b01J96k33M99r7pm63K1L81K99l65j76J97J50k52j68k1M33m4k68l0P0M01n69
971b47r7M98q1l10nK64p2J93l81o7O53k08l60P6K49j26j2m69N02K55N2o71J8M38
$$ y = [10, 312, -55, -314, -336, 125, 0, -275, -109, -44, 195, 193, -53, -67, 72, 168, -217, 28, 53, 53, -150, -152, -87, 5, 170, -83, -163, -34, -285, -110, -100, 224, 225, 147, -182, 61, 241, -85, -83, -213, 220, -122, 50, -275, 253, 193, 177, -210, 11, 88, 7, -381, -254, 194, -56, -55, -108, 346, 87, -72, -461, -108, 569, 323, -234, 1, -29, 405, -257, -133, 260, 292, -108, -251, 133, 150, -138, -73, -157, 145, 199, -166, -112, 410, 255, 42, -217, 148, 207, 52, -41, -195, 343, 112, 114, -233, 246, 161, -265, 52, 114, 86, -79, -219, 157, 162, 170, -241, 80, -152, -15, -407, -113, 97, 101, -392, -89, -8, 255, 119, -125, -276, 283, 185, -88, -313, 178, 450, -182, -260, 227, 421, 111, -27, -179, 287, 342, -90, -381, 98, -201, -5, -238, 261, 164, 157, -306, -285, 96, 395, 30, -146, 51, 201, -51, -219, -240, 193, 149, -119, -149, -79, 322, -247, -344, 154, 73, -237, -242, 22, -50, 143, -238, -305, 348, 140, -220, -144, 105, -21, -33, -502, 0, 255, 307, -364, -346, 92]
995I2L6j16n2K31n1k14l52M07N68l71o61M50K81l22K7j23N74q2j87m71K90O96
1017F50m60n49L11K19m7l80K82K36q7l24l71M91P80n87m85L23L54o57J52K43j08
1038a4K69j55o48M64O42o80k36P74j53p43K78J43M98l7l47o43O69M67p02k62P85
1059C69k42l34M36j60p6L07m88j53M51Ml19j23R61k38q56L56q1K18N43n83k94
1080c02J87M59n32L35M46m92m69M68j52J52J89j70o03M63Q1m88J75L84K08l22
1100A7o3k73M14J80k37j95L3J38l94K25N07j89m29K65P1j9K66o82j9M54J59k45
1122a6k20J66n1J15m8l4J25j01j4n9N82l53l68K18L94l23k03j15J81K58R4k64
1144c6j69K18o4l36L42J28K0J08J4l96J20j06J3J12M43k89l63k3N47k57J81k28
$$ y = [92, 128, 12, -40, 191, 140, -74, -426, -19, 549, 178, -483, -33, 248, -74, -47, -170, 404, 322, 135, -336, -46, 650, 190, -359, -48, 171, 124, -256, 26, 262, 175, -149, -520, -29, 751, 164, -321, 2, 356, -301, -149, 94, -14, 255, 100, -548, -84, 558, -122, -358, 416, 263, -480, -202, -59, 439, 402, 55, -588, 81, 548, -154, -416, 369, 127, -207, 229, 69, -7, 300, -188, -341, 110, 114, -205, -328, 633, 395, -461, -105, -186, 32, 575, -8, -302, -115, 344, -188, 147, 593, 101, -368, 100, -52, 100, 289, 119, -484, -21, 60, -428, -253, 131, 339, 17, -46, -319, 95, 275, 38, -157, -124, 14, -380, -155, 352, 163, -266, -1, 70, 51, 317, -365, -384, 70, 229, -16, -236, -70, -121, -6, -54, -88, 37, -64, -78, -137, 445, 92, -276, -58, 336, 13, -190, -305, -124, 134, 228, -36, -205, 13, -51, -387, -45, 83, 103, 211, 225, -171, -51, -157, -144, -32, 411, 122, -241, -264, 283, 26, 207, -21]
1166b1k31J96K34k98n0N41k39l66P5K71k00j07J83N0J09k3k56j05L43K14m24Q0
1188b4n3lJ40qN7j52K83k71K10j41Kk39J69K68j44k05P1k3j68L54k85P3J86J98
1212B95m33j77L58L01k41R9Jk14K5q9P4J22j32j72j54M51J80k91r8O4k9J1J01
1235E2l45J50M26k62m87N45P3l99J41j7L50j77M3j93K75J96l31o5j90K38Q2j92
1257h7l0k02P39m92j48K37j30j5M1m7J38J18j41m2R5J57j79k49K23J06L5J12J1
1280B50j22k6j90P4N3K18k88j59L53l1Kl80J34J29J47l10M5M58k49j38r2Q4K1
1303a7l84L95M3j00K8J43K2j57J62l97M83l01K87k49j05K24j19L34n35q2M63J5
1325A53l56K3L61m2k83N3J27J46j52Q9m0j27Q8j05j71L51J00j40l7o4k5J18j40
$$ y = [-21, -252, -56, 178, -120, -170, 371, 132, -234, -159, 112, -88, -195, -12, 38, 147, 124, -132, -237, 106, 320, -104, -24, -77, -80, 60, 52, 109, -43, 240, -31, 179, 38, 40, -199, -30, 238, 94, -111, -40, -63, -231, 123, -162, -89, 97, 295, -138, -315, 43, 344, 103, 202, 203, -11, 14, -75, -1, 121, -11, -183, -337, 114, 294, 3, -95, -31, -60, -49, 52, -293, -143, 283, 21, -466, 79, 152, -247, -106, -123, 227, 50, 93, -100, 175, 371, 40, -25, -215, 23, 105, -87, -117, -319, 420, -72, -220, 17, -113, -128, -87, -134, 4, 122, -19, -61, 34, 191, 12, -237, -14, 92, 127, 239, 250, 128, 102, -88, -14, 39, 257, -31, -190, 163, 132, 134, -246, -112, 17, 164, -146, -101, 357, 108, -30, -122, -38, -17, -401, -6, 37, -63, -35, 108, 130, -27, 135, -262, 221, -80, 207, -42, -147, 77, -42, 292, -243, -325, 138, 153, -203, -180, 181, 139, -144, -91, 36, 182, 30, 119, 79, -48, 40, -65, -236, 115, 215, 75, 38, -26, -51, 67, -73]
1348g3L16M1l08l66j07N42K11k20j14P5M0J75m10J74K74j40ON7k57J13m2J04j06
1371a5J86l12K17j77l9K81mnL8k23p2J52J63j8N7k85J7M11m21lJ65j95K09j13
1395A4k65J90O9R1l43J33M22j30k80K64l56L20k89o7L3L73k20l99M85j51J53k81
1417b34J07K9J64j9k85K82n2J00l03J84k9J50k23K37J8P8l79j10M70J23k90j00
1439h2J36K68k33k75k5O55m26k27qN06l1l73p2L48n2q5r2j80J36L12l21k8K11
1462F2k78L22r6M6J66l76L64k03J6J15j83p8K87k1k66J6N5Q6r5J46j81P6J75k64
1486a09L8j7O7oj42Q0J20k6R5m2K82l08l23L04K07k50j73M29O8j80P2l07q8K23
1510A4n2p6L19k70j8J5k0P5k12P24m72k18J24J43j77p2P5k8PM8J30NK39m49Q9
$$ y = [-73, 243, 284, -24, -390, -497, 45, 256, 36, -78, -3, 37, 212, -198, -24, 250, 110, 116, 173, -84, 29, -13, 91, -15, 171, -141, 76, -101, -140, 141, 137, 132, 170, -53, -125, 27, 190, 172, 229, -56, -39, 372, -49, -52, 113, -82, 127, 14, -251, -61, 8, 99, -244, -111, 311, 181, -99, 165, -191, 129, -160, -227, -194, 179, -41, -440, 45, -106, 47, -234, -127, -98, 66, 47, -238, 44, -8, 92, -211, -27, -56, 94, -129, 108, 126, 204, -175, -285, 185, 308, 18, -82, 54, 322, 89, -186, -211, 444, 18, -209, -217, 289, 258, -115, -187, 161, 109, 24, -68, -248, -112, 200, -121, -149, 62, -216, 106, 10, 56, 222, -154, 210, 7, 23, 138, -45, -123, 164, 143, -123, -107, -52, 34, -61, 85, -96, -20, 155, -109, -71, -88, -21, -27, -169, -89, 31, 5, 100, 58, 340, 32, -291, 13, 220, -30, -203, 226, 294, 114, 186, -121, -209, 14, -38, -114, 205, -65, -83, -68, -88, -13, -225, 499, 27, -191, -67, 76, -101, -173, -98, -126, -119, -71, 59, 64, 303, -146, -57]
1535e7K95k45k43K83K97l04j73M2O9J37P2l80J13K72Rj91l8L44k90P1n5j31M7
1558e6K27l26J09N54l75m94K82K55k49J78k59J13L46j85k75J21L87k07j76J59
1578A29J23m16m3K59qK08k65j86M90M2k48j75J55K15k96J1P4l46K97q9j03M41
1600B69Oo19L66J74mk36R6M1n2J57J11m05J6J34k90r0K04J34m1K12L0j42j96K34
1624A09o0J70j99k70K00P4K80n48K94k51K91j24q4O1K34J92o46J02J74o4k08K82
1646IK05l0M2m27k9M26j97j28l83O04N2l24J17K6K41l20L6K07j10O0l04K57J19
1669A49j60o6j09J29Q9q0K84J73n68qJ21j11J05k9k74M25P3j93n3J39J82j22j21
1692b5j11K27R6k45P6j06K11o7k92K09kqK25j11j14m1m5j33M04K02k38m59L96
$$ y = [-57, 238, -7, -250, 33, 330, 26, -147, -105, -36, 101, 173, -207, -94, 178, 187, -4, -42, 302, 12, 83, 28, -103, -56, 171, -155, -46, 508, 133, -361, -79, 176, -73, 105, -154, -41, 305, 120, -155, -34, 353, 146, -30, 129, 252, -164, -207, 52, 44, 252, -13, -199, 291, 333, 85, -90, 65, 280, -16, -5, 69, -277, 20, -69, -172, 269, 275, -344, 22, 196, 192, -44, 52, 93, 41, 198, 309, -96, -80, 54, -236, -326, -122, 12, -29, 183, 213, 71, -125, 109, 49, 219, 20, -250, -50, 24, 304, -244, 50, -201, 90, -34, -118, -57, 177, 369, -277, -175, -1, -65, -273, 9, 214, 184, 226, -201, -230, 196, -1, -129, -512, 92, 144, -180, -63, -37, 204, -116, -80, 127, 17, 77, -227, 30, 149, -11, -77, -186, -57, 32, -48, 236, 409, -159, -167, -46, -157, -52, -81, -355, 70, 143, -50, -103, 36, 218, 96, -25, -136, 91, 187, -58, 18, -88, 123, 56, -236, -27, -29, -37, 188, 77, -37, -78, -123, -256, 148, 350, 112, -347, 49]
1715D9R9j10q1J94j65J85j10l11L04K51l32l50K84K15j61o8K48l9j57M9k93J20
1737a79K74k53P9J30k7k35Q9J82J01j46k78L01q1K42j27m94O10J95m67k30L46
1758C2p4J27m82L74K07j87N8k42L78j04j96k83L72K56n7k44K53k25K36l24L9M46
1780C60l13J1m47N13n5P8l60K52J65k36p3M8K03Jj66k39N92r8k38j95K25K27k57
1803bN2l1L56l47k74Q4M76k14j51LkM71p80R3M25K72n66J9J97J92m61J27k55M48
1827A32l7l7j90L20Q2l51k11K78L13l10j11K35K49k40j81m30N83K93l61n31O37
1848A32J79n31N9m8P29m17l52J35N27k23k19j90L83r2j37n8K01J46r9l56%N09
1870B78jm00oL58R4k34j38o5L56m76k79L79K89P3l09j9L36pl12k70N43J27k34
$$ y = [49, 148, 38, -43, 151, -14, 171, 61, -250, 54, 305, -27, -377, -93, 122, -39, -107, 141, 102, -55, -6, -299, -179, 95, -158, -79, 51, 24, -211, -122, 60, 161, 15, -263, 38, -43, 199, 72, -422, 188, 383, -84, -314, 32, -42, 85, -397, -23, 184, -3, 55, -187, 191, 87, -109, -392, -20, 236, 179, -65, 188, -37, 199, -125, -86, 360, 47, 58, -389, 124, 69, 147, -213, 39, 204, -32, -105, -57, 146, 147, -19, -258, 334, 236, -2, -197, 28, 255, -2, 50, 19, 375, 28, -246, -162, 314, 100, -51, -48, -50, 421, -359, -266, 159, 431, -135, -116, 81, 273, -188, -61, -316, 132, 95, 58, -132, 188, 270, -81, -292, -14, 299, -11, -122, 113, 362, 122, -59, -489, 94, 387, 26, -505, 132, 311, -220, -161, -209, 520, 103, -249, -114, 413, 190, -29, -219, 164, 72, -65, -123, 78, 224, 125, -231, -231, 278, 277, -123, -129, 229, 323, 89, -49, -114, 242, -234, -513, -134, 155, 228, -81, -100, 236, 229, -83, -353, 190, 317, 83]
1893H3l39K33L83j48n93K69J23K22k09k54K45J01j90L4K34J96j85m43J72M57k25
1914A66m04Q2L23K06m52k82N75J2J6m35J22M45n24R1j37M56j76l48P5L24J81m70
1936a54k83N76K32l10l04N0L66q4k34O2J25L71m79j96M88J34j94p13M01L34j20
1957F8k91J32K40L3n3k35o8M78n34J45q5O68n32J07l18L06M05p10P1O3M74n39
1979a75p4L14m9l7j69J08K24j51J91k44k2J90k05j53L90ll9q4j20L36qr5l19N66
2003C72j84k25k69M18Mk72j4K14K00p3m79K12K79j59l48l8K75M29j31k78J21Q2
2025A36J87o06J97L5L0k17J64M55j88k06p3R0j04J72l40J58L99k58m66K35L69
2046A69J24n52J60R7M0N8l32N2M12k15n16M30J74l3j95KL18R5j93J8k35j5m5K
$$ y = [83, -256, -23, 360, 212, -381, -112, 11, 233, 24, -230, 15, 116, -74, -40, 194, 390, 205, -238, -66, 391, 166, -238, -156, 167, 373, -79, -361, 214, 226, 242, -193, -71, 374, -150, -59, -196, 260, 84, -264, -189, 135, 316, -154, -437, 139, 371, 61, -243, -193, 173, 89, -145, -83, 42, 413, -66, -262, 226, 360, 166, -547, -146, 188, 68, -223, -91, 149, 182, 129, -106, -174, 304, -230, -85, -170, 498, -34, 73, -245, 61, 466, -244, -173, -110, 364, -175, -249, 65, 16, -21, -190, -82, 142, -9, 182, -62, -84, 106, -99, -252, 138, 135, 96, 12, -108, 228, 220, 125, -194, 372, 188, -37, -306, 112, 116, -156, -170, 44, 244, 171, -308, -96, 183, 24, -324, -362, -87, 342, 211, -67, 54, 136, 323, -283, -86, -51, -21, -238, -74, 381, 193, -13, -86, 4, -100, 72, -268, -110, 289, 31, -435, -200, 169, 293, -259, -99, -2, 38, 96, -236, -184, 228, 13, -503, -73, 101, 68, -127, -125, 193, 288, 95, 113, -122, -137, -182, -180]
2070a80n8K17J78j80l9K22k2l10k5K54Mqk59L6Q4k3J29O0J04J25l46k26N13j20
2094A30L1m20L03K63k13j29J05L3J44k00k44L86j02J52j15l4N2N1m66K54L90m08
2116c7l36L57L56k77j49j8J74K57m22J90o0M30l48qj43J08J76l35N9L2L69m27
2138e2l15M52j31J70l48N7K57J6j55M1K09j15k00P8J01j09N8k78K26Q7k00j55
2160c06K09N9J07k36j93O67j61q7J6j37K30k07j10J82R2j33k34K7J89M2p6m0J41
2183D1J5R6j86J82r4Q9k68J90Q0k58m5j7K59j33j0j22J12R4q9p1K36k6L5j12n1
2208e3K08l13j92K32K25k9n4m7j54L63r5J1j55K05j95P5j03O5k60J52o3L56j50
2231B9J69j27J04q9k56J12mL02k84j89J18J99J08l6j42kR0j36J49l01M17on4k89
$$ y = [-180, -238, -21, 157, -23, -62, 160, 138, -172, -197, 57, 61, 53, -206, -170, -86, -109, 20, 80, 184, 309, -37, -263, 250, 130, 161, -259, 44, 307, 94, -35, 70, 103, 247, 47, -197, 189, 87, 239, 124, 90, 142, 193, -273, -19, 371, -37, -373, -16, 340, 63, -86, -104, 70, 327, -95, 95, 35, 465, 117, 109, -34, 74, 250, -85, -26, 6, 375, -52, -367, 85, -46, 124, -224, -167, 90, 106, -49, -8, 201, 86, -114, -36, 65, -44, 14, -264, -38, 49, -151, -306, -97, -38, 69, -167, -360, 307, 146, 59, 75, -62, 168, -39, -149, 33, 125, -8, -242, -215, -26, 16, -60, -100, 41, 56, 152, -34, 148, 54, 143, -125, 65, 145, -113, -158, -175, 84, -49, -59, -181, -69, 25, -64, -135, 101, 75, 110, -2, -53, 155, -158, -350, -118, 107, 78, 24, -23, -177, 186, 91, 102, -53, 152, -43, 32, -71, -6, -266, -114, -177, 179, 29, 198, 71, 175, 86, -170, -58, -62, 240, -44, -233, -115, 84, 192, 156, 14, 12, 102, -34, 115, -186, 231, 225, 171, -118]
2255a18O1n8k19J32J09R6j51j07L14r7L29l09n1J58k1j29j25L48k41%J60o3L2
2278E0o0M1K01l58L49l77o3N82j70k08K08kk09Rj49L09j56J33j96J90m3Q2k25
2301f2j20L41k31J31j96M12j98O0l91J97P7L9p7M5K68k52j60M5Q5P3j4j75J99
2324I6o4N2j28M7O7q1p7p3L02K0j97j27O3M4j79R7L2J30k55J83J28q3NL0j10m4
2350a22N9K45n9k62N3O4n3Q4J88J55m77L74j87P3j49k40o5K70k24Q4M37l9j79
2373C0q0j47M41k17j61K13k38PK06k99K52j75j52j8M27J06J64m37Q3Q0m6j10J93
2396A22j97k4J43L2O6l3q0Kj88P3K02j05k17o6J73J99J85n23M28q9k62J57P0P6
2420A44j99j98J62l1j7J31J44k51l5J59R5k29lK77N4k25M02l82j36M0J06J38j31
$$ y = [-118, -57, -115, -334, -202, -93, 3, -148, -255, 59, -38, 291, -18, -69, 89, 68, -61, -186, 162, -79, -79, 81, 18, 50, -10, 31, 232, -126, 223, -154, -217, 365, 195, -13, 195, 193, -16, -7, -156, 153, -3, 130, -66, 124, 81, 163, -62, -182, 159, -72, 59, -137, 275, 77, 137, -254, -57, 20, 59, -18, 27, 295, 43, -117, -72, 13, 86, 72, -103, 96, 32, 84, -44, 3, 70, -11, -88, -161, 141, 161, -36, -163, -100, -56, -235, -138, -106, 24, -231, -48, 80, -3, 2, 32, -78, -122, -63, 182, 123, -139, -86, -22, -75, 9, 197, 352, -125, 249, 62, 135, -14, -254, -319, -49, -273, -189, 248, 209, 30, -50, -197, 244, 27, -134, 79, -159, -152, 54, -245, 7, -168, -320, -338, 89, 195, 359, -78, 5, 85, 39, -71, 122, -75, -99, 44, 76, 142, 109, 29, 31, -157, -84, 118, 13, -204, -270, -97, 102, 287, -236, 192, 103, -159, -2, 68, 144, -55, -253, -91, -122, -139, -8, 136, -115, -150, 9, 104, -125, -128, 149, 203, -22, 380, -2, -138, -98, 8, 146, 15]
2443A5M1j76N1%P8m5P0j10O0p5P1qr3O0l9L4M2k11L93k4j76j42j41K85R9J78j86
2470E1J86j39q1j03J30k50R2J47l9O3j17n7R2K3j54M18m60L17l77m2L61k28L89
2493B22j05mk67Q6p7J85j02Q6k0j51K46m7j47O0R0nn2j28N8j51K30K07p8m5j55
2518f4Q0q5j37J3J47ol4R5j67L74j1j34j18J67M0k90M7r1J22J59j78m4J24r8P7
2543a2j23L03m3r8R1L4m5j89Q0k29j5K61j4j0j14J39k00O1K19j81K03J26l10J95
2567A29p5k35L99k32j49L28j31J84n13K98k44L09L4m2j03j4K71l45PJ01J07j81
2589i7J14Q5k37R1r0J84j59K37k11j26K1K43Q1J01k87J37j83J1K9J75j04q6K04
2612A33l01m7LK50k20J12K13Jj32k1J25J3j57J14k60R7P0k12L2K22Q1j2k97J40
$$ y = [15, 56, -120, -69, -69, 9, -36, 34, -76, -16, -91, -20, -28, -121, -61, -100, -66, -24, -235, 158, 134, -42, -184, -325, -40, 59, 237, 51, 237, 98, 17, -86, 44, -206, -114, 33, -6, 57, -60, -117, -25, -2, -156, 262, -198, 119, -258, -300, 61, -167, 222, 117, 113, -154, -68, -145, 40, -62, 24, 4, -147, 99, 52, -95, -35, 55, 50, -2, -130, -72, -223, 7, 214, 136, 91, -64, 16, -69, -206, -193, -46, -52, -86, 9, -158, 216, 205, 71, -47, 120, 160, -130, -83, -174, -52, 107, -71, -115, 9, -89, -12, -135, 168, 125, 27, 118, 152, 107, -82, -2, -231, -246, 15, 1, -9, -123, 16, -184, -123, 96, -85, 118, 244, -66, 129, 54, -181, 218, -14, -163, 165, 34, 218, -295, 3, -241, 68, 102, 60, -43, -57, 214, -131, -124, -23, 84, -97, 17, 102, -135, -44, -134, 50, -109, 128, -83, -209, -188, 55, 136, 237, -50, 87, -96, -85, -56, 119, 15, -71, 133, -168, -215, -212, 38, -182, -70, 143, 144, 12, -9, 116, 129, -28, 86, -174, -77, -7, -219, -187, 35, 116, 104, -193, -53]
2636e3J13j19K45k89m8N5k47L17l5P0j7J20j68p4J40k4p5K31k78P3K47j01n7k00
2660a74M40j16r4m7r7J45j16jm7O8l6J96R1o1k00J64l4r3R6j83J33o3j9j28L46
2685A70l13J86N7r4K3O5J22l14R9l2K6j8j31k9J16J86p3k32K30j7L5k07J49N9
2709F3j80j05L37k08K20j25nP7p5jj47K20p1K32l78K50l41R0pJ30P5O2k34J53
2733C2n3J05mr5J19j26J42j36j24J27J5J2j61K24p2J61k01oJ15P4k8k68R0R7j60
2758a21K55l10J71j17J36j6J34l21n8K06K9L0N6k96L71q7K5j81K1oj31Q8J68k47
2782b01L06k01J20k7J26J5j21j7j75K03P0j94J3K71l33J43k20L37l3q6R4j95J62
2805E7k3n0Q8r7L19m26O1rJ70m2q2J55j13r1J65l1j3J9O9p4q1J2p2L76o09L80
$$ y = [-53, 60, -59, 186, -103, -151, -96, -343, -26, -61, 9, -8, 112, -56, -130, 10, -14, -89, 142, -136, -63, 184, 83, 26, -174, 266, 150, 56, 9, -88, 57, -59, -60, -107, -39, -75, 121, 212, 151, -49, 115, 81, -12, 84, -99, 34, -29, -48, -176, 170, -143, 43, 100, 6, 29, 94, 216, -98, 1, -31, -5, -23, -154, -183, -67, 119, 46, -186, 44, 27, 62, -145, 4, 63, -117, -222, 115, -93, 127, 2, -3, 74, -1, -2, -149, 71, 0, 232, -146, 104, -237, -147, -154, -24, 51, 113, -121, 32, -21, 84, 80, -15, 104, -22, 120, -16, -140, -13, 2, 14, -147, 77, 5, 166, -35, -41, 74, 148, 120, -148, -58, 39, -121, 134, -176, -5, -122, 14, -2, 132, -189, -247, -41, -12, 18, 74, -222, 149, 62, 87, -94, -73, -79, -210, -122, 46, -201, 105, -96, 24, -3, 123, 138, 17, 0, -175, 28, 98, -96, -83, 188, -145, -2, -222, 115, 82, -4, 90, -105, 57, 34, -16, 72, -25, 294, -132, -71, -80, 90, 48, -34, 121, 8, -83, 82, 51, 38, 57, 126, 52, -29, -17, -89, 287, -322, 58]
2831E8j39j60L14j40J7J93k61l2J55j2k44K54o4Q7O7j09l4J35n8R4rRl06J95K3
2856C3K61j04k29L03k29l6j1O0J17j71n3K36j25K02n37L42k04J86k26n2J33N5
2878d9M58k81k24J76P9k14K29l56K53J4n1J1K5j81N1M7o5J83j93P8j49J54J9P
2902B1J9j6r2M57m77%l8L8k17M45O0ok34L1pL1k19J77J81k20N3k19K30L7r7J54
2928I2j37P1J65k19R9p2K03l33J13j33M00k03j35Oj61K31N5j04J93k95o8K80j27
2951g9l6K25R6k90j62L12l75L35l5J14j14r7J76rj36L78k44k83O0L8K05l17M35
2974A97r7j03K01j30j05J3Q4k25K01J2j67K8O9Q7j14K26j26n6J80k14J15k23J48
2997Aj0O1k13O0K56k23K1m3P0N9p5O5o4J06Qk63J38Q6j53K01l1K8kk08J85j4R6
$$ y = [58, -81, -241, 73, -67, -50, 143, -118, -150, 5, -7, -251, 3, -61, 26, 93, -16, -50, 85, 27, 121, 112, 121, -185, 10, 33, 294, 190, -39, 264, 35, -1, -12, 48, 165, -6, -59, 177, 52, 254, -283, 59, -145, 41, -185, -237, -104, -49, 409, 128, -96, 80, 159, -55, 174, -182, 71, 85, 34, 45, 70, -111, -60, -13, -78, 105, -88, -10, -159, -5, 14, 21, 40, 24, -68, 389, -88, -88, -126, -88, -305, 140, 200, 194, -40, -9, -16, 15, -204, -27, 154, -66, -13, -232, -2, 35, -62, 92, -45, 26, 191, -28, 71, -1, 202, -131, -18, -151, 249, 46, -89, -83, -244, -13, 42, -62, 131, -164, -232, 48, -79, -115, 110, 206, -84, -246, 66, -309, 26, -9, 105, -9, -106, 70, 61, -75, 303, 59, -224, -164, -126, 79, -238, 197, 100, -3, 198, 68, -37, -24, 60, -165, 36, 48, -119, -91, -22, 65, -49, 177, 51, -5, 175, -39, 76, -147, 1, -9, 52, -161, -101, 155, -68, -47, -90, -20, 39, -36, 29, -35, 71, 79, -184, -46, 40, -113, 88, 57, 85, 83, -125, 60, 46, 142]
3024A42j45K70k64J72N1r4j83l2J23P8p7q0J59j77J65q7q5K81q8n1N4k17J13K23
3048B51q5M2k30J28j18j38J95J4k3Ml29L79j56J61o0L1K0j1j09J22J11Nj62j60
3072a18K89j52j37rJ80l20o8N10j76j31O4J76n0O3jj30j19L42q0k34J54O6j67
3095d8J78k11p5J40J23J02l5k27J46j5R5o7n4j97m3J8K54P2l25o3J86j03l6K98
3119A13N7k42j18P8R2R4k05o9L32k56MK89j51J22r1j24k21J23P1J58J50r2j58
3142d4J21l13J97PJ33j00q2P9L17k60j72Q1M7K6L6J1j43K89l37PJ87q7J77M1j43
3167G5j10R2n0Oj31K10J18k35P6M0L6rk12L35m10J63J1J61j63J25k33o0K93l51
3191b23J56j57M00q0mk27J82m1m7Q8LR2k16MJ39j41J74k12J40J95k05j61J95N8
$$ y = [142, -3, 267, 3, 175, 226, 132, -51, -83, 40, 118, 41, -39, 120, -57, 108, 21, -64, 217, 129, 78, 132, -85, 28, 251, 166, 208, -22, 106, -12, -150, 45, 59, 36, 40, -289, 90, -66, 95, 35, 66, 86, 75, -34, 88, 199, 204, 42, -118, 171, 19, -118, -127, 53, -267, -335, 175, -1, -132, -68, 108, 58, 121, 120, -10, -129, 213, 133, -101, 53, 119, -48, 130, -81, -156, -16, 107, 209, 174, -53, 93, 78, 173, 106, 52, -145, -188, -170, 84, 156, -169, -232, -46, -149, -185, 113, 170, -72, -190, -112, -20, 74, -131, -200, 132, -124, -120, 169, 18, 140, 49, -75, -296, -173, -102, 56, 206, 114, -44, 77, -236, -39, -32, 101, 1, -81, -2, 315, 55, -117, -36, 11, 37, 73, 84, -59, 230, -107, -100, 87, 0, 177, 218, 75, -35, 57, 7, 13, -118, 92, 210, -25, 51, 91, 127, 118, -94, 241, -169, -6, 5, 166, 3, 128, -105, -165, 128, -223, -67, -224, 176, 96, 92, -135, 47, 6, -41, 47, 50, 142, -74, -70, 69, -72, 102, -110, 30, 225, 20, -141, 54, 112]
3215A12k22K5k04J24J21P6p4J09l10K3mL46nn4J4J94n2j84op3K1p2L42j77k84
3240b14L06J9r4p3n4K62l31K71j00j32J81r1j28M22r0N4r2k48J50j11j72J24K39
3263I8j27K7q6K4K33k61P5q8k31L07K80j64O5j50k5L9k27K69j34M8j2J2O7RO2
3288A10K2j63R3j5k9l6J29j65P0K58k31m2j30Q4K2j25J31Jj1J59J11k51k12J93
3312b7R4K1j14M9k01K04j02J76J83Kk32R8k61L2R7j80L14j55Q1q0K91m53M2J79
3336E8Lj37J21J00k3j77O6j57N8KO5qQ3j29r1K00j46K05n2Qj05J58j53L4j13J18
3362a2N8J7Mk8l24L39j22j16J50J68j97m3q4K70m3K66l78J55r3J30k39O2K60l78
3386a78Q1J52J1j14j62K82p2q2L4K4m5o5j82K31j16R4K38j16J00n7r4k03oK87
$$ y = [112, -110, -85, -289, -165, -44, 32, -42, 67, -243, -220, -224, 122, 117, 63, 77, 271, 219, 35, 29, -44, -23, -95, 247, 70, -214, 92, 111, 17, -56, -110, 152, -179, 92, -8, -140, 41, -50, -178, 244, 154, 208, 116, -132, 18, -93, -265, -141, 98, -29, -2, -88, -64, 169, -92, -17, -105, -336, -29, 251, 87, 152, 2, -23, 16, -211, 58, -76, -28, -40, -28, 39, 48, 110, 132, -31, 62, 47, 18, -18, 111, -54, 16, 274, 43, 1, -129, -45, -23, -148, -17, -16, -27, 132, 243, -8, -220, -27, 67, 88, -26, 23, -178, 26, -76, 100, 283, 285, 53, 151, -110, -78, 19, -161, 153, -2, 79, -1, 290, -163, -121, 58, 61, -76, 45, 145, 122, -55, 11, -146, -88, -86, -21, -29, 54, -75, -166, 34, -112, 93, 41, 49, -56, 102, -51, -17, -130, -12, 46, 63, 67, 39, -285, 54, -68, -184, -34, 134, -63, -106, -190, 80, 37, 303, -75, 80, -13, 117, -122, -60, 200, -178, -97, 55, 66, -48, -210, 72, 0, -82, -48, -24, -69, -134, -316, -85, -201, -107, 131, 15, 115, 58, -36, -239, -245, 42]
3410D2R1j82qM7J88q8p9j86L9K34k29N6l2J33jN9l0m1rk07q2L25J23r1k47K44
3436F9K2N4o2j92j42L16o7Jn1oJ88j83j4Q7N6k03J18k4j11N3P2K06k82R1j08M0
3462g2O0J9j41J76j75J69j78N03n62J1J65K19k08L08k58j06j00r7L1Q6M28k57
3484B1p9p2L3k3J89q6Q0k24K68j48n2j56M12j65j3p0J42M3j62J96k55K39k6q2
3508A0j36K16K3o5j55P2o2J88k62oL06j82j69J06K8J69O8j15j72M78j34j52jj08
3532e5lK40N3k34K06k25k13L37k56l2M6NlJ92m4k1l9N8j24J08j05m8K21j86J71
3557D9r5J71k37J04L1j05j20K09j51J71J01k88QJ27J94R9j81nk89J94j78K37k55
3580b09K73Pj48J41l9P4l57L27o3P3J89k73k11K29L7k13K71j32j7P4M1M7p9J9
$$ y = [42, 133, -49, -57, -10, 178, 90, 11, -175, -136, 98, -131, -75, -107, 26, 25, 84, 54, 13, 4, -203, -285, 40, 163, 72, -175, 69, 91, 145, 83, -109, -251, 65, -2, -1, -52, -58, 130, -53, -67, 20, 76, -127, -9, -33, -144, -91, -19, 187, -95, -4, -112, -72, -12, 7, -134, 42, -133, 36, -142, 361, -201, -190, -25, 194, -14, 294, 36, -70, -170, -267, -236, -150, 278, 21, -58, -130, -97, -120, 69, -17, 63, -161, 107, -41, -93, -249, 163, -2, -15, -85, 57, 100, -62, 134, -121, 118, 92, 10, -126, 90, 113, 48, -107, -35, -97, 91, -171, -177, 129, -53, -222, -116, -88, 81, 149, 34, -138, 340, 206, 54, 53, -55, -58, 182, 235, 1, 207, -18, -231, 106, -150, -182, -136, -131, -134, 58, 14, -7, -46, 12, -112, -4, -109, -157, 64, -122, 49, -46, 125, -112, -8, 23, -82, -202, 7, -144, 27, 128, -160, -152, -25, 169, 268, 87, 82, -207, -13, -191, 46, -209, 64, 71, -77, 64, 25, 99, -258, 69, 6, 79, 268, -5, -216, 13, 50, -163, 108, -24, -41, 33, 74, 121, 42, 61]
3604F1j9J7j37Q7n0k0O8l1j63K12j34r8K91j97o7O1J87oL3n1qk14Q9L70j85r2
3630DM2l38J81Q2q3j3K63j06k0M7j73Q6J32mj74r1K13J39n9K45l98j87L01k50
3654a61J53J3O8n5p6K59j43K15k31k39K12k57K98j77J50J10j27R8j70m4N6k87
3676c35J46L4L5J63o3N5j6l6p8J81l05J59j5K67l06n5K95j53K35j07j42p3J81
3699F7j58L04r8k67O6l3L93k21j90K44k37j41M73l20J38N1J85l59J47Q8m96K68
3721i6J80j94K14L6j04J11j72O0J62o0k61J85J6j46j18K23M7j49J23k32J32j23
3743a66R0J16q1r9M96j58j82R6j58K72j72j8K3j64J15r7K8M18m13J06m3q2m6p9
3767a98K83l25K50J67m70N69n33K58J22k96J28Q6K0j07J61j04N8N4J6j91K39k32
$$ y = [61, 42, 59, -78, 9, -41, -61, 7, -24, -187, 25, -109, -207, 84, -113, -180, -119, 68, 62, 95, 44, 36, -178, -89, 281, 96, 4, 46, -292, -111, -29, -112, -125, 138, 32, 12, 59, -114, -28, 104, 100, -74, -165, 48, 187, 128, 373, -25, -212, 89, -161, -8, 5, 73, 18, -58, 201, 58, 273, 42, -197, 15, -242, 56, -121, 29, 139, 12, 110, -60, -104, -48, -335, -189, -155, -120, 43, -20, 35, 19, -17, -95, 86, -219, -60, -75, 192, -114, -169, 126, -27, 208, 101, -41, -114, 67, -91, 213, 115, -152, -86, -119, 274, 53, -137, 107, -130, -271, 202, -118, 20, 71, 256, -103, 44, 132, -364, -96, 84, -110, 104, 140, 36, 147, -25, 35, 197, 137, -124, 61, 77, -69, -187, 36, 83, -66, 57, -175, -43, -166, -76, 40, -41, -140, 356, 198, 16, 112, -46, 226, 54, 36, 59, -105, 10, -87, -59, 359, -54, 52, 9, -73, -119, -198, 85, -240, 10, 177, -293, 276, -257, 1, 123, -173, -45, 41, 61, -46, 115, 11, 69, 123, 139, -52, 187, -45]
3789d5j03K94j87L4l9l30N26j23j1j59J27J3%r9Q0j59J77j06Q9Ml7J64M5j38j43
3814a26P7l8p5L08k88L7J41k78L32p3M0q0J68M2k98P5L0N4k16J28K92k92R3r1
3838c8m0j1j26L6L34o1J0j91PJ61j84JL22k05K64k19J79k38P1r0N6j04J32j40
3862g4m05M93K3j26M6J67k6o7p7J81p9M0K2l1k7r7k42K89j17Q4l1R0k5j44J15
3887a8J14j32J52k62l8K47n6r0Op3K26n3J68l73mM30m99L34m8J67k69k4J57N2
3911A14o9k9R7j78J17j55Q4N4P3j30p2J52N0M4r0k4j58J74J1J04l5k24J5J75j96
3936i6K75m16J02K09oJ96K0n62K46J8K2l0O5n5N0j67o2J69L34j42q3l42R4K68
3960A07j02j9n0M5L6o9MnR4k3K8L2o8j23Q4J72j45J13l83%K89J27m68J45J15K12
$$ y = [-45, -148, 146, -41, -7, -46, -376, 150, 27, 16, -143, -16, -3, -3, -102, -22, -181, -4, -110, -21, -17, -54, 110, 155, 17, -126, -49, -87, -162, 146, -142, -105, 36, -242, 90, 17, 57, -23, 145, 187, -111, -36, -6, 48, -168, -40, 252, -40, 53, -38, -78, -89, -215, -179, 155, 94, 104, -87, -80, 81, -103, -102, 220, 15, 279, 60, 239, 1, 72, -18, 38, -66, 66, -74, -479, 14, 37, -89, -43, 124, 98, 31, -46, 135, 56, 96, 118, 87, 60, -37, -279, 10, -107, -23, -54, 36, 11, -133, -18, 96, -36, 116, -146, -184, 63, 7, -83, -77, -150, 76, 23, 191, -182, -186, 244, -255, 79, 31, 198, -71, -95, 62, 114, 45, 16, 113, -65, 52, -103, -19, 35, 108, -22, -94, 58, 108, 152, 62, 38, -120, 54, 65, 169, 134, -90, -75, 100, -96, 179, -237, -135, 74, 68, 264, 284, -278, -32, -14, 8, -22, 43, -12, 38, -129, -191, -22, 312, 170, 87, -255, -161, 107, 5, -14, -64, -19, 17, -52, -48, -53, 41, 18, 46, 78, 10, -113, -29, 143, -2, 111, -272, -272, 17, 144, -324, -179, -64, 148]
3986A48l40R6R0J76p4l46K65Pj90M58m05j39K55r5J31Q7j06m9r4J62l54K07k6
4009a36J75q0kJ87l02j06L70K84l12o7k05J54n8l5K21J8p4NJ96k12mj37K90j30
4033D0k13L13k53K51k26J20N9j31L5j77J4K29j30J34j9j85K22ol09J43J28J58
4055A97j93j46L45k07n3K07n5j49j29J25K3p0L4K5j59L94j05pr9J38k14K6j25
4078a97L76K6j22k2k68J19J22o3K02k94L69k11J13r7R3J37l30O4j00r6J73K9o4
4101d1J4J01k92J58K0J84r9l0K1j55O7n8K71j13lR6q2j7o4O6J22j6kj95j66J40
4127g3Q2R4l8J4l13K30j09m1R4R7j38J23Mj06P6k07N37m12oL12j8k30K08n8j79
4152e7K38j09p6L58l57K12k87o7j3L93k6j42N1m4r2q3J55j40j47L11n5m3J11J16
$$ y = [148, -192, -96, -6, 170, 96, -250, 15, 22, -168, 290, -115, -254, 1, -94, 37, 124, 18, -31, -125, 37, -317, -110, -136, 39, -41, -43, 144, -158, -264, 106, 390, 78, 11, -194, -40, -98, -133, 88, 106, 32, 37, 233, 21, 17, -120, 170, 40, -173, 140, -113, 138, -88, 32, 91, -40, -5, -182, -168, 61, -69, 65, 46, -139, 83, 77, -232, -89, 39, 197, 4, -142, 203, -4, -57, 150, 95, -54, -183, -58, -35, -105, -71, -46, -205, 189, 84, 77, -22, 116, -98, -72, -197, 179, 205, 83, 61, -207, -88, 34, -29, 173, -121, 248, 37, 150, 53, 146, 283, -47, 17, -83, -179, -6, 23, -41, -27, 74, -218, -60, -40, 144, 45, 15, 36, -119, -52, -110, 161, 48, 45, 141, 59, 42, -22, 44, 166, 150, 148, -47, -213, -73, 9, 103, 65, 79, -234, -4, -113, -154, -60, 37, -101, 22, 26, -80, -4, -211, 326, -86, -92, 220, 202, -28, 180, 122, -57, 181, 72, -4, 354, -3, 209, -78, -145, -158, 235, 209, 67, 118, 74, -18, -101, 54, -86, -233, 78, 23, -20, 91, 207]
4176B07l29Q6l8J08Mk02K57j04J17k84J32m8j02K03J32j79k98M20J9k6j0k76J29
4199h2J66j03j2N8j53J01j31o5K09j04J25n9J0oK16j40j38K26m01n3L14J91m15
4222b46L15j48l51L99O2J24k05J61k67OJ24L22l00J36k39K9J75j40K53l80j14
4243b84P2K95o4N5P1L7o8j41k07L77k86L60k03L7j32K10r3j72K04LPO8q0K0r9
4268a3J41J0k81m5Q0L30K0k73N8J93l72K48P2k07J9L4j37M5J46j93J19r5o2K15
4292E2k24j05K62j6J64k14J39K4j46J09l35J40J92nr1m7QK58n13M47j94J81Kq1
$$ y = [207, -122, -36, -74, 34, 38, -164, 93, -11, 106, -178, -46, -94, -196, 7, 139, -40, -338, 82, 101, 75, 65, -211, -82, 84, -19, -31, 27, -126, -25, -156, -221, -12, -116, 9, -50, -40, -46, 170, 30, -108, 118, -283, -336, -22, 169, -246, 69, -79, -430, -31, 31, 155, -50, 111, -156, -150, -26, 296, -4, 132, -107, -78, 97, -43, 210, -170, -284, -212, 83, 19, 74, 145, 182, 114, -27, -234, 143, -143, 217, 14, 51, -81, 129, 36, -136, 68, 71, 78, 146, 66, 86, -13, 128, 138, -143, -188, -108, 222, 242, -31, 27, 220, -152, 96, 168, -39, -20, 14, -123, -78, 68, -125, -6, -101, -163, 52, -172, -277, -15, -31, 133, -81, 58, 82, -64, 45, -290, -150, 42, 37, -54, -101, -93, 165, -348, 99, -95, 86, 88, 7]
$$ [...]
8191b5
##END NTUPLES=NMR FID
##END=
