##TITLE=1H_SR90_k_vak
 CDCl3,8 sc, 
 25.10.2021
##JCAMPDX= 6.0         $$ Bruker NMR JCAMP-DX V2.0
##DATA TYPE= NMR FID
##DATA CLASS= NTUPLES
##ORIGIN= UXNMR, Bruker Analytische Messtechnik GmbH
##OWNER= root
$$ XWIN-NMR		Version 3.5
$$ Mon Oct 25 11:28:42 2021 Russian Standard Time (UT+4h)  she@DPX200
##.OBSERVE FREQUENCY= 200.1313468511
##.OBSERVE NUCLEUS= ^1H
##.DELAY= (6, 6)
##.ACQUISITION MODE= SIMULTANEOUS
##.ACQUISITION SCHEME= undefined
##.AVERAGES= 8
##.DIGITISER RES= 18
##SPECTROMETER/DATA SYSTEM= spect
##.PULSE SEQUENCE= zg30
##.SOLVENT NAME= Acetone
##.SHIFT REFERENCE= (INTERNAL, Acetone, 0, 15.7039)
##AUDIT TRAIL= $$ (NUMBER, WHEN, WHO, WHERE, WHAT)
$$ ##TITLE= Audit trail, XWIN-NMR		Version 3.5
$$ ##JCAMPDX= 5.01
$$ ##ORIGIN= Bruker BioSpin GmbH
$$ ##OWNER= she
$$ F:/spectra/data/she/nmr/H-F/1/audita.txt
$$ ##AUDIT TRAIL=  $$ (NUMBER, WHEN, WHO, WHERE, WHAT)
(   1,<2021-10-25 11:27:32.26 +0400>,<she>,<DPX200>,
      <created by zg, POWCHK disabled, PULCHK disabled
       configuration hash MD5:
       00 E9 B6 7A A2 85 ED C7 34 08 36 98 17 FE 4E 26
       data hash MD5: 16K
       A7 D0 08 61 DA 8F B0 C5 48 8B 6B EA E4 79 45 A7>)
$$ ##END=
$$ 
$$ hash MD5
$$ 46 D0 37 4B 82 4D 72 F7 55 EB D6 2C 88 36 1B B5
##$RELAX= 
##$RELAX= 
##$RELAX= 
##$RELAX= 
##$RELAX= 
##$RELAX= 
$$ Bruker specific parameters
$$ --------------------------
##$DU= <F:/spectra>
##$EXPNO= 1
##$NAME= <H-F>
##$PROCNO= 1
##$TYPE= <nmr>
##$USER= <she>
##$AMP= (0..31)
100 100 100 100 100 100 100 100 100 100 100 100 100 100 100 100 100 100 
100 100 100 100 100 100 100 100 100 100 100 100 100 100 
##$AQSEQ= 0
##$AQ_mod= 1
##$AUNM= <au_zg>
##$AUTOPOS= <>
##$BF1= 200.13
##$BF2= 200.13
##$BF3= 200.13
##$BF4= 200.13
##$BF5= 200.13
##$BF6= 200.13
##$BF7= 200.13
##$BF8= 200.13
##$BYTORDA= 1
##$CFDGTYP= 0
##$CFRGTYP= 5
##$CHEMSTR= <none>
##$CNST= (0..31)
1 1 145 1 1 1 1 1 1 1 1 1 1 1 1 1 1 1 1 1 1 1 1 1 1 1 1 1 1 1 1 1 
##$CPDPRG= <>
##$CPDPRG1= <>
##$CPDPRG2= <>
##$CPDPRG3= <>
##$CPDPRG4= <mlev>
##$CPDPRG5= <mlev>
##$CPDPRG6= <mlev>
##$CPDPRG7= <mlev>
##$CPDPRG8= <mlev>
##$CPDPRGB= <>
##$CPDPRGT= <>
##$D= (0..31)
0 1.2 0 0 0 0 0 0 0 0.06 0 0.03 0 0 0 0 0.0002 0 0 0 0 0 0 0 0 0 0 0 0 
0 0 0 
##$DATE= 1635146851
##$DBL= (0..7)
120 120 120 120 120 120 120 120 
##$DBP= (0..7)
150 150 150 150 150 150 150 150 
##$DBP07= 0
##$DBPNAM0= <>
##$DBPNAM1= <>
##$DBPNAM2= <>
##$DBPNAM3= <>
##$DBPNAM4= <>
##$DBPNAM5= <>
##$DBPNAM6= <>
##$DBPNAM7= <>
##$DBPOAL= (0..7)
0.5 0.5 0.5 0.5 0.5 0.5 0.5 0.5 
##$DBPOFFS= (0..7)
0 0 0 0 0 0 0 0 
##$DE= 6
##$DECBNUC= <off>
##$DECIM= 32
##$DECNUC= <off>
##$DECSTAT= 4
##$DIGMOD= 1
##$DIGTYP= 9
##$DL= (0..7)
0 120 120 120 120 120 120 120 
##$DP= (0..7)
150 150 150 150 150 150 150 150 
##$DP07= 0
##$DPNAME0= <>
##$DPNAME1= <>
##$DPNAME2= <>
##$DPNAME3= <>
##$DPNAME4= <>
##$DPNAME5= <>
##$DPNAME6= <>
##$DPNAME7= <>
##$DPOAL= (0..7)
0.5 0.5 0.5 0.5 0.5 0.5 0.5 0.5 
##$DPOFFS= (0..7)
0 0 0 0 0 0 0 0 
##$DQDMODE= 0
##$DR= 18
##$DS= 0
$$ [...]
##$SUBNAM2= <"">
##$SUBNAM3= <"">
##$SUBNAM4= <"">
##$SUBNAM5= <"">
##$SUBNAM6= <"">
##$SUBNAM7= <"">
##$SUBNAM8= <"">
##$SUBNAM9= <"">
##$SW= 18.0517286264689
##$SWIBOX= (0..15)
0 0 2 0 0 0 0 0 0 0 0 0 0 0 0 0 
##$SW_h= 3612.71676300578
##$TD= 16384
##$TD0= 1
##$TE= 0
##$TE2= 300
##$TE3= 300
##$TEG= 300
##$TL= (0..7)
0 120 120 120 120 120 120 120 
##$TP= (0..7)
150 150 150 150 150 150 150 150 
##$TP07= 0
##$TPNAME0= <>
##$TPNAME1= <>
##$TPNAME2= <>
##$TPNAME3= <>
##$TPNAME4= <>
##$TPNAME5= <>
##$TPNAME6= <>
##$TPNAME7= <>
##$TPOAL= (0..7)
0.5 0.5 0.5 0.5 0.5 0.5 0.5 0.5 
##$TPOFFS= (0..7)
0 0 0 0 0 0 0 0 
##$TUNHIN= 0
##$TUNHOUT= 0
##$TUNXOUT= 0
##$USERA1= <user>
##$USERA2= <user>
##$USERA3= <user>
##$USERA4= <user>
##$USERA5= <user>
##$V9= 5
##$VALIST= <valist>
##$VCLIST= <CCCCCCCCCCCCCCC>
##$VD= 0
##$VDLIST= <DDDDDDDDDDDDDDD>
##$VPLIST= <PPPPPPPPPPPPPPP>
##$VTLIST= <TTTTTTTTTTTTTTT>
##$WBST= 1024
##$WBSW= 4
##$XGAIN= (0..3)
0 0 0 0 
##$XL= 0
##$YL= 0
##$YMAX_a= 129623
##$YMIN_a= -108969
##$ZGOPTNS= <>
##$ZL1= 120
##$ZL2= 120
##$ZL3= 120
##$ZL4= 120
##$ABSF1= 10
##$ABSF2= 0
##$ABSG= 5
##$ABSL= 3
##$ALPHA= 0
##$AQORDER= 0
##$ASSFAC= 0
##$ASSFACI= 0
##$ASSFACX= 0
##$ASSWID= 0
##$AUNMP= <proc_1d>
##$AZFE= 0.1
##$AZFW= 0.1
##$BCFW= 1
##$BC_mod= 2
##$BYTORDP= 1
##$COROFFS= 0
##$CY= 11.3945322036743
##$DATMOD= 1
##$DC= 2
##$DFILT= <>
##$DTYPP= 0
##$F1P= 2.36226072786647
##$F2P= -0.459571619588291
##$FCOR= 0.5
##$FTSIZE= 0
##$FT_mod= 4
##$GAMMA= 1
##$GB= 0.15
##$INTBC= 1
##$INTSCL= 1
##$ISEN= 128
##$LB= 0.24
##$LEV0= 0
##$LPBIN= 0
##$MAXI= 10000
##$MC2= 0
##$MEAN= 0
##$ME_mod= 0
##$MI= 1.114404
##$NCOEF= 0
##$NC_proc= 0
##$NLEV= 6
##$NOISF1= 3.799351
##$NOISF2= 2.8
##$NSP= 1
##$NTH_PI= 0
##$NZP= 0
##$OFFSET= 15.70392
##$PC= 1
##$PHC0= -15153.16
##$PHC1= 14.40083
##$PH_mod= 1
##$PKNL= yes
##$PPARMOD= 0
##$PSCAL= 0
##$PSIGN= 0
##$REVERSE= no
##$SF= 200.130013532006
##$SI= 16384
##$SIGF1= 3
##$SIGF2= 2
##$SINO= 400
##$SIOLD= 16384
##$SREGLST= <1H.CDCl3>
##$SSB= 0
##$STSI= 0
##$STSR= 0
##$SW_p= 3612.71676300578
##$SYMM= 0
##$S_DEV= 0
##$TDeff= 0
##$TDoff= 0
##$TI= <>
##$TILT= no
##$TM1= 0
##$TM2= 0
##$TOPLEV= 0
##$USERP1= <user>
##$USERP2= <user>
##$USERP3= <user>
##$USERP4= <user>
##$USERP5= <user>
##$WDW= 1
##$XDIM= 8192
##$YMAX_p= 0
##$YMIN_p= 0
$$ End of Bruker specific parameters
$$ ---------------------------------
##NTUPLES= NMR FID
##VAR_NAME=  TIME,          FID/REAL,        FID/IMAG
##SYMBOL=    X,             R,               I
##VAR_TYPE=  INDEPENDENT,   DEPENDENT,       DEPENDENT
##VAR_FORM=  AFFN,          ASDF,            ASDF
##VAR_DIM=   8192,          8192,            8192
##UNITS=     SECONDS,       ARBITRARY UNITS, ARBITRARY UNITS
##FACTOR=    0.0002768,     1,               1
##FIRST=     0,             0,               0
##LAST=      2.2672688,     0,               0
##MIN=       0,             -108969,         0
##MAX=       2.2672688,     129623,          0
$$ Real data points
##PAGE= N=1
##DATA TABLE= (X++(R..R)), XYDATA
$$ [...]
$$ plain form
1743 297 148 -27 9 171 -11 184 -48 24 -145 251 -141 110 -212 -59 -35 118 -2 -61 138 -56 108
1764 108 -117 -1 -97 -171 95 -123 15 -140 -33 71 12 206 -28 -147 18 -198 19 -31 -34 -30 -43 139 349
1787 349 157 170 -109 -200 -31 29 88 202 -113 -25 68 -88 64 -234 -61 -291 46 61 -115 37 51 -68 122
1810 122 22 75 145 -167 22 -81 135 80 -53 -87 189 2 -87 -71 -60 30 -153 -6 -89 -31 129 64 -57 -21
1834 -21 47 -54 -55 -28 67 252 119 -194 -26 -19 -28 -187 156 78 48 -63 -95 141 -121 -66 -132 -137 -278 36 -95 -64
1860 -64 137 -24 11 9 -23 -22 23 -38 -45 -56 -4 -4 179 142 353 137 60 196 -103 -62 174 -99 -107 -126 -19 22 -168
1887 -168 -93 -135 185 -133 166 -152 -177 -181 -96 -167 65 227 -57 163 -138 46 293 282 -278 92 -57 78 -57
1910 -57 84 -106 -149 45 -36 -37 -85 -26 -176 112 39 35 51 -68 -96 215 90 -43 11 -215 -85 19 -254 -299 -4
$$ packed form
1743B97j49j75L6J62j82J95k32P2j69L96l92K51l22J53K4J53j20n9J99j94J64
1764A08k25J16r6p4K66k18J38j55J07J04n9J94k34j19J65k16K17n0lMj3J82K10
1787C49j92J3k79r1J69O0N9J14l15Q8R3j56J52k98J73k30L37J5j76J52J4j19J90
1810A22j00N3P0l12J89j03K16n5j33l4K76j87q9J6J1R0j83J47q3N8J60o5j21L6
1834b1O8j01jK7R5J85j33l13J68Prj59L43p8l0j11l2K36k62N5o6nj41L14j31L1
1860f4K01j61L5kl2JM5o1pj1N2%J83l7K11k16p7J36k99M1K36k73qj9J07M1j90
1887a68P5m2L20l18K99l18k5mQ5p1K32J62k84K20l01J84K47j1n60L70j49J35j35
1910e7J41j90m3J94q1jm8N9j50K88p3mJ6j19k8L11j25j33N4k26J30J04k73m5K95
$$ plain form
1935 -4 -66 147 157 87 38 -48 92 -196 -143 81 246 -89 -118 57 -89 262 307 -40 -84 52 -152 -18 311 208
1959 208 -233 48 125 -135 26 -71 99 -157 -108 111 4 180 254 -167 -334 -321 87 -174 -250 -66 -67 -6 -188
1982 -188 -172 171 11 -98 -160 56 -147 -9 -59 31 -107 42 -27 -8 292 279 304 146 -6 -192 -293 218 -126
2005 -126 77 174 27 141 134 32 37 -173 -12 191 -41 -95 89 291 -126 -38 72 83 52 83 -66 91 181 181
2029 181 375 -151 -171 193 -50 -56 -161 -76 -110 -48 99 -165 -91 -40 -148 102 72 -8 -35 -55 130 152 246 110 -102
2054 -102 -4 -177 113 174 101 10 152 -62 105 -62 -72 90 24 -28 -56 80 77 180 69 -5 -54 164 126 52 192
2079 192 -48 53 54 145 -230 202 -98 -215 180 -211 -126 139 23 120 286 179 -25 -33 -56 137 76 194 -209
2102 -209 32 -42 -192 24 -187 -123 -131 86 265 105 -83 34 -47 166 -96 -128 122 -33 64 29 181 168 -235
$$ packed form
1935do2K13J0p0m9q6J40k88N3K24J65l35k9J75j46L51M5l47m4J36k04J34L29j03
1959B08m41K81P7k60J61r7J70k56M9K19j07J76P4m21j67J3M08k61p6J84jO1j82
1982a88J6L43j60j09o2K16k03J38n0R0j38J49o9J9L00j3K5j58j52j86j01N11l44
2005a26K03R7j47J14pj02Nk10J61K03k32n4J84K02m17Q8J10J1l1L1j49J57R0%
2029A81J94n26k0L64k43oj05Q5l4O2J47k64P4N1j08K50l0q0k7k0J85K2R4j36k12
2054a02R8j73K90O1p3r1J42k14J67j67j0J62o6n2k8J36lJ03j11p4m9K18l8p4J40
2079A92k40J01JR1l75M32l00j17L95l91Q5K65j16R7J66j07k04qk3J93o1J18m03
2102b09K41p4j50K16k11O4qK17J79j60j88J17q1K13k62l2K50j55R7l5J52j3m03
$$ plain form
2125 -235 106 -42 23 -105 64 -186 -58 -61 164 14 69 -40 85 -147 -17 15 -23 133 -388 22 -86 -67
2147 -67 219 -51 -70 -3 5 -56 -91 43 -163 -32 80 107 -121 107 -227 91 51 -85 85 -15 78 102 -110 120
2171 120 -152 -103 11 36 -29 -109 -19 28 51 -57 -82 153 -144 128 -202 -80 59 28 39 191 -85 -193 19
2194 19 133 97 -242 227 96 3 -315 -165 302 -125 2 -99 -58 39 -39 138 170 -17 32 53 82 57 166 278
2218 278 214 15 -126 20 95 131 2 -3 119 -72 7 -10 -106 -32 160 -228 7 3 95 -40 250 -113 -47 -170
2242 -170 31 -97 -125 16 33 -202 7 80 29 151 -231 100 177 -5 -16 4 -263 -62 39 -4 35 -158 67
2265 67 62 -65 -243 -63 -43 -11 30 108 264 -14 36 -185 -93 405 -125 32 169 -43 186 -101 110 -86 -181
2288 -181 144 -43 -185 -40 -72 -87 -250 -161 282 88 94 100 32 58 -179 -1 77 -2 -13 121 -166 245 16 380
$$ packed form
2125b35L41j48O5j28J69k50J28lK25j50N5j09J25k32J30L2l8J56n21M10j08J9
2147f7K86k70j9O7Qo1l5J34k06J31J12K7k28K28l34L18m0j36J70j00R3K4k12K30
2171A20k72M9J14K5o5q0R0M7K3j08k5K35k97K72l30J22J39l1J1J52k76j08K12
2194A9J14l6l39M69j31r3l18J50M67m27J27j01M1R7p8J77L2j87M9K1K9k5J09J12
2218B78o4j99j41J46P5L6j29nJ22j91P9j7r6P4J92l88K35mR2j35K90l63O6j23
2242a70K01j28k8J41J7k35K09P3n1J22l82L31P7j82j1K0k67K01J01m3L9j93K25
2265F7nj27j78J80K0L2M1P8J56k78N0k21R2M98n30J57J37k12K29k87K11j96r5
2288a81L25j87j42J45l2j5j63Q9M43j94OOo8K6k37J78P8p9j1J34k87M11k29L64
$$ plain form
2312 380 248 -60 128 135 -390 -206 -259 94 -19 69 -30 126 40 158 -69 -43 83 23 -75 -99 226 -34 244
2335 244 14 168 -51 126 132 110 -76 100 56 22 -107 -31 -61 62 -20 153 151 -86 103 -103 40 -115 120
2358 120 55 31 67 7 -38 75 156 131 58 -108 -50 25 -126 59 140 3 140 11 105 -29 173 57 -84 -88 16
2383 16 -121 9 -113 83 165 -51 187 -175 7 56 51 -9 46 -69 -59 -51 119 59 -18 -10 255 153 104 -51 13
2408 13 23 -19 4 -128 -6 60 -145 -214 -131 107 238 -143 13 168 -114 -21 -177 -100 108 218 -39 115 -1
2431 -1 60 -43 -277 -152 -154 142 33 -6 -22 -13 133 -28 -280 59 -119 -42 53 46 -20 55 8 1 19 -267 192 -158
2457 -158 68 -313 156 35 81 57 -39 -102 -126 -95 106 -65 -243 55 260 8 96 136 -119 -3 -162 1 91
2480 91 -60 110 96 34 32 -127 -7 -206 74 78 35 -13 -148 166 312 -81 63 -44 -119 -177 -45 -248 -107 15
$$ packed form
2312C80j32l08J88Pn25J84n3L53j13Q8r9J56q6J18k27K6J26o0r8k4L25k60K78
2335B44k30J54k19J77Ok2j86J76m4l4j29P6l0J23q2J73kk37J89k06J43j55K35
2358A20o5k4L6o0m5J13Q1k5p3j66N8P5j51J85Q1j37J37j29R4j34K02j16j41mJ04
2383A6j37J30j22J96Q2k16K38l62J82M9no0N5j15J0QJ70o0p7QK65j02m9j55O4
2408A3J0m2K3j32J22O6k05o9Q3K38J31l81J56J55k82R3j56P7K08J10k57J54j16
2431aO1j03k34J25kK96j09l9j6RJ46j61k52L39j78P7R5po6P5m7pJ8k86M59l50
2457a58K26l81M69j21M6k4r6o3k4L1K01j71j78K98K05k52Q8M0k55J16j59J63R0
2480I1j51J70j4o2kj59J20j99K80Mm3m8j35L14J46l93J44j07p5n8J32k03J41J22
$$ plain form
2504 15 -13 -75 -68 -157 -49 238 -147 180 56 -219 -235 45 113 -86 -51 -57 -82 30 173 7 -26 190 15 31 -165
2529 -165 -150 28 -125 76 49 39 -33 -52 -140 -154 -123 -177 120 50 -45 -1 103 129 103 -13 163 29 85 -38 181
2554 181 -45 155 107 -116 11 -7 -4 13 -116 12 37 26 146 -7 117 -71 35 204 -59 45 -155 125
2576 125 49 107 -278 50 0 85 191 -150 171 11 -40 -53 85 -87 52 -156 10 -67 52 -115 -8 -121
2598 -121 156 160 -17 26 -106 27 -219 95 -92 -123 34 140 52 142 274 -130 40 -13 -45 -178 -156 -35 18
2621 18 14 41 58 -239 115 175 152 21 -81 -111 86 -48 -181 48 128 150 -322 -58 192 310 -41 0 -69 -120
2645 -120 316 393 -106 -13 24 315 -47 -77 -70 40 -23 83 -63 229 -165 -193 11 -146 -136 39 26 -14 -162 -116
2669 -116 67 -68 -142 -130 -173 -9 149 -1 134 88 -75 54 -130 -145 134 1 212 -188 333 -99 -70 -28
$$ packed form
2504A5k8o2Pq9J08K87l85L27j24k75j6K80O8j99L5ok5J12J43j66l3K16j75J6j96
2529a65J5J78j53K01k7j0p2j9q8j4L1n4K97p0r5M4J04K6k6j16J76j34N6j23K19
2554A81k26K00m8k23J27j8LJ7j29J28K5j1J20j53J24j88J06J69k63J04k00K80
2576A25p6N8l85L28n0Q5J06l41L21j60n1j3J38j72J39k08J66p7J19j67J07j13
2598a21K77Mj77M3j32J33k46L14j87l1J57J06q8R0J32m04J70n3l2j33K2J21N3
2621A8mK7J7k97L54O0k3j31j02l0J97j34j33K29Q0K2m72K64K50J18l51M1o9n1
2645a20M36P7m99R3L7K91l62l0PJ10o3J06j46K92l94k8K04j57J0J75j3m0j48M6
2669a16J83j35p4J2m3J64J58j50J35m6j63J29j84j5K79j33K11m00N21m32K9M2
$$ plain form
2691 -28 24 27 25 28 -77 -75 74 212 -5 -189 -114 204 -120 -144 -72 -47 -14 96 138 -133 -193 82 -236 -11 -131 15
2717 15 74 -112 186 -199 -80 -108 -55 -59 9 85 24 -78 182 -108 36 81 -425 -221 21 -27 -141 32 -2 59
2741 59 -58 -13 141 43 -209 145 3 25 8 -23 176 179 -90 -92 -189 -56 158 -272 7 -108 -32 -156 43 95
2765 95 -225 92 61 154 -187 173 -5 -147 -35 -173 -261 121 111 -19 247 9 -65 -24 71 -205 3 -112 -42
2788 -42 -174 -118 46 154 -88 -11 -50 2 8 -323 -149 258 -56 -89 152 225 45 -330 -177 -95 4 -381 -141 -12
2812 -12 -181 5 156 140 156 -157 -34 129 -62 169 -59 -74 80 72 298 8 7 90 -116 123 -217 -21 -69
2835 -69 -34 17 159 -297 -101 -22 132 30 82 1 180 -126 0 -85 -51 -235 -40 -63 237 167 -27 100 149 -157
2859 -157 49 20 -49 -9 -164 -173 -42 -144 -17 206 -18 138 -180 0 -99 153 105 51 288 -94 -78 -8 -107 -46
$$ packed form
2691b8N2LkLj05KJ49J38k17j84P5L18l24k4P2K5L3J10M2k71o0K75l18K25j20J46
2717A5N9j86K98l85J19k8N3mO8P6o1j02K60k90J44M5n06K04K42m8j14J73l4O1
2741E9j17M5J54r8k52L54j42K2j7l1J99Lk69kr7J33K14m30K79j15P6j24J99N2
2765I5l20L17l1R3l41L60j78j42J12j38q8L82j0j30K66k38p4M1R5k76K08j15P0
2788d2j32N6J64J08k42P7l9N2Ol31J74M07l14l3K41P3j80l75J53Q2R9l85K40J29
2812a2j69J86J51j6J6l13J23J63j91K31k28j5J54qK26k90jQ3k06K39l40J96m8
2835f9L5N1J42m56J96P9J54j02N2q1J79l06J26q5L4j84J95k3L00p0j94J27M9l06
2859a57K06k9o9M0j55rJ31j02J27K23k24J56l18J80r9K52m8n4K37l82J6P0r9O1
$$ plain form
2883 -46 -4 -23 -189 -117 99 -54 16 -27 110 -160 64 -319 14 125 -130 164 -87 61 7 -167 -103 -58 129
2906 129 7 17 -96 -176 47 97 -12 -78 90 48 21 -13 174 -151 22 -60 -184 80 120 -135 -123 8 -18 122
2930 122 -29 86 116 214 146 9 -237 -154 96 127 87 164 -109 216 152 270 83 39 -233 85 185 249 -57
2953 -57 90 -63 203 151 -313 -33 116 -120 156 22 -44 59 47 37 22 -92 -175 296 -114 19 115 -87 121
2976 121 139 -51 -75 -157 114 80 14 -111 -90 103 114 -112 33 -78 -78 -106 8 -133 -170 -86 95 273 68 -121
3000 -121 33 -220 -57 -34 91 138 -92 -2 177 -48 -226 86 158 -37 -57 108 122 58 45 -290 188 -90 -88
3023 -88 -74 -230 -168 -44 -100 -96 7 28 126 295 59 -224 -33 61 -31 125 135 4 62 175 -157 0 -184 23
3047 23 122 97 -92 116 -34 -112 -124 98 -2 264 -111 -275 -69 -45 -52 31 -328 2 148 -351 153 -46 -28
$$ packed form
2883d6M2j9j66P2K16j53P0m3J37k70K24l83L33J11k55K94k51J48n4j74O4M5J87
2906A29j22J0j13q0K23N0j09o6J68m2k7l4J87l25J73q2j24K64M0k55J2J31k6J40
2930A22j51J15L0R8o8j37k46Q3K50L1m0P7k73L25o4J18j87m4k72L18J00O4l06
2953e7J47j53K66n2m64K80J49k36K76j34o6J03j2j0j5j14q3M71m10J33R6k02K08
2976A21J8j90k4q2K71l4o6j25K1J93J1k26J45j11%k8J14j41l7Q4J81J78k05j89
3000a21J54k53J63K3J25M7k30R0J79k25j78L12P2j95k0J65J4o4j3l35M78k78K
3023h8J4j56O2J24n6MJ03K1R8J69k36k83J91R4r2J56J0j31N8J13l32J57j84K07
3047B3R9k5j89K08j50p8j2K22j00K66l75j64K06K4pQ3l59L30J46m99N04j99J8
$$ plain form
3070 -28 62 -328 7 -100 15 -40 -147 -9 -110 6 38 107 -35 -78 -21 94 -97 -92 -80 -172 -198 134 -217 266
3094 266 279 -23 -82 205 -261 -31 -46 -12 -59 -137 -117 -143 6 -15 78 -37 -81 -124 -259 -128 -89 141 -131 -93 -151
3119 -151 75 -15 -35 1 -249 142 11 375 85 -139 59 -209 168 180 72 -74 33 25 33 54 131 -53 -89 151
3143 151 -135 35 324 3 -255 89 127 40 8 182 165 -99 181 25 222 65 -185 -95 -4 -66 -89 -188 46
3166 46 164 45 18 -112 157 -136 -80 18 -118 -40 30 132 92 -120 -57 -12 73 104 101 40 82 60 166 323 16
3191 16 -132 -315 -36 183 20 119 -59 -58 51 1 -83 142 -11 -29 -212 -406 14 -170 15 -79 93 -81 -53
3214 -53 -51 74 -75 69 33 173 94 -142 42 38 136 -171 102 49 88 40 126 -81 30 -40 -144 26 -166 228
3238 228 63 26 -31 134 54 -7 -27 142 24 46 -76 75 134 174 90 24 235 -379 94 15 53 224 -3 45
$$ packed form
3070b8R0l90L35j07J15n5j07J38j01J16L2O9j42m3N7J15j91NJ2r2k6L32l51M83
3094B66J3l02n9K87m66K30j5L4m7p8K0k6J49k1R3j15m4m3j35J31L9K30k72L8n8
3119a51K26r0k0L6k50L91j31L64k90k24J98k68L77J2j08j46J07qQK1P7j84l6K40
3143A51k86J70K89l21k58L44L8q7l2J74j7k64K80j56J97j57k50R0R1o2k3r9K34
3166D6J18j19k7j30K69k93N6R8j36P8P0J02m0k12O3M5Q5L1lo1M2k2J06J57l07
3191A6j48j83K79K19j63R9j78JJ09n0q4K25j53j8j83j94M20j84J85r4J72j74K8
3214e3KJ25j49J44l6J40p9k36J84mR8l07K73n3L9m8Q6k07J11p0j04J70j92L94
3238B28j65l7n7J65q0o1k0J69j18K2j22J51N9M0q4o6K11o14M73p9L8J71k27M8
$$ plain form
3262 45 -56 114 -43 -8 -26 -183 51 -113 21 143 -48 -138 11 87 -251 125 -132 291 115 -211 122 -13
3284 -13 -104 83 -128 -97 136 6 -25 -115 -102 -40 -116 -75 -136 44 -65 142 -9 44 -284 -43 105 -278 -47 -28
3308 -28 46 -116 -202 108 -98 -82 -208 -76 -175 41 204 109 125 -54 -21 -120 7 -105 55 -106 57 65 213 20
3332 20 47 287 193 -265 -41 -79 -231 17 123 68 116 -72 49 97 71 167 48 -36 -111 -38 -190 -62 138 -173
3356 -173 87 -68 -140 237 21 130 -123 251 -42 107 -135 -88 203 80 263 -178 8 50 -80 -52 89
3377 89 -84 -11 44 -112 268 49 28 204 75 196 81 108 -81 -221 61 -18 -35 225 -26 -59 266 125 -15
3400 -15 -175 -10 8 -79 -111 -161 -196 118 83 -12 226 255 83 20 -22 10 -235 -16 222 -328 -27 -116 -58 -122 -79
3425 -79 -152 -111 -101 101 -54 130 290 -46 -96 -11 183 82 -19 -70 27 -69 50 348 -131 159 -8 0 44 -23
$$ packed form
3262D5j01J70j57L5j8j57K34j64J34J22j91r0J49P6l38L76k57M23j76l26L33j35
3284a3r1J87k11L1K33j30l1r0J3O2p6M1o1J80j09K07j51N3l28K41J48l83K31J9
3308b8P4j62q6L10k06J6j26J32r9K16J63r5J6j79L3r9J27j12J60j61J63QJ48j93
3332B0K7K40r4m58K24l8j52K48J06n5M8j88J21M8k6R6j19q4p5P3j52J28K00l11
3356a73K60j55p2L77k16J09k53L74k93J49k42M7K91j23J83m41J86M2j30K8J41
3377H9j73P3N5j56L80k19k1J76j29J21j15K7j89j40K82p9j7K60k51l3L25j41j40
3400a5j60J65J8q7l2n0l5L14l5r5K38K9j72o3m2L2k45K19K38n50L01q9N8o4M3
3425g9p3M1J0K02j55J84J60l36n0Q5J94j01j01n1R7r6J19K98m79K90j67QM4o7
$$ plain form
3449 -23 -87 -82 203 -217 -264 90 -2 -37 161 -37 -30 24 -58 96 -179 -127 -78 -86 49 93 158 -45 11 42 111 103 -29
3476 -29 28 -33 -63 29 143 11 -51 54 85 49 61 71 77 -16 7 40 -18 -53 38 24 -5 50 140 182 -137 -168 -244 -70
3504 -70 15 46 56 -159 137 -70 -71 -91 299 -75 98 187 19 180 -30 171 86 132 -77 -132 15 -92 73 126
3528 126 -207 170 32 -80 135 -165 6 87 -157 -251 -102 -9 -35 -107 137 88 -3 187 8 79 38 -117 207
3551 207 145 155 -70 252 171 -56 153 16 111 -32 -228 -146 78 141 148 -108 -56 -39 106 98 23 7 -125 221 30
3576 30 -167 -136 26 -296 -247 57 -14 48 29 117 -156 -106 117 88 -200 58 -34 63 -113 -212 -12 55 -131 36
3600 36 329 -24 4 -130 -73 -94 -112 -75 -120 53 33 7 -7 -164 -77 94 -4 12 -96 -90 91 -59 -97 72 47 -70
3626 -70 176 104 -58 74 -501 -63 -83 -141 -177 -113 88 -36 196 -9 -340 51 -64 6 -219 -43 250 -92
$$ packed form
3449b3o4NK85m20m7L54r2l5J98j98PN4q2J54k75N2M9qJ35M4O5k03N6L1O9qj32
3476b9N7o1l0R2J14j32o2J05L1l6J2J0Or3K3L3n8l5R1j4k9N5R0M2l19l1p6J74
3504g0Q5L1J0k15K96k07jk0L90l74J73Q9j68J61k10K01q5M6k09n5J47j07J65N3
3528A26l33L77j38j12K15l00J71Q1k44r4J49R3k6p2K44m9r1J90j79P1m1j55L24
3551B07o2J0k25L22q1k27K09j37R5j43j96Q2K24O3Pk56N2J7J45qp5j6j32L46j91
3576C0j97L1J62l22M9L04p1O2j9Q8k73N0K23k9k88K58r2R7j76r9K00O7j86J67
3600C6K93l53K8j34N7k1j8L7m5J73k0k6j4j57Q7J71r8J6j08OJ81j50l8J69k5j17
3626g0K46p2j62J32n75M38k0n8l6O4K01j24K32k05l31L91j15P0k25J76K93l42
$$ plain form
3648 -92 80 188 27 -86 73 3 42 -87 16 -21 3 209 -86 -141 -85 96 85 53 -45 -11 -107 117 -214 55
3672 55 -24 -71 -13 56 -145 -20 72 -137 -25 8 -228 -267 28 -128 -279 -102 73 13 165 -215 -29 -143 -15
3695 -15 168 36 43 63 53 103 135 -107 -64 31 52 -277 -49 -129 12 35 -76 95 -39 94 -197 -15 -122 114
3719 114 8 -25 -2 -15 -199 -112 -38 197 -171 -13 -126 -10 34 -118 -121 -68 73 -35 -45 -36 -152 -43 185 93
3743 93 -25 79 197 104 -43 110 -253 172 90 23 -84 105 48 -125 -44 -254 231 -275 245 93 26 -57 212
3766 212 166 17 -124 119 402 -138 209 242 70 30 86 0 -68 -119 -101 -94 144 -91 -85 16 60 -93 -116 -111 20
3791 20 135 229 -94 -159 88 78 -124 -171 74 137 17 24 -215 -253 -100 -19 -17 195 217 -93 -19 11 37 -138 -24
3816 -24 -179 -90 -189 -211 -162 153 89 140 -178 -123 231 1 90 -21 -126 -12 47 -26 56 105 108 63 169 -125 -34 -65
$$ packed form
3648i2J72J08j61j13J59p0L9j29J03l7K4K06k95n5N6J81j1l2r8L4r6K24l31K69
3672E5p9m7N8O9k01J25R2k09J12L3k36l9K95j56j51J77J75o0J52l80J86j14J28
3695a5J83j32PK0j0N0L2k42M3R5K1l29K28q0J41K3j11J71j34J33k91J82j07K36
3719A14j06l3K3j3j84Q7P4K35l68J58j13J16M4j52lN3J41j08j0Rj16J09K28r2
3743I3j18J04J18r3j47J53l63M25q2o7j07J89n7j73Q1k10M85n06N20j52o7q3K69
3766B12m6j49j41K43K83n40L47L3j72m0N6q6o8n1J8PK38k35OJ01M4j53k3NJ31
3791B0J15R4l23o5K47j0k02m7K45O3j20Pk39l8J53Q1KK12K2l10P4L0K6j75J14
3816b4j55Q9r9k2M9L15o4N1l18N5L54k30Q9j11j05J14N9p3Q2M9Lm5J06k94R1l1
$$ plain form
3842 -65 139 -51 -136 67 -3 -42 -195 -67 48 -78 188 61 23 -64 -53 -129 -220 31 -37 11 -161 -120 -185 225
3866 225 95 -44 -95 189 -32 -71 -103 -102 50 -34 222 -20 73 -157 -10 -86 106 94 -59 62 -113 -28 -144
3889 -144 109 -123 98 275 -20 288 -164 -147 -13 104 -2 -38 -85 -37 -43 64 -169 17 113 80 68 -80 -35
3912 -35 153 69 -91 -257 -21 -23 96 67 -210 -40 -45 18 243 269 45 76 -54 -8 -95 96 -5 -154 277 -56
3936 -56 -202 104 -104 179 -100 112 71 -98 -152 -33 17 -160 -79 137 61 124 -85 -35 -58 -22 68 -120 192 71
3960 71 197 68 5 -43 -44 66 -11 -70 232 91 -142 -159 -35 -157 165 182 41 -175 13 133 -283 104 14
3983 14 34 16 61 67 -46 102 85 39 -139 -163 -87 241 -35 -349 66 48 337 89 -82 222 155 241 -135 108
4007 108 48 -24 94 -46 42 135 -245 29 -199 -239 -129 8 -52 140 118 102 -3 -60 -30 -117 33 -15 -5 -32 87
$$ packed form
3842f5K04j90q5K03p0l9j53J28J15j26K66j27l8q7J1p6r1K51o8M8j72M1o5M10
3866B25j30j39n1K84k21l9l2JJ52q4K56k42R3k30J47p6J92j2j53J21j75Q5j16
3889a44K53k32K21J77k95L08m52J7J34J17j06l6m7M8oJ07k33J86R6l3j2j48M5
3912c5J88q4j60j66K36kJ19k9k77J70nO3K25K6k24L1j30M6q7J91j01j49M31l33
3936e6j46L06k08K83k79K12m1j69n4J19N0j77Q1K16p6O3k09N0k3L6R0j88L12j21
3960G1J26j29o3m8jJ10p7n9L02j41k33j7J24j22L22J7j41k16J88J20m16L87r0
3983A4K0j8M5Oj13J48j7m6j78k4P6L28k76l14M15j8K89k48j71L04o7Q6l76K43
4007A08o0p2J18j40Q8R3l80K74k28m0J10J37o0J92k2j6j05n7L0q7J50m8J0k7J19
$$ plain form
4032 87 65 15 91 155 -45 273 -162 76 55 117 31 125 140 -80 -93 -165 44 -251 97 -372 157 -118 93 -175
4056 -175 -171 -23 8 45 -106 -4 60 39 -80 -180 -90 4 214 -223 52 -75 105 222 15 -64 -121 -47 -11 70
4080 70 -88 30 102 -39 15 -49 -246 -173 75 85 207 190 294 51 83 281 146 -162 -78 62 -133 -28 236
4103 236 -42 166 -115 49 155 -106 -63 85 41 -128 35 88 23 -202 -277 12 -119 -116 -27 -315 -177 -70 -259
4126 -259 60 69 -46 -5 217 -130 -18 9 111 -39 132 -142 107 -72 210 109 -79 -122 120 247 -131 65
4148 65 41 -135 154 -153 23 -112 -34 -41 -5 270 -84 21 -35 -235 -79 116 -42 -42 -14 -30 -23 -32 17 150 -61
4173 -61 -13 -212 113 52 67 6 22 -53 -73 -6 6 10 -97 109 -129 -238 16 199 -101 -74 5 -41 4 -73 142 -121
4199 -121 135 -119 -225 -159 89 219 110 -193 69 11 -23 43 -38 18 -95 175 183 -85 -43 125 -68 -203 198
$$ packed form
4032H7k2n0P6O4k00L18m35K38k1O2q6R4J5k20j3p2K09k95L48m69N29k75K11k68
4056a75MJ48L1L7j51J02O4k1j19j00R0R4K10m37K75j27J80J17k07p9n7P4L6Q1
4080G0j58J18P2j41N4o4j97P3K48J0J22j7J04k43L2J98j35l08Q4J40j95J05K64
4103B36k78K08k81J64J06k61M3J48m4j69J63N3o5k25p5K89j31LQ9k88J38J07j89
4126b59L19Rj15M1K22l47J12K7J02j50J71k74K49j79K82j01j88m3K42J27l78J96
4148F5k4j76K89l07J76j35P8pL6K75l54J05n6k00J56J95j58%K8j6PrM9J33k11
4173f1M8j99L25o1J5o1J6p5k0O7J2Mj07K06k38j09K54J83l00K7P9m6M5p7K15k63
4199a21K56k54j06O6K48J30j09l03K62n8l4O6q1N6j13K70Qk68M2J68j93j35M01
$$ plain form
4222 198 -59 -214 41 15 -98 -46 -55 -71 135 -226 28 -34 -80 93 -183 -23 14 24 -60 -155 -79 -62 28 -160 70
4247 70 40 69 -41 42 -120 141 -135 -96 127 29 117 -39 -69 -30 157 31 -106 -190 134 -143 -166 0 31 -253
4271 -253 45 -153 152 -54 -133 143 3 -206 78 150 -218 -19 223 -121 5 -29 99 59 49 -84 39 55
4293 55 18 45 29 -140 -35 -116 138 49 -169 -31 198 115 136 160 -14 26 2 200 -22 17 49 44 -205 109 -104
4318 -104 -152 140 -141 -268 -164 50 5 16 111 -52 -187 -23 -56 -26 8 -15 -84 -167 183 -158 2 -74 16 21 -34
4343 -34 101 -20 -4 68 268 -218 122 -229 216 -27 -38 -264 107 -11 85 -2 79 87 92 -7 7 320 16 112 161
4368 161 -110 80 -1 -56 106 98 54 -7 171 -2 -68 -133 53 -130 48 152 -85 -91 167 -80 -164 1 -30 -119
4392 -119 -107 61 110 265 -143 -37 -79 -92 -235 -125 202 244 67 70 204 10 -19 -228 -12 -44 81 -24 141
$$ packed form
4222A98k57j55K55k6j13N2rj6K06l61K54o2m6J73k76J60L7J0q4r5P6J7R0j88K30
4247G0l0K9j10Q3j62K61k76L9K23r8Q8j56l0L9J87j26j37q4L24k77k3J66L1k84
4271b53K98j98L05k06p9K76j40k09K84P2l68J99K42l44J26l4J28m0j0j33J23J6
4293E5l7K7j6j69J05q1K54q9k18J38K29q3K1K4j74M0k4J98k22L9L2nk49L14k13
4318a04m8K92k81j27J04K14m5J1R5j63j35J64l3L0L4k3o9q3L50l41J60p6R0Nn5
4343c4J35j21J6P2K00m86L40l51M45k43j1k26L71j18R6q7Q1QNr9J4L13l04R6M9
4368A61k71J90q1n5J62qm4o1J78j73o6o5J86j83J78J04k37oK58k47q4J65l1q9
4392a19J2J68M9J55m08J06m2j3j43J10L27M2j77LJ34j94k9k09K16l2J25j05J65
$$ plain form
4415 141 65 5 -178 177 -6 -226 21 3 92 133 20 -121 -58 -85 175 -65 34 -25 -178 -59 184 -209 -107
4438 -107 -58 74 -8 -138 191 -73 -53 -163 -150 -101 70 180 -32 16 -187 -25 -224 0 4 62 159 -164 -133 11
4462 11 28 58 85 -33 15 153 115 5 64 86 104 60 222 71 -83 -31 101 177 182 -182 -4 -70 -226 207 -17
4487 -17 -64 71 -25 135 -74 -107 49 32 -156 -20 -261 7 214 176 -251 281 105 -206 -112 143 -114 94
4509 94 51 141 -141 222 89 -111 118 -231 -59 -66 18 186 34 9 18 -179 208 -48 18 -90 -100 21 224 8
4533 8 41 -15 21 64 28 -9 37 -129 5 113 -71 165 -9 65 93 -147 27 214 2 -133 222 333 -5 42
4557 42 -196 -39 55 279 -148 7 -19 -123 -2 114 89 100 -141 -227 55 319 -44 -100 60 -79 109 -93
4579 -93 181 154 108 -117 180 -260 -156 6 161 -37 -57 130 -10 -58 -89 -35 -152 -99 66 142 -44 65 -29
$$ packed form
4415A41p6o0j83L55j83k20K47j8Q9M1j13j41O3k7K60k40R9n9j53J19K43l93J02
4438a07M9J32q2j30L29k64K0j10J3M9J71J10k12M8k03J62j99K24MN8R7l23L1J44
4462A1J7L0K7j18M8J38l8j10N9K2J8m4J62j51j54N2J32P6Nl64J78o6j56M33k24
4487a7m7J35r6J60k09l3J56j7j88J36k41K68K07l8m27N32j76l11R4K55k57K08
4509I4m3R0k82L63j33k00K29l49J72pQ4J68j52k5Rj97L87k56O6j08j0J21K03k16
4533HL3n6L6M3l6l7M6j66J34J08j84K36j74P4K8k40J74J87k12j35L55J11l38M7
4557D2k38J57R4K24m27J55k6j04J21J16k5J1k41q6K82K64l63n6J60j39J88k02
4579i3K74k7m6k25K97m40J04J62J55j98k0J87j40m8l1N4j17N3J65P6j86J09r4
$$ plain form
4602 -29 55 -7 0 211 -24 -63 158 -65 69 280 -281 -9 -132 281 132 19 -68 193 -36 -221 -27 253
4624 253 -105 25 -54 -70 -87 -79 -284 -5 -98 112 -49 -120 71 -209 28 -358 4 -52 -51 -2 82 -309 133 -121
4648 -121 -176 -31 -133 -78 -14 87 -196 -52 157 32 56 -82 -123 -162 -89 -325 -30 102 77 -209 -260 -192 219
4671 219 -213 126 -26 -129 250 78 -45 -51 272 133 145 48 99 -189 -17 -156 -49 85 -5 -47 -9 62 -157
4694 -157 -111 -91 -1 -62 85 -20 3 3 -60 58 30 70 22 -18 -84 -59 -196 -90 24 -30 -90 33 18 -50 274 1
4720 1 104 69 119 -47 102 13 227 -44 89 -158 147 -162 95 41 -57 -68 -62 104 27 -123 -66 143 111 -21
4744 -21 -81 -192 -15 116 43 50 13 -12 54 88 58 7 -219 67 123 -99 -100 -19 -200 -184 109 274 -24 16 -49 -141
4770 -141 159 40 106 -38 138 327 150 -101 31 113 -16 -200 -223 -49 71 -63 38 -23 25 -23 47 221
$$ packed form
4602b9Q4o2PK11k35l9K21k23J34K11n61K72j23M13j49j13q7K61k29j85J94K80
4624B53l58J30p9j6j7Qk05K79r3K10j61p1J91k80K37l86L62n6JM9Q4l91M42k54
4648a21n5J45j02N5O4J01k83J44K09j25K4j38m1l9P3k36K95J32k5k86n1O8M11
4671B19m32L39j52j03L79j72j23oL23j39J2r7N1k88J72j39J07J34r0m2L8P1k19
4694a57M6K0R0o1J47j05K3%o3J18k8M0m8m0o6K5j37J06J14n4o0J23j5o8L24k73
4720AJ03l5N0j66J49q9K14k71J33k47L05l09K57n4r8j1OJ66p7j50N7K09l2j32
4744b1o0j11J77J31p3Pl7k5O6L4l0n1k26K86N6k22jQ1j81J6K93J65k98M0o5r2
4770a41L00j19O6j44J76J89j77k51J32Q2j29j84k3J74J20j34J01o1M8m8P0J74
$$ plain form
4792 221 193 -152 95 -155 86 -249 -157 135 -101 -3 -7 180 -104 95 63 -265 128 -107 -108 -58 -151 181 23
4815 23 28 25 -67 -77 103 100 -144 60 147 152 123 -167 -136 -12 -135 -144 140 -57 -192 52 168 92 209 -124 -85 133
4841 133 154 163 -66 98 16 -128 -45 -311 148 -183 212 155 -243 -146 -118 20 20 -103 64 59 134 2 -61 -148 -151 103
4867 103 -244 -226 -167 -141 126 24 -76 -96 -99 233 25 -1 -54 -130 16 -64 106 6 202 211 169 -5 108 -39
4891 -39 -54 -40 238 -143 10 24 -157 115 129 102 -95 -107 46 -76 -201 112 123 -40 68 -137 188 -38 84
4914 84 142 -124 135 -146 69 -62 -25 -170 147 -25 -55 -42 -97 -33 -256 272 184 -4 -63 -99 -172 96 -2 -5 61
4939 61 30 154 -122 -35 13 -75 -98 -47 157 81 40 -77 77 98 318 -67 131 142 228 -137 10 -9 16 -22 -11
4964 -11 129 -9 282 56 212 -231 -4 -66 -116 95 110 33 -66 -95 -65 70 -132 -117 -184 -111 159 207 109 -18
$$ packed form
4792B21k8l45K47k50K41l35R2K92k36R8mJ87k84J99l2l28L93k35jN0r3L32j58
4815B3Nlr2j0J80lk44K04Q7Nk9k90L1J24j23rK84j97j35K44J16p6J17l33L9K18
4841A33K1Rk29J64q2j44Q3k66M59l31L95n7l98R7K8J38%j23J67nP5j32o3q7lK54
4867A03l47J8N9K6K67j02j00k0lL32k08k6n3p6J46q0J70j00J96Rm2j74J13j47
4891c9j5J4K78l81J53J4j81K72J4k7j97j2J53j22j25L13J1j63J08k05L25k26J22
4914H4N8k66K59k81K15j31L7j45L17j72l0J3n5O4k23N28q8j88n9l6p3K68r8lO6
4939F1l1J24k76Q7M8q8k3N1K04p6m1j17J54K1K20l85J98J1Q6l65J47j9K5l8J1
4964a1J40j38K91k26J56m43K27o2n0K11J5p7r9k9L0J35k02J5o7P3K70M8r8j27
$$ plain form
4988 -18 149 -89 -126 217 11 53 -200 102 74 -47 102 -88 241 196 172 39 -18 152 246 -83 143 -41 -137
5011 -137 -141 100 37 67 -101 -4 -29 -165 -226 -24 228 179 -28 -98 -31 -249 209 91 70 -87 -132 -118 200 99
5035 99 11 286 -125 -27 22 195 -71 -114 27 128 -81 269 -114 -28 13 -187 -26 -40 -41 -72 -51 13 73 -121 57
5060 57 -58 -108 3 -272 147 37 -42 137 177 75 271 -270 -78 267 -20 141 213 -173 97 -28 -49 29
5082 29 -2 165 29 -122 75 -73 -170 -20 116 -19 -51 -14 176 100 -315 -190 186 3 5 247 29 21 -163
5105 -163 202 68 242 -175 114 -29 -4 -124 -113 -20 31 -98 -116 -36 -267 6 30 259 -208 188 4 10 -165
5128 -165 -27 55 175 -71 -156 -75 -177 212 -2 -69 -218 34 69 -43 -142 -325 -268 61 245 -134 69 -3 109
5151 109 -269 31 -202 105 -188 52 139 -171 -24 44 120 132 -77 -182 102 -113 -130 348 -222 265 188 -67
$$ packed form
4988a8J67k38l7L43k06M2k53L02k8j21J49j90L29m5k4j33n7J70R4l29K26j84r6
5011a37mK41o3L0j68R7k5j36o1K02K52m9k07p0O7k18M58j18k1j57m5J4L18j01
5035I9q8K75m11R8M9J73k66m3J41J01k09L50l83Q6M1k00J61j4jl1K1O4O0j94J78
5060E7j15n0J11k75M19j10p9J79M0j02J96n41J92L45k87J61P2l86K70j25k1P8
5082B9l1J67j36j51J97j48r7J50J36j35l2L7J90p6m15J25L76j83KK42k18qj84
5105a63L65j34J74m17K89j43K5j20J1R3N1j29j8Q0k31K73K4K29m67L96j84Oj75
5128a65J38Q2J20k46q5Q1j02L89k14o7j49K52L5j12r9j83N7L29J84l79K03p2J12
5151A09l78L00k33L07k93K40Q7l10J47O8P6J2k09j05K84k15j7M78n70M87p7k55
$$ plain form
5173 -67 79 -90 -214 -38 60 196 19 -18 -23 -195 -47 -32 -78 -241 -91 -59 -81 -158 -30 52 259 170 -89 85
5197 85 95 -81 -156 30 -136 -374 -141 -132 37 -40 42 40 22 -198 101 89 -38 21 -83 -102 -68 -120 40 167 -1
5222 -1 276 51 99 42 -60 141 -71 56 -3 126 -43 -254 102 104 149 -34 40 158 99 -203 125 104 125 -75
5246 -75 128 178 -147 -38 -224 77 -72 131 -28 -165 18 -142 -29 48 -322 -67 -264 40 -54 173 -34
5267 -34 -1 200 47 33 -269 127 -123 295 324 -164 15 73 -106 139 131 -93 -38 21 77 -73 73 -44 -79 97
5291 97 -131 -105 -13 41 -7 77 124 60 72 21 31 -112 39 122 198 15 58 52 -155 67 209 -77 261 -46 -13 -197
5317 -197 227 12 -118 201 -28 -47 -109 62 -169 -74 41 34 -19 -32 59 -23 249 -34 73 10 197 -25 -214
5340 -214 -97 61 136 -13 -263 118 -200 93 96 103 197 194 -119 -22 -189 142 -32 -82 7 35 223 -49 265 -80
$$ packed form
5173f7J46j69j24J76R8J36j77l7nj72J48J5m6j63J50L2k2p7J28Q2K07q9k59J74
5197H5J0j76p5J86j66k38K33RJ69p7Q2kj8k20K99j2j27N9j04j9L4n2J60J27j68
5222aK77k25M8n7j02K01k12J27n9J29j69k11L56KM5j83P4J18n9l02L28k1K1k00
5246g5K03N0l25J09j86L01j49K03j59j37J83j60J13P7l70K55j97L04r4K27k07
5267c4L3K01j53j4l02L96k50M18K9m88J79N8j79K45qk24N5N9N6j50J46j17l5J76
5291I7k28K6R2N4m8Q4M7o4J2n1J0j43J51Q3P6j83M3ok07K22J42k86L38l07L3j84
5317a97M24k15j30L19k29j9o2J71k31R5J15pn3j3R1q2K72k83J07o3J87k22j89
5340b14J17J58P5j49k50L81l18K93LPR4ll13R7j67L31j74n0Q9K8J88k72L14l45
$$ plain form
5364 -80 -179 78 -106 25 93 15 56 -55 -99 -145 -109 -26 96 124 -83 161 -13 338 -105 38 -19 -89 135 -62
5388 -62 -27 128 -136 -86 -4 -205 -105 -90 -315 -58 197 -117 212 -101 129 -42 6 -263 -87 50 222 -296
5410 -296 -96 39 -117 115 -64 121 -196 -267 -218 36 -156 116 235 214 202 100 136 -69 -132 -135 -41 116 -162
5433 -162 -11 -151 9 -260 -126 -195 -63 149 257 54 -20 119 -103 -31 -331 74 164 19 97 -213 4 -102
5455 -102 17 117 -143 14 180 22 -84 8 -291 -76 75 -24 74 229 -13 -181 -16 73 99 17 -103 135
5477 135 177 76 18 -166 -141 140 -123 -35 -61 -292 154 -23 -192 -5 308 55 28 241 124 -112 -133 89
5499 89 -8 -127 241 -89 128 -31 20 -13 -29 -58 232 16 74 -92 37 -27 -16 -103 46 281 185 62 -136 5
5523 5 40 -101 12 94 25 -115 -8 -180 -20 -78 -57 144 23 -1 -123 99 -72 -68 79 -26 -68 -217 57 67
$$ packed form
5364h0r9K57j84J31O8p8M1j11m4m6L6Q3J22K8k07K44j74L51m43J43n7p0K24j97
5388f2L5J55k64N0Q2k01J00J5k25K57K55l14L29l13K30j71M8k69J76J37J72n18
5410b96K00J35j56K32j79J85l17p1M9K54j92K72J19k1j2j02L6k05o3lR4J57k78
5433a62J51j40J60k69J34o9J32K12J08k03p4J39k22P2l00M05R0j45P8l10K17j06
5455a02J19J00k60J57J66j58j06R2k99K15J51r9R8J55k42j68J65Q9K6q2j20K38
5477A35M2j01n8j84K5K81k63Q8k6k31M46j77j69J87L13k53k7K13j17k36k1K22
5499H9r7j19L68l30K17j59N1l3j6k9K90k16N8j66J29o4J1q7J49K35r6j23j98J41
5523EL5j41J13Q2o9j40J07j72J60n8K1K01j21k4j22K22j71MJ47j05m2j49K74J0
$$ plain form
5547 67 9 -146 -52 37 -182 51 27 76 -14 -118 -42 -13 -229 87 259 -15 -139 -273 32 -114 127 -185 187
5570 187 -79 38 -235 -24 44 106 -94 -16 -70 142 136 -328 71 -6 59 194 -49 51 -67 -69 -6 -12 106 75 -55
5595 -55 -61 43 -93 9 189 238 -118 -52 217 -69 80 70 -76 100 -52 151 85 -45 144 65 179 216 -120
5618 -120 58 30 -160 -38 50 -117 -30 -194 71 -11 -86 -39 -65 18 64 22 -273 -77 159 173 34 -7 181 -65
5642 -65 -178 -6 -126 -45 265 -168 -152 -193 59 68 -196 -125 161 143 52 0 55 -114 -160 35 -59 53 140 203 88
5667 88 -185 110 1 71 112 50 -116 -146 69 -173 7 -150 95 221 -156 30 -7 -26 -76 -129 32 226 175
5690 175 -63 43 45 -159 -149 -189 309 21 72 -4 145 53 -58 -22 159 -10 -86 142 13 230 71 127 51 -65
5714 -65 -19 -47 -31 69 -89 -31 132 39 -33 41 232 92 155 -37 119 -123 124 79 -50 -20 142 71 5 225
$$ packed form
5547F7n8j55R4Q9k19K33k4M9r0j04P6K9k16L16J72k74j24j34L05j46K41l12L72
5570A87k66J17k73K11O8O2k00P8n4K12om64L99p7O5J35k43J00j18kO3oJ18l1j30
5595e5oJ04j36J02J80M9l56O6K69k86J49j0j46J76j52K03o6j30J89p9J14L7l36
5618a20J78k8j90J22Q8j67Q7j64K65q2p5M7k6Q3M6m2k95J96K36J4j39m1J88k46
5642f5j13J72j20Q1L10m33J6m1K52Rk64P1K86j8r1n2N5j69m6J95r4J12Q7O3j15
5667H8k73K95j09P0M1o2j66l0K15k42J80j57K45J26l77J86l7j9n0n3J61J94n1
5690A75k38J06Kk04J0m0M98k88N1p6J49r2j11L6J81j69p6K28j29K17j59N6p6j16
5714f5M6k8J6J00j58N8J63r3p2P4J91j40O3j92J56k42K47m5j29L0J62p1o6K20
$$ plain form
5738 225 58 111 -116 -94 -126 113 -36 137 121 -104 -62 -60 68 32 102 140 309 7 261 155 112 -71 122 -86
5762 -86 62 -43 -84 -137 -35 -153 -130 289 120 56 -163 49 -111 -93 -28 265 -9 32 140 12 109 79 32 -45
5786 -45 259 122 -123 203 68 10 -149 147 -119 -151 53 -17 190 -156 -61 -40 -20 -174 -101 115 89 -45 114
5809 114 59 19 -162 -105 33 -142 112 -140 -215 -174 -73 237 -13 167 117 -118 -98 41 -42 -77 -44 14 252 21
5833 21 19 64 30 29 64 -75 -229 18 48 -195 -113 3 -96 -77 77 -168 14 -89 -134 83 -81 -47 190 -41 -62
5858 -62 -11 68 -71 -10 -272 -97 -135 59 179 -122 136 64 -84 -66 127 -46 -120 19 -106 32 -38 205 -198
5881 -198 -208 -94 97 -56 -319 -204 41 -107 8 197 -34 -35 -83 -176 -20 423 -22 -193 -60 -6 8 -73 -67
5904 -67 -73 49 127 -83 -34 -104 -63 -101 86 -253 -59 132 62 29 207 124 150 -84 -61 -124 -61 155 -255 -8 111
$$ packed form
5738B25j67N3k27K2l2K39j49J73j6k25M2KJ28l6P0L8J69l02K54j06m3j83J93k08
5762h6J48j05m1n3J02j18K3M19j69o4k19K12j60J8O5K93k74M1J08j28R7l0m7p7
5786d5L04j37k45L26j35n8j59K96k66l2K04p0K07l46R5K1K0j54P3K16k6j34J59
5809A14n5m0j81N7J38j75K54k52p5M1J01L10k50J80n0k35K0J39q3l5L3N8K38k31
5833B1kM5l4jL5j39j54K47L0k43Q2J16r9J9J54k45J82j03m5K17j64L4K37k31k1
5858f2N1P9j39O1k62J75l8J94J20l01K58p2j48J8J93j73p4J39j25J38p0K43m03
5881a98j0J14J91j53k63J15K45j48J15J89k31jm8r3J56M43m45j71J33N4J4q1O
5904f7oJ22P8k10M9p0M1l8J87l39J94J91p0l3J78q3K6k34K3o3O3K16m10K47J19
$$ plain form
5929 111 94 152 -94 -39 -6 73 262 -16 -29 -98 -99 -68 78 97 157 -66 -214 22 95 -44 115 58 -69 134 214
5954 214 -57 -58 81 53 -25 184 104 44 2 127 -135 115 -74 -62 251 130 8 15 -126 -129 96 60 22 129 -98
5979 -98 32 130 175 -33 63 -167 -10 122 94 -120 -29 -312 37 -195 157 186 66 94 -25 83 88 72 110 30
6003 30 -324 159 -192 106 -145 -169 144 2 31 -144 -118 -106 116 -117 220 -79 325 0 -237 40 -96 11
6025 11 -88 44 -145 -169 143 30 -101 -99 -117 -94 97 41 170 27 62 77 152 156 -66 -10 114 -4 -41 148 -32
6050 -32 80 -200 -45 182 223 168 137 -74 -95 -112 -247 -8 197 69 -98 51 -120 56 292 41 -13 -134
6072 -134 95 149 -132 -57 -24 -86 284 -118 -42 -35 2 -53 55 -36 -93 -104 -310 85 58 13 -68 -30 113 15 -135 -111
6098 -111 83 -131 93 54 -287 -81 -164 -269 -320 12 82 140 -83 149 -74 -17 170 -212 52 64 -73 -140 -114
$$ packed form
5929A11j7N8k46N5L3P9J89k78j3o9jL1J46J9O0k23j48K36P3j39J59n7j27K03Q0
5954B14k71jJ39k8p8K09q0o0m2J25k62K50j89J2L13j21j22Pj41lK25l6l8J07k27
5979i8J30R8M5k08R6k30J57J32k8k14R1k83L49k32L52K9j20K8j19J08Nj6L8q0
6003C0l54M83l51K98k51k4L13j42K9j75K6J2K22k33L37k99M04l25k37K77j36J07
6025A1r9J32j89k4L12j13j31Kj8K3J91n6J29j43L5J5P5Mk22N6J24j18l7J89j80
6050c2J12k80J55K27M1n5l1k11k1j7j35K39K05j28j67J49j71J76K36k51n4j21
6072a34K29N4k81P5L3o2L70m02P6PL7n5J08r1n7j1k06L95k7m5q1L8J43r8j50K4
6098a11J94k14K24l9l41K06q3j05n1L32P0N8k23K32k23N7J87l82K64J2j37o7K6
$$ plain form
6121 -114 60 235 29 9 52 73 11 -86 -141 7 -111 -92 -53 -196 -48 64 85 -184 -92 188 127 -51 329 9
6145 9 -62 -90 -22 163 -80 45 28 86 -35 117 -23 83 71 109 153 -127 -115 93 -122 -47 58 148 -365 -67
6169 -67 -83 181 -28 -45 -16 -74 26 43 -24 128 -209 189 73 122 110 30 -214 60 212 16 59 -100 -177 20
6193 20 -44 151 -192 63 -22 168 234 25 59 109 -26 137 -115 -369 -104 -152 125 -136 105 50 -180 -18 23
6216 23 36 -177 -198 -47 279 18 -22 -71 17 182 174 97 -10 35 24 31 -19 20 -57 27 42 28 -62 -147 173 46 122
6243 122 62 70 -116 10 -3 56 110 -173 27 -181 214 86 206 -304 39 58 -216 -132 -6 -27 112 81 22 -59
6267 -59 -72 75 169 93 93 56 -258 245 57 -70 21 89 -7 -40 9 175 71 -167 -10 42 -227 64 -305 100
6291 100 -154 15 94 42 100 -63 107 167 136 -24 -142 -26 -74 64 -3 25 45 149 -129 -315 -14 -241 93
$$ packed form
6121a14J74J75k06k0M3K1o2r7n5J48j18J9L9j43J48J12K1k69R2K80o1j78L80l20
6145Ip1k8O8J85k43J25j7N8j21J52j40J06j2L8M4k80J2K08k15P5J05R0n13K98
6169f7j6K64k09j7K9n8J00J7o7J52l37L98j16M9j2q0k44K74J52j96M3j59p7J97
6193B0o4J95l43K55q5J90O6k09L4N0j35J63k52k54K65m8K77k61K41n5k30J62M1
6216B3J3k13k1J51L26k61m0m9Q8J65qp7j07M5j1Pn0L9p7Q4J5j4r0q5L20j27P6
6243A22o0Qj86J26j3N9N4k83K00k08L95j28J20n10L43J9k74Q4J26k1J39l1n9q1
6267e9j3J47R4p6%l7l14N03j88j27R1O8r6l3M9J66j04k38J57N2k69K91l69M05
6291A00k54J69P9n2N8j63J70O0l1j60j18J16m8J38o7K8K0J04k78j86L01k27L34
$$ plain form
6314 93 -277 -224 -94 -307 -81 -100 168 -24 -441 -168 61 103 131 -64 -291 -227 15 120 55 -174 8 62 -76
6337 -76 169 42 88 -155 56 96 -215 179 -11 34 2 236 188 247 -154 -17 -23 -133 -96 43 -130 12 57 -98
6361 -98 101 41 181 29 53 24 122 118 -99 -89 20 -116 -208 69 -140 72 209 54 -131 47 36 26 45 -71
6385 -71 -138 -134 53 -44 170 -115 97 83 6 -161 -15 93 5 76 4 -142 -78 94 167 -66 45 -173 84 -102
6409 -102 -45 -66 60 -64 258 102 91 3 -64 83 102 -216 -112 72 318 85 51 -140 -48 -118 -211 70 -210
6432 -210 -101 -57 71 -168 -34 5 -12 -42 -132 -303 182 -59 39 -45 185 89 125 53 -237 -95 97 60 -103 70
6456 70 -185 -82 91 43 -66 81 -13 44 48 170 -171 -20 -32 -85 168 33 119 244 97 94 30 -175 219 -79
6480 -79 136 61 -16 282 91 -57 133 125 -13 195 153 -6 153 -59 -141 -131 280 103 93 -134 161 -12 210
$$ packed form
6314I3l70N3J30k13K26j9K68j92m17K73K29M2K8j95k27O4K42J05o5k29J82N4j38
6337g6K45j27M6k43K11M0l11L94j90M5l2K34m8N9m01J37oj10L7J39j73J42M5j55
6361i8J99o0J40j52K4k9R8mk17J0J09j36r2K77k09K12J37j55j85J78j1j0J9j16
6385g1o7MJ87r7K14k85K12j4p7j67J46J08q8P1p2j46O4J72P3k33J11k18K57j86
6409a02N7k1J26j24L22j56j1q8o7J47J9l18J04J84K46k33l4j91R2p0r3K81k80
6432b10J09M4J28k39J34L9j7l0r0j71M85k41R8q4K30r6L6p2k90J42J92l7j63J73
6456G0k55J03J73m8j09J47r4N7MJ22l41J51j2n3K53j35Q6J25j47lo4k05L94k98
6480g9K15p5p7K98j91j48J90qj38K08m2j59J59k12q2J0M11j77j0k27K95j73K22
$$ plain form
6503 210 58 -55 79 23 -291 -212 228 -156 -36 -62 -28 269 -116 11 244 84 -6 118 -131 109 43 61
6525 61 199 127 -44 -15 -58 -55 -83 179 0 61 5 135 -55 17 85 -6 -44 41 -36 20 9 146 -13 242 -303 -69
6551 -69 -117 172 32 -97 238 -119 213 -35 89 -138 227 -146 33 118 -87 -159 -20 174 -118 -43 161 141
6573 141 -142 120 129 44 172 -145 -130 79 49 17 51 33 1 -53 -20 14 -251 69 -91 269 -89 -213 -5 110
6597 110 88 174 189 -150 -174 38 -86 127 -30 42 -65 -7 -100 -21 134 -45 55 56 -50 -4 -1 22 195 201 -42
6622 -42 -223 150 -205 60 -26 -232 -33 23 18 88 76 199 -70 -42 -138 15 39 -162 137 -87 261 125 35 22
6646 22 -81 49 -200 72 19 47 -232 -169 -36 -221 121 -62 -32 -26 103 152 -297 -47 18 -208 44 -54 -2 -165
6670 -165 38 -76 161 94 -56 -197 23 184 -214 -80 -72 13 -106 -193 -108 -178 88 -103 49 -141 22 137
$$ packed form
6503B10j52j13J34n6l14P9M40l84J20k6L4K97l85J27K33j60r0J24k49K40o6J8
6525F1J38p2j71K9m3Lk8K62j79O1n6J30j90P2O8r1l8Q5p7N6j1J37j59K55n45K34
6551f9m8K89j40j29L35l57L32k48J24k27L65l73J79Q5k05p2J39J94k92P5K04k0
6573A41k83K62Rq5J28l17J5K09l0l2L4j8l2n4L3L4k65L20j60L60l58j24K08J15
6597A10k2Q6J5l39k4K12j24K13j57P2j07N8r3P9J55j79J00Jj06M6LK3J73Ok43
6622d2j81L73l55K65q6k06J99N6nP0j2J23k69K8r6J53K4k01K99k24L48j36r0j3
6646B2j03J30k49K72n3K8k79O3J33j85L42j83L0OJ29M9m49K50O5k26K52r8N2j63
6670a65K03j14K37o7j50j41K20J61l98J34QQ5j19q7Q5p0K66j91J52j90J63J15
$$ plain form
6692 137 275 -182 67 -197 156 55 59 51 -89 -95 -28 -8 -142 72 -210 -181 11 42 -30 -1 112 19 107 212 -10
6717 -10 34 55 32 -113 -344 -77 193 -53 -28 170 70 -108 100 58 124 173 70 -16 69 14 126 -285 296 3
6741 3 -113 -78 -32 -276 56 166 53 -172 301 -42 -56 -36 115 56 11 233 -35 164 -57 252 -61 -121 7
6764 7 -137 83 0 114 73 26 -20 -110 -67 -41 44 -192 21 104 141 -5 -230 72 -29 -26 -91 -91 -162 -259 243 130
6790 130 -48 -101 238 -116 97 48 78 -45 98 -98 -273 -24 0 -44 79 -56 -136 86 -270 83 -18 -44
6812 -44 -17 -62 32 -151 -233 -224 273 -70 55 96 115 -99 -9 -40 121 123 163 13 -45 -6 59 97 -104 -70 -6 -66 78
6839 78 92 -214 -97 -30 52 227 -202 271 189 -166 -152 -154 -153 -102 31 64 189 -97 -39 20 190 346 -183 51 188
6864 188 69 -224 -85 -134 53 133 46 131 42 -213 32 -133 -141 -83 -129 158 192 -119 140 82 156 -72 -186 -73
$$ packed form
6692A37J38m57K49k64L53j01Mqj40oO7K0j34K14k82K9J92L1p2K9J13r3Q8J05k22
6717a0M4K1k3j45k31K67K70k46K5J98j00j78K08m2O6M9j03q6Q5n5J12m11N81k93
6741Cj16L5M6k44L32J10j13k25M73l43j4K0J51n9m5K22k68J99k21L09l13o0J28
6764Gj44K20q3J14m1m7m6r0M3K6Q5k36K13Q3L7j46k25L02j01Lo5%p1r7N02j13
6790A30j78n3L39l54K13m9L0j23J43j96j75K49K4m4J23j35q0K22l56L53j01k6
6812d4K7m5R4j83q2RM97l43J25M1J9k14R0l1J61KM0j50n8L9O5L8k01L4O4o0J44
6839G8J4l06J17O7Q2J75m29M73q2l55J4kJN1J33L3J25k86N8N9J70J56n29K34J37
6864A88j19k93J39m9J87Q0q7Q5q9k55K45j65qN8m6K87L4l11K59n8P4k28j14J13
$$ plain form
6888 -73 19 -47 -46 -29 100 -46 -17 -41 -74 -118 -77 46 -66 50 94 97 261 409 -7 136 -40 95 -38 -117 191
6913 191 42 130 -18 -4 143 -307 -97 151 184 82 -79 -65 -10 -113 -197 173 -160 -87 -109 136 18 155 4
6936 4 -11 44 54 -167 -130 -20 -100 -16 51 362 -147 -54 60 -137 -167 -200 70 -91 -47 -51 -93 137 134 44 -213 -175 102
6963 102 113 -212 -34 -96 37 85 -320 207 43 78 157 -99 195 -33 50 -74 145 104 54 57 -223 -93 69
6986 69 58 -151 -197 -210 216 -144 -4 33 67 50 -173 -199 -6 60 86 -31 -224 57 -28 144 356 -20 -78 -146
7010 -146 123 -144 32 -48 109 40 -61 95 -101 -82 21 -268 107 130 52 120 -132 -81 121 144 -72 59 -71
7033 -71 -73 -43 14 146 -98 -41 -68 49 -43 83 -183 83 -233 136 73 -2 -11 -73 26 -6 156 53 -63 17 194
7058 194 -163 -28 93 46 101 126 1 32 -161 -112 -73 -201 -49 -44 64 -205 -205 148 57 21 72 -6 -24 -212 47
$$ packed form
6888g3R2o6JJ7J29j46K9k4l3m4M1J23j12J16M4LJ64J48m16J43j76J35j33p9L08
6913A91j49Q8j48J4J47m50K10K48L3j02j61J4N5j03q4L70l33P3k2K45j18J37j51
6936Dj5N5J0k21L7J10q0Q4O7L11n09R3J14j97l0l3K70j61M4mm2K30lr0k57L8K77
6963A02J1l25J78o2J33M8m05N27j64L5P9k56K94k28Q3j24K19m1n0Lk80J30J62
6986F9j1k09m6j3M26l60J40L7L4j7k23k6J93O6K6j17j93K81q5J72K12l76n8o8
7010a46K69k67J76q0J57o9j01J56j96J9J03k89L75K3p8O8k52N1K02K3k16J31j30
7033g1kL0N7J32k44N7k7J17r2J26k66K66l16L69o3p5ro2R9l2J62j03j16Q0J77
7058A94l57J35J21m7N5K5j25L1j93M9L9j28J52NJ08k69%L53r1l6N1p8j8j88K59
$$ plain form
7083 47 -108 201 -72 -117 -33 -283 -87 -62 101 50 5 -67 -133 -117 136 62 -113 116 32 -229 233 303 221 151 -85
7108 -85 -51 -71 -166 -140 -102 40 172 134 -37 -85 -157 107 44 -45 93 -183 74 5 -21 -32 -215 -93 -161 214 236
7133 236 -301 49 16 25 -107 150 -239 -93 277 51 122 -154 -87 -137 127 30 114 -138 49 -230 -44 4 -183
7156 -183 -16 -327 -111 161 -235 -174 57 34 -2 -75 -122 -6 97 -198 29 181 -66 -10 -151 65 -161 69
7178 69 63 17 72 43 -61 -99 18 53 137 -24 -115 -207 -118 -88 -264 109 59 121 -166 -48 -68 59 120 -110 158 -93
7204 -93 157 -231 46 226 166 136 118 36 -53 -124 100 -114 70 52 95 222 -75 102 -98 108 191 228 176 312
7228 312 209 -11 38 -3 81 121 48 93 96 59 -13 -63 -123 47 257 42 -59 -67 47 -83 -90 131 90 146 -195 113
7254 113 -126 -38 221 -56 -24 -120 -28 -132 -5 -5 33 32 -116 -131 11 56 111 121 198 -97 -195 82 -187 -75 3
$$ packed form
7083D7j55L09k73m5Q4k50J96K5J63n1m5p2o6J6K53p4j75K29q4k61M62P0q2p0k36
7108h5L4k0r5K6L8J42J32l8j71m8p2K64o3q9J38k76K57o9k6j1j83J22o8L75K2
7133B36n37L50l3Rj32K57l89J46L70k26P1k76O7n0K64r7Q4k52J87k79J86M8j87
7156a83J67l11K16K72l96O1K31k3l6p3m7J16J03k95K27J52k47N6j41K16k26K30
7178F9om6N5k9j04l8J17L5Q4j61r1r2Q9L0j76L73n0O2k87J18k0J27O1k30K68k51
7204i3K50l88K77J80o0l0j8q2q9p1K24k14J84j8M3J27k97J77k00K06Q3L7n2J36
7228C12j03k20M9m1Q4M0p3M5Ll7p2n0o0J70K10k15j01qJ14j30pK21m1N6l41L08
7254A13k39Q8K59k77L2r6R2j04J27%L8jj48j5J42M5N5J0P7k95r8K77k69J12P8
$$ plain form
7279 3 -80 -50 -164 127 88 261 137 -98 -85 191 185 -54 -38 -102 115 44 142 55 -81 36 -144 216 -139 -69 91
7304 91 -34 146 19 50 179 154 13 52 91 68 -11 -69 -255 149 -11 69 -40 -154 251 -170 31 -190 65
7327 65 11 -177 289 -81 32 -45 135 92 -155 173 -255 60 -192 -88 -11 68 -60 95 152 79 -36 176 -13
7350 -13 -91 133 53 103 -22 -15 -45 64 79 151 -40 -201 169 -155 -37 -87 54 -67 56 -123 -43 150 -186 -255
7374 -255 59 -7 -194 109 107 -182 8 70 -89 19 -48 -20 -151 80 -133 11 232 170 -69 -65 -186 175 -74
7397 -74 17 187 -54 28 71 270 -6 136 -2 -87 -41 56 250 140 20 35 -61 -43 29 -132 9 -285 116 -103
7421 -103 66 -3 129 180 213 251 92 -174 249 -83 -33 188 101 28 14 -72 -137 -14 50 357 20 -63 -60 -69 85
7446 85 5 -135 -138 77 178 -153 -19 100 -109 147 15 -16 62 233 48 -49 -43 245 134 -11 -243 15 -226
$$ packed form
7279Cq3L0j14K91l9J73j24k35J3K76ok39J6o4K17p1R8q7j36J17j80L60l55P0J60
7304I1j25J80j27L1J29k5j41L9L9k3p9n8j86M04j60Q0j09j14M05m21K01k21K55
7327F5n4j88M66l70J13p7J80m3k47L28m28L15k52J04P7P9j28J55N7p3j15K12j89
7350a3p8K24q0N0j25Pl0J09J5P2j91j61L70l24J18n0J41j21J23j79Q0J93l36o9
7374b55L14o6j87L03kk89J90O2j59J08o7K8j31K31k13J44K21o2k39Mj21L61k49
7397g4R1J70k41Q2M3J99k76J42j38q5M6R7J94j10j20J5r6J8P2j61J41k94M01k19
7421a03J69o9J32N1L3L8j59k66M23l32N0K21q7p3j4q6o5J23O4L07l37q3LrJ54
7446H5q0j40lK15J01l31J34J19k09K56j32l1P8J71j85r7OK88j11j45k32K58k41
$$ plain form
7469 -226 -146 9 104 -1 0 46 -301 149 -84 52 7 190 111 -3 -194 93 85 -16 77 160 82 -138 -15 -357
7493 -357 37 158 -118 -77 -117 -44 -184 -313 150 -270 -69 -179 -394 206 268 -85 165 -90 -270 -67 -84 98
7515 98 -16 -136 23 -186 152 37 4 50 34 -132 -82 -22 -77 -127 230 -42 50 63 77 -90 -179 198 -95 22
7539 22 -43 217 193 96 -155 -44 -214 48 46 -127 -60 -115 -218 118 110 -174 26 -202 71 -160 -35 104 93 -147
7563 -147 12 48 311 -106 -4 122 79 25 152 9 28 -2 -286 -64 11 -241 -31 142 135 -4 143 54 -146
7586 -146 -185 55 -25 -5 -131 -129 54 -124 70 -39 85 -121 60 103 15 -8 -84 75 -30 -148 65 -76 94
7609 94 147 17 1 23 -44 174 3 -75 -110 0 167 -41 -145 22 17 -68 36 -127 -180 108 81 -161 91 -66
7633 -66 143 68 51 -186 40 -371 -101 132 -123 99 -286 -21 -145 36 -10 55 -53 -226 -21 29 207 222
$$ packed form
7469b26Q0J55R5j05JM6l47M50k33J36m5J83p9j14j91K87qj01R3Q3p8k20J23l42
7493c57L94J21k76M1m0P3j40j29M63m20K01j10k15O00O2l53K50k55j80K03j7J82
7515I8j14j20J59k09L38j15l3M6j6j66N0O0n5n0L57k72R2J3J4j67q9L77k93J17
7539B2o5K60k4r7k51J11j70K62kj73O7n5j03L36qk84K00k28K73k31J25J39j1k40
7563a47J59L6K63m17J02J26m3n4J27j43J9l0k84K22P5k52K10J73pj39J47q9k00
7586a46l9K40q0K0j26KJ83j78J94j09J24k06J81M3q8k3p6J59j05j18K13j41J70
7609I4N3j30j6K2o7K18j71p8l5J10J67k08j04J67nq5J04j63n3K88k7k42K52j57
7633f6K09p5j7k37K26m11K70K33k55K22l85K65j24J81m6O5j08j73K05N0J78J5
$$ plain form
7655 222 -13 -7 2 -122 132 -75 -41 10 91 -50 -80 -33 -91 138 145 24 -104 298 12 -256 79 -141 -155 -151 -52
7680 -52 -41 5 58 262 -127 -141 -10 -47 35 -103 16 -19 -144 26 -200 118 23 -165 -105 162 -3 15 -58 -93
7704 -93 159 133 8 136 57 65 127 -108 181 85 318 -154 -37 59 106 192 -57 51 -94 -27 3 -164 192 -255
7728 -255 -26 -18 18 66 -101 -44 -1 -167 148 4 -19 35 132 8 54 27 -111 -81 -2 111 -18 11 -15 -374 183
7753 183 95 76 127 -38 11 141 239 99 124 84 13 -177 23 -19 -168 149 -27 -48 66 66 72 224 253 -86 121
7778 121 273 -91 145 -387 -20 -115 69 102 -8 -103 -127 106 124 -128 -27 -253 120 45 -51 -14 -192 5 -288
7801 -288 -111 27 -162 -123 141 -51 73 224 -3 88 153 -185 229 -64 206 -125 -240 115 13 66 -56
7822 -56 18 -87 32 125 153 136 -340 31 -96 -79 141 41 -70 156 151 -154 -55 90 83 -24 36 51 37 119 -181
$$ packed form
7655B22k35ORj24K54k07L4N1Q1j41l0M7n8K29Pj21j28M02k86k68L35k20j4MR9
7680e2J1M6N3K04l89j4J31l7Q2j38J19l5j25J70k26L18r5j88O0K67j65J8p3l5
7704i3K52k6j25J28p9QO2k35K89r6K33m72J17R6M7Q6k49J08j45O7L0j67L56m47
7728b55K29QL6M8j67N7M3j66L15j44k3N4R7j24M6k7j38L0P9J13j29K9k6l59N57
7753A83q8j9N1j65M9J30R8j40K5m0p1j90K00m2j49L17j76k1J14%OJ52K9l39K07
7778A21J52l64K36n32L67r5J84L3j10r5k4K33J8k52J01k26L73p5r6L7j78J97k93
7801b88J77J38j89L9K64j92J24J51k27R1O5l38M14k93K70l31j15L55j02N3j22
7822e6P4j05J19R3K8j7m76L71j27J7K20j00j11K26nl05R9J45pj07O0J5j4Q2l00
$$ plain form
7847 -181 16 65 4 115 296 67 92 -221 180 173 44 -5 9 148 -180 -51 161 46 129 -84 28 -20 -94
7870 -94 -115 42 37 -210 29 135 -110 57 149 -143 218 -58 -81 61 -70 -114 -37 2 62 18 169 -54 110 158
7894 158 287 -16 147 39 53 -82 -292 -274 -35 101 48 226 64 68 -264 7 109 51 -159 15 -116 -74
7916 -74 -102 24 -56 184 23 47 25 -268 -242 24 115 -219 -34 56 49 44 -30 72 99 -150 216 -15 -54 -50 -157 9
7942 9 -76 -100 -17 -102 83 -166 63 63 94 -100 18 90 -190 37 130 -232 86 35 117 -61 64 -98 -181 -58 68
7967 68 13 -9 -115 46 142 -75 124 112 -86 -21 -97 109 -8 -27 160 135 -31 121 -82 175 102 139 55 269
7991 269 91 -169 -147 102 45 50 91 57 144 -183 -89 76 -29 -67 91 55 175 -204 -152 -64 -116 14 109 -250 -347
8016 -347 92 -64 224 -12 83 61 110 -103 12 83 -19 -24 -95 46 118 -54 -135 72 -40 18 46 13 32 28 -100
$$ packed form
7847a81J97M9o1J11J81k29K5l13M01pj29m9J4J39l28J29K12j15Q3k13J12m8p4
7870i4k1J57nk47K39J06k45J67R2k92L61k76k3J42j31m4P7L9O0m4J51k23J64M8
7894A58J29l03J63j08J4j35k10J8K39J36n3J78j62Ml32K71J02n8k10J74j31M2
7916g4k8J26q0K40j61K4k2k93K6K66R1l34J85R0pnp4J02K7k49L66k31l9Mj07J66
7942Iq5k4Q3q5J85k49K29%L1j94J18P2k80K27R3l62L18n1Q2j78J25j62q3J23J26
7967F8n5k2j06J61R6k17J99j2j98O5p6K06j17j9J87k5j66J52k03K57p3L7q4K14
7991B69j78k60K2K49n7NM1l4Q7l27R4J65j05l8J58l6J20l79N2Q8n2J30R5l59r7
8016c47M39j56K88k36R5k2M9k13J15P1j02np1J41P2j72q1K07j12N8K8l3J9mj28
$$ plain form
8041 -100 36 83 129 192 201 137 142 -92 92 181 184 -114 61 -196 -197 -328 126 -179 237 -41 -55 -26 129 -147 80
8066 80 219 -33 -128 -11 -159 -115 -48 -141 160 -33 -147 86 138 -63 90 -109 30 39 145 -175 140 -55 -220
8089 -220 -192 -62 59 -131 13 -21 -149 26 -18 -43 -135 -112 -46 -220 -215 13 -14 -191 -6 254 -112 -167 -202 -29
8113 -29 -113 35 98 86 145 -46 -158 174 -45 -68 -281 -192 137 -128 194 -127 2 11 -48 -100 -176 -199 16 -147
8137 -147 320 -5 172 -39 -104 -11 85 -252 -55 -133 -179 -75 51 -84 -38 -74 -67 70 -111 -217 76 -33 -49
8160 -49 -203 74 162 93 -134 17 -70 203 -279 -107 101 7 -87 -76 90 -60 168 175 -141 -387 158 33 -32
8183 -32 -100 0 45 -151 -158 -258 -15 120
$$ packed form
8041a00J36M7M6O3Ro4Nk34J84Q9Lk98J75k57jj31M54l05M16k78j4K9J55k76K27
8066H0J39k52r5J17j48M4O7r3L01j93j14K33N2k01J53j99J39RJ06l20L15j95j65
8089b20K8J30J21j90J44l4j28J75m4k5r2K3O6j74NK28k7j77J85K60l66n5l5J73
8113b9q4J48O3j2N9j91j12L32k19k3k13Q9L29k65L22l21J29Rn9n2p6k3K15j63
8137a47M67l25J77k11o5R3R6l37J97p8m6J04J26j35M6l6PJ37j81j06K93j09j6
8160d9j54K77Q8o9k27J51q7K73m82J72K08r4r4J1J66j50K28Pl16k46N45j25o5
8183c2o8J00M5j96pj00K43J35
8191A20
$$ Imaginary data points
##PAGE= N=2
##DATA TABLE= (X++(I..I)), XYDATA
$$ plain form
0 0 0 0 0 0 0 0 0 0 0 0 0 0 0 0 0 0 4 -8 8 -8 8 -8 16 -16 16 -24 24 -31 32 -40 44 -48 56 -64 72 -83 92 -103
38 -103 116 -130 144 -162 178 -195 218 -241 265 -294 323 -357 390 -431 476 -525 578 -642 711
57 711 -794 886 -997 1128 -1288 1489 -1752 2105 -2615 3408 -4843 8219 -32906 24575 103949
72 103949 -18998 -108969 -14071 125984 91445 -19563 -49346 27248 101858 78443 -38072
83 -38072 -83695 7002 82642 19099 -66736 -55800 7835 30591 -4813 -62517 -66055 -160
95 -160 34980 -22795 -69036 -21514 42545 40764 2885 -18150 718 44499 53042 2940 -27835
108 -27835 7460 42047 22397 -9582 -14220 2921 20970 10466 -27204 -39032 -6206 13032
120 13032 -12789 -36958 -22928 4256 13855 2504 -13342 -9860 13569 21962 1725 -12495 2177
$$ packed form
0@%%%%%%%%%%%%%%%%Mj2J6j6J6j6K4l2L2m0M8n5O3p2Q4r2J04j20J36j55J75j95
38a03K19k46K74l06L40l73M13m59N06n59O17o80P47q21R07j001J103j220J353
57G11j505J680j883K125k416K777l241L857m720O023q251J3062m1125N7481P9374
72A03949j22947q9971R4898J40055l4539j11008k9783P6594P4610k3415j16515
83c8072m5623R0697P5640o3543q5835J0936O3635K2756l5404n7704l538O5895
95a60L5140n7775m6241M7522O4059j781l7879k1035J8868M3781Q543n0102l0775
108b7835L5295L4587j9650l1979m638J7141J8049j0504l7670j1828L2826J9238
120A3032k5821k4169J4030K7184R599j1351j5846L482K3429Q393k0237j4220J4672
$$ plain form
133 2177 19376 15240 1316 -3959 3732 14796 11842 -6839 -16236 -3619 6598 -1715 -13377
146 -13377 -11851 -1278 5741 2254 -5922 -5648 3859 8898 1507 -5828 -1529 7670 8140 1422 -2780
161 -2780 42 4571 4642 -2246 -9089 -6221 651 -1523 -7445 -7017 -1728 1852 1673 -576 -1460 2560
177 2560 7657 5091 375 2497 7198 7345 4758 2614 1579 2477 3185 -357 -6154 -5321 -2769 -4614
193 -4614 -8019 -7677 -6134 -4975 -3464 -3869 -4893 -1966 2378 2264 1114 3656 6479 7091 7672 7255 5981
210 5981 6438 7380 4696 1358 1117 877 -1421 -3024 -4661 -6081 -6082 -5876 -7405 -8387 -7149 -4842 -4419 -3762
228 -3762 -2146 -250 1461 3109 3997 4615 5824 6892 6493 5925 6264 5868 4948 3858 2245 646 -366
245 -366 -1963 -3539 -4691 -5245 -5229 -5282 -5282 -5284 -4901 -3510 -3212 -2470 -1346 -376 1034 2384 2841 3126 4307 4995
$$ packed form
133B177J7199m136j3924n275P691J1064k954j8681r397J2617J0217q313j1662
146a3377J526J0573P019l487q176K74R507N039p391p335M299R199M70o718m202
161b780K822M529P1o888o843K868O872k174n922M28N289L580j79k249q84M020
177B560N097k566m716K122M701J47k587k144j035Q98P08l542n797Q33K552j845
193d614l405L42J543J159J511m05j024K927M344j14j150K542K823O12N81m17j274
210E981M57R42k684l338k41k40k298j603j637j420jK06j529r82J238K307M23O57
228c762J616J896J711J648Q88O18J209J068l99n68L39l96r20j090j613j599j012
245c66j597j576j152n54J6n3%kL83J391K98P42J124R70J410J350M57K85J181O88
$$ plain form
265 4995 4580 4574 4499 3556 2721 2544 1393 -178 -335 -623 -1809 -2679 -2295 -3000 -3602 -3143 -3121 -3481 -2702 -1821
285 -1821 -1936 -1227 175 464 403 1444 1575 1064 1734 2439 1672 1109 1823 1467 956 1361 1538 367 224
304 224 681 -710 -926 -339 -585 -1182 -850 -388 -977 -940 -556 -934 -1265 -666 -827 -1316 -829 -578 -835 -278
324 -278 144 40 -86 790 928 343 908 1287 941 1281 1651 1440 1306 1646 1545 498 798 455 -648 -666
344 -666 -610 -1212 -1630 -1601 -1747 -2297 -1915 -1704 -1820 -1778 -1219 -1149 -759 -58 551 868 1564 2223 1912 2258 2815 2455
366 2455 2013 2234 1766 1156 1020 642 -16 -674 -852 -1700 -1867 -1846 -2603 -2830 -2711 -2472 -2467 -1608 -1199 -1072 -322
387 -322 284 374 1029 1597 2155 2031 2493 2563 2530 2211 2196 2077 1334 985 493 -259 -590 -858 -1625 -1926 -1772 -2323
409 -2323 -2258 -1960 -2168 -2151 -1832 -1248 -976 -528 227 291 721 1562 1723 1607 2034 2286 1960 1967 1847 1289 818 925
$$ packed form
265D995m15op5r43q35j77j151j571j57k88j186q70L84p05o02M59K2l60P79Q81
285a821j15P09J402K89o1J041J31n11O70P05p67n63P14l56n11M05J77j171j43
304B24M57j391k16N87k46n97L32M62n89L7L84l78l31N99j61m89M87K51k57N57
324b78M22j04j26Q76J38n85N65L79l46L40L70k11j34L40j01j047L00l43j103j8
344f66N6o02m18K9j46n50L82K11j16M2N59P0L90P01O09L17O96O59l11L46N57l60
366B455m42K21m68o10j36l78o58o58j78q48j67K1p57k27J19K39NQ59M09J27P50
387c22O06R0O55N68N58j24M62P0l3l19j5j19p43l49m92p52l31k68p67l01J54n51
409b323O5K98k08J7L19N84K72M48P55O4M30Q41J61j16M27K52l26Pj20n58m71J07
$$ plain form
431 925 326 -73 -270 -440 -1119 -1359 -1213 -1585 -1849 -1680 -1241 -1826 -1354 -893 -962 -671 -80 -135 277 811 1062
452 1062 884 1151 1618 1234 1235 1454 1187 788 957 919 222 172 -11 -324 -339 -465 -1013 -935 -1027 -980 -1079 -823 -732
475 -732 -1110 -821 -557 -515 -459 -383 116 126 395 865 676 875 1147 1252 968 1159 1042 782 992 604 402 320
497 320 429 -383 -646 -408 -709 -1019 -1140 -1086 -1193 -1182 -1136 -852 -829 -670 -756 -557 141 433 206 822 938 780
519 780 967 1193 1062 1139 1291 1186 1169 818 452 366 4 -29 -495 -929 -767 -1145 -1207 -1178 -1348 -1122 -1206 -672 -956
542 -956 -918 -389 -72 166 370 463 756 1036 1265 1274 1058 1400 1242 969 775 867 572 7 -199 -414 -660 -478
564 -478 -874 -1080 -1090 -1032 -1258 -1199 -802 -909 -946 -462 -277 -109 375 336 274 788 705 1095 1016 1203 1086 1061 877
587 877 735 535 660 202 73 -104 -563 -590 -1117 -685 -520 -1197 -817 -627 -824 -953 -342 -380 -388 -230 153 216
$$ packed form
431I25n99l99j97j70o79k40J46l72k64J69M39n85M72M61o9K91N91n5M12N34K51
452A062j78K67M67l84JK19k67l99J69l8o97n0j83l13j5j26n48P8r2M7r9K56R1
475g32l78K89K64M2N6P6M99J0K69M70j89J99K72J05k84J91j17k60K10l88k02q2
497C20J09q12k63K38l01l10j21N4j07J1M6K84K3J59q6J99O98K92k27O16J16j58
519G80J87K26j31P7J52j05j7l51l66q6l62l3m66m34J62l78o2K9j70K26q4N34k84
542i56L8N29L17K38K04R3K93K80K29Rk16L42j58k73j94R2k95n65k06k15k46J82
564d78l96k06j0N8k26N9L97j07l7M84J85J68M84l9o2N14q3L90p9J87j17k5j84
587H77j42k00J25m58j29j77m59k7n27M32J65o77L80J90j97j29O11l8qJ58L83O3
$$ plain form
609 216 298 725 529 566 784 831 719 912 865 652 439 532 287 199 124 -347 -408 -356 -393 -862 -820 -826 -714 -783 -430
634 -430 -551 -599 -421 -291 -195 75 355 244 344 710 599 496 855 677 832 604 693 663 343 180 138 -99
656 -99 49 -306 -697 -485 -486 -683 -914 -590 -835 -397 -304 -440 -347 -379 275 109 348 395 525 467 663 735 659 652
680 652 556 471 555 610 453 168 -18 -155 -396 -344 -284 -591 -572 -740 -878 -954 -595 -588 -601 -543 -315 -164 -37 195
704 195 309 447 329 583 495 653 908 440 745 671 615 177 270 27 0 105 -319 -574 -444 -445 -427 -626 -916
727 -916 -826 -821 -615 -464 -334 -136 -121 37 223 374 449 723 394 636 542 600 537 382 299 429 317 -56 87
750 87 -205 -230 -458 -617 -677 -552 -523 -608 -840 -441 -297 -711 -453 -108 -215 -11 125 359 -12 577 430 202
772 202 610 552 634 446 305 243 260 216 -31 9 -25 -235 -452 -308 -478 -534 -629 -137 -338 -467 -224 -295 -47 -195
$$ packed form
609B16Q2M27j96L7K18M7j12J93m7k13k13R3k45q8p5m71o1N2l7m69M2oJ12o9L53
634d30j21m8J78J30R6K70K80j11J00L66j11j03L59j78J55k28Q9l0l20j63m2k37
656i9J48l55l91K12jj97k31L24k45M38R3j36R3l2O54j66K39M7J30n8J96P2p6p
680F52r6q5Q4N5j57k85j86j37k41N2O0l07J9j68j38p6L59Pj3N8K28J51J27K32
704A95J14J38j18K54q8J58K55m68L05p4n6m38R3k43k7J05m24k55J30jJ8j99k90
727i16R0NK06J51J30J98J5J58J86J51P5K74l29K42r4N8o3j55q3J30j12l73J43
750H7k92k5k28j59o0J25K9q5k32L99J44m14K58L45j07K04J36K34l71N89j47k28
772B02M08n8Q2j88j41o2J7m4k47M0l4k10k17J44j70n6r5M92k01j29K43p1K48j48
$$ plain form
796 -195 61 37 111 209 249 270 439 464 407 524 491 537 115 188 484 122 235 22 -53 -265 -482 -395 -552 -536 -522
821 -522 -363 -448 -259 -510 -380 -393 20 -146 93 105 240 329 439 327 234 641 553 526 676 397 243 274 169
844 169 126 -16 46 -378 -394 -411 -333 -255 -249 -339 -272 -325 -378 -313 -152 -48 25 131 234 411 507 326 240 294 343 675
870 675 186 479 239 277 20 25 9 -131 -39 -167 -225 -606 -432 -522 -307 -401 -382 -311 -209 -148 -16 37 65 102 376
895 376 297 339 435 388 262 416 389 310 373 105 91 164 -121 -304 -236 -56 -237 -430 -334 -209 -360 -361 -588 -273 -228
920 -228 -92 -18 252 176 -411 163 291 373 373 398 485 302 304 552 284 292 174 55 56 -91 182 -148 -224 -244 -328 -424
946 -424 -429 -423 -378 -115 -151 -225 -46 -152 -54 47 -188 88 125 317 500 324 277 316 344 396 212 209 5 77 94 -147
972 -147 133 -312 -82 -335 -173 -211 -296 -290 -356 -277 -270 -363 -76 16 145 114 191 248 -28 301 309 280 389 224 421 339
$$ packed form
796a95K56k4P4R8M0K1J69K5n7J17l3M6m22P3K96l62J13k13p5k12k17Q7j57J6J4
821e22J59q5J89k51J30j3M13j66K39J2J35Q9J10j12r3M07q8k7J50k79j54L1j05
844A69m3j42O2m24j6j7P8P8Or0O7n3n3O5J61J04P3J06J03J77R6j81q6N4M9L32
870F75m89K93k40L8k57Nj6j40R2j28n8l81J74r0K15r4J9P1J02O1J32N3K8L7K74
895C76p9M2R6m7j26J54k7p9O3k68j4P3k85j83O8J80j81j93R6J25j51jk27L15M5
920b28J36P4K70p6n87N74J28Q2%K5Q7j83KK48k68Qj18j19Jj47K73l30p6k0q4r6
946d24nOM5K63l6p4J79j06R8J01k35K76L7J92J83j76m7L9K8N2j84lk04P2J7k41
972a47K80m45K30k53J62l8q5Oo6P9Pr3K87R2J29l1P7N7k76L29Qk9J09j65J97q2
$$ plain form
998 339 269 -28 237 8 35 98 -149 -167 -329 -114 -332 -421 -497 -379 -104 -564 -206 -112 -19 -47 105 -127 155
1021 155 87 119 211 232 422 67 -13 164 82 109 158 67 78 -62 -297 163 78 -168 -142 -68 -373 -128 -191 -541 -442
1046 -442 -228 -83 24 -89 87 195 238 202 198 295 409 365 198 325 145 159 80 207 46 143 130 -65 -116 -40
1070 -40 -346 56 -205 -171 -210 -259 -286 -215 -222 -211 -144 -36 182 15 402 -129 424 300 343 197 102 280 263 305 85
1095 85 229 -144 3 27 -145 -176 -143 -220 -305 -239 -352 -273 -52 -292 -276 -109 -124 4 9 8 112 331 234 331 356 106
1121 106 266 335 367 -15 252 193 104 -121 -96 -80 -389 -232 -323 -331 -120 -90 -233 -277 -135 -191 -274 -40 44 55 -84
1146 -84 131 356 6 409 462 395 -99 188 253 143 199 165 -116 87 -126 -182 18 -135 -42 -246 -372 -468 -156
1169 -156 227 -43 -328 -98 -59 -95 -195 -100 4 345 234 219 86 106 129 234 345 244 326 110 139 156 68
$$ packed form
998C39p0k97K65k29K7O3k47j8j62K15k18q9p6J18K75m60L58R4R3k8J52k32K82
1021A55o8L2R2K1J90l55q0J77q2K7M9r1J1j40k35M60q5k46K6P4l05K45o3l50R9
1046d42K14J45J07j13J76J08M3l6mR7J14m4j67J27j80J4p9J27j61R7j3j95n1P6
1070d0l06M02k61L4l9m9k7P1pJ1O7J08K18j67L87n31N53j24M3j46r5J78j7M2k20
1095H5J44l73J47K4j72l1L3p7q5O6j13P9K21k40J6J67j5J28NjJ04K19r7R7K5k50
1121A06J60O9L2l82K67n9q9k25K5J6l09J57r1qK11L0j43m4J42n6q3K34Q4J1j39
1146h4K15K25l50M03N3o7m94K87O5j10N6l4k81K03k13n6K00j53R3k04j26r6L12
1169a56L83k70k85K30L9l6j00R5J04L41j11j5j33K0K3J05J11j01Q2k16K9J7q8
$$ plain form
1192 68 -83 -103 -151 -148 -171 -41 -253 -241 18 -187 -51 -52 -121 -168 219 119 90 -127 235 107 28 -96 48 -94
1216 -94 11 241 311 4 -15 287 93 -97 -14 -101 -236 -7 -93 -13 -98 -192 -95 -74 84 -28 -6 68 25 -58 -25
1241 -25 285 214 -115 400 121 219 -1 142 419 114 40 -31 87 88 68 -176 -74 -196 -129 -197 -232 -160 -72 -64 -25
1266 -25 -166 -170 123 51 142 -20 -33 -25 -10 190 114 158 67 109 85 173 147 202 242 145 -216 -119 5 -19 -12 98 -210 -195
1294 -195 -56 -57 118 -122 -58 -123 -91 155 4 71 -114 307 -140 67 2 -42 279 95 215 17 334 104 26
1317 26 -177 -151 1 -337 -14 -40 28 -30 -61 -67 -290 -147 -232 -140 421 120 -36 -63 138 -79 257 206 -67 207
1341 207 100 205 152 370 429 -40 222 65 59 131 -250 -188 -24 -138 18 -269 -314 156 -136 -164 -226 32 -144
1364 -144 -58 -28 -16 325 -110 -10 -44 224 255 89 223 232 239 129 273 -85 296 213 -4 -15 -7 -162 45 140 -50
$$ packed form
1192F8j51k0m8Lk3J30k12J2K59k05J36jo9m7L87j00k9k17L62j28p9j24J44j42
1216i4J05K30P0l07j9L02j94j90Q3q7j35K29q6Q0q5r4R7K1J58j12K2P4m3q3L3
1241b5L10p1l29N15k79R8k20J43K77l05p4p1J18Jk0k44J02j22O7o8l5P2Q8QL9
1266b5j41mK93p2R1j62j3QJ5K00p6M4r1M2k4Q8k6N5M0r7l61R7J24k4PJ10l08J5
1294a95J39jJ75k40O4o5L2K46j51O7j85M21m47K07o5m4L21j84J20j98L17k30p8
1317B6k03K6J52l38L23k6O8n8l1ok23J43q5R2N61l01j56k7K01k17L36n1k73K74
1341B07j07J05n3K18N9m69K62j57oP2l81O2J64j14J56k87m5M70k92k8o2K58j76
1364a44Q6L0J2L41m35J00l4K68L1j66J34RPj10J44l58L81q3k17j1Qj55K07R5j90
$$ plain form
1389 -50 -279 56 81 -73 -85 -144 -122 291 -114 8 134 -30 156 161 28 5 59 153 -29 44 96 142 152 -232 2
1414 2 -47 -110 35 -148 -322 -60 -136 24 -77 53 -70 -2 -202 73 -113 -27 239 173 185 97 293 138 4
1437 4 46 27 -143 220 -24 99 82 -7 -19 70 -23 -69 8 -146 -278 -113 42 157 -89 -95 136 -153 54 -204
1461 -204 -162 -45 95 151 -124 -45 262 60 295 378 -275 248 -166 -7 -35 59 -83 8 -34 -6 74 -153 -160 -616
1485 -616 -163 -12 -111 -167 -60 21 -96 -26 0 182 131 -261 7 40 93 -101 17 -72 14 -121 -10 -33 -206 -92
1509 -92 43 70 -66 -125 -3 128 36 -86 -174 15 27 20 -121 148 -48 56 123 62 -145 203 -17 -47 -90 -33
1533 -33 -169 -34 -81 107 90 239 57 261 154 -83 -284 -135 -122 -36 0 74 -230 10 -198 -94 -72 58 271
1556 271 16 -158 -73 -35 69 119 -60 150 -44 81 42 226 -181 50 -142 -271 69 106 -193 -18 -331 134
$$ packed form
1389e0k29L35K5j54j2n9K2M13m05J22J26j64J86Nj33k3N4R4j82P3N2M6J0l84K34
1414Bm9o3J45j83j74K62p6J60j01J30j23O8k00K75j86Q6K66o6J2q8J96j55j34
1437DM2j9j70L63k44J23j7q9j2Q9r3m6P7j54j32J65J55J15k46oK31k89K07k58
1461b04M2J17J40N6k75P9L07k02K35Q3o53N23m14J59k8R4j42R1m2K8Q0k27pm56
1485f16M53J51r9n6J07Q1j17P0K6J82n1l92K68L3N3j94J18q9Q6j35J11k3j73J14
1509i2J35K7j36n9J22J31r2j22q8J89J2pj41K69j96J04O7o1k07L48k20l0m3N7
1533c3j36J35m7J88j7J49j82K04j07k37k01J49J3Q6L6P4l04K40k08J04K2J30K13
1556B71k55j74Q5L8J04N0j79K10j94J25l9J84m07K31j92j29L40L7k99J75l13M65
$$ plain form
1578 134 380 -63 -80 -335 -36 -62 -8 -8 -121 20 32 9 -18 -5 221 96 131 -15 -168 146 67 116 -139 -79
1602 -79 217 -29 35 1 26 153 -105 -10 -31 -114 284 119 44 -59 -24 -179 -100 -71 18 117 42 74 -67 152 -67
1627 -67 -1 58 0 34 -15 -122 214 84 -202 -105 179 117 -51 163 -28 35 -116 -221 -48 -16 -40 29 -12 68 191
1652 191 -30 456 51 -226 85 -59 336 -51 131 269 -25 88 48 147 -88 331 47 14 55 181 -13
1673 -13 -100 -140 -41 71 -147 -99 -237 -24 63 124 -23 269 -97 273 -149 8 21 146 458 -107 -113 63 42 -21
1697 -21 -106 78 -2 -68 79 -37 -6 -14 -107 20 24 -68 75 -61 75 107 34 41 11 190 147 -123 255 213 94 -201
1723 -201 82 63 -127 -38 -187 -21 15 -284 28 -13 89 -19 -110 49 -191 -137 61 120 -25 79 165 -51 22
1746 22 157 150 33 -68 11 150 -144 198 -15 44 332 242 -45 198 -177 -232 71 -82 -114 119 140 104 49 151
$$ packed form
1578A34K46m43j7k55K99k6N4%j13J41J2k3k7J3K26j25L5j46j53L14p9M9k55O0
1602g9K96k46O4l4K5J27k58R5k1q3L98j65p5j03L5j55P9K9Q9R9p5L2j41K19k19
1627f7O6N9n8L4m9j07L36j30k86R7K84o2j68K14j91O3j51j05J73L2k4O9m1Q0J23
1652A91k21M86m05k77L11j44L95l87J82J38k94J13m0R9k35M19k84l3M1J26j94
1673a3q7m0R9J12k18M8j38K13Q7O1j47K92l66L70m22J57J3J25L12n65oJ76k1o3
1697b1q5J84q0o6J47j16L1qr3J27Mr2J43j36J36L2p3Pl0J79m3k70L78m2j19k95
1723b01K83j9j90Q9j49J66L6k99L12m1J02j08r1J59k40N4J98N9j45J04Q6k16P3
1746B2J35pj17j01P9J39k94L42k13N9K88r0k87K43l75n5L03j53l2K33K1l6n5J02
$$ plain form
1770 151 20 -240 187 -139 286 -135 -202 146 105 -84 91 4 139 131 144 -38 -2 -90 129 19 67 29 -5 -21
1794 -21 4 -58 -172 -46 95 -18 -232 103 90 39 -98 -249 78 -169 115 -199 242 59 0 4 -57 64 -101
1817 -101 9 11 -142 -50 -179 -3 23 28 -124 -44 1 -2 10 -61 -296 -134 -104 114 183 -108 -100 -18 236 -111 10 229
1843 229 87 10 -7 -7 -83 264 242 -30 110 236 94 -3 93 -15 -78 54 -82 104 -97 -173 -10 279 93
1866 93 -145 23 -105 -300 -22 58 14 12 159 97 100 108 -23 23 -28 24 -109 -21 108 5 165 -90 -288 106 -146
1891 -146 -68 -221 -71 356 -176 245 100 116 -88 -141 -222 -79 223 -29 208 204 99 45 -282 -135 -58 16 -209
1914 -209 271 -52 18 -65 58 120 -94 266 -263 67 44 149 -117 -82 -290 -66 -12 -124 -147 119 -84 -45 -34
1937 -34 -49 46 26 77 -92 257 229 -9 25 218 -4 -9 200 -81 -15 24 -1 192 223 -34 -128 -35 57 -251 -2
$$ packed form
1770A51j31k60M27l26M25m21o7L48m1j89J75q7J35qJ3j82L6q8K19j10M8l8l4j6
1794b1K5o2j14J26J41j13k14L35j3n1j37j51L27k47K84l14M41j83n9Mo1J21j65
1817a01J10Kj53R2j29J76K6Nj52Q0M5lJ2p1k35J62L0K18O9k91QQ2K54l47J21K19
1843B29j42p7j7%p6L47k2k72J40J26j42r7R6j08o3J32j36J86k01p6J63K89j86
1866I3k38J68j28j95K78Q0m4kJ47o2LQj31M6n1N2j33Q8J29j03J60k55j98L94k52
1891a46P8j53J50M27n32M21j45J6k04n3q1J43L02k52K37mj05n4l27J47P7P4k25
1914b09M80l23P0q3J23O2k14L60n29L30k3J05k66L5k08K24N4j12k3K66k03L9J1
1937c4j5R5k0N1j69L49k8k38L4J93k22nK09k81O6L9k5J93L1k57r4R3R2l08K49
$$ plain form
1962 -2 -103 -160 20 -29 117 64 43 106 -48 81 -23 23 115 -19 21 108 -106 -177 -217 58 168 -239 79 261
1986 261 -255 -55 -43 -122 -148 160 37 40 -194 -99 -32 -244 43 -57 -137 -84 -156 46 36 273 88 104 69 124 -46
2011 -46 35 102 55 103 -216 -2 30 22 -104 89 -11 156 49 43 -96 424 107 149 75 -103 -3 63 -43 -34 85
2036 85 -74 -202 285 215 -37 -25 -284 -84 79 169 -40 224 -109 -54 -51 -95 -68 -73 13 -34 -20 -59 259 25 -41
2061 -41 -160 -115 185 -28 42 370 -39 177 188 93 115 -17 25 -30 -149 -7 -56 -136 59 -68 280 51 118 -99
2085 -99 9 234 -32 -27 -117 -94 30 225 -239 62 32 -149 221 -180 24 -75 98 -97 81 -47 -192 -341
2107 -341 41 -175 70 121 -60 -57 219 -168 60 73 69 69 32 -21 -48 -175 171 -24 -76 15 -86 13 224 48 82
2132 82 170 68 -42 -162 8 5 212 -72 -57 23 -121 -15 -231 160 -97 37 -41 -96 169 -78 110 21 -9
$$ packed form
1962bj01n7J80m9J46n3k1O3j54J29j04M6R2j34M0Q7k14p1m0K75J10m07L18J82
1986B61n16K00J2p9k6L08j23Lk34R5O7k12K87j00q0N3p2K02j0K37j85J6l5N5j70
2011d6Q1O7m7M8l19K14L2qj26J93j00J67j07oj39N20l17M2p4j78J00O6j06RJ19
2036H5j59j28M87p0k52J2k59K00J63R0k09K64l33N5Lm4K7nQ6m7J4l9L18k34o6
2061d1j19M5L00k13P0L28m09K16J1r5K2j32M2n5j19J42m9q0J95j27L48k29O7k17
2085i9J08K25k66Nr0K3J24J95m64L01l0j81L70m01K04r9J73j95J78j28j45j49
2107c41L82k16K45N1j81LK76l87K28J3m%l7n3k7j27L46j95n2R1j01R9K11j76L4
2132H2Q8j02j10j20J70lK07k84J5Q0j44J06k16L91k57J34p8n5K65k47J88q9l0
$$ plain form
2155 -9 -54 98 -105 175 -113 89 46 -123 63 32 -85 -159 20 -211 -62 38 92 -10 -14 9 12 -159 -204 -210 -43
2180 -43 -47 -67 -5 -20 83 317 55 109 144 -76 -104 156 -236 171 23 -84 -39 -330 -114 64 1 -187 79 -95
2204 -95 76 133 267 -34 104 -28 182 -253 27 -58 -148 17 148 -173 -75 -89 -3 -76 -50 15 -4 -78 -42 175
2228 175 24 167 -223 -125 149 79 -94 128 -179 202 -58 69 -313 87 -18 -109 -12 32 43 121 -193 -157 -139
2251 -139 -168 50 10 2 72 109 36 -98 -154 -38 85 -27 29 -2 92 -10 150 17 34 -268 -17 -146 -74 74
2275 74 -208 143 -21 -63 124 131 -161 117 32 -53 -34 2 -47 109 61 85 -111 -8 93 -158 -101 -170 -99 -177 60
2300 60 -114 80 -51 61 211 82 -43 -262 38 -45 -153 262 55 134 -40 131 260 -258 109 91 -118
2321 -118 -42 80 167 27 124 190 30 80 -143 56 -104 23 123 -28 61 -17 12 89 1 42 19 -37 -68 -17 -111
$$ packed form
2155im5J52k03K80k88K02m3j69J86l1j17p4J79k31J49J00N4j02mK3Lj71m5oJ67
2180d3mk0O2j5J03K34k62N4L5k20k8K60l92M07j48j07M5k91K16J78o3j88K66j74
2204i5J71N7J34l01J38j32K10m35K80q5r0J65J31l21R8j4Q6p3K6O5j9p4L6K17
2228A75j51J43l90R8K74p0j73K22l07L81k60J27l82M00j05r1R7M4J1P8l14L6J8
2251a39k9K18m0qP0L7p3j34n6J16J23j12N6l1R4j02J60j33J7l02K51j29P2J48
2275G4k82L51j64m2J87Pk92K78q5q5J9L6m9J56m8K4j96J03J01k51N7o9P1p8K37
2300F0j74J94j31J12J50j29j25k19L00q3j08M15k07P9j74J71J29n18L67j8k09
2321a18P6J22Q7j40R7O6j60N0k23J99j60J27J00j51Q9p8K9P7q8M1k3n6l1N1r4
$$ plain form
2346 -111 191 -231 -203 70 76 111 23 87 -130 96 127 68 117 -5 -170 -20 173 -139 45 64 -27 32 44 72 -97
2371 -97 184 76 133 302 268 -61 -173 -347 -81 -10 -212 28 146 -86 49 55 -124 -352 -86 -13 90 -170
2393 -170 -129 -25 -4 85 -42 -15 233 -3 -83 -105 72 116 133 -89 150 64 -2 -163 378 45 27 30 107 -57 96
2418 96 81 107 57 173 87 -24 83 -124 224 9 68 -131 171 29 120 88 11 73 -2 -65 -8 -31 -32 35 -123 -266
2444 -266 49 -61 -11 -173 154 282 -110 -67 -72 187 -183 44 -54 270 -151 -32 -24 205 10 78 -173 -151 153
2467 153 -75 -50 -7 146 18 -240 -65 -149 271 81 39 62 212 80 198 -70 77 -51 169 87 -186 -70
2489 -70 135 245 129 -39 -6 74 -95 -66 -146 135 -49 37 311 73 71 290 -178 94 -33 -194 6 -96 21
2512 21 -58 -58 50 -208 -65 113 7 30 -201 -14 387 -124 -85 38 -81 143 -133 -185 61 -178 165 85 149
$$ packed form
2346a11L02m22K8K73OL5q8O4k17K26L1n9M9j22j65J50J93l12J84J9r1N9J2K8j69
2371i7K81j08N7J69l4l29j12j74K66P1k02K40J18k32J35Oj79k28K66P3J03k60
2393a70M1J04K1Q9j27K7K48k36q0k2J77M4J7k22K39q6o6j61N41l33j8LP7j64J53
2418I6j5K6n0J16q6j11J07k07L48k15N9j99L02j42R1l2p7O2p5o3N7k3jO7j58j43
2444b66L15j10N0j62L27J28l92M3nK59l70K27r8L24m21J19QK29j95O8k51K2L04
2467A53k28K5M3J53j28k58J75q4M20j90m2K3J50j32J18k68J47j28K20q2k73J16
2489g0K05J10j16j68L3Q0j69K9q0K81j84Q6K74k38kK19m68K72j27j61K00j02J17
2512B1p9%J08k58J43J78j06K3k31J87M01n11L9J23j19K24k76n2K46k39L43q0O4
$$ plain form
2535 149 43 134 -170 39 105 -163 -163 -131 114 248 102 -83 163 -214 191 151 26 32 3 207 -33 50 16 -57
2559 -57 -146 79 -194 17 123 -21 -117 116 -219 -272 303 106 -251 17 76 -77 217 38 49 89 219 338
2581 338 -122 -144 -39 195 205 -168 -106 416 -35 -6 283 -93 -111 151 200 16 20 130 20 -60 -132 64 -85
2604 -85 -49 -85 51 61 221 -173 -238 19 190 135 61 110 248 -63 43 196 27 -4 24 202 -63 -100 -161 -104
2628 -104 140 -17 -43 -34 -167 -58 163 116 180 -78 -33 137 -63 150 -129 9 -135 -42 -231 36 85 179 131
2651 131 -115 -186 92 219 -32 122 -82 167 17 -32 140 -165 -74 44 -25 -54 218 -95 53 -95 -10 84
2673 84 91 119 -404 -45 65 -37 61 -145 62 -17 24 -180 -47 32 59 1 70 90 -64 -25 104 -51 18 363 -39
2698 -39 -185 -6 209 151 -94 158 50 -73 27 -34 38 -289 112 36 -20 62 133 -3 33 -290 -80 -16 193
$$ packed form
2535A49j06R1l04K09O6k68%L2K45J34j46j85K46l77M05m0j25Ok9K04k40Q3l4p3
2559e7q9K25k73K11J06j44r6K33l35n3N75j97l57K68N9j53K94j79J1M0J30J19
2581C38m60k2J05K34J0l73O2N22m51K9K89l76j8K62M9j84MJ10j10q0p2J96j49
2604h5L6l6J36J0J60l94o5K57J71n5p4M9J38l11J06J53j69l1K8J78k65l7o1N7
2628a04K44j57k6Rj33J09K21m7O4k58M5J70k00K13k79J38j44R3j89K67M9R4m8
2651A31k46p1K78J27k51J54k04K49j50m9J72l05R1J18o9k9K72l13J48j48Q5R4
2673H4PK8n23L59J10j02R8k06K07p9M1k04J33P9K7n8O9K0j54L9J29j55O9L45m02
2698c9j46J79K15n8k45K52j08j23J00o1P2l27M01p6n6Q2P1j36L6l23K10O4K09
$$ plain form
2721 193 46 -225 -198 -54 -91 -172 149 -100 -232 25 -238 4 29 6 -181 147 208 137 -70 -62 -102 41 -35 -46
2745 -46 111 -45 -216 65 -47 -132 42 -78 97 240 250 -51 -33 -66 -98 -103 -259 27 140 -106 -136 -192 229
2768 229 60 28 55 44 -109 -1 88 105 -83 208 0 180 -248 -87 -154 -124 148 66 78 -128 70 52 -42 57
2792 57 26 -279 85 82 -131 -100 -56 172 -60 -249 113 -129 -71 -32 -61 -126 9 -102 -67 99 -298 296 132 -118
2816 -118 -38 -32 -18 -188 316 -191 49 -42 23 -18 -289 -233 -113 89 -19 62 148 41 136 -161 -160 -15 101 7 166
2841 166 34 122 -273 63 -195 69 -161 -152 -151 -93 261 52 -85 68 -51 -29 135 130 -34 -212 -106 -59 51
2864 51 35 25 30 -129 -163 73 -114 39 85 -103 203 41 147 73 -154 17 -160 2 30 33 57 -20 276 21
2888 21 -69 85 -193 131 -83 44 16 14 54 -207 -8 -75 -154 -17 -72 -113 -13 -39 -22 11 -39 -31 -14 137 180 22
$$ packed form
2721A93j47k71K7J44l7q1L21k49j32K57k63K42K5k3j87L28O1p1k07Qm0J43p6j1
2745d6J57j56j71K81j12q5J74j20J75J43J0l01J8l3l2nj56K86J13k46l0n6M21
2768B29j69l2K7j1j53J08Q9J7j88K91k08J80m28J61o7L0K72q2J2k06J98j8r4R9
2792E7l1l05L64lk13L1M4K28k32j89L62k42N8L9k9o5J35j11L5J66l97N94j64k50
2816a18Q0OJ4j70N04n07K40r1O5m1k71N6J20K02j08Q1Q6j07R5k97JJ45J16r4J59
2841A66j32Q8l95L36k58K64k30RJN8L54k09j37J53j19K2J64nj64j78J06M7J10
2864E1j6j0Nj59l4K36j87J53M6j88L06j62J06p4k27J71j77J62K8LK4p7K96k55
2888B1r0J54k78L24k14J27k8kM0k61J99o7p9J37n5m1J00k6J7L3n0QJ7J51M3j58
$$ plain form
2914 22 103 93 22 49 75 -82 164 -60 178 -171 36 5 52 117 167 -62 -159 -166 -4 72 -51 81 223 110 10
2939 10 -11 -130 94 25 171 -35 101 95 -99 5 -259 152 21 -43 146 -86 -9 -125 -54 46 139 40 -168
2962 -168 -15 -22 -43 104 219 82 -56 -171 170 108 -24 104 -293 34 -111 304 187 50 -8 -292 -150 -100
2984 -100 -42 -67 -52 -216 63 78 -39 -274 178 -169 183 137 189 -45 53 242 -3 -35 5 -161 207 -19 33
3007 33 11 70 75 -229 -188 29 25 115 -96 -39 -100 -143 -15 -215 25 -160 126 -25 -80 -21 -29 -166 -233 176 -26 -106
3033 -106 -191 -2 -23 -414 148 20 40 60 121 12 181 -238 135 -182 119 34 50 115 -149 -244 35 -14 237
3056 237 43 -7 58 -27 -13 11 32 -108 168 -197 -184 -109 -147 287 300 -170 52 52 -87 -5 -135 -84 97 60 -63
3081 -63 141 -18 95 -138 32 -336 -98 27 -187 -17 -141 -141 -100 32 -85 -202 -191 -58 53 101 -20 77
$$ packed form
2914B2Q1j0p1K7K6j57K46k24K38l49K07l1M7O5N0k29r7pJ62P6j23J32J42j13j00
2939A0k1j19K24o9J46k06J36oj94J04k64M11j31o4J89k32P7j16P1J00R3r9k08
2962a68J53pk1J47J15j37j38j15L41o2j32J28l97L27j45M15j17j37n8k84J42N0
2984a00N8k5J5j64K79J5j17k35M52l47L52m6N2k34R8J89k45l2M0j66L68k26N2
3007C3k2N9Nl04M1K17mR0k11N7o1m3J28k00K40j85K86j51n5N9qj37o7M09k02q0
3033a06q5J89k1l91N62j28K0K0O1j09J69m19L73l17L01q5J6O5k64r5K79m9K51
3056B37j94n0O5q5J4K4K1j40K76l65J3P5l8M34J3m70K22%j39Q2j30N1J81l7j23
3081f3K04j59J13k33J70l68K38J25k14J70j24%M1J32j17j17J1J33J11M8j21R7
$$ plain form
3103 77 151 -41 10 -230 -199 91 -176 197 301 -152 132 -25 -166 95 -35 -125 120 -150 -11 65 -224 1
3125 1 -10 70 174 -172 107 -102 -65 -82 -150 82 -65 113 -55 78 113 -109 10 -130 -124 -74 95 93 -62 5 234
3150 234 88 208 -90 -107 59 84 77 -4 -148 -101 -19 178 -101 -147 -21 -214 -81 144 223 -24 91 -101 -139
3173 -139 92 98 127 141 -81 50 164 -124 83 -101 -26 60 51 -37 -23 -146 -150 100 -408 228 57 -28 227 89
3197 89 -77 14 -66 4 81 -39 -16 139 -136 -87 103 -283 143 59 -38 219 -215 -7 217 -73 -262 97 35
3220 35 -201 160 68 0 253 119 114 45 -15 76 -72 190 -32 37 -90 156 41 115 73 -19 -236 -250 -43 -137 234
3245 234 88 -90 -165 100 -145 217 -74 -104 117 -42 170 76 -118 -95 -33 -59 -34 85 -83 -124 -21 -91 -167
3268 -167 -99 227 20 -202 37 -72 57 118 -26 36 54 -277 29 29 72 59 137 59 54 -290 16 44 27 -150 -47
$$ packed form
3103G7P4j92N1k40L1K90k67L73J04m53K84j57j41K61j30r0K45k70J39P6k89K25
3125Aj1Q0J04l46K79k09L7j7o8K32j47J78j68J33L5k22J19j40ON0J69kj55O7K29
3150B34j46J20k98j7J66K5pq1j44M7Q2J97k79m6J26j93J33K25P9k47J15j92l8
3173a39K31OK9J4k22J31J14k88K07j84P5Q6rq8J4j23mK50n08O36j71q5K55j38
3197H9j66R1q0P0P7j20K3J55k75M9J90l86M26q4r7K57m34K08K24k90j89L59o2
3220C5k36L61r2o8K53j34no9o0R1j48K62k22O9j27K46j15P4m2r2k17j4K07r4L71
3245B34j46j78p5K65k45L62k91l0K21j59K12r4j94K3O2k6K5J19j68m1J03p0p6
3268a67O8L26k07k22K39j09J29O1j44O2J8l31L06%M3j3P8p8nl44L06K8j7j77J03
$$ plain form
3293 -47 50 -99 -249 116 186 -21 -58 52 -7 -202 -98 36 338 -24 -221 -105 112 121 -171 -106 30 16 212
3316 212 121 -40 -63 -259 178 144 -45 70 83 38 52 20 -51 150 63 17 81 -50 -71 197 -218 -43 148 36
3340 36 70 -48 -62 95 12 -113 -168 30 59 136 -130 29 50 -13 -153 193 107 51 49 -139 130 180 75 -271 -154
3365 -154 157 51 -35 20 -25 -17 -247 -42 -14 -7 1 50 167 -146 119 -156 83 86 -14 7 -63 336 293 128 38 -32
3391 -32 -35 29 192 135 117 59 296 -91 -272 -89 -71 -92 86 101 6 -60 94 -11 -215 90 -6 117 32 230 56
3416 56 -178 -149 61 174 -64 -15 -151 -37 176 -144 -150 146 44 64 117 12 -185 116 -274 -209 69 13 56
3439 56 -26 -123 1 188 -94 -8 88 -42 127 96 258 3 9 44 -108 -26 136 71 -93 136 -18 128 -181 -68
3463 -68 -52 -91 93 56 7 40 62 -119 141 -181 -64 -1 -24 -102 43 -54 -126 67 71 -36 -96 120 -128 -139 23
$$ packed form
3293d7R7j49j50L65P0k07l7J10n9j95J04J34L02l62j97J16K17Rk92O5J36j4J96
3316B12r1j61k3j96M37l4j89J15J3m5J4l2p1K01q7m6O4j31k1K68m15J75J91j12
3340C6L4j18j4J57q3j25n5J98K9P7k66J59K1o3j40L46q6n6kj88K69N0j05l46J17
3365a54L11j06q6N5m5Qk30K05K8PQM9J17l13K65k75K39Lj00K1p0L99m3j65r0p0
3391c2lO4J63n7j8n8K37l87j81J83J8k1J78J5r5o6J54j05k04L05r6J23q5J98j74
3416E6k34K9K10J13k38M9j36J14K13l20oK96j02K0N3j05j97L01l90O5K78n6M3
3439E6q2r7J24J87k82Q6R6j30J69l1J62k55OL5j52Q2J62o5j64K29j54J46l09J13
3463f8J6l9J84l7m9L3K2j81K60l22J17O3k3p8J45r7p2J93Mj07o0K16k48j1J62
$$ plain form
3488 23 140 28 -7 -34 -42 33 31 72 -140 93 -143 -214 -308 66 168 -201 173 259 -20 -61 202 -44 -53 -98 -89 -2
3514 -2 37 -69 -30 -156 -152 97 -139 -80 -122 158 15 168 23 86 17 -118 199 -214 -82 148 -177 -380 -142
3537 -142 40 34 -176 42 95 95 7 114 137 62 74 -48 -90 155 -151 68 -82 139 -3 -93 -146 87 104 135 -181
3562 -181 25 86 -57 2 -208 396 -33 -119 24 152 76 76 72 138 196 -91 89 -126 134 -88 -218 -140 -40 73
3586 73 92 -27 63 -60 -152 22 -48 -154 81 114 121 27 52 -11 -190 -91 -44 -4 -167 -65 -23 -79 101 38 -275 174
3612 174 -84 131 79 -75 -63 3 61 -14 -133 -121 -240 -110 117 -5 191 50 47 -121 214 62 145 192 268 204
3636 204 253 -103 122 -204 -77 66 -122 -106 -120 -2 127 102 48 -46 188 -47 239 156 -207 -22 78 45 93
3659 93 -70 -171 -112 48 212 93 2 7 123 75 293 95 -221 63 -101 -95 -210 189 67 50 -67 -238 32
$$ packed form
3488B3J17j12l5k7qP5kM1k12K33k36p1r4L74J02l69L74Q6k79m1K63k46rm5RQ7
3514bL9j06L9j26MK49k36N9m2K80j43J53j45O3o9j35L17m13J32K30l25k03K38
3537a42J82ok10K18N3%q8J07K3p5J2j22m2K45l06K19j50K21j42r0n3K33J7L1l16
3562a81K06O1j43N9k10O04m29q6J43J28p6%mO6N8k87J80k15K60k22j30P8J00J13
3586G3J9j19R0j23r2J74p0j06K35L3Pr4K5o3j79R9M7M0j63J02M2n6J80o3l13M49
3612A74k58K15n2j54J2O6N8p5j19J2j19J30K27j22J96j41lj68L35j52Q3M7P6o4
3636B04M9l56K25l26J27J43j88J6j4J18J29k5n4r4K34k35K86q3l63J85J00l3M8
3659I3j63j01N9J60J64j19r1NJ16m8K18j98l16K84j64Oj15L99j22j7j17j71K70
$$ plain form
3682 32 -341 -163 195 -14 -66 -151 106 -156 141 -55 -237 -142 -150 -204 246 -39 -113 124 25 126 179 114 -27 111
3706 111 -35 -60 14 -41 -1 -64 138 173 -105 -54 -263 9 -86 216 -15 92 -41 -277 -241 -131 6 -182 117
3729 117 65 121 22 286 184 132 193 -1 -37 27 -109 44 59 -70 -15 15 -148 -57 -33 -96 22 -82 115 7
3753 7 62 -81 14 142 82 91 111 82 31 -36 -81 178 -17 -1 -163 -54 342 170 60 -30 -18 -175 -66 9 44 -92
3779 -92 -141 -16 -97 13 75 111 29 144 -15 11 -113 -232 -19 -70 -76 -238 -102 -180 -405 46 -30 -160 -29 -322
3803 -322 13 -192 153 -4 235 -171 -98 -100 108 130 -72 -17 7 -73 -58 -84 18 -257 -57 127 225 126 174 50
3827 50 128 -296 27 -26 -27 -90 90 -15 36 95 -126 120 195 -27 -243 -18 -169 -63 -139 -218 -85 18 -111 -73
3851 -73 42 -58 -201 16 40 -112 109 77 57 -41 72 102 12 -85 -161 55 -54 -26 137 1 83 29 -124 131
$$ packed form
3682C2l73J78L58k09n2q5K57k62K97j96j82R5qn4M50k85p4K37r9J01N3o5j41J38
3706A11j46k5P4n5M0o3K02L5k78N1k09K72r5L02k31J07j33k36L6J10J37j88K99
3729A17n2N6r9K64j02n2O1j94l6O4j36J53J5j29N5L0j63R1K4o3J18j04J97j08
3753GN5j43R5J28o0RK0k9n1o7m5K59j95J6j62J09L96j72j10r0J2j57J09P5L5j36
3779i2m9J25q1J10O2L6q2J15j59K6j24j19K13n1oj62J36p8k25M51p6j30J31k93
3803c22L35k05L45j57K39m06P3kK08K2k02N5K4q0J5k6J02k75K00J84R8r9M8j24
3827E0P8m24L23n3jo3J80j05N1N9k21K46P5k22k16K25j51J06p6p9J33J03j29L8
3851g3J15j00j43K17K4j52K21l2k0r8J13L0r0r7p6K16j09K8J63j36Q2n4j53K55
$$ plain form
3875 131 -102 53 -8 -11 -29 -42 -50 88 -284 68 -120 107 48 -145 -45 -105 6 -272 -49 -17 142 -109 71
3898 71 -117 -9 -152 21 48 330 -12 -6 0 -5 -98 -116 56 54 122 -122 -109 -38 3 -213 -56 -42 -57 -14 -116 -94 -185
3925 -185 -147 -11 47 92 -218 -78 45 32 68 -176 1 52 86 -69 82 14 -78 192 45 143 103 -108 -301 49
3949 49 157 184 -66 -21 251 63 162 -99 211 -228 55 96 143 38 -8 120 -28 -14 33 10 -85 19 142 -30
3973 -30 -49 -106 104 40 -76 -179 -153 168 76 -100 135 -123 58 85 -74 -75 -42 253 83 -97 -66 -61 -105 -384 8
3998 8 80 89 150 41 207 -173 175 -89 -327 48 -52 256 -271 131 -41 -203 156 228 -64 -77 52 49 -4 118
4022 118 211 107 -150 26 231 -8 73 -163 -162 -30 -95 246 -72 -15 64 -37 -145 -274 -138 -21 94 -187
4044 -187 -123 63 -85 -181 43 38 127 17 285 100 -45 167 71 -126 278 -61 -262 -148 82 390 11 30
$$ packed form
3875A31k33J55o1lj8j3qJ38l72L52j88K27n9j93J00o0J11k78K23L2J59k51J80
3898G1j88J08j43J73K7K82l42OOnr3j8J72kO8k44J3P1M1k16J57J4j5M3j02K2r1
3925a85L8J36N8M5l10J40J23j3L6k44J77N1L4j55J51o8r2K70j47R8m0k11j93L50
3949D9J08K7k50M5K72j88R9k61L10m39K83M1M7j05m6J28j48J4M7k3r5J04J23j72
3973c0j9n7K10o4j16j03K6L21r2j76K35k58J81K7j59jL3K95j70j80L1Nm4k79L92
3998HP2RO1j09J66l80L48k64k38L75j00L08n27M02j72j62L59P2k92j3J29ln3J22
4022A18R3j04k57J76K05k39Q1k36JJ32o5L41l18N7P9j01j08j29J36J17J15k81
4044a87O4J86j48r6K24nQ9j10K68j85j45K12r6j97M04l39k01J14K30L08l79J9
$$ plain form
4066 30 -50 5 -244 -166 228 -183 -104 12 227 93 65 -194 -149 97 -42 33 20 14 163 81 27 30 7 72 -298 226
4092 226 -49 64 254 -34 -50 106 75 105 -95 -168 11 146 -168 -14 193 11 39 -121 -60 151 75 -25
4114 -25 -173 -55 31 -227 -43 -80 167 80 -50 -304 -56 10 65 -166 -70 15 26 -80 46 -402 74 -16 -122
4137 -122 -43 185 -43 202 142 -88 -137 -127 -220 -24 24 -96 216 -87 148 69 -52 -310 -132 243 173 42 127
4160 127 197 67 -133 107 155 143 63 60 -67 38 174 -22 -176 -84 150 -167 191 -87 45 -146 -219 29 12
4183 12 73 23 52 127 59 -195 -45 135 -333 30 94 -69 -132 163 -155 117 -7 34 180 -206 -28 -8 241
4206 241 -100 -244 65 -14 125 -131 -271 -166 -370 -83 -68 -54 -170 82 -19 89 30 137 11 -66 -291 4
4228 4 -206 -95 27 77 124 102 -2 -194 -35 -55 -105 5 50 140 15 318 30 -226 133 39 66 328 39 -93
$$ packed form
4066C0q0N5k49P8L94m11P9J16K15j34k8k59M5K46j39P5j3oJ49q2n4Lk3O5l70N24
4092B26k75J13J90k88j6J56l1L0k00p3J79J35l14J54K07j82K8j60O1K11p6j00
4114b5j48J18Q6k58J84l7K47q7j30k54K48O6N5k31R6Q5J1j06J26m48M76r0j06
4137a22P9K28k28K45o0k30m9J0r3J96M8j20L12l03K35p9j21k58J78L75p0j31Q5
4160A27P0j30k00K40M8j2q0lj27J05J36j96j54R2K34l17L58k78J32j91p3K48j7
4183A2O1n0K9P5o8k54J50J80m68L63O4j63o3K95l18K72j24M1J46l86J78K0K49
4206B41l41j44L09p9J39k56j40J05k04K87J5J4j16K52j01J08n9J07j26p7k25K95
4228Dk10J11J22N0M7k2j04j92J59k0n0J10M5R0j25L03k88k56L59r4K7K62k89j32
$$ plain form
4252 -93 -63 44 68 -156 22 -46 -41 -52 195 -105 -15 62 156 270 25 -162 -72 -38 -44 63 -143 143 160 243 -55
4277 -55 159 -14 145 311 -90 -55 -3 -143 38 -94 49 -87 -51 -135 -157 135 -247 29 -59 -111 -29 135 -117
4300 -117 -204 -188 -104 2 -50 146 -95 54 87 -46 -70 -119 -3 -241 -160 -271 89 53 -5 -44 -165 29 -24 -5
4324 -5 -66 -11 152 -42 75 0 64 -53 -201 -129 -85 435 63 144 81 165 97 -118 220 50 17 105 18 159 251
4349 251 -121 164 -35 -89 -72 6 -173 -169 -48 119 -43 -62 186 -62 -146 -193 -65 -274 201 -127 -18 -26 -35 154
4373 154 -16 52 -55 -59 74 -220 81 133 251 124 48 -77 -76 -140 -75 -86 -238 -90 -191 146 13 -120 255
4396 255 -33 -31 -21 -69 203 155 30 -5 46 67 -93 58 47 -163 -102 30 177 31 -61 161 180 -2 -56 340
4420 340 -52 18 190 111 89 39 51 203 87 153 15 -18 -117 -8 -6 85 86 -61 -20 -124 -209 -134 0 -197 4
$$ packed form
4252i3L0J07K4k24J78o8Nj1K47l00R0P7R4J14k45j87R0L4oJ07k06K86J7Q3k98
4277e5K14j73J59J66m01L5N2j40J81j32J43j36L6q4k2K92l82K76q8n2Q2J64k52
4300a17q7J6Q4J06n2J96k41J49L3j33k4m9J16k38Q1j11L60l6n8l9j21J94n3J9
4324eo1N5J63j94J17p5O4j17j48P2M4N20l72Q1o3Q4o8k15L38j70l3Q8q7J41R2
4349B51l72K85j99n4J7P8j79MJ21J67j62j9K48k48q4m7J28k09M75l28J09qrJ89
4373A54j70O8j07mJ33k94L01N2J18j27p6j25Jo4O5j1j52J48j01L37j33j33L75
4396B55k88KJ0m8K72m8j25l5N1K1j60J51j1k10O1J32J47j46r2K22J9j82n4L96
4420C40l92P0J72p9k2n0J2J52j16O6j38l3r9J09KR1Jj47M1j04q5P5J34j97K01
$$ plain form
4445 4 255 -125 3 -16 106 -140 -141 -47 -175 -12 86 -159 124 -82 198 -67 -1 -51 29 11 -50 26 12 27 -146
4470 -146 -288 225 37 -211 334 150 85 -61 -101 19 -169 -236 -114 -95 38 239 -25 85 4 -410 8 29
4492 29 -110 -5 140 -274 -130 138 75 192 -232 147 49 -209 153 114 -24 -91 -17 -114 -92 -76 132 4 151
4515 151 12 32 82 121 -145 -211 -45 7 -13 -258 96 289 127 382 73 -14 -175 98 165 28 -16 -42 229
4538 229 52 -118 -72 221 -57 128 -39 -138 -197 -117 -12 43 -124 -52 -49 -160 -34 239 -109 -235 -83 132 64
4561 64 161 184 114 -37 110 280 8 46 30 94 37 -20 -50 19 -154 -145 135 9 -39 51 -37 30 -15 78 -119 125
4587 125 -61 -42 92 -40 71 107 -224 -174 -28 82 8 141 121 104 140 107 271 97 23 -127 -26 144 460
4610 460 18 -39 -54 -109 191 -136 312 -35 -149 -255 20 104 -81 -63 51 -70 97 57 20 -27 -112 205 114
$$ packed form
4445DK51l80J28j9J22k46jR4j28J63R8k45K83k06K80k65O6n0Q0j8o1P6j4J5j73
4470a46j42N13j88k48N45j84o5j46m0J20j88o7J22J9J33K01k64J10q1m14M18K1
4492B9j39J05J45m14J44K68o3J17m24L79r8k58L62l9j38o7P4r7K2J6K08j28J47
4515A51j39K0N0L9k66o6J66N2k0k45L54J93j62K55l09q7j61K73O7j37m4k6K71
4538B29j77j70M6K93k78J85j67r9n9Q0J05N5j67P2Lj11J26K73l48j26J52K15o8
4561F4R7K3p0j51J47J70k72L8j6O4n7n7l0O9j73RK80j26m8R0q8O7m5R3j97K44
4587A25j86J9J34j32J11L6l31N0J46J10p4J33k0j7L6l3J64j74p4j50J01J70L16
4610D60m42n7j5n5L00l27M48l47j14j06K75Q4j85J8J14j21J67m0l7m7q5L17r1
$$ plain form
4633 114 303 -106 211 -439 -22 18 117 -71 -100 98 49 41 -121 145 68 188 38 105 113 -73 -129 227 -119 91
4657 91 -44 -49 -89 -29 149 -40 37 -80 127 208 133 -25 10 -65 -26 -4 -157 175 131 -39 50 76 96 -49 41 -90
4683 -90 139 -81 79 -190 -115 136 194 -83 -93 -72 33 -80 -87 277 -102 -99 -91 183 -149 82 -179 -103 270 94
4707 94 214 -151 25 246 215 151 -48 65 138 -264 82 74 -23 84 -245 -4 54 -180 -76 -165 -154 -243 115 23
4731 23 -156 185 -43 -24 38 183 33 -57 -159 147 -74 30 -23 -251 -76 -164 -30 -191 74 30 119 -30 -210
4754 -210 -221 -14 122 271 -137 114 -69 242 13 -50 -14 -28 32 10 26 -9 119 88 -5 -44 -3 -103 134 -180
4778 -180 159 60 -275 -80 33 -150 83 -58 -94 -16 -139 -199 13 120 -10 40 177 -84 24 -161 -109 10
4800 10 104 -134 -28 73 -39 47 -188 -80 20 189 37 -58 -232 4 75 -123 49 138 -183 246 164 -99
$$ packed form
4633A14J89m09L17o50M17M0R9j88k9J98m9qj62K66p7J20j50O7Qj86n6L56l46K10
4657I1j35nm0O0J78j89P7j17K07Q1p5j58L5p5L9K2j53L32m4j70Q9K6K0j45R0j31
4683i0K29k20J60k69P5K51N8k77j0K1J05j13pL64l79LQK74l32K31k61P6L73j76
4707I4J20l65J76K21l1o4j99J13P3m02L46qr7J07l29K41N8k34J04q9J1q9L58r2
4731B3j79L41k28J9O2J45j50r0j02L06k21J04n3k28J75q8J34j61K65m4Q9j49j80
4754b10j1K07J36J49m08K51j83L11k29o3L6j4O0k2J6l5J28l1r3l9M1j00K37l14
4778a80L39r9l35J95J13j83K33j41l6P8j23o0K12J07j30N0J37k61J08j85N2J19
4800A0R4k38J06J01j12Q6k35J08J00J69j52r5j74K36P1j98J72Q9l21M29q2k63
$$ plain form
4822 -99 -73 -57 -128 -82 -96 -86 27 57 44 115 296 49 -54 54 -28 -152 -9 36 -133 -96 26 -123 -13 -280
4846 -280 194 -75 68 -44 -182 164 189 -69 239 51 53 -89 -75 40 -14 -115 -24 -100 99 -61 -37 12 3 69
4870 69 288 -194 57 209 224 11 -175 -62 54 -138 -97 1 132 181 -95 15 -92 -131 -69 129 -43 -211
4892 -211 32 140 22 72 57 17 -45 -119 115 -83 63 -32 -189 -9 -106 116 308 -122 -118 -52 -73 99 47 64
4916 64 36 -40 168 -101 -66 71 -38 66 23 -131 -125 -54 -167 -37 -99 -8 -256 137 -94 164 126 -6 133 18
4940 18 103 -99 70 -122 -24 37 -136 -40 -254 -144 20 -57 -169 -52 -25 -258 130 -165 53 237 -55 -3 -111
4963 -111 9 -109 -247 121 -132 -106 -160 122 -156 145 196 52 -202 -157 -52 176 70 315 20 64 -133 -137
4985 -137 147 -112 3 7 -14 -3 -88 -102 98 5 -89 -60 115 14 -24 -74 175 35 -66 177 -56 -18 78 141 -48
$$ packed form
4822i9K6J6p1M6j4J0J13L0j3P1J81k47j03J08q2j24J43M5j69L7J22j49J10k67
4846b80M74k69J43j12j38L46K5k58L08j88Kj42J4J15n4j01R1p6J99j60K4M9rO6
4870F9K19m82K51J52J5k13j86J13J16j92M1R8J31M9k76J10j07l9O2J98j72j68
4892b11K43J08j18N0j5m0o2p4K34j98J46r5j57J80r7K22J92m30MO6k1J72n2J7
4916F4k8p6K08k69L5J37j09J04m3j54OP1j13J30o2R1k48L93k31K58l8j32J39j15
4940A8Q5k02J69j92R8O1j73R6k14J10J64p7j12J17K7k33L88k95K18J84k92N2j08
4963a11J20j18j38L68k53K6n4K82k78L01N1j44k54M5J05K28j06K45k95M4j97m
4985a37K84k59J15Mk1J1q5j4K00r3r4K9J75j01l8n0K49j40j01K43k33L8R6O3j89
$$ plain form
5010 -48 9 36 31 180 -39 213 14 -187 -234 38 24 121 -166 108 -76 -162 -42 -41 -55 92 65 -13 30 118 66 63
5036 63 -42 57 -170 23 -339 -175 -58 -21 225 -334 -130 -121 -129 -253 -116 -95 97 -146 38 220 -148 116 124
5059 124 420 123 215 290 163 28 -173 288 -11 -265 -21 -46 20 -103 -150 60 -99 73 -196 203 74 -122
5081 -122 -243 -38 36 -101 61 125 218 157 -211 -161 -23 70 25 223 65 140 117 54 -57 135 -139 -327 -34
5104 -34 120 184 -232 144 334 -78 -100 -26 242 -54 -58 39 -54 105 -104 -89 212 124 -25 25 -239 -149 -148 157 -13
5129 -13 115 100 144 87 -156 119 57 199 121 -16 33 -236 148 -58 107 -53 -58 -108 -105 100 223 134 62 -62 125
5154 125 276 49 -215 6 -45 117 -45 148 101 -221 292 -76 132 142 -183 -103 -123 201 -122 30 -4 16
5176 16 240 -46 111 174 -189 -92 93 -22 133 40 -71 -75 220 21 268 -10 21 -77 76 137 133 -123 -7 39
$$ packed form
5010d8N7K7nJ49k19K52j99k01m7K72j4R7k87K74j84q6J20Jj4J47k7p8M3Q8n2l
5036F3j05R9k27J93l62J64J17L7K46n59K04Rqj24J37K1J92k43J84J82l68K64Q
5059A24K96k97R2P5j27j35k01M61k99k54K44k5O6j23m7K10j59J72k69L99j29j96
5081a22j21K05P4j37J62O4R3o1l68N0J38R3m5J98j58P5k3o3j11J92k74j88K93
5104c4J54O4m16L76J90m12k2P4K68k96mR7r3J59k09J5L01q8j49N0k64R0JL05j70
5129a3J28j5M4n7k43K75o2J42p8j37M9k69L84k06J65j60nn0LK05J23q9p2j24J87
5154A25J51k27k64K21n1J62j62J93m7l22N13l68K08J0l25Q0k0L24l23J52l4K0
5176A6K24k86J57O3l63R7J85j15J55r3j11mK95j99K47k78L1r8J53O1mk56J16M6
$$ plain form
5200 39 110 33 -49 -392 -61 67 23 204 -17 -69 119 -82 -59 -54 -176 -140 81 73 149 35 69 19 39 209 150 -40
5226 -40 144 -195 -86 113 91 -86 -49 311 71 89 104 -109 112 92 42 56 -189 124 -6 -14 -250 21 -132
5249 -132 18 -109 -52 50 -99 23 -56 53 -144 -93 60 30 -268 -246 128 42 11 -230 -86 44 -36 -45 83
5272 83 14 -31 -34 -5 45 64 154 -236 262 -11 56 92 4 -32 -212 -66 -15 270 -85 169 98 113 -107 -39 -69 -4
5298 -4 -326 36 -141 -17 58 282 -126 -64 -43 -3 -283 -6 152 -178 309 8 144 -227 -179 107 -70 242
5320 242 -152 81 258 -8 52 -130 -28 154 -28 -18 -70 103 16 -159 -13 -55 -29 -153 -110 116 108 -235 -6
5343 -6 57 -101 11 104 -38 119 217 18 -50 28 113 -36 -227 87 122 17 160 153 129 -256 -101 17 134 13
5367 13 29 192 94 -92 84 -80 -209 -153 138 -141 -3 -118 -17 92 -98 -130 129 -85 19 -36 70 157
$$ packed form
5200C9P1p7q2l43L31J28m4J81k21n2J88k01K3Nj22L6K21qP6j14L4n0K0J70n9j90
5226d0J84l39J09J99k2j77L7L60k40J8J5k13K21k0n0J4k45L13j30qk36K71j53
5249a32J50j27N7J02j49J22p9J09j97N1J53l0k98K2L74q6l1k41J44J30q0rJ28
5272H3o9m5lK9N0J9R0l90M98k73O7L6q8l6j80J46N1K85l55K54p1J5k20O8l0O5
5298dl22L62j77J24P5K24m08O2K1M0k80K77J58l30M87l01J36l71M8K86j77L12
5320B42l94K33J77k66O0j82J02J82j82J0n2J73q7j75J46m2K6j24M3K26ql43K29
5343fO3j58J12R3j42J57R8j99o8P8Q5j49j91L14L5j05J43pk4l85J55J18J17j21
5367A3J6J63r8j86J76j64j29N6K91k79J38j15J01J09j90l2K59k14J04n5J06Q7
$$ plain form
5389 157 96 80 -3 138 95 248 -78 -119 115 245 -68 104 -66 -133 -63 -42 -42 14 -330 173 44 145 116 76
5413 76 15 118 331 166 -110 -25 133 309 28 130 -42 135 -216 -84 -77 -13 -112 179 -181 12 -24 244 98
5436 98 -2 -63 46 -207 58 -62 65 211 -17 21 -218 16 169 83 21 251 -61 242 -66 -138 -38 194
5458 194 -65 -141 -62 107 97 -47 34 37 -110 -118 131 325 136 -119 -152 112 23 92 -61 -35 -80 82 -61 15 -135
5483 -135 97 255 -52 177 27 7 -70 -7 -10 -34 62 137 -11 276 -148 -80 71 -22 -139 -91 177 -100 62 -72
5507 -72 -1 123 3 72 -153 -17 -217 100 185 54 -126 185 103 -161 -130 -131 87 332 217 135 84 27 92 109
5531 109 -2 155 89 -60 -31 -138 -113 -53 -50 -192 258 237 -43 -69 6 128 110 62 -63 92 226 -122 -46 -167
5555 -167 -77 -23 -177 55 166 115 62 296 -11 31 81 142 215 -165 100 -110 -1 81 148 42 254 257 -258 181
$$ packed form
5389A57o1j6q3J41m3J53l26m1K34J30l13J72j70o7P0K1%N6l44N03j29J01k9m0
5413G6o1J03K13j65k76Q5J58J76k81J02j72J77l51J32PO4r9K91l60J93l6K68j46
5436I8j00o1J09k53K65j20J27J46k28L8k39K34J53q6o2K30l12L03l08p2J00K32
5458A94k59p6P9J69j0j44Q1Lj47qK49J94j89k55l3K64q9O9j53K6m5J62j43P6j50
5483a35K32J58l07K29j50k0p7O3lk4R6P5j48K87m24O8J51r3j17M8K68k77J62j34
5507g2P1J24j20O9k25J36k00L17Q5j31j80L11q2k64L1jK18K45j15q2n1n7O5J7
5531A09j11J57o6j49K9j07K5O0Lj42M50k1k80k6P5J22j8m8j25J55J34l48P6j21
5555a67R0N4j54K32J11n1n3K34l07M2N0O1P3l80K65k10J09Q2O7j06K12Ln15M39
$$ plain form
5579 181 144 28 134 -301 65 162 148 -231 -221 -89 -205 -90 19 25 -136 58 -119 97 221 -74 -269 -61
5601 -61 46 42 -148 -166 -143 -135 -91 -29 -135 -30 -202 -103 27 163 99 97 -138 200 -142 -46 301 -294 -87 189 -69
5626 -69 -240 52 -13 -84 -61 69 -10 -172 70 8 -143 172 94 110 -75 -43 -202 235 -53 -138 292 12 99 125
5650 125 -135 193 -59 -173 -149 -259 152 64 -162 -66 76 -41 -149 -43 72 21 -261 183 -53 -40 -53 190
5672 190 49 -24 63 -45 -118 14 -48 -56 -15 -180 141 124 -56 -117 -68 102 -74 48 167 45 93 -46 16 107
5696 107 -42 81 -270 -52 27 -149 -100 -322 78 -153 81 -111 -37 45 217 39 23 181 -10 -6 -79 -3 172
5719 172 36 218 129 90 82 27 137 -31 173 114 110 -155 -159 -6 -204 139 -112 130 152 90 -63 -152 -105 -17 -51
5744 -51 133 -83 -23 -137 -34 181 -143 155 -135 56 -141 161 -131 97 -55 60 -274 -90 10 40 47 -74
$$ packed form
5579A81l7j16J06m35L66R7j4l79J0J32j16J15J09Oj61J94j77K16J24k95j95K08
5601f1J07mj90j8K3QM4O2j06J05j72R9J30J36o4kk35L38l42R6L47n95K07K76k58
5626f9j71K92o5p1K3J30p9j62K42o2j51L15p8J6j85L2j59M37k88q5M30k80Q7K6
5650A25k60L28k52j14K4j10M11q8k26R6J42j17j08J06J15n1k82M44k36J3j3K43
5672A90j41p3Q7j08p3J32o2qM1j65L21j7j80o1M9J70j76J22J19j22M8j39O2R1
5696A07j49J23l51K18P9j76M9k22M00k31K34j92P4Q2J72j78j6J58j91Mp3P6J75
5719A72j36J82q9l9qn5J10j68K04n9mk65mJ53j98L43k51K42K2o2j53q9M7Q8l4
5744e1J84k16O0j14J03K15l24K98k90J91j97L02k92K28j52J15l34J84J00L0Pj21
$$ plain form
5766 -74 -104 121 276 -106 -65 22 -17 -88 80 -148 -31 34 24 -45 -92 52 -116 -56 -14 14 69 129 -217 153 18
5791 18 36 -26 95 -147 -101 124 184 -47 128 156 35 -148 -105 16 11 238 29 54 -200 127 93 60 -42 -20
5815 -20 -91 -23 52 165 -6 212 61 52 57 -28 -231 31 -160 198 -196 -32 43 133 -157 -141 109 79 475 112
5839 112 11 5 49 16 287 66 1 -61 14 -130 43 -72 -112 -102 -66 21 71 -98 131 12 4 143 66 67 159 -39
5865 -39 257 -154 57 -25 6 175 -117 -45 -62 -97 -21 -17 -81 72 83 120 -107 -76 54 163 141 -208 -42 107 -94
5890 -94 -13 138 -260 -35 140 -71 -65 -90 -388 -43 -70 74 113 35 20 16 -353 179 13 55 9 -34 -84 143 99
5915 99 -124 18 -86 -118 50 116 -101 -55 120 153 119 69 96 -113 -111 -47 -173 -8 -109 84 -153 -112 -58 -25 -64
5940 -64 -32 -42 -162 153 204 -119 -42 28 82 91 -138 -123 -30 139 -8 165 -163 -21 159 149 162 68 -336 120 76
$$ packed form
5766g4l0K25J55l82M1Q7l9p1J68k28J17O5j0o9m7J44j68O0M2K8N5O0l46L70j35
5791A8J8o2J21k42M6K25O0k31J75K8j21j83M3J21nK27k09K5k54L27l4l3j02K2
5815b0p1O8P5J13j71K18j51rNq5k03K62j91L58l94J64P5R0k90J6K50l0L96l63
5839A12j01oM4l3K71k21o5o2P5j44J73j15m0J0L6Q7N0j69K29j19qJ39p7JR2j98
5865c9K96m11K11q2L1J69k92P2j7l5P6Mo4J53J1L7k27L1J30J09k2l49J66J49k01
5890i4Q1J51l98K25J75k11Ok5k98L45k7J44L9p8j5ml69N32j66M2m6m3n0K27m4
5915I9k23J42j04l2J68O6k17M6J75L3l4n0K7k09KO4j26J65j01J93k37M1N4L3l9
5940f4L2j0j20L15N1l23P7P0N4Rk29J5R3J69j47J73l28J42J80j0J3r4m04M56m4
$$ plain form
5965 76 -26 74 30 -58 162 91 -115 93 25 -73 182 -57 -141 -39 -212 -65 53 168 -70 144 -137 112
5987 112 116 -272 -52 -78 69 37 -101 116 -365 -198 49 167 213 96 50 12 -53 11 -89 68 145 -52 -105 60
6011 60 -105 -110 178 275 194 318 163 -261 34 337 165 284 6 -46 202 187 96 -144 58 33 51 32 383 82
6035 82 49 -1 189 73 75 -89 174 155 -29 7 115 238 174 -5 30 34 116 0 98 15 6 55 22 -76 -27 58 -173
6062 -173 89 118 115 72 -88 71 -20 -60 233 14 -69 38 117 43 -19 -9 -126 -9 116 32 88 15 -133 -60 -138
6087 -138 28 -115 115 -28 59 -150 -179 202 -151 -223 106 -16 196 -360 -165 -98 212 -44 -90 -47 22 37 -190
6110 -190 122 -179 213 -346 -240 -172 -138 200 -290 25 3 -253 98 -100 -339 -100 60 66 -55 238 41 71
6132 71 -29 39 -50 -6 123 -40 -207 79 27 97 61 59 171 -12 346 254 140 -166 151 -145 -37 124 42 -78
$$ packed form
5965G6j02J00m4q8K20p1k06K08o8r8K55k39q4J02j73J47J18J15k38K14k81K49
5987A12Ml88K20k6J47l2j38K17m81J67K47J18M6j17m6l8o5O4j00J57P7j97n3J65
6011F0j65nK88R7q1J24j55m24K95L03j72J19k78n2K48j5r1k40K02k5J8j9L51l01
6035H2l3n0J90j16Kj64K63j9j84L6J08J23o4j79L5MQ2j16R8q3rM9l3r8M9Q5k31
6062a73K62K9lm3j60J59r1m0K93k19q3J07P9p4o2J0j17J17J25q4N6p3j48P3p8
6087a38J66j43K30j43Q7k09k9L81l53p2L29j22K12n56J95O7L10k56m6M3O9J5k27
6110a90L12l01L92n59J06O8L4L38m90L15k2k56L51j98k39K39J60Oj21K93j97L0
6132G1j00O8q9M4J29j63j67K86n2P0l6kJ12j83L58r2j14l06L17k96J08J61q2j20
$$ plain form
6156 -78 125 -41 122 202 -122 -39 -71 137 -89 46 -87 -159 -132 -46 4 -71 -191 -176 -127 226 225 -313 -115 23
6180 23 3 -133 110 135 76 -92 -175 195 169 192 126 33 -60 -126 88 -126 134 107 155 -62 -37 6 -93 134 -27
6205 -27 137 -215 -121 102 8 95 -152 103 -65 98 165 -76 42 31 -85 127 -271 369 -78 88 -136 2
6227 2 35 36 231 93 -191 -84 110 133 -127 203 55 -117 -227 -43 -154 -95 -68 -20 90 91 -216 -10 -202 -82
6251 -82 91 32 -4 16 226 124 7 -163 -26 -44 34 32 -66 -107 -126 112 -27 -120 -45 -148 59 -78 -40 -201 7
6276 7 -47 -299 -49 -19 -25 43 57 -263 -14 249 92 -238 -173 -80 17 -358 83 -29 -70 -22 -137 116 79 -112 -61
6301 -61 50 165 83 28 -83 132 -22 115 -40 66 91 -48 -165 -21 -35 61 145 -141 -163 -60 212 72 -191
6324 -191 -138 1 79 103 136 48 159 21 -51 10 5 22 -109 89 16 207 -49 -96 243 -6 28 -16 -52 84 255
$$ packed form
6156g8K03j66J63Q0l24Q3l2K08k26J35j33p2K7Q6N0p5j20J5M9L53jn38J98J38
6180B3k0j36K43K5n9j68q3L70k6K3o6r3r3o6K14k14K60k7M8k17K5M3r9K27j61
6205b7J64l52R4K23r4Q7k47K55j68J63O7k41J18j1j16K12l98O40m47J66k24J38
6227BL3JJ95j38k84J07J94K3k60L30j48j72j10J84j11N9K7M8J10Jl07K06j92J20
6251h2J73n9l6K0K10j02j17j70J37j8P8kr8m1j9K38j39r3P5j03K07j37L8j61K08
6276Gn4k52K50L0oO8J4l20K49K63j57l30O5R3R7l75M41j12m1M8j15K53l7j91N1
6301f1J11J15q2n5j11K15j54J37j55J06K5j39j17J44j4R6Q4k86k2J03K72j40k63
6324a91N3J39P8K4L3q8J11j38p2O1nJ7j31J98p3J91k56m7L39k49L4m4l6J36J71
$$ plain form
6349 255 60 -197 -88 111 -115 198 6 10 -32 114 -46 2 35 -225 164 184 -102 -281 105 -271 -44 15
6371 15 144 -11 -148 72 201 -168 183 96 91 -69 -90 60 32 -264 -101 245 -137 76 2 128 17 172
6393 172 -130 71 5 20 38 107 98 129 -176 54 -70 145 14 -45 -50 -9 104 96 197 -53 195 -198 -48 177
6417 177 62 37 25 76 107 -12 198 120 -102 -124 62 -54 127 -168 -430 140 -69 -16 89 231 185 -224 -116
6440 -116 -194 -253 -106 -10 -47 -60 6 -71 -166 262 74 -79 143 145 -152 59 -242 145 193 89 208 -166 158 125
6464 125 -217 -83 6 -86 51 58 -93 227 -145 86 -60 93 -79 -117 -243 87 28 9 77 -263 -44 124 -7
6487 -7 28 212 11 -166 184 -59 -33 -79 170 11 90 -168 -129 99 -160 3 198 238 -22 127 -14 67 40
6510 40 -86 -111 -13 -97 419 -11 -89 -157 242 83 221 -106 -9 -1 87 68 17 -16 84 -216 46 262 -138 -49 59
$$ packed form
6349B55j95k57J09J99k26L13j92Mm2J46j60M8L3k60L89K0k86j79L86l76K27N9
6371A5J29j55j37K20J29l69L51q7nj60k1J50k8k96J63L46l82K13p4J26j11J55
6393A72l02K01o6J5J8O9rL1l05K30j24K15j31n9nM1J13qJ01k50K48l93J50K25
6417A77j15k5j2N1L1j19K10p8k22k2J86j16J81k95k62N70k09N3J05J42m6m09J08
6440a16p8n9J47R6l7j3O6p7r5M28j88j53K22Kk97K11l01L87M8j04J19l74L24l3
6464A25l42J34Q9r2J37Pj51L20l72K31j46J53j72l8j26L30n9j9O8l40K19J68j31
6487gL5J84k01j77L50k43K6m6K49j59P9k58L9K28k59J63J95M0k60J49j41Q1k7
6510D0j26k5R8q4N16m30p8o8L99j59J38l27R7QQ8j9n1l3J00l00K62K16m00Q9J08
$$ plain form
6535 59 103 183 -181 41 -40 -62 -4 -93 -149 105 -104 -21 35 58 14 28 -34 99 -70 -222 -162 -42 -47 -72 100 -77
6561 -77 -163 -13 49 -94 -247 -5 82 -212 120 204 -62 50 34 33 -199 69 -116 60 90 20 -16 -171 104 48
$$ packed form
6535E9M4Q0l64K22q1k2N8q9n6K54k09Q3N6K3m4J4o2J33j69j52O0J20nk5J72j77
6561g7q6J50O2j43j53K42Q7k94L32Q4k66J12j6jk32K68j85J76L0p0l6j55K75n6
$$ [...]
8191F2
##END NTUPLES=NMR FID
##END=
