##TITLE=1H_SR8_r2_TFA
 CDCl3, 8 sc, 
 28.10.2020
##JCAMPDX= 6.0         $$ Bruker NMR JCAMP-DX V2.0
##DATA TYPE= NMR FID
##DATA CLASS= NTUPLES
##ORIGIN= UXNMR, Bruker Analytische Messtechnik GmbH
##OWNER= root
$$ XWIN-NMR		Version 3.5
$$ Wed Oct 28 13:33:48 2020 Russian Standard Time (UT+4h)  she@DPX200
##.OBSERVE FREQUENCY= 200.1315066352
##.OBSERVE NUCLEUS= ^1H
##.DELAY= (6, 6)
##.ACQUISITION MODE= SIMULTANEOUS
##.ACQUISITION SCHEME= undefined
##.AVERAGES= 8
##.DIGITISER RES= 18
##SPECTROMETER/DATA SYSTEM= spect
##.PULSE SEQUENCE= zg30
##.SOLVENT NAME= CDCl3
##.SHIFT REFERENCE= (INTERNAL, CDCl3, 0, 15.7039)
##AUDIT TRAIL= $$ (NUMBER, WHEN, WHO, WHERE, WHAT)
$$ ##TITLE= Audit trail, XWIN-NMR		Version 3.5
$$ ##JCAMPDX= 5.01
$$ ##ORIGIN= Bruker BioSpin GmbH
$$ ##OWNER= she
$$ F:/spectra/data/she/nmr/H-F/1/audita.txt
$$ ##AUDIT TRAIL=  $$ (NUMBER, WHEN, WHO, WHERE, WHAT)
(   1,<2020-10-28 13:32:43.10 +0400>,<she>,<DPX200>,
      <created by zg, POWCHK disabled, PULCHK disabled
       configuration hash MD5:
       00 E9 B6 7A A2 85 ED C7 34 08 36 98 17 FE 4E 26
       data hash MD5: 16K
       3C BE A1 CD A3 8A 55 02 F1 12 E5 BC CA 56 7F 89>)
$$ ##END=
$$ 
$$ hash MD5
$$ A1 7C 74 44 C1 CC 44 A3 02 43 99 75 90 7A 8E 33
##$RELAX= 
##$RELAX= 
##$RELAX= 
##$RELAX= 
##$RELAX= 
##$RELAX= 
$$ Bruker specific parameters
$$ --------------------------
##$DU= <F:/spectra>
##$EXPNO= 1
##$NAME= <H-F>
##$PROCNO= 1
##$TYPE= <nmr>
##$USER= <she>
##$AMP= (0..31)
100 100 100 100 100 100 100 100 100 100 100 100 100 100 100 100 100 100 
100 100 100 100 100 100 100 100 100 100 100 100 100 100 
##$AQSEQ= 0
##$AQ_mod= 1
##$AUNM= <au_zg>
##$AUTOPOS= <>
##$BF1= 200.13
##$BF2= 200.13
##$BF3= 200.13
##$BF4= 200.13
##$BF5= 200.13
##$BF6= 200.13
##$BF7= 200.13
##$BF8= 200.13
##$BYTORDA= 1
##$CFDGTYP= 0
##$CFRGTYP= 5
##$CHEMSTR= <none>
##$CNST= (0..31)
1 1 145 1 1 1 1 1 1 1 1 1 1 1 1 1 1 1 1 1 1 1 1 1 1 1 1 1 1 1 1 1 
##$CPDPRG= <>
##$CPDPRG1= <>
##$CPDPRG2= <>
##$CPDPRG3= <>
##$CPDPRG4= <mlev>
##$CPDPRG5= <mlev>
##$CPDPRG6= <mlev>
##$CPDPRG7= <mlev>
##$CPDPRG8= <mlev>
##$CPDPRGB= <>
##$CPDPRGT= <>
##$D= (0..31)
0 1.2 0 0 0 0 0 0 0 0.06 0 0.03 0 0 0 0 0.0002 0 0 0 0 0 0 0 0 0 0 0 0 
0 0 0 
##$DATE= 1603877562
##$DBL= (0..7)
120 120 120 120 120 120 120 120 
##$DBP= (0..7)
150 150 150 150 150 150 150 150 
##$DBP07= 0
##$DBPNAM0= <>
##$DBPNAM1= <>
##$DBPNAM2= <>
##$DBPNAM3= <>
##$DBPNAM4= <>
##$DBPNAM5= <>
##$DBPNAM6= <>
##$DBPNAM7= <>
##$DBPOAL= (0..7)
0.5 0.5 0.5 0.5 0.5 0.5 0.5 0.5 
##$DBPOFFS= (0..7)
0 0 0 0 0 0 0 0 
##$DE= 6
##$DECBNUC= <off>
##$DECIM= 32
##$DECNUC= <off>
##$DECSTAT= 4
##$DIGMOD= 1
##$DIGTYP= 9
##$DL= (0..7)
0 120 120 120 120 120 120 120 
##$DP= (0..7)
150 150 150 150 150 150 150 150 
##$DP07= 0
##$DPNAME0= <>
##$DPNAME1= <>
##$DPNAME2= <>
##$DPNAME3= <>
##$DPNAME4= <>
##$DPNAME5= <>
##$DPNAME6= <>
##$DPNAME7= <>
##$DPOAL= (0..7)
0.5 0.5 0.5 0.5 0.5 0.5 0.5 0.5 
##$DPOFFS= (0..7)
0 0 0 0 0 0 0 0 
##$DQDMODE= 0
##$DR= 18
##$DS= 0
##$DSLIST= <SSSSSSSSSSSSSSS>
$$ [...]
##$SUBNAM2= <"">
##$SUBNAM3= <"">
##$SUBNAM4= <"">
##$SUBNAM5= <"">
##$SUBNAM6= <"">
##$SUBNAM7= <"">
##$SUBNAM8= <"">
##$SUBNAM9= <"">
##$SW= 16.880792210976
##$SWIBOX= (0..15)
0 0 2 0 0 0 0 0 0 0 0 0 0 0 0 0 
##$SW_h= 3378.37837837838
##$TD= 16384
##$TD0= 1
##$TE= 0
##$TE2= 300
##$TE3= 300
##$TEG= 300
##$TL= (0..7)
0 120 120 120 120 120 120 120 
##$TP= (0..7)
150 150 150 150 150 150 150 150 
##$TP07= 0
##$TPNAME0= <>
##$TPNAME1= <>
##$TPNAME2= <>
##$TPNAME3= <>
##$TPNAME4= <>
##$TPNAME5= <>
##$TPNAME6= <>
##$TPNAME7= <>
##$TPOAL= (0..7)
0.5 0.5 0.5 0.5 0.5 0.5 0.5 0.5 
##$TPOFFS= (0..7)
0 0 0 0 0 0 0 0 
##$TUNHIN= 0
##$TUNHOUT= 0
##$TUNXOUT= 0
##$USERA1= <user>
##$USERA2= <user>
##$USERA3= <user>
##$USERA4= <user>
##$USERA5= <user>
##$V9= 5
##$VALIST= <valist>
##$VCLIST= <CCCCCCCCCCCCCCC>
##$VD= 0
##$VDLIST= <DDDDDDDDDDDDDDD>
##$VPLIST= <PPPPPPPPPPPPPPP>
##$VTLIST= <TTTTTTTTTTTTTTT>
##$WBST= 1024
##$WBSW= 4
##$XGAIN= (0..3)
0 0 0 0 
##$XL= 0
##$YL= 0
##$YMAX_a= 121865
##$YMIN_a= -144927
##$ZGOPTNS= <>
##$ZL1= 120
##$ZL2= 120
##$ZL3= 120
##$ZL4= 120
##$ABSF1= 10
##$ABSF2= 0
##$ABSG= 5
##$ABSL= 3
##$ALPHA= 0
##$AQORDER= 0
##$ASSFAC= 0
##$ASSFACI= 0
##$ASSFACX= 0
##$ASSWID= 0
##$AUNMP= <proc_1d>
##$AZFE= 0.1
##$AZFW= 0.1
##$BCFW= 1
##$BC_mod= 2
##$BYTORDP= 1
##$COROFFS= 0
##$CY= 11.3945322036743
##$DATMOD= 1
##$DC= 2
##$DFILT= <>
##$DTYPP= 0
##$F1P= 15.9154993809931
##$F2P= -4.1035820241983
##$FCOR= 0.5
##$FTSIZE= 0
##$FT_mod= 4
##$GAMMA= 1
##$GB= 0.15
##$INTBC= 1
##$INTSCL= 1
##$ISEN= 128
##$LB= 0.24
##$LEV0= 0
##$LPBIN= 0
##$MAXI= 10000
##$MC2= 0
##$MEAN= 0
##$ME_mod= 0
##$MI= 1.114404
##$NCOEF= 0
##$NC_proc= 0
##$NLEV= 6
##$NOISF1= 3.799351
##$NOISF2= 2.8
##$NSP= 1
##$NTH_PI= 0
##$NZP= 0
##$OFFSET= 15.70392
##$PC= 1
##$PHC0= -10687.05
##$PHC1= 10.00088
##$PH_mod= 1
##$PKNL= yes
##$PPARMOD= 0
##$PSCAL= 0
##$PSIGN= 0
##$REVERSE= no
##$SF= 200.130013532006
##$SI= 16384
##$SIGF1= 3
##$SIGF2= 2
##$SINO= 400
##$SIOLD= 16384
##$SREGLST= <1H.CDCl3>
##$SSB= 0
##$STSI= 0
##$STSR= 0
##$SW_p= 3612.71676300578
##$SYMM= 0
##$S_DEV= 0
##$TDeff= 0
##$TDoff= 0
##$TI= <>
##$TILT= no
##$TM1= 0
##$TM2= 0
##$TOPLEV= 0
##$USERP1= <user>
##$USERP2= <user>
##$USERP3= <user>
##$USERP4= <user>
##$USERP5= <user>
##$WDW= 1
##$XDIM= 8192
##$YMAX_p= 0
##$YMIN_p= 0
$$ End of Bruker specific parameters
$$ ---------------------------------
##NTUPLES= NMR FID
##VAR_NAME=  TIME,          FID/REAL,        FID/IMAG
##SYMBOL=    X,             R,               I
##VAR_TYPE=  INDEPENDENT,   DEPENDENT,       DEPENDENT
##VAR_FORM=  AFFN,          ASDF,            ASDF
##VAR_DIM=   8192,          8192,            8192
##UNITS=     SECONDS,       ARBITRARY UNITS, ARBITRARY UNITS
##FACTOR=    0.000296,      1,               1
##FIRST=     0,             0,               0
##LAST=      2.424536,      0,               0
##MIN=       0,             -144927,         0
##MAX=       2.424536,      121865,          0
$$ Real data points
##PAGE= N=1
##DATA TABLE= (X++(R..R)), XYDATA
0@%%%%%%%%%%%%%%Qj6J6j6J6k4L2l8M6n6O4p2Q8j04J20j36J53j76K02k28K58k92
36a55L30l72M16m64N19n80O44p14P92q75R66j066J175j296J429j574J733j910
54a002K107k327K575k855L175l549L987m508N145n943O978q382J0429j3764K0603
69A2669o5129M7413k9931R1671L3610k25555Q0246N8427O7550j8893j73260R0610
81c0572R5420k3831j2270j40784P8507J40986n4452n3081p6385K6176J42429k83
93I1860j02658o7063J02931Q6208p9320o4387j7792P3501R2392o0712q8375k4206
105e7621R3341P5111r1525n1838J7741O1246N7047j10545m6949P7526L2571L1910
117H8015p4860p8220Q2020M8057j5826n4120m0776Q8342L4978o7194l5867q772
$$ y = [0, 0, 0, 0, 0, 0, 0, 0, 0, 0, 0, 0, 0, 0, 0, 8, -8, 8, -8, 8, -16, 16, -22, 24, -32, 32, -40, 48, -56, 64, -72, 81, -95, 107, -121, 137, -155, 175, -197, 219, -245, 274, -306, 338, -376, 416, -459, 507, -559, 616, -680, 749, -825, 908, -1002, 1105, -1222, 1353, -1502, 1673, -1876, 2111, -2397, 2748, -3195, 3783, -4599, 5830, -7934, 12669, -52460, -5047, -34978, 56693, 90303, -135252, -55006, 3421, 70971, 52078, -121182, -30572, 64848, 41017, 28747, -112037, -33530, 107456, 53004, -77, -76462, -50286, 92143, 91860, -10798, -77861, 25070, 111278, 31958, -32429, -50221, 23280, 115672, 54960, -33415, -57621, 35720, 110831, 19306, -32532, -14791, 46455, 103502, -7043, -53992, 23534, 56105, 88015, 13155, -65065, 16955, 65012, 49186, -4934, -45710, 42632, 77610, 10416, -25451, -34223]
129c4223O7378N3308p8125n2690L0556M9132K8214o4269n1722N9198M8961j5737
141C9981o3540m1072P0819N8244l5424n5525k8467N9853N7089n4565n5236R912
153c7931N8624L5972o0453n6813K4673O4090K4111o4897n0334L4550N5815M360
165C1767o0503k8670M5059M8178j0536p1561j5121N9471L2719j5585o0204j1459
177e6445O7200J5383l1128m1361k021O9764M794n1875k2258P591O4618O185o7431
190c6984p860K2673M0150L769o6945N10M4808K1015p426o1683J044O1743R384
203B4198k2951m4124K447O2621K163l5940k5555J1517N5993l389n0327j5730K6823
216a2254M8395q723n3386p321L4200L4394j6008m5984K839L8893K4490k7566m4876
$$ y = [-34223, 33155, 86463, 8338, -44352, -13796, 35336, 63550, -719, -52441, 6757, 55718, 39981, -23559, -64631, 6188, 64432, 29008, -26517, -54984, 4869, 61958, 7393, -47843, -37931, 20693, 56665, -3788, -60601, -35928, 28162, 52273, -12624, -62958, -28408, 27407, 31767, -28736, -57406, -12347, 35831, 25295, -46266, -61387, -1916, 30803, 15218, -44986, -56445, 10755, 26138, -4990, -46351, -48372, 21392, 26186, -25689, -47947, -40356, 24262, 30447, -36984, -44844, -22171, 17979, 21748, -45197, -44687, 121, 21136, 13710, -47973, -46929, 14814, 24198, 1247, -42877, -40430, 22191, 24354, -11586, -37141, -25624, 30369, 26980, -23347, -39077, -12254, 36141, 27418, -25968, -33289, 911, 35305, 19297, -26687, -23848, 15045, 39535, 11969, -32907]
229c2907J4430M5469J5200l3815l9309K2250M0550K317l1239k8360K8391L8974
241D1951j3563l6723j7642L5473L9853k3081l8602n875L1950K9042k6502l2804
253a6523Q743L2639J7311l5122l4527K1488L8323P059l6143k9229K4046L2415
265C0480m379l2224j5691L0501K7962j8676l7693p240L7354K6937k3033l4703
277b0405l65L2970J5568k7103k6029J3167L3867M295l6113k3989K2577L5268L23
290B4031l5219j8652K3205K5692j0045l0578m440L2050K0485k2496l4298P95L5378
303E908J8252k3504k7728P037K9998O313k7656j8882K0411K9778m223l4446j6567
316c5309K5023K9990o367l0449r110K4883J8536j7394k6982L872L2981J4914k5635
$$ y = [-32907, -18477, 26992, 42192, 8377, -30932, -8682, 31868, 34185, 2946, -25414, 2977, 41951, 28388, -8335, -25977, 9496, 49349, 26268, -12334, -18209, 13741, 42783, 16281, -16523, -7780, 24859, 42170, 7048, -27479, -5991, 32332, 39391, 3248, -25981, -1935, 30480, 26101, -6123, -21814, 8687, 36649, 17973, -19720, -26960, 10394, 37331, 14298, -20405, -20770, 12200, 27768, 665, -25364, -12197, 21670, 25965, -10148, -34137, -11560, 23708, 24031, -11188, -29840, -6635, 19057, 9012, -21566, -26006, 6044, 26529, 4033, -30265, -29470, 5908, 24160, 656, -27072, -20035, 9963, 16276, -11380, -30262, -9851, 19927, 15704, -18742, -35309, -10286, 19704, 13337, -17112, -26222, -1339, 17197, -197, -27179, -23307, 9674, 24588, -1047]
329a047k9284P471L1942J1186k5053k1207J3586K5557l94k8481j2825K4999K6471
342B2921q539l2282j1805K5847K3579j0936k4585k369K5090J2863k1306k2504
354b4026Q755K9319J0070k5737k3108J2290K6626M212k2384j3574J7136K0219
366A9798p772k5468o304K5432K1454j3378k6302l190K2681J5280j4669k1179O744
379f873K4612L832k1971j7219J3015K7962R52k5589j4614J3748K3559l936k4060
392f582k955J7376J6366r796l0194J938K6272J0944j1161k5337J402K6001M469
405A8743j4622j7235N845K7884l438k3689q326R023K5782j400k7924m801J2826
418a332J4980l569k4193Q00J9567R409j0211k4520M289K4761L159j3188j6016
$$ y = [-1047, -30331, -22860, 9082, 20268, -4785, -25992, -12406, 13151, 12757, -15724, -28549, -3550, 22921, 14382, -17900, -29705, -3858, 19721, 8785, -15800, -18169, 6921, 19784, -1522, -24026, -15271, 14048, 24118, -1619, -24727, -12437, 14189, 18401, -3983, -17557, -421, 19798, 12026, -13442, -19746, 5686, 27140, 13762, -12540, -15730, 6951, 22231, 7562, -13617, -6873, 17739, 21571, -400, -17619, -4604, 23358, 24310, -1279, -15893, -2145, 21414, 17478, -6582, -9537, 7839, 24205, 14409, -15785, -13847, 12425, 23369, 12208, -13129, -11727, 14274, 18743, 4121, -13114, -7269, 20615, 17177, -6512, -14838, -5815, 19967, 18567, -9357, -14158, -1332, 13648, 10079, -14114, -13314, 6253, 15662, 5451, -19069, -14780, 9981, 13140, -48, -16064]
431a6064L462K1746J742j7613j1015J2083J8902o189j9796p628J6755J9137j1158
444D364j7827j478J3871J4904j4200j6345N179J4278J4547k0620k0328J8131J1992
457F468N360j3476k1428J9448J3331l390q944j8912K0559J8918j6067r383j0449
470a7965J8037K0769k1564r532O27Q062J9171j7430j4443P978J1816J0179k0024
483d319j2970J5317J1581K330j6049r523J2429J0276O70j7537m828J7852N906
496A1135n159j8848K42K4278k362o692j0911m934K4548j364j3449l197j678K3823
510A5432k947k5810N908M831J4754K618k7020L700J1451M582L936k2959R02K2902
524A2280j225q483j3552K82K3258J295j3706p252j243J7103N245j9326l705J1042
$$ y = [-16064, -12602, 9144, 10886, -6727, -17742, -5659, 13243, 7054, -12742, -20370, -3615, 15522, 4364, -13463, -14941, -1070, 13834, -366, -16711, -11532, 2746, 17293, -3327, -23655, -5524, 6468, 11828, -1648, -23076, -3628, 9703, 6313, -2631, -21543, -984, 17934, 1867, -7516, -17965, 72, 20841, -723, -10255, -9628, -1566, 17605, 175, -14268, -6290, 5526, 15705, -4319, -17289, -1972, 9609, 11939, -4110, -13633, -1204, 9072, 9742, -7795, -12623, 5229, 11135, 5976, -12872, -12630, 11648, 9286, 2594, -8317, -13251, 11297, 9933, -3516, -6713, -8391, 15432, 12485, -13325, -7417, -2586, 12168, 14786, -12234, -8534, 2917, 7499, 11435, -11524, -10622, 12280, 11055, 2572, -10980, -10698, 12560, 13855, 149, -7103, -8346, 8757, 14002, -5324, -9029, 2013]
538B013Q899Q26j9259n481J7272O720k104j2428p392J5479O273r087q200R0J5324
553H945L725j5276p663M531J3601L893j3150q302O810J1286l484j2217o12Q972
567A059J1182q140j6074K601R312J0696n961j6579O989Q163K277n595j5405J2400
581c075J3567n965n487j4454P678J9704q418o561o454M816J6478j2364q956L427
595f064M813J5615j1393j5518O094O121J0516o823j4334R016O417J637p761j0824
609a2488J3095Q790k254q129j1135J0826J0343m147o873m843J0945N351j0125
622f44m608j290J2152P457j3716n256K65R269P790j4352l017O879M564L027j5279
637f759k950J3644K924J299j1925p711J4964L063m270o377l995J4676J383j0803
$$ y = [2013, 10912, 11738, -7521, -13002, 4270, 10990, 8886, -3542, -10934, 4545, 10818, 1731, -6469, -6379, 8945, 12670, -2606, -10269, -5738, 7863, 11756, -1394, -9696, -2886, 8400, 4916, -7301, -7913, 1059, 12241, 4101, -11973, -9372, -60, 10636, 4675, -11904, -4915, 3248, 5525, -70, -15475, -3075, 10492, 4527, -960, -15414, -7736, 11968, 3550, -3011, -9465, -4649, 11829, -535, -9491, -6064, -1251, 14364, 2971, -12547, -6453, -332, 10184, 3361, -10973, -1957, 4460, 6097, -1664, -12488, 607, 9397, 7143, -986, -12121, -1295, 9048, 4901, -1972, -6815, 4130, 9481, -644, -5252, -6542, 5610, 13067, -649, -5905, -5640, 3629, 11419, -2933, -5950, 929, 5493, 8520, -6759, -9709, 3935, 6859, 8158, -3767, -11478, 3486, 6549, 2279, -4098, -8093, 6583, 7966, -2837]
651b837m051q00J3316M265j3037l894J856Q803M014j2268k769P942N543j720j1746
666g383j518J0123N671k598j0143k166J0142L811n739o895K528R801O65p944o377
681h022M117J0540l00q187m849M192Q811k218q859n93O973O368n133r923J528
696e555P919N050m128r757K189Q902Q10n440o761M209R076j438p735m363M847
711b175R407k396q575j930M735P184l227r006J393O841L833m568q531K475P989
726C449K495n625p038K968Q211m04n763m590M677P395k445o981k581N868P343
741F979m089p017r81O073N348n166o181K170N758L239o268n998M040P129J218
756F254o382n458M758N924n38n471l692O214M995l411o012j865P203M871m875
$$ y = [-2837, -6888, -7688, 5628, 9893, -3144, -7038, -5182, 3621, 7635, -4633, -7402, 540, 6083, 4363, -7383, -8901, 1222, 6893, 4295, -5848, -8014, 2128, 5939, 200, -6695, -4167, 5634, 6299, -1645, -8022, -3905, 6635, 6335, -1852, -6701, -2509, 6302, 4084, -4775, -5368, 1605, 7973, 2840, -7083, -5555, 2364, 7414, 3286, -6471, -4282, 4620, 5430, -10, -6771, -2562, 6514, 5076, -2659, -7022, -2175, 7232, 4836, -3739, -5669, -934, 6250, 3023, -5983, -4590, 2251, 6084, 1516, -7015, -4540, 3449, 5944, 319, -6719, -3751, 4460, 4056, -1707, -6297, -1620, 5775, 3330, -3651, -6232, -364, 6979, 2890, -4127, -5108, 965, 6313, 1147, -5034, -2864, 2894, 6133, -135, -6133, -2093, 5036, 6254, -128, -5586, -828, 5096, 4558, -913, -4605, 1609, 6604, 3193, -2819, -4684, 2519, 7390, 2515]
771B515o000j71O418L390n289m594K136N941R83o862l955M182O329m8o702l605
787e332M469M896j650n864p94N586L416m310o240O46O942K949m294n791J232N818
803A679J093m780l641L593N627j139o053l566N036O089j662n560k250M449L943
818B858k713n194J144N662K596m971n384J742O176K846m877m634K387M774M65
833B877n133k145M735M327j408o361k290N807M193j709m729j656N449K102l549
848E10l062O55O104J241o005l357J862N303J986n290k344K863K535k31n267q02
864c299N620K845k230n815j410N924K760k532l956%N027N21m882k598K761N659
880D395K75n921k856K389N291k21n043j017L233L177k365n325O16M625L937k899
$$ y = [2515, -3485, -3656, 2762, 6152, 863, -3731, -1595, 4346, 5329, -1533, -5488, -1306, 5023, 4975, -1727, -5332, -863, 4033, 2383, -3481, -4275, 1311, 4727, 417, -5823, -5177, 1765, 4714, 420, -5371, -4139, 1679, 2772, -2008, -5649, -2056, 3571, 2432, -3621, -7187, -2151, 3938, 2276, -3284, -5534, -1085, 2858, 145, -5049, -3905, 1757, 4353, -618, -6002, -4260, 1916, 4762, -115, -4749, -2362, 2412, 2877, -2256, -4401, 334, 4661, 3253, -3108, -5398, 409, 4602, 2893, -1836, -3492, 1957, 4059, 510, -2552, -1897, 4207, 5448, -557, -3914, -2052, 3251, 5237, -53, -2397, 466, 3001, 2770, -2497, -3299, 2321, 5166, 2936, -2879, -4289, 1635, 4395, 1863, -2093, -2093, 2934, 3455, -1427, -4025, -1264, 4395, 4670, -1251, -4107, -1718, 3573, 3352, -1691, -2708, 525, 3702, 1337, -3988, -3372, 1253, 5190, 2291]
896B291o057L51M381K510k227m172J875M186m58l127l589K564N628n75m409k207
912c035K025M151p42l907k09K861K117k155m670J502M022J490k328l774N97M545
928B490m46l199j179J582M094j201n389k54L117L794j055n740J10L533J811j822
944B46m080P92M734R59l784l837J729M753J783m422l614K470L606L32l227l207
960d767L585L813j518k963l812M632M442l281j612k143K175N229m210k035Q23
975a642J098M383m382k958L404M13K692k665l680L928O16J74r12l088L872J523
991B776k246j238r01L599J010k628j343l9L440N70l505r61J403L596j119m248
1007a834L25J717L563n96n388O68K268K227r7n637J062M059K91r30m949P81N845
$$ y = [2291, -3766, -3415, 966, 3476, 1249, -2923, -1048, 3138, 2680, -447, -4036, -1472, 4156, 3581, -828, -3035, -1010, 3141, 2399, -1508, -1717, 1144, 3261, 1106, -3564, -2062, 1960, 3450, 1122, -2652, -2055, 2490, 2044, -1155, -2334, -752, 3342, 2141, -3248, -3502, -385, 3409, 2354, -3386, -3276, 257, 2068, 246, -3834, -3042, 1692, 2651, -1133, -4970, -3241, 1512, 3295, -1127, -4741, -2271, 1335, 1667, -1560, -4767, -1182, 2631, 1113, -1850, -5662, -1030, 3412, 131, -1481, -3624, -1449, 3780, -430, -2465, -1642, -544, 3839, -543, -3501, -97, 316, 3008, 343, -3337, 591, 1207, 1381, 469, -2619, 1253, 2776, 530, -708, -1609, 1990, 3000, 372, -971, -1010, 2430, 3000, -505, -1466, -63, 3533, 2414, -1834, -1509, 208, 3771, 3175, -2213, -1545, 723, 2950, 2853, -2784, -1722, 2337, 2628, 1698, -3251, -2470, 3375]
1024C375p95j688l182j002O008P4l146j363l27M294M05m552k40J331K897N92m285
1041a604q99K291J501L09k838p71L125M22j349j929N02K818O84k315j623O25K056
1058A005j42j184j157J846K010k177j686r0K253K396k638j943M86Q89K419k353
1074f6k632L227J032M92k612l657L991K325j038r03l465K316L600k728j176j058
1090b352K001L698l472k813L66J976L592k513l401J026J325J604j291l115K300
1105a069K470k95k066k616J894L096n22j651j593J113K418j087j931nK039J771
1121A966j739k322R0K747J243j383j855N23J609P15k482p38K157J789j6l136r89
1138a821K514R67L4j575j160K712M17j653j091m31L415J004l290o18n26K539J813
$$ y = [3375, 2580, 892, -2290, -3292, 2716, 2790, -356, -1719, -2046, 2248, 2653, -1899, -2139, -808, 2089, 2681, -1604, -2503, -212, 1289, 1598, -1240, -2011, 1114, 1536, 187, -1742, -1240, 1578, 2262, -53, -1676, -1051, 1005, 863, -321, -1478, 368, 2378, 201, -1485, -1575, 678, 3074, 436, -1507, -1021, -132, 2287, -66, -2698, 529, 1561, 2053, -559, -4216, -225, 2100, 1062, 159, -3306, -990, 2610, -118, -1294, -2352, -351, 3347, -125, -2938, -2572, -596, 2996, 483, -2918, -1892, -567, 1037, -254, -3369, -1069, 1401, 1106, -960, -3576, -1682, 1414, 892, -759, -2352, -1239, 1179, 92, -1839, -1844, 195, 1966, 227, -2095, -2005, 742, 1985, 602, -1253, -730, 879, 1594, -888, -1626, 531, 2320, 2304, -832, -1821, 693, 1660, 1694, 119, -1041, 1671, 2088, 435, -656, -1087, 2328, 3332, 42, -576, -1102, 1437, 3250]
1155C250l207o29J093J330K66l095m38K305J565p7l240r55K464Q45l47j945l73
1172a188K631K8j414j904M86K866M59k215j451L33K441K41k095l30Q29J625o92
1189F50k593j01J817J722p81k422M61J266J084p29k412R03K265k67j642j480J193
1206a066K521m46j434j109O80K419j058j578m06J547K006j202k580K93J881J215
1222A683q76k278N31J687M23j203j723J102J945k8j794j493J571J825j78j906
1238g12r52J216J725r25j742k09J336J557j169j722J08J897Q70j521j740Q43J941
1255H01M47k025j289J439J578l54j750o89J650J635j174j423n21J683J471j225
1271B54j553M20J344J027j287j597Q67J729O75j826j413J136J733K11j410j197
$$ y = [3250, 43, -586, 507, 1837, 2103, -992, -1430, 875, 2440, 2363, -877, -1832, 632, 1477, 1130, -815, -1188, 1443, 1471, 57, -1847, -1361, 1505, 1964, -251, -1702, -1369, 1072, 1313, -782, -1112, -283, 1342, 650, -1943, -2044, -227, 1495, 714, -1708, -1247, 19, 1103, 374, -2038, -1135, 1130, 863, -779, -2259, -1066, 1455, 1009, -425, -1534, -854, 1565, 507, -1071, -1477, 70, 2076, 874, -1706, -1413, 468, 1683, 807, -1471, -940, 747, 1170, -33, -1756, -654, 1291, 1263, -531, -2024, -453, 1372, 1194, -712, -1664, -448, 1277, 352, -1390, -1599, -263, 1294, 125, -1597, -1489, 408, 1278, -243, -1983, -1140, 801, 1248, -777, -2066, -627, 951, 597, -1153, -1842, -192, 1443, 269, -1154, -1675, 8, 1479, 254, -1299, -879, 465, 1492, 205, -1392, -525, 1204, 1879, 53, -1360, -224, 1509, 1720, 310, -887]
1287h87J348J220n75j630k47J517J335j082j346o9J171J180r88j643O83J209M17
1304A613j610j074J134J623k43j420r62Q60J746m11j651m52J160J324j064j878
1320a305N28J491Q82j233j912L78J476M14q68j334O36J779l55j800m67Q74J892
1337A076j80j915q39J182J170j22j403j29J489L30q57j318o0K107Q87j596j056
1354a234M84Q19Q34j545m56J175P84j17j459j132K204O41n10k35j864J901N43
1371H33j144L28r02J493J296k467n35O15J213J067k100q17J208O05J18j271q17
1388a277J919Q03o89j698p45J356J733q41j693L66J016L18m30j944J116J680k68
1405G22p07k012Q75K278r82l06n70m60K554r28j920J275l62K039n23k714J345
$$ y = [-887, 461, 1681, 1106, -524, -771, 746, 2081, 999, -347, -416, 755, 1935, 947, -696, -13, 1196, 1613, 3, -1071, 63, 1686, 1443, 23, -939, -79, 1667, 1256, -395, -847, 313, 1637, 573, -1305, -777, 714, 1596, 363, -1549, -1171, 305, 719, -149, -1483, -847, 932, 577, -1223, -1690, -816, 1076, 896, -1019, -1858, -676, 494, 372, -1031, -1160, 329, 659, -198, -1516, -1576, 531, 1418, -178, -1234, -750, 69, 903, -642, -1098, 77, 861, 744, -715, -1847, 357, 998, 488, 253, -1611, 290, 833, -311, 17, -885, 608, 1904, -563, -1098, -483, 730, 1797, -303, -1120, 88, 693, 811, -460, -1277, 642, 1445, 756, -942, -1687, -331, 1402, 561, -1132, -766, 250, 568, 138, -1806, -690, 990, 722, 15, -1997, -1122, 1156, 174, -132, -702, -1162, 1392, 464, -1456, -181, -543, 1496, 973, -1741, -396]
1422c96M76O92L26k259N93J416m77Rj277L35K165r40q06l04j06J783j6j995P61
1441b0R20K28J6j866n9K269j86m06j325l56K238p8j682J91j60J543L98k520R0
1460g65J095L94N56j988l92J700J10p8j104r78J949Q77j665n36l25J186J666k152
1478d50q78R85K7J591j379j772K017j16j12L5j659J807Q24j450M10j118N73K124
1496A459k280M1M11q8J543j447j129J660k23P68q29j236J341J005q77j64n39M59
1514a25J469j215p23J80N60J103p23j755J060R04j4o8j722M70J922o31p88o27
1532g23l0K351q15j619L16J42J272L79k300M73O72J58J85j342l72K010l80j88
1550A89r26p21K434l18j052K89r16J537L89j944O65M86K26M60j863J4J358M9J62
$$ y = [-396, 80, 772, 1098, -1161, -568, 848, 371, 380, -897, -562, 1603, 663, -143, -447, -553, 1230, 1214, -781, -20, 900, 1128, 1144, -722, -781, 1488, 1302, 896, -429, -785, 1453, 1375, -307, -116, -276, 1267, 1665, -855, -765, 330, 724, 1280, -708, -1100, 600, 710, 632, -472, -1450, 499, 1376, -289, -825, -1150, 36, 1702, -450, -1328, -343, -316, 1275, -104, -1876, 141, 25, -87, -52, -1711, 96, 920, -530, -120, -1238, -665, 1459, -821, -780, -369, -457, 1086, -361, -1490, 170, -53, 715, -114, -1350, -9, 996, 119, -45, -584, -125, 1344, 129, -594, -414, 146, 1249, 526, -1229, -169, 735, 721, 653, -1069, -599, 1323, 692, -96, -723, -753, 1598, 783, -836, -520, -378, 894, 1273, -1027, -554, 118, 276, 461, -881, -1253, 757, 377, 189, -737, -1458, 976, 658, -394, -105, -1021, 516, 905, -1039, -374, 112, 338, 798, -1065, -1051, 307, 356, 518]
1569E18j027m03J373R2p93l48J17J212M44j262p73R09N63N48j097j025J355M54
1587H57n33k39r71J337J315j249m32q32R91J239j204n73N21K25P25r28j102J281
1605D28L96M29p83j842J429O61k41m39n48O00J197j054p50L4N03R15n57j222K17
1624f27O19L65n46p65M88R30k01r02m54N85J128k16j098j17K91O12j17q35Q4R95
1644B19P0n77r32K63J020N27p06p36L29Q60kr16m2M16P24m4j329J31Q54N95j29
1665E95r73r5O95K47l02l57j50R76P0p63m96J07J226j60p79l84L35N59K49j038
1685d38j66Q52O24l53j156mN90O43j17j012J57O24J17l75q61M84P64J46p97o47
1705i25N57O04J94p69l01M77M46l88m54J7P00N17o06r68N00L19O83m12r53M24
$$ y = [518, -509, -912, 461, 553, -240, -588, -471, 741, 1185, -77, -850, 59, 622, 1170, 73, -952, 403, 857, 324, 85, -886, 451, 1766, 517, 85, -747, 244, 1483, 279, -294, 227, 452, 1177, 249, -853, 428, 824, 1253, 470, -1372, 57, 718, 477, 38, -510, 90, 1287, 233, -517, -483, 20, 935, 378, -844, -627, -8, 357, -189, -954, -466, 464, 263, -639, -1093, -508, 620, 404, -694, -811, -520, 92, -25, -860, -776, 219, 289, -288, -1220, -957, 63, 590, -116, -852, -523, 337, 335, -581, -623, -207, 517, 473, -856, -725, 129, 724, 595, -378, -473, 222, 469, 167, -190, -340, 636, 706, -57, -553, -446, 780, 620, -159, -543, -208, 351, 600, -438, -604, 248, 872, 519, -637, -641, -51, 592, 475, -537, -380, 244, 361, -14, -875, -391, 373, 519, -278, -925, -368, 236, 430, -339, -640, -163, 283, -105, -559, -542, 158, 675, 69, -899, -399, -80, 603, 191, -762, -338]
1725c38O35L51p19m04K05J083l3q50n74P90Q80n36n37P9M53N04p33p56J26R64
1745E90N01p80o20M3R03L56q18m65N75O34p0r71m59Q61K70L88j391k40R23L45
1765E75k68o43k00N84M25o22k39j33P61M05p61k39m12R17K25q88m1p0P63no36
1786e02j25M12M44k07q22p1R09K27k67k27l18P41Q8l77m77M55M83r6m38p29O67
1807b30O58j4l25p80O54N30n89J33n46O90O44n88m67LM90M81n22n28K02J50M82
1828E28l93r34Q17Q99k59p58m40K71P97k84l25k2j44N85j25j035N11O09J58k27
1848B29n84r7O87k53k4k61o2P43l45m51L11j63O88k80o58L33P9K91J22o45J9Q61
1870E40n19k06j79j7Q34q7n23j92j35P81q0p02M01L94j53M85r20k01J137j33p8
$$ y = [-338, 297, 648, -71, -475, -270, 813, 780, -70, -644, 146, 1026, 490, -47, 32, 485, 989, 256, -500, -374, 590, 1091, 311, -309, -266, 637, 993, 175, -290, 285, 919, 849, -122, -581, 280, 550, 938, -453, -693, 230, 575, 307, -336, -536, 48, 473, -149, -388, -521, 240, 645, -116, -355, -767, 150, 375, -513, -554, -624, 139, 134, -502, -627, -215, 229, 22, -800, -871, 38, 265, -2, -229, -547, 194, 282, -95, -572, -117, 366, 270, -168, -897, -230, 428, 414, 89, -691, -37, 493, -96, 37, -509, 181, 825, 237, -230, -227, 263, 744, 222, -306, -104, 46, 528, 135, -799, 18, 917, 658, -100, -540, -269, 528, 244, -81, -103, -247, 338, 213, -822, -311, 298, 456, 229, -355, -452, 235, -18, -42, -303, -365, 378, 33, -418, -107, -270, 418, 138, -520, -187, -108, 183, 305, -340, -321, 540, 21, -185, -364, -381, 453, 366, -157, -349, -484, 297, 217, -485, -84, 310, 157, 642, -278, -479, 658, 525, 447]
1891D47k51p99J164K8m88j98p9N97O16j183M1N8M25P20j226m54O36K84K97n07
1911A28p76Q84J0j59m7p38Q98M98p69l52M23m94Q45k91n18N64j54k65J79p45R74
1932I5K56q57M21l31K24M86p24k37P11l21N80m31n97O83J9K82l6q74P26O22r17
1953b20J33p64N88J135o41m76p5j92J272l46q96N50R4N61k48j068M97O23p7k5
1973D25n27l6N92J05m78P2k73O09J38p58K20J48oM25p76j35N96k99M32l73o29
1994e28P76m22Q6J75n87M36N11j097O11kJ9L54p84jO52j87Rk82l65P88J2m84L2
2017b78Q4L34M12o47l78L26J39L24o11j39L67MK96k23k59L34M05m16J3k60R0R01
2039H18o59l85K5M50K81r8p50L02J69K08p5p10L31K59K08j85l30R7M22m98k00
$$ y = [447, 196, -603, 561, 589, 101, -97, -176, 421, 1037, -146, -105, -47, 378, 1098, -128, -582, 54, 338, 635, 128, -648, 236, 246, 87, 40, -698, 200, 698, -71, -423, 0, -494, 351, 60, -458, 106, -48, -313, -134, -879, 95, 351, -506, -85, -416, -192, 294, -430, -667, 44, -277, 303, -128, -725, -42, -23, 259, 223, -651, 75, 697, -220, -87, -851, -263, 872, 231, -245, -320, -512, 760, 414, -482, 68, 162, 723, 475, -593, -96, 527, 450, 425, -102, -138, 454, 559, 81, 153, -120, 489, 627, -131, 89, 237, 231, 656, -120, -255, 341, 42, 474, 101, -528, 248, -174, -88, 87, -500, -64, 447, -650, -39, -41, -22, 332, -452, -453, 199, 12, 21, -261, -626, 162, 174, -310, -278, -194, 140, 552, -95, -473, -147, -8, 316, -295, -434, -67, -63, 233, 10, -249, 85, 490, 74, 87, -173, -83, 818, 159, -226, -201, 249, 530, 432, -318, -16, 153, 361, 286, -424, -93, 166, 374, 189, -141, -44, 378, -120, -320]
2060c20L16m5K47K33o76K15r7J75%m90K52K89l46L91m42k28P60r4l56k15J04K85
2082d2j6m11K40J07J66p1n03J91N15kk35l26L7N23k25K13o31L08K49K78n37k47
2104d19M24L00Q9o88m8N21L0n5j06q9K36J34j54j07j45K57K01l37L5J08%J10l22
2127b5k0J86K41r9k70l44L56J63Mk58j49L76L4l07j44J25K40J98l41l47L13p3
2149a41K71k16j58J51K04j34m62K41J03J86l10lJ35j85K60lk50J79N4kJ5j48j04
2172c17O13l13J8n1l9J88j33m6r5K35N1k08l0j85L27K84M5m31J31P0M16n05R7
2195A22N6J10j04k26j33K73K23j03L4k7k65J50J12k29J0J86K82k33j92n0K89l75
2217i0Q6Q9k86K78m6J5k18K78o2p5j16m9m1K10N96p64j45O27j97Q0p5n53M36J76
$$ y = [-320, -4, -49, 198, 431, -245, -30, -127, 48, 48, -442, -190, 99, -247, 144, -298, -526, 234, 140, -216, -431, -327, -42, -58, -469, -229, -122, 44, -27, -530, -339, 176, 174, -61, -387, -350, 173, -52, 161, -470, -162, 87, 365, -172, -419, 5, 305, 394, -294, -342, 179, 209, 154, 48, -41, 195, 329, 175, 68, -77, 180, 381, 44, 79, 187, 187, 297, -25, -45, 141, 382, 283, 13, -331, 25, 188, 192, -66, -215, 161, 195, -112, -256, -131, 109, 307, -34, -381, -68, -141, 130, -86, -244, -93, 111, -23, -485, -244, -141, 45, -265, -268, -133, -318, -58, -61, -311, -132, -78, -80, -65, -213, -317, 296, -17, 1, -50, -89, 99, -34, -80, -175, 60, 111, -97, -127, -312, 15, 299, 344, -87, 44, 114, 530, 25, 122, 178, 288, 184, -42, -175, 98, 321, 218, 252, 225, -40, 110, 222, -7, 3, 189, 471, 238, 46, -4, 285, -90, -4, 85, -201, 77, 31, 46, -172, 106, 44, -31, -147, -196, -237, -27, 569, -195, -340, 287, 90, 170, 95, -458, -22, 154]
2241A54j85l08J41M4L34k82j24J38L3J60j25J17N6Nn1j25J0n0L68j95J22m57N36
2264C16r1l02J29j38P5J58k28jN2J2L79j91P3j80K62k79J4P9j30P6j09j07J51
2287B0OkN9m80K58R9k07n6M6O1J67l93K42r3J20J74L5l59J63QK8R8k71j8M39l98
2313b54K95j54k88J70J18n5K2k23K94J82j03j06j43J12K17k04j23N73p8k42N7
2334F7k65J45L58k47n0LJ73L45n59J71l80M04J11k40RL70l63L44k36j70J64J10
2356B64q2M9l21J27RN5K5j90R3K64o0j05j79K89k06J45L9l15J44q6K35n1j94J96
2380A45k99r1L34k24K33k93l9K13k69J25K96l64L21M9k87J89p7o6Q4K89k26j45
2402a02k82M14R6k66R3J07J49j98P8j42j91K34J0j57L2J36J03R0K7l25o8J9J09
$$ y = [154, -31, -339, -198, -154, 180, -102, -226, -88, -55, 105, -20, 97, 153, 158, 107, -18, -8, -58, 310, 115, 237, -220, 316, 225, -77, 52, -86, -11, 147, -81, -82, -30, -18, 361, 170, 243, 63, 325, 46, 60, 139, 9, 85, -24, -131, 20, 26, 24, 83, -397, -139, -40, -247, -303, -257, -196, -29, -422, -180, -273, -153, 21, 56, -303, -140, -132, -104, -6, -277, -295, 144, -254, 41, -113, -401, -231, -113, -168, -146, -369, -75, 107, 4, -102, -245, -133, 84, -120, -243, 330, 252, 10, 67, -198, -53, 305, 58, 8, 11, 184, 529, -30, 141, -239, 165, 276, 36, 45, 415, 52, 396, 160, -10, 154, 264, 182, 231, -90, 37, 46, 101, 126, -64, 29, 293, 233, 128, -51, 238, 32, 177, 216, -99, 45, -41, 194, 143, -51, 145, -154, -245, 89, -135, 98, -195, -234, -21, -290, -165, 131, -233, 88, 137, -150, 39, -38, -104, -20, 269, 43, -102, -384, 30, 126, -140, -47, 60, 209, 11, 89, -53, -244, -10, 0, -157, -125, 11, 114, 204, 231, -94, -162, -143, -34]
2425c4J43j59L10o5k49L2L8L8Q8j16j17J86%l06K64l94K32L35m24j19J88J46j06
2448h9R7l51N08k18k1M1m26K75k1Q4K28n56K66J32l0Lk7K65r4j92P3q6J29J87
2472A77j46p3j70K14J93p1o9J4m6M1j4J5l06M65l7j10j68K08j46P2K21k96J71
2495A39m9l5J13k1j97K84j94Q4J81l97K36J56j40j8j03J76m9j34K97k81Q2L3k10
2518d7L34n74J66M07m00J18j04p1K24O7k93J56j82P1k8o2J20Q3j76J27nl5j45
2541b49M43k87M7K60k77lo5M9K42l81N0K15r1M07k52j16p2J57j01OJ84k06l0J4
2565e6J77K06l02m7P5R8j84Q8n9j5l6M06n9k15k43j2K89l1k04M8N2J36k09J55
2589E8q4j4j07P2K62k69J91J12l52qP0o3J38P8M2l83L73j52J34j26Q4q3n7J00
$$ y = [-34, 109, -50, 260, 195, -54, -22, 16, 54, 142, 26, -91, 95, 95, -211, 53, -341, -109, 226, -198, -317, -129, 17, -89, 8, -343, 165, -53, -74, -33, -459, -184, -205, -121, 107, -449, -183, -51, -81, -78, -105, 160, 66, -126, -53, -139, -10, 177, 31, -42, -212, 2, 195, 124, 55, 69, 23, 64, 50, 65, -241, 224, 187, 77, -91, 117, -29, 43, 264, -32, 139, 90, 55, 168, 147, -50, 234, 40, 124, 305, -92, 144, 300, 160, 142, 39, 215, 166, 32, 329, 48, 130, 163, -47, 287, -287, -121, 286, -114, 4, -100, -171, 53, 120, -173, -17, -199, -128, -156, -218, -98, -15, -191, -64, -69, -104, -249, 194, -93, -46, 214, -63, -66, -131, -82, 160, -221, -171, 44, -47, 360, 108, -8, -80, 77, -24, -18, 166, -40, -70, -56, 121, 327, 25, -22, 53, 151, -33, 55, -4, -19, -55, 351, 292, 77, -166, -178, 111, 80, -124, -76, -24, 112, -97, 58, -26, -40, -147, -75, 187, -82, 109, 221, -131, -139, -69, -132, 6, 84, 126, -257, 116, -36, 98, -28, 56, -27, -84, 16]
2613A6m96K82J18j82M46j97M2k1n1Rj64M20k13n4J65k07J9K29q1M6j08J56k30
2636e6k8J27O1m6L53k43m0j28K22j29Q2l0l47K25m4Q1J24l09J44J89J55l47n7
2659d1M48k83j67J58K96l33q6J7R5l3J32p5k06j75K15q1m2J11m9lN9p5M5K02q0
2684D9j5k45N6J13r0L1N0l03K64oK4J24j30J98L1l63L8K43k19L8K10j81M7R2j26
2709g0J02L6j61J55l8MNO4K3k50Q9K2L6r8J48k7R9j58J22p3M1o1JP8j19L4r1O8
2737a9J9j52j60L30k5K3n8J24k7j38Q1j92K17m7J25k61K2j68J60L09k00r7q5M34
2761B15j37j94j45L60j59k24K60j89K04L6j75J59O0P8k0j60L2P8j48l2J74M4J8
2784A35j3mK0p5J60k9J4l94M22j64r8K15q4nk82L33L0j13j39K68p9P8k90L20o9
$$ y = [16, -480, -198, -80, -262, 184, -13, 29, 8, -43, -34, -198, 222, 9, -45, 120, -87, -68, 161, 80, 126, 18, 174, -56, -84, 43, 104, 58, 411, 168, 128, 0, 222, 93, 175, 145, -202, 23, -21, 60, 184, -125, 19, 208, 363, 16, -41, 407, 124, -43, 115, 411, 78, -8, 9, 104, 71, 203, 128, -78, -253, -38, -119, -161, -50, -99, -102, -43, -118, -73, 129, 49, 34, -211, -155, -42, -132, -101, -51, -354, -90, -96, -72, 52, -78, 120, 151, -212, -174, 69, -150, -112, 98, -83, -36, 56, -70, 32, 68, -93, 62, 24, 28, 33, 97, 120, -130, -41, -19, 17, -81, 67, 40, 139, -19, 103, 30, 71, 10, 11, 89, -30, 4, -87, -19, 0, -152, -312, 18, -7, 16, -42, 82, 55, -83, -2, -194, 23, -24, 101, -160, -138, -306, -146, 163, -37, -134, -219, 215, 78, -116, -261, 99, -60, -284, -24, -213, -9, 27, -148, 11, 71, 149, 129, -31, 1, 79, -69, -101, 73, 117, 135, 122, 118, 138, 63, 223, 194, 208, -186, 236, 72, -26, 189, 105, 100, -182, 151, 181, 68, -71, 197, 118, 196, -94, 226, 157]
2809A57k02J47m4q8j22L52j77J14p6j73Oo9j89J75J55n9l30M64p8R5Oo4k23K66
2833D3m28J22K90O0l63K95k01J03r2M25k09j65JK9L95m20JL3J12%Pj65J05K3n8
2858e7K21l64N25j96k9J69k37k34K19J43k16M7q8O1R5l4j42M4K79k85K70j08j41
2881e8J16j73K10R7jk11L67m59J44qj88L8L30l93K46j84N8L17j21j74j8O1Q0j85
2905a09j7k22M21k81M88l50R3j8Jj07RP2q6J04j49L67m59J92J12J47j38l03j37
2928c70M15l3R5J26k72r5L54l14m5J24J19%j45J43K30j90P9l98K51l2Q3l40L81
2951A66O5k36rr6K42j28p0K46m1j68O6k62M46j22k31J7J14j6r8J81j46k83L57
2974fJ14k01K59J12k94k00K26o5l2o3r7K77k0q2r9M2P7L25k91j5n3J69j98J66
$$ y = [157, -45, 102, 58, -30, -152, 200, 23, 137, 61, -112, -106, -175, -364, -189, -34, -93, -423, 41, -37, 58, 64, 0, -223, 43, -385, -263, 27, 87, -276, 19, -182, -79, -171, 254, 45, -120, -119, -90, 305, -115, -114, -81, 31, 31, 38, -127, -22, 1, -57, 164, -200, 325, 129, 100, 269, 32, -202, 17, 160, -56, -9, -97, -36, 59, 25, -117, -73, 206, -79, 191, 83, -58, 58, -115, 95, 192, 191, -20, 347, -112, 32, 24, -164, -126, 204, -189, 57, -127, -69, 248, 127, -47, -65, -4, 76, -109, -126, -348, 73, -208, 280, -70, 23, 5, 6, -101, -92, -20, -106, -2, -151, 216, -243, -51, 61, 208, 70, -233, -370, 45, 12, 107, 233, -39, -134, 220, -94, -139, -15, 104, 104, -41, 102, 332, 142, 221, -177, 74, 42, 125, -215, 166, 231, -5, -14, -110, 132, 4, -66, 180, 139, -29, 37, -225, 221, 99, -132, -115, -1, -17, -115, 66, -80, -363, -6, 108, -93, 166, 278, -16, -216, 10, -55, -87, -150, -247, 30, 10, -72, -171, -129, -52, 273, -18, -33, -86, 83, -115, 51]
2998E1J29m4k95J34j83J66Q1J43p5p3j0O3j34L35l13j06rJ11J95j91K91j14o6
3021H6J03m3j71K12j24j10J1J56N6k15J29Qj8M4j36O4J54k19Q5L4j38l4L2J06
3045G2J26l60M4O4K82j29k12J62o7J37p1k49L85k79J41k25J39K60m08L47k49k3
3067a13J7Q4L4p2P8K36m56K88k98L27k07J73k24R4K21k29K47j17r0k81M70k04
3089b2J12k80M79j03j1k13m4J34j67J14K05J18m43K60p2j42K64N6q7q1k10N7K35
3112A59j29K6j58NO0J80k49J10m5M27m02k6J20J92l00K2j52J67j26P0j92J28j1
3135a24P7mmK1L0K3j24K1J05k09J25KN0J6K18m4j66k9K4J89k57J41j1k72L64l40
3161a78K62j69O1J1K3o6J21j02J86j46j88L72k86J24j06K47j55m2J28%q4J36j7
$$ y = [51, 180, 136, -159, -25, -208, -42, 39, 182, 107, 34, 24, 87, -47, 288, -25, -131, -140, -29, 166, -25, 266, 152, 86, 189, 146, -25, 187, 63, -47, -36, 120, 176, -39, 90, 98, 80, 124, -12, 52, 206, -13, 72, 106, -32, -66, -34, 72, 198, -162, -118, -54, 228, 99, -113, 49, -18, 119, 48, -201, 184, -95, 46, -179, -40, 220, -188, 159, -90, -113, -96, -12, 22, -50, 28, 264, -192, 96, -202, 125, -82, 91, -133, -39, 182, -47, 200, 83, -7, -288, 182, -22, 90, -190, 289, 186, 175, -38, -82, 52, -115, -1, 204, 322, -121, 139, 67, -75, 189, 245, 158, 77, -133, -76, 159, 30, 56, -102, -97, -37, 143, -106, 4, -41, 386, -16, -42, 78, 270, -30, -8, -160, 7, -119, -49, -241, -113, -124, -47, -51, -55, -34, -4, 19, -105, -84, 21, -188, -63, -61, -11, 5, 223, 179, 13, -16, 8, 197, -60, 81, 70, -202, 162, -178, 84, -85, -24, -13, 10, -56, 65, -37, 149, 3, -185, 187, -99, 25, -81, 166, 11, -31, 97, 97, 13, 149, 132]
3184A32j84j85Q4L12k25J11m1J40n7k49L74k05M9J8J63l84J58L7l8k65K44j32
3206a43L69P0l95j80J25K73j11j5j23q5j39L53N0l53L77o3j88R3L72j96j52J30
3228F9K14k35k64M68j98Op7j33J70O0m7j65J54M9k02K51k17J51K17j70P1j62k8
3251a8M5L05j59k7k44K70P5j02k34l3M62l19P5n4M7j77pj42O9K95M9j38k5j16
3275a03J89k15N3J02k04L27l84J77j55M31m12J12o8K77l8r6o2J66j12L7j40j4
3297a32P8j36K68n0l22M85k32k5K09k60J44ml5q1j06L62P3o7j46K21k25jj21j2
3321a15L44j67R1m43L82J25k68p5O8K0L39m10r2L02j97N09m94K90l11l8L3L07
3343B00r2m03N22j29K2p8L9p1P7j55k8OM3R2j76qj31K44J06Q7j04j72R5r9J90
$$ y = [132, -52, -237, -153, 159, -66, 45, 4, 144, 87, -162, 212, 7, 56, 74, 237, -147, 11, 48, 10, -255, -11, -143, 226, 296, -99, -279, -154, 119, 8, -7, -130, -215, -354, -1, 49, -304, 73, 10, -178, -85, 287, 91, -61, 69, 283, 48, -216, 252, 54, 60, -17, -150, 20, 80, 33, -132, 22, 71, -131, 120, -97, 54, 271, 101, 172, 10, -18, 27, 332, 173, 146, -98, 172, 247, 145, -89, -122, 340, 21, 96, 42, 89, -88, -95, -237, -168, 127, 176, 38, 13, -103, 86, -129, -76, 26, -178, 149, -235, -58, -213, 218, -194, -82, -150, 127, 89, -7, -69, 97, -15, 22, -118, -132, -54, -190, 78, 28, -294, 191, -41, -66, 143, -117, 27, 23, -12, -93, -199, 163, 236, 169, 23, 244, 19, 18, -103, -115, 229, 62, 153, -290, 92, 217, -51, -126, -58, -38, 301, -109, -201, 101, -96, 413, -81, 209, -102, -140, -107, 200, 108, -295, 227, 98, 120, 42, 81, 10, 87, -68, -96, -90, -47, 45, -131, -139, -270, -26, 80, 167, 63, -109, -14, -113, 77]
3368G7k22k0R0O6Q2k5q6R2k22r0L51K6l61L75J4l44K19R9k96J43p0L34k86K31
3392A77l2K3k12M6jN5J3L07j35k54m3K81J94n08K05k61K79k2k5R5k83R1j13n0
3416a73l3m6L32o9j69J62q6O8k6oL9jP7j1l3k65K17K08M5k20j88K18l53L03K66
3441B56l23o2j06L58j63m8J93p6R9k82p8L03J29k76j44L77J34p7l18L11k30m5
3463f8J38j36J79J10k5k2k9J13k83q3K93n7j91J99j3l23L27l22K09M3KL21m37
3486e5J06P0j95m3K39jO6j73L4m8r1J57k17K45k14K69j91Q2r9J77j51k04L56j30
3510a1J42k18N6K4J38r3R4m18K36Q3J05r0J57M3k49j64J87l61K95J36o5Mj84K04
3534E1K0K22n14Q7K07k6K48l62L27n9l0l75J30p1K24qj43J32j05O5J76l07p5K69
$$ y = [77, -145, -165, -75, -9, 73, 48, -38, 54, -168, -258, 93, 119, -242, 133, 147, -197, 22, 121, -175, -32, -102, 232, -54, 177, 145, 168, -44, 2, 1, 56, 69, 376, 241, -13, -56, 225, 419, -89, 116, -145, 134, 112, 87, 182, -101, -10, -123, -173, -206, -252, 80, 11, -158, 4, -82, -14, -40, -46, -7, -8, 69, 58, 25, -240, -23, 185, 230, 10, -178, 40, -313, -10, 256, -67, -129, -235, 123, -40, -88, 105, 29, 128, -154, -232, 71, 200, -76, -220, 157, 291, 214, -104, 207, -23, -68, 70, -66, 113, 223, 198, 176, 147, 260, -23, -106, 187, 130, -61, 138, 125, -198, 129, -193, 16, 59, 61, 382, -55, 51, 121, -74, -117, 122, 121, 187, 14, 48, 0, -91, 66, -151, 94, -120, 149, -42, 40, -59, 118, -33, -237, 119, -11, 131, -87, -31, -7, 131, 38, 132, -286, -50, 33, 138, 48, 205, 248, -1, -165, 22, -339, -44, 92, 27, 31, -153, 51, 71, 293, -221, -134, 73, 47, 295, -67, 260, 201, 171, -204, -74, -145, 79, 71, -72, 60, -45, 20, 196, -111, -186, 83]
3558H3J26k00q6J22k4o6k16K26m3O0J11k47K20k56L12k18K72k24O7O7J80l21L6
3581a9O3r4o9k5j01J00M8K33k29n8qJ63l2L7N1O7o4p8k8j34n2J50j26K75k60o1
3607b51Q2J91L97m96N7J46k38P9p3O4J59m2p7q3nJ26p4n0R4k2kpj7q4J72j63N3
3634f4K30k11M5k9q6J15J48p2m48L74N7j51o7k27J69K24R9j01j14J49Q2k7o1j43
3658a09J3l8O7l5n7O0K55j74k81K79J81k79J15j03o6L4J63J18k79K62j42n9K53
3681A78R9j50k61J20J07j15J49rj95J22J92n16J54J01J48J01j51J31k29q9K03
3702I0O6j27Q9R3k22jP4j53n9P3J25k04N9J37j02J21k58K7J65R2n1k7P7k38L20
3727A66l42J94J31l4j37j54J51k8K32j23n7l44K90J02p1r4m6k1K01K28m98K6J91
$$ y = [83, 209, 9, -77, 45, 21, -45, -261, -35, -78, -18, 93, -154, 66, -190, 122, -96, 176, -48, 19, 86, 266, -55, -19, 44, -50, -119, -144, -245, -145, -97, 136, -93, -151, -159, 4, -28, 9, 60, 127, 63, -15, -43, -177, -229, -79, -205, 70, -190, -251, -169, 22, 419, -77, -20, 126, -112, -33, -106, -42, 117, 75, -2, -85, -90, 36, -38, -88, 6, -16, -18, -25, -42, -126, 46, -117, -64, 166, -45, 0, -29, -115, 0, 148, 76, -372, 2, 59, -92, -159, -386, -217, 7, 106, 5, -109, 40, 122, 95, 34, -109, -96, -134, -67, -102, -159, -99, 156, -18, -299, -20, 161, -118, -3, -106, -172, -138, 25, 143, -136, 126, -16, -75, 178, 277, 127, -134, -14, 93, -22, 127, 118, -77, 45, 237, -279, -125, -24, 124, 225, 74, 205, -24, -113, 90, 156, 29, 118, 211, -11, -12, 62, -91, -150, -77, 48, -156, -97, 40, -62, 59, -199, -172, -7, 85, 34, 7, 84, -154, 166, -176, 18, 149, 115, -22, -176, -25, -53, 179, 56, -1, -345, -55, 47, -24, -118, -164, -185, 16, 244, -254, -228, -37]
3750c7k11L00j78k5K8r3K93J03j92j01K38k83J61J14j15K87k71m5q8J93N6K4j43
3773A5O7jJ68m50L15k17%M4J6J66J1l45K40j12J15j57L57j15J04q8j0k08R1P3
3797G9j53L6J77k33j07K01o0J86j62p5k6K76j60l9o4J1J62j45J02j41J44J14k34
3820a11R5JM9J7Ql72J61J83N5n0l71K59L6J16n0n7L8j68L33p8J0j03r3J84k7k27
3846a62K52J06k21J17o9K93k79J28n10L94J65l60L19j86k37J76J45l89L29p0J0
3867d9JJ84p9N5n1k57J00O9j29m2K92j74J74r1J92k88K54m34K1K54KL1j15K2J67
3892A09j2L0n9M0j17m2J38O9k26M0j16L8m7J90p4l34K95J46j47L10k26J18o3p7
3916a7j43J36L1Q2n6L7L8k44K18j40J76J09l24q6L29k11R6L0j3j47K90j87N5k22
$$ y = [-37, -248, 52, -126, -151, -123, -216, 77, 180, -12, -113, 125, -158, 3, 117, 2, 289, 18, -27, -115, 78, 134, 158, 15, 82, 81, 249, -201, 114, -103, -103, -59, -43, 123, 134, -211, 29, -83, 32, -125, 232, 117, 221, 133, 123, -85, 6, 79, -74, -38, 139, -94, -201, 0, -60, 126, -36, -111, -137, 139, -21, -60, -124, -113, 49, -96, 6, -135, 9, 123, -111, -16, -15, 34, 51, 59, -313, -152, 31, 86, 36, -335, -76, -40, 76, 26, -31, 7, -161, 172, 94, 104, 1, -92, 92, 65, -162, 90, 196, -25, 92, 23, 316, 37, 165, -345, 49, 214, -146, 173, -13, -250, -74, 71, -318, 11, -59, -49, -48, 136, 57, 112, 61, -196, -96, -27, -156, -198, 94, -80, 94, 3, 195, -93, 161, -273, -252, 2, 4, 35, -80, -58, 109, 97, 127, 68, 108, -9, -51, 87, 156, -70, -30, -146, -108, -155, 35, -39, -373, -78, 68, -79, 231, 5, 123, 60, -17, -160, -24, 7, 89, 33, 70, 108, -136, 82, -58, 118, 227, -97, -183, 146, -65, 31, 61, 48, -99, 191, 4, 59, -163]
3940a63J84k91J00L15k18o5M0K91k18L06j11m85K67k77M51j62j02l8L3K79m30
3961b94K20j59J79j1kJ67j53K39l81K47j42J6j23J13m7K99pj63J95j13k82J33
3983f9K27k15K09l07J19J74j65J03k04J35j04J30q4K6j87L40j17j41P4q5NJ62
4005B6o6J09n6q3J02Q9P4k68nok00M44j15j37L94l77j44j36L93p1j07K07j87K37
4029A17l14J40P4j5M3n6Q5j56P7P9n4j02J86o9O9j94j20L96j38r1J80k10P1K02
4053B00k37k8J68j7q4O4k5j5q2K07k1k97J01K01L3j68j5p0K28k24j7m4L72l49
4077a19K3JK83l14Q4J96J2k08j31J92J06m4k4J2K27k13qk10P1J29j72K18j08k
4101Al1P8o2k53N5J64J42R6k49mK77j41r2K13m23K21j26J52j04q2J38N7L7q6l0
$$ y = [-163, 21, -270, -170, 145, -73, -138, -98, 193, -25, 281, 170, -315, -48, -325, 126, -36, -138, -176, -143, 136, -294, -74, -233, -54, -65, -67, 100, -53, 186, -195, 52, -90, -74, -197, -84, -131, 168, 161, -2, 193, 80, -202, -69, 158, -57, 152, -155, -36, 138, -27, 76, -128, 7, -97, 33, -51, -25, -212, 128, 11, -130, -56, -141, -136, 26, -40, 69, 13, -70, 32, 121, 195, -73, -78, -84, -284, 160, 45, -92, 302, -75, -219, -355, 38, -33, -140, 67, -120, 117, -197, -57, 17, 2, 45, -11, 74, -82, -5, 74, 20, -82, 104, 35, 104, -90, -210, 186, 48, -43, 137, -73, -2, 200, -37, -65, 103, 86, 2, 66, 41, 26, -56, 151, 130, -167, -66, 135, 168, 0, -15, -85, 143, -81, -98, -142, 230, -119, -96, -95, 188, -126, -42, 154, 166, -42, -173, 19, 125, 81, 57, 69, 296, 83, 75, -135, -64, 65, -107, 111, 3, 1, -30, 48, -14, -267, -212, -48, 94, 190, -59, -63, 214, 73, -19, 194, -229, -8, -134, 18, -86, -168, -30, 27, 64, -22, -52]
4126e2J37k6j60K38j29J00m32N24n38L74Q7k72L03m36M08n6K42m13K73M8m61K54
4148A3lj00Q8j44J23o8K64K01l70j26J65l8j35P5J18k37R4K12m03M06L3j44O6
4171I0p8J30k83M54j76J5j71n4r3J21p4K89j72j06M8J42j40J97j58PJ2q6Q1l3
4195c8R2j9o1oJ33j36k00L21l69L19l9j21Q5PQ4j15K30j27n1M8q0J66%l34K93
4220H2m3j72J18L5J27n6JJ37k58j01j4R5L6j56L13j24j86K51o6j52r1K53qr9K58
4245A80p1k86M4L96l45J73k19J15L2J52k04J9P8r%j11J27j10j45K67L0o8P8k85
4269a62P6M72m40n9J84p5L6P0Nj06p2J09q5k58M61r0Lp2J7L96l09j90N0J58j08
4294A1j13J57j15Oj02K78m12L38J01m4n9q3J86k63J30j26K42J17m24J41J51k37
$$ y = [-52, 85, 59, -101, 137, 8, 108, -324, 200, -338, 36, 123, -149, 154, -282, 126, 70, 312, -101, 172, 220, -241, 13, 10, -90, -2, -146, -23, -91, 173, 374, 4, -122, 43, 5, -130, -55, 63, -174, -80, 132, -271, 135, 168, 24, 90, 12, 142, -141, 313, 137, 152, -19, -73, -166, -45, -119, 170, -2, -108, -60, 82, -58, 139, -19, -12, 0, -86, -5, -38, 54, 35, -26, -32, 101, -35, -235, 86, -283, 36, -3, -124, -39, -32, 52, -63, 167, 40, -11, 37, -43, 123, 123, -211, 82, 39, -133, -15, 20, 147, 91, 92, 229, -29, -130, -144, -49, -13, -169, 144, 20, -166, 85, 19, -133, -224, 29, 21, -78, 180, 109, -177, -133, 263, -82, 91, -128, -13, 19, 171, -33, -14, 64, 55, 55, -56, 71, -39, -184, 83, 113, 45, 123, -162, -86, 386, -54, -113, 71, -4, 32, 102, 107, 1, -71, 38, -47, -305, 156, 66, 69, -3, 14, 410, 101, -89, -39, 119, 11, -102, 55, -60, -54, -156, 122, -290, 48, 149, 105, 46, -37, 149, -114, 16, -110, 132, 249, -175, -34, 117, -120]
4316a20K07q0n1o0K39L0o3j15j81K01p0J91J6j65j02j03K28l37L15m8r3K07o0
4339a4M4J42k65K06q0l28L82j97J10J12l82J27J66p2Q8p9J14l6k4rJ35k31J54
4362F3Q6l60K08l5Q0k12O2J2j8n2J60J72j15R5k12J0j6K48j65J7rj1P2l1j90Q5
4388e6O9p0m0J27j63J90l1k5K28k82o2Q6k0k53M32l5j97R4nJ7M8Ol1P6j39q4J28
4415HJ51l37M26l52q9K16J12j50j33L2K00m5l8L9J23j19k52K66k08K5l6m6J47
4438f0J10k2j29L44j36J07j20j60j23p5J41l8L48k00K57M2m33K76J44j74j52p3
4460a26nK1N16l75J5r4J82k26Q6J44j28J90j89M2j61r9Q7q2K93p0k03M8J58L1
4484E5l21L67j72R4K7j27J45r3o5r4J08kJ20K8p4j01m9K37J8j02K10k34R0Q2o3
$$ y = [-120, 87, 7, -44, -104, 135, 165, 102, -13, -194, 7, -63, 128, 144, -21, -123, -226, 2, -335, -20, -68, -161, 46, -14, 30, 172, -93, 113, 33, -295, 87, -110, 0, 112, -270, -143, 23, -49, 39, -40, 74, 38, 14, 5, 140, -91, 63, 149, -211, -3, -38, 42, -170, -108, -96, -114, -166, -6, 166, 51, 146, -66, -56, -72, 176, 11, 28, 19, 8, 80, 49, -141, -56, 13, -57, -97, 30, -133, 57, 26, 1, 229, -53, -115, -29, -49, -302, 130, 95, -102, -8, -13, 4, 52, 58, 27, 103, -36, -120, 8, 159, -178, 248, -104, -193, 23, 135, -15, -148, -116, 84, 39, 1, 40, 163, 44, -208, 58, -150, -125, -161, -207, -60, 50, 28, -101, 243, 107, 214, 94, -66, -189, -264, -123, -161, 187, -13, 244, 286, -147, 129, 273, 99, -53, -126, -131, -110, 406, 31, 46, -48, 134, -92, -6, 138, 10, 200, 11, 53, -108, -207, -120, -202, 91, 21, -182, -134, 24, 55, -266, 101, -71, 23, 50, -77, 68, -25, -90, -184, -76, -78, 42, 70, -4, -105, -154, 83, 101, -1, 209, -25, 65, 147, 84]
4509H4O6j72OM2J27j73J08L1j86k51L33j27J69P6k28J80J41j33j63k24L34j51
4531a11R0J79l72K77r1j71J97O8p9j58J40J11l16K26P4J01l79J37k9J39j24K42
4553A51l08R4K33j85j61K8J34r6M0J54P0q2k3n7M0j27O7J60o8n8k15L30j81R2
4577C2j52N9p0m7M00j99m6j02J76k36L02j79p0K38K0j63R7j88J70M1j32M5l6j13
4601a53P9J06j69J8m2J27K76k88N5l3k6P5O6m8O1O2j24l7j43M03k38j11L31k33
4625A4j98K75j64nL05k43J80M5m38K44j32J02j20J03k41J44K8K61l24L77j79j21
4647h7mQ2J43N4n6n5k43L25k27p7J21j11j89L74j65L04mn8k61l07N99q2o0R0j21
4672a5J61l0L3k23K18j90K78l09J44L8J43l44q3K40j00R7J6j9J21j0j29MJ33l39
$$ y = [84, 150, -22, -16, 26, 153, -20, 88, 119, -67, -318, 15, -112, 57, 133, -95, 85, 226, 93, -70, -294, 40, -111, -21, 158, -214, 63, -28, -199, -2, 66, -13, -171, -31, 80, -236, -10, 64, 165, -214, -77, -106, 33, -91, 151, -157, -63, 170, -15, -176, -148, -14, -110, -70, 84, 154, 72, 49, -8, 32, -95, -28, 132, 64, 6, -209, 121, -60, 32, -120, -61, -131, -178, 222, 23, -23, -125, 51, -185, 117, -62, -132, 106, 126, -37, 60, -128, 42, 83, -49, -4, -40, -153, -74, 32, -137, -119, -161, -34, 242, -46, 9, -24, -50, 25, 91, 43, 104, 166, 42, 5, -138, 265, 27, -84, 247, 14, -184, 91, -73, -78, 227, -16, 164, 209, -229, 15, -117, -15, -135, -32, -273, -129, -101, 160, -164, 213, 34, -87, -91, -9, 134, 188, 132, 77, -166, 159, -68, -145, -24, -135, -324, 50, -115, 189, 185, 127, -134, -441, 158, 76, 16, 106, -15, 146, 116, 149, -74, 144, -46, 232, -77, 67, 105, 248, -96, -179, 61, -39, 58, 74, 55, 176, 166, 37, 41, 174, -165]
4696a65O1M2k0j14J24k04L9L07L5K10m29j06Q8J48J69j76l1M2J45n9j27M78l35
4719A22j47K02L0l64J54K6N1j98J17Q8j79J82j20P5kq3l20L40r0o8K82k85L56
4742A69k50M00k61l52M16j41r6K39k84J93j15l4M21m34K40l1l7J75l27K3j12o
4764b04Q4K91j84lJ57l47K28P7K2k47L27k39J6K3n7P7j52K33k85J26L8l2J90q3
4788E6k12K6K97k85K40k31K29m1r0p2m6L66k65N9o3J95k8lP5m61L73Lk67L00j64
4813iK96l26K4J96r1k76K5O5m9L08J0k47N4L4J25j98L16k77L12k13j35r8J43k2
4837c3J17M5j31l17L68k5J7Pl6P0o5j14K41j82R9J23l31J94k43J60J30j50k14
4860b70L35k19K16j58J66J42k27N9o5j77J2J77q3P8P6q5P1om3j22m1j01J2K0L30
$$ y = [-165, -104, -62, -82, -196, -72, -276, -237, 70, 105, 315, -114, -220, -132, 16, 185, 9, -22, 20, 165, 106, -21, 457, 122, -25, 177, 207, -157, -3, 23, 74, -124, -7, 81, -98, 84, -36, 39, 37, -46, -366, -26, -116, -184, 98, -187, 169, -81, 319, 58, -294, 122, -19, -115, 124, -160, 33, -82, -116, 305, -129, 111, 80, 43, 218, -109, -86, -198, -204, -120, 171, -13, -16, 141, -206, 22, 99, 121, -126, 201, -38, -22, 1, -56, 21, -131, 102, -183, -57, -19, -51, 139, 56, -156, -130, 167, -118, 122, -109, 120, 79, -11, -83, -129, 237, -28, 31, -32, 163, 135, 132, 207, -254, 119, 122, -145, 155, -9, 287, -39, -15, 181, 90, -186, -161, -96, -145, 163, 173, -74, -20, 14, 139, -59, 257, -20, 292, 79, -56, -154, -11, -33, 84, 129, -2, -319, 49, 24, 41, 48, 12, 82, 17, -97, 144, -38, 61, 184, -147, 47, -196, -36, 94, -56, -270, 65, -154, 62, -96, 70, 212, -15, 44, -21, -198, -186, -9, -92, -14, 62, -23, 48, 42, -1, -123, -164, -265, -253, -233, 97]
4885I7k57K21J32l04N2K51k90O6J48k35J11K57j16j96J63J04k52O2P9R5j55q2
4907d9M2O1q7j58L43j62K0j20L42j42l89K60l0L8J70k54j5L50l23K6j9J85l36
4930b47K49r6K86l69R8n4J55l68J58J23P4k44J3L07j30J4o5O0j20J83j49J10o0
4953g2R6n2k5J51j78J26L44m89J6N5J30j02P4l8j68K92j96k5J88k88K35j3l9J65
4977A87k8j40K49j00k58P1n3R4p6j5j48M70j43j99J59k1j77J25j31L71l99Q7P0
5000eQ5o5l4k96K42K1K04k38q2K27K66n02M01j77R4j99o0jr6M53j38j73q0K72
5024A19l09J89L12k06R9j25Q4j6K29n66J78j37P0pp4O5O9N9j59N7n5J58J22j34
5048B2r9k07L96m4J3j54L40l15O2J04j30K08k07J43P1j49K6j18M8m6j3J64l31
$$ y = [97, -160, 61, 193, -111, -59, 192, -98, -32, 116, -119, -8, 249, 133, -63, 100, 204, -48, 14, 93, 188, 33, -49, -7, 54, -33, -191, 152, -10, 10, -110, 232, 90, -299, -39, -69, -31, 139, -115, -130, 220, -103, -77, -96, 89, -247, 2, -94, 192, -177, -79, -133, 22, -346, -188, -65, 9, -235, -222, 85, -45, -31, -96, -36, -156, 27, -122, -12, -72, 24, -28, -53, 98, -80, 46, 390, -99, -83, -28, 102, 0, 74, 36, -132, 160, -36, -61, 127, -161, 74, 61, 22, 187, 159, 19, 268, 168, -90, -19, -72, 22, -54, -69, -217, 253, 110, -89, 70, 49, -128, -3, -134, 237, -162, -75, -5, 80, 15, -19, -315, -73, -52, 152, -86, -168, 59, 325, -177, 224, 47, 141, -58, -118, -119, -215, 238, 100, -73, -153, 119, -190, -1, 311, 105, 204, 79, 163, 147, 376, -190, -12, -149, -79, -86, -160, -95, -26, 33, -126, -69, -124, 34, 156, 22, -77, -284, 112, 68, 81, -73, 267, -48, 14, 118, -12, 196, -11, 132, 203, 54, 80, -38, 10, -36, -49, 115, -216]
5071b16k5K72K6J3p3j07O7P2n6K0j47J06n0Q8M6L8m33M57k86J41K43j56K30n77
5095c07M52p0l7j52q1J49p8K19K34l07Q4k61J08K9k0r8O7P9k4r5J32K59l34j38
5119a90J62rP2Q5m1J11k19m5P6L4o3r7j04K90r0NK17m69L23R9j02P5j17R6K4j41
5145a8n2L6n5J79j94j70L87j22J32j06o1l1J18p5J29K73n63J05JO3J49R2j68m
5169D5m17N32j54m1m9k17N60k85J46l5l0k46J39J2J4k0Q2P5k43J64P1j74J46j29
5193e4LP0Q5%j75J48r3q0J00p4P0j94L88k01O5L7j81P2L16j58l62M11j44j00K10
5218A59J12l98L21q3m9K5j88o2L71l17J02k47L31p4o8K19j89M5p0o9M76j24n21
5241b98J07n0K74j28J03k5M9j42K37K47l95k2J32R5l16Q5j26J88j81K34p2J26
$$ y = [-216, -241, 31, 57, 70, -3, -110, -43, 29, -27, -7, -154, -48, -98, -10, 36, 74, -359, 98, -188, -47, 196, 40, 270, -307, 145, 75, 38, -114, -195, -46, -124, 95, 329, 22, 106, -155, -47, -18, -38, -136, -69, 10, -14, -109, 23, 282, -52, -190, -28, -37, 35, 120, 79, 190, -29, -74, 2, 36, -27, -124, -228, 62, -28, -23, 194, -275, 48, 147, 45, 120, 3, 99, 123, -18, -70, -34, -89, 90, -104, -274, 113, -9, 123, 17, -44, -75, 43, -32, 97, 370, -193, -88, -87, -24, 125, 217, 49, 45, -372, 160, 6, -35, -84, -301, 259, -26, 120, 85, 55, -191, -52, -40, -26, -46, 36, 111, -132, 32, 103, -71, 75, -54, -51, 19, 104, 104, -71, 77, -16, -96, 4, -70, 0, -194, 194, -7, 58, 95, -86, -14, 302, 144, -218, 193, 49, -51, 159, 271, -127, 194, 111, 62, 87, -101, -163, 208, -109, -7, -254, 77, 3, -65, 154, -35, 10, -60, -129, 347, 223, -298, -191, -241, 33, -95, 8, -17, 32, -110, 127, 374, -21, -43, 89, 184, -132, -47, -173, 15, -166, 68, -4, 122]
5263A22J09j24r7j40Q6N4R3j19K06j89j49kNL10l63Q6L5o2L59j36J83m01K13r
5287G0k29J51M8P1r5J81k07M7r2J71j77j00j2J89k86K03J24j33L4M0J6q9J60J32
5311B17k8k1j79L8q2O6j46o4L3J31j1J25j29O7k00J68p8O8qK40L1r1k29J65O2
5336A45n06K86K54k11Q2n0k02J07m0K57j46J17j21J27j91p3J65L39k39j60J01
5357D1n2J09O9k96J85k08K09M3l00N3Q8n7K36k79L33l59L24k48Rj51J49Q6J29
5380A13p2k7Q1j51J77l01L83j33r4j22R1J25n3r7J62k17K42j18j5J08j29L4Q9
5403G6m5M4J60k67J86j73J44j06K31m85L08J76m46K87j69J17L8k18M13k14rK4
5425G2M6j74l21M71k64K13J37m01J51K8J68N4l9j27j30n2J44J75j83J62k60J83
$$ y = [122, 231, 107, 10, -130, -44, 10, 103, -16, 190, 1, -148, -150, -145, 165, -198, -112, -77, -139, 220, 84, 267, -134, 79, 70, -159, -8, 40, 111, 16, 197, -10, 37, -55, 116, -61, -161, -173, 16, -270, -67, 57, -76, -42, -2, 14, -75, 85, 217, 189, 168, -11, 27, -55, 11, -135, -199, -166, -35, -46, 79, -50, 17, -183, -15, -93, -25, -33, 207, 238, 147, -82, 83, 145, -361, -75, 179, -32, 50, 0, -202, -95, -135, 122, -24, 93, -28, 99, -92, -165, 0, 339, 100, -60, 41, -11, 98, 167, -129, 56, -152, 57, 100, -200, -147, -59, -116, 120, -159, 174, -185, 139, -109, -100, -251, -102, -16, 113, 41, 14, 95, -56, 121, -180, 203, 70, -24, -146, -55, 70, 17, -80, 82, -135, 107, -11, -26, 82, -47, -13, 76, 31, 75, 235, -32, 154, -19, 125, 19, 250, -235, 73, 249, -197, 90, -79, 38, 76, -142, 271, 57, 48, 72, 118, -56, -377, 94, -170, 43, 180, -221, -70, -42, 126, 180, 141, 14, -116, -168, -24, 151, -32, 130, -130, 53]
5447E3k14J7J58j08R1j30J68J22l32K63q2J71l37P4M48m40N9J80R0k55J73k8j8
5470A23k22L2K46k01p7j91K59J55k42k42L35J48j18K2j04mK21J28k93j2j63J18
5492h2n7K19l00M11j54J40m6p7j99o8L41k10N7P1j57j50K78j9n2J6K27k38J05
5515E6L4k03P7rR2k75K12J36j91k2p5K88j7l00O6K7K95Q3k98Q9q6J15P0k30Q1
5540A5J21k23J72l19J19Q0j28L33j97K37j50j45MN9j9m6J21ok93L56l19Q9J86
5563D7R5j58p5L06k46k27L52R4l02J69j19m9K60k27N1J24j74K00l0j41p8M5J1
5586g2r3k36L80l0R2M3j05j60K49j18q5J25o3J25r3R4k3J78l56K47j20k4M8L4
5610C7j17J28J89l61J42q9K20k19J89N7k48K46p3k60K7L84l54m9L19j63O9J23
$$ y = [53, -161, -144, 14, -94, -3, -133, 35, 157, -175, 88, 6, 177, -160, -86, 362, -78, -19, 161, 251, -4, 169, 141, 123, -99, -67, 179, -22, -99, -290, -31, 124, -118, -360, -25, 123, 5, 27, -77, -81, 140, 268, -25, -37, -200, -82, -139, 80, -220, 191, 37, 177, 131, 54, -145, -213, 128, -82, -25, 46, -111, -261, 17, -2, -54, -38, 189, -49, 56, 90, -113, -36, -45, 47, -228, -16, 120, -71, -93, -168, 120, 103, -197, -131, -104, 191, 274, -24, 65, -21, 94, 164, -66, 15, 136, -87, 85, -234, -115, -35, -163, 170, -27, 210, 60, -85, -81, -22, -41, -87, 34, 28, -265, 91, -228, -139, 47, 142, -16, -91, 215, -31, -258, 94, 188, -114, 55, -64, -113, 147, -80, -29, 95, -79, 121, 91, -50, -128, -83, -72, -165, -401, -21, -51, 41, 84, -21, -181, 68, -50, -135, -10, -73, 52, -41, 53, 30, 208, -148, 99, -21, -45, 3, 37, -80, 48, 237, -124, 18, -71, 149, -70, 119, 176, -72, 174, 101, -159, -132, 252, -102, -151, 168, 5, 74, 197]
5632A97j42p0J00J7o7L3o3j64j36J67O5o9N1j8N8J04r4o1J15j67Q2k37O7L16q7
5657cJ58j77k00L22N3q1j60K03J05k73j56K82l26J86Nj8J13O9l05J43K77j2j16
5680H9j53L56k09k61L16%j45j05m2K69k18J75J53k39n2n7J67P3j48J6NK49k83
5703d4P0M4k73J94M53n52J47m9O4L5r5N3N8o4%o0j83k1M00j33Rj86j12J70K16
5728A41j00J36k31j49J48P4o2pp1J78k81J08K82m4j87j50K04M6O2l66K08pk27
5751b95M68k43J19j55M0J8j25J86j31P7J1J24o4J1p1J97l93L04P7k54J97m43K56
5774h9p9J84J03K29l52j28J49l8P8q3L2J40l42M31l3n42N62m53J09K52k31M67
5796C66n61J17k3J03Jn8p1p9J16J29j76L71k08J51j46k05K95k84QJ18l4K7m3j16
$$ y = [197, 55, -15, 85, 102, 35, 68, 5, -159, -295, -128, -63, -132, -81, -99, -41, 63, -31, -92, 23, -144, -62, -299, -232, 84, -3, 155, -22, -222, 100, 153, 72, -88, 115, 220, -53, -209, 73, -253, -67, -62, -80, 33, 102, -203, -60, 217, 205, 89, -64, 292, 83, -178, 138, 138, -7, -112, -154, 115, -103, 72, 225, -14, -66, -123, 44, 117, -31, -15, -10, 239, -44, 26, 70, -203, -9, 444, -108, 39, -10, 54, 89, -6, 47, 105, 41, 41, -19, -202, -223, 177, 44, 53, -133, -245, -75, 141, 41, 177, -54, -203, -55, 19, -43, -50, -121, 57, -224, -116, 166, 122, -65, -215, -11, 35, 97, -269, -61, -68, -295, 173, -70, 49, -106, -66, -48, -173, 13, -118, -41, -30, 94, 30, 41, -30, 167, -226, 78, 155, -99, 98, -345, -89, -168, 16, 119, 348, -4, -132, 17, -21, 57, -26, 6, 146, -196, 235, 202, -340, 222, -231, -122, 130, -101, 366, -195, -78, -101, 2, 3, -55, -126, -205, -89, 40, -136, 235, 27, 178, 32, -173, 122, -162, -154, -36, -70, -43, -86, -202]
5820b02J22j2K16n2l20J39R9Q5L5r1L35k83J03q1k53M16j97J4k96K63j01K69k46
5843c8r9P3Kj02K67j43pL81k81L13k63j20q6J78l95L49o3j31J08R1j98L18k15
5866f1P7r6J50k01J87r5J0k48L83j28j48L68k13J91o0k76K80j82L6j25j6M7j54
5889b74K93k3R9J16l47J26J31o1J6M0r1j49J26K22j6k51N6K6P5k91k6N41m02P7
5913A3J85j07q3RP6j09J7J23l7k44L56j32k10K17Q4k03J0j31K47K6j68K33L6j39
5937F9J6k00J04j63J64J26L0k30K66J27l01L48m49L9M6k7K48l43K3R5j18N0j29
5960b09J35L3J5J71j96Q5j8J77j85L4pp4p4K3K78ql51j68L73k57J96qJ8J7J00
5985A00j51K1j24K04O0Q1l03J99J25k21n5k18L43n1l3J9j32K54k14K98j80l4L5
$$ y = [-202, -80, -92, 124, 72, -248, -109, -10, 75, 110, 19, 354, 71, 174, 93, -160, 256, 59, 73, -223, 40, -61, 208, -38, -137, -64, -62, -164, 103, -40, -47, 334, 53, 366, 103, -17, -103, 75, -320, 29, -34, -165, -57, 34, -164, 154, -61, 16, -80, 70, -131, 56, -39, -29, -277, 106, -22, -170, 198, -15, 176, 116, -160, 120, -62, -26, -151, -167, -120, -274, 19, -4, 95, 211, -136, -10, 121, 60, 76, 116, 25, -124, 2, 224, 208, -43, 13, 39, 114, -177, -203, 338, -64, 13, 198, 91, 8, 17, 93, -16, 1, 124, 87, -157, 199, 67, -143, 74, 158, -45, -35, -166, 81, 107, -61, 172, 208, 69, 85, -115, -11, -174, -10, 116, 146, -84, 182, 309, 8, 356, -93, -54, -8, -35, 213, -130, -107, -12, -130, -80, -209, -74, -41, -26, 145, -51, 34, 16, 193, 8, 42, 35, -39, -113, -90, 188, 180, -171, -339, 34, -223, -27, -35, -17, 0, 100, -51, -30, -154, 50, 110, 191, -112, 87, 212, -9, -64, -282, 61, 10, -23, -4, -136, 118, -96, 202, 22, -12, 23]
6008B3k5q7Q2Rj64K7J15r7J07L7j3J66j98J50l39L36k77r6J93lL8rj18kM3L01
6034A99J41j81j52J60o8J71l79K22K2R4j57m3J1k54J01L59l18q5J35M0R4j02J09
6057A19j21O3l69L23j16J08K7o1kj1J66R4l27L05k75L01j95l9J38j63J23j85j1
6080a08J17j38R4j23K07N6M0k8l53pK11K97j73J68k73J17J34k27O8k24K53R9l08
6103a01r5K19M3k26m9L56j67J24k01J52n4o7oK85j02j52J09n1J0j10K73l38K76
6126A28m41K66Q7n5l5K47j75p9J61j13J1P9k33K93J20k08J19l40K16R3N1r5j03
6149fk0m9J83K1k88J50M1l8l5J68k73N65p06L46j34j04Q5P6L2Q4j27m0J95l31
6173b05K5J38J98j3k17j22K31j6j2J44k8Kk46Q2j05L80m01L32k31K19l36J94R
$$ y = [23, -2, -89, -7, 2, -162, -135, -20, -117, -10, 27, 14, 180, -18, 132, -207, 129, -148, -244, -51, -54, -16, -25, -143, -145, -102, 199, 340, 159, 7, 167, 99, 270, -109, 113, 135, 229, 72, 29, 40, -214, -113, 246, -72, -157, -22, 18, 112, 10, 119, -2, 61, -308, 15, -101, 7, 34, -27, -29, -40, 126, 220, -107, 198, -77, 224, 29, -10, 128, -35, 88, -97, -108, 9, -129, -35, -158, 49, 105, 145, 117, -236, -243, -32, 265, 92, 260, -13, 104, 238, 11, 79, -145, 108, 207, -101, -196, 23, 66, -160, -209, 147, -20, 104, -97, 55, 1, -66, -72, 213, 111, -41, 68, 17, 27, -83, 190, -148, 128, -313, -47, 40, -15, -50, 197, 22, -57, 104, -9, 2, 81, -152, 141, 261, 53, 172, -168, 48, 141, 192, 97, -6, -26, -75, 108, 129, -159, -9, 32, -6, -41, 127, -146, 419, -287, 59, -75, -179, -94, -18, 14, 98, -29, -69, 126, -205, -180, -42, 156, 143, -74, -196, 35, 19, 7, 151, 123, 125, -121, -39, -144, 236, -165, 167, -64, 155, -181, 13, 22]
6196B2j17J19M3j08K25j92Q9nk63L73k03l1j42L38j32K6n1K24j16j82J56j19j05
6219a51J41MJ62o7j11k1J6j5j43L56J34l87LJ96J11l03L2K18j11o1J47j03m1q2
6243g6N9MQ4o1q1j73M26o7l29R8J97j00K66l75R2K12j10j70K01kJ57k20j13J33
6267E2Q9l41N5J06J32J12o1p5m1j61K1J29j16qQ3J57j74L6L6p5%L6j68J82j8K6
6293A4K4J18j91K62j53o1n7K6p4K56k8J21k94J1L5m7j3K67l46M16k39j7k0J93
6317B03j21k92J11l1J82k26K10j1k28L61k2k55K03J2r2j64J44J37j24K45q8L8
6339A92j74J07o1o5J20P2p8k46J96l2k80K98o8K1o1M1q2N1J18J04j91k2j3L09
6363B56k27j58L05o9k35N2J13n7n9J41j09O4l4q5O4L7L76k87Pk34J75Q8j12k69
$$ y = [22, -95, 24, 67, -41, 184, -8, 81, 76, -187, 186, -17, -48, -190, 148, 16, 42, -9, 215, 99, -83, 73, -46, -151, -10, -6, 156, 89, -22, -43, -27, -42, -185, 171, 305, -82, -79, 117, 228, -75, -43, 175, 64, 3, 150, 47, 6, -76, -17, -13, 71, 10, -71, -244, 182, 115, -214, -116, 81, -19, 247, -128, -36, 176, 66, -104, 97, 95, 252, 32, -81, 52, 141, -200, -145, -39, 93, 205, 144, 69, 28, -133, -112, 17, -99, -107, -24, 133, -41, -5, 31, -44, -44, -8, -176, 6, -12, 14, 38, 156, -35, 227, 74, 13, -44, -18, -92, 164, 136, 257, -37, -26, 9, -38, -51, 216, -130, 286, 47, 30, 10, 203, 82, -210, -99, -130, 52, -174, 36, 25, -203, 158, 136, -119, 84, 96, 4, -160, -16, 121, -3, 242, 154, 192, 18, 125, 64, -1, 119, 191, 113, -133, 63, 31, -249, 49, -19, 2, -59, -18, -100, -49, 69, 173, -18, -40, -53, 256, 29, -129, 176, 107, -128, -76, 37, -20, -79, 62, -47, 17, -17, -102, -38, -1, 375, 88, 95, -139, 36, 124, 12, -257]
6387b57K63j16O6k0k83J49L31j82N3M0J64j92n8N7j63P7K3k6J87J0k53J99k2L2
6411G9P6k20J97j88k0M2K67l78K1K51k21L47m36L4N2j42L66k01M31n85J98O5o3
6434b8l6J99j30k49K99Q7j18q5O0K93j27m67L49k1j01M6j43j02J02j2K26M0J8
6457A00l12K14l3J57j64j11J14j02j56N02k40O4k13K77J01P6j77P3O4l30K07J16
6479B27j17j55J86l87J98nJ52j01lO2k41K11p4J41l13L06P5k10j21K84Q0k44J3
6502c6L8J7J3k13J54J53n3j91J83j45J31O3lj61J74j65k35M91j61J73k71j49J65
6525b8p0K85k20O7J58j59PN3Pj07n6m9J13j15K60k19j1M28l25n3p5M4P1j09N5
6550d8J72j37K4J66j23j64N9J22J1L9p1PJ42n00K64j05J71J3j11J28J21P3k30
$$ y = [-257, 6, -110, -44, -64, -347, -198, 133, -49, 4, 44, 208, 16, -42, 15, -148, -71, -48, -74, 113, 123, -130, 69, 47, 79, 155, -65, 132, -56, -76, -34, 233, -145, -124, 127, -94, 253, -183, -149, -97, -239, 127, -74, 357, -228, -30, 35, -28, -64, 135, 5, -244, 55, 142, 24, -61, -1, 292, 165, -302, 47, 26, -75, -29, -172, -274, -172, -184, 42, 82, 100, -212, 2, -31, 126, -38, -149, -35, -137, -293, 209, -31, 33, -180, 97, 198, 274, 97, 170, 234, -96, 111, 227, 110, -45, 141, -246, -48, -53, 99, -2, -5, 57, -184, 27, -47, 94, -219, 87, 162, -48, -169, 115, 195, -49, -36, 2, 19, 32, -181, -27, 126, 73, -118, 65, -80, 51, 114, 111, -50, 124, -41, -276, 215, 54, 227, -44, -193, -28, -98, 187, -33, 34, 192, 33, 40, 93, 100, -7, -63, -112, 1, -114, 146, -73, -84, 344, 19, -34, -109, -65, 6, -103, -48, 124, -13, 11, 177, 54, -110, -51, 71, 82, 121, 50, 57, 199, -301, -37, -142, 29, 42, -69, 59, 180, 253, 23]
6573B3k13K21pJ35j1j96o5K01R4k73j26J57O5R5l4o2J62j50R1l98J31K38j73M6
6597d9o6KJ81O4k02j7rK10l2k43Q7J58J55j73O1jm1N3j93j03N0q0J38q8K38K4
6623A24j42j00J08j97%K74k37J62j85O4K00m5k08L6Q5L5l8M1L8l41L63Q3k91P5
6647i6J90m05L95l26J69K9J10Q7Pj29k02K54K0j12K4L4M3k4J95k52l13J98m0J11
6671c3n8K38l28K49K2k07L13J4k22o6J72k96M24k59o5J48J90l48J24L8K1j03l
6694c5o2R8mL1J65r0nK31j92j32L5K1p9R5j13J2Q5j41J27j41K30j09n1j75K46
6719D7J16k14M0lj90J62K2J44o2j97L34k20r9K58l05J28Jl4J07k5K1o1k01K31
6743@N4O4j46N6j00P1r2K20j91j05K36l8j01l6j9K91l70mK90k47J75l8k46M03
$$ y = [23, -190, 31, 24, 159, 148, -48, -113, 88, 182, -91, -217, -60, 5, 100, 66, 4, 166, 16, 107, -291, -160, 78, -95, -49, -115, -113, 68, 132, -70, -87, -96, 114, 82, -161, -74, 84, 239, 66, 127, 126, 85, 138, -55, -158, -108, -188, -50, -138, 100, 124, -18, -118, -10, -207, -207, 67, -170, -8, -193, -129, 71, 26, -182, -146, -61, -26, -64, -23, 15, -326, 37, 120, -171, -96, 94, -311, 84, -242, -73, -44, 66, 153, 160, 31, -171, 83, 103, -9, 15, 49, 92, 68, 263, 11, -302, -104, -144, -33, -91, 147, -181, 68, 90, -117, 196, 210, -12, -78, 94, -202, 222, -37, -102, 46, 236, -112, 12, 50, 71, -32, -35, -97, 1, -3, 28, 193, 103, 98, 329, 137, 5, 40, 61, -18, 77, -36, -24, 61, -80, 47, -94, 136, 27, -24, -199, 47, 163, -51, -11, -14, -204, -42, -20, 124, 62, -135, 199, -21, -120, 138, -167, -39, -38, -72, 35, 10, 31, -30, -231, 0, 54, 118, -28, 28, -72, -1, -93, 127, -64, -169, 67, 29, -72, -108, -127, 164, -206, -210, 80, -167, 8, -30, -276, 127]
6767A27j23l7Q4L6j4k25L65k31OJ15J4l24M59j31J6k9k72K48j49J41K06k40L4
6790G6j03J64qm6L9J07k45R4k09J20K8loj2L5j55J88j09J14n0k1K5p8l1k52K43
6816i5l3P3j89L04j94K24l5k28N2J35k1o2L8O8j6j32ll7P1J9J87j78J47r9j22
6841a26J29k3j55M47l78J5K70K4j63k40J44K62r1j59o8K69o4l7j59K22j17mM0
6864C8Q0j68j03j4r7L7P9Q1J43l19K26J5k84M12j93J76Q1k14j10K26l6j20J40
6887G6J12l44N9R3J15l68L07k02P2K99l35O4n1K41k27J94k38N0j29L33j98J29
6909E2p1M7J19k88J98j06O6O9j35o7j79J52K44k86L07j74M4P8j03j0j53K97j00
6932Ao3N0M0k41K87n1j09K65P8k01j3j3j43J58M3k48J30n4J68l55L38jL7o6M3
$$ y = [127, 4, -33, 51, 87, 73, -152, 213, -18, -12, 103, 117, -207, 252, 121, 137, 108, -164, 84, -65, 76, 282, 42, 76, -27, 137, 129, 83, 122, 229, -16, 78, -131, -11, 17, 14, 8, -4, 31, -124, 64, -45, 69, 19, -2, 23, -55, -86, -338, -95, -128, -55, -244, 60, -134, 90, 55, -173, -121, 14, -7, -69, -31, 37, 21, -111, -114, -151, -80, -61, 126, -52, 95, -4, -126, 3, -20, -175, 272, -106, -91, 179, 203, 40, -200, -56, 206, 115, -44, -112, 157, 93, 56, -103, 119, 2, -2, 38, 118, -50, -153, -167, -264, -227, -148, -67, 76, -243, -17, -2, -286, 126, -67, 109, 190, -24, -134, 92, 56, -64, 76, 188, -156, -97, -4, 111, -257, 50, -152, -80, 219, -116, -52, -103, 138, -89, 105, -133, -83, -212, 121, -77, 52, -19, 28, 147, -141, 57, -49, 17, 86, -49, -116, -295, -143, 101, -185, 122, -52, -8, 70, -33, -43, -196, 101, 1, -62, -12, 28, -213, 74, 23, -86, 179, 257, 56, 43, 30, -113, 45, 88, -160, -30, -84, 84, -271, 67, 66, 103, 37, 80]
6957H0K07l23J8l9j4J42k41k0L30j18k09L7K33K6k7r4J84P3k48m6J16l72J41n1
6981b15M27k04l4L31m17K6J90K27j66k73L03j00k2n7n1Kj71L92l68J70k9J36j65
7004f8J38j11j62K08J94k8j91K65k56jq0J74j29n2J52L4j48J92p7j50N1J09o2
7027Bj74J3K02k41L15l08O9P5Q2J48k58K02j28p5R3j77L4K1J61p1j31K9O6L9J47
7052A35l4K37k67j28kj45L58J2J5l4k54L7P8r8O7j97J89O6j17P0J8k00K98k3j62
7077h1K8K37k23J42j41o0J12RR7j98J99K41m88N7M0j4J66l64L68q3l09J86J75
7100I6M5j19K9q8O6k47J27J05J07k2j55K4J13j79J2mJ64j99L31Kl12J14Q3k14
7124a21K10qJ6l9m0m7N7q6j23k7J65j11K8R3k4j37k3Q5J21j25p9K80k72K2K74
$$ y = [80, 287, -36, -18, -57, -71, 71, -170, -190, 140, 22, -187, -150, 83, 109, 82, -12, 172, 245, -3, -49, 67, -305, -164, -215, 212, 8, -26, 305, -112, -86, 104, 331, 165, -108, 195, 95, 73, 16, -35, -33, -204, 188, -180, -10, -39, 97, -68, 70, -41, -203, 5, 199, 171, -20, 245, -11, -12, -92, 82, -47, -99, 53, 87, -61, 131, 54, -96, -45, 64, 2, -172, -159, 43, -198, 117, -191, -122, -47, 35, 183, -75, 127, -1, -76, 17, -160, -126, -105, 56, -15, -146, -117, -51, -12, 135, 101, 338, 71, -57, -59, -204, 154, 166, 181, 147, -107, -70, 8, -90, -23, -220, -31, 35, -82, -12, 6, -194, 104, 81, -81, -53, 184, -39, 103, -38, -98, 14, 23, 120, -78, 121, 362, -126, -69, -29, -43, 123, -241, 127, 44, -265, -79, 96, 141, 22, 51, -37, 29, -218, -91, 14, 121, 99, -56, -32, 81, -98, -86, -90, 74, -125, 206, 208, -104, 10, 93, -121, 89, 81, 97, 58, 18, -29, 28, -58, -181, -208, -43, -154, -126, -33, -57, -194, -217, -132, -11, -136, -215, 65, -207, -185, 89]
7149H9jm65J99J94J2j73K75p8m0J45l91J72J04p9J93j66O8j39p3L15kk26J11j23
7173g9l3R9r5l6L7J60j62NK6j9k41K56J18j20J98m7J41k45pJ59o4j6p3k19K45
7198a2R1o7l6j87L37j00j83J95J14k65J37j52J42J76j77o3j03M64j08r4q8J31
7220A52l02K93j96J11j65N0L45o5l79J35j00L8J27r2J55nL4l9k98R0PJ14J55j21
7244D4k82L14N0l19j04K40R8%K21m03j45O26m45J58J40j43q3O5J5k54P4O5J17
7267D9N0Lk01JJ06J24j55l7r2K13j69J7j83J46J01j2J81j95J35P9l44L49k24k20
7291b78J33L47k01j21J28qj65K64k20L07j84l7k8K83j93K0%nL0o4J74j31M1j68
7315g6K50n2k9r2Q4no7j04M29k91k64K80k61M27l91L85j77j1O7k91J38K60p1j64
$$ y = [89, 88, -377, -178, 16, 28, -145, 130, 52, 12, 157, -234, -62, 42, -37, 156, -10, 58, -81, -154, 161, 159, -67, 44, -79, -112, -13, -108, -144, -107, 53, -109, -104, -78, -97, -338, -82, 36, -84, 114, 67, 208, -37, -44, 115, 51, 35, -38, -257, -12, 79, 12, -24, -211, 126, 26, -157, 38, 152, -113, 24, -128, 14, 190, 13, -50, -153, 311, 203, 109, 21, 152, -150, 143, -53, 58, -107, -57, 288, 223, -156, -21, -121, -83, 44, -48, 107, 102, 136, 97, -201, -111, -104, 10, 165, 44, -238, 76, 126, -193, -297, -57, 41, 41, 262, -141, -286, 340, -105, 53, 193, 50, -33, 32, 47, -207, -133, -68, 49, 99, 102, -99, -98, 8, 132, -23, -60, -152, 61, -108, -91, -274, -128, -27, -39, 142, -53, 82, 161, -183, 166, -58, -278, -145, 202, 1, -120, 8, 0, -165, 99, -121, 186, 2, -35, -63, 220, 27, 47, 47, 42, 72, 8, 182, 51, 92, -76, 174, 122, 93, 1, 85, 80, 13, -91, 338, 47, -217, 63, -198, 229, -162, 223, 46, 35, 102, -189, -51, 209, 138, -26]
7339b6R4j29r0K58o6k82J97L3k40L84k44L15m42K20J2j83M84k47R4j40J1J10q3
7362D0k70L17j69K28j21o1l2n3j7R5J14j51L03n69R3L43k72K76j21K12P9k75j63
7385a74J00qJ18K6%J0rj29O8Q7n3J68l8m32J11J13J83k4%Q9j11m1j05n1J36j06
7411g2J32k73J74K58k71K54k72n4J82P3J8j95J62r7k2N2j26K66n4j24OJ95k17
7434ej5r7J26J06O6j19j76J68j99J08m5j21J68K33j30k87M7R3Q1J15Nk66K51j84
7458g7J80J46j95n2j07J18j7j95J77J86j04K6j51L6o3j69J57J67N6Lj30j08K57
7481A41j76j31K24J10j31k17K82j61R0R2l2j00K67l26qqj71K52m1N3k8L6J28K9
7505A74k99L7J93n2q4K2K09j71p7K23l16M52k30j86J92j51K74j89K0p5r3K6J90
$$ y = [-26, 68, -61, -151, 107, 41, -241, -44, -11, -251, 133, -111, 204, -238, -18, -6, -189, 295, 48, 142, 2, 13, 123, 40, -230, 87, -82, 146, 25, -36, -68, -121, -138, -43, 71, -80, 223, -346, -253, 90, -182, 94, -27, 185, 264, -11, -174, -74, -82, 36, 62, 62, 72, 63, -66, 2, 89, 36, 204, 166, -266, -155, -42, 141, 117, 117, 206, 95, 54, -51, -102, 34, -72, 60, -213, -39, 219, -52, 202, -70, -124, 58, 131, 149, -46, 116, 19, -3, 49, -77, 189, 135, 11, 17, 212, -5, -20, -117, 9, 115, 181, 62, -114, 54, -145, -37, -82, -203, -35, 198, 68, -219, -172, -79, 2, 117, 122, -144, 107, -77, 103, 249, 54, 2, -105, 13, -4, -199, -22, 164, 60, 86, -65, -29, -92, -261, -104, 63, 119, 122, -8, -116, 141, -35, -166, 58, 168, 37, -180, 102, -59, 31, 123, 91, -9, 258, -68, -76, -84, -255, -3, -44, 9, -19, 17, 145, 174, -125, -88, 105, 53, -31, -9, 200, 29, -48, 175, -141, 311, 81, -105, 87, -64, 210, 21, 41, -34, -127, -101, 89]
7528H9R9k51r5J64L5K6k20Q6R0l34J94J61M1q4k3R6L8j39j41K50k89J63N0m5k3
7553f2P1o5J25J31l21J89Q4q5J10r1j18M5Mo1j15L19j45m9L6j24l5J2Q7J39K06
7578B87l58L47l26p3m3L62m8l43PJ18J10j93L35l4j31J9k53N70n66K80N2j04m7
7601c2q8K79j01K0n7J8j68Ol1J4L75m05K55J19k65L61j75k7j50l3K9J52j01M6
7625D1k12M90m83M10j45lJ9L2j29j2J89k43ml4J87J93m39K90l14L28O3l19J63
7648F8j27j16L53j87pR4j99J40K89k54J63k81J9k06K32pn7N9N6J75k55K74l23
7671i7M8O9O4M8k17J54K1j96J03P2J15L2Nl55J75Q6j33j09l4J63L6J11N6k62J39
7696I4m9lJ5P8J42j79Q3k02J89M8l02N2J98j64M2R5j89J18p3L7K14j47j89K83
$$ y = [89, 188, -63, -158, 6, 41, 67, -153, -67, 23, -311, -117, 44, 85, 1, -22, 74, 112, -27, -168, 82, -207, -44, 6, -39, -62, 9, -56, 69, 200, -121, 68, 152, 67, 177, 86, -32, 13, 17, -44, -159, 160, 15, -34, 2, -122, -157, -145, -58, 81, 287, -71, 276, -50, -123, -166, 196, 148, -195, -188, -70, 40, -153, 182, 148, 17, 36, -217, 353, -213, 67, 119, 15, -32, -120, 159, 58, 78, 21, 39, -129, -123, -154, -140, 235, -170, 85, 204, -61, 300, 125, 98, -52, -85, -56, 96, -5, 41, -171, 319, -164, 246, 101, 98, 117, 149, 20, 8, 197, -46, -50, -84, 103, 296, -143, 147, -167, 161, 224, -95, 68, -59, -175, 178, -9, -16, 78, -121, 19, 308, 54, 217, -64, -45, -251, -19, -26, -83, -24, 32, 207, -48, 226, -97, -49, 20, 84, 132, -85, 69, 90, -106, -3, 69, 184, 216, 221, -134, 41, 127, -6, -115, -149, 14, 50, 161, 217, -45, 94, 45, 42, 57, 135, 277, 98, 181, -21, 168, 216, -86, -34, 164, 0, 42, 137, -52, 66, -7, 30, 244, 97, -92, 191]
7720A91l59j0J42j20K51r6k99L18L4K4L5j51k9J35N8j85K25j85L8P9k04P3j45
7743a80J55rj56N9j24RJ06J06J23o5j03O4jP3l4Q2k28J1l4K64j58O8o7J01p6k
7769a6P1Lk15N3R0J64r0r7Q5N7j25J19j05j07M69n18K73p4N8j86Q1J3RJ09J66
7794B87m57K39J62r0k56Q9O4jJ56k90J05J45j37Q5j77J93l96K09l1K23j4J31l23
7817h4K00j80O1o4m8K42k0l12p0M88N3k90K13j16j90N4Q1k6p1J05j32j0J55J17
7841A56j9K3J11j69k9J06j96rj95J10J15r7J89O3M7k14J67o1j04L6j08J23j11
7864f6M0J21K89m75J73q1m1L33j97QM1l27nJ40k04N02j92k7j0j04L6q4K0L10j17
7889H3K19l51j25K03O2O0k64j35J94J27o3R3q7K4j19K09l35N0M2O9j22K05l5p
$$ y = [191, -168, -178, -36, -156, 95, -1, -300, 18, 52, 76, 111, -40, -69, 66, 124, -61, 164, -21, 17, 96, -108, -35, -180, -25, -34, -190, -131, -255, -246, -140, -34, 89, 24, -79, -15, -16, 57, 23, 105, -123, -112, -146, 118, -40, 28, -39, 62, -14, -16, 55, 58, -157, -104, -14, 150, 60, -37, 48, 105, -20, 99, -6, -113, 356, -162, 111, 37, 95, -91, -10, 3, 12, 121, 287, -170, 69, 231, 141, -115, -26, 38, 37, 193, -97, 8, 153, 16, 101, -76, 117, -279, -70, -101, 122, 108, 239, -84, 116, -64, -3, -67, -115, 127, 107, -205, -275, 213, 266, -24, 189, 73, -117, -63, 18, -8, -79, 26, -106, -116, 39, 156, 137, 160, 271, 102, 73, 179, -17, -26, -221, -111, 4, -93, 96, 159, 206, -8, 159, 98, -6, 30, -78, 45, -66, -26, 95, 384, -91, 82, 1, -40, 293, 96, 104, 145, -182, -187, -47, -251, 251, 59, 32, 22, -82, -46, -130, -110, 200, 83, 302, -49, -174, 29, 91, 151, -113, -248, -54, 73, 10, 103, 16, 40, -79, 130, -205, -155, -113, -44, -166, 39, 4, -3]
7913cj8P6k21J53J86j68J82k30m6J69l2j00j77L92p4m5J38l38K35j02%R1j81J87
7937G4k62J64M7r9J85k08M9L3Q4k47L87rk23J91r6q4l19J61K19Op2N0m8r6J41
7962B8m7j6L39k27k15K81k19J13L0O7j15o0lk40N21l66P5K12j67J13k11q8L36
7985A41Jo0m5L1K5j81K21j17K18k29r4J0k76J94M99k60o1j62k8J88J49j5K6j13
8009F2J0Rn9P6n1m8k0Q6oJ6j09J40M9L5l26N9M9p1M9K5j08Q6K56M0q7l8j38Ml3
8038d3R6K7k32K94k65L32m45J14L84m97K56k08J22Q0j41J92k86K84k70L85l25
8059a46K02j75K61j47K8J59l6j89K74j34j9O6j73J44j22j30K08O2k77J87K4m35
8081c68K62K87l37J85j03R9L3l23L48j54o0j08L46k73K62r2q9O2l2J83j25n1M2
$$ y = [-3, -21, 55, -166, -13, 173, 5, 187, -43, -89, 80, 48, -52, -229, 163, 89, 44, 182, -156, 79, -23, -23, 68, -113, 74, -188, -24, 23, -76, 109, -99, -50, -17, 67, -180, 207, 198, -25, 166, 70, -14, -333, -172, 47, 53, -19, 31, -17, -113, 28, -19, -35, 304, 77, -138, 143, -76, 37, 67, 134, 19, -41, -44, -284, 237, -129, -54, 158, -9, 104, -107, -195, 141, 142, 82, 37, 68, 93, -88, 133, 16, 234, 5, -89, -79, -355, -161, 338, 78, 17, -145, -173, 15, 164, 149, 175, 62, 72, 81, 22, 98, 47, -1, -21, 65, 59, 75, -34, 106, 155, 190, -136, -77, -28, -99, -50, -25, -133, -47, 209, 249, 162, 124, -14, -10, -43, 53, 80, -152, 142, -123, 209, -236, -122, 262, -235, 21, -187, -65, 15, -126, 66, -220, 64, -206, 179, -146, 56, -119, 142, -5, 23, 182, 146, -43, 231, 97, 78, 144, -29, 115, -7, -137, 71, 133, -144, 43, 67, -368, -106, 181, -156, 29, -74, 25, 58, -265, 83, -71, -131, -239, 107, -166, 96, 4, -85, -23, -55, 128, 3, -48, -6]
8104fj2m3Q2P4k38K41n2r8l8K49k23op6R0J93J6k17K6P6j13J88l7p1j76J42K4
8130eJ03k47P9J6M9M8O9j67Q1j9K3P1j60J1j50J95j0P9k7j47L45m08Q8J60j78
8155a01j40K63n8R1O1j38j08M24j84q0K24k30j64J45q2Lj88L44k30m3J13J88j08
8178Bn0j05K17no1j3k9l5L3J73k61M4N4
$$ y = [-6, -18, -61, 21, 95, -143, 98, 46, -52, -90, 159, -64, -70, -146, -56, 137, 153, -64, -38, 38, -75, 113, 76, 5, -171, -29, -5, 98, -149, -70, -54, -5, 43, 112, -55, 26, 7, 30, 101, -59, -48, -198, -3, -13, 66, 39, -108, 237, -171, -83, 77, -101, -241, 22, -36, 55, 116, -22, -130, 294, 110, 30, 254, 24, -140, 5, -77, -74, -262, 82, -148, -191, -78, 110, 2, -48, -153, 64, 59, -2, -15, -44, -79, -46, 127, -134, -90, -36]
8191c6
$$ Imaginary data points
##PAGE= N=2
##DATA TABLE= (X++(I..I)), XYDATA
0@%%%%%%%%%%%Qj6J6j6J6k4L2m0M8n6P2q7J02j19J36j55J79k08K40k72L11l55
33a88M00m51N08n72O41p16P99q89R90j100J218j349J491j643J811j997K199k421
51a269K668k942L245l583L965m399M891n463O136o935P911r128J0692j2788J5756
66H757k0301K8182m5560J48975n5999k08981K22879k5395L6492o8641j02341J42266
78F0333L0882k2183m4951j24015J54924N8260p3601k7647o8050R8919P8994j22759
90h94l2497M4182O9896k802p6806l8060Q054J00144J9342j19400j2225O2012N3685
103G4631l9939r2878K7924O0331M5465l6207j18609M0633P9828J2533k0620j07923
115g4831L0262J15199l8737o0458m2290L5823J08714l2136q3565k7156L0043R8390
$$ y = [0, 0, 0, 0, 0, 0, 0, 0, 0, 0, 0, 0, 8, -8, 8, -8, 8, -16, 16, -24, 24, -32, 40, -47, 55, -64, 72, -83, 96, -112, 128, -144, 167, -188, 212, -239, 269, -303, 338, -378, 421, -468, 522, -578, 640, -709, 782, -861, 950, -1047, 1152, -1269, 1399, -1543, 1702, -1881, 2084, -2315, 2576, -2887, 3249, -3686, 4225, -4903, 5789, -6999, 8757, -11544, 16638, -28922, 120053, 64054, -144927, 77952, 52557, 89049, 20408, -81933, 60333, 91215, 69032, 24081, -99934, 54990, 113250, 39649, 12002, -56048, 42871, 121865, -894, -33391, 10791, 80687, 77885, 1079, -36981, -28927, 71217, 90559, -28841, -41066, 20946, 74631, 34692, -58186, -30262, 30069, 75534, 39327, -79282, -38649, 41179, 53712, 33092, -74831, -44569, 70630, 31893, -28565, -70855, -35032, 73682, 41546, -42019, -69175, -39132, 59258]
127E9258k0343j04191Q445N6262M3128k3266r3545R885Q8301J9698m3004p1025
139g0397L016Q8435J3605n4926l9143J6838P5088m531p7035j3109L8989N5505
151C2335m485p7186j2605N4153L8315k2139o1624O196N7035J7918l8255n1404
163f1746K2478O4847R890n0563m5523L5261N3876p310m2965l2808M6290N3855
175D5582l4124m5238j3894M6726N4743m6353m8575P096L9824M6382m8216m9861
187d5908L2907L3674K3854m4163n4413M8955M3315l2l7894m7521M8534M6691k3234
200B4765l1489k7048M2689M7108l8201l6225l536M0966M0979m4772m1752J4875
212a1641L7665K5147m1100l5975K6514L5259O429m2795k8485L7068L7530p825
$$ y = [59258, 38915, -65276, -56831, -569, 42559, 19293, -74252, -64367, 23934, 43632, 628, -70397, -67381, 21054, 34659, -20267, -59410, -42572, 32516, 27985, -49050, -62159, -23170, 32335, 27850, -49336, -61941, -7788, 30527, 8388, -53236, -47040, 9995, 27913, -10342, -61746, -39268, 25579, 35469, -15094, -60617, -25356, 28520, 21210, -21755, -54563, -8273, 45582, 11458, -33780, -47674, -948, 53795, 7442, -41133, -34037, 5787, 52169, 3953, -45908, -13001, 20673, 44527, 364, -54049, -5094, 38221, 38189, 295, -47226, 1308, 47999, 24765, -6724, -33772, 8917, 56025, 17824, -18401, -21937, 19029, 60008, 15236, -26516, -11641, 26024, 51171, 10071, -25904, 610, 35869, 42298, -497, -28982, 8086, 45616, 37791]
224C7791m6450j8662M1626K9022j6450l9104p635M2374J8564k7753l5415L437
236a8655M9721J1841m0001k9425J1021M4524N752m1711j6972J9680L3363l396
248B5742m7162r749L4512K9708j2769m7501n235L8811J9007j7564l5159J971L9217
261A3829Q989l0487k9521J4403M3574L932l7948k5019J8318L6435k118l5244j1257
274c2114K5849K7528j5059l8948k413L5362K5243k0649l7611J789L4628J5091
286A8696k2869k7151J2302L3592K157l2625k2923K3155L7374j491l4729j8225
298c2737K2065K8753q775l0513l732K9479K0829k0889l3869L184L5657J8040k2946
311D546l0585O261L1137Q040k4528j8719J7491L0028m009l3482j6119K4536L1081
$$ y = [37791, -8659, -27321, 14305, 43327, 26877, -12227, -19862, 22512, 41076, 13323, -22092, -18655, 31066, 42907, 2906, -26519, -15498, 29026, 34778, -6933, -23905, -4225, 29138, 25742, -21420, -31169, 3343, 33051, 20282, -27219, -32454, 6357, 25364, 7800, -27359, -25388, 13829, 22818, -7669, -37190, -22787, 20787, 24719, -13229, -38248, -19930, 16505, 14387, -20857, -32114, -6265, 21263, 6204, -32744, -35157, 205, 25448, 4799, -32812, -31023, 3605, 18696, -4173, -31324, -19022, 14570, 16727, -15898, -38821, -15666, 21708, 20217, -14512, -32737, -10672, 18081, 9306, -21207, -24939, 4540, 25369, 4480, -29389, -26205, 9452, 27492, 4546, -26039, -19778, 11359, 19399, -5129, -23848, -6357, 23671, 19662, -13820, -29939, -5403, 25678]
324B5678n291l1276r631K2695K0105j3610k6749L258K9340J3086k2963k8516Q616
337a5258L2369J0088k2839k2161J0993K6153j401k5228j0511K1600K5850j0165
349A9490l2059p778K4396K3091j0764k7725p81K4404J1536j8131k2139Q781K9752
362B2073O207k6309k2368J1874K9248L356k4068j3750J4778K0946o373k6981o026
375a7393K4707J9853j3168k7351m378K4296J7094j5385k1858L654K1229P359k1399
388b740j7419J3425K2748M143k5225j8678J7851J8659k881j7362j2100J9966J7229
401A7616j5451j8781k468K2520J6319k0993j8001K944J7807J4574k0929j6975
413b1818J4781J3909K931k0439j6551K1760J9176m774k0069j2509K0486J5814
$$ y = [25678, 20387, -10889, -20520, 2175, 22280, 8670, -18079, -14821, 14519, 27605, 4642, -23874, -15258, 17111, 27199, 4360, -17801, -6808, 19345, 17944, -7284, -17795, 3805, 29655, 19490, -12569, -20347, 4049, 27140, 16376, -11349, -12130, 12274, 23810, 5679, -16460, -7679, 22073, 28280, 1971, -20397, -8523, 20725, 24081, 13, -13737, 1041, 21987, 15614, -11367, -17393, 7314, 27167, 13999, -13352, -17730, 6566, 23660, 8275, -13583, -9929, 11300, 18659, -2740, -20159, -6734, 16014, 20157, -5068, -23746, -5895, 12764, 9883, -7479, -19579, 387, 17616, 2165, -16616, -19084, 3436, 19755, -1238, -19239, -16295, 1512, 16086, -4843, -21818, -7037, 6872, 9803, -10636, -27187, -5427, 13749, 8975, -11094, -23603, -3117, 12697]
425A2697j0597j5270n976K0321J5799j8651j8266M973K1306R879j8793j6553O534
438a2597K0637N339j8803j0302J0711J7210J152k4153o710J7406J4517k568k4560
451a2721p14J8773M481p54j9570m071K7339l12j1939j1456p34K8727k665j9560
465e176k106o69K1928P06k4868L756N202J4356J437k9841M813J8929M744m583
479H628k2413M354J8984J888n651j7734M152K1275j023j4352j3740J2618J9156
492A6142n878j3482j1562J2835J7453q989r259r920J2322K0683j9110j1753L389
505g129R704J8327j9683j4259J0297K922J5480j1489k0260J7728O395R74r102
518i5j7691K0470J2353j0950n029j1471J0253J7130j2392q481m48Q518J2669j5450
$$ y = [12697, 2100, -13170, -19146, 1175, 16974, -1677, -19943, -14970, 6336, 16215, -2578, -19131, -12597, 8040, 13379, -5424, -15726, -5015, 12195, 13347, -10806, -17516, -110, 14407, 11839, -12721, -13435, 5338, 9819, 9065, -10505, -14576, 12763, 12451, 512, -10944, -11678, 17049, 14384, -5176, -7282, -7951, 13977, 14683, -10185, -6429, -1227, 13129, 14566, -15275, -10462, 8467, 13211, 8628, -13785, -9431, 9553, 11441, 5790, -11944, -7792, 13483, 12460, -1892, -15632, -3014, 16142, 10264, -3218, -14780, -1945, 15508, 6519, -2740, -12660, -338, 20345, 1235, -10518, -7129, 2575, 20902, 1219, -13040, -2743, 179, 15659, 4170, -16090, 1638, 8033, 9007, -95, -17786, 2684, 15037, 4087, -942, -12413, -2160, 14970, 2578, -5903, -6351, 2167, 14836, -614]
532f14j4137J1522J0114M461r200j6758R200J3981k614p880r574R202J5914j0247
546C370j3836r88J0091J5144q787j5825N78R299J0251p666j4166N608J3248K904
560I225j3055j1033P107J4756M105j4677r334Q333Q998K156j2903n666J5145M894
574H051m015j2074o816J9303N410p462o512q101J6533N298j4978O76L79J1565
588G257N122j9916q81N514Q958P495j9276k151J1501J073K037j3618q59J6939
602I195m01n048j1500k135J7671K120o983q401p94J5232j782j1446j872M279J3483
617A1618l035j4109l442N227J4124l150j4245K236M861P560m247j4643O902R073
631D730L621m644j5820N867J1561K4k630j2348N244J3293q089n167m048N255J4298
$$ y = [-614, -14751, -3229, 6885, 11346, 2146, -14612, -5412, 8569, 5955, -1925, -11499, -2297, 13617, 3370, -10466, -11454, -1363, 13781, 4994, -10831, -10253, -954, 9297, 1631, -12535, -6927, 6321, 9225, -3830, -14863, -7756, 7000, 11105, -3572, -12906, -4573, 4425, 6581, -6322, -11988, 3157, 8051, 4036, -8038, -14854, 4449, 9859, 2397, -4115, -12216, 4317, 9615, -5363, -4687, -4308, 7257, 12379, -7537, -8418, -2904, 6054, 13549, -5727, -7878, 3623, 4696, 6733, -6885, -7744, 9195, 8794, 3746, -7754, -9889, 7782, 9902, 2919, -5482, -6276, 8956, 7174, -4272, -6144, -1865, 11618, 8583, -5526, -8968, -3741, 10383, 7233, -7012, -4776, 85, 7645, 3398, -11245, -4343, 4730, 8351, 3707, -12113, -6246, 5315, 5339, 2709, -9639, -4395, 8898, 809, -4358, -8406, -3151, 11147]
646A1147q061r128j018L405J2484o036j0396M909M072N621o719j1365Q364Q345
660E624J012o007j0408N814R813o62o600n820P565Q106n835q042j713Q726P927
675I500n659r192j030Q960N507o904o804K121Q448K684r645n812N778Q288J339
690G579r208n902O423O632m79q249l551R164M330m661p384j496R387N555p199
705I41o915P11Q080L879q010m911L786O901J312r089m614P564N948p47q089l887
721g140P895N165l295o670j574Q347L654o015n827O49Q993K842p244n310K206
736c324P891J574q043l013M303O416p17q577j792O663M959k118q123j117P253
751B235L633l152p089Q65P677R29n252n472K791Q392j30o803m320L153P356r14
$$ y = [11147, 3086, -6042, -7060, -3655, 8829, 2793, -7603, -2694, 1378, 6999, 280, -11085, -2721, 5624, 6636, 629, -9779, -3965, 5848, 5186, -1414, -7234, 331, 8437, 2602, -5440, -7153, 1573, 9500, 3841, -5351, -6381, 2579, 8086, 1182, -5622, -3501, 4947, 7631, -2014, -7826, -2048, 6240, 7579, -1629, -7531, -1108, 5524, 5045, -3204, -6755, 2409, 6739, 2078, -5306, -6802, 2585, 8140, 941, -5974, -5263, 2817, 6696, -1314, -6225, -2439, 4462, 5774, -3315, -7929, -365, 5583, 4836, -3253, -7140, 755, 5920, 2625, -4045, -5619, 2728, 6382, 367, -5460, -4811, 4182, 7024, -220, -5530, -3324, 4567, 6141, -1902, -4915, -612, 5804, 5087, -3490, -5282, 1381, 6340, 4222, -3901, -5018, 2235, 5868, 2716, -4373, -3508, 4169, 5098, -154, -5626, -2835, 5557, 5427, -1376, -5696, -2543, 4813, 3899]
767C899o892j862M401N289k521p540p2O403M171l612p637L14O999K662m217n463
783e678K071O105N40o066m132M607O632l56o776l478M075N802j472n773j224N621
799D98L348l311o026P05O875L131m941n263Q64O229J725m660l023K772N126j90
815C859o652k114M787N585j088o413k300M740L995k234m617N66N459J756m241
830A088n337J885P088J380m324n133J945N534n91m069k153L587M754k740n533
845b619j437M571N627k598o216j46L523L335l020n098K864M714J074m815n638
860e879L503N788O12l591m466K334N036j819l817j063L717M720l418n329p06M400
876B2M448k881m338M10L117K027l546l130K672M292P22n184l480L553L843Q58
$$ y = [3899, -2993, -4855, -454, 4835, 2314, -5226, -5298, 1105, 5276, 1664, -5973, -5659, 1340, 4002, -215, -5678, -3607, 2498, 3038, -3028, -7160, -2553, 4079, 3723, -3053, -6531, -2456, 3346, 1874, -3899, -5123, 498, 3846, 535, -5491, -4786, 2089, 5220, 279, -4984, -4120, 2109, 3834, -826, -3849, -1077, 4049, 3859, -2793, -4907, -120, 5465, 4377, -2036, -4336, 404, 4399, 2165, -2452, -1886, 3573, 5329, 1088, -4249, -2364, 4724, 6104, 1780, -3353, -1408, 4126, 3535, -534, -2687, 900, 5654, 2914, -2619, -4056, 515, 6142, 3544, -2672, -2818, 705, 4040, 1020, -4078, -1214, 3500, 4574, -241, -5879, -2376, 3412, 4024, 433, -4033, -1699, 3337, 1518, -2299, -3362, 355, 5075, 1657, -3672, -4378, 22, 4470, 1589, -2749, -2339, 778, 2805, -741, -3871, -1199, 3093, 3815, -1369, -4849, -1296, 2547, 3405]
892C405m531k068M012J706j991l298o64N624J978l689l860n33N605K127m268k334
908b779J335L714O10n508j746L788M209l19n559k619L936L968j322m101j269L965
924C03K915l282l858M42M189L535m246m585J443L528K068k969l576K530L041k12
940A266k823l054L685L744j178l352j687K494K958j158l156K34L200R56k437k371
956b679Q91M156N4k473j721L09M518j052l817J143P63L523r97o144K652K460J746
973C332k69o353K163M153m18j10n159J646O081k354j926l255O67P024j865l955
989e98j356J079N152j192m295r10J736M351j347m948K24K162L513j689m346L14
1005b150K242L261k400l633J735J175J794k170l355L311J319k19j129l285K838
$$ y = [3405, -1126, -3194, 818, 2524, 533, -2765, -3429, 2195, 4173, 484, -3376, -3909, 1696, 3823, -445, -2779, -1444, 2270, 2880, -2628, -4374, -586, 3623, 3304, -2255, -4874, -938, 3030, 1708, -2393, -3662, 303, 3218, -64, -3922, -3480, 709, 4244, -2, -4587, -3144, 384, 2452, -517, -4093, -1563, 1478, 1266, -1557, -4611, -926, 2818, 1640, -1712, -3399, -905, 2053, 895, -2261, -2027, 1173, 2129, -308, -2679, -1788, 2368, 2422, -51, -1772, -1463, 3055, 2003, -1814, -671, 92, 3615, 2618, -3526, -874, 1586, 3332, 3063, -3290, -1127, 3026, 2608, 2498, -2661, -1015, 5066, 2712, 786, -2469, -1802, 5222, 3357, -598, -1954, -875, 4277, 3085, -1210, -2120, -384, 3967, 2620, -2328, -2104, 58, 3571, 1882, -2464, -2150, 92, 3353, 953, -2680, -945, 230, 2024, -146, -3501, -190, 1129, 910, -219, -3504, -666]
1020f66K100j700j31j859J943K712m193m06J448J082K059l336k155K744J021J126
1036A789k097k934L571J744j582k212j392L683K690k692k657q41L030K844k142
1051H02l112M84L086J327l303k360J606L873P96l720k397Q24L748Q54l185j462
1067b139J603K107L64m249q71L559J176L29l304k096L943K53k0j585j689L974
1083A355M7k964k20l18L232J386m096l7M79J155J603l465J52K949l82l19k716
1100b159k35M062L57j284j971m61L105K04j980m04N31K855k39l595q70K378K301
1117B595m2k930j008J971J686o37k486P1K621J477j951l063N66K890J365j554
1133A571k789P27K628m85j145j864J347L323j412k419j247P71L662r76k299j52
$$ y = [-666, 1434, -266, -397, -2256, -313, 2399, -1794, -2200, -752, 330, 2389, -947, -3102, -358, 663, 1789, -308, -3242, 329, 2073, 491, -1721, -3113, 570, 3260, 568, -2089, -2930, 100, 2944, 802, -2310, -1826, 1260, 2587, -716, -3076, -1470, 2403, 3199, -521, -2918, -2094, 1654, 2508, -677, -2139, -536, 1571, 1935, -2314, -3185, 374, 1550, 1879, -1425, -3521, 422, 675, 655, -930, -2619, 1355, 1402, -1562, -1782, -2100, 1132, 2518, -1578, -1615, -1136, 19, 1622, -1843, -1691, 1258, 876, 557, -2159, -2394, 1668, 2025, 741, -1230, -1691, 1414, 1618, -362, -766, -235, 2620, 2381, -1214, -2084, 294, 2595, 2553, -377, -1385, 586, 2272, 1635, -851, -780, 1841, 3318, 1367, -1696, -1130, 1760, 3125, 1571, -1218, -491, 2137, 1652, 507, -1357, -10, 3313, 1901, -518, -1765, -994, 2668, 1692, -607, -759]
1149g59L45J945j300k198J425J329O97r62l520J303K465M26o69k821J394K102
1165A202j480r78q85J645K472j572k140o26J579K259j559j330j47J642R74j977
1181i21j369J251J670J175k608j639J455J707L18j857j025K116P96m79j548j432
1197b390K969J301j284j784n15K009J242j264j307M3K073Q91k490p75O56J852
1213A227N02k210j158J395J295L6j891o46J852J141j006j937n42K564J154j554
1229B22j472PJ810P44j675j291O98J951L65j981j118J373J643j97j880q01J469
1246a33J461m78j754m97J954J099j165j836K47K082O09j536j329P38K077L29j790
1263G8j212R86J927k06j958n29J557J277n95j958n13K097R69p97j779O4J852M16
$$ y = [-759, -414, 1531, 231, -1967, -542, 787, 1484, 522, -2998, -1695, 770, 1196, 527, -2294, -900, 1202, -278, -1256, -2141, -496, 1976, 404, -1736, -2362, -783, 1476, -83, -1413, -1560, 82, 1056, -921, -2290, -1039, 631, 1806, -802, -2441, -986, 721, 1039, -818, -1843, 273, 1069, 590, -958, -2390, 579, 1880, 596, -1188, -1703, 306, 1548, 284, -1023, -980, 1093, 1984, -506, -1281, -625, 1227, 1729, -481, -1639, -244, 1051, 1087, -804, -1450, 402, 1543, 537, -1400, -1942, 622, 1776, 222, -1250, -1243, 567, 1311, -364, -1655, -957, 994, 1359, -622, -1740, -367, 1276, 1079, -801, -1602, -133, 1328, 850, -904, -1401, 553, 1652, 487, -1349, -1102, 980, 1589, 53, -1276, -538, 1539, 1868, 78, -1134, -148, 1779, 1573, -385, -914, 643, 1920, 1325, -633, -1146, 951, 1920, 1123, -656, -592, 1260, 1676]
1281A676j170j173M58J768J96j802j160O86K113q2j936n58J120J111n67j557m03
1298a280J546J105p90j935j56J746R53j071j423J06J313O84j657o65P21J469O8
1315G34j769j393J597J663k39j618p56J624P84r44q27k44J801N41j426j089MJ567
1333A0J073j230j191Q33R86O2j358o00J239J514n24j380p21J028J622p40j397
1350g74Q4J088R03j045k075J302J802L62j048k156P40J877k17o31p28Q2K232j228
1368E70j391M8K51K448o97k531O71J39J388J40k199Q44Q53N55r63j544N02J902
1386I86K3q61j108K1J368L35j475l09J053Q36l08j358p74K104M65n86p19j013
1404a320J843N82j847L94N0J191J026k720j94J325N2J414k088n89J821m16K19
$$ y = [1676, 506, -667, -209, 1559, 1755, -47, -1207, -521, 1592, 1510, -426, -984, 136, 1247, 680, -877, -1280, 266, 1371, 581, -1354, -1510, 236, 1189, 118, -1305, -1199, 114, 798, -859, -1524, -803, 666, 734, -1035, -2428, -831, 832, 593, -1025, -1781, -157, 627, -317, -1144, -1388, 413, 954, -472, -1561, -1557, 10, 1083, -147, -1338, -505, 481, 543, -815, -1415, -176, 1338, 814, -566, -1287, -259, 1363, 623, -774, -690, 398, 1301, 256, -1819, -517, 1285, 1647, 599, -1557, -817, 1060, 843, 212, -516, -434, 1798, 570, -821, -773, -522, 1926, 1229, -1302, -631, -492, 896, 1036, -1163, -319, 534, 1089, 126, -1418, -916, 986, 1009, 148, -960, -939, 429, 764, -711, -1020, 33, 869, 561, -797, -1571, 533, 998, 412, -307, -1320, 523, 1105, -742, -348, -298, 893, 1919, -801, -995, 330, 382, 1796, -292, -881, 940, 524, 743]
1421G43q40j166K751O7j327l47j099J837J715k219k49k15P41J387k039j153J621
1438B08Q54J23r24j920J541J290o44l84j342R88J580j649m76J34J54J991j340
1455A84j773J005K67P81k60j689Q82J017o13m18r70P68J594q07j020J38j57J434
1473C63J54k128J114O46j92L46j969N78K212r14j12j008o39K850o80j421L50n93
1491a043K356k25k559J323L28P61N99k923N28J530p7M78j664n79K113p4p78l89
1509b95n38J843L77j766qL91R66M22j535p01R69N51j3r56n93J446M11j307k93
1528f29j16P79J238j759q4N04J0R69r88j360J806K0J9l41j563J740P50j079m0
1547a24q65Q30J816k288J42J31L82J616j673j349J215L10J193o11k134J579O11
$$ y = [743, -97, -1263, 1488, 1555, 228, -119, -1218, 619, 2334, 115, -134, -349, 392, 1779, -260, -1413, 208, 1062, 1185, 261, -1659, -118, 1172, 528, 144, -1198, -210, 1370, -279, -755, -621, -467, 1524, 184, -1589, -584, -317, 464, 204, -1485, -603, 414, -199, -617, -1587, -819, 775, -32, -1052, -914, -1071, 363, 517, -1611, -497, 149, -43, 303, -1666, -1088, 1124, 210, 98, -910, -1549, 1301, 621, -800, -450, -1043, 1313, 1088, -1471, -148, 180, 941, 1540, -1383, -855, 675, 598, 1076, -588, -1167, 946, 872, 94, -295, -833, 1010, 1387, -379, -387, 4, 970, 1392, -143, -844, 125, 676, 663, -293, -886, 560, 971, -336, -629, -745, 34, 1272, -487, -571, -67, -57, 912, -76, -1436, 370, 390, 409, 68, -1495, 245, 995, -84, -124, -989, -159, 1657, -631, -489, -358, 24, 1640, -33, -1382, -167, 143, 1336, 725, -1409, 170, 781]
1564G81k35l12j343J498R36r32n48m06P07J229m85j147j3N20M04j81q90J44J679
1583A406o98m32o17k89J572r8p31k65l88J114L3j353L59N97L25J86j793J41J541
1602F10m21K65j364r0J903r56l84l22O7J186K55j532n1J31P87N59j630M9J102
1621A64J36m37r53p4J474L52r40n63l32J009P96q87n48M60O84K49j206n79J246
1640E1P14m5q70p56P99Q32n64l74l49P36N01p87n14K11P20N37l81j072M06M66
1660B61L26m00n24M65O73l24m95p23N65J267p94n56J38L7Q93n64r60O71M00M58
1680H14q72j038O67P62J74o40p73Q25M42r2o40k18O54M34j10r32l02R10N89l26
1700C28q23k22P58P78o58n95L51N28L81j126l18L72R95J66r47l68M02R00m70n16
$$ y = [781, 546, 234, -1109, 389, 1325, 393, -155, -561, 146, 1375, 890, -257, -270, 250, 654, 473, -417, -273, 1406, 708, 276, -341, -630, 942, 844, 113, -152, -540, 574, 607, -746, -387, 210, 535, 721, -1072, -931, 610, 189, 454, -910, -1000, 903, -53, -437, -759, -692, 494, 749, -783, -834, -703, 84, 643, -987, -938, 164, 300, -137, -1090, -1164, 310, 662, -278, -841, -1173, -164, 632, -255, -803, -343, 341, 590, -616, -1195, 51, 765, 720, -150, -906, -107, 725, 161, -213, -562, 174, 675, -112, -626, -415, 305, 842, 461, -611, -205, 261, 587, 187, -337, 128, 801, 477, -18, -741, -176, 1091, 297, -259, -121, -84, 809, 245, -715, -44, 356, 814, -58, -1096, -429, 333, 507, -133, -906, -81, 361, 269, -371, -589, 65, 499, 389, -543, -845, 65, 654, 328, -495, -717, 41, 819, 161, -434, -83, 445, 826, -300, -618, -246, 749, 915, -32, -400, 2, 902, 432, -84]
1720h4j55R38J88k82q12j96J104L55o55p25L46O96ro88l29K70Q95j72p76n20N25
1741h6P17j31p27k86N86P40o69l95k01N55L27m78p46J38P12L8n24l35M45N76j72
1762H4n19m60M65O16k28p66k34J026K86m62p08q1R83M37n75q53L39N08M89q26
1782d79m47O15N84p6k54l39J41P78j44p20L19J02O06o29r08N07P87J36P2j110
1802d59O6Q96J90l88n12K34P02j11o22j78k1J153k30r76k3K70N05n8j029N04M97
1823D10J15j92p13q2Q86J29m20m38p6P13K7p06K10j09N84R0r90j0N99J56R8m83
1845b02o42Q28K72n20J21j78L71J027j611J23j79O08O38o47n99L24L20L31n27
1864a42n84J069L67o11j52o55R11P39o19J27m77K11M03n49o35J044r8L27m12q45
$$ y = [-84, -239, 699, 887, 605, -207, -403, 701, 1056, 401, -324, 22, 718, 709, 21, -308, -38, 857, 685, -91, -611, -86, 631, 500, -227, -513, 73, 813, 144, -251, -452, 103, 430, -48, -794, -656, 56, 94, -430, -765, -320, 256, 84, -435, -895, -430, 186, -42, -808, -1042, -16, 270, -192, -900, -981, 2, 439, -136, -989, -650, -142, 347, -479, -926, -311, 273, 197, -57, -396, -255, 523, 379, -341, -22, 80, 686, 57, -851, -344, 443, 579, 651, -459, -393, 503, 693, 305, -207, 27, 729, 618, -4, -182, -203, 950, 720, -256, -279, -9, 496, 438, -591, -87, 410, 525, 333, -380, -462, 424, 553, 133, -305, -381, 332, 359, -347, -137, -246, 338, 428, -562, -572, 27, 183, 281, -202, -844, -16, 256, -264, -143, -321, 50, 1077, -534, -411, -590, 18, 656, 9, -590, -266, 54, 385, -142, -726, 343, 710, 99, -53, -708, 203, 942, 323, 450, -27, 184, 587, 38, -597, 447, 349, 676, 264, -581]
1884e81L63O88l69M18o42J05O52q07j74J4O6J179q38n95L63j30N35j42j042J111
1904A74Q9m81N2q01O20Q24m23n84j84K66O49k21q95M34L68L06k7j101K58Q44J46
1925C13k59l91n75J217p4m94J40l67O70N79j241K0K42L43Q78j169k44L08K63J48
1945C07k62o35J048k22k26%m12O20O90j135N85m37k4P87p89J17L02k84N37o07
1965d0l75J154o47O4J22n22L69L74q45K4L49J55L70r70l95P42J38K30k40n30L73
1986a00L83n57J40m49M93O50n75k97m7M6R77m90q88O19j94N51O5j399P78N19l91
2007a66L45o30J70Q07n38J90m65k04P60j07o31M26O5J87n9m16K19lL36j62m28
2028c04K5O97o9n64K14L3M77j74n04L3K55Q2J16o92J33N37j27j96R0k46K97L58
$$ y = [-581, -218, 470, 101, 519, -123, -18, 634, -173, -347, -333, -267, 912, 74, -521, -158, -288, 247, 105, -937, 174, 263, -218, -166, -967, -347, 477, 54, -530, -714, -448, 201, -20, -915, -481, -113, 193, 166, -935, -677, 167, 313, 54, -337, -912, 305, 231, -263, -123, -490, 180, 759, -482, -462, -220, 123, 1001, -168, -412, -104, 159, 307, 45, -590, 458, 236, 10, 10, -402, 218, 908, -227, 358, -79, -103, 684, -105, 12, 314, 30, 567, -40, -415, 739, 92, 156, 278, -244, 125, 499, -346, -322, 27, 182, 552, -418, -813, -71, 67, 297, 57, -473, -100, 283, -274, -134, -583, -90, 560, -15, -312, -359, -313, 664, 174, -714, -95, -289, 262, 327, -1072, -294, 225, -166, 179, -451, -281, 526, -12, 178, -287, -491, 269, 162, -469, -43, 22, 209, 150, -266, -47, -50, 286, 124, -304, -279, 418, 349, -215, -1, 32, 509, 335, -169, -136, 119, 201, 317, -375, -242, 295, 168, -28, 62, -184, 113, 471]
2050D71o12r0L7M37R8n76r4K03O4J19n49P9O49j78l34K8q17J138Q8J49o25QK37
2073g0L05l60P6k58Q1O46o83R9L03J62J41m64k25N64l30J65k18q5N66k09j58j76
2095a28J2J46K10lj64q3L24j42j00j23k9M38j62k52J20q5K76J95l22m9j77J57
2117E9P6l79K92j99L06l30j24L47j18J59R2m79p7O98m56j87j25M91M3p9k16j00
2139c06J07J8j6R0j77J94oj54j6n1L40M5j51j02j47R9L71K29o86L58j40J09k11
2162b03K1K59L58k57l36r6L40K28k82M4k64N31j5k07j85J36L46lm17J05K26r4
2184B35M5j38P3k52K82L8k71p9M24Q0k53Q6o99L70J17j68J85QJ88O7m18k60K64
2207g6M54k01k22r4l4J14L1k5k13K24Nk16j50K85J19J21l7n29L62K9N5p6J33k79
$$ y = [471, -141, -231, -194, 243, 341, -235, -329, -126, -62, 57, -492, -413, 236, 58, -276, -248, -1065, 73, 161, 310, -315, -307, -70, 235, -125, -49, -307, -226, 420, -263, -164, 139, 301, 442, -22, -247, 317, -13, 152, -66, -151, 415, 206, 48, -128, -116, 30, 240, 237, 73, -10, 314, 172, 72, -51, -80, 358, 196, -56, 64, -21, 255, 450, 128, 79, -98, 59, 135, -244, 48, -151, 155, -175, -299, 48, -70, 89, 181, -298, -375, 323, -133, -320, -445, 46, 89, 10, -206, -306, -199, -181, -197, -107, -284, -90, -96, -250, -266, -317, 23, 68, -83, -185, -332, -233, 138, 367, -319, 39, -101, 8, -203, -182, 77, 435, 178, -158, -254, 86, 314, 32, 76, -188, 343, 328, 121, -64, 72, 418, 415, -2, 103, 329, 235, 280, 142, 215, -37, 245, 283, 12, -67, 357, 437, 184, 270, -429, -59, 58, -110, 75, 83, 271, 338, -80, -340, -76, 378, 177, -45, -139, -173, -59, -28, -53, -266, -42, -37, -253, -403, -118, 1, 122, 85, -444, -82, -53, 2, -74, 59, -220]
2231b20L04R1l40p0L19K16l19l8Rk02N01N0n80K06L7M0K90m27L2K46K46l80L1
2254D2k07K84J97l73J83q9P9o5j69K97k5l87K40j45m4K54J45l71J41k4L83l55
2276iq2k40P8L17N5k10j11L64k49l5M8l53L84p2jN7l62J97K29k33M9j37J83K80
2300A47k37l44N25j20J48j89j15J41n1J20j16j72J94K10K7l3M5K48j58p9l45R3
2322f1K13J08j3k9j40J81o4K44l09n1O7O5k33Q2r6J68j13Q3q0K46K6j01m51K42
2346a6K42l9k3l18J80L7J12k34K9R1j22K05m67K91p2j61K08OR0r1r4N6J50l18
2370b58J74J04n7k63j2L08K6k61j39K81k47M21q3O3q3j54K30K2l01J08J45K0J50
2393A94m93L11J94q2J49l01l5L16j47m0K05k05J59j69r0K22k26K1k1J96m7j53
$$ y = [-220, 84, 175, -165, -235, 84, 300, -19, -57, -48, -250, 251, 301, -279, -73, -36, 4, 294, -133, -101, 145, 391, 11, 42, -165, 119, 316, -57, 126, 37, 116, 51, -118, 179, 154, -233, 7, -138, -182, 72, 217, -154, -13, -37, 346, -9, -91, -331, -253, 64, 119, -91, -202, 162, -87, -122, -74, -427, -43, -115, -116, -59, -421, -224, 5, -228, -179, -316, -133, 147, -90, -434, 91, -29, 119, -70, -185, -44, -95, 25, -91, -263, -69, 141, 168, 135, 180, 428, 270, 191, -154, -61, 152, 260, 247, 218, 78, 259, 195, 439, 130, 79, 146, 211, -22, 60, -36, 132, 19, 102, 22, 268, 294, 193, -258, -16, 226, 187, 164, -154, 26, 63, 175, -59, -30, 61, -61, 144, -323, -32, -104, -265, -57, -51, 39, -52, -146, -90, 60, -258, -84, 20, -37, -300, -312, -4, 22, -239, -378, -97, -344, 77, -6, 57, -26, -180, 50, 72, -229, -121, 24, 44, 194, -299, 12, 206, 124, 273, -28, -63, 253, 106, 66, 271, 66, 225, 56, -34, 188, -38, -17, -38, 158, 111, -42]
2415d2j78K89J58j70J62k78J83k51J07K37o1J47j34k38j33J83q6j68M13Q0m12
2436a92q6Q0J45J96l7q8j55r0M03l98j30K35J62j74K68k83m2K41j99K07k59K86
2458I0j32J97q0q1J25K41l00l1R7j28J76M8p8j87K16k08J23j5j53L59K4n9j44
2481A00O5jl92K68j32K08p2k0j95J52J70kn36M95O6p8p2o4K8k20M42j67j67o4
2505a88K7K02K93n06J02q3K05j85j34K07K44M5m32j4o2L72j15l11K53j02RO0J33
2528B0j44j25K28j34J50n9L1k05M74j44l21L19M9j57j06P1J80J02l83R0M9J0K05
2551B00o8j76J80j26J12j6J14l62J78K17m1j32O5M9mr7j18J68j29J35l70K58j90
2574a53k4J01L34m18L06n1j03M6k24L61Lj85j52L2L9K49k17J16j93K62l23K60
$$ y = [-42, -220, 69, 227, 57, 219, -59, 124, -127, -20, 217, 156, 303, 169, -69, -202, -19, -105, -273, 140, 220, -192, -278, -198, -53, 143, 106, 18, -137, -227, 176, -222, -352, -117, 45, -129, 139, -144, -186, 55, -144, 63, -196, 90, -42, 155, 75, -6, 119, 360, 60, 29, 126, -2, 174, 222, 144, -43, 173, -35, 88, 73, -80, 279, 303, 244, 100, 165, 164, -228, 40, -92, 116, 44, 24, -171, -19, 151, 149, -387, 108, 174, 96, 24, -40, -12, -232, 210, 43, -124, -188, -161, 41, 334, -172, -70, -153, 52, -133, -267, -60, 184, 229, -203, -217, -279, 93, -22, -333, -80, -182, -173, -113, 20, -124, -249, -21, -155, -5, -64, -33, -238, 236, 92, -229, 90, 139, -18, -124, -53, 127, 229, -154, -64, -15, -5, 200, 132, -44, 136, 10, 122, 106, 220, -142, 36, 253, 212, 80, 145, 194, 190, 93, -25, 143, 14, 149, -221, 37, -153, -177, -76, 258, -160, 146, 95, -8, 38, -186, 175, 178, -7, -159, -127, -88, 161, -56, 60, -133, 129, -194, 66]
2596F6o9j76O5K24LJ0j49J33j08k9L6j10J96r5J35m2L6K8j36J67j14q3J02l02
2620b12L74p4O2K56l55P9j09J46k16J64k04L74P4k01n5j61M7k3J39j8j59M89n11
2643i4J10J70q4K7j69R6k61mK3K32j0k88Q3J79j21j00L01j37j52K41k30K45r4
2666c7o6L51n29L64M5k70J73k26K36J25k86M9j69K35q6p3LM9J56j44j08J01J49
2689D2R6k25j01r7L71j37J56J95m88J52K35j45J32n4k3N8j02j02J54j99LK5J89
2712A35o7O2J01l36j15J79JK05j08K53l99J28j55j44M73p8N8j97L8K8n4J02M2
2735A52p32M15M27j0k9j76J5j29J51L0k63l0J92Nj29O3J15j85J22j22J08j9j59
2758a88J33K68j23O4j70J48k42O1k1q3K13q2kJ11l58rL65K24j07l9r8p5K85j98
$$ y = [66, -3, -179, -114, 110, 113, 123, -26, 107, -1, -30, 6, -104, 92, -3, 132, 90, 126, 154, 18, 185, 71, -12, 90, -212, 162, 88, 150, 406, 51, 130, 21, 167, -49, 115, -89, 285, 359, 158, 103, -58, -11, -34, 105, 87, -72, 417, -94, 16, 186, 102, 129, -40, 56, -205, -209, -186, 46, 36, -252, -169, 10, -111, -211, 90, -47, -199, 42, -188, 57, -37, -103, 248, -281, 83, 128, -142, 31, -195, 41, 166, -120, -71, -240, -5, -91, -164, -161, -112, 44, -100, -208, -107, 42, 138, -87, -188, -285, 86, -51, 105, 300, -188, -36, 199, 54, 186, 132, 109, 167, 65, -37, 117, -82, -79, -54, 135, 68, 130, 231, -105, -220, -41, -40, 165, 57, 310, -89, 39, -116, -260, 213, 135, 193, -4, 34, 62, 8, 110, 152, -580, -165, 262, 252, 223, 47, 62, -67, 84, 114, -149, -179, 13, 18, -111, -48, 67, -118, 4, -118, -10, -29, -188, -55, 213, 90, 154, -16, 132, -110, -49, -70, -153, 60, -22, -24, 87, -271, -280, 85, 309, 202, 163, 65, -10, 275, 77]
2782G7q5l2K07k31P2j22j9J36r5K93l57RL94l45P4K36m85J42j54J01P6l29M17
2805b0j41j19j47J22N75l72q0mM4J07j77L4m5J1R7k6K9K3K62l19m2L7J21p8J8
2830i0R6n25L17N68k52l45Q1J28N5j46K86m25K92O4k55J36j98J35L15j36j04K92
2852B89J80l38Lm17N59o5j37l17J72J42J07k62N4J2O8J20j72K61k30K55k98J22
2874A08k86qK35oK00l96L58k18J24l04J53k6r8J26m8M0l15M73Q3j22q8L5j5J41
2898A46k03q6J33Q5j91j11j23K52K41l18J13K08k63M31k43m1p3M7k4J09j01k1
2920c3o5L55l19q6J87O4P1k16J62r2M3j55J39J27j61J00J6K5R4p7j38J80k20J36
2944A37m7k01lj49L79N6l23L4L10o4o2j10J90l72J24P7K6l11J95l6k15N00l98
$$ y = [77, -8, -40, 167, -64, 8, -114, -133, 3, -92, 201, -156, -147, 247, -98, -24, 212, -273, -131, -285, -184, -108, -437, -20, -161, -280, -427, -305, 270, -102, -182, -186, -142, -35, -212, -178, -223, -212, -115, -141, -112, -89, 173, -146, -188, -151, -30, -108, -90, 6, -519, -202, 366, 114, -231, -150, -22, 33, -113, 173, -252, 40, 104, -151, -15, -213, -78, 237, 101, -3, 289, 469, 131, 134, -283, 276, 211, 74, -243, -71, 71, 178, -84, -30, -18, 50, 170, -2, 259, 29, 284, -14, 108, -178, -186, 49, 43, 243, -153, 205, -13, 111, -193, -40, -66, -164, -38, -86, -46, -361, 112, 195, 73, -15, 20, 5, 146, -57, -143, -10, 75, -116, -227, -350, -98, 143, -175, -62, 146, -117, 314, 71, 30, -43, 4, -20, 89, -12, -33, -98, 257, -62, -148, 39, 103, 174, -42, 120, 28, 71, -84, 55, 182, 21, 121, 137, 162, 256, 179, 41, 221, 1, 137, 90, -111, -114, -263, 116, 172, -151, -117, 193, 129, 67, -43, 147, -225, -101, -24, 2, -309, -114, -150, -365, 135, -263]
2967b63J21j9K82q3r8J77k40M38n93K30j2N3K7j76j19J32K18k78Q1j60M28k1l12
2990a87NJ16N7J30M3j33J55q8M5r5kJ23j46K01r0M9j63N0N9j46L0M6J24k11N0
3015B2P4j87J22n7m3J49o3k01K73k39M41k79j9L4o8m5L5J81m06K12j05j29L76
3038G8j32q4J45J16l45K62k06O9K0j57K78J9J7K2K6k99l8J31Q6k06P6m0K82rq0
3063C1k51J82J18j60J84r0J36p2m6J62j12J66j09q6J5o8J35k8l8J93j77J60k31
3086A4LNJ07J79l86m2Q2j70J61Nr5l5J88k78J30J00O9j23M2%OJ16n9k4j07l2J09
3113c5j15P1J01j44N8P5j0j51J6J72j40J32m8j06J17j80P6L2L5j29J69l0m05J84
3137b55N54m24J88R7k68K36j5k74M73k06L6k68L66lm07J02L03j14Q4j5n17M01
$$ y = [-263, -142, -161, 121, 38, -60, 117, -123, 315, -278, -48, -60, -7, 20, -156, -275, -143, 75, -203, -122, -282, 146, 125, -187, -182, -66, -9, 121, 164, 31, 186, 98, 143, 48, 46, 169, 23, 224, 134, 183, 20, 70, 129, -17, 13, 59, 183, -28, 22, 96, -91, 31, -26, -69, 80, 17, -184, 89, -150, 291, 12, -7, 27, -41, -86, -51, 130, -276, -64, -169, -298, 78, -54, -138, 7, 123, -222, 40, -166, -97, -77, -234, 44, 63, 80, 102, 128, -171, -209, -78, 8, -198, -122, -162, 120, 111, 31, -220, -38, 80, -80, 104, 14, 150, 78, 32, 194, 82, 248, 139, 53, 68, 0, 135, 107, 69, 262, 85, 245, 14, 17, 22, 129, 308, -78, -120, -38, -208, -47, -42, -137, -172, 16, -262, -132, -32, 37, -86, -44, -44, -38, 78, 19, -5, -112, -144, -35, -150, -79, 22, -122, -64, 11, 1, -150, -134, 38, -102, 30, -18, -124, -7, -187, -111, -79, -44, -173, -4, -34, -439, -255, 299, -125, 63, 160, -108, 128, 113, -161, 312, 106, 142, -126, 240, 237, -170, -68, 235, 121, 205, 190, -327, 74]
3159G4P5j21q9L21k02R0k09N7Rl6jJ49k15k2J08N3M7j14j69K31m4o5J67l93K00
3184i9K68j56m5M2j30k6L06k51r6LL14k21r9J87%J14m77K41P0O8J81j62j64M11
3208B79l24q0J94j57p4J78K5k16J64Q4l24J46J62j63K65j70j51K88K26k37Kk24
3230a07o7J57L22j22k44K8K66l33R9J47r5J28k41J31Q0k01L36j12q9j8J69q4j02
$$ y = [74, 149, 28, -61, 260, 58, 148, -61, -4, 5, -31, -32, 117, -98, -120, -12, 41, 88, -26, -195, 36, -8, -73, 94, -299, -99, 169, 13, -32, 10, -120, -146, 160, -91, -187, -184, 130, -91, -190, -3, -3, 111, -366, -125, -55, 13, 194, 32, -132, 279, -45, -125, 69, -88, -162, 16, 41, -175, -11, 73, -251, -105, 57, -106, 159, -11, -162, 126, 352, 115, 117, -107, -174, -17, 305, 183, -61, -33, 233, -100, -1, 146, 51, 179, -62, 69, 149, -52, 284, 172, 83, 65, 234, 150, 48]
$$ [...]
8191G7
##END NTUPLES=NMR FID
##END=
