##TITLE=1H_SR8_r
 CDCl3, 8 sc, 
 26.10.2020
##JCAMPDX= 6.0         $$ Bruker NMR JCAMP-DX V2.0
##DATA TYPE= NMR FID
##DATA CLASS= NTUPLES
##ORIGIN= UXNMR, Bruker Analytische Messtechnik GmbH
##OWNER= root
$$ XWIN-NMR		Version 3.5
$$ Mon Oct 26 13:51:27 2020 Russian Standard Time (UT+4h)  she@DPX200
##.OBSERVE FREQUENCY= 200.1315066352
##.OBSERVE NUCLEUS= ^1H
##.DELAY= (6, 6)
##.ACQUISITION MODE= SIMULTANEOUS
##.ACQUISITION SCHEME= undefined
##.AVERAGES= 8
##.DIGITISER RES= 18
##SPECTROMETER/DATA SYSTEM= spect
##.PULSE SEQUENCE= zg30
##.SOLVENT NAME= CDCl3
##.SHIFT REFERENCE= (INTERNAL, CDCl3, 0, 15.7039)
##AUDIT TRAIL= $$ (NUMBER, WHEN, WHO, WHERE, WHAT)
$$ ##TITLE= Audit trail, XWIN-NMR		Version 3.5
$$ ##JCAMPDX= 5.01
$$ ##ORIGIN= Bruker BioSpin GmbH
$$ ##OWNER= she
$$ F:/spectra/data/she/nmr/H-F/1/audita.txt
$$ ##AUDIT TRAIL=  $$ (NUMBER, WHEN, WHO, WHERE, WHAT)
(   1,<2020-10-26 13:50:13.56 +0400>,<she>,<DPX200>,
      <created by zg, POWCHK disabled, PULCHK disabled
       configuration hash MD5:
       00 E9 B6 7A A2 85 ED C7 34 08 36 98 17 FE 4E 26
       data hash MD5: 16K
       7D B2 9C 6B 4F 96 A1 81 78 D4 D1 6C 8E 4B 4F 6F>)
$$ ##END=
$$ 
$$ hash MD5
$$ 50 85 97 10 53 01 F6 DB D3 20 5B 99 CD D4 F3 DD
##$RELAX= 
##$RELAX= 
##$RELAX= 
##$RELAX= 
##$RELAX= 
##$RELAX= 
$$ Bruker specific parameters
$$ --------------------------
##$DU= <F:/spectra>
##$EXPNO= 1
##$NAME= <H-F>
##$PROCNO= 1
##$TYPE= <nmr>
##$USER= <she>
##$AMP= (0..31)
100 100 100 100 100 100 100 100 100 100 100 100 100 100 100 100 100 100 
100 100 100 100 100 100 100 100 100 100 100 100 100 100 
##$AQSEQ= 0
##$AQ_mod= 1
##$AUNM= <au_zg>
##$AUTOPOS= <>
##$BF1= 200.13
##$BF2= 200.13
##$BF3= 200.13
##$BF4= 200.13
##$BF5= 200.13
##$BF6= 200.13
##$BF7= 200.13
##$BF8= 200.13
##$BYTORDA= 1
##$CFDGTYP= 0
##$CFRGTYP= 5
##$CHEMSTR= <none>
##$CNST= (0..31)
1 1 145 1 1 1 1 1 1 1 1 1 1 1 1 1 1 1 1 1 1 1 1 1 1 1 1 1 1 1 1 1 
##$CPDPRG= <>
##$CPDPRG1= <>
##$CPDPRG2= <>
##$CPDPRG3= <>
##$CPDPRG4= <mlev>
##$CPDPRG5= <mlev>
##$CPDPRG6= <mlev>
##$CPDPRG7= <mlev>
##$CPDPRG8= <mlev>
##$CPDPRGB= <>
##$CPDPRGT= <>
##$D= (0..31)
0 1.2 0 0 0 0 0 0 0 0.06 0 0.03 0 0 0 0 0.0002 0 0 0 0 0 0 0 0 0 0 0 0 
0 0 0 
##$DATE= 1603705813
##$DBL= (0..7)
120 120 120 120 120 120 120 120 
##$DBP= (0..7)
150 150 150 150 150 150 150 150 
##$DBP07= 0
##$DBPNAM0= <>
##$DBPNAM1= <>
##$DBPNAM2= <>
##$DBPNAM3= <>
##$DBPNAM4= <>
##$DBPNAM5= <>
##$DBPNAM6= <>
##$DBPNAM7= <>
##$DBPOAL= (0..7)
0.5 0.5 0.5 0.5 0.5 0.5 0.5 0.5 
##$DBPOFFS= (0..7)
0 0 0 0 0 0 0 0 
##$DE= 6
##$DECBNUC= <off>
##$DECIM= 32
##$DECNUC= <off>
##$DECSTAT= 4
##$DIGMOD= 1
##$DIGTYP= 9
##$DL= (0..7)
0 120 120 120 120 120 120 120 
##$DP= (0..7)
150 150 150 150 150 150 150 150 
##$DP07= 0
##$DPNAME0= <>
##$DPNAME1= <>
##$DPNAME2= <>
##$DPNAME3= <>
##$DPNAME4= <>
##$DPNAME5= <>
##$DPNAME6= <>
##$DPNAME7= <>
##$DPOAL= (0..7)
0.5 0.5 0.5 0.5 0.5 0.5 0.5 0.5 
##$DPOFFS= (0..7)
0 0 0 0 0 0 0 0 
##$DQDMODE= 0
##$DR= 18
##$DS= 0
##$DSLIST= <SSSSSSSSSSSSSSS>
$$ [...]
##$SUBNAM2= <"">
##$SUBNAM3= <"">
##$SUBNAM4= <"">
##$SUBNAM5= <"">
##$SUBNAM6= <"">
##$SUBNAM7= <"">
##$SUBNAM8= <"">
##$SUBNAM9= <"">
##$SW= 16.880792210976
##$SWIBOX= (0..15)
0 0 2 0 0 0 0 0 0 0 0 0 0 0 0 0 
##$SW_h= 3378.37837837838
##$TD= 16384
##$TD0= 1
##$TE= 0
##$TE2= 300
##$TE3= 300
##$TEG= 300
##$TL= (0..7)
0 120 120 120 120 120 120 120 
##$TP= (0..7)
150 150 150 150 150 150 150 150 
##$TP07= 0
##$TPNAME0= <>
##$TPNAME1= <>
##$TPNAME2= <>
##$TPNAME3= <>
##$TPNAME4= <>
##$TPNAME5= <>
##$TPNAME6= <>
##$TPNAME7= <>
##$TPOAL= (0..7)
0.5 0.5 0.5 0.5 0.5 0.5 0.5 0.5 
##$TPOFFS= (0..7)
0 0 0 0 0 0 0 0 
##$TUNHIN= 0
##$TUNHOUT= 0
##$TUNXOUT= 0
##$USERA1= <user>
##$USERA2= <user>
##$USERA3= <user>
##$USERA4= <user>
##$USERA5= <user>
##$V9= 5
##$VALIST= <valist>
##$VCLIST= <CCCCCCCCCCCCCCC>
##$VD= 0
##$VDLIST= <DDDDDDDDDDDDDDD>
##$VPLIST= <PPPPPPPPPPPPPPP>
##$VTLIST= <TTTTTTTTTTTTTTT>
##$WBST= 1024
##$WBSW= 4
##$XGAIN= (0..3)
0 0 0 0 
##$XL= 0
##$YL= 0
##$YMAX_a= 238042
##$YMIN_a= -169596
##$ZGOPTNS= <>
##$ZL1= 120
##$ZL2= 120
##$ZL3= 120
##$ZL4= 120
##$ABSF1= 10
##$ABSF2= 0
##$ABSG= 5
##$ABSL= 3
##$ALPHA= 0
##$AQORDER= 0
##$ASSFAC= 0
##$ASSFACI= 0
##$ASSFACX= 0
##$ASSWID= 0
##$AUNMP= <proc_1d>
##$AZFE= 0.1
##$AZFW= 0.1
##$BCFW= 1
##$BC_mod= 2
##$BYTORDP= 1
##$COROFFS= 0
##$CY= 11.3945322036743
##$DATMOD= 1
##$DC= 2
##$DFILT= <>
##$DTYPP= 0
##$F1P= 16.9975609425685
##$F2P= -3.02152046262296
##$FCOR= 0.5
##$FTSIZE= 0
##$FT_mod= 4
##$GAMMA= 1
##$GB= 0.15
##$INTBC= 1
##$INTSCL= 1
##$ISEN= 128
##$LB= 0.24
##$LEV0= 0
##$LPBIN= 0
##$MAXI= 10000
##$MC2= 0
##$MEAN= 0
##$ME_mod= 0
##$MI= 1.114404
##$NCOEF= 0
##$NC_proc= 0
##$NLEV= 6
##$NOISF1= 3.799351
##$NOISF2= 2.8
##$NSP= 1
##$NTH_PI= 0
##$NZP= 0
##$OFFSET= 15.70392
##$PC= 1
##$PHC0= -10689.17
##$PHC1= 10.60088
##$PH_mod= 1
##$PKNL= yes
##$PPARMOD= 0
##$PSCAL= 0
##$PSIGN= 0
##$REVERSE= no
##$SF= 200.130013532006
##$SI= 16384
##$SIGF1= 3
##$SIGF2= 2
##$SINO= 400
##$SIOLD= 16384
##$SREGLST= <1H.CDCl3>
##$SSB= 0
##$STSI= 0
##$STSR= 0
##$SW_p= 3612.71676300578
##$SYMM= 0
##$S_DEV= 0
##$TDeff= 0
##$TDoff= 0
##$TI= <>
##$TILT= no
##$TM1= 0
##$TM2= 0
##$TOPLEV= 0
##$USERP1= <user>
##$USERP2= <user>
##$USERP3= <user>
##$USERP4= <user>
##$USERP5= <user>
##$WDW= 1
##$XDIM= 8192
##$YMAX_p= 0
##$YMIN_p= 0
$$ End of Bruker specific parameters
$$ ---------------------------------
##NTUPLES= NMR FID
##VAR_NAME=  TIME,          FID/REAL,        FID/IMAG
##SYMBOL=    X,             R,               I
##VAR_TYPE=  INDEPENDENT,   DEPENDENT,       DEPENDENT
##VAR_FORM=  AFFN,          ASDF,            ASDF
##VAR_DIM=   8192,          8192,            8192
##UNITS=     SECONDS,       ARBITRARY UNITS, ARBITRARY UNITS
##FACTOR=    0.000296,      1,               1
##FIRST=     0,             0,               0
##LAST=      2.424536,      0,               0
##MIN=       0,             -169596,         0
##MAX=       2.424536,      238042,          0
$$ Real data points
##PAGE= N=1
##DATA TABLE= (X++(R..R)), XYDATA
$$ plain form
0 0 0 0 0 0 0 0 0 0 0 0 0 0 0 -8 8 -8 8 -16 16 -19 24 -30 32 -40 48 -56 64 -76 88 -102 116 -133 150 -172 194
35 194 -220 249 -281 313 -350 390 -435 484 -535 592 -656 724 -800 882 -972 1071 -1179 1299
53 1299 -1431 1577 -1742 1929 -2138 2378 -2655 2981 -3369 3843 -4432 5191 -6210 7670 -9971
68 -9971 14477 -50395 101084 -103238 -70436 41711 -169596 19451 -23054 -6041 66977
79 66977 -19258 143742 73606 -26482 106624 -556 109755 150435 14982 100964 37880
90 37880 26713 140415 72433 79765 118569 137455 101202 74900 144782 91324 115871 187806
102 187806 74673 60269 78970 78068 83381 50813 91030 30788 20265 100171 2994 40065
114 40065 79386 12356 83796 12136 -24553 49012 -21859 21188 22802 -64079 -29537 -55146
$$ packed form
0@%%%%%%%%%%%%%qJ6j6J6k4L2l5M3n4O2p2Q8j04J20j40J64j90K18k49K83l22L66
35A94m14M69n30N94o63P40q25R19j019J127j248J380j524J682j854K043k250K478
53A299k730L008l319L671m067M516n033N636o350P212q275R623j1401J3880j7641
68i971K4448o4872J51479k04322L2802J12147k11307J89047m2505J7013P3018
79F6977q6235J63000p0136j00088J33106j07180J10311M0680j35453Q5982o3084
90C7880j1167J13702o7982P332L8804J8886l6253k6302O9882n3458K4547P1935
102A87806j13133j4404J8701r02N313l2568M0217o0242j0523P9906r7177L7071
114D0065L9321o7030P1440p1660l6689P3565p0871M3047J614q6881L4542k5609
$$ plain form
126 -55146 -33938 -22158 -71515 -3337 -46898 -74112 -5034 -80420 -55046 8821 -45294 -29907
138 -29907 -58744 -88982 -44772 -58796 -37793 -29225 -70568 -42527 -45251 -59347 -28786 -28302 -1803
151 -1803 10622 -26972 -18908 -22167 -26712 24255 14504 -15351 1731 -14374 -17954 4729 3990 19697
165 19697 26844 21654 20236 -2189 13432 38523 31562 43940 26545 -1683 11146 4011 5852
178 5852 23726 9336 6536 7923 -12013 -10011 3146 6678 14205 9542 -8898 -18814 -21273 -12531
192 -12531 -5872 -17143 -17435 -28576 -47282 -32476 -36895 -37447 -12609 -27062 -31848 -30221 -47310 -26851
206 -26851 -19124 -18458 -9214 -35016 -31027 -27559 -37610 -8881 -14018 -17376 -693 -23463 -15249 -2440
220 -2440 -2723 23651 19480 15853 17736 4029 23155 29753 29744 45920 31403 27707 33825 26836 41802
$$ packed form
126e5146K1208J1780m9357O8178m3561k7214O9078p5386K5374O3867n4115J5387
138b9907k8837l0238M4210j4024K1003Q568m1343K8041k724j4096L0561M84K6499
151a803J2425l7594Q064l259m545N0967r751k9855J7082j6105l580K2683p39J5707
165A9697P147n190j418k2425J5621K5091o961J2378j7395k8228J2829p135J841
178E852J7874j4390k800J387j9936K002J3157L532P527m663j8440r916k459Q742
192a2531O659j1271k92j1141j8706J4806m419n52K4838j4453m786J627j7089K0459
206b6851P727O66R244k5802L989L468j0051K8729n137l358J6683k2770Q214J2809
220b440k83K6374m171l627J883j3707J9126O598rJ6176j4517l696O118o989J4966
$$ plain form
235 41802 52864 54678 55789 47538 45295 45101 53220 64022 60231 56995 49567 38795 37484 41605
249 41605 45380 44195 43092 34094 20159 23203 23502 24764 32644 23175 12387 4236 -3927 -2442 -2964
264 -2964 -1632 -6774 -21479 -25907 -34478 -38399 -27232 -29731 -33018 -35714 -48182 -52281 -50203 -44923
278 -44923 -41542 -44686 -48182 -58534 -64460 -58200 -55939 -50950 -44647 -49937 -55718 -56502 -53613 -45727 -34408
293 -34408 -27715 -31630 -34919 -34939 -34144 -24742 -13651 -10448 -8357 -9252 -13457 -12390 -2164 8639 15779
308 15779 20414 16370 10958 16734 24008 29553 37450 39661 34704 31108 30748 30910 37368 47922 47761
323 47761 40241 36942 33230 33864 42563 45723 42630 40028 35461 26810 24136 28222 29746 29656 26535 15449
339 15449 5816 8043 10438 10121 12057 6829 -1990 -4426 -8259 -10247 -5761 -4039 -7755 -16007 -22691
$$ packed form
235D1802J1062J814J111q251k243j94Q119J0802l791l236p428j0772j311M121
249D1605L775j185j103q998j3935L044K99J262P880r469j0788q151q163J485n22
264b964J332n142j4705m428q571l921J1167k499l287k696j2468m099K078N280
278d4923L381l144l496j0352n926O260K261M989O303n290n781p84K889P886J1319
293c4408O693l915l289k0P95R402J1091L203K091q95m205J067J0226J0803P140
308A5779M635m044n412N776P274N545P897K211m957l596l60J62O458J0554j61
323D7761p520l299l712O34Q699L160l093k602m567q651k674M086J524r0l121j1086
339A5449r633K227K395l17J936n228q819k436l833j988M486J722l716q252o684
$$ plain form
354 -22691 -25769 -25031 -16851 -17268 -23828 -21348 -28612 -32640 -22490 -23893 -21128 -13307 -20631 -25093 -25769
369 -25769 -21373 -14324 -12871 -6572 -12807 -20576 -8197 -10888 -9137 6266 551 2304 4580 -3057
383 -3057 3770 8332 16305 21605 11652 12557 9800 9890 22398 19400 21972 24932 14418 16957 15877
398 15877 12505 23869 26962 20486 13949 9634 7195 9242 17388 13487 6295 5046 579 -3810 -6350
413 -6350 -412 950 -5012 -2057 -14913 -24958 -12930 -14924 -11431 -12437 -27069 -21300 -29656 -30992
427 -30992 -17147 -31638 -21785 -16331 -36093 -27211 -34255 -30476 -10712 -25512 -17314 -21995 -36839
440 -36839 -11957 -19262 -18970 -2914 -19171 -4840 -7750 -20922 3084 -5329 3858 20014 -3467
453 -3467 4638 8811 8254 25873 16993 22750 24313 14525 31126 23438 20789 38452 33072 33389 31448
$$ packed form
354b2691l078P38Q180m17o560K480p264m028J0150j403K765P821p324m462o76
369b5769M396P049J453O299o235p769J2379k691J751J5403n715J753K276p637
383c057O827M562P973N300r953R05k757R0J2508k998K572K960j0514K539j080
398A5877l372J1364L093o476o537m315k439K047Q146l901p192j249m467m389k540
413f350N938J362n962K955j2856j0045J2028j994L493j006j4632N769q356j336
427c0992J3845j4491R853N454j9762Q882p044L779J9764j4800Q198m681j4844
440c6839K4882p305K92J6056j6257J4331k910j3172K4006q413R187J6156k3481
453c467Q105M173n57J7619q880N757J563r788J6601p688k649J7663n380L17j941
$$ plain form
468 31448 24420 28989 34687 41848 35611 29255 29187 26239 32513 27992 26491 30715 22419 26191 16173
483 16173 8700 19078 12424 21870 13109 -7386 7479 -5246 -2767 10265 -15565 -5505 -8627
496 -8627 -22625 -8919 -29157 -19619 -9096 -30211 -15320 -33868 -43725 -17246 -32196 -23947 -24414
509 -24414 -44849 -25265 -34473 -37140 -22260 -38486 -23551 -18811 -37737 -27054 -31147 -25842 -7185
522 -7185 -17892 -19183 -16897 -20949 -7233 -4896 -9323 71 -951 -238 5584 -4549 3312 16674
536 16674 11316 19693 14210 1015 21048 21618 19448 30578 16804 21966 28360 17231 26483 21234
550 21234 24402 37239 18633 19919 20073 10747 31454 25873 12357 20554 8627 10234 17884 5304
564 5304 9229 11258 5272 5560 -5804 -6871 826 -2313 1702 -4998 -19999 -9701 -10672 -16459 -5750
$$ packed form
468C1448p028M569N698P161o237o356o8k948O274m521j501M224q296L772j0018
483A6173p473J0378o654R446q761k0495J4865j2725K479J3032k5830J0060l122
496h627j3998J3706k0238R538J0523k1115J4891j8548r857K6479j4950Q249m67
509b4414k0435J9584r208k667J4880j6226J4935M740j8926J0683m093N305J8657
522g185j0707j291K286m052J3716K337m427R394j022P13N822j0133P861J3362
536A6674n358Q377n483j3195K0033N70k170J1130j3774N162O394j1129R252n249
550B1234L168J2837j8606J286J54r326K0707n581j3516Q197j1927J607P650j2580
564E304L925K029n986K88j1364j067P697l139M015o700j5001J0298r71n787J0709
$$ plain form
579 -5750 -16596 -19096 -9263 -22838 -20782 -17739 -21786 -7725 -15515 -21054 -17080 -26886 -10284 -7566
593 -7566 -18885 -5295 -15772 -14803 -735 -15903 -5068 1868 -5820 6265 -4847 -6051 6582
606 6582 1882 14403 11067 953 13505 7722 10981 20763 11185 18054 20989 13570 16774 14181
620 14181 16508 23496 21167 18758 14456 10553 15571 18695 14547 15377 13294 7360 10916 6493 2749
635 2749 10279 5437 4420 2718 -9730 -3314 -3786 -5962 478 -12562 -12682 -10497 -21055 -11642 -15569
650 -15569 -19759 -9729 -22168 -23372 -20766 -27777 -16973 -18248 -21266 -18706 -28419 -22097 -19387 -23731
664 -23731 -13199 -16687 -19350 -13482 -18852 -16848 -11096 -8840 -4677 -7034 -7421 -6434 -5681 697 4298
679 4298 4298 6523 7183 5855 8727 12264 13561 18158 18659 15766 18460 16624 18208 24747 23426 23661 23170
$$ packed form
579e750j0846k500R833j3575K056L043m047J4061p790n539L974r806J6602K718
593g566j1319J3590j0477R69J4068j5168J0835O936p688J2085j1112j204J2633
606F582m700J2521l336j0114J2552n783L259R782r578O869K935p419L204k593
620A4181K327O988k329k409m302l903N018L124m148Q30k083n934L556m423l744
635B749P530m842j017j702j2448O416m72k176O440j3040j20K185j0558R413l927
650a5569m190J0030j2439j204K606p011J0804j275l018K560r713O322K710m344
664b3731J0532l488k663N868n370K004N752K256M163k357l87R87P53O378L601
679D298%K225O60j328K872L537J297M597N01k893K694j836J584O539j321K35m91
$$ plain form
696 23170 20405 22000 21155 24577 25472 20210 23855 19917 14325 20218 17931 16650 18605 12591 9908
711 9908 7681 7899 9068 5050 5431 2458 -3944 -2494 -4944 -6879 -3658 -7010 -9848 -12409 -16065 -15201
727 -15201 -14715 -14209 -15317 -17993 -19103 -21798 -21578 -19168 -19608 -17967 -17915 -21432 -22520 -20274 -18645 -16940
743 -16940 -13884 -14032 -16997 -15120 -13530 -13156 -8432 -5360 -5782 -5851 -5428 -4121 -3036 2095 4973 3815
759 3815 5771 5511 4301 7791 10524 12217 14028 13558 12313 12038 14100 15607 17157 18591 16832 14781
775 14781 14951 14032 15002 17326 16393 14236 12471 10636 9107 10123 10640 9159 7571 5692 2364 644
791 644 1911 1506 217 -619 -3545 -7083 -6999 -7019 -7660 -7187 -8684 -11178 -13639 -14167 -13692 -13584 -12020 -12303
809 -12303 -15451 -15441 -15754 -16149 -12927 -12411 -12093 -11705 -13158 -12617 -11975 -8802 -6188 -6605 -5109 -5715 -6759 -2806
$$ packed form
696B3170k765J595q45L422Q95n262L645l938n592N893k287j281J955o014k683
711I908k227K18J169m018L81k973o402J450k450j935L221l352k838k561l656Q64
727a5201M86N06j108k676j110k695K20K410m40J641N2l517j088K246J629J705
743a6940L056j48k965J877J590L74M724L072m22o9M23J307J085N131K878j158
759C815J956k60j210L490K733J693J811m70j245k75K062J507J550J434j759k051
775A4781J70r19R70K324r33k157j765j835j529J016N17j481j588j879l328j720
791F44J267m05j289q36k926l538Q4k0o41M73j497k494k461n28M75J08J564k83
809a2303l148J0l13l95L222N16L18L88j453N41O42L173K614m17J496o06j044L953
$$ plain form
827 -2806 -1289 121 3392 3390 2637 3556 5257 6748 9319 12325 11682 10296 11851 11928 12669 16418 16994 15164
845 15164 16443 15398 12731 15975 17059 15551 17542 14987 11202 11960 11988 11874 11729 10698 8916 4534
861 4534 5430 4841 1067 4363 2734 -2591 -1068 -5451 -8130 -4213 -6647 -7849 -9119 -12966 -12930 -14564
877 -14564 -13724 -12886 -16290 -13651 -16235 -20385 -16342 -18299 -18080 -12447 -17283 -18607 -15604 -18133 -14895 -12433
893 -12433 -13379 -11158 -12328 -10774 -9207 -11270 -5250 -3634 -4972 -363 -3436 -3746 3183 2575 5408 7681
909 7681 4022 8088 8296 8429 12715 11193 14386 16029 11554 14764 13746 14006 20355 16761 15355 16805
925 16805 13111 16112 17178 14479 16379 14005 13017 13676 7973 9920 11820 8520 10243 6049 507
940 507 4073 3041 1406 2541 -2389 -2814 -3164 -6683 -5182 -7867 -8261 -4265 -11286 -11642 -11039 -16732 -8749
$$ packed form
827b806J517J410L271kp53R19J701J491K571L006o43j386J555P7P41L749N76j830
845A5164J279j045k667L244J084j508J991k555l785P58K8j14j45j031j782m382
861D534Q96n89l774L296j629n325J523m383k679L917k434j202j270l847L6j634
877a4564Q40Q38l404K639k584m150M043j957K19N633m836j324L003k529L238K462
893a2433r46K221j170J554J567k063O020J616j338M609l073l10O929o08K833K273
909G681l659M066K08J33M286j522L193J643m475L210j018K60O349l594j406J450
925A6805l694L001J066k699J900k374r88O59n703J947J900l300J723m194n542
940E07L566j032j635J135m930m25l50l519J501k685l94L996p021l56O03n693P983
$$ plain form
957 -8749 -10458 -16336 -11310 -16462 -15541 -10756 -16692 -12333 -12187 -14211 -9177 -16028 -13198 -7586 -12074 -4187
973 -4187 -6571 -12537 -3292 -6444 -4316 1613 -4074 513 2215 -834 4185 1330 4340 9859 5678
988 5678 8714 7474 4359 12661 12315 10056 13901 9679 10478 14196 10701 11520 13397 11977 14071 10356
1004 10356 7174 10623 8768 11016 11567 3319 6267 6550 1818 6832 1873 -345 4082 -2287 -2058
1019 -2058 -2698 -7580 -468 -4213 -7452 -5208 -14225 -8633 -6386 -13462 -7819 -12502 -14827 -8194 -15309
1034 -15309 -14068 -11064 -14157 -8354 -12671 -15086 -10446 -13967 -7817 -6159 -12498 -6964 -7863 -8783 -2817
1049 -2817 -5737 -4474 11 -1366 21 -1085 -380 4462 5006 6354 6999 3748 7676 10446 8572 12106
1065 12106 11618 9680 14961 12472 10001 14657 13489 15378 16215 11072 12651 11387 12829 16014 9534
$$ packed form
957h749j709n878N026n152R21M785n936M359J46k024N034o851K830N612m488P887
973d187k384n966R245l152K128N929n687M587J702l049N019k855L010N519m181
988E678L036j240l115Q302l46k259L845m222P99L718l495Q19J877j420K094l715
1004A0356l182L449j855K248N51q248K948K83m732N014m959k218M427o369K29
1019b058o40m882P112l745l239K244r017N592K247p076N643m683k325O633p115
1034a5309J241L004l093N803m317k415M640l521O150J658o339N534q99r20N966
1049b817k920J263M485j377J387j106P05M842N44J348O45l251L928K770j874L534
1065A2106m88j938N281k489k471M656j168J889Q37n143J579j264J442L185o480
$$ plain form
1080 9534 11445 11882 6304 11249 7489 4109 10084 4968 3829 3773 -2027 1652 659 -1111 -323 -6812
1096 -6812 -5081 -4567 -9306 -5788 -8621 -10829 -7440 -12109 -13682 -11902 -13512 -11121 -11611 -14147 -14285 -15137
1112 -15137 -13316 -11959 -13477 -11935 -11515 -13027 -10880 -10709 -11956 -7644 -6582 -7741 -5798 -7330 -5660
1127 -5660 -2265 -2209 -300 -96 -257 2840 1319 3584 6356 4352 8443 8525 5600 9604 8978 9661 13064
1144 13064 10605 11325 11205 10156 12984 10985 12604 13643 10092 11787 10389 7590 11338 9970 8489
1159 8489 9277 5902 5603 5389 4475 4557 3056 2303 1037 -1739 -880 -1849 -3111 -1853 -3943 -6402 -6094
1176 -6094 -7455 -8073 -6793 -7508 -8612 -9760 -10312 -10577 -10613 -9755 -9365 -10226 -9567 -10399 -11163 -9386 -8429 -8421 -6977
1195 -6977 -6863 -7750 -6503 -5211 -4649 -3030 -1683 -1658 -1460 -693 361 1187 3456 4232 3590 4655 5402 5227
$$ packed form
1080I534J911M37n578M945l760l380N975n116j139n6n800L679r93j770P88o489
1096f812J731N14m739L518k833k208L389m669j573J780j610K391m90k536j38q52
1112a5137J821J357j518J542M20j512K147J71j247M312J062j159J943j532J670
1127e660L395N6J909K04j61L097j521K265K772k004M091Q2k925M004o26O83L403
1144A3064k459P20j20j049K828j999J619J039l551J695j398k799L748j368j481
1159H489P88l375k99k14r14Q2j501p53j266k776Q59r69j262J258k090k459L08
1176f094j361o18J280p15j104j148n52k65l6Q58L90q61O59q32p64J777R57QJ444
1195f977J14q87J247J292N62J619J347K5J98P67J054Q26K269P76o42J065P47j75
$$ plain form
1213 5227 7392 8657 8115 9085 8998 8536 8921 9851 10704 10699 10485 10574 8739 9375 9719 8576 9781 9182 6669
1232 6669 6921 5730 5085 5305 4677 3954 1696 1405 346 -1500 -101 -1263 -3189 -2747 -4975 -6574 -5911
1249 -5911 -6486 -7127 -7741 -8146 -9838 -10753 -9445 -10574 -11062 -9280 -11165 -11922 -11061 -11554 -11125 -9731 -9188 -9790
1267 -9790 -9572 -8789 -9376 -7333 -5682 -6214 -4806 -3920 -4660 -3356 -1725 -542 459 1587 2164 1398 3071
1284 3071 4839 4874 7147 7353 7023 8090 8283 8694 9899 11059 11565 10387 11138 10661 9982 12107 11905 11008
1302 11008 11608 9995 9163 9448 8872 8844 8647 7700 6271 5022 4928 4016 3460 3536 2440 131 -419 -1176 -2481
1321 -2481 -2070 -2842 -4325 -4962 -6185 -7371 -7201 -7934 -7350 -8396 -9354 -9184 -11120 -9942 -9204 -11020 -8896
1338 -8896 -9551 -11540 -9447 -9965 -9219 -7740 -8437 -7335 -8192 -7518 -5513 -6754 -3770 -2394 -4318 -1715
$$ packed form
1213E227K165J265n42R70q7m62L85R30Q53nk14Q9j835O36L44j143J205n99k513
1232F669K52j191o45K20o28p23k258k91j059j846J399j162j926M42k228j599O63
1249e911n75o41o14m05j692r15J308j129m88J782j885p57Q61m93M29J394N43o02
1267i790K18P83n87K043J651n32J408Q86p40J304J631J183J001J128N77p66J673
1284C071J768L5K273K06l30J067J93M11J205J160N06j178P51m77o79K125k02q97
1302A1008O00j613q32K85n76k8j97r47j429j249r4r12n56P6j096k309n50p57j305
1321b481M11p72j483o37j223j186J70p33N84j046r58J70j936J178P38j816K124
1338h896o55j989K093n18P46J479o97J102q57O74K005j241K984J376j924K603
$$ plain form
1354 -1715 -1835 -2051 942 1262 2057 2984 2630 3604 4128 5541 6387 6291 7563 7490 6595 7532 8281 8215 9526
1373 9526 9933 7588 8689 8735 7321 9534 8360 6989 7912 6258 6279 5186 4519 6192 3464 3327 2874
1390 2874 -953 1640 1279 -1704 420 -2710 -3384 -2557 -5637 -4462 -4941 -5861 -4107 -8297 -8142 -7157 -9505
1407 -9505 -5897 -7068 -10167 -7526 -9197 -9160 -7117 -8897 -7661 -6754 -7330 -6386 -7574 -6376 -4223 -4608
1423 -4608 -3022 -3002 -4738 -1613 -423 -1329 1141 1018 851 3507 2138 2923 4803 5012 7227 6281 5226
1440 5226 7315 6474 8620 10639 6598 9115 9433 7462 10567 8226 7948 10466 8151 8773 6897 5167
1456 5167 8713 6561 6497 6878 2030 4235 4349 853 3506 1305 -515 1477 -1974 -2661 -2561 -3887
1472 -3887 -1935 -4175 -5951 -5694 -8204 -6384 -5632 -9371 -7767 -8039 -10355 -7943 -9895 -10779 -8038 -8628
$$ packed form
1354a715j20k16K993L20P95R27l54R74N24J413Q46r6J272p3q95R37P49o6J311
1373I526M07k345J101M6j414K213j174j371R23j654K1j093o67J673k728j37m53
1390B874l827K593l61k983K124l130o74Q27l080J175m79r20J754m190J55R85k348
1407i505L608j171l099K641j671L7K043j780J236R07n76R44j188J198K153l85
1423d608J586K0j736L125J190r06K470j23j67K656j369P85J880K09K215r46j055
1440E226K089q41K146K019m041K517L18j971L105k341k78K518k315O22j876j730
1456E167L546k152o4L81m848K205J14l496K653k201j820J992l451o87J00j326
1472c887J952k240j776K57k510J820P52l739J604k72k316K412j952q84K741n90
$$ plain form
1488 -8628 -8788 -9179 -10699 -8407 -7464 -7277 -5734 -8705 -6627 -4470 -6733 -3863 -3099 -4325 -734 -1865
1504 -1865 -2571 234 -474 2053 3596 1680 3912 2988 4314 6896 4912 6659 8012 6149 8580 7829
1520 7829 6295 9917 9267 8911 9431 7119 8240 8754 8400 9597 6954 6883 8068 5364 6407 6092 3613
1537 3613 6347 4368 1909 2480 645 1116 1739 -565 -821 -2398 -3019 -1910 -4658 -4301 -3827 -6416 -5056
1554 -5056 -6272 -8619 -6088 -6871 -7528 -6684 -8653 -8496 -7687 -8012 -6743 -7806 -7440 -6097 -7644 -6432 -5585
1571 -5585 -6482 -3604 -3631 -4983 -3278 -3476 -2866 -569 -399 -12 797 355 2433 2063 2771 4757 3856 4992
1589 4992 5889 4079 5989 6739 6060 8230 6678 6233 7496 6957 7744 7477 6857 7879 6483 6529 6440 4575
1607 4575 6389 6166 4204 4736 2875 2344 3012 1684 1589 519 -681 -481 -2464 -2229 -1779 -3269 -2932
$$ packed form
1488h628j60l91j520K292R43J87J543k971K078K157k263K870P64j226L591j131
1504a865p06K805p08K527J543j916K232r24J326K582j984J747J353j863K431p51
1520G829j534L622o50l56N20k312J121N14l54J197k643p1J185k704J043l15k479
1537C613K734j979k459N71j835M71O23k304k56j577o21J109k748L57M74k589J360
1554e056j216k347K531p83o57Q44j969J57Q09l25J269j063L66J343j547J212Q47
1571e585q97K878k7j352J705j98O10K297J70L87Q09m42K078l70P08J986r01J136
1589D992Q97j810J910P50o79K170j552m45J263n39P87k67o20J022j396M6q9j865
1607D575J814k23j962N32j861n31O68j328r5j070j200K00j983K35M50j490L37
$$ plain form
1624 -2932 -3898 -5797 -5391 -5565 -6098 -5746 -6267 -7377 -7740 -7603 -7612 -7479 -7018 -7217 -7505 -7273 -7500 -7578 -6610 -4948
1644 -4948 -5481 -5431 -4750 -5167 -3961 -2503 -2871 -1591 -1026 -1048 -449 147 1259 1655 2574 3568 2679 3606 4824
1663 4824 4103 6125 6748 5594 7144 7033 6806 7541 7862 8337 7810 8142 7743 6451 7669 7917 6601 7323
1681 7323 6355 5143 5421 4872 4314 4242 3867 3034 1601 1806 914 111 473 -446 -1493 -2033 -2934 -3558 -3875
1700 -3875 -3650 -4478 -5234 -5407 -6801 -6777 -6350 -7033 -6825 -6823 -7569 -8182 -7696 -7159 -7612 -6860 -6504 -7236 -6746 -6180
1720 -6180 -6473 -5245 -4191 -4436 -4131 -3670 -3383 -2910 -1239 -723 -568 269 412 292 1666 2758 2693 4285
1738 4285 4195 3872 4409 5528 5733 6000 7022 6752 6362 6583 6676 6714 7318 7265 6669 6527 6267 5461 5802 5964
1758 5964 4938 5047 4709 3352 3204 2817 2664 1963 1396 914 -759 -730 -710 -1986 -1382 -2374 -3985 -3808 -4568
$$ packed form
1624b932r66j899M06j74n33L52n21j110l63J37rJ33M61j99k88K32k27p8R68J662
1644d948n33N0O81m17J206J458l68J280N65k2N99N96J112L96R19R94q89R27J218
1663D824p21K022O23j154J550j11k27P35L21M75n27L32l99j292J218K48j316P22
1681G323r68j212K78n49n58p2l75q33j433K05q92q03L62r19j047n40r01o24l17
1700c875K25q28p56j73j394K4M27o83K08Kp46o13M86N37m53P52L56p32M90N66
1720f180k93J228J054k45L05M61K87M73J671N16J55Q37J43j20J374J092o5J592
1738D285r0l23N37J119K05K67J022k70l90K21R3L8O04n3n96j42k60q06L41J62
1758E964j026J09l38j357j48l87j53p01n67m82j673K9K0j276O04r92j611J77p60
$$ plain form
1777 -4568 -4670 -4722 -4956 -5130 -5875 -6186 -6097 -6922 -5994 -5854 -6796 -6126 -6211 -6993 -5832 -5190 -5117 -4958 -4364 -4698 -4556
1798 -4556 -3243 -3165 -2564 -1625 -1474 -1532 -846 15 82 1338 2649 1809 2768 3292 3114 4421 4493 4889 5345 5223
1818 5223 5618 5342 5898 6962 6172 6785 6837 5236 6325 6536 5486 6345 5546 4931 5084 4057 4030 3688 3388
1837 3388 3499 1802 1481 1059 -197 398 -86 -1441 -1380 -2010 -3336 -3047 -3803 -4108 -4174 -4312 -4960 -5573 -6071
1856 -6071 -5798 -6066 -6148 -5687 -7156 -6630 -5961 -7023 -6117 -5692 -6555 -5351 -5630 -5823 -4776 -4884 -3195 -3116 -3363
1875 -3363 -2212 -3198 -1422 -209 -1257 807 1076 619 2231 1883 2295 3712 3888 4617 4163 4316 5345
1892 5345 5515 6121 6743 5598 6647 6974 5794 6990 6934 6340 7255 6234 5324 5758 4837 5708 5321 3911
1910 3911 4134 2716 2830 3483 1280 1658 1632 -110 611 -590 -2268 -944 -1914 -2141 -2761 -4513 -4019 -4667
$$ packed form
1777d568j02n2k34j74p45l11Q9q25R28J40r42O70q5p82J161O42P3J59N94l34J42
1798d556J313P8O01R39J51n8O86Q61O7J256J311q40R59N24j78J307P2L96M56j22
1818E223L95k76N56J064p90O13N2j601J089K11j050Q59p99o15J53j027k7l42l00
1837C388J11j697l21m22j256N95m84j355O1o30j326K89p56l05o6j38o48o13m98
1856f071K73k68q2M61j469N26O69j062R06M25q63J204k79j93J047j08J689P9k47
1875c363J151r86J776J213j048K064K69m57J612l48M12J417J76P29m54J53J029
1892E345J70O06O22j145J049L27j180J196n6n94R15j021r10M34r21Q71l87j410
1910C911K23j418J14O53k203L78k6j742P21j201j678J324r70k27o20j752M94o48
$$ plain form
1928 -4667 -4578 -4104 -6233 -5843 -4928 -6697 -5753 -6010 -7037 -5335 -5782 -6886 -6005 -6376 -5294 -4857 -5053 -4368
1946 -4368 -5024 -4538 -2784 -3746 -2758 -1831 -2495 -1156 -981 -1784 44 1052 1045 2143 1344 1796 2909 3206
1964 3206 4030 3540 4196 5712 4193 5025 5862 4418 6439 6512 4737 5721 5119 5403 6128 5013 5533 4801
1982 4801 4167 4903 3206 3755 4145 2417 2889 2304 481 1573 608 -169 515 -1066 -1607 -2011 -2401 -1981
2000 -1981 -3253 -3486 -3249 -4542 -4572 -4160 -5632 -4612 -4529 -5670 -5223 -5582 -6012 -5014 -4973 -5014 -4832 -5128 -4298
2019 -4298 -4868 -4657 -3197 -3715 -2933 -1980 -3087 -1896 -845 -1089 400 422 -80 1452 1129 2189 2475 2776
2037 2776 4016 3452 3856 4590 3672 4920 5845 4660 5847 5346 4756 5708 5518 5593 5797 5313 5453 4652 4489
2056 4489 4856 3872 4255 3957 2596 2692 2583 1435 1879 1276 -69 -117 -481 -1263 -1630 -1887 -2240 -2896 -3322
$$ packed form
1928d667Q9M74k129L90R15j769R44k57j027J702m47j104Q81l71J082M37j96O85
1946d368o56M86J754r62R88R27o64J339J75q03J828J008pJ098p99M52J113K97
1964C206Q24m90O56J516j519Q32Q37j444K021P3j775R84o02K84P25j115N20p32
1982D801o34P36j697N49L90j728M72n85j823J092r65p77O84j581n41m04l90M20
2000a981j272k33K37j293l0M12j472J020Q3j141M47l59m30R98M1m1J82k96Q30
2019d298n70K11J460n18P82R53j107J191J051k44J489K2n02J532l23J060K86L01
2037B776J240n64M04P34r18J248R25j185J187n01n90R52j90P5K04m84J40q01j63
2056D489L67r84L83k98j361R6j09j148M44o03j345m8l64p82l67k57l53o56m26
$$ plain form
2075 -3322 -3711 -4584 -4563 -3863 -4999 -4719 -5069 -5937 -5585 -5410 -6231 -5558 -5481 -5823 -5851 -5724 -5125 -5343 -4820 -3841
2095 -3841 -4723 -3834 -3277 -3603 -2541 -1806 -1909 -1312 -883 -697 84 411 1384 1637 2115 2384 2313 2971 3998
2114 3998 3483 4481 4830 4478 4949 5021 5047 5692 5786 5748 5449 5651 5524 5220 5431 5522 4768 4785 4519 3748 3958 3582
2136 3582 2930 2913 2513 1595 1196 1099 571 194 -183 -540 -1612 -1750 -1930 -2715 -2726 -2839 -3521 -3912 -4315 -4790
2156 -4790 -4715 -4306 -4941 -5139 -5113 -5506 -5642 -5026 -4851 -5057 -4887 -4450 -5035 -4302 -3757 -3710 -3340 -2671 -2695 -2717 -2053
2177 -2053 -1940 -1339 -534 -88 -211 525 755 944 1467 2442 2417 2619 3088 3020 3481 4384 4402 4491 4779 4424 4192
2198 4192 4688 4970 4660 4954 5021 4216 4391 4226 3464 3681 3897 3054 2684 2772 2015 1941 1667 1128 470 307 -128
2219 -128 -744 -772 -1275 -2080 -1779 -2313 -2964 -3407 -3213 -3894 -3925 -3447 -4531 -4653 -4584 -4789 -4648 -4415 -4309 -4619 -4830
$$ packed form
2075c322l89q73K1P00j136K80l50q68L52J75q21O73P7l42k8J27N99k18N23R79
2095c841q82Q89N57l26J062P35j03N97M29J86P81L27R73K53M78K69p1O58J027
2114C998n15R98L49l52M71P2K6O45R4l8k99K02j27l04K11R1p54J7k66p71K10l76
2136C582o52j7m00r18l99r7n28l77l77l57j072j38j80p85j1j13o82l91m03m75
2156d790P5M09o35j98K6l93j36O16J75k06J70M37n85P33N45M7L70O69k4k2O64
2177b053J13O01Q05M46j23P36K30J89N23R75k5K02M69o8M61R03J8Q9K88l55k32
2198D192M96K82l10K94O7q05J75j65p62K17K16q43l70Q8p57p4k74n39o58j63m35
2219a28o16k8n03q05L01n34o51m43J94o81l1M78j084j22O9k05J41K33J06l10k11
$$ plain form
2240 -4830 -4403 -4670 -3873 -3610 -3899 -3347 -2984 -3064 -2680 -1870 -1770 -1254 -898 -483 -562 -41 740 876 1533 2129
2260 2129 1702 2351 3176 2573 3489 3983 4058 3894 4387 4457 4151 5072 5082 4594 5257 4844 4333 4775 4947 4254 4217
2281 4217 4195 3438 3340 3357 2644 2564 2212 1784 1044 772 425 -204 -196 -482 -1416 -1744 -1593 -2742 -2738 -2756 -3693 -3376
2303 -3376 -3929 -4379 -4593 -4533 -4172 -4867 -4829 -4617 -5242 -4807 -4588 -5055 -4588 -4325 -4805 -4377 -3894 -4008 -3470 -2986
2323 -2986 -2343 -2494 -2190 -1759 -1515 -646 1 -510 372 1184 642 1621 2140 1860 2863 3264 2868 3545 3756
2342 3756 4206 4409 4267 4780 4336 4552 5402 4445 4735 5342 4231 4860 4538 3782 3911 4010 3318 3502 2834 2876
2362 2876 2243 1910 2285 905 943 908 -409 -64 -333 -1485 -1116 -1285 -2396 -2604 -2841 -3039 -3189 -3566 -3545
2381 -3545 -4415 -4144 -3962 -4606 -4300 -3919 -4932 -4383 -3912 -4852 -4337 -3662 -4029 -3298 -3506 -3416 -3096 -3056 -1857 -2126
$$ packed form
2240d830M27k67P97K63k89N52L63q0L84Q10J00N16L56M15p9N21P81J36O57N96
2260B129m27O49Q25o03R16M94P5j64M93P0l06R21J0m88O63m13n11M42J72o93l7
2281D217k2p57r8J7p13q0l52m28p40k72l47o29Qk86r34l28J51j149Mj8r37L17
2303c376n53m50k14O0L61o95L8K12o25M35K19m67M67K63m80M28M83j14N38M84
2323b986O43j51L04M31K44Q69O47n11Q82Q12n42R79N19k80J003M01l96O77K11
2342C756M50K03j42N13m44K16Q50r57K90O07j111O29l22p56J29R9o92J84o68M2
2362B876o33l33L75j380L8l5j317L45k69j152L69j69j111k08k37j98j50l77K1
2381c545q70K71J82o44L06L81j013N49M71r40N15O75l67P31k08R0L20M0J199k69
$$ plain form
2401 -2126 -1833 -936 -1206 -646 223 -693 558 1214 792 1863 1567 1996 2772 2776 3257 3096 3245 4048 3404 3681
2421 3681 4522 3828 4528 4525 3543 4231 4373 3803 4093 3468 3476 3197 2964 3290 2418 2233 2415 1410 970 1164 -38
2442 -38 93 171 -663 -986 -1267 -2068 -1682 -1911 -2391 -2611 -3270 -2950 -3353 -3713 -3396 -4293 -3774 -3452 -4647 -4212
2462 -4212 -3851 -4329 -3570 -3803 -4101 -3457 -3510 -3061 -3260 -3052 -2171 -2161 -1814 -1217 -1713 -796 83 -431 402 803
2482 803 311 1323 1870 1952 2199 2298 3031 2807 3068 3356 3371 3660 4379 3648 3956 4432 3861 4324 4469 3961 4042
2503 4042 3832 3787 3746 3215 3331 3188 2690 2671 1738 1932 2006 978 758 757 -344 -210 -707 -1116 -1293 -1697 -2077
2524 -2077 -2323 -2575 -2618 -3568 -3305 -3092 -3832 -3942 -3679 -4482 -4122 -3896 -4594 -4308 -3729 -4276 -3901 -4027 -3680 -3453
2544 -3453 -3391 -2967 -3021 -2646 -2383 -2100 -1743 -937 -1335 -600 -321 -258 578 559 898 1402 1646 2067 2185 2559 2997
$$ packed form
2401b126K93Q97k70N60Q69r16J251O56m22J071k96M29P76MM81j61J49Q03o44K77
2421C681Q41o94P00lr82O88J42n70K90o25Qk79k33L26q72j85J82j005m40J94j202
2442c8J31P8q34l23k81q01L86k29m80k20o59L20m03l60L17q97N19L22j195M35
2462d212L61m78P59k33k98O44n3M49j99K08Q81J0L47N97m96R17Q79n14Q33M01
2482H03m92J012N47Q2K47R9P33k24K61K88J5K89P19p31L08M76n71M63J45n08Q1
2503D042k10m5m1n31J16j43m98j9r33J94P4j028k20jj101J34m97m09j77m04l80
2524b077k46k52m3r50K63K13p40j10K63q03L60K26o98K86N79n47L75j26L47K27
2544c453O2M24n4L75K63K83L57Q06l98P35K79O3Q36j9L39N04K44M21J18L74M38
$$ plain form
2565 2997 2877 3237 3581 3008 3808 4161 3763 4106 4084 3618 4140 4123 3924 3846 3797 3359 3081 3004 2927 2463 2514 2240
2587 2240 1689 1317 1387 814 674 467 -187 -293 -958 -1242 -1400 -1683 -1814 -1966 -2492 -2458 -3072 -3349 -2913 -3714
2607 -3714 -3565 -3361 -3981 -3950 -3578 -3812 -3682 -3305 -3272 -3674 -3458 -3325 -3060 -2766 -2182 -2605 -2134 -1658 -1988 -1268
2627 -1268 -823 -361 -262 100 282 383 769 1275 1489 1959 2205 2275 2437 2811 3002 3283 3315 3400 3251 3520 3590
2648 3590 3481 3636 3790 3430 3360 3524 2976 3131 2915 2560 2646 2636 1795 1844 1458 1131 882 749 370 -248 -13
2669 -13 -811 -920 -1100 -1108 -1872 -1933 -2018 -2766 -2894 -2434 -3260 -3082 -3143 -3556 -3634 -3514 -3497 -3555 -3540 -3633 -3556 -3157 -3255 -3418
2693 -3418 -3048 -2607 -2827 -2659 -1919 -1884 -1758 -1066 -1007 -923 -357 -361 -36 552 850 764 1185 1828 1534 2151 2466 2359
2715 2359 2887 3286 3229 3000 3493 3347 3660 3806 3540 3453 3725 3645 3295 3381 3587 2801 2884 2917 2502 2339 2347 1898
$$ packed form
2565B997j20L60L44n73Q00L53l98L43k2m66N22j7j99p8m9m38k78p7p7m64N1k74
2587B240n51l72P0n73j40k07o54j06o65k84j58k83j31j52n26L4o14k77M36q01
2607c714J49K04o20L1L72k34J30L77L3m02K16J33K65K94N84m23M71M76l30P20
2627a268M45M62R9L62J82J01L86N06K14M70K46P0J62L74J91K81L2Q5j49K69P0
2648C590j09J55J54l60p0J64n48J55k16l55Q6j0q41M9l86l27k49j33l79o18K35
2669a3p98j09j80qp64o1q5p48j28M60q26J78o1m13p8J20J7n8J5r3P7L99r8j63
2693c418L70M41k20J68P40L5J26O92N9Q4N66mL25N88K98q6M21O43k94O17L15j07
2715B359N28L99n7k29M93j46L13J46k66q7K72q0l50Q6K06p86Q3L3m15j63Qm49
$$ plain form
2737 1898 1472 1576 1099 641 274 229 -684 -575 -732 -1406 -1451 -1621 -2124 -2284 -2244 -2723 -2810 -2968 -3311 -3305 -3227 -3444
2759 -3444 -3717 -3518 -3454 -3908 -3386 -3182 -3790 -3458 -2856 -3340 -2850 -2486 -2598 -2145 -1703 -1702 -1445 -1042 -814 -608 -177
2780 -177 333 201 528 1111 1074 1306 1876 1540 2278 2582 2574 2716 2857 3329 3300 3465 3533 3488 3510 3869 3234 3268 3285
2803 3285 2752 2900 3139 2700 2855 2788 2055 1903 1737 1390 960 963 697 365 43 34 -440 -648 -472 -1476 -1523
2824 -1523 -1657 -2206 -2202 -2260 -2633 -2809 -2938 -2966 -3214 -3430 -3183 -3380 -3554 -2902 -3517 -3280 -2943 -3419 -2735 -2493 -2686
2845 -2686 -2445 -2021 -2145 -1797 -1299 -1074 -1429 -821 -236 -419 168 499 248 1243 1515 1104 1546 1898 1842 2219
2865 2219 2551 2699 2410 2851 2934 3134 2802 3223 3040 3004 3561 2890 2949 3168 2646 2818 2763 2163 2442 2057 1718
2886 1718 1739 1383 1263 811 455 521 -141 -44 -67 -1060 -1030 -1157 -1924 -1717 -1927 -2319 -2193 -2612 -2665 -2811 -3036 -3149
$$ packed form
2737A898m26J04m77m58l67m5r13J09j57o74m5j70n03j60M0m79q7j58l43OP8k17
2759c444k73J99O4m54N22K04o08L32O02m84M90L64j12M53M42JK57M03K28K06M31
2780a77N10j32L27N83l7K32N70l36P38L04qJ42J41M72k9J65O8m5K2L59o35L4J7
2803C285n33J48K39m39J55o7p33j52j66l47m30Lk66l32l22rm74k08J76j004m7
2824a523j34n49Mn8l73j76j29k8k48k16K47j97j74O52o15K37L37m76O84K42j93
2845b686K41M24j24L48M98K25l55O08N85j83N87L31k51R95K72m11M42L52n6L77
2865B219L32J48k89M41Q3K00l32M21j83l6N57o71N9K19n22J72n5o00K79l85l39
2886A718K1l56j20m52l56O6o62R7k3r93L0j27p67K07k10l92J26m19n3j46k25j13
$$ plain form
2908 -3149 -3228 -3401 -2640 -3397 -3073 -2659 -3050 -3183 -2567 -3093 -2742 -2371 -2305 -2175 -2068 -1606 -1426 -1563 -925 -718
2928 -718 -541 308 30 178 934 734 1295 1827 1134 2069 1878 2370 2443 2571 2803 2798 2676 3383 2846 2905 3292
2949 3292 2855 3408 3510 2694 2912 2933 2394 2474 2449 2389 1930 1938 1699 1078 1068 1112 604 318 506 -361 -525 -532 -1108
2972 -1108 -1126 -1571 -1796 -1883 -2349 -2259 -2586 -2621 -2396 -3075 -3197 -2749 -3146 -3090 -2585 -3400 -3256 -3004 -2888 -2941 -2785 -2638
2994 -2638 -2353 -2263 -1901 -1811 -1817 -1171 -1428 -1101 -448 -572 -190 131 156 692 1035 884 1360 1508 1573 1852 2289 2429
3016 2429 2509 2342 2774 2671 2706 3277 2830 3034 2985 3105 2993 3020 2680 2609 2675 2353 2074 1881 2209 1661 1526 1416
3038 1416 969 606 519 -31 -223 -282 -724 -738 -676 -1202 -1492 -1656 -1773 -2314 -2223 -2123 -2521 -2563 -2775 -3247 -3029 -2581
3060 -2581 -3110 -3116 -2991 -2775 -3000 -2741 -2554 -2855 -2355 -2209 -2179 -1787 -1315 -1498 -1469 -1082 -825 -642 -171 -239 319
$$ packed form
2908c149p9j73P61p57L24M14l91j33O16n26L51L71O6J30J07M62J80j37O38K07
2928g18J77Q49k78J48P56k00N61N32o93R35j91M92P3J28K32nj22P07n37N9L87
2949C292m37N53J02q16K18K1n39Q0k5o0m59Qk39o21j0M4n08k86J88q67j64pn76
2972a108j8m45k25q7m66R0l27l5K25o79j22M48l97N6N05q15J44K52J16n3J56J47
2994b638K85R0L62R0oO46k57L27O53j24L82L21K5N36L43j51M76J48O5K79M37J40
3016B429Q0j67M32j03L5N71m47K04m9J20j12K7l40p1O6l22k79j93L28n48j35j10
3038A416m47l63q7n50j92n9m42j4O2n26k90j64j17n41R1J00l98m2k12m72K18M48
3060b581n29oJ25K16k25K59J87l01N00J46L0L92M72j83K9L87K57J83M71o8N58
$$ plain form
3081 319 457 630 866 914 1282 1261 1856 1855 1806 2334 2445 2448 2636 2931 2590 2577 3118 2604 2646 2912 2785 2415 2341
3104 2341 2549 2232 2068 2093 1981 1839 1952 1351 1205 1217 1046 642 506 -61 -159 -324 -514 -931 -1042 -1295 -1605
3125 -1605 -1762 -1911 -2257 -2483 -2394 -2466 -2678 -2727 -2856 -3006 -2642 -2768 -2773 -2659 -2544 -2773 -2632 -2359 -2457 -1995 -1851 -2064
3147 -2064 -1851 -1381 -1388 -1218 -693 -651 -774 43 82 20 348 701 1183 1123 1589 1514 1820 2231 1999 2045 2454 2471 2598
3170 2598 2735 2561 2486 2775 2776 2655 2586 2719 2521 2610 2626 2070 1912 1871 1652 1496 1665 1152 778 863 277 49
3192 49 -302 -17 -460 -424 -756 -1119 -1439 -1099 -1794 -1879 -1948 -2252 -2117 -2172 -2546 -2856 -2291 -2743 -2816 -2554 -2514 -2807
3214 -2807 -2479 -2451 -2419 -2325 -1849 -2167 -1840 -1692 -1677 -1630 -1030 -1241 -945 -620 -182 -91 41 506 445 687 1206 1057
3236 1057 1436 1705 1434 1666 2155 2515 2155 2422 2622 2549 2770 2802 2567 2689 3019 2639 2393 2639 2269 2168
$$ packed form
3081C19J38J73K36M8L68k1N95jm9N28J11LJ88K95l41j3N41n14M2K66j27l70p4
3104B341K08l17j64K5j12j42J13o01j46J2j71m04j36n67r8j65j90m17j11k53l10
3125a605j57j49l46k26Q9p2k12m9j29j50L64j26nJ14J15k29J41K73r8M62J44k13
3147b064K13M70pJ70N25M2j23Q17L9o2L28L53M82o0M66p5L06M11k32M6M09J7J27
3170B598J37j74p5K89Jj21o9J33j98Q9J6n56j58m1k19j56J69n13l74Q5n86k28
3192D9l51K85m43L6l32l63l20L40o95q5o9l04J35n5l74l10N65m52p3K62M0k93
3214b807L28K8L2R4M76l18L27J48J5M7O00k11K96L25M38R1J32M65o1K42N19j49
3236A057L79K69k71K32M89L60l60K67K00p3K21L2k35J22L30l80k46K46l70j01
$$ plain form
3256 2168 2183 1962 1677 1722 1412 1353 1143 745 714 608 321 -179 -563 -325 -798 -1031 -851 -1331 -1463 -1391 -2012
3277 -2012 -2099 -2144 -2415 -2473 -2478 -2428 -2721 -2513 -2467 -2639 -2699 -2389 -2539 -2560 -2373 -2470 -2130 -1847 -1729 -1764 -1417 -1455 -1439 -840
3301 -840 -989 -282 -406 -157 -194 139 832 755 1095 1246 1200 1428 1871 1706 1928 2173 2060 2302 2586 2422 2405
3322 2405 2426 2638 2554 2325 2622 2367 2275 2357 1772 1702 2340 1738 1616 1796 1413 1017 844 610 544 252 -36 -95
3344 -95 -379 -393 -929 -1101 -951 -1263 -1736 -1614 -1675 -2185 -1997 -2085 -2389 -2308 -2795 -2415 -2771 -2255 -2432 -2642 -1812 -2364
3366 -2364 -2180 -2036 -2284 -2168 -1502 -1695 -1652 -1332 -1116 -915 -680 -776 -530 -264 225 100 304 911 777 892
3386 892 1526 1181 1285 1900 1879 1854 2071 1958 2297 2302 2363 2360 2366 2621 2344 2274 2520 1884 2116 2295 1660 1955 1536
3409 1536 1500 1236 1234 978 828 492 683 240 -91 179 -779 -675 -293 -1066 -1297 -1092 -1579 -1590 -1662 -1885 -2209
$$ packed form
3256B168J5k21k85M5l10n9k10l98l1j06k87n00l84K38m73k33J80m80j32P2o21
3277b012q7m5k71n8nN0k93K08M6j72o0L10j50k1J87r7L40K83J18l5L47l8J6N99
3301h40j49P07j24K49l7L33O93p7L40J51m6K28M43j65K22K45j13K42K84j64j7
3322B405K1K12q4k29K97k55r2Q2n85p0O38o02j22J80l83l96j73k34o6k92k88n9
3344i5k84j4n36j72J50l12m73J22o1n10J88q8l04Q1m87L80l56N16j77k10Q30n52
3366b364J84J44k48J16O66j93M3L20K16K01K35r6K46K66M89j25K04O07j34J15
3386H92O34l45J04O15k1k5K17j13L39NO1lOK55k77p0K46o36K32J79o35K95m19
3409A536l6k64kk56j50l36J91m43l31K70r58J04L82p73k31K05m87j1p2k23l24
$$ plain form
3430 -2209 -2109 -2019 -2195 -2213 -2121 -2338 -2446 -2039 -2295 -2348 -1917 -2015 -2128 -1575 -2052 -1543 -1543 -1380 -1477 -965 -695 -551
3452 -551 -496 -306 -76 -30 678 467 326 904 1134 1195 1473 1532 1770 1991 2090 1914 2064 2265 2109 1880 2340 2228
3474 2228 2200 2783 2050 1978 2518 1927 2020 2161 1628 1488 1364 1370 1081 897 990 697 357 304 -106 -364 -236 -682
3496 -682 -860 -710 -1051 -1308 -1492 -1394 -1808 -1907 -1883 -2064 -2237 -2110 -2380 -2269 -2352 -2316 -2549 -2291 -2308 -2316 -2072 -1780 -1905
3519 -1905 -1793 -1624 -1330 -1196 -1076 -1122 -744 -608 -579 -403 0 163 313 709 758 797 1057 1188 1159 1436 1735
3540 1735 1551 1896 2160 2053 2332 2230 2374 2348 2448 2197 2307 2179 2060 1817 2112 2137 1810 1621 1477 1465 1137
3561 1137 1169 840 666 622 387 309 415 -104 -870 -579 -944 -883 -1149 -1333 -1608 -1410 -1521 -1952 -2124 -1797 -2080
3582 -2080 -2190 -2065 -2216 -2351 -1959 -2401 -2404 -2199 -1774 -1822 -2013 -1544 -1811 -1764 -1415 -1324 -1090 -796 -859 -865 -297 -549
$$ packed form
3430b209J00R0j76j8R2k17j08M07k56n3M31r8j13N53m77N09%J63r7N12K70J44
3452e51N5J90K30M6P08k11j41N78K30O1K78N9K38K21R9j76J50K01j56k29M60j12
3474B228k8N83p33p2N40n91R3J41n33j40j24Ok89j84R3k93l40n3m10k58J28m46
3496f82j78J50l41k57j84R8m14r9K4j81j73J27k70J11q3L6k33K58j7qK44K92j25
3519a905J12J69K94J34J20m6L78J36K9J76M03J63J50L96M9L9K60J31k9K77K99
3540A735j84L45K64j07K79j02J44k6J00k51J10j28j19k43K95K5l27j89j44j2l28
3561A137L2l29j74m4k35p8J06n19p66K91l65O1k66j84k75J98j11m31j72L27k83
3582b080j10J25j51j35L92m42lK05M25m8j91M69k67M7L49R1K34K94o3oN68k52
$$ plain form
3604 -549 -41 146 136 410 578 1025 764 1014 1442 1415 1788 1511 1648 1816 2107 2048 2086 2213 2138 2370 2166 2053
3626 2053 2005 2213 2091 1653 2007 1579 1593 1415 1550 922 1015 1004 715 768 319 221 -19 -36 -434 -735 -589 -541
3648 -541 -1263 -1431 -1192 -1535 -1583 -1415 -1899 -1879 -1860 -2073 -2042 -1974 -1975 -2072 -2254 -1945 -1936 -2031 -1841 -1761 -1638 -1615 -1578 -1536 -1089
3673 -1089 -1196 -1252 -731 -536 -631 -36 -122 -50 279 406 624 1076 879 1038 1134 1277 1781 1493 1621 1639 1723 2051
3695 2051 2044 2096 2185 2135 2231 2211 2130 1936 1846 1907 1916 1456 1726 1324 808 1329 992 874 847 642 324 202 80 -272
3719 -272 -292 -528 -822 -849 -844 -1436 -1448 -1304 -1617 -1903 -1443 -1612 -1999 -1989 -1830 -2311 -1991 -2148 -2373 -1935 -2165 -2142
3741 -2142 -1843 -1606 -1733 -1711 -1456 -1641 -1320 -666 -984 -796 -654 -338 -214 -157 75 154 428 456 751 981 1278
3762 1278 1314 1028 1639 1476 1606 2042 1746 1560 2082 2254 1869 2121 2276 2044 1861 2017 1987 1513 1880 1689
$$ packed form
3604e49N08J87j0K74J68M47k61K50M28k7L73k77J37J68K91n9L8J27p5K32k04j13
3626B053m8K08j22m38L54m28J4j78J35o28R3j1k89N3m49r8k40j7l98l01J46M8
3648e41p22j68K39l43m8J68m84K0J9k13L1O8jr7j82L09Rr5J90Q0J23K3L7M2M47
3673a089j07n6N21J95r5N95q6P2L29J27K18M52j97J59R6J43N04k88J28J8Q4L28
3695B051pN2Q9n0R6k0q1j94r0O1Rm60K70m02n16N21l37j18k7k05l18j22j22l52
3719b72k0k36k94k7Nn92j2J44l13k86M60j69l87J0J59m81L20j57k25M38k30K3
3741b142K99K37j27K2K55j85L21O54l18J88J42L16J24N7K32P9K74K8K95K30K97
3762A278L6k86O11j63J30M36k96j86N22J72l85K52J55k32j83J56l0m74L67j91
$$ plain form
3782 1689 1095 1536 1441 1095 979 782 562 566 333 242 163 -96 -348 -514 -548 -942 -1146 -963 -1333 -1465 -1180 -1471
3804 -1471 -1852 -1687 -1723 -2075 -1780 -2015 -1792 -2025 -1855 -1659 -1998 -1612 -1984 -1831 -1459 -1562 -1436 -1357 -1145 -1251
3824 -1251 -874 -655 -870 -233 -280 -61 23 366 582 692 878 817 1086 1552 1313 1328 1819 1762 1622 1821 1630
3845 1630 2067 2062 1734 1935 1569 2070 2042 1569 1779 1826 1497 1367 1125 1052 1390 776 736 941 778 473 534 307
3867 307 -35 -158 -326 -558 -606 -591 -899 -886 -952 -1332 -1572 -1410 -1775 -1808 -1646 -1769 -1958 -1655 -1982 -1981 -1719 -1976
3889 -1976 -1865 -1906 -1696 -1535 -1635 -1496 -1444 -1267 -968 -973 -1150 -621 -305 -426 -369 -121 -14 174 370 663 604 974
3911 974 1141 884 1227 1338 1508 1380 1650 1844 1771 1634 1918 1730 1997 2010 1852 2204 1837 1633 1696 1722 1735 1482
3933 1482 1366 1122 1056 976 758 654 535 369 51 283 -215 -669 -204 -774 -871 -680 -1205 -1279 -1105 -1267 -1645
$$ packed form
3782A689n94M41r5l46j16j97k20Mk33r1p9k59k52j66l4l94k04J83l70j32K85k91
3804a471l81J65l6l52K95k35K23k33J70J96l39L86l72J53L72j03J26P9K12j06
3824a251L77K19k15O37m7K19Q4L43K16J10J86o1K69M66k39J5M91n7j40J99j91
3845A630M37nl28K01l66N01k8m73K10M7l29j30k42p3L38o14m0K05j63l05O1k27
3867C07l42j23j68k32m8J5l08J3o6l80k40J62l65l3J62j23j89L03l27JK62k57
3889a976J11m1K10J61j00J39N2J77K99nj77N29L16j21N7K48J07J88J96K93n9L70
3911I74J67k57L43J11J70j28K70J94p3j37K84j88K67J3j58L52l67k04O3K6J3k53
3933A482j16k44o6q0k18j04j19j66l18K32m98m54M65n70r7J91n25p4J74j62l78
$$ plain form
3954 -1645 -1796 -1589 -1660 -1684 -1867 -1798 -1840 -1844 -2095 -1928 -1449 -1591 -1530 -1271 -1339 -1614 -1232 -1112 -955 -868 -637 -664 -590
3977 -590 -367 -438 -131 148 80 372 478 600 723 1192 1015 1060 1422 1346 1600 1792 1657 1608 1571 1811 1779 1744 2174
4000 2174 1912 1614 1657 1627 1358 1506 1540 1246 1252 1275 1098 1074 827 504 485 456 78 -41 -2 -124 -395 -670 -615
4023 -615 -821 -984 -1059 -1440 -1391 -1268 -1625 -1689 -1527 -1786 -1840 -1602 -1893 -2077 -1729 -1705 -2139 -1389 -1672 -1762 -1483 -1470
4045 -1470 -1287 -1293 -891 -796 -817 -724 -701 -639 -128 -173 81 235 373 694 761 898 866 943 1141 1186 1461 1428 1477 1513 1987
4070 1987 1576 1686 1781 1775 1499 1968 1700 1452 1751 1515 1420 1128 1446 1360 1207 1054 751 738 588 570 499 441 77
4093 77 -109 -470 -465 -480 -603 -904 -998 -949 -778 -1320 -1480 -1309 -1517 -1441 -1665 -1896 -1925 -1729 -1803 -2023 -1681 -1624 -1621 -1659
4117 -1659 -1337 -1532 -1567 -1305 -1321 -1081 -1001 -939 -1027 -583 -539 -252 -26 -187 77 614 371 387 650 732 614 1091
$$ packed form
3954a645j51K07p1k4j83O9m2mk51J67M79j42O1K59o8k75L82J20J57Q7K31k7P4
3977e90K23p1L07K79o8K92J06J22J23M69j77M5L62p6K54J92j35m9l7K40l2l5M30
4000B174k62k98M3l0k69J48L4k94OK3j77k4k47l23j9k9l78j19L9j22k71k75N5
4023f15k06j63p5l81M9J23l57o4J62k59n4K38k91j84L48K4m34P50k83r0K79J3
4045a470J83oM02R5k1R3K3O2N11m5K54J54J38L21O7J37l2P7J98M5K75l3M9L6M74
4070A987m11J10R5ok76M69k68k48K99k36r5k92L18q6j53j53l03j3j50j8p1n8l64
4093G7j86l61Nj5j23l01r4M9J71n42j60J71k08P6k24k31k9J96p4k20L42N7Ll8
4117a659L22j95l5K62j6K40Q0O2q8M44M4K87K26j61K64N37k43J6K63Q2j18M77
$$ plain form
4139 1091 1428 945 1077 1342 1572 1725 1695 1828 1743 2060 1491 1637 1916 1733 1715 1641 1549 1352 1242 1272 1103 1015
4161 1015 1163 793 558 798 195 262 86 -50 -504 -349 -351 -485 -661 -931 -967 -936 -1235 -1164 -1417 -1426 -1581 -1622 -1500
4184 -1500 -1796 -1871 -1567 -1434 -1732 -1871 -1602 -1608 -1342 -1136 -1438 -1293 -1166 -965 -1099 -645 -796 -829 -206 -83 -127
4205 -127 -146 282 153 407 690 551 869 1064 1191 1071 1062 1546 1262 1643 1788 1360 1768 1696 1648 1917 1946 1502
4227 1502 1559 1390 1274 1431 1410 1300 1002 1212 1024 422 712 233 363 353 201 -282 -113 -340 -516 -489 -422
4248 -422 -906 -844 -1067 -1079 -1308 -1552 -1242 -1573 -1160 -1640 -1845 -1447 -1675 -1895 -1598 -1640 -1542 -1498 -1536 -1396 -1482 -1154
4270 -1154 -1041 -1182 -1150 -858 -959 -770 -459 -468 -472 -220 2 130 498 514 371 806 777 822 1052 1150 1066 1406 1413 1293
4294 1293 1606 1560 1174 1705 1616 1707 1483 1659 1372 1100 1406 1338 1256 1253 1268 1136 964 785 692 497 702 322 543
$$ packed form
4139A091L37m83J32K65K30J53l0J33q5L17n69J46K79j83j8p4r2j97j10L0j69q8
4161A015J48l70k35K40o03O7j76j36m54J55kj34j76k70l6L1k99P1k53rj55m1J22
4184a500k96p5L04J33k98j39K69oK66K06l02J45J27K01j34M54j51l3O23J23m4
4205a27j9M28j29K54K83j39L18J95J27j20rM84k84L81J45m28M08p2m8K69K9m44
4227A502N7j69j16J57k1j10k98K10j88o02K90m79J30j0j52m83J69k27j76K7O7
4248d22m84O2k23j2k29k44L10l31M13m80k05L98k28k20K97m2R8M4l8J40q6L28
4270a154J13j41L2K92j01J89L11rmK52K22J28L68J6j43M35k9M5K30R8q4L40Pj20
4294A293L13m6l86N31q9R1k24J76k87k72L06o8q2lJ5j32j72j79r3j95K05l80K21
$$ plain form
4317 543 132 -104 -80 -444 -408 -494 -599 -832 -1100 -1125 -1095 -1355 -1315 -1361 -1649 -1454 -1273 -1792 -1352 -1475 -1609 -1662 -1666
4340 -1666 -1574 -1720 -1144 -1223 -1036 -1059 -1188 -1010 -648 -825 -786 -478 -333 -141 -255 61 -10 316 191 536 325
4361 325 841 844 684 1091 1161 1319 1359 1670 1461 1537 1580 1382 1809 1663 1257 1665 1366 1465 1277 1496 1352 1205
4383 1205 1086 1160 912 1066 753 403 437 431 109 91 20 -254 -550 -369 -620 -687 -716 -889 -1122 -790 -1006 -1287
4405 -1287 -1381 -1538 -1529 -1399 -1425 -1539 -1514 -1368 -1522 -1380 -1382 -1293 -1561 -1267 -1251 -1060 -953 -763 -1063 -718 -514 -508 -381
4428 -381 -493 -294 -215 201 486 -17 429 361 674 930 1061 828 1001 1218 1142 1492 1259 1367 1618 1592 1406
4449 1406 1377 1322 1307 1482 1493 1352 1169 1403 1345 1260 891 760 640 675 593 571 -84 229 59 -133 -213 -255 -547
4472 -547 -479 -593 -703 -868 -1150 -651 -1083 -1166 -1459 -1056 -1258 -1389 -1388 -1503 -1170 -1644 -1231 -1434 -1409 -1484 -1257 -1407
$$ packed form
4317E43m11k36K4l64L6q6j05k33k68k5L0k60M0m6k88J95J81n19M40j23j34n3m
4340a666R2j46N76p9J87k3j29J78L62j77L9L08J45J92j14L16p1L26j25L45k11
4361C25N16Lj60M07P0J58M0L11k09P6M3j98M27j46m06M08k99R9j88K19j44j47
4383A205j19P4k48J54l13l50L4ol22j8p1k74k96J81k51o7k9j73k33L32k16k81
4405a287r4j57RJ30k6j14K5J46j54J42kQ9k68K94J6J91J07J90l00L45K04OJ27
4428c81j12J99P9M16K85n03M46o8L13K56J31k33J73K17p6L50k33J08K51k6j86
4449A406k9n5j5J75J1j41j83K34n8q5l69j31j20L5q2k2o55L13j70j92q0m2k92
4472e47O8j14j10j65k82M99m32q3k93M03k02j31Jj15L33m74M13k03K5p5K27j50
$$ plain form
4494 -1407 -1026 -865 -1294 -922 -700 -793 -609 -147 -428 -227 -108 103 -26 201 373 463 611 768 592 1211
4514 1211 1105 1072 1273 1409 1274 1155 1403 1381 1604 1170 1435 1163 1604 1637 1279 1546 1172 1167 1272 1048 988 913
4536 913 929 713 640 607 239 131 238 -153 -190 -100 -380 -545 -678 -798 -1154 -887 -1040 -1128 -1199 -1079 -1083 -1288 -1247
4559 -1247 -1312 -1522 -1318 -1613 -1468 -1444 -1213 -1497 -1198 -1189 -1393 -1073 -884 -1112 -877 -701 -343 -205 -186 -339 -44
4580 -44 11 128 107 291 397 570 726 1024 737 959 1013 1160 1155 1198 1149 1077 1276 1317 1422 1781 1351 1316 1314 1389 1160
4605 1160 1210 1480 1123 1182 1342 892 781 848 521 204 587 49 117 -42 -154 -275 -457 -366 -485 -593 -601 -1069
4627 -1069 -1267 -1148 -1081 -1488 -1267 -1472 -1549 -1192 -1340 -1465 -1399 -1243 -1233 -1292 -1453 -1369 -1194 -1125 -945 -1103 -772 -689
4649 -689 -707 -501 -565 -374 -174 -301 -3 64 460 245 439 568 657 674 746 817 934 1053 1260 1270 1360 1396 1260
$$ packed form
4494a407L81J61m29L72K22r3J84M62k81K01J19K11j29K27J72R0J48J57j76O19
4514A211j06l3K01J36j35j19K48k2K23m34K65k72M41L3l58K67l74nJ05k24o0p5
4536I13J6k16p3l3l68j08J07l91l7R0k80j65j33j20l56K67j53q8p1J20mk05M1
4559a247o5k10K04k95J45K4K31k84K99Rk04L20J89k28K35J76L58J38J9j53K95
4580d4N5J17k1J84J06J73J56K98k87K22N4J47nM3m9p2J99M1J05L59m30l5kP5k29
4605A160N0K70l57N9J60m50j11O7l27l17L83n38O8j59j12j21j82R1j19j08qm68
4627a069j98J19O7m07K21k05p7L57j48j25O6J56J0n9j61Q4J75O9J80j58L31Q3
4649f89j8K06o4J91K00j27K98O7L96k15J94J29Q9J7P2P1J17J19K07J0R0L6j36
$$ plain form
4672 1260 1517 1404 1326 1413 1368 1199 1383 1503 1188 1121 1014 1005 705 614 751 426 632 354 307 338 251 -51 -145
4695 -145 -132 -621 -380 -464 -932 -801 -944 -901 -966 -901 -1270 -1427 -1050 -1184 -1444 -1304 -1207 -1530 -1184 -1248 -1498 -1246
4717 -1246 -1010 -1374 -1192 -1150 -1043 -817 -395 -657 -790 -254 -140 -350 -124 44 102 210 104 240 572 719
4737 719 573 810 1010 945 890 1254 1389 812 1209 1075 1442 1468 1453 1165 1373 1477 1144 1278 1018 1111 1157 980
4759 980 766 613 636 464 198 441 488 206 145 85 -233 -234 -526 -321 -546 -665 -533 -973 -748 -841 -1179 -986
4781 -986 -1248 -1341 -1324 -1258 -1435 -1161 -1289 -1234 -1254 -1467 -1335 -1383 -1099 -1077 -972 -808 -941 -1024 -906 -701 -618 -449 -207
4804 -207 -193 152 94 -138 287 433 445 731 964 713 555 1121 1171 907 998 987 1120 1439 1322 1270 1184 1322 1520
4827 1520 1144 1337 1341 1045 895 906 865 875 780 387 775 722 266 326 231 129 -182 129 -179 97 -380 -435 -856
$$ packed form
4672A260K57j13p8Q7m5j69J84J20l15o7j07rl00r1J37l25K06k78m7L1q7l02r4
4695a45J3m89K41q4m68J31j43M3o5O5l69j57L77j34k60J40R7l23L46o4k50K52
4717a246K36l64J82M2J07K26M22k62j33N36J14k10K26J68N8J08j06J36L32J47
4737G19j46K37K00o5n5L64J35n77L97j34L67K6j5k88K08J04l33J34k60R3M6j77
4759I80k14j53K3j72k66K43M7k82o1o0l18jk92K05k25j19J32m40K25r3l38J93
4781i86k62r3J7O6j77K74j28N5k0k13J32m8K84K2J05J64j33q3J18K05Q3J69K42
4804b07J4L45n8k32M25J46J2K86K33k51j58N66N0k64R1j1J33L19j17n2q6J38J98
4827A520l76J93Mk96j50J1m1J0r5l93L88n3m56O0r5j02l11L11l08K76m77n5m21
$$ plain form
4850 -856 -696 -866 -776 -966 -799 -1136 -1085 -1101 -1375 -1371 -1273 -1061 -1179 -1453 -1369 -1346 -1185 -823 -1232 -916 -824 -977 -782
4873 -782 -721 -591 -391 -363 -277 -338 -356 4 353 272 370 224 630 603 546 601 820 595 942 1153 955 994 1134 1046
4897 1046 1227 1352 1324 1526 1246 1046 1138 1199 1110 986 1029 928 753 812 801 632 445 357 241 305 321 178 -130
4920 -130 47 -395 -547 -371 -1102 -836 -915 -645 -1010 -1037 -844 -1382 -1035 -1188 -1445 -1243 -1071 -1075 -1203 -991 -1187
4941 -1187 -847 -1049 -912 -1079 -873 -849 -1106 -627 -403 -716 -496 -246 -481 -56 -312 -57 -3 467 468 389 648
4962 648 611 656 940 917 741 1093 1167 1009 976 1014 1356 990 1205 1005 1035 1175 1253 841 1081 1188 1037 982 797
4985 797 866 580 471 428 214 263 198 -144 2 -202 -335 -251 -352 -591 -537 -588 -820 -841 -663 -1081 -916 -938 -1060
5008 -1060 -1000 -1037 -1106 -1374 -1369 -1316 -1231 -1008 -917 -1209 -909 -1044 -942 -995 -600 -646 -724 -263 -218 -676 -163 -144 71 94
$$ packed form
4850h56J60j70R0j90J67l37N1j6k74MR8K12j18k74Q4K3J61L62m09L16R2j53J95
4873g82O1J30K00K8Q6o1j8L60L49q1R8j46M06k7n7N5K19k25L47K11j98L9J40q8
4897A046J81J25k8K02k80k00R2O1q9j24M3j01j75N9j1j69j87q8j16O4J6j43l08
4920a30J77m42j52J76p31K66p9K70l65k7J93n38L47j53k57K02J72mj28K12j96
4941a187L40k02J37j67K06K4k57M79K24l13K20K50k35M25k56K55N4M70Jp9K59
4962F48l7M5K84k3j76L52P4j58l3L8L42l66K15k00L0J40P8m12K40J07j51n5j85
4985G97O9k86j09m3k14M9o5l42J46k04j33Q4j01k39N4n1k32k1J78m18J65k2j22
5008a060O0l7o9k68NN3Q5K23R1k92L00j35J02n3L95m6p8M61M5m58N13J9K15K3
$$ plain form
5032 94 68 235 597 285 235 484 574 628 890 1038 894 1212 1028 1123 948 1334 1042 1188 1297 990 1030 945 1198
5055 1198 943 1216 800 666 649 1014 580 493 398 137 490 -133 134 -116 -32 -73 -183 -399 -370 -573 -538 -717
5077 -717 -682 -864 -1062 -1101 -1206 -1025 -1154 -974 -1192 -1035 -1019 -1000 -1230 -1277 -1170 -1153 -1149 -866 -912 -1052 -758 -432 -525
5100 -525 -654 -439 -158 -149 -242 -92 -9 70 333 344 467 752 580 853 632 940 727 1025 805 786 1007 1366
5122 1366 967 1359 980 1010 1231 1236 813 943 857 953 981 879 674 621 485 487 233 593 235 156 148 169 -302 69
5146 69 -65 -406 -309 -684 -635 -614 -528 -858 -1115 -925 -820 -1238 -1106 -1124 -1141 -1080 -960 -1101 -951 -1093 -903 -981 -1245
5169 -1245 -849 -986 -662 -739 -808 -712 -756 -348 -232 -327 -260 60 185 57 114 287 483 535 835 712 701 700 807
5192 807 1009 1154 891 1170 879 1252 1017 1000 1068 967 1204 981 1128 880 832 762 725 728 615 601 584 433 227
$$ packed form
5032I4k6J67L62l12n0K49R0N4K62J48j44L18j84R5j75L86k92J46J09l07M0q5K53
5055A198k55K73m16j34j7L65m34q7r5k61L53o23K67k50Q4m1j10k16K9k03L5j79
5077g17L5j82j98l9j05J81j29J80k18J57J6J9k30m7J07J7MK83m6j40K94L26r3
5100e25j29K15K81Rr3J50Q3P9K63J1J23K85j72K73k21L08k13K98k20j9K21L59
5122A366l99L92l79L0K21Nm23J30q6R6K8j02k05n3j36Kk54L60l58p9qK1m71L71
5146F9j34l41R7l75M9K1Q6l30k57J90J05m18J32j8j7O1J20j41J50j42J90p8k64
5169a245L96j37L24p7o9R6m4M08J16r5O7L20J25j28N7J73J96N2L00j23j1jJ07
5192H07K02J45k63K79k91L73k35j7O8j01K37k23J47k48m8p0l7Lj13j4j7j51k06
$$ plain form
5215 227 335 324 -62 -55 -87 -452 -215 -301 -540 -445 -718 -518 -782 -836 -657 -962 -951 -1122 -1075 -1175 -1197 -1130 -1107 -862
5239 -862 -1059 -1227 -542 -1078 -1138 -765 -963 -913 -685 -553 -522 -548 -328 -452 -80 -173 -431 182 217 184 53 457
5261 457 546 889 552 866 827 1059 961 951 881 1117 694 1002 1091 1081 1049 957 949 939 1113 697 984 964 898 589 660
5286 660 545 137 540 209 55 -61 262 -122 -215 -221 -340 -323 -399 -583 -482 -935 -592 -897 -768 -764 -995 -971 -1056
5309 -1056 -992 -1175 -852 -1033 -899 -1018 -1121 -892 -1061 -952 -896 -941 -681 -550 -532 -503 -243 -258 -419 -142 5 -134
5331 -134 8 -15 -40 341 550 401 646 631 923 789 805 1099 938 900 1209 1004 849 1019 1120 770 1146 1081
5353 1081 1060 995 695 870 601 772 799 475 456 512 350 574 169 149 350 125 112 -90 -85 -325 -285 -443 -609
5376 -609 -767 -729 -717 -602 -784 -735 -1024 -883 -1026 -1100 -900 -1223 -922 -955 -931 -927 -977 -538 -804 -1014 -688 -735 -770 -513
$$ packed form
5215B27J08j1l86Pl2l65K37q6k39R5k73K00k64n4J79l05J1j71M7j00k2O7K3K45
5239h62j97j68O85n36o0L73j98N0K28J32L1k6K20j24L72r3k58O13L5l3j31M04
5261D57Q9L43l37L14l9K32r8j0p0K36m23L08Q9j0l2r2qj0J74m16K87k0o6l09P1
5286F60j15m08M03l31j54j16L23l84r3oj19J7p6j84J01m53L43l05J29Mk31K4q5
5309a056O4j83L23j81J34j19j03K29j69J09N6m5K60J31J8K9K60j5j61K77J47j39
5331a34J42k3k5L81K09j49K45j5K92j34J6K94j61l8L09k05j55J70J01l50L76o5
5353A081k1o5l00J75k69J71K7l24j9N6j62K24m05k0K01k25j3k02Nk40M0j58j66
5376f09j58L8J2J15j82M9k89J41j43p4K00l23L01l3K4Mn0M39k66k10L26m7l5K57
$$ plain form
5400 -513 -481 -506 -177 -118 -346 -26 155 224 108 389 451 443 719 729 870 642 963 805 882 1064 970 1020 853 945
5424 945 917 1204 1005 1205 884 1004 651 619 829 539 712 631 379 452 565 379 193 60 96 210 75 -126
5446 -126 -493 -533 -310 -727 -608 -430 -594 -591 -634 -1057 -807 -818 -823 -836 -1004 -1065 -792 -1087 -1036 -973 -951 -759 -926 -1039
5470 -1039 -586 -744 -647 -455 -968 -395 -309 -532 -194 -29 45 514 328 92 387 253 403 433 618 702 679 779
5492 779 703 885 795 1005 1063 853 1035 1014 973 1233 913 882 943 949 656 678 773 684 561 446 496 355 331 216 113
5517 113 377 49 -257 -239 -165 -417 -501 -158 -482 -613 -604 -761 -615 -630 -902 -546 -874 -782 -1006 -997 -1150 -879 -1140
5540 -1140 -850 -816 -924 -686 -822 -649 -443 -604 -267 -589 -331 -335 -267 -18 -276 -69 22 49 361 307 43 537
5562 537 471 613 739 787 554 613 848 551 884 796 782 829 858 1000 900 1005 980 802 872 679 665 627 524 501
$$ packed form
5400e13L2k5L29N9k28L20J81O9j16K81O2qK76J0J41k28L21j58P7J82r4N0j67R2
5424I45k8K87j99K00l21J20l53l2K10k90J73q1k52P3J13j86j86j33L6J14j35k01
5446a26l67m0K23m17J19J78j64Lm3m23K50j1nj3j68o1K73k95N1O3K2J92j67j13
5470a039M53j58R7J92n13N73Q6k23L38J65P4M69j86k36K95j34J50L0J85Q4k3J00
5492G79p6J82r0K10N8k10J82k1m1K60l20l1O1Ok93K2R5q9j23j15N0j41k4j15j03
5517A13K64l28l06J8P4k52q4L43l24j31Rj57J46j5k72L56l28R2k24Rj53K71k61
5540a140K90L4j08K38j36J73K06j61L37l22K58mO8K49k58K07R1K7L12n4k64M94
5562E37o6J42J26M8k33N9K35k97L33q8j4M7K9J42j00J05k5j78P0j93j4l8j03k3
$$ plain form
5586 501 576 684 448 231 459 220 -15 -24 8 -260 -153 -189 -313 -427 -472 -737 -681 -577 -771 -683 -706 -777 -909
5609 -909 -851 -772 -782 -861 -855 -1178 -676 -842 -939 -860 -759 -900 -877 -593 -531 -457 -324 -367 -375 -157 -72 -32 59 386 208 309
5635 309 406 337 695 822 398 533 788 637 629 727 844 878 907 879 831 995 1041 818 1116 1022 724 492 675 465
5659 465 643 310 380 192 544 452 82 137 224 -51 -242 -167 -329 -171 -284 -475 -558 -443 -772 -557 -718 -636
5681 -636 -933 -809 -713 -851 -825 -758 -1177 -515 -829 -885 -402 -796 -817 -749 -599 -477 -493 -478 -317 -739 -217 -246 -350
5704 -350 -40 -11 -17 90 198 267 526 363 697 425 770 632 635 636 897 507 781 1002 713 848 931 886 784
5727 784 934 793 970 900 493 784 694 435 416 301 525 228 523 24 -147 275 109 -210 31 -147 -407
5748 -407 -442 -755 -624 -310 -494 -744 -728 -546 -595 -702 -911 -743 -828 -684 -736 -826 -756 -877 -706 -764 -510 -528 -826
$$ packed form
5586E01P5J08k36k17K28k39k35rL2k68J07l6j24j14m5k65N6J04j94Q8k3p1j32
5609i09N8P9j0p9Ol23N02j66r7P9J01j41K3K84O2P4J33m3qK18Q5M0R1L27j78J01
5635C09R7o9L58J27m24J35K55j51qR8J17L4K9k8m8J64M6k23K98r4k98k32J83k10
5659D65J78l33P0j88L52r2l70N5Q7k75j91P5j62J58j13j91q3J15l29K15j61Q2
5681f36k97J24R6j38K6O7m19O62l14n6M83l94k1O8J50J22j6J5J61m22N22k9j04
5704c50L10K9oJ07J08O9K59j63L34k72L45j38LJK61l90K74K21k89J35Q3m5j02
5727G84J50j41J77p0m07K91r0k59j9j15K24k97K95m99j71M22j66l19K41j78k60
5748d07l5l13J31L14j84k50J6J82m9j07k09J68q5J44n2r0P0j21J71n8K54j8k98
$$ plain form
5771 -826 -432 -609 -736 -540 -290 -275 -155 -116 -383 -33 167 178 115 55 236 667 525 361 555 560 507 848 837
5794 837 782 677 571 1003 827 803 937 755 637 643 606 929 649 714 691 609 466 332 338 132 208 186 311 -115
5818 -115 -243 -292 -223 -323 -49 -533 -441 -603 -513 -500 -623 -647 -659 -886 -899 -651 -814 -796 -662 -629 -989 -1065 -798 -770
5842 -770 -651 -574 -547 -532 -586 -502 -353 -483 -168 -244 -56 -212 -151 -31 -57 205 276 490 80 270 473 382 469 722
5866 722 613 519 715 733 979 706 951 817 895 855 806 931 918 641 833 782 286 585 169 516 436 228 390
5889 390 161 346 33 230 -123 -71 -316 -263 -418 -410 -339 -395 -818 -429 -638 -438 -477 -690 -762 -882 -859 -724 -876
5912 -876 -1014 -764 -1021 -716 -760 -784 -754 -838 -651 -378 -410 -460 -415 -395 -358 -168 -348 102 -47 318 172 236 394
5935 394 385 412 602 669 560 658 585 586 645 666 841 946 664 699 919 752 559 795 669 703 869 525 427 469 451
$$ packed form
5771h26L94j77j27J96K50J5J20L9k67L50K00J1o3o0J81M31j42j64J94Nn3L41j1
5794H37n5j05j06M32j76k4J34j82j18Ol7L23k80O5k3q2j43j34Ok06P6k2J25m26
5818a15j28m9O9j00K74m84R2j62R0J3j23k4j2k27j3K48j63J8J34L3l60p6K67K8
5842g70J19P7K7J5n4Q4J49j30L15p6J88j56O1J20k6K62P1K14m10J90K03r1Q7K53
5866G22j09r4J96J8K46k73K45j34P8m0m9J25j3k77J92n1m96K99m16L47q0k08J62
5889C90k29J85l13J97l53N2k45N3j55QP1n6m23L89k09K00l9k13p2j20K3J35j52
5912h76j38K50k57L05m4k4L0q4J87K73l2n0M5K0L7J90j80M50j49L65j46O4J58
5935C94rK7J90O7j09R8p3JN9K1J75J05k82L5K20j67j93K36j26L4J66l44r8M2j8
$$ plain form
5960 451 550 615 478 0 366 184 91 91 51 -53 -403 -131 -13 -364 -476 -754 -332 -526 -371 -534 -643 -633
5982 -633 -773 -947 -886 -660 -916 -804 -711 -809 -842 -562 -627 -588 -433 -580 -421 -288 -347 -543 -525 -144 -203 -61 30
6005 30 -220 -26 81 254 40 424 28 91 570 467 523 616 622 638 571 716 597 734 716 468 700 594 599 557
6029 557 587 449 720 882 433 730 474 397 449 484 296 163 173 102 32 -50 13 -136 -430 -12 -235 -253 -431
6052 -431 -482 -755 -551 -750 -689 -693 -819 -599 -802 -904 -815 -718 -542 -695 -528 -475 -474 -675 -475 -761 -453 -353 -145
6075 -145 -202 46 23 -220 -64 -81 -123 62 324 420 139 296 448 344 507 394 566 475 372 660 865 877
6097 877 486 682 750 625 672 705 483 594 519 447 423 567 597 533 380 396 325 563 170 109 93 3 23 -215 170
6122 170 -368 -305 -267 -395 -161 -205 -591 -596 -565 -512 -790 -663 -412 -794 -576 -643 -693 -605 -305 -543 -537 -714 -476 -515
$$ packed form
5960D51R9O5j37m78L66j82r3%m0j04l50K72J18l51j12k78M22j94J55j63j09J0
5982f33j40j74O1K26k56J12R3r8l3K80o5L9J55j47J59J33n9j96J8L81n9J42R1
6005C0k50J94J07J73k14L84l96O3M79j03N6R3OJ6o7J45j19J37j8k48K32j06Nm2
6029E57L0j38K71J62m49K97k56p7N2L5j88j33J0p1p0q2O3j49k94M18k23j8j78
6052d31n1k73K04j99O1mj26K20k03j02Q9R7J76j53J67N3Jk01K00k86L08J00K08
6075a45n7K48k3k43J56j7m2J85K62R6k81J57J52j04J63j13J72r1j03K88K05J2
6097H77l91J96O8j25M7L3k22J11p5p2k4J44L0o4j53J6p1K38l93o1j6r0K0k38L85
6122A70n38O3L8j28K34m4l86nL1N3k78J27K51l82K18o7n0Q8L00k38Oj77K38l9
$$ plain form
6146 -515 -484 -744 -398 -599 -422 -96 -92 -15 24 -228 30 199 150 389 136 247 368 444 542 569 490 368 604
6169 604 419 494 581 594 667 632 816 519 527 639 754 705 671 623 347 214 414 309 590 303 181 156 243 -195
6193 -195 -109 -52 -52 -269 -469 -245 -474 -622 -478 -496 -335 -682 -562 -760 -500 -413 -806 -646 -614 -635 -836 -719 -706
6216 -706 -516 -497 -494 -570 -542 -661 -404 -244 -458 -483 -200 -329 -280 -205 -112 89 135 20 402 274 411 462 525 397
6240 397 404 329 718 471 635 571 562 683 624 650 644 774 707 802 580 518 644 670 471 386 462 486 430 179 432 18
6266 18 70 -24 -92 -48 36 -190 -61 -361 -508 -397 -434 -311 -571 -556 -461 -603 -680 -368 -743 -560 -708 -951 -663
6289 -663 -839 -685 -477 -730 -497 -576 -449 -599 -652 -276 9 -221 -370 216 -218 -99 -7 28 191 378 111
6310 111 24 477 88 206 454 376 495 584 721 541 500 416 578 807 587 316 827 512 623 709 742 387
$$ packed form
6146e15L1k60L46k01J77L26MP7L9k52K58J69m9K39k53J11J21P6R8K7p9j22K36
6169F04j85P5Q7J3P3l5J84k97QJ12J15m9l4m8k76j33K00j05K81k87j22k5Q7m38
6193a95Q6N7%k17k00K24k29j48J44j8J61l47J20j98K60Q7l93J60L2k1k01J17J3
6216g06J90J9Lp6K8j19K57J60k14k5K83j29M9P5R3K01M6j15L82j28J37N1O3j28
6240C97Pp5L89k47J64o4rJ21n9K6oJ30o7R5k22o2J26K6j99q5P6K4n6k51K53m14
6266A8N2r4o8M4Q4k26J29l00j47J11l7J23k60J5R5j42p7L12l75J83j48k43K88
6289f63j76J54K08k53K33p9J27j50n3L76K85k30j49N86m34J19R2L5J63J87k67
6310A11q7M53l89J18K48p8J19Q9J37j80m1q4J62K29k20k71N11l15J11Q6L3l55
$$ plain form
6332 387 314 410 522 262 441 516 150 114 19 80 -24 -67 124 -81 -224 -249 -303 -230 -346 -556 -436 -595 -720
6355 -720 -600 -588 -677 -432 -622 -665 -588 -624 -416 -454 -548 -437 -751 -520 -428 -648 -337 -379 -186 -353 -504 -337 -201
6378 -201 -134 -5 226 58 -8 103 3 100 244 291 147 546 394 375 697 431 396 558 417 587 774 543
6400 543 618 746 700 392 627 481 371 803 550 393 303 401 395 487 -161 128 14 -25 -53 -9 87 -109 -113 -323
6424 -323 -237 -365 -155 -248 -359 -475 -479 -898 -606 -718 -612 -543 -540 -591 -617 -548 -670 -407 -405 -683 -700 -164 -366 -338 -381
6449 -381 -266 -98 -129 -239 -164 5 86 -44 23 107 129 377 192 125 235 495 174 694 470 508 290 558 685
6472 685 553 520 720 598 594 821 359 269 563 294 405 438 225 162 248 426 333 68 130 -185 -16 81 212
6495 212 132 -161 -204 -315 -258 -302 -501 -335 -741 -859 -561 -676 -626 -526 -321 -538 -445 -705 -633 -449 -652 -782
$$ packed form
6332C87p3R6J12k60J79P5l66l6r5O1j04m3J91k05j43k5n4P3j16k10J20j59j25
6355g20J20J2q9K45j90m3P7l6K08l8r4J11l14K31R2k20L11m2J93j67j51J67J36
6378b01O7J29K31j68o6J11j00R7J44M7j44L99j52j9L22k66l5J62j41J70J87k31
6400E43P5J28m6l08K35j46j10M32k53j57r0R8oR2o48K89j14l9k8M4R6j96mk10
6424c23Q6j28K10r3j11j16mm19K92j12J06O9Ln1k6O9j22K63Kk78j7N36k02K8m3
6449c81J15J68l1j10P5J69Q1j30O7Q4K2K48j85o7J10K60l21N20k24L8k18K68J27
6472F85j32l3K00j22mK27m62r0K94k69J11L3k13o3Q6J78r3k65O2l15J69R7J31
6495B12q0k93m3j11N7m4j99J66m06j18K98j15N0J00K05k17R3k60P2J84k03j30
$$ plain form
6517 -782 -589 -423 -536 -455 -410 -617 -251 -337 -417 -278 -133 -170 67 -67 44 137 168 155 70 288 218 330 252 199
6541 199 399 543 642 420 510 815 337 294 547 552 469 744 534 457 641 587 313 462 508 263 417 504 235
6564 235 255 148 220 98 -76 75 -227 -206 -13 -220 -549 -323 -307 -378 -321 -437 -537 -593 -562 -340 -334 -557 -439
6587 -439 -602 -450 -574 -562 -428 -455 -435 -473 -350 -508 -419 -265 -410 -275 -119 -200 -46 -17 -41 -76 200 3 283
6610 283 288 136 359 338 336 329 389 476 699 624 414 405 414 433 335 323 508 455 444 578 354 301 430 171 306 367 291
6637 291 184 347 -25 204 9 121 17 -91 -142 -86 39 -152 -410 -421 -344 -367 -448 -396 -461 -494 -585 -816 -638
6660 -638 -481 -576 -477 -536 -404 -517 -470 -380 -405 -490 -177 -336 -278 -190 -302 -433 -158 223 -56 -51 284 11 -128 313
6684 313 55 197 206 320 179 220 413 361 461 382 402 420 516 322 567 337 519 508 552 323 541 455 556 331
$$ packed form
6517g82J93J66j13Q1M5k07L66q6q0J39J45l7K37j34J11R3L1j3q5K18p0J12p8n3
6541A99K00J44R9k22R0L05m78m3K53Nq3K75k10p7J84n4k74J49M6k45J54Q7k69
6564B35K0j07P2j22j74J51l02K1J93k07l29K26J6p1N7j16j00n6L1K22Ok23J18
6587d39j63J52j24J2J34k7K0l8J23j58Q9J54j45J35J56q1J54K9k4l5K76j97K80
6610B83Nj52K23k1kpO0Q7K23p5k10rRJ9r8j2J85n3j1J34k24n3J29k59J35O1p6
6637B91j07J63l72K29j95J12j04j08n1N6J25j91k58j1P7k3q1N2o5l3r1k31J78
6660f38J57r5R9n9J32j13M7R0k5q5L13j59N8Q8j12j31K75L81k79NL35k73j39M41
6684C13k58J42RJ14j41M1J93n2J00p9K0J8R6j94K45k30J82j1M4k29K18q6J01k25
$$ plain form
6708 331 486 95 311 259 358 192 128 199 -17 16 -26 -153 -159 -173 -417 -483 -390 -178 -489 -258 -489 -474 -518 -328
6732 -328 -632 -504 -150 -784 -357 -483 -487 -441 -494 -573 -735 -457 -423 -297 -261 -420 -182 54 -345 -328 -243 -22 46
6755 46 122 190 139 121 94 409 216 712 253 227 553 324 352 454 559 451 477 609 383 466 662 533 616 249
6779 249 547 453 575 369 256 221 373 199 213 -3 28 205 -7 114 -88 173 -212 -202 -330 -220 -360 -365
6801 -365 -221 -570 -265 -357 -210 -408 -218 -202 -375 -469 -493 -709 -297 -285 -266 -454 -553 -532 -548 -597 -577 -311 -261 -291
6825 -291 -402 78 -3 -214 17 123 -100 150 209 181 61 251 391 345 492 399 286 381 606 367 408 331 358
6848 358 478 578 502 441 266 622 123 213 578 203 235 347 350 263 283 45 -92 26 234 130 -132 -17 -193
6871 -193 -172 -1 -441 -319 -226 -402 -692 -372 -329 -381 -492 -447 -344 -425 -598 -397 -503 -376 -494 -650 -233 -366
$$ packed form
6708C31J55l91K16n2R9j66o4P1k16L3m2j27oj4k44o6R3K12l11K31k31J5m4J90
6732c28l04J28L54o34M27j26mM6n3p9j62K78L4J26L6j59K38K36l99J7Q5K21O8
6755D6P6O8n1j8k7L15j93M96m59k6L26k29K8J02J05j08K6J32k26Q3J96j29Q3l67
6779B49K98r4J22k06j13l5J52j74J4k16L1J77k12J21k02K61l85J0j28J10j40n
6801c65J44l49L05r2J47j98J90J6j73r4k4k16M12J2J9j88r9K1j6m9K0K66N0l0
6825b91j11M80q1k11K31J06k23K50N9k8j20J90J40m6J47r3j13R5K25k39M1p7K7
6848C58J20J00p6o1j75L56m99R0L65l75L2J12Lq7K0k38j37J18K08j04k62J15j76
6871a93K1J71m40J22R3j76k90L20M3n2j11M5J03q1j73K01j06J27j18j56M17j33
$$ plain form
6893 -366 -356 -268 -197 -124 -161 -249 -265 -274 -138 -151 -361 -141 -87 -94 -104 117 226 344 251 469 80 212 591 542 531 362
6919 362 183 350 383 663 368 586 369 315 377 407 334 388 340 448 326 214 179 378 218 240 45 30 250
6942 250 213 79 -44 8 -328 -141 -401 -209 -334 -205 -253 -259 -546 -368 -393 -530 -340 -531 -434 -567 -547 -448 -640
6965 -640 -449 -572 -315 -209 -509 -348 -421 -166 -591 -245 -275 -35 180 -245 10 26 135 -79 16 71 121 165
6987 165 435 495 95 332 440 172 351 646 605 430 577 597 403 398 436 376 538 444 190 585 399 247 225
7010 225 156 85 154 84 93 93 136 -172 70 31 -55 -116 -19 -6 -396 -347 -292 76 -118 -361 -530 -452 -395 -539 -418 -458
7036 -458 -590 -306 -379 -680 -395 -379 -541 -361 -569 -434 -588 -171 -74 -303 -123 -362 -314 -211 -115 -58 201 452
7058 452 113 433 214 316 167 -70 462 339 332 258 404 373 368 470 437 335 511 484 577 471 326 174 217
$$ packed form
6893c66J0Q8P1P3l7q8j6rJ36j3k10K20N4pj0K21J09J18r3K18l89J32L79m9j1j69
6919C62j79J67L3K80k95K18k17n4O2L0p3N4m8J08j22j12l5J99j60K2j95j5K20
6942B50l7j34j23N2l36J87k60J92j25J29m8ok87J78k5j37J90j91R7j33K0R9j92
6965f40J91j23K57J06l00J61p3K55m25L46l0K40K15m25K55J6J09k14R5N5N0M4
6987A65K70O0m00K37J08k68J79K95m1j75J47K0j94nL8o0J62r4k54L95j86j52k2
7010B25o9p1O9p0R%M3l08K42l9q6o1R7J3l90M9N5L68j94k43j69P8N7j44J21m0
7036d58j32K84p3l01K85J6j62J80k08J35j54M17R7k29J80k39M8J03R6N7K59K51
7058D52l39L20k19J02j49k37N32j23pp4J46l1nJ02l3j02J76k7R3j06j45j52M3
$$ plain form
7081 217 277 453 103 149 247 469 200 349 187 69 77 -56 -131 -21 -199 -60 22 -44 -222 -403 -390 -196 -192 -413
7105 -413 -184 -367 -402 -264 -483 -473 -266 -414 -177 -507 -499 -349 -534 -431 -259 -562 -142 -171 -150 -223 -194 -226 -183
7128 -183 98 -157 202 -142 169 74 351 67 174 248 391 188 286 401 247 202 378 291 368 455 569 411
7150 411 247 296 492 651 372 229 264 198 438 255 59 264 223 274 161 -140 25 82 -133 -45 -214 -156 -10
7173 -10 -58 -152 -446 -271 -109 -207 -377 -473 -253 -330 -374 -491 -236 -483 -566 -285 -337 -423 -358 -307 -287 -578 -427 -13
7197 -13 -4 -103 -107 -310 -22 -323 103 69 66 308 125 33 138 148 106 250 224 189 258 316 304 480 324 335 403 508
7223 508 386 562 314 403 280 323 204 499 101 134 327 227 242 198 113 280 247 104 129 13 150 -112 -60
7246 -60 -277 -358 -200 -480 -166 -215 -247 -211 -419 -182 -466 -476 -380 -481 -511 -309 -535 -468 -407 -460 -469 -340 -275 -470 -112
$$ packed form
7081B17O0J76l50M6R8K22k69J49j62j18Qj33p5J10j78J39Q2o6j78j81J3J94Mk21
7105d13K29j83l5J38k19J0K07j48K37l30QJ50j85J03J72l03M20k9K1p3K9l2M3
7128a83K81k55L59l44L11r5K77k84J07P4J43k03R8J15j54m5J76q7P7Q7J14j58
7150D11j64M9J96J59k79j43L5o6K40j83j96K05m1N1j13l01J65N7k15Q8j69N8J46
7173a0m8r4k94J75J62r8j70r6K20p7m4j17K55k47q3K81n2q6O5N1K0k91J51M14
7197a3Rr9mk03K88l01M26l4lK42j83r2J05J0m2J44k6l5O9N8j2J76j56J1O8J05
7223E08j22J76k48Q9j23M3j19K95l98L3J93j00J5m4q5J67l3j43K5j16J37k62N2
7246f0k17q1J58k80L14m9l2L6k08K37k84j0R6j01l0K02k26O7O1n3rJ29O5j95L58
$$ plain form
7271 -112 -469 -67 -275 -78 -159 -182 -66 64 141 74 -19 -80 279 228 -91 163 109 263 66 353 444 380 551
7294 551 416 408 578 400 167 567 357 355 273 297 68 199 145 293 375 142 109 -8 392 55 64 191 -238 -104
7318 -104 -104 23 -42 -239 -48 -154 -176 -238 -168 -438 -20 -498 -458 -87 -316 -729 -489 -483 -284 -216 -283 -454 -359 -469
7342 -469 -131 -284 -297 -403 -183 -263 -149 -176 -190 -106 -162 -192 107 -124 163 231 87 -66 230 305 200 104 342
7365 342 80 295 148 355 461 551 355 326 291 471 629 358 479 484 427 309 450 310 390 422 237 91 201
7388 201 281 51 26 -28 62 -20 -49 -193 -251 -80 -102 -292 -170 -115 -289 -270 -385 -306 -338 -396 -474 -403 -476 -551 -572 -369
7414 -369 -224 -275 -423 -263 -231 -392 -316 -396 -167 -288 -156 5 -170 -48 -14 89 45 86 102 251 143 276 253
7437 253 495 151 367 532 189 16 367 332 238 230 351 318 515 223 388 75 126 427 54 288 456 283
$$ packed form
7271a12l57M02k08J97q1k3J16J30P7o7r3o1L59n1l19K54n4J54j97K87R1o4J71
7294E51j35qJ70j78k33M00k10kq2K4k29J31n4J48Q2k33l3j17M00l37RJ27m29J34
7318a04%J27o5j97J91j06k2o2P0k70M18m78M0L71k29m13K40OJ99O8o7j71R5j10
7342d69L38j53j3j06K20q0J14k7j4Q4n6l0K99k31K87O8j44j53K96P5j05r6K38
7365C42k62K15j47K07J06R0j96k9l5J80J58k71J21Nn7j18J41j40Q0L2j85j46J10
7388B01Q0k30k5n4R0q2k9j44n8J71k2j90J22N5j74J9j15P9l2n8p8P1p3p5k1K03
7414c69J45n1j48J60L2j61P6q0K29j21J32J61j75J22L4J03m4M1J6J49j08J33k3
7437B53K42l44K16J65l43j73L51l5r4qJ21l3J97k92J65l13N1L01l73K34J68j73
$$ plain form
7459 283 169 222 272 210 -62 124 -35 268 50 -17 57 33 -30 -97 -62 -104 -120 -302 -54 -191 -403 -260 -275 -253
7483 -253 -410 -458 -548 -561 -434 -217 -381 -160 -285 -426 -321 -369 -40 -71 -465 -498 -75 -210 -52 308 -3 -32
7505 -32 105 140 209 115 132 236 153 431 88 -5 327 -2 166 517 433 381 527 311 348 340 216 91 244 494
7529 494 215 337 103 87 341 262 255 182 280 173 38 230 30 -127 -5 -330 -111 -113 -50 -198 -275 -255 -300 -390
7553 -390 -275 -313 -155 -296 -234 -196 -311 -161 -253 -291 -440 -436 -294 -448 -377 -180 -390 -4 -61 -171 -96 -310 -126
7576 -126 -169 -4 -140 -212 21 118 155 8 148 248 18 -55 220 85 241 104 249 112 520 417 307 247
7598 247 269 155 125 217 288 536 404 261 136 199 210 364 78 223 263 9 289 286 -11 58 94 54 123 -164
7622 -164 -33 -70 -305 -304 -193 -413 -369 -154 -346 -415 -223 -181 -477 -255 -421 -385 -402 -543 -307 -405 -239 -529 -544
$$ packed form
7459B83j14N3N0o2k72J86j59L03k18o7P4k4o3o7L5m2j6j82K48j37k12J43j5K2
7483b53j57m8r0j3J27K17j64K21j25j41J05m8L29l1l94l3M23j35J58L60l11k9
7505c2J37L5O9r4J7J04q3K78l43r3L32l29J68L51q4n2J46k16L7qj24j25J53K50
7529D94k79J22k34j6K54p9pp3R8j07j35J92k00j57J22l25K19kO3j48p7K0m5r0
7553c90J15l8J58j41O2L8j15J50r2l8j49MJ42j54P1J97k10L86n7j10P5k14J84
7576a26m3J65j36p2K33R7L7j47J40J00k30p3K75j35J56j37J45j37M08j03j10o0
7598B47K2j14l0R2P1K48j32j43j25O3J1J54k86J45M0k54K80lk97O9L6m0O9k87
7622a64J31l7k35JJ11k20M4K15j92o9J92M2k96K22j66L6j7j41K36r8J66k90j5
$$ plain form
7645 -544 -174 -167 -217 115 -197 -301 -50 -199 -87 -71 -20 173 153 153 115 -220 162 245 -6 317 266 13 159 151
7669 151 288 248 329 245 425 492 278 309 545 360 542 238 205 26 212 80 119 180 6 228 -94 313 243
7692 243 -62 56 -36 -108 -174 48 -72 -58 -141 -298 -275 -156 -391 -295 -472 -229 -170 -202 -297 40 -423 -550 -339
7715 -339 -450 -266 -352 -164 -405 -53 -206 -62 -225 -242 -229 59 93 -60 -160 -33 392 241 26 232 25
7736 25 34 224 -81 253 360 473 107 485 320 129 438 416 187 229 439 99 158 264 493 433 143 240 163
7759 163 103 25 224 89 -23 146 200 -49 67 -26 48 -282 -316 -345 -44 -123 -90 -235 -274 -238 -261 -361 -194 -277
7783 -277 -231 -296 -263 5 -358 -348 -113 -61 -269 -394 -160 -96 -124 78 -449 151 -262 -117 146 -125 -316 -2
7805 -2 -165 24 241 -109 43 233 175 33 87 314 173 289 529 471 226 320 296 296 212 297 367 273 352 26 255
$$ packed form
7645e44L70Pn0L32l12j04K51j49J12J6N1J93k0%l8l35L82Q3k51L23n1k53J46q
7669A51J37m0Q1q4J80O7k14L1K36j85J82l04l3j79J86j32L9O1j74K22l22M07p0
7692B43l05J18r2p2o6K22j20J4q3j57K3J19k35R6j77K43N9l2r5L37m63j27K11
7715c39j11J84q6J88k41L52j53J44j63j7J3K88L4j53j00J27M25j51k15K06k07
7736B5RJ90l05L34J07J13l66L78j65j91L09k2k29M2K10l40N9J06K29o0k90R7p7
7759A63o0p8J99j35j12J69N4k49J16r3P4l30l4k9L01p9L3j45l9L6k3j00J67q3
7783b77M6o5L3K68l63J0K35N2k08j25K34O4k8K02n27O00m13J45K63k71j91L14
7805bj63J89K17l50J52J90n8j42N4K27j41J16K40n8k45R4k4%q4Q5P0r4P9l26K29
$$ plain form
7830 255 253 390 119 254 114 255 308 182 236 50 78 -166 -78 -29 105 122 -96 -19 -76 -197 48 -46 -272 -527
7854 -527 -378 -158 -439 -395 -185 -191 -508 -280 -549 -395 -311 -37 -310 -267 -240 -307 -386 101 -180 -68 -177 -107 -284
7877 -284 -261 -77 -118 -112 290 -71 -279 155 184 316 125 -36 48 342 282 -107 312 369 114 583 194 243 541
7900 541 141 359 542 456 414 -56 140 72 475 79 39 245 211 186 223 181 -274 -36 -11 -181 -159 15 -375
7923 -375 -87 -166 -332 -11 -334 -280 -92 -292 -352 -120 -124 -150 -152 -272 -340 -315 -254 -187 -38 -438 47 -262 -56 -221
7947 -221 -221 28 -167 -185 -36 84 -143 51 -102 -56 -47 -78 89 137 31 24 117 94 185 355 353 145 205 492 267
7972 267 499 359 354 329 227 411 349 314 218 252 135 327 288 67 182 264 130 11 -42 -121 80 -157 -88 -29
7996 -29 13 -166 -226 -145 -55 -47 -58 -149 -320 -415 -109 -339 -412 -357 -362 -251 -4 -217 -378 -201 -153 17 -195 -98 -280
$$ packed form
7830B55kJ37k71J35j40J41N3j26N4j86K8k44Q8M9J34J7k18P7n7j21K45r4k26k55
7854e27J49K20k81M4K10ol17K28k69J54Q4K74k73M3K7o7p9M87k81J12j09P0j77
7877b84K3J84m1OM02l61k08M34K9J32j91j61Q4K94o0l89M19N7k55M69l89M9K98
7900E41m00K18J83q6m2m70J96o8M03l96m0K06l4k5L7m2m55K38K5j70K2J74l90
7923c75K88p9j66L21l23N4J88k00o0K32mk6kj20o8K5O1O7J49m00M85l09K06j65
7947b21%K49j95j8J49J20k27J94j53M6Rl1J67M8j06pR3k3R1J70kk08O0K87k25
7972B67K32j40nk5j02J84o2l5r6L4j17J92l9k21J15Q2j34j19n3p9K01k37O9N9
7996b9M2j79o0Q1R0Qj1r1j71r5L06k30p3N5nJ11K47k13j61J77M8J70k12R7j82
$$ plain form
8021 -280 -180 -17 -244 -30 -51 -61 -222 -3 102 -78 404 75 214 109 -125 152 128 -3 395 395 158 215
8043 215 462 317 416 383 296 582 416 313 480 65 347 228 435 174 201 90 61 -22 27 289 143 19
8065 19 -23 51 32 -174 55 -16 -177 -74 -128 -242 -121 -75 -147 -333 -189 -181 -518 -129 -154 -191 -45 -86 -625 -194
8089 -194 -265 -273 -235 -221 -183 -160 -270 -144 -13 -343 -50 -216 -69 -253 -254 110 -163 252 -67 11 139 231 211 368
8113 368 212 142 71 -72 250 318 269 424 321 337 337 144 475 275 453 147 202 172 204 402 201 98 106 240
8137 240 9 56 68 -101 278 -114 -158 -50 -117 -104 -242 -281 161 -65 -43 -299 -163 -166 -181 -233 -245 -227 -182 -210 -253
8162 -253 -408 -248 -261 -395 -287 -465 -369 -242 -187 -325 174 -88 -137 -138 -197 -398 117 -6 -69 -91 -126 92 31 43
8186 43 280 -6 106 55 307
$$ packed form
8021b80J00J63k27K14k1j0j61K19J05j80M82l29J39j05k34K77k4j31L98%k37N7
8043B15K47j45R9l3q7K86j66j03J67m15K82j19K07k61K7j11k9q3M9K62j46j24
8065A9m2P4j9k06K29p1j61J03n4j14J21M6p2j86J44Ql37L89k5l7J46m1n39M31
8089a94p1qL8J4L8K3j10J26J31l30K93j66J47j84jL64k73M15l19P8J28R2k0J57
8113C68j56p0p1j43L22O8m9J55j03J6%j93L31k00J78l06N5l0L2J98k01j03QJ34
8137B40k31M7J2j69L79l92m4J08o7J3j38l9M42k26K2k56J36lj5n2j2J8M5k8m3
8162b53j55J60j3j34J08j78R6J27N5j38M99k62m9jn9k01N15j23o3k2l5K18o1J2
8186D3K37k86J12n1K52
8191C07
$$ Imaginary data points
##PAGE= N=2
##DATA TABLE= (X++(I..I)), XYDATA
$$ plain form
0 0 0 0 0 0 0 0 0 0 0 0 -8 8 -8 8 -16 16 -24 24 -32 40 -48 56 -66 80 -94 108 -127 145 -168 192 -219 250
32 250 -283 320 -360 406 -455 510 -569 637 -706 785 -869 964 -1064 1175 -1296 1429 -1575
49 -1575 1732 -1909 2103 -2319 2560 -2829 3133 -3478 3876 -4342 4892 -5553 6365 -7393 8738
64 8738 -10580 13260 -17526 25381 -44566 189447 209019 -15147 238042 2573 98506 168984
76 168984 58142 157860 77780 124102 165250 -15678 146105 124068 112663 215149 44204
87 44204 72604 103292 15095 126012 61893 618 46097 28580 -3763 -41825 19327 13500
99 13500 -23207 59409 -30274 -74664 -1841 -13914 -11957 -47668 -42895 -59449 -115402 -31648 -90291
112 -90291 -122109 -30881 -107369 -76504 -68489 -138950 -32225 -56696 -71498 -17237 -106895 -77419
$$ packed form
0@%%%%%%%%%%qJ6j6J6k4L2m0M8n6P2q8J04j22J46j74K02k35K72l13L60m11M69
32B50n33O03o80P66q61R65j079J206j343J491j654J833k028K239k471K725l004
49a575L307l641M012m422M879n389N962o611P354q218R234j0445J1918j3758J6131
64H738j9318K3840l0786M2907o9947K34013J9572k24166K53189k35469R5933P0478
76A68984j10842R9718q0080M6322M1148j80928J61783k2037j1405J02486j70945
87D4204K8400L0688q8197J10917o4119o1275M5479j7517l2343l8062O1152n827
99A3500l6707Q2616q9683m4390P2823j2073J957l5711M773j6554n5953Q3754n8643
112i0291l1818R1228p6488L0865Q015p0461J06725k4471j4802N4261q9658K9476
$$ plain form
124 -77419 -48351 -66474 -29642 -84836 -52340 -43058 -107202 -26002 -48496 -66762 29824 -18844
136 -18844 -32551 -8251 -37993 17870 27066 12942 30921 -13516 -3340 17897 -9264 17951
148 17951 26608 23547 37719 2119 4183 32282 27304 63251 62620 13240 27405 28945 13137
161 13137 35400 30220 22387 23414 3103 -1632 -10901 -1637 29472 16437 10135 4686 -22409 -4411
175 -4411 6003 -2846 9994 -6064 -23480 -18554 -33363 -33535 -14816 -14278 -16565 -20817 -34654 -33595
189 -33595 -21159 -7766 1851 -8124 -13231 -12416 -25104 -10032 373 -10458 8659 -274 -17439
202 -17439 -2336 -7896 9457 30283 20032 28347 15030 13097 36473 27582 45657 50005 27224
215 27224 41594 27010 22171 46406 39121 50678 48841 29957 38125 31608 43111 57746 43788
$$ packed form
124g7419K9068j8123L6832n5194L2496R282o4144Q1200k2494j8266R6586m8668
136a8844j3707K4300k9742N5863R196j4124J7979m4437J0176K1237k7161K7215
148A7951Q657l061J4172l5600K064K8099m978L5947o31m9380J4165J540j5808
161A3137K2263n180p833J027k0311m735r269R264L1109j3035o302n449k7095J7998
175d411J0414q849J2840j6058j7416M926j4809j72J8719N38k287m252j3837J059
189c3595J2436J3393R617r975n107Q15j2688J5072J0405j0831J9117q933j7165
202a7439J5103n560J7353K0826j0251Q315j3317j933K3376q891J8075M348k2781
215B7224J4370j4584m839K4235p285J1557j837j8884Q168o517J1503J4635j3958
$$ plain form
228 43788 49897 37302 21551 31581 24440 27419 33923 20691 12080 1057 -3590 106 3608 9179
242 9179 -176 -10916 -16519 -24472 -22837 -17933 -18048 -25367 -34144 -42572 -54667 -50537 -43844 -46647 -43269
257 -43269 -50824 -62459 -61173 -60130 -52162 -46571 -47040 -48770 -59352 -59025 -54324 -53855 -40484 -38596 -45947
272 -45947 -43894 -47602 -44384 -31428 -22159 -15992 -16820 -17528 -17657 -15812 -1733 7058 9027 14152 9541
287 9541 4914 10361 18351 27522 35706 38017 31986 28720 34119 39661 48376 56143 53710 49324 46231
302 46231 41995 42997 51126 56230 53076 47909 39825 32467 37192 44084 43576 42812 38572 28676 22512
317 22512 23074 23102 24222 26768 19274 4610 -1396 -2207 -2838 2243 1430 -7922 -13852 -17448 -22456 -22231
333 -22231 -16333 -14768 -19332 -24385 -32750 -38108 -31724 -25300 -27236 -28140 -31736 -38573 -36721 -32935 -30483
$$ packed form
228D3788O109j2595j5751J0030p141K979O504j3232q611j1023m647L696L502N571
242I179r355j0740n603p953J635M904j15p319q777q428j2095M130O693k803L378
257d3269p555j1635J286J043P968N591m69j730j0582L27M701M69J3371J888p351
272d5947K053l708L218J2956R269O167q28p08j29J845J4079Q791J969N125m611
287I541m627N447P990R171Q184K311o031l266N399N542Q715P767k433m386l093
302D6231m236J002Q129N104l154n167q084p358M725O892n08p64m240r896o164
317B2512N62K8J120K546p494j4664o006q11o31N081q13r352n930l596n008K25
333b2231N898J565m564n053q365n358O384O424j936r04l596o837J852L786K452
$$ plain form
348 -30483 -23591 -20735 -24600 -28537 -29678 -24637 -18313 -10370 -8999 -16885 -14223 -12536 -14896 -2371 1503
363 1503 -331 7500 2332 -1690 4527 10600 18359 17703 17614 14917 5832 17485 21566 15385 27447
378 27447 21864 13125 18192 11623 15716 23365 22133 23116 11036 7097 10975 8011 16697 13297 4883
393 4883 6704 -4487 -6092 -1600 -6670 -316 825 -10790 -17210 -18528 -16434 -13343 -8338 -12295 -22647
408 -22647 -22527 -22742 -24625 -23008 -18523 -15108 -23132 -23020 -25653 -33159 -16605 -10580 -15362 -11497 -23055
423 -23055 -17640 -10964 -15780 1721 -4616 -6983 8310 -10199 -4488 6274 2233 23489 13049
436 13049 7156 17634 2489 23629 30712 15774 34795 22981 21825 33677 14971 34177 37544
449 37544 26503 43833 21882 18687 35499 26788 37752 31259 22140 28760 15196 24069 24781 10377
$$ packed form
348c0483O892K856l865l937j141N041O324P943J371p886K662J687k360J2525L874
363A503j834P831n168m022O217O073P759o56q9k697r085J1653M081o181J2062
378B7447n583q739N067o569M093P649j232R83j2080l939L878k964Q686l400q414
393D883J821j1191j605M492n070O354J141j1615o420j318K094L091N005l957j0352
408b2647J20k15j883J617M485L415q024J12k633p506J6554O025m782L865j1558
423b3055N415O676m816J7501o337k367J5293j8509N711J0762m041K1256j0440
436A3049n893J0478j5145K1140P083j4938J9021j1814j156J1852j8706J9206L367
449C7544j1041J7330k1951l195J6812q711J0964o493r119O620j3564Q873P12j4404
$$ plain form
463 10377 25421 18849 6573 7977 -311 3443 7156 6391 -1451 -12974 -10475 -12144 -10124 -11688
477 -11688 -19304 -15097 -22550 -25079 -25990 -35775 -23036 -24998 -28242 -26998 -48693 -33756 -28911 -38860
491 -38860 -19351 -37876 -39545 -23775 -41474 -26752 -28879 -32784 -9566 -30093 -24857 -19758 -35648
504 -35648 -3932 -7199 -15815 -1258 -20488 -4738 4635 -8102 12371 4386 5761 21429 820
517 820 9121 19434 16004 32879 24078 13988 23341 21000 29093 34649 24537 29599 30634 24785
531 24785 29371 23073 23633 37389 28073 23591 23730 8888 22580 29830 14668 21416 11704 5339
545 5339 16663 3678 5969 8048 -185 10197 -5326 -14265 -2707 -12882 -1680 -317 -22816
558 -22816 -14854 -16351 -21867 -9716 -19510 -21275 -13366 -21484 -21214 -24482 -25600 -13341 -15205 -17092 -17728
$$ packed form
463A0377J5044o572j2276J404q288L754L713p65p842j1523K499j669K020j564
477a1688p616M207p453k529r11r785J2739j962l244J244k1695J4937M845r949
491c8860J9509j8525j669J5770j7699J4722k127l905K3218k0527N236N099j5890
504c5648L1716l267q616J4557j9230J5750R373j2737K0473p985J375J5668k0609
517H20Q301J0313l430J6875q801j0090R353k341Q093N556j0112N062J035n849
531B4785M586o298N60J3756r316m482J39j4842J3692P250j5162O748r712o365
545E339J1324j2985K291K079q233J0382j5523q939J1558j0175J1202J363k2499
558b2816P962j497n516J2151r794j765P909q118K70l268j118J2259j864j887o36
$$ plain form
573 -17728 -29052 -19117 -8992 -17701 -8606 -10411 -18539 -4129 -10328 -12904 191 -3914 4839 4283
587 4283 -7326 3121 743 8858 19757 2422 11259 12375 3866 21937 11821 10941 25821 12610
601 12610 17404 16086 6626 22797 18825 18504 20729 4345 13989 15571 8943 18931 9094 6302 12473
616 12473 1636 2111 3317 1174 6139 1122 -6048 -8072 -10314 -6578 -3329 -9726 -12729 -12516 -18100
631 -18100 -15545 -14906 -20277 -13558 -14449 -20959 -18592 -26747 -21574 -13332 -19671 -14055 -20535 -25161 -14001
646 -14001 -20672 -14640 -9113 -17615 -6868 -11152 -16724 -5084 -8756 -815 4172 -3902 1365 -2548
660 -2548 1446 11744 5803 12911 14245 7130 14801 13606 13306 21475 21643 22418 20102 17666 20843 21331
676 21331 25255 27119 22982 21981 21835 19724 20561 22973 21236 20914 19675 13445 13679 13384 10987 14858
$$ packed form
573a7728j1324R935J0125q709R095j805q128J4410o199k576J3095m105Q753n56
587D283j1609J0447k378Q115J0899j7335Q837J116q509J8071j0116q80J4880j3211
601A2610M794j318r460J6171l972l21K225j6384R644J582o628R988r837k792O171
616A2473j0837M75J206k143M965n017p170k024k242L736L249o397l003K13n584
631a8100K555O39n371O719q91o510K367q155N173Q242o339N616o480m626J1160
646a4001o671O032N527q502J0747m284n572J1640l672P941M987q074N267l913
660b548L994J0298n941P108J334p115P671j195l00Q169J68P75k316k436L177M88
676B1331L924J864m137j001j46k111Q37K412j737l22j239o230K34k95k397L871
$$ plain form
692 14858 11286 6264 5076 979 1502 1141 -155 103 -7427 -7418 -7850 -15177 -9884 -9875 -15467 -13433 -18680
709 -18680 -22013 -20078 -20138 -17660 -20885 -22377 -21245 -26196 -23240 -20646 -22467 -18430 -19132 -22018 -20721 -20615
725 -20615 -16979 -13580 -12697 -12034 -13319 -12132 -10430 -8158 -3535 -2275 -1556 164 -1533 -539 4399 7332
741 7332 8823 10361 11052 8436 10327 14329 14464 17170 19513 17037 15261 16275 17172 17950 20249 20908
757 20908 17282 15996 16109 14122 15669 17397 15486 13856 11407 8781 8084 8438 8807 7285 5643 2574
773 2574 -764 -763 -1494 -2220 -1193 -3764 -7626 -8972 -9846 -10557 -9732 -9144 -11832 -13477 -14288 -15609 -16140 -13300
791 -13300 -12612 -14063 -14334 -15153 -16752 -14696 -11975 -11376 -10530 -10790 -11475 -11214 -9537 -6756 -5045 -3580 -2433
808 -2433 -4215 -3062 -258 522 4445 6064 5320 6188 5819 7019 9321 11558 13639 12327 11978 12543 11148
$$ packed form
692A4858l572n022j188m097N23l61j296K58p530Rm32p327N293Rn592K034n247
709a8680l333J935o0K478l225j492J132m951K956K594j821M037p02k886J297J06
725b0615L636L399Q83O63j285J187J702K272M623J260P19J720j697R94M938K933
741G332J491J538O91k616J891M002J35K706K343k476j776J014Q97P78K299O59
757B0908l626j286J13j987J547J728j911j630k449k626o97L54L69j522j642l069
773B574l338Jp31p26J027k571l862j346q74p11Q25N88k688j645q11j321n31K840
791a3300O88j451k71q19j599K056K721N99Q46k60o85K61J677K781J711J465J147
808b433j782J153K804P80L923J619p44Q68l69J200K302K237K081j312l49N65j395
$$ plain form
825 11148 14324 16562 14963 16242 15011 12639 12946 14098 14462 14414 14513 11820 8650 9037 8825 8004 9013
842 9013 7637 3134 2226 1706 -1544 -616 687 -3469 -4543 -5627 -10576 -9349 -8196 -9612 -10007 -12219
858 -12219 -13945 -16429 -15717 -13595 -16942 -14491 -13722 -19867 -17376 -16584 -19311 -13382 -13038 -15898 -14290 -15549
874 -15549 -13888 -11649 -10697 -7786 -9034 -7294 -5499 -8843 -3347 -521 -1891 4264 2174 -767 5182
889 5182 5240 7067 11682 9261 10558 11103 11011 14184 13028 16125 19205 14804 17011 16201 13366 19700 19234
906 19234 16777 18764 13439 14522 16448 13067 15627 13439 11323 12803 6884 6789 8556 5021 8470
921 8470 4879 -1105 943 -1879 -1936 85 -5090 -4773 -6058 -9498 -8291 -11877 -11601 -8039 -12364 -13047
937 -13047 -13681 -18789 -14576 -12263 -15813 -13761 -16228 -17470 -13594 -15857 -14388 -12376 -13724 -9267 -12741
$$ packed form
825A1148L176K238j599J279j231k372L07J152L64m8R9k693l170L87k12q21J009
842I013j376m503r08n20l250R28J303m156j074j084m949J227J153j416l95k212
858a2219j726k484P12K122l347K451P69o145K491P92k727N929L44k860J608j259
874a5549J661K239R52K911j248J740J795l344N496K826j370O155k090k941N949
889E182N8J827M615k421J297N45r2L173j156L097L080m401K207q10k835O334m66
906A9234k457J987n325J083J926l381K560k188k116J480n919r5J767l535L449
921H470l591n984K048k822n7K021n175L17j285l440J207l586K76L562m325o83
937a3047o34n108M213K313l550K052k467j242L876k263J469K012j348M457l474
$$ plain form
952 -12741 -14806 -8526 -11373 -5976 -2123 -9838 -4655 -3384 -5646 2664 -958 236 5283 1022 5979
967 5979 3932 2913 12584 7931 10222 12890 4213 12283 14016 10235 16970 11637 11268 15695 10055
982 10055 13063 12676 10828 16150 10714 8620 10084 5533 10842 11381 4557 6542 4041 1470 5145
997 5145 1227 -697 1582 -1638 -2485 -4169 -8166 -4988 -5441 -6918 -5561 -12816 -12217 -7101 -12800 -9653
1013 -9653 -10077 -15403 -9119 -12518 -14977 -10338 -14181 -9193 -7901 -14478 -9243 -12104 -10464 -2359 -9625
1028 -9625 -6571 -4030 -9178 -725 -2844 -4886 2723 -159 2746 3468 -1196 5947 5803 7522 11812
1043 11812 4487 8017 11883 8175 13308 12257 9962 14812 12785 11777 12550 11381 15098 14746 12450
1058 12450 12334 9027 10229 13530 9949 9075 9608 5387 7381 6619 1413 4433 4132 1427 2204 -3457
$$ packed form
952a2741k065O280k847N397L853p715N183J271k262Q310l622J194N047m261M957
967E979k047j019R671m653K291K668q677Q070J733l781O735n333l69M427n640
982A0055L008l87j848N322n436k094J464m551N309N39o824J985k501k571L675
997E145l918j924K279l220q47j684l997L178m53j477J357p255N99N116n699L147
1013i653m24n326O284l399k459M639l843M988J292o577N235k861J640Q105p266
1028i625L054K541n148Q453k119k042P609k882K905P22m664P143j44J719M290
1043A1812p325L530L866l708N133j051k295M850k027j008P73j169L717l52k296
1058A2450j16l307J202L301l581q74N33m221J994p62n206L020l01k705P77n661
$$ plain form
1074 -3457 -3935 -2183 -4373 -1641 -7385 -9557 -5645 -11684 -9146 -8393 -14596 -8856 -10734 -15594 -12197
1089 -12197 -16093 -13577 -10402 -14493 -12334 -15468 -15336 -10091 -14024 -11150 -9582 -12770 -8020 -8915 -11006
1104 -11006 -5957 -5823 -4301 -2803 -4785 -3170 -1617 92 2674 1968 2882 4774 4134 5697 7533 6448
1120 6448 9663 11674 8744 10212 10794 10532 14170 13466 12780 12809 11144 13196 12433 11358 14567 11224 11471
1137 11471 12010 7048 9333 9977 7152 9162 6065 3727 4303 2569 3512 1943 176 1346 -2952 -3023
1153 -3023 -2552 -6546 -3884 -3923 -7832 -6802 -9245 -10195 -8719 -9659 -9463 -10346 -10996 -10984 -12110 -11276 -9865 -11039
1171 -11039 -9621 -9704 -11623 -9821 -8664 -8574 -6005 -5906 -6523 -6015 -5122 -4607 -2989 -1239 -162 -676 306 1373
1189 1373 1122 3753 5443 4783 5984 6644 5850 7383 8904 9011 9860 10350 9177 8962 9665 10170 10377 10761
$$ packed form
1074c457m78J752k190K732n744k172L912o039K538P53o203N740j878m860L397
1089a2197l896K516L175m091K159l134J32N245l933K874J568l188M750q95k091
1104a1006N049J34J522J498j982J615J553J709K582p06R14J892o40J563J836j085
1120F448L215K011k930J468N82k62L638p04o86K9j665K052p63j075L209l343K47
1137A1471N39m962K285O44k825K010l097k338N76j734R43j569j767J170m298p1
1153c023M71l994K662l9l909J030k443r50J476r40J96q83o50J2j126Q34J411j174
1171a1039J418q3j919J802J157R0K569R9o17N08Q93N15J618J750J077n14R82J067
1189A373k51K631J690o60J201O60p94J533J521J07Q49M90j173k15P03N05K07L84
$$ plain form
1207 10761 10947 8851 8527 8920 7972 8252 8969 6507 5744 5476 3617 3813 3286 2817 1155 9 -857 -2471
1225 -2471 -2942 -2525 -4209 -4448 -4954 -7671 -7622 -7879 -8772 -8005 -8560 -9558 -10692 -10985 -10258 -11003 -9675 -9063 -11143
1244 -11143 -10124 -10102 -10972 -8993 -7948 -8120 -7438 -7426 -7179 -6833 -4559 -3391 -3395 -1447 -1604 -1692 319 1223 2103
1263 2103 4012 4878 4438 4822 6310 6872 7815 9898 8823 9019 10145 9667 10329 11451 11802 11411 11537 11339
1281 11339 9835 10627 11898 10339 10526 10226 7849 7978 7565 6958 6850 6295 5394 3031 2306 1914 248
1298 248 1066 577 -2031 -1987 -3504 -5055 -4697 -4909 -5905 -6765 -7540 -8688 -9994 -9195 -9101 -9862 -9673 -10086 -11740
1317 -11740 -11360 -10600 -10553 -9988 -9350 -10365 -10004 -9490 -9655 -7695 -7295 -6600 -6139 -6716 -4932 -4725 -3641 -1188
1335 -1188 -2254 -671 403 -1132 1558 2772 2494 4912 4344 5092 5714 5402 7864 7296 8085 10036 7458
$$ packed form
1207A0761J86k096l24L93r48K80P17k462p63k68j859J96n27m69j662j146q66j614
1225b471m71M17j684k39n06k717M9k57q93P67n55r98j134k93P27p45J328O12k080
1244a1143J019K2q70J979J045j72O82J2K47L46K274J168mJ948j57q8K011R04Q80
1263B103J909Q66m40L84J488N62R43K083j075J96J126m78O62J122L51l91J26j98
1281A1339j504P92J271j559J87l00k377J29m13o07j08n55r01k363p25l92j666
1298B48Q18m89k608M4j517j551L58k12r96q60p75j148j306P99R4p61J89m13j654
1317a1740L80P60M7N65O38j015L61N14j65J960M00O95M61n77J784K07J084K453
1335a188j066J583J074j535K690J214k78K418n68P48O22l12K462n68P89J951k578
$$ plain form
1352 7458 8250 9721 8130 10670 10438 9062 9475 8273 8371 8489 8053 8460 6823 6225 5979 4149 4189 4732
1370 4732 3308 2965 2676 -320 -742 560 -1589 -1210 -1731 -4539 -3752 -4673 -5722 -5693 -6693 -5390 -6928
1387 -6928 -9235 -7190 -10014 -8277 -6090 -9903 -7921 -8271 -10089 -6790 -7995 -7998 -5742 -7290 -4752 -6146
1403 -6146 -7156 -3050 -4594 -2085 -791 -4209 -991 123 -537 2559 1627 2335 4296 3488 3954 4532
1419 4532 5407 7928 7383 7007 7749 6275 8335 10034 7871 8788 9249 7641 9197 8263 6951 8886 8054
1436 8054 7876 6985 4016 5867 5479 4416 5905 1843 1721 3024 -127 1222 250 -2581 -59 -2703
1452 -2703 -4216 -4153 -6416 -4080 -4518 -7350 -5915 -9337 -8932 -6008 -9739 -8420 -7999 -10572 -8177 -9549
1468 -9549 -10695 -8122 -9005 -7658 -7626 -10056 -7606 -7936 -6773 -4100 -6566 -5884 -3011 -5203 -2696 -1495
$$ packed form
1352G458P92J471j591K540k32j376M13j202R8J18m36M07j637n98k46j830M0N43
1370D732j424l43k89k996m22J302k149L79n21k808P87r21j049K9j000J303j538
1387f928k307K045k824J737K187l813J982l50j818L299j205lK256j548K538j394
1403f146j010M106j544K509J294l418L218J114o60L096r32P08J961q08M66N78
1419D532Q75K521n45l76P42j474K060J699k163R17M61j608J556r34j312J935q32
1436H054j78q91k969J851l88j063J489m062j22J303l151J349r72k831K522k644
1452b703j513O3k263K336m38k832J435l422M05K924l731J319M21k573K395j372
1468i549j146K573q83J347L2k430K450l30J163K673k466O82K873k192K507J201
$$ plain form
1484 -1495 -2833 897 1170 241 1501 1113 3357 5197 4414 5837 4753 4827 8468 6610 7205 9776 6983
1501 6983 9441 9591 6952 9399 9567 9127 10522 7588 7960 8086 7373 9403 6944 5799 7765 4504
1517 4504 4659 5208 1901 4250 3840 906 1486 -972 -940 -46 -1746 -1871 -3805 -4865 -3282 -5881 -5978
1534 -5978 -4738 -7302 -5972 -6146 -9450 -8037 -7954 -8208 -6322 -8498 -8842 -8313 -8857 -6800 -7489 -7793 -5461
1551 -5461 -7077 -6269 -4891 -6772 -3798 -2390 -3601 -1973 -2682 -2316 356 362 1097 1639 1507 3421 2685
1568 2685 3271 5471 4259 5831 7321 4600 5906 6931 6599 8219 7897 6976 7456 6674 7395 7707 6791
1585 6791 7529 6512 5786 6392 4066 4741 5935 3623 4069 2988 769 2104 971 273 494 -1316 -957
1602 -957 -2135 -3493 -2581 -4233 -4154 -3296 -6320 -5976 -5964 -7293 -5796 -6537 -7428 -7207 -8177 -7370 -7577 -7548 -6470
$$ packed form
1484a495j338L730K73r29J260l88K244J840p83J423j084P4L641j858N95K571k793
1501F983K458J50k639K447J68m40J395k934L72J26p13K030k459j145J966l261
1517D504J55N49l307K349m10k934N80k458L2Q94j700j25j934j060J583k599r7
1534e978J240k564J330j74l304J413Q3k54J886k176l44N29n44K057o89l04K332
1551e461j616Q08J378j881K974J408j211J628p09L66K672OP35N42j32J914p36
1568B685N86K200j212J572J490k721J306J025l32J620l22r21M80p82P21L12r16
1585F791P38j017p26O06k326O75J194k312M46j081k219J335j133o98K21j810L59
1602i57j178j358R12j652P9Q58l024L44J2j329J497p41q91K21r70Q07k07K9J078
$$ plain form
1621 -6470 -7218 -6504 -5967 -7299 -6332 -4920 -4879 -4111 -3899 -3769 -3432 -2418 -1317 -951 101 625 456 1242
1639 1242 2073 2291 3586 4893 4533 4311 5467 5264 5990 8046 7034 7273 7895 6965 7501 7676 8089 7994
1657 7994 7560 7647 6482 6067 7103 6088 6225 6691 4044 4188 4164 2987 3225 2578 1848 1114 -320 -432
1675 -432 -1912 -1501 -1054 -3020 -3317 -3979 -5559 -5035 -5348 -5882 -6251 -6658 -6763 -7820 -7489 -7458 -7985 -6935 -7406
1694 -7406 -8457 -7725 -7589 -7636 -6673 -6091 -6359 -6353 -5570 -5824 -5012 -3191 -3346 -3156 -2011 -2072 -1809 -562 410 1027
1714 1027 1320 2544 2034 2557 4044 3886 4806 5657 5199 5791 6027 6375 6751 7343 7779 6818 7045 6989 6857
1733 6857 7343 7827 6873 6530 6334 5277 5244 5460 4985 4212 4232 3219 1938 1952 1631 802 832 202 -1127 -1834
1753 -1834 -1942 -3156 -2947 -2705 -4063 -4618 -5012 -5651 -5795 -5621 -5717 -6339 -6636 -6447 -7411 -6933 -6011 -6675 -5930
$$ packed form
1621f470p48P14N37j332R67J412M1P68K12J30L37J014J101L66J052N24j69P86
1639A242Q31K18J295J307l60k22J156k03P26K056j012K39O22r30N36J75M13r5
1657G994m34Q7j165m15J036j015J37M66k647J44k4j177K38o47p30p34j434j12
1675d32j480M11M47j966k97o62j580N24l13n34l69m07j05j057L31L1n27J050m71
1694g406j051P32J36m7R63N82k68OP83k54Q12J821j55J90J145o1K63J247R72O17
1714A027K93J224n10N23J487j58R20Q51m58N92K36L48L76N92M36r61K27n6j32
1733F857M86M84r54l43j96j057l3K16m75p73K0j013j281J4l21q29L0o30j329p07
1753a834j08j214K09K42j358n55l94o39j44J74r6o22k97J89r64M78R22o64P45
$$ plain form
1772 -5930 -5667 -6593 -6169 -5290 -5077 -4227 -3839 -3668 -3575 -3288 -2285 -2035 -968 -263 -509 363 950 651 2064
1791 2064 2932 2945 3457 3930 3790 4162 5125 5469 5681 6140 6194 5628 5787 6352 6443 6385 6825 5656 5614 5985 5133
1812 5133 5239 5318 4545 4206 3591 2995 2796 1867 2599 1405 521 700 -1174 -772 -412 -2386 -1750 -2488 -4004
1831 -4004 -3648 -4591 -4651 -4644 -5188 -4884 -6014 -6770 -6337 -6710 -6327 -5598 -6753 -6627 -5986 -6695 -5980 -5421 -5320 -4969
1851 -4969 -4509 -4584 -4371 -3904 -2651 -2479 -2377 -1512 -1852 -1099 879 115 968 2416 1494 2728 3092 3232 4375
1870 4375 4725 5537 5667 4770 6084 5994 6338 7688 5910 6523 7380 5640 6785 6788 5637 6695 6179 5250
1888 5250 5097 3856 4776 4349 3628 3885 1995 1238 2026 606 561 750 -885 -856 -1491 -3149 -2812 -3114 -3634
1907 -3634 -3605 -5258 -5161 -5562 -5987 -4689 -6297 -6707 -5490 -7073 -6544 -5883 -7254 -6111 -5527 -6305 -5641 -6441
$$ packed form
1772e930K63r26M24Q79K13Q50L88J71R3K87J003K50J067P05k46Q72N87k99J413
1791B064Q68J3N12M73j40L72R63L44K12M59N4n66J59N65R1n8M40j169m2L71q52
1812E133J06P9p73l39o15n96j99r29P32j194q84J79j874M02L60j974O36p38j516
1831d004L56r43o0Pn44L04j130p56M33l73L83P29j155J26O41p09P15N59J01L51
1851d969M60p5K13M67J253J72J02Q65l40P53J978p64Q53J448r22J234L64J40J143
1870D375L50Q12J30q97J314r0L44J350j778O13Q57j740J145Lj151J058n16r29
1888E250j53j241R20m27p21K57j890p57P88j420m5J89j635K9o35j658L37l02n20
1907c634K9j653R7m01m25J298j608m10J217j583N29O61j371J143N84p78O64q00
$$ plain form
1925 -6441 -5688 -4479 -4767 -3790 -4141 -4169 -2164 -3049 -2245 -629 -1440 -115 706 -565 1073 1716 2143 3253
1943 3253 2845 3487 3667 3764 5397 4740 4760 6307 5193 5401 6522 4926 6140 7180 5773 6123 5558 5119
1961 5119 6179 5028 5212 4791 3574 4716 3435 2420 3383 1697 1861 2297 -366 147 -54 -1121 -478
1978 -478 -1683 -2384 -2122 -3562 -2656 -3632 -4563 -3475 -4779 -4815 -4436 -6275 -5262 -4665 -5592 -5226 -5731 -6252
1996 -6252 -5203 -5249 -4583 -4476 -4981 -3754 -3969 -3911 -2858 -2878 -2361 -796 -1974 -1515 -427 -546 780 1287
2014 1287 1038 1855 2074 2411 2726 2613 4002 4010 3976 4836 4157 4402 6052 4985 5605 6046 4604 5274 5244 5139
2034 5139 5460 4619 5206 4550 3743 4325 3052 2974 3884 1927 1749 1690 55 1084 564 -471 -650 -1299 -1856
$$ packed form
1925f441P53J209k88R77l51k8K005q85Q04J616q11J325Q21j271J638O43M27J110
1943C253m08O42J80R7J633o57K0J547j114K08J121j596J214J040j407L50n65m39
1961E119J060j151J84m21j217J142j281j015R63j686J64M36k663N13k01j067O43
1978d78j205p01K62j440R06r76r31J088j304l6L79j839J013N97r27L66n05n21
1996f252J049m6O66J07n05J227k15N8J053k0N17J565j178M59J088j19J326N07
2014A287k49Q17K19L37L15j13J389Ql4Q60o79K45J650j067O20M41j442O70l0j05
2034E139L21q41N87o56q07N82j273p8R10j957j78n9j635J029n20j035j79o49n57
$$ [...]
8191A86
##END NTUPLES=NMR FID
##END=
