##TITLE=1H_SR8_2
 CDCl3, 8 sc, 
 5.2.2020
##JCAMPDX= 6.0         $$ Bruker NMR JCAMP-DX V2.0
##DATA TYPE= NMR FID
##DATA CLASS= NTUPLES
##ORIGIN= UXNMR, Bruker Analytische Messtechnik GmbH
##OWNER= root
$$ XWIN-NMR		Version 3.5
$$ Wed Feb  5 14:01:01 2020 Russian Standard Time (UT+4h)  she@DPX200
##.OBSERVE FREQUENCY= 200.1315
##.OBSERVE NUCLEUS= ^1H
##.DELAY= (6, 6)
##.ACQUISITION MODE= SIMULTANEOUS
##.ACQUISITION SCHEME= undefined
##.AVERAGES= 8
##.DIGITISER RES= 18
##SPECTROMETER/DATA SYSTEM= spect
##.PULSE SEQUENCE= zg30
##.SOLVENT NAME= D2O
##.SHIFT REFERENCE= (INTERNAL, D2O, 0, 15.7039)
##AUDIT TRAIL= $$ (NUMBER, WHEN, WHO, WHERE, WHAT)
$$ ##TITLE= Audit trail, XWIN-NMR		Version 3.5
$$ ##JCAMPDX= 5.01
$$ ##ORIGIN= Bruker BioSpin GmbH
$$ ##OWNER= she
$$ F:/spectra/data/she/nmr/H-F/1/audita.txt
$$ ##AUDIT TRAIL=  $$ (NUMBER, WHEN, WHO, WHERE, WHAT)
(   1,<2020-02-05 13:59:47.21 +0400>,<she>,<DPX200>,
      <created by zg, POWCHK disabled, PULCHK disabled
       configuration hash MD5:
       00 E9 B6 7A A2 85 ED C7 34 08 36 98 17 FE 4E 26
       data hash MD5: 16K
       0C 21 3A 5B 19 D4 51 A4 5D 5F 4A 19 96 15 D6 B1>)
$$ ##END=
$$ 
$$ hash MD5
$$ E4 00 A2 00 49 92 90 FA E3 99 82 50 69 5A F5 74
##$RELAX= 
##$RELAX= 
##$RELAX= 
##$RELAX= 
##$RELAX= 
##$RELAX= 
$$ Bruker specific parameters
$$ --------------------------
##$DU= <F:/spectra>
##$EXPNO= 1
##$NAME= <H-F>
##$PROCNO= 1
##$TYPE= <nmr>
##$USER= <she>
##$AMP= (0..31)
100 100 100 100 100 100 100 100 100 100 100 100 100 100 100 100 100 100 
100 100 100 100 100 100 100 100 100 100 100 100 100 100 
##$AQSEQ= 0
##$AQ_mod= 1
##$AUNM= <au_zg>
##$AUTOPOS= <>
##$BF1= 200.13
##$BF2= 200.13
##$BF3= 200.13
##$BF4= 200.13
##$BF5= 200.13
##$BF6= 200.13
##$BF7= 200.13
##$BF8= 200.13
##$BYTORDA= 1
##$CFDGTYP= 0
##$CFRGTYP= 5
##$CHEMSTR= <none>
##$CNST= (0..31)
1 1 145 1 1 1 1 1 1 1 1 1 1 1 1 1 1 1 1 1 1 1 1 1 1 1 1 1 1 1 1 1 
##$CPDPRG= <>
##$CPDPRG1= <>
##$CPDPRG2= <>
##$CPDPRG3= <>
##$CPDPRG4= <mlev>
##$CPDPRG5= <mlev>
##$CPDPRG6= <mlev>
##$CPDPRG7= <mlev>
##$CPDPRG8= <mlev>
##$CPDPRGB= <>
##$CPDPRGT= <>
##$D= (0..31)
0 1.2 0 0 0 0 0 0 0 0.06 0 0.03 0 0 0 0 0.0002 0 0 0 0 0 0 0 0 0 0 0 0 
0 0 0 
##$DATE= 1580896786
##$DBL= (0..7)
120 120 120 120 120 120 120 120 
##$DBP= (0..7)
150 150 150 150 150 150 150 150 
##$DBP07= 0
##$DBPNAM0= <>
##$DBPNAM1= <>
##$DBPNAM2= <>
##$DBPNAM3= <>
##$DBPNAM4= <>
##$DBPNAM5= <>
##$DBPNAM6= <>
##$DBPNAM7= <>
##$DBPOAL= (0..7)
0.5 0.5 0.5 0.5 0.5 0.5 0.5 0.5 
##$DBPOFFS= (0..7)
0 0 0 0 0 0 0 0 
##$DE= 6
##$DECBNUC= <off>
##$DECIM= 24
##$DECNUC= <off>
##$DECSTAT= 4
##$DIGMOD= 1
##$DIGTYP= 9
##$DL= (0..7)
0 120 120 120 120 120 120 120 
##$DP= (0..7)
150 150 150 150 150 150 150 150 
##$DP07= 0
##$DPNAME0= <>
##$DPNAME1= <>
##$DPNAME2= <>
##$DPNAME3= <>
##$DPNAME4= <>
##$DPNAME5= <>
##$DPNAME6= <>
##$DPNAME7= <>
##$DPOAL= (0..7)
0.5 0.5 0.5 0.5 0.5 0.5 0.5 0.5 
##$DPOFFS= (0..7)
0 0 0 0 0 0 0 0 
##$DQDMODE= 0
##$DR= 18
##$DS= 0
##$DSLIST= <SSSSSSSSSSSSSSS>
##$DSPFIRM= 0
$$ [...]
##$SUBNAM2= <"">
##$SUBNAM3= <"">
##$SUBNAM4= <"">
##$SUBNAM5= <"">
##$SUBNAM6= <"">
##$SUBNAM7= <"">
##$SUBNAM8= <"">
##$SUBNAM9= <"">
##$SW= 24.9337058887773
##$SWIBOX= (0..15)
0 0 2 0 0 0 0 0 0 0 0 0 0 0 0 0 
##$SW_h= 4990.01996007984
##$TD= 16384
##$TD0= 1
##$TE= 0
##$TE2= 300
##$TE3= 300
##$TEG= 300
##$TL= (0..7)
0 120 120 120 120 120 120 120 
##$TP= (0..7)
150 150 150 150 150 150 150 150 
##$TP07= 0
##$TPNAME0= <>
##$TPNAME1= <>
##$TPNAME2= <>
##$TPNAME3= <>
##$TPNAME4= <>
##$TPNAME5= <>
##$TPNAME6= <>
##$TPNAME7= <>
##$TPOAL= (0..7)
0.5 0.5 0.5 0.5 0.5 0.5 0.5 0.5 
##$TPOFFS= (0..7)
0 0 0 0 0 0 0 0 
##$TUNHIN= 0
##$TUNHOUT= 0
##$TUNXOUT= 0
##$USERA1= <user>
##$USERA2= <user>
##$USERA3= <user>
##$USERA4= <user>
##$USERA5= <user>
##$V9= 5
##$VALIST= <valist>
##$VCLIST= <CCCCCCCCCCCCCCC>
##$VD= 0
##$VDLIST= <DDDDDDDDDDDDDDD>
##$VPLIST= <PPPPPPPPPPPPPPP>
##$VTLIST= <TTTTTTTTTTTTTTT>
##$WBST= 1024
##$WBSW= 4
##$XGAIN= (0..3)
0 0 0 0 
##$XL= 0
##$YL= 0
##$YMAX_a= 708707
##$YMIN_a= -350347
##$ZGOPTNS= <>
##$ZL1= 120
##$ZL2= 120
##$ZL3= 120
##$ZL4= 120
##$ABSF1= 10
##$ABSF2= 0
##$ABSG= 5
##$ABSL= 3
##$ALPHA= 0
##$AQORDER= 0
##$ASSFAC= 0
##$ASSFACI= 0
##$ASSFACX= 0
##$ASSWID= 0
##$AUNMP= <proc_1d>
##$AZFE= 0.1
##$AZFW= 0.1
##$BCFW= 1
##$BC_mod= 2
##$BYTORDP= 1
##$COROFFS= 0
##$CY= 11.3945322036743
##$DATMOD= 1
##$DC= 2
##$DFILT= <>
##$DTYPP= 0
##$F1P= 16.9975609425685
##$F2P= -3.02152046262296
##$FCOR= 0.5
##$FTSIZE= 0
##$FT_mod= 4
##$GAMMA= 1
##$GB= 0.15
##$INTBC= 1
##$INTSCL= 1
##$ISEN= 128
##$LB= 0.24
##$LEV0= 0
##$LPBIN= 0
##$MAXI= 10000
##$MC2= 0
##$MEAN= 0
##$ME_mod= 0
##$MI= 1.114404
##$NCOEF= 0
##$NC_proc= 0
##$NLEV= 6
##$NOISF1= 3.799351
##$NOISF2= 2.8
##$NSP= 1
##$NTH_PI= 0
##$NZP= 0
##$OFFSET= 15.70392
##$PC= 1
##$PHC0= -9784.442
##$PHC1= 13.80081
##$PH_mod= 1
##$PKNL= yes
##$PPARMOD= 0
##$PSCAL= 0
##$PSIGN= 0
##$REVERSE= no
##$SF= 200.130013532006
##$SI= 16384
##$SIGF1= 3
##$SIGF2= 2
##$SINO= 400
##$SIOLD= 16384
##$SREGLST= <1H.CDCl3>
##$SSB= 0
##$STSI= 0
##$STSR= 0
##$SW_p= 3612.71676300578
##$SYMM= 0
##$S_DEV= 0
##$TDeff= 0
##$TDoff= 0
##$TI= <>
##$TILT= no
##$TM1= 0
##$TM2= 0
##$TOPLEV= 0
##$USERP1= <user>
##$USERP2= <user>
##$USERP3= <user>
##$USERP4= <user>
##$USERP5= <user>
##$WDW= 1
##$XDIM= 8192
##$YMAX_p= 0
##$YMIN_p= 0
$$ End of Bruker specific parameters
$$ ---------------------------------
##NTUPLES= NMR FID
##VAR_NAME=  TIME,          FID/REAL,        FID/IMAG
##SYMBOL=    X,             R,               I
##VAR_TYPE=  INDEPENDENT,   DEPENDENT,       DEPENDENT
##VAR_FORM=  AFFN,          ASDF,            ASDF
##VAR_DIM=   8192,          8192,            8192
##UNITS=     SECONDS,       ARBITRARY UNITS, ARBITRARY UNITS
##FACTOR=    0.0002004,     1,               1
##FIRST=     0,             0,               0
##LAST=      1.6414764,     0,               0
##MIN=       0,             -350347,         0
##MAX=       1.6414764,     708707,          0
$$ Real data points
##PAGE= N=1
##DATA TABLE= (X++(R..R)), XYDATA
0 0 0 0 0 0 -8 8 -8 8 -16 23 -24 32 -40 48 -57 71 -86 102 -121 142 -167 198 -225 261 -302 347 -395 448
28 448 -508 578 -649 730 -821 919 -1027 1145 -1272 1416 -1569 1740 -1929 2135 -2362 2616
44 2616 -2897 3213 -3568 3970 -4430 4962 -5586 6330 -7235 8364 -9815 11765 -14534 18803
58 18803 -26301 43302 -161831 196771 385954 -264922 -238899 183435 107727 -350347 -269417
69 -269417 60638 66021 -123921 -39420 73780 -66080 -212535 28217 295607 119844 -207606
80 -207606 -110687 96916 -58582 -190532 125866 341487 76755 -121824 52811 108568
90 108568 -76141 -74289 131325 171866 52505 -14588 -2543 64568 165608 169697 62660
101 62660 13931 64861 90003 62123 60719 123276 198155 187431 85754 24106 45897 66902
113 66902 105832 185360 160089 50478 102866 232129 118805 -60813 66579 262933 144760
124 144760 -27449 79568 208613 107093 19906 137019 231937 121188 -16115 24289
134 24289 124668 80544 10649 133779 269144 148942 -9020 60630 113828 -16262 -14435
145 -14435 179343 175204 -20655 -6820 161322 135481 1443 28664 125872 90441 -28062
156 -28062 -66242 21902 120560 99821 37225 68697 83026 -28633 -74516 35939 66836 -23924
168 -23924 -1392 93312 42780 -47254 4121 69643 27270 -24805 -30089 -27020 -11878 -4311 -17375
181 -17375 22008 79312 18405 -75891 -38712 4069 -72525 -90559 23614 56814 -25380 -38818
193 -38818 2122 -27233 -70414 -50125 -23592 -25189 -36194 -49580 -36617 -5359 -22826 -47428
205 -47428 3272 18905 -84398 -129479 -39642 -8308 -65318 -33159 43790 2815 -73677 -65014
217 -65014 -47203 -67204 -59253 -33904 -32125 -29958 -32540 -47267 -25911 745 -40840 -81849 -52130
230 -52130 -44290 -83315 -56305 9179 -3942 -37090 -19928 -28674 -70255 -62136 -40585 -53977 -41408
243 -41408 -11939 -36599 -49367 -2907 -5494 -62589 -51774 -14181 -53538 -82091 -31789 -5660
255 -5660 -30627 -21773 1945 -16717 -39624 -49081 -63144 -49975 -21001 -31439 -31115 19026 14854
268 14854 -52690 -48152 1270 -35479 -75815 -16788 17584 -36299 -43118 13606 11385 -27540 -21387
281 -21387 -8703 -26030 -37386 -36089 -22961 10720 18191 -10909 -3335 24158 -14402 -54156 -12062
294 -12062 14409 -27995 -22994 34890 28848 -7108 13218 26223 -10322 -23471 -6142 -4948 3993
307 3993 27611 24277 20998 41061 26272 -10098 4920 26297 -2697 -5933 38194 40766 18305
320 18305 40801 55000 22350 14632 30372 11694 3324 33173 36182 23507 53416 68785 33764
333 33764 29287 51758 22005 -6381 28565 49244 28774 46180 76285 52082 31539 45315
345 45315 32184 9378 31549 44773 26431 42700 69492 45962 32591 58506 44458 6264
357 6264 24657 46639 18867 20037 58797 50257 24997 44808 48018 14724 15211 31247 10398
370 10398 7327 41006 40513 22021 40304 42997 4585 -2028 16474 -466 -7493 26983 31777
383 31777 7541 20721 31538 -1415 -13406 4605 -9426 -24338 2103 11858 -7573 5362
395 5362 22265 -6664 -24778 -8914 -19450 -39382 -20013 -7677 -24026 -13446 6633 -11800
407 -11800 -25551 -11775 -24479 -51088 -38658 -27665 -42839 -29322 -536 -13933 -30369 -16754
419 -16754 -28352 -58466 -49737 -32255 -45921 -39247 -12093 -19812 -36856 -24189 -27625 -52336 -43657
432 -43657 -28990 -47212 -48060 -21425 -26351 -41254 -20053 -14430 -42336 -40999 -24437 -44217 -52868
445 -52868 -22053 -15902 -32106 -17114 -7565 -32716 -35665 -17607 -33261 -43825 -15480 -8224 -27491
458 -27491 -11848 6402 -17424 -27640 -8601 -21595 -40496 -12854 6865 -9872 -3200 17280
470 17280 -786 -16839 -3554 -8889 -23272 -832 12478 -8145 -1254 26791 12869 -3885
482 -3885 16817 16003 -13226 -5657 14450 -1046 -1667 30756 33741 15457 21676 22135 636 676 11263
497 11263 896 7992 36361 29922 13417 33173 36093 2932 1879 28032 14721 -1461 23038
510 23038 34087 16498 22283 35498 18774 9769 21425 14667 4582 17284 20848 15612 31126
523 31126 34534 7819 9648 34936 15311 -12365 11396 29963 8648 9564 32055 20918 5325
536 5325 19041 15338 -6739 1019 17860 11113 13221 25201 12907 3686 15573 6161 -14547
549 -14547 1891 18075 531 2013 25303 13789 -6751 9555 14542 -10061 -5847 12039 -3799
562 -3799 -9484 17152 14829 -9122 5480 22285 -1662 -17993 -4774 -4160 -8663 5234 10519
575 10519 4014 12321 12701 -7427 -10175 -2798 -16621 -12962 17373 8870 -19927 4848 31834 -4525
589 -4525 -27842 6127 13314 -21950 -18721 12277 7088 -8064 3839 14009 4231 -9891 -17611
602 -17611 -8472 5632 -7398 -19922 8986 23797 -11796 -18869 20602 10500 -35775 -16641
614 -16641 21758 -8346 -36610 3430 29257 -15 -15392 -708 -2684 -17434 -20985 -12458 2417
627 2417 7163 -5854 -6190 8181 -9484 -34326 -8248 15856 -16962 -32935 3687 6596 -28133
640 -28133 -15949 14397 -4090 -23440 -7262 -9882 -32001 -21003 -1097 -5793 -6642 -285 -13214
653 -13214 -23732 -15577 -17508 -24522 -11667 -4529 -13770 -10061 -6517 -21629 -17923 1114 -15332 -35226
667 -35226 -12790 -1992 -29497 -20983 15503 -1038 -33510 -12357 3269 -30516 -37743 -327
679 -327 7953 -15709 -15365 -496 -4974 -17473 -18668 -6171 4442 -11817 -30252 -8421 15230
692 15230 -10004 -21812 20610 26712 -26059 -32962 8035 471 -26734 4201 36524 9734 -12978
705 -12978 3034 7851 -8118 -8073 7108 17212 14087 -1768 -3658 21004 24718 -661 4422 30721
719 30721 11702 -18560 2526 28424 15682 14433 33994 25976 6045 10231 11687 4548 18671
732 18671 29385 15488 16411 32060 19331 6947 29898 35532 6211 3089 25320 20287 7396
745 7396 24400 41183 33917 20885 8738 5238 18648 20356 6540 21496 46513 23757 -6269
758 -6269 17488 36706 7474 1963 33448 25004 -8893 1493 27073 17804 9675 24872 25789
771 25789 8074 -4711 -8174 2321 18688 14318 4390 18156 22004 -8460 -17263 8258 10545
784 10545 -7453 2098 12219 -6671 -10743 6474 2548 -7114 4508 1718 -19973 -16768 -2251
797 -2251 -10199 -9310 9302 2001 -19360 -14249 -7456 -21553 -20505 -2083 -3592 -14087 -14092 -15382 -15241
812 -15241 -6570 -11333 -23099 -12558 -7555 -31521 -32128 736 716 -23307 -10952 1964 -28158 -42827
826 -42827 -13585 -5258 -23160 -13457 4675 -10060 -28411 -21991 -13017 -11713 -13815 -18413 -13574 -4787
840 -4787 -17711 -28632 -4062 11113 -14361 -23359 -514 -10041 -36889 -17176 11821 -3943 -15903
853 -15903 5562 4268 -21312 -20523 -3773 -4238 -6713 -2915 -3784 -1975 1982 -5636 -7455 7148 3250
868 3250 -15641 -8887 5927 -4491 -6458 14274 13580 -4682 -848 4624 -10159 -7870 11160 6559
882 6559 -3365 9510 11207 -5258 580 14988 3304 -5713 7228 6049 -8149 -827 14608
895 14608 13112 10510 8921 -182 -1308 2503 -6503 -4594 18401 19076 -2871 4021 19485 -2182
909 -2182 -15623 10941 18116 -7981 -6497 15625 8073 -5982 6410 15587 5540 -535 -1220 -3121
923 -3121 1049 1234 -2381 8999 19609 1107 -10577 9063 10294 -13925 -8059 15196 4703
936 4703 -9903 8025 15415 -2524 -2120 9793 71 -8897 -282 2221 841 9064 8759 -1157 3961
951 3961 8333 -5582 -7715 7746 5041 -4485 6522 11231 -1568 827 12162 2981 -4430 6616
965 6616 4134 -6934 4019 13692 1311 2580 18054 8983 -6891 1582 7307 -3759 156 14279
979 14279 10547 5507 12206 8250 -390 4368 3799 -2917 7307 15509 2187 766 17945 12195
993 12195 -4989 5417 14718 -1535 -4586 11452 8358 -1702 9521 16122 5455 3787 6911
1006 6911 -1015 -1493 6473 1665 -1641 12087 12773 -850 4177 11860 -2873 -9220 5327 3192
1020 3192 -8920 1949 12898 1731 -1536 6140 -2087 -10556 -1597 -100 -8784 -1668 5994 -4075
1034 -4075 -5567 3499 -3769 -12277 -1815 -824 -15163 -10820 369 -7077 -9720 2264 -1294 -13338
1048 -13338 -7022 -4972 -18450 -15996 -2890 -7625 -12033 -1106 -2721 -15845 -11088 -5412 -17678
1061 -17678 -18752 -4974 -8230 -14955 -4654 -3201 -15225 -11416 -4575 -15543 -18166 -5361 -7966
1074 -7966 -16375 -6529 -2029 -13667 -11170 -1127 -10159 -16411 -5933 -6148 -15609 -7025 676 -7974
1088 -7974 -7630 2489 -5799 -14784 -5596 -3705 -12195 -3684 5684 -3629 -4954 5487 -702 -11469
1102 -11469 -2233 2182 -6841 -2041 8987 1623 -2175 8549 5377 -6053 1007 7339 -2066 -365
1116 -365 11195 5274 390 11374 11274 -350 5087 12129 1026 -1476 10506 8503 2197 13229
1130 13229 16838 5484 7178 13072 2389 -1085 11182 11018 3856 13445 18534 6285 6231 14113
1144 14113 4846 -1080 10782 12149 2249 8447 17105 7655 4608 12658 7605 347 8020 8849 -700
1159 -700 5530 13729 4700 2738 13182 8273 -2507 4208 7275 -4808 -1585 10829 4945 -646
1173 -646 9362 8585 -3881 -1594 2852 -5161 -3951 5770 1697 -2617 6361 4832 -7647 -3196 3057
1188 3057 -6737 -8844 2649 -140 -7697 820 3609 -7563 -6044 2268 -6013 -10966 -1993 -2942 -10261
1203 -10261 -2379 2429 -6753 -4842 3391 -6048 -14739 -4337 -2324 -11178 -5106 4411 -2804 -5639
1217 -5639 349 -6167 -12820 -3700 -1653 -10272 -3695 5419 -4146 -7910 2739 -784 -11413 -3017
1231 -3017 2796 -8357 -8305 4043 671 -5780 1398 3094 -4428 -2447 -122 -7420 -3829 5504 -1233
1246 -1233 -5329 7521 7529 -6340 -1704 7347 -3638 -9055 4024 4627 -3845 3003 10514 1943 -952
1261 -952 3475 -2019 -4551 3140 2030 -1307 8418 9466 -3686 -1888 9097 760 -7677 3932
1275 3932 8432 -3507 -2028 6718 1915 -476 7417 4369 -3599 415 461 -6696 -947 7521 1052
1290 1052 10 9515 2600 -10364 -3040 4673 -4953 -5533 5565 3221 -4354 596 2124 -3937 -1067
1305 -1067 947 -7328 -5456 2783 -3794 -7678 5276 5944 -8279 -5553 3477 -6004 -11857 910
1319 910 3411 -6624 -3363 2576 -3346 -4567 -159 -3405 -5082 -154 -5123 -10857 461 6092 -4643
1334 -4643 -3294 7331 -2375 -14128 -4013 2456 -5871 -2048 7945 1690 -5200 -530 -1877 -5889
1348 -5889 1205 3741 -3617 -448 5422 -3511 -5267 7841 7482 -3689 566 6096 -4180 -6265
1362 -6265 4997 6777 3088 7204 6378 -1361 1389 3718 -2643 1752 12128 5135 -2500 8699
1376 8699 11335 -1890 1248 13225 5224 -4998 3913 9372 2669 4467 11883 9057 5127 3831
1390 3831 -550 1557 9021 5329 1217 11574 12438 -2914 -797 14064 6532 -4943 6421 11824
1404 11824 -3175 -4459 9249 9236 2644 7126 7183 -966 -2200 -1597 -2938 3858 9405 2525 367
1419 367 6871 -35 -9740 -309 6844 -3226 -4320 4634 -205 -7627 256 3995 -3657 -1960 1443
1434 1443 -8300 -11085 -604 -1640 -6840 1537 4593 -7694 -9873 -2393 -5999 -10518 -4153 -1465
1448 -1465 -6388 -5844 -4287 -7203 -4056 -936 -9130 -10964 -2750 -7506 -16174 -3477 6218 -7130 -11914
1463 -11914 801 -3532 -17936 -10780 1510 -3926 -8540 -2698 -2447 -7828 -7326 -5798 -3838 -731
1477 -731 -4731 -11060 -4467 -270 -9063 -7173 8236 3651 -12172 -6409 2800 -8151 -11709 4211
1491 4211 6711 -3548 -1734 3042 -3423 -5461 -205 -225 -34 3035 -387 -2835 4658 4836 -2705 1931
1507 1931 8356 -1312 -5658 4465 5456 -1652 4583 10971 2394 -1131 6000 2464 -1627 6556 7473
1522 7473 -15 3699 9919 3224 515 9353 8512 -441 2028 6061 855 1959 9208 7860 5550
1537 5550 7611 2978 -1958 4191 5199 -1194 5286 13446 3287 -3686 7087 8160 -3584 224
1551 224 10743 3407 -4564 2907 5724 506 2274 6146 3100 1555 858 -3660 -1813 4867 968
1566 968 -2397 6716 6393 -5712 -3833 5901 -1237 -8142 1959 4880 -4469 -2176 4534 -541 -3981
1581 -3981 891 -1403 -6194 -1836 -307 -4445 148 4286 -2796 -5050 1514 -1471 -7804 -1341 2230
1596 2230 -4739 -3966 2059 -1568 -4544 2237 667 -5696 -1601 436 -6845 -5188 4105 862 -4164
1611 -4164 3129 3809 -6203 -5561 1714 -2080 -4407 2994 3441 -1604 842 1933 -2768 -717 3404
1626 3404 -1995 -2689 4049 1608 -4408 3190 7299 -1760 -2034 5913 920 -5538 1577 5107 -957
1641 -957 1082 6548 2455 -443 3300 981 -2570 2159 2958 -1951 2132 7646 1305 -1136 5609
1656 5609 2697 -4948 297 4718 -1304 -483 6222 3024 -1812 3041 2142 -3697 -457 3710 -1892
1671 -1892 -2002 4165 687 -3756 2824 3702 -4247 -2242 2818 -3513 -6006 976 712 -3439 1059 2695
1687 2695 -3966 -3866 -74 -5177 -6857 284 167 -5208 -629 2646 -5312 -6714 -82 -3651 -8313
1702 -8313 -2401 326 -5951 -4210 930 -3855 -5750 -849 -3293 -7581 -3049 -1729 -6938 -4143 1329
1717 1329 -3636 -5980 446 -1610 -8085 -4311 -625 -6453 -5527 1632 -923 -4821 657 312 -6737
1732 -6737 -4013 159 -4386 -4363 3296 744 -3963 984 2003 -4315 -2798 2477 -1440 -3159 3065
1747 3065 2309 -2372 2525 4610 -1746 -296 5128 511 -2765 4076 4412 -1430 3117 7978 2000
1762 2000 358 6051 3017 -1907 3049 6000 1716 3841 8282 3917 1711 6028 3603 -538 4948
1777 4948 7047 1596 4017 9425 4091 542 6365 6121 -131 3644 7905 2569 1849 7626 5047
1792 5047 1316 5321 6365 866 2134 5609 1495 861 6208 4407 245 4976 5911 -875 184
1807 184 4818 117 -1981 4585 4518 -825 2548 5120 -1884 -2758 2319 -485 -3553 1831 2830 -1912
1823 -1912 29 2822 -2595 -3824 1416 -1135 -5302 -387 896 -4546 -2087 1830 -2886 -4732 633
1838 633 -1826 -7379 -2762 -266 -5565 -4445 2031 -1851 -5430 -1238 -1950 -7553 -4837 -663 -4783
1853 -4783 -4828 608 -1512 -5547 -1743 -1781 -7050 -4295 -354 -4798 -5331 1029 -1048 -5980 -1366 662
1869 662 -5626 -4407 596 -3092 -5436 66 490 -4116 -1156 1890 -2802 -3443 766 -2078 -4852 511
1885 511 1067 -3063 486 3671 -1225 -2963 2013 -295 -4678 577 3409 -1115 360 4537 411
1900 411 -2408 2589 1700 -2805 1594 4366 -499 -592 4687 1168 -1306 3628 3846 -1684 434 4237
1916 4237 -187 -769 4178 2704 -5 3386 3452 -2121 -82 3686 -987 -1459 5041 3444 -1748 2241
1932 2241 4376 -2270 -2247 3220 412 -2494 2178 3138 -1560 305 2948 -1646 -1942 1542 -1356 -2948
1948 -2948 1934 1091 -3657 34 3753 -2495 -3924 1889 227 -5686 -1400 1506 -3118 -2951 2198
1963 2198 -321 -3299 76 -809 -4609 -2194 -437 -3308 -1645 2967 -910 -4144 293 -589 -6150
1978 -6150 -2996 1915 -1937 -3190 2002 198 -4333 -991 976 -3095 -1817 1964 -2305 -3798 1472
1993 1472 859 -2844 1139 3354 -1791 -2230 1655 -588 -3079 1609 2847 -285 1343 2978 -1064
2008 -1064 -841 3135 -179 -1852 3862 4327 -1494 988 6222 1362 -1765 3667 3680 -1437 924 4827
2024 4827 2968 1818 4413 2707 1366 3415 1686 80 4516 5508 -381 1201 6748 2415 -1655
2039 -1655 4955 6884 -530 -284 4922 2247 -310 4059 5660 2648 2980 2418 -520 652 2788 231
2055 231 1361 6211 3132 -2333 1516 4048 -1582 -1747 4462 2028 -2547 531 2567 -1131 -11
2070 -11 2436 -577 -1252 891 -2132 -4037 1180 2089 -3238 -891 3264 -2268 -5671 -187 277 -4543
2086 -4543 -2430 605 -2264 -2947 -795 -1949 -3033 -763 -2916 -6227 -2092 -389 -5466 -3462 2808
2101 2808 -1273 -7271 -2654 -297 -6023 -5817 456 -794 -4160 -2694 -2326 -3838 -1991 -1682 -3499 -1602
2117 -1602 -731 -5390 -5363 567 -270 -4665 24 2970 -4569 -6199 -198 -706 -3715 93 2701 -845
2133 -845 -1488 -49 -2471 -2083 1959 -80 -2442 1671 1950 -2791 -763 4238 980 -2471 2113 2058
2149 2058 -2404 -517 3201 1357 1279 3929 1017 -678 2756 1757 -1307 2979 5291 -373 -674 5418
2165 5418 3218 -1219 2888 5486 -11 -1242 3066 2682 981 3926 4131 2137 2167 1491 -1389 1405
2181 1405 4570 707 406 5770 3245 -3116 433 5235 699 -1508 3844 2768 -2194 -364 2947
2196 2947 1194 751 2612 666 -903 551 -1530 -2299 2178 2425 -1766 199 3200 -1732 -4501 1024
2212 1024 1704 -3196 -1643 1979 -1157 -2481 543 -454 -2328 -404 -1065 -4064 -1717 635 -2407 -2398
2228 -2398 1918 -731 -4909 -1750 932 -3621 -3099 793 -794 -3362 -1273 -762 -2730 -369 43 -3246
2244 -3246 -2031 258 -3322 -3934 1593 1511 -3351 -1149 1900 -2988 -4952 346 948 -1934 -292 1458
2260 1458 -1000 -1599 94 -1142 -935 1844 171 -2195 1526 1907 -2652 -685 4669 744 -2772 1391
2276 1391 2608 -1933 -541 3345 1519 169 2677 1870 -819 1554 1580 -905 1553 4133 434 168
2292 168 4491 2937 -1357 1853 3895 -165 -587 3061 2231 302 2934 2819 85 1340 1698 -808
2308 -808 794 4278 817 -1465 3030 3204 -1964 197 4384 678 -1972 1502 1624 -1474 -100 2461
2324 2461 603 310 1400 -1170 -1355 856 -915 -2965 1581 2522 -2496 -1855 2256 -1034 -4580 -268
2340 -268 1225 -2917 -2257 887 -1222 -2979 -265 -698 -2718 -758 -1272 -3650 -1923 200 -2751 -3199
2356 -3199 1203 -572 -4541 -1345 273 -3949 -3967 5 -1341 -3195 -275 -40 -3163 -1762 -300 -3108
2372 -3108 -3335 298 -1195 -2884 298 1124 -2496 -1854 985 -2115 -2667 761 595 -2180 -120 1238
2388 1238 -1972 -645 1834 -509 -1759 1914 1050 -2324 461 3101 -344 -654 3226 1613 -1157
2403 -1157 1016 2095 -528 587 3279 1545 963 3504 1692 -387 2268 2785 -272 1557 4828
2418 4828 1737 15 4090 3433 -704 1965 4117 1150 536 3595 2510 263 3207 3744 519 1997
2434 1997 3267 793 600 3321 1950 -135 2943 3742 78 948 3209 207 -1142 2290 1625 -1116
2450 -1116 1782 3669 -135 -496 2182 -354 -2204 994 1204 -1564 160 2218 -1026 -1485 1493 -474
2466 -474 -2533 31 521 -2661 -1600 834 -1841 -2622 264 -377 -3334 -1130 -216 -3666 -2822 698
2482 698 -1322 -3140 -64 -505 -3769 -2335 -471 -3770 -3258 -53 -1416 -3393 -600 -523 -3863 -2753
2498 -2753 -715 -3189 -3442 -100 -1162 -3261 -993 -75 -3546 -2577 321 -2189 -3350 -267 -406 -3258
2514 -3258 -1146 976 -1869 -2205 871 -845 -2873 -37 171 -2396 -572 1833 -744 -1262 1602 311
2530 311 -2514 279 1338 -1386 129 2697 137 -789 1874 1301 -1424 933 2388 -296 396 3248
2546 3248 813 -769 2402 2686 -587 616 3140 523 67 2805 1638 16 2375 2905 318 842
2562 842 3447 95 -277 2664 1792 -298 2379 3660 -300 46 2890 462 -1232 1845 2156 -554
2578 -554 1277 2672 -131 -343 1980 339 -1160 1458 1341 -1240 502 2225 -790 -810 1927 297
2594 297 -2004 182 1032 -1995 -994 1480 -658 -1746 933 542 -2520 -812 300 -2357 -1708 996
2610 996 -707 -2122 548 596 -2814 -1427 462 -2084 -2488 540 -332 -2342 -411 -10 -2383 -1248
2626 -1248 560 -1563 -2299 1147 -605 -3211 -371 1235 -1915 -1549 1368 -299 -2598 -281 518 -1938
2642 -1938 -290 1057 -484 -744 1174 -619 -1798 1053 857 -1801 275 2470 -532 -1465 2036 1122
2658 1122 -1426 495 2504 -270 -151 2156 1147 -275 1802 1163 -685 1337 2325 -282 669 3110
2674 3110 640 -624 2448 2660 -523 817 2850 483 -618 1834 1751 102 1959 2169 -220 802
2690 802 2271 -151 -512 2676 1924 -486 1423 2833 -894 -469 2148 625 -835 1108 2116 -757
2706 -757 90 1353 -620 -540 1893 -158 -1599 1064 760 -2353 -857 2154 -931 -2094 1030 374
2722 374 -2817 -1360 657 -1371 -1821 313 -892 -2026 -105 -802 -2843 -623 -86 -2795 -1970 689
2738 689 -1234 -3351 -289 131 -3503 -2922 261 -1395 -2862 -714 -951 -2443 -948 -861 -2551 -1180
2754 -1180 113 -2227 -2670 114 -986 -3321 -543 1042 -2095 -2254 762 -832 -2974 -823 117 -1573
2770 -1573 -290 1210 -999 -1177 931 -943 -2047 910 1113 -1551 -25 2157 -350 -1278 1604 1653
2786 1653 -1108 477 1698 -108 -162 1907 1274 347 2286 1599 -341 1321 2717 -170 -16 3235
2802 3235 1766 -464 2651 3471 138 513 2473 1087 -55 2257 2380 797 2079 2493 525 1003
2818 1003 2720 467 440 2940 2180 -690 1526 3068 159 -164 2908 1590 -374 1442 1717 -207
2834 -207 389 1686 491 226 1791 355 -1422 826 1263 -1467 84 2457 -348 -1898 837 550
2850 550 -2127 -364 1276 -832 -1054 396 -625 -1599 183 -422 -2102 -535 446 -2401 -1771 894
2866 894 -809 -3199 -626 199 -2586 -2441 158 -1354 -2597 -636 -866 -2272 -985 -422 -2146 -1253
2882 -1253 -57 -2406 -2916 182 -694 -3246 -734 1327 -2167 -3063 244 -397 -2720 -1015 701 -1201
2898 -1201 -1261 -431 -1115 -1424 301 -743 -1787 831 363 -2469 -920 1917 -669 -1977 1703 1527 -1667
2915 -1667 -567 1260 -477 -632 1392 453 168 1318 721 -805 736 2037 -570 -245 2745 1025
2931 1025 -922 1555 2927 -498 -113 2159 585 -407 1928 1588 216 1698 2063 -300 799 2918
2947 2918 501 -505 2531 1833 -1360 392 2887 105 -463 1974 1667 -697 733 1284 -179 609
2963 609 1845 295 -13 1629 -172 -1701 768 1435 -1426 -382 2301 -36 -2173 499 1035 -1243
2979 -1243 -455 667 -755 -918 517 -533 -1121 368 87 -2196 -630 792 -1922 -2067 1086 -312
2995 -312 -2704 -583 766 -1753 -1925 396 -884 -2174 -106 -413 -1565 -172 164 -2072 -1495 452
3011 452 -1354 -2447 362 474 -1794 -901 1105 -1387 -2190 177 -13 -1630 -110 434 -1210 -422 796
3028 796 -737 -1140 1404 -42 -2031 426 1135 -1205 -788 1784 594 -708 1096 1381 -1296 15
3044 15 1432 -79 66 1766 763 -583 1296 1269 -837 621 2361 211 -62 2205 1487 -75 1423
3061 1423 2039 49 253 2081 809 -224 1687 1685 -233 1373 2348 107 575 2296 738 -608 1421
3078 1421 1855 -326 860 2158 388 -345 1802 831 -967 1228 1259 -721 475 1902 -217 -800
3094 -800 1058 471 -1614 229 1370 -986 -680 1222 -407 -1607 326 326 -1146 -711 838 -952 -1552
3111 -1552 805 -732 -1829 133 460 -1995 -972 337 -1637 -2306 367 -271 -2370 -715 412 -1834
3127 -1834 -1848 -208 -1328 -2409 -322 -278 -2330 -788 -287 -2030 -1956 -31 -808 -2179 -296 84 -2102
3144 -2102 -1329 399 -1533 -1822 388 -405 -1998 -19 37 -1583 -1316 830 -466 -1316 291 -279 -1649
3161 -1649 -63 895 -862 -597 1448 316 -729 717 1062 -1131 -9 1453 -282 -332 1727 819
3177 819 -329 1186 1506 -475 191 2017 504 -255 1954 1170 -465 1071 2280 243 194 2124 788
3194 788 -70 1791 1598 -31 1143 2519 451 27 2212 693 -370 1311 2122 -87 989 2442
3210 2442 651 -372 1889 1032 -252 1118 2175 -254 140 1699 -79 -242 1226 883 -795 392
3226 392 1241 -388 -533 1549 382 -948 579 1231 -1289 -257 805 -1043 -1016 966 193 -1769 -69
3243 -69 645 -1228 -1171 399 -640 -1461 168 32 -1868 -719 448 -1443 -1580 -104 -985 -1506 -72
3260 -72 -383 -1969 -963 -146 -1285 -1776 595 -615 -2064 -589 105 -2156 -1233 561 -658 -1597 -45
3277 -45 -188 -1739 -753 217 -1325 -858 904 -576 -1412 358 143 -1471 -193 908 -672 -994 1003
3294 1003 92 -1451 180 837 -1002 -272 1454 58 -672 1110 706 -593 702 1420 -381 -44 1462
3311 1462 321 -491 1579 1304 -194 885 1574 248 27 1712 460 -398 1593 1342 -40 971
3327 971 1935 112 -179 1603 1268 -499 1050 1963 -242 94 1657 489 -403 1363 1365 -212 648 917
3345 917 -394 72 1332 55 -717 1206 587 -1025 -118 1204 -659 -829 1222 728 -1332 101 593
3362 593 -965 -684 557 -276 -885 512 -171 -1374 -189 244 -1504 -875 431 -454 -1568 70 260
3379 260 -1599 -678 244 -1154 -1409 408 -668 -1718 -204 -139 -1685 -930 248 -867 -1663 73 -428
3396 -428 -1823 -762 491 -1294 -1006 502 -635 -1504 -223 -354 -1311 -490 416 -1208 -900 662 -704
3413 -704 -1369 408 504 -1499 -405 1105 -421 -919 487 365 -702 455 811 -425 155 963 18
3430 18 -424 1324 748 -470 1033 1710 -273 -69 1644 519 -486 1314 1465 -26 697 1494 380
3447 380 216 1381 708 8 1380 1387 48 571 1693 187 221 1649 1060 -149 1000 1622 -322 -97
3465 -97 1390 692 -223 1211 1249 -95 507 1319 -10 220 1211 374 -671 966 585 -918 -147 1076
3483 1076 -335 -728 485 575 -838 -38 504 -766 -579 678 -492 -1004 550 -258 -1298 -476 433
3500 433 -1265 -1127 625 -587 -2018 -293 447 -1620 -916 367 -557 -1219 -308 -523 -1641 -531 -184
3517 -184 -1475 -674 235 -1356 -1859 127 -600 -2013 -764 394 -899 -1381 253 -647 -1728 -584 -151
3534 -151 -922 -441 119 -971 -875 211 -631 -1370 196 326 -1384 -344 952 -516 -1016 363 917 -663
3552 -663 -1 870 -631 -564 799 89 -393 885 458 -375 579 1421 -443 -361 1116 812 -315 974
3570 974 1537 152 229 1375 572 118 1349 777 177 987 948 119 884 1665 552 -119 1661 1317 -484
3589 -484 883 1488 3 109 1149 1019 219 672 1388 -100 660 1189 24 14 1409 644 -739 646
3607 646 951 -456 -186 1314 -57 -295 796 645 -635 -176 510 -740 -202 363 -226 -856 461 -83
3625 -83 -1262 -175 474 -808 -1161 331 -433 -1398 -430 411 -562 -714 204 -606 -1028 -168 -542 -1102 -44
3644 -44 76 -1216 -825 68 -812 -1717 -327 38 -1040 -699 127 -1103 -858 204 -599 -1235 -419 127 -1127
3663 -1127 -355 251 -1055 -882 315 -196 -972 65 99 -1028 -676 285 -31 -777 694 614 -621 -191
3681 -191 649 -259 -259 842 51 -697 598 737 -391 349 1279 -20 -206 1301 786 -424 809 1191
3699 1191 -30 403 1128 182 141 1311 763 -273 526 1371 258 287 1414 507 19 1111 948 -314
3717 -314 582 1486 207 96 1139 546 -73 859 778 -145 533 1045 -320 17 969 571 -279 514 721
3736 721 -190 -205 756 22 -432 504 235 -526 -100 593 -437 -537 592 -125 -692 83 574 -516 -586 530
3756 530 -775 -823 322 -340 -1196 51 -145 -1199 -858 102 -636 -1463 -79 -119 -948 -256 24 -1223 -542
3775 -542 -176 -569 -963 -53 -103 -1088 -480 144 -1198 -862 256 -267 -1440 -45 -235 -878 -353 272 -731
3794 -731 -907 161 -201 -937 -279 235 -617 -487 77 -345 -841 279 422 -453 93 260 -523 -436 789
3813 789 568 -395 747 460 -262 256 762 459 -73 698 510 -214 492 935 26 405 1230 296 -48 911
3833 911 676 117 704 1262 334 319 1350 226 -97 1107 870 -95 644 1450 86 294 1102 861 -314
3852 -314 557 1095 36 389 1183 415 -290 961 629 -303 796 697 -551 -117 680 -185 -438 423 505
3871 505 -311 109 559 -456 -646 455 -115 -831 257 382 -430 -417 280 -751 -1072 147 -250 -890 -25
3890 -25 -32 -1003 -688 238 -846 -771 85 -171 -1165 -641 45 -1044 -1101 116 -808 -1056 -69 -368 -1050 -481 170
3911 170 -722 -511 199 -345 -1111 -552 -51 -962 -657 132 -280 -854 106 116 -1343 256 393 -988 -596
3930 -596 750 -301 -898 487 410 -828 29 599 -312 -269 895 84 -444 486 813 -331 -304 1042 317
3949 317 -110 761 578 -398 557 961 -102 351 916 59 -121 661 412 -168 670 1373 86 180 991 301
3969 301 -69 1016 908 -95 377 785 106 -156 1257 821 -82 303 809 -134 342 790 347 -109 956
3988 956 699 -263 265 616 -313 -386 973 -34 -670 467 604 -610 99 414 -574 -712 428 -186 -943
4007 -943 167 179 -728 -287 413 -755 -697 411 -360 -1082 -284 63 -1005 -703 153 -509 -1257 66 -111
4026 -111 -988 -534 342 -934 -643 -177 -434 -754 -233 -48 -889 -531 -123 -882 -989 104 -383 -1098 -260
4045 -260 -252 -799 -561 379 -30 -854 232 -207 -984 -181 119 -348 -491 319 -169 -574 5 478 -611 94
4065 94 792 -356 -585 406 248 -485 540 826 -344 -12 793 -176 -164 555 604 -61 396 991 -40 116
4085 116 974 351 28 794 975 -154 450 1149 287 266 991 590 61 688 747 -237 299 1029 310 87
4105 87 894 678 -307 140 757 -166 245 977 -21 -298 538 344 -397 505 335 -62 -505 724 95 -438
4125 -438 290 329 -636 -532 471 -263 -695 554 15 -280 73 12 -778 -417 331 -410 -832 101 40 -1057
4145 -1057 -145 414 -834 -539 140 -500 -639 -328 0 -774 -416 287 -659 -838 -100 -533 -826 -325 -71
4164 -71 -879 -545 389 -819 -928 54 -95 -780 -517 166 -705 -296 54 -680 -480 237 48 -760 11 503
4184 503 -518 -279 557 22 -805 121 413 -530 -15 769 -335 -763 534 395 -164 669 408 -478 -102
4203 -102 919 179 -217 679 587 -465 297 861 -150 -82 754 552 -29 765 693 -108 603 725 140 115
4223 115 876 600 -74 378 799 -262 -111 1051 452 -66 794 591 -69 453 624 -82 -105 848 346 39
4243 39 643 438 -441 233 705 -107 -397 814 286 -529 310 291 -413 -341 421 -476 -748 398 132 -953
4263 -953 201 719 -465 -600 281 -9 -722 250 46 -1103 -476 280 -527 -1072 52 -604 -1072 154
4281 154 158 -894 -298 153 -434 -1074 28 -443 -1088 -199 -13 -861 -622 122 -626 -989 53 -28 -988 -104
4301 -104 164 -770 -480 47 -197 -621 -25 -127 -638 -130 413 -459 -656 632 4 -727 -32 385 -556 -152
4321 -152 531 28 -372 540 287 -316 94 768 -201 28 597 -61 13 958 419 67 478 1047 212 44
4341 44 729 302 -58 554 716 -254 209 927 232 -286 709 616 -378 782 759 101 44 872 223 -174 859
4362 859 635 17 494 676 1 112 864 333 -198 747 568 28 91 590 137 -139 724 258 -469 187
4382 187 459 -210 -205 561 132 -537 193 209 -634 56 268 -661 -323 104 -277 -536 62 462 -810 -268 366
4403 366 -474 -865 -99 -241 -946 111 80 -875 -673 230 -673 -908 40 -225 -887 -143 383 -679 -587 144
4423 144 -125 -608 -437 141 -817 -677 84 -587 -607 189 174 -891 6 122 -722 -226 14 -446 -619 278
4443 278 186 -533 -12 205 -548 -292 236 -43 -271 519 229 -511 214 389 -148 -207 885 -146 -474 403
4463 403 121 -236 52 750 -63 -35 726 102 -128 418 602 -126 216 759 -80 203 678 460 -320 335
4483 335 951 126 73 992 218 -374 492 498 -97 664 940 97 4 648 498 -427 205 470 -233 111 503
4504 503 47 -270 518 354 -654 -45 346 -227 -253 687 -247 -693 351 287 -305 10 467 -252 -123 193
4524 193 -36 -602 -77 104 -704 -483 127 -515 -583 66 -273 -881 -226 248 -927 -363 235 -378 -873 68
4544 68 -4 -883 -563 140 -488 -689 -3 -304 -906 215 -38 -731 -54 284 -959 -576 347 -14 -749 33
4564 33 154 -482 -230 194 -244 -525 42 -1 -607 -119 67 -359 -200 376 23 -444 176 281 -374 26 548
4585 548 211 -178 272 117 -430 215 309 -280 -67 828 -149 -71 558 368 -368 482 665 106 382 781 208
4606 208 -227 577 516 -75 344 538 116 -55 572 415 -331 709 600 139 460 299 96 -246 911 475
4626 475 15 682 472 -232 -38 639 131 -275 280 346 -656 91 296 -189 -342 321 -52 -520 399 522
4646 522 -429 -209 330 -311 -522 133 -191 -645 -137 211 -557 -395 296 -398 -540 51 -141 -833 48 -286
4666 -286 -468 -538 47 -597 -653 62 -228 -950 -656 -40 -760 -542 341 -163 -602 -327 -216 -677 -648 83 -701
4687 -701 -728 -57 -149 -778 -376 77 -534 -158 459 80 -566 349 47 -354 -93 576 -174 -357 264 11 -344
4708 -344 161 211 -669 -227 497 -51 -131 847 -162 -427 158 495 -54 307 769 279 -61 405 513 -182
4728 -182 247 686 141 317 702 191 90 865 923 -240 444 723 448 25 733 461 72 731 293 -384
4748 -384 103 731 -45 161 638 242 -62 402 564 -370 75 659 58 -83 354 245 -278 -226 295 -153
4768 -153 -319 406 -45 -546 -51 146 -376 -48 213 -150 -471 25 57 -521 -89 292 -624 -212 255 -284
4788 -284 -840 -47 54 -617 -350 79 -590 -374 352 -356 -735 124 -157 -485 -411 -28 -401 -423 58 -242 -466
4809 -466 -10 84 -305 -431 128 -292 -741 133 -43 -639 1 496 -544 -381 -291 0 -496 43 11 -261 3
4830 3 278 -280 -432 297 -65 -547 166 487 -356 203 550 287 -210 515 286 -120 213 765 -456 -184
4850 -184 450 320 -102 590 820 -79 443 763 68 152 262 464 7 380 724 -236 70 445 284 19
4870 19 826 454 6 596 534 -363 295 730 287 27 550 31 -244 395 480 -276 0 517 131 -337 145
4891 145 231 -497 292 393 -107 -103 291 -38 -698 72 292 -264 -343 279 -156 -418 105 -94 -479 -108 217
4912 217 -106 -130 314 -180 -663 297 -256 -929 -240 271 -522 -394 236 -44 -598 23 159 -428 -326 224
4932 224 -216 -690 -106 -48 -651 -103 114 -353 -219 80 -306 -351 82 159 -533 -161 188 -568 -260 96 -290
4953 -290 -686 178 22 -467 -171 608 -326 -320 296 -12 -722 223 231 -254 61 291 -341 -165 331 230 -221
4974 -221 160 503 8 203 466 136 -87 446 -7 -212 417 704 96 -38 711 226 94 535 199 -1
4994 -1 192 657 247 -6 564 242 -161 538 473 -60 17 503 68 -57 340 380 -197 -3 425 -88 -79 991
5016 991 -32 -301 339 309 -266 -15 562 86 -74 353 15 -283 -215 66 -328 51 427 -186 -472 -22
5036 -22 -38 -241 -128 289 -385 -536 -57 -100 -523 -150 -148 -406 -155 -81 -615 -283 -27 -77 -706 -262 123 -237
5058 -237 -414 -1 -534 -473 140 -221 -649 -272 -75 -720 -468 120 -317 -690 -12 114 -404 -203 157 -344
5078 -344 -307 162 64 -326 297 112 -295 -236 142 -447 -410 183 96 -283 -43 158 -512 -137 317 41 -248 522
5100 522 212 -102 -171 420 59 -4 560 116 -44 587 405 190 101 578 74 62 563 408 -99 255 598
5121 598 11 381 489 110 -329 513 402 -16 153 353 94 -31 406 -31 -117 447 425 -278 97 582 107
5142 107 -83 429 170 -37 180 504 123 31 735 -105 -11 407 197 -508 116 177 -160 -211 -24 -147 -230 128
5164 128 206 -656 -204 246 -297 -334 144 -114 -136 -121 -242 -639 -434 341 -383 -572 -98 38 -715 -322 13
5185 13 -647 -348 -8 -308 -471 191 -98 -506 -78 -73 -333 -280 161 -148 -639 -264 129 -493 -147 -41 -107 -235
5207 -235 280 -23 -533 -60 37 -541 -37 278 -79 -419 403 194 -486 -189 225 -301 87 713 -422 -335
5227 -335 311 -32 -135 169 456 121 151 548 136 -30 246 493 -44 -28 457 21 -54 556 231 -149 418
5248 418 424 -239 26 584 77 -220 268 487 -65 425 352 -33 14 170 301 150 479 313 -132 93 484
5269 484 -78 38 469 206 197 268 483 -251 -142 120 2 -454 191 186 -404 -138 431 -199 -298 45 139 -484
5291 -484 -72 232 -443 -238 12 -526 -739 237 30 -482 -334 172 -589 -431 273 -370 -604 -19 -68 -442
5311 -442 -61 -114 -165 -423 169 -264 -525 44 39 -374 -136 10 -259 -364 -98 -237 -727 -240 -222 -357 -177 75
5333 75 -282 -412 189 -128 -511 -106 -10 -386 -298 417 39 -282 -48 112 -323 242 401 191 -338 124 66
5354 66 -339 536 385 -347 13 421 10 -320 365 246 -172 332 426 -98 103 368 -12 -19 -145 343 -125
5375 -125 208 613 -81 144 439 228 -17 516 481 212 129 563 475 -112 261 123 45 350 418 -81 -33 388
5397 388 12 42 439 199 -96 2 213 291 -115 311 -113 -199 354 240 -106 198 382 -28 -294 -182 -143 -132
5419 -132 58 367 -489 -53 81 -169 -444 268 -290 -766 -102 364 -208 -474 348 -356 -137 67 34 -498
5439 -498 -215 103 -398 -468 135 -220 -311 53 -503 -379 -312 142 -443 -374 -65 -281 -396 308 -48 -393 -148
5460 -148 148 137 -340 -3 -177 -481 -168 146 -284 -204 102 31 -292 374 8 8 48 411 -45 20 662 112
5482 112 -274 289 449 -22 -78 300 194 -323 322 201 -187 362 496 -65 8 488 -9 142 272 295 218
5503 218 520 315 331 214 337 82 -72 213 445 -300 125 321 20 205 431 273 -148 496 569 -156 -36
5524 -36 517 -84 -191 253 194 -53 134 171 -310 -200 419 159 -343 -140 216 -209 -52 383 -60 -307 328
5545 328 123 -111 -119 212 -115 -152 424 -210 -268 50 -6 -458 -142 467 -323 -372 155 -498 -425 -192 -47 -478
5567 -478 -310 -8 -506 -325 166 -174 -270 163 -40 -327 -424 224 -428 -530 152 -102 -490 -385 101 -474 -304
5588 -304 -95 -158 -321 102 -118 -566 -177 382 -86 -195 72 62 -277 13 69 -419 -169 -105 117 -232 48
5609 48 315 20 -16 474 -127 -314 402 66 -132 275 526 -59 43 294 -49 72 413 96 -72 295 326
5630 326 -127 -176 489 82 135 363 259 -198 312 422 -98 -3 501 36 -48 602 391 72 281 627 -93
5651 -93 126 297 159 -144 322 357 -294 289 257 -422 -129 449 32 -626 162 403 -201 -333 328 113 -96
5672 -96 -52 -111 -332 128 4 -359 -562 215 -276 -463 44 -52 -275 14 165 -199 -138 240 -262 -440 97 240
5694 240 -421 -330 26 -372 -612 167 123 -564 82 405 -394 -335 71 -207 -405 -496 -76 -599 -354 -10 -208
5715 -208 -6 -7 -78 -409 -218 90 -442 0 142 -373 -36 206 244 -127 -162 -6 -373 -262 449 -34 -355 132
5737 132 134 -133 323 214 271 -168 283 66 -163 407 407 -174 556 355 165 -31 242 243 118 150 447 -79 289
5760 289 480 -103 -77 353 245 32 410 528 -376 32 584 151 73 549 396 1 307 683 -152 -9 308
5781 308 261 -102 217 53 -207 -10 721 260 -136 466 210 -205 272 584 -10 47 241 -73 -83 431 145
5802 145 -149 -19 342 -63 -438 123 -189 -336 -23 -120 -335 -87 3 -328 -326 -45 -346 -252 -51 -51 -624 -553 -96
5825 -96 -372 -527 127 7 -587 -116 5 -263 -499 177 -264 -567 48 -119 -144 -190 -88 -678 -299 -19 -135
5846 -135 -331 338 151 -81 67 159 -341 -367 282 -105 -356 189 219 -239 -74 337 -172 -131 414 346 -25 -60
5868 -60 451 -272 -104 409 -41 -203 323 566 -398 -3 500 -181 -62 576 338 41 156 121 23 -306 397
5889 397 133 3 306 161 92 164 274 188 3 538 341 38 73 275 280 233 408 -18 42 403 154 -200 36
5912 36 343 -82 38 407 254 -221 384 -25 -270 -31 216 -152 -147 503 6 -17 -81 64 -339 -245 73 -201
5934 -201 -131 275 -249 -272 85 185 -237 -115 -107 -357 -95 303 -149 -560 -99 198 -533 -196 -302 -408 -431 79
5956 79 234 -733 -79 -33 -228 -131 75 30 -560 227 -270 -458 -97 60 -345 -447 222 -114 -311 -87 231
5977 231 -297 -94 11 100 -382 54 85 -53 91 295 -104 -167 315 -259 -9 101 155 -140 -195 240 62 -129
5999 -129 508 71 -237 264 215 -20 166 332 202 49 -67 182 -358 350 399 -163 235 422 -55 -12 145
6020 145 225 -71 140 815 300 187 593 228 -74 210 324 27 482 281 -46 60 313 490 33 303
6040 303 367 -62 -129 613 -52 -418 107 259 -243 20 276 -186 -112 272 178 -523 319 166 -350 197 222 -105
6062 -105 -57 359 -99 -104 -55 101 -213 -232 14 -119 -143 -126 -24 -297 -153 -147 -185 -150 -6 -271 -269 -270 128 -602 -290
6087 -290 67 -406 -237 19 -22 -285 -84 -143 -652 -246 126 -217 -364 115 104 -300 -250 143 -98 -70 -52 -106
6109 -106 -111 200 350 -377 120 211 -198 -282 161 83 -219 394 -21 -37 79 321 -177 -328 336 282 -132 279
6131 279 -3 -7 170 557 43 127 542 349 -149 207 550 -56 -10 704 -109 -22 229 461 -95 65 419 332
6153 332 -54 443 295 -16 431 335 157 -78 486 317 -10 170 56 -108 379 456 -101 -104 317 227 -154 -140
6175 -140 467 -395 -138 285 158 -249 55 225 -307 -93 208 -360 -114 75 -139 -149 -22 9 -388 -189 -234
6196 -234 -245 -242 36 -312 -323 -70 -75 -382 -76 -41 -248 -435 123 -234 -271 -312 -131 -148 -315 75 58 -41 -101 119
6220 119 -211 -126 163 -234 -208 62 -184 -59 -233 136 -483 -125 -26 -299 -182 3 -70 -191 -60 33 -414 -277
6242 -277 127 -424 -53 306 -98 -268 55 146 -9 283 107 -115 -217 135 281 -175 -33 143 -155 322
6262 322 425 292 -188 305 277 -191 146 442 123 333 182 166 -166 103 315 -244 -72 455 5 166 694
6283 694 288 -158 484 273 351 -253 155 -116 -107 260 319 -273 181 445 -11 31 -14 61 -316 237 -10 -355
6305 -355 19 -66 74 -207 -21 57 -156 138 201 -361 63 201 115 -174 81 -157 -713 -60 83 -162 -195 210
6327 210 32 -416 -43 165 -350 -168 -39 -213 -381 119 -203 -345 -223 140 -161 -338 143 -324 -475 -96
6347 -96 -31 -369 28 -264 -383 -239 209 -200 -179 17 43 -301 -297 -179 -160 -314 -95 -232 -302 -87 117 -42 -177
6370 -177 24 -28 -64 185 190 -164 353 313 -151 -13 87 -118 -165 356 364 50 30 395 166 -73 240 176 -267
6393 -267 185 219 -117 341 181 54 96 1 437 -115 253 542 -115 45 382 104 -142 290 141 -18 159
6414 159 67 -353 39 345 271 -319 137 342 -167 -47 252 -133 -47 175 165 -270 253 -51 113 -50 53
6435 53 -248 -99 251 107 -237 169 71 -181 -376 -169 -190 -403 67 -154 -299 115 331 -346 -360 48 -120
6456 -120 -345 -85 215 70 -267 10 19 -115 73 -136 -121 -45 -75 -227 -191 24 -29 98 54 94 -388 7 136
6479 136 -168 -227 -141 -223 -413 -135 -31 -221 -39 274 55 -251 -125 72 -344 -102 258 -507 -390 92 -163
6500 -163 9 284 212 -72 -144 13 165 -215 423 223 -121 208 189 -161 -44 103 -178 103 189 225 -318 282
6522 282 448 -115 9 444 156 212 199 106 -67 -33 292 -132 252 374 187 -70 -205 88 48 458 203 178
6544 178 -81 248 157 -48 13 433 145 -14 161 22 -144 -155 -4 -281 -52 136 59 -17 93 -292 -226 77
6566 77 109 -112 -40 196 -64 93 239 227 -246 -149 -51 -295 6 68 -178 -258 151 -163 -279 -243 -137 -270 -330
6589 -330 -213 -366 -331 -286 109 -552 -198 -143 -315 -94 -96 -36 -360 -114 -213 -215 -114 338 -211 -488 -135 -178 -205 22
6613 22 -22 -106 21 60 217 -264 216 105 -232 53 210 32 42 87 -187 159 -24 194 -314 106 373 10
6635 10 42 124 -104 -50 142 57 -78 96 377 78 178 214 209 -64 119 83 -39 73 273 -42 184 39 207
6658 207 18 44 470 46 -119 53 261 8 144 285 280 83 372 263 -96 223 94 -29 166 326 171
6679 171 -63 139 86 -4 202 195 -163 298 -27 -6 19 141 134 40 137 90 -328 -295 -73 -73 -318 -14 -58 -131 22
6704 22 20 -114 -190 463 -87 -219 -13 -7 -146 -28 -34 -362 -204 -101 -286 146 12 -140 -459 -204 155 -411 -340
6727 -340 67 105 -253 -28 58 -80 -60 -17 -100 -253 -169 -180 -390 8 -5 -248 -254 -238 -28 -219 -82 50 -336 -17
6751 -17 52 81 -245 -60 -186 -173 -145 -111 -340 28 164 -20 -58 249 -30 -347 97 187 -84 -129 314 44 69
6774 69 249 115 155 16 -191 42 13 20 277 -146 -93 326 92 116 128 -219 203 215 -39 52 332 266 79 62
6798 62 -108 -90 -449 98 82 256 53 540 -112 225 124 -55 103 294 118 -46 406 160 -67 161 -20
6819 -20 -38 -139 239 220 -59 49 3 -202 21 -4 75 -184 -148 313 -45 -130 72 -78 65 -148 24 -139 -33
6842 -33 84 -615 -11 -83 182 -570 144 42 -70 -88 -99 -159 -201 -78 -355 -282 -61 -29 -88 -56 1 -106 -280 -313
6866 -313 150 -193 188 209 -201 -161 63 -317 -335 148 325 -304 -341 159 -5 -227 288 -78 -109 -8 112 -188
6888 -188 19 61 -78 139 -122 184 -188 160 307 96 316 33 -32 93 54 291 -17 28 394 -57 134
6909 134 29 -53 394 -40 59 -57 70 410 -170 -69 172 430 -163 379 76 -122 300 344 104 162 -29
6930 -29 49 67 -186 367 7 -38 171 -177 -68 224 270 -36 -100 330 -114 -248 -35 32 -205 -112 237 32 -90
6953 -90 176 -65 -229 -45 181 -244 25 416 89 -341 107 -218 -312 -1 -114 -459 -129 105 -104 -236 72
6974 72 -271 -416 188 -111 -76 -322 129 -110 -471 -43 -88 -101 -207 81 -262 -210 -3 -167 88 2 -249 231
6996 231 -200 179 -21 59 125 62 160 250 -1 -321 -111 -10 -14 -192 193 188 -273 -294 74 -310 65 204 -20
7019 -20 -181 79 -209 -294 -111 509 83 15 429 227 -115 -181 94 199 136 537 -55 -91 253 173 18 188
7041 188 130 -165 316 143 220 -26 320 -30 -139 -106 480 -53 -41 298 -96 121 -52 222 99 90 175 107 -4
7064 -4 -25 -115 -147 -32 13 494 -19 87 233 186 -64 89 -422 1 193 196 -145 -94 209 -109 89 -327 -275 -226
7088 -226 406 -164 -348 215 -6 -168 51 -288 -87 -129 17 -17 -209 -121 64 -78 -49 195 -101 -263 146
7109 146 61 -360 9 -183 -310 2 -131 -76 -18 78 313 -112 -77 -250 -86 -58 -167 72 -262 -140 -246 -66
7131 -66 9 150 -52 -115 50 -43 -8 430 -96 -393 28 145 38 -57 207 -196 -129 -157 -8 -248 323 65 -187
7154 -187 -38 -47 52 114 -116 292 -89 -48 118 169 14 252 207 34 148 274 -54 106 277 -182 -154 178 114
7177 114 28 313 239 -66 -20 4 9 -8 12 167 210 335 153 101 6 41 251 -11 341 158 166 -314 349 139 -146
7202 -146 388 466 -55 -8 274 -197 -241 87 -48 153 -96 96 50 -108 239 43 -53 410 -113 -86 -202 -27
7224 -27 -210 -57 68 -158 -308 -40 -108 12 -77 45 -65 -280 247 -238 -208 60 93 -271 -152 0 -60 -168
7246 -168 -76 -216 -145 -99 99 -327 -122 81 -375 -154 -215 -279 -241 -71 150 -105 -318 -431 -297 -31 123 -76
7268 -76 -66 -103 153 81 159 56 113 -117 -74 213 -303 -15 246 368 -20 101 212 -33 98 157 17 61 31
7291 31 15 -7 -89 65 -48 133 150 -82 -70 244 86 120 91 240 -272 127 205 80 90 198 85 -13 -44 -18
7315 -18 88 102 145 -590 5 251 414 -11 145 20 140 83 54 231 -250 -234 196 -133 -183 4 -269 -285 120
7338 120 -222 -76 256 105 -78 -375 170 -46 111 107 -109 -93 34 -143 -185 151 -6 -34 -305 20 234 120
7360 120 -94 150 -117 -381 -77 -242 21 -82 61 -296 -455 27 -293 -376 164 -72 -336 -149 213 -185
7380 -185 78 -185 -94 -243 -133 248 -495 -56 199 -83 -105 -112 189 -308 135 -207 16 75 144 -418 -426 28 -143
7403 -143 198 56 330 58 -467 186 165 -6 21 70 -56 -257 343 61 131 116 -167 -361 321 360 25 -6
7425 -6 183 44 133 56 129 -116 179 217 -135 -70 291 45 -111 349 -48 -141 -85 60 -78 154 238 166 -65 181
7449 181 48 -357 93 -63 46 139 -6 -6 -302 -208 316 -88 34 41 71 -32 -54 238 -257 -213 317 -110 -101 194
7473 194 -116 18 31 146 -7 195 48 -174 -72 122 18 -95 -19 -252 -60 14 -134 -194 -66 278 89
7494 89 30 145 -7 -391 -151 -94 -5 -389 -125 -256 -176 -61 -3 -139 -295 187 -300 -141 152 -44 -195 32
7516 32 102 178 -276 112 -198 -220 34 -28 -17 -306 369 -81 -120 330 19 -82 -44 -288 -69 -100 -81 -141 -232 149
7540 149 -86 154 -84 37 186 -138 29 217 -104 208 56 -154 -127 291 -61 -37 -209 103 -122 149 -203
7561 -203 -13 -64 462 259 210 295 66 -301 63 230 66 -35 126 -10 -73 73 -3 -415 -156 161 -188 -6
7583 -6 221 -129 -109 142 -152 -145 12 122 -55 64 -40 30 24 152 45 -114 150 149 94 -3 -132 97 -20 -140
7607 -140 57 -18 92 227 -19 -138 185 411 -256 85 -66 -279 -155 104 75 -158 -128 54 -358 -237 216
7628 216 -197 -24 36 -153 -137 -289 176 31 -202 57 -167 -62 93 15 -424 21 -91 -32 92 -19 -43 -145
7650 -145 23 160 -175 185 82 -11 -422 -335 2 -70 3 157 -207 -40 168 -34 -66 419 -60 14 13 343 45
7673 45 93 367 -143 231 -113 -14 -31 284 31 -76 123 234 199 -217 -109 8 63 93 205 -46 -58 -85 292
7696 292 84 117 50 -133 -25 131 194 -49 199 180 -67 128 7 17 28 255 -152 -8 157 349 -68 -230
7718 -230 308 75 -99 8 -119 -110 -107 -58 45 -74 -118 -178 -292 -19 120 -171 287 -175 102 -176 140 242
7740 242 -127 25 -244 -297 -246 8 -215 -499 283 0 -97 188 -230 79 74 45 -130 -70 -221 -5 -223 -43
7762 -43 -35 -128 -388 33 -117 -106 -23 -161 -76 -195 316 189 -281 -95 44 -53 -204 -255 122 -129 103 23 69 42
7786 42 -226 -34 69 53 179 -231 119 -46 -41 66 -46 -83 -32 292 32 3 26 172 70 180 75 116 57
7809 57 153 -17 307 62 -9 145 -151 82 -386 -82 49 47 -24 47 -6 236 -101 -105 63 121 35 49 119 149 266
7834 266 -246 -35 69 309 -2 -96 -103 -95 138 -19 -23 147 19 -153 -112 -90 109 -325 -140 -5 -297 47 188
7857 188 -156 2 -219 39 92 138 -156 -20 -65 -33 286 41 98 -166 -29 -112 27 -152 181 66 -251 -108
7879 -108 -162 -431 87 -71 300 42 254 116 -136 -185 -150 211 -2 -12 -87 -92 39 -74 59 -148 -69 164 -179
7902 -179 87 -85 -116 12 -152 144 85 -25 -124 -150 5 -87 106 -96 73 -21 123 59 77 212 -48 -11 38
7925 38 -304 207 152 172 -79 -180 44 22 59 -47 38 -8 108 8 97 38 178 -148 8 258 -65 -149 -195 -32
7949 -32 30 67 238 155 -28 -69 -161 -329 134 40 -58 33 147 34 -55 -51 -38 31 185 -143 -218 -255 8 -21 -22 83
7975 83 -154 -119 -71 -26 -19 185 -61 -165 -65 256 408 -23 -257 -1 -186 33 -51 179 -285 221 -207 -259 13
7998 13 127 -50 -47 97 95 -490 -165 70 -149 -207 -83 -305 151 -52 20 -217 -209 -89 110 -233 39 -22 45 189
8022 189 72 -27 -3 192 -169 -109 67 -99 -41 114 -15 178 -3 171 -127 -165 17 -247 137 110 62 47 -3
8045 -3 344 -201 -179 243 56 142 79 187 100 18 194 -21 -125 37 219 -195 78 171 -116 -152 -270 -99 -183
8068 -183 -34 26 -139 -106 -285 6 221 -102 37 -152 75 83 -39 -16 229 36 -40 -49 135 -46 -310 -30 -16
8091 -16 142 121 -170 -152 -47 -46 -73 -31 165 57 75 -47 -90 -140 191 98 -27 -135 25 114 100 -106 147 -111
8115 -111 235 -68 -34 158 -216 -114 34 -44 145 -332 54 -51 19 -183 -65 269 -374 -180 -364 -236 -55
8136 -55 384 248 -12 -99 -92 8 156 -71 -31 -231 189 -80 50 55 -305 -239 191 22 -165 -102 -71 127 -129
8159 -129 19 -140 -228 -267 114 -53 86 69 -22 -211 45 43 -29 -13 -12 96 78 0 6 26 -103 84 116 -115 8
8184 8 -93 -223 -209 36 189 165 156
8191A56
$$ Imaginary data points
##PAGE= N=2
##DATA TABLE= (X++(I..I)), XYDATA
0 0 0 0 0 -8 8 -8 8 -16 24 -24 32 -41 56 -64 80 -96 120 -137 163 -192 227 -261 301 -349 403 -459 523
27 523 -592 672 -759 855 -960 1075 -1202 1341 -1493 1659 -1842 2044 -2265 2508 -2777 3075
43 3075 -3403 3774 -4187 4654 -5187 5800 -6517 7363 -8385 9643 -11241 13344 -16252
56 -16252 20546 -27547 40922 -75624 347900 708707 -148978 -187110 290670 302737 -147162
67 -147162 -41351 308519 270863 -386 77734 244203 161312 16190 186054 353004 142347
78 142347 -149599 18850 303221 184881 -1388 233239 410158 130805 -78708 129131
88 129131 224673 23130 -961 222709 265158 111858 41996 76938 119307 164117 145385
99 145385 53367 27929 92552 104864 52564 50239 120216 174812 128959 5031 -58344 -6517
111 -6517 57813 101347 152811 115386 -11788 -10732 91614 15967 -117882 21461 207510
122 207510 58671 -152522 -46184 119308 36362 -62310 30952 87183 -55845 -177139 -84909
133 -84909 60561 36485 -53553 8014 89258 -43512 -191063 -90266 19377 -85680 -119423
144 -119423 42973 47958 -136766 -119799 56103 15865 -155078 -133698 -11582 -32639 -130932
155 -130932 -131552 -34606 32065 -18378 -96369 -72776 -42226 -128537 -171921 -58499 -4770 -87193
167 -87193 -79331 10987 -42984 -152907 -105131 -19913 -57083 -109392 -93363 -75552 -69105 -56928
179 -56928 -55958 -29494 5786 -59532 -156986 -116963 -38926 -75291 -84813 20515 38045 -78294
191 -78294 -113759 -52143 -52065 -82778 -52743 -22898 -40959 -58526 -55757 -32567 -2056 -19054 -59693
204 -59693 -38450 -21829 -92501 -110049 785 45285 -31108 -35037 31099 -6000 -82766 -58719
216 -58719 -15165 -32594 -32599 297 7252 1623 -1474 -18852 -16814 998 -27327 -56068 -13677 14948
230 14948 -20857 -10181 46694 31239 -17387 -5860 -1999 -40070 -30910 10247 11321 16020 40603
243 40603 16093 -14152 18312 25308 -24159 -14456 33303 5786 -28308 23153 59376 27112
255 27112 19535 37098 10838 -19803 -12607 17 21436 52072 41787 21588 46998 43289 -16158
268 -16158 -10812 49213 26633 -18745 33063 77074 25091 7097 60828 56156 1774 4370 32809
281 32809 24931 18426 30745 42667 59135 59210 27040 24538 49768 21618 -15789 26863 67556
294 67556 32574 27008 78148 67077 12728 22109 45924 17551 7142 37097 44495 41553 56833
307 56833 53018 37488 45232 33181 -2079 11771 44775 28191 20810 60377 60865 22176 28101
320 28101 44710 14782 2410 25507 18467 5998 34738 45766 26312 38615 47009 5681
332 5681 -11637 15881 4242 -18467 18318 45594 16078 12614 36243 11107 -19293 -4169
344 -4169 -4608 -24433 -3727 18915 1699 3566 23489 -2847 -29915 -8113 -9384 -42202 -24589
357 -24589 6250 -17965 -28245 6504 1107 -33934 -23174 -13665 -45977 -48248 -20340 -27928 -35063
370 -35063 -5850 -7413 -38520 -32423 -24158 -56138 -61716 -31638 -35430 -46042 -16044 -8534 -40155
383 -40155 -38928 -25899 -54458 -68126 -40042 -37966 -50914 -27422 -13702 -38477 -38353 -21330 -44890
396 -44890 -64223 -42251 -38155 -54125 -34606 -13416 -28881 -29309 -12403 -30690 -51620 -35218 -33890
409 -33890 -52416 -35925 -12566 -23297 -19184 5534 -8949 -35022 -24625 -24058 -46844 -32363 -1873
422 -1873 -7533 -9476 12432 3460 -21571 -11431 -4119 -22706 -14656 7918 -3662 -9118 17263
435 17263 17897 -2536 10236 18723 -7704 -10126 15152 7814 -1445 27426 35917 12168 16592 29430
449 29430 7467 684 23796 18685 6192 32250 44288 20167 23360 40669 18207 2009 25104
462 25104 26071 9480 33051 54923 32325 24571 42218 26745 5189 20399 26487 13924 31095
475 31095 48123 26541 22937 46777 33724 8143 24333 31962 5638 10491 37109 26918 18039
488 18039 43324 43789 14341 11734 17269 985 1853 21621 19036 19016 39417 30915 4341 14039
502 14039 21661 -7398 -10808 19683 14306 -6053 14851 29376 7020 2042 14525 227 -12557
515 -12557 1926 3707 -7383 3913 11399 1281 6508 10089 -13872 -17158 7774 -3922 -30282
528 -30282 -7040 18676 -3644 -12986 7637 -810 -22392 -10228 -4377 -22960 -15728 5841 -1323
541 -1323 -8834 -23 -8846 -22161 -11531 -11649 -27738 -11988 9651 -7055 -14982 4834 -3442 -27667
555 -27667 -14071 -1433 -22131 -21955 889 -8455 -19143 4094 5532 -21254 -14180 5162 -16080
568 -16080 -33336 -12615 -1475 -8614 213 5607 -7253 -6883 -4965 -21580 -24338 -9095 -11776 -11501
582 -11501 12795 7888 -22741 -7987 18594 -13855 -40655 -4422 12089 -21938 -22235 12607 8481
595 8481 -14385 -6384 4441 -9287 -22074 -21433 -8951 4342 -3908 -16702 3762 17379 -16547
608 -16547 -29406 7413 5815 -38069 -22957 21018 -2425 -34621 2575 29414 -7489 -31096
620 -31096 -10816 -5311 -19118 -16549 -2416 7617 6503 -8563 -13882 -1447 -10247 -29916 -7553
633 -7553 19211 -10001 -30658 5130 15733 -20280 -15771 17162 516 -26032 -8123 703 -17706
646 -17706 -8141 15989 8200 -2685 1284 -7220 -16978 -5157 1433 -4526 5005 13548 2112 -522
660 -522 5834 -4095 -4106 13751 4689 -15155 5600 23274 -463 -752 31773 18120 -18769 -402
674 -402 24077 -2213 -10825 28439 36876 5605 995 19333 15970 2864 6114 18570 24669 11328
688 11328 -2864 17102 40495 17828 -434 32088 38960 -10766 -17684 32473 35103 3371 24446
701 24446 53089 21495 -8710 11549 24627 9373 9418 26394 31685 22607 9016 8250 28364
714 28364 31626 5575 4349 29298 16743 -11745 10035 40728 24502 9546 23654 17201 -6049
727 -6049 -210 11305 6739 14626 25086 9479 2154 16193 7677 -7617 9300 17220 -10447
740 -10447 -15797 11243 11126 -5342 6378 19610 3783 -15287 -19070 -14916 -1222 3984 -8423
753 -8423 -2712 15577 -5895 -36496 -13589 11381 -15674 -28758 862 -1019 -35162 -24544 6598
766 6598 -2935 -20344 -10076 -9436 -28433 -35306 -26590 -13254 -745 -6657 -21924 -15410 -10763 -34590
780 -34590 -41300 -10870 -3575 -25676 -21547 -7732 -22855 -30047 -10982 -10568 -24992 -17654 -14699 -32294
794 -32294 -28153 -7351 -11091 -16921 -4145 -9450 -31829 -25824 -10909 -18947 -19250 -1664 -2372 -17592
808 -17592 -17363 -12362 -12095 -6080 -7478 -18375 -10486 -886 -16871 -18105 12499 13754 -15812 -11317
822 -11317 6113 -15648 -27774 5650 19720 -2781 -1712 15588 1263 -17550 -6069 9036
834 9036 7334 3557 790 4155 11507 3608 -5892 14022 27485 1121 -12748 11677 12040 -11748
848 -11748 5694 36377 18484 -3512 13810 17302 -7164 -5701 17673 18822 9573 12360 12950
861 12950 10885 13490 8273 4795 15609 14492 -3221 2649 21179 13705 5838 21205 20568 -1534
875 -1534 -457 11413 2070 1733 20580 17179 1936 9916 15233 -519 1245 16931 7312 -5565
889 -5565 7444 11790 -2056 3695 19305 14310 3342 1386 -3920 -4321 3410 2017 1492 18966
903 18966 17802 -6998 -5460 11941 -2588 -17089 8145 19282 -7914 -10718 13965 9430 -9101
916 -9101 1188 12174 -642 -9018 -4435 -2161 1520 4512 1077 6267 12913 -3392 -16025 2703
930 2703 9287 -12472 -8800 16322 8384 -10968 3928 14372 -4985 -8853 5762 295 -10078
943 -10078 1203 8147 3017 6410 6318 -4662 -2556 4749 -4959 -7537 8706 9432 -3297 3274 10763
958 10763 -2282 -3873 7930 1571 -8431 2774 5512 -5189 2289 13538 1377 -3771 9750
971 9750 3586 -13761 -4508 7127 -2194 -1933 11493 6825 -3671 813 -464 -8976 -4744 339
985 339 -4618 1626 9609 -2922 -8529 6006 3195 -15041 -7682 5569 -8010 -14087 3274 3786
999 3786 -9587 -2774 4870 -7070 -12908 -6209 -9596 -11507 -2021 -3790 -9348 547 1625 -13651
1013 -13651 -12529 -2335 -13019 -20361 -4269 -1303 -14321 -7244 4601 -7847 -16540 -7199 -10480
1026 -10480 -19102 -9179 -3313 -11879 -7726 725 -9213 -14539 -4669 -8187 -17536 -7862 -2419 -14983
1040 -14983 -12226 1453 -4077 -11163 -1339 -2387 -15752 -11178 -3296 -12195 -11305 4076 1276 -7598
1054 -7598 352 1193 -11623 -8702 1187 -6749 -8826 5491 5009 -4986 2327 6065 -5514 -4447 5752
1069 5752 -1441 -5620 7660 8803 -1932 5088 11614 273 -810 10518 4717 -3584 7206 11447
1083 11447 1640 7027 16555 7383 3268 12303 7441 -2011 7417 14239 5670 9897 19633 10415 3728
1098 3728 13626 10537 -408 7643 16514 8013 8441 19124 12661 4405 12617 12474 621 6010 15658
1113 15658 7358 5450 16214 11895 3316 11582 13514 1135 3406 12692 3878 -496 11698 12262
1127 12262 2753 9164 13086 262 -1818 6419 72 -4473 8008 10138 -147 5140 10163 -2318
1141 -2318 -6273 3753 -1544 -8749 2267 6852 -4758 -1973 7125 -1891 -9377 -571 -2081 -10872
1155 -10872 -3759 308 -8331 -5023 4391 -4233 -10328 -870 -2991 -14766 -8377 -1367 -10995 -9856
1169 -9856 3150 -1639 -11038 -3587 -2046 -14337 -13020 -4175 -8552 -9616 331 -2490 -9757 -3301
1183 -3301 -2295 -14698 -11604 -994 -8039 -11640 11 -29 -9868 -4050 1237 -9536 -10093 64
1197 64 -4964 -11488 -2180 903 -7320 -1898 4430 -4397 -6311 2627 -3647 -12501 -1152 4775 -3713
1212 -3713 -826 8437 1217 -5596 638 -1387 -7902 1186 6717 -1876 1042 10307 1490 -5400 5115
1227 5115 4432 -6265 107 9141 -1109 -3196 9799 8046 -2008 3572 7184 -1345 -1142 4372
1241 4372 -151 582 10035 5040 -2118 7781 9166 -5010 -3390 8746 837 -6383 6294 10178
1255 10178 -619 2454 9600 607 -5172 1210 122 -3528 3990 5250 -44 4889 7024 -5841
1269 -5841 -6384 6011 882 -9094 1511 8346 -3684 -5362 5556 1858 -4158 2009 976 -7774
1283 -7774 -4442 51 -5196 -1530 7292 713 -5107 2608 -1072 -13411 -5977 5759 -2624 -6214
1297 -6214 4692 3552 -6696 -3048 1219 -4429 -3850 515 -5041 -4596 3984 570 -5429 4512 6412
1312 6412 -8358 -7513 4905 -1343 -8285 4026 8408 -2979 -2750 5321 525 -3650 1920 962 -2116
1327 -2116 2786 1352 -3429 5571 11859 115 -2631 7356 1669 -9793 872 11652 3027 2220
1341 2220 11348 5303 -4300 1309 4402 351 5323 9359 1779 1988 8817 2597 -1136 10061 10686
1356 10686 -2502 -376 7827 519 -2655 9463 11739 3719 4216 4776 -2554 -645 4673 942 2404
1371 2404 11326 4790 -4780 4424 8921 -3594 -3799 8929 2660 -8570 713 8769 951 -699
1385 -699 5693 1988 -4495 -4130 -4582 -2627 3928 1610 -4865 1948 3864 -9970 -9561 5619 560
1400 560 -12857 -3679 4446 -8745 -11609 3099 3981 -6841 -5365 -3541 -10473 -10878 -5909 -5202 -1396
1415 -1396 2969 -4525 -10263 -4258 -7190 -15264 -6319 2736 -6619 -11194 -1373 -3183 -11695 -5110 973
1430 973 -7654 -9487 -3910 -9425 -12204 -1027 638 -6797 -2350 1625 -9506 -12867 -2604 -2367 -8193
1445 -8193 -1946 2183 -4023 -4751 -1032 -3270 -2364 687 -5301 -7778 1302 886 -7243 2558 12302 -1185
1461 -1185 -9459 3297 3741 -9735 -2784 11934 5830 -2745 2968 5144 -707 55 3962 4688 5499
1476 5499 2888 -1907 3888 10008 2536 1647 13968 10021 -6696 -1391 11701 3459 -1828 12779
1490 12779 15898 2070 1141 7983 3787 456 6950 8768 6101 7415 5367 2487 8065 9217 1312
1505 1312 3080 9797 2443 -2658 7979 11079 1964 4729 10709 2219 -2580 4890 4503 -430 5430
1520 5430 8080 -258 1025 8096 1964 -2810 4999 5384 -4294 -2126 4273 485 -849 5707 3834
1535 3834 -1804 -607 -2646 -6279 -612 3240 -3049 -303 6822 -1802 -10598 -216 3834 -7867
1549 -7867 -5976 5348 -1028 -10331 -2398 3496 -3210 -3721 578 -2898 -6076 -4834 -6318 -4192 2197
1564 2197 -741 -5822 673 1467 -10045 -8824 2710 -2052 -9946 -640 4217 -5120 -5767 2508 -1334
1579 -1334 -6997 -1813 -1497 -6143 -2425 1901 -2567 -931 3393 -2601 -6552 739 484 -6487 -1006
1594 -1006 4538 -2010 -3489 3638 1049 -3635 2019 2453 -4291 -1775 2985 -2221 -2185 6983 4565 -2693
1610 -2693 1974 4560 -4857 -4419 4779 2805 -1461 4548 5537 -1104 -415 2597 -1114 -571 4152 389
1626 389 -1758 4827 3541 -3105 2305 6855 -1922 -4413 3854 1776 -5258 1085 6225 -332 -1241
1641 -1241 4284 1028 -3939 221 -62 -4092 427 2872 -2052 -264 4833 -1371 -5678 668 269
1656 269 -7121 -2971 3705 -1871 -3410 2901 521 -6283 -2427 -464 -5644 -3863 1893 -2874 -4919
1671 -4919 1141 -601 -6444 -1289 1253 -6306 -6197 427 -3370 -6997 118 1762 -3779 -2279 695
1686 695 -5284 -6323 -933 -3023 -5494 1372 2532 -3856 -1589 2363 -4308 -6250 867 -237 -5193
1701 -5193 280 3834 -2258 -1893 3499 -542 -3828 1089 1218 -3714 505 3933 -1097 -160 5925 2008
1717 2008 -2202 3398 3609 -2891 81 5919 1482 653 7425 5324 -224 3444 4956 -1269 636
1732 636 6928 3461 1406 8058 6815 467 3711 6747 835 947 7234 4958 1487 6620 6921 1207
1748 1207 4016 7356 2000 1195 7263 3700 -562 5575 7679 1155 3201 8248 2625 -1032 4954
1763 4954 4064 -1424 2925 7027 2105 1746 5845 1777 -1985 2373 1877 -2282 2189 5384 -123 -611
1779 -611 4774 413 -4858 742 2349 -3947 -1757 3562 -1501 -3599 1793 563 -4910 -1610 897
1794 897 -4773 -4161 274 -2739 -4592 212 -392 -5434 -2174 -535 -6883 -6658 -552 -3835 -6992 -696
1810 -696 401 -6214 -4504 -1266 -6702 -8407 -2230 -2651 -6983 -2369 -20 -5849 -5336 -1147 -5441 -7720
1826 -7720 -1790 -2315 -7028 -2859 98 -5498 -4454 582 -3565 -6482 -1326 -1619 -7080 -3271 1451
1841 1451 -3262 -3780 2381 -260 -5949 -1465 -113 -5237 -2586 2818 -338 -1902 3038 1275 -3435
1856 -3435 -293 1587 -2895 -1048 4091 348 -1251 4241 3151 -2564 995 4646 -761 -1349 4411
1871 4411 2429 -1563 3694 5043 131 1147 5009 883 -1091 3698 2642 -1000 3608 5434 699
1886 699 1927 5737 1086 -1788 3344 3032 -1636 2736 6583 1236 451 5096 1601 -2147 2485 3463
1902 3463 -1281 1524 5585 526 -663 4048 1461 -2314 1943 3272 -2436 -1125 3514 -59 -1957
1917 -1957 2796 2522 -2121 75 1399 -3660 -2463 2230 -729 -2604 2936 2218 -4213 -1175 2138
1932 2138 -3231 -4565 1994 781 -3848 257 2053 -2601 -2654 962 -2393 -3545 215 -787 -3559
1947 -3559 764 1721 -3694 -1543 2813 -2207 -5506 817 1218 -4806 -1959 3286 -1279 -2737 2357
1962 2357 919 -3033 -272 570 -3035 -861 2348 61 -305 4211 1163 -3454 580 2059 -3153
1977 -3153 -288 4967 1599 -1132 3220 2761 -2001 1078 3933 46 71 4326 1425 -1245 3322 4525
1993 4525 146 2120 4942 243 -1472 3734 3010 25 3629 5884 1420 1055 3687 -127 -391 4118
2009 4118 2618 -285 3966 5456 -643 327 5802 1672 -2699 2696 4145 -1146 -285 4722 2513
2024 2513 -456 1988 1026 -966 716 1145 -1206 1818 3170 -2063 -1918 3821 618 -4475 873 3583
2040 3583 -4158 -4498 2085 364 -3673 267 2226 -2066 -2946 -2038 -4065 -3414 63 -1733 -2481 1415
2056 1415 -961 -7019 -3710 708 -4213 -5344 627 -352 -6109 -3315 -297 -3610 -3723 -550 -3151
2071 -3151 -4944 -2143 -3280 -5338 -702 1025 -4576 -3829 548 -3525 -7477 -1800 647 -4169 -3251
2086 -3251 771 -1776 -3896 -783 -1320 -2904 -1176 -1999 -4598 -760 2306 -2258 -2204 3846 438 -5869
2102 -5869 -1588 2755 -2162 -2881 3766 2744 -2630 -526 1865 -417 567 2053 185 725 2668 -553
2118 -553 -1069 4957 4588 -610 1627 5056 -1021 -3206 3439 4806 785 2923 5665 1336 -330 2424
2134 2424 1667 1228 4343 3557 548 3557 4780 -141 1140 6256 3024 -1623 2342 3915 -46 639
2150 639 5445 3315 1000 3090 1602 -580 2181 2668 -156 1935 4741 -114 -1981 4168 2993
2165 2993 -2543 576 3871 -872 -2931 1689 2460 -429 1233 1768 -1271 -1606 -870 -2657 -541 2920
2181 2920 -575 -2667 1751 431 -5587 -2578 3170 -1494 -4932 484 883 -4760 -3059 1592 -870
2196 -870 -2619 -611 -1890 -4016 -2086 -1946 -3243 411 1361 -3552 -3306 584 -2901 -5862 -591 1783
2212 1783 -3626 -3023 1611 -1334 -3967 -491 -270 -2908 -1195 -362 -3223 -1389 1591 -1191 -2238 1624
2228 1624 320 -4333 -1147 2383 -1394 -2022 2439 1385 -2273 -164 1911 -809 112 1708 -1145
2243 -1145 -1098 2341 218 -1236 3420 4014 -1604 -739 3318 72 -2572 2754 4718 732 1123 3244
2259 3244 648 -380 1829 1434 938 3115 1899 -624 2481 3584 -766 72 4891 2240 -2433 1576
2275 1576 3924 -423 -25 4290 2744 -324 1726 1479 -908 889 2101 -499 503 3371 -41
2290 -41 -1631 2479 1852 -3146 -481 2567 -1374 -2505 1778 1902 -1435 8 713 -2005 -1582 216
2306 216 -2010 -1430 1987 -507 -3785 319 1451 -3500 -2943 1911 -1233 -4644 -1103 448 -2980 -1663
2322 -1663 685 -907 -2635 -1193 -2698 -3738 -698 -1463 -3608 -73 1613 -3461 -3947 1063 -1042
2337 -1042 -5129 -1236 2005 -2412 -2970 1180 -395 -2856 -727 -65 -1931 -1134 -348 -2001 -850 1728
2353 1728 -1041 -1952 1657 1351 -2903 -634 2518 -1425 -2075 2700 1862 -1136 1256 2592 -748 -391
2369 -391 2093 -218 -902 2852 2428 -144 2295 3201 -53 -244 2956 1261 -293 2997 3696 329
2385 329 1703 3600 952 517 3895 1599 -340 2965 3406 -407 1334 4583 1600 -94 3904 2799
2401 2799 -1090 1111 3406 625 743 3660 2035 128 2019 1598 -850 1262 2943 -204 513 3690
2417 3690 880 -1696 1576 2067 -2344 -660 2820 -17 -1970 1474 807 -2321 -13 1153 -1881
2432 -1881 -1411 985 -1581 -2818 469 -451 -2693 -204 792 -2746 -2728 290 -2052 -4241 -528 -163
2448 -163 -3140 -1815 551 -2738 -3802 -1155 -1845 -4417 -1491 -71 -3182 -2579 -145 -2827 -3755 -677
2464 -677 -1397 -4167 -1473 -233 -3279 -2889 135 -1973 -3424 -677 -341 -3679 -1839 -1 -2602 -2491
2480 -2491 1015 -197 -2439 -156 326 -2959 -2216 801 -1377 -2059 1673 998 -1877 475 1132 -1807
2496 -1807 -1097 2020 -86 -1093 1891 1781 -765 634 2234 -384 -584 2941 1167 -594 2151 2776
2512 2776 -501 919 3563 886 238 3043 1887 -652 1613 3217 714 1565 3929 1724 185
2527 185 2996 2278 -598 1702 3287 1048 1362 3343 1924 -265 2229 2238 -680 1340 3374 563
2543 563 222 2955 1208 -739 1646 2414 -638 141 2489 323 -666 2115 1839 -1051 1203 1996 -1189
2560 -1189 -848 1413 -499 -1843 1591 976 -1811 470 1878 -1924 -2515 891 -701 -2883 219 1152
2576 1152 -1702 -998 937 -1667 -2277 -43 -688 -2321 -468 597 -2451 -1925 682 -1457 -2945 269
2592 269 -370 -3227 -1417 466 -2380 -2178 1051 -353 -2655 -140 -159 -2735 -1489 538 -1862 -1775 1232
2609 1232 6 -2162 74 650 -2356 -1714 1315 -615 -1409 1368 1019 -1530 -133 1412 -1271 -722
2625 -722 2147 138 -1175 1725 1452 -1278 897 3397 -185 -1011 2509 1005 -1319 826 2202 134
2641 134 579 2607 772 -68 1550 871 -685 1683 2792 -314 934 3230 508 -1406 2120 2143
2657 2143 -1250 360 2867 641 -663 2100 1398 -696 966 1335 -726 705 2053 -699 -547 2317
2673 2317 810 -1730 859 1795 -1917 -1157 1597 -304 -2044 749 1053 -1343 -374 802 -1551 -1474
2689 -1474 479 -834 -2141 929 713 -2434 -759 775 -2176 -2990 533 -204 -2869 -979 668 -2083
2705 -2083 -1932 -228 -1550 -2074 -164 -1136 -2963 -676 163 -3197 -2055 1259 -1300 -3349 -600 -12
2721 -12 -3184 -2088 552 -1163 -2346 -10 -640 -1996 -494 -357 -2170 -656 766 -1906 -1240 1993
2737 1993 140 -2632 169 1671 -1917 -1903 1799 405 -1524 878 1484 -930 63 1432 -207 -37
2753 -37 2017 8 -808 1891 1814 -783 1143 3299 35 -690 2332 1724 -862 1523 3085 1251 1288
2770 1288 2548 990 333 1906 1544 -75 2514 3054 13 759 3450 1705 -546 2098 3114 -135
2786 -135 804 3023 933 28 2641 2161 160 1737 1914 -409 910 2346 -91 -24 2950 1608 -1519
2803 -1519 1258 2349 -930 -1284 1875 610 -1153 589 1438 -433 129 753 -1143 -1106 725 -341
2819 -341 -1755 1074 689 -2781 -1193 1193 -1811 -2640 728 -206 -2868 -1286 201 -2282 -1722 262
2835 262 -1248 -2291 -631 -1537 -3264 -1189 -85 -2499 -1549 779 -1687 -3439 -841 -141 -3167 -1749
2851 -1749 599 -1280 -2414 -204 -1152 -2326 -747 -311 -2522 -1395 182 -2019 -2229 951 -88 -2723
2867 -2723 -607 756 -1946 -2048 1091 17 -2016 -318 603 -1186 -161 1107 -773 -469 1207 -859
2883 -859 -1468 1327 1509 -1317 401 2702 -386 -1876 1536 1740 -866 429 2730 759 -275 1435
2899 1435 652 -18 2064 1282 -105 1825 2124 -502 257 3351 1294 -654 2414 2885 -548 74 2822
2916 2822 1214 1 1961 1883 -103 1099 1452 -424 817 2406 431 51 2733 1556 -1240 922
2932 922 2413 -545 -881 1787 1271 -749 898 1134 -723 143 882 -925 -717 1594 -8 -1839 733
2949 733 1167 -1918 -1137 1538 -846 -2142 365 684 -2201 -1278 583 -977 -1091 298 -796 -1761 -3
2966 -3 -1184 -2786 -175 1168 -1899 -1812 1213 -657 -3191 -604 398 -1919 -1613 531 -893 -2076
2982 -2076 -302 -480 -1823 -120 -155 -1774 -922 918 -1372 -1812 972 344 -2232 -584 1357 -1226
2998 -1226 -2004 807 273 -1526 302 1155 -709 196 1453 -1075 -898 1390 365 -1207 1290 2141
3014 2141 -572 -136 2164 90 -991 1409 1727 -311 676 2032 -143 289 1933 876 -239 2198
3030 2198 1661 -733 1235 2362 -25 -118 2372 1735 -456 1231 2279 -382 208 1850 1002 289 2019
3047 2019 1326 -738 701 1550 -668 270 2168 295 -692 1681 1307 -1075 121 1563 -229 -837
3063 -837 1350 340 -1233 293 690 -1261 -345 1034 -763 -1605 857 201 -1762 -59 997 -1275
3079 -1275 -1329 765 -711 -2262 -168 -389 -2045 -686 467 -1409 -1478 308 -1178 -2612 -516 -195
3095 -195 -2482 -1294 636 -1626 -2357 -128 -853 -2529 -1009 10 -1781 -1624 1 -1319 -1969 39
3111 39 -36 -2048 -271 326 -1902 -1547 698 -579 -2005 602 514 -1863 -910 788 -1276 -1288 838 -108
3129 -108 -1007 440 946 -1107 -384 1147 -296 -1073 1279 514 -615 923 1287 -291 -96 1997 427
3146 427 -654 1682 1597 -544 744 2204 326 30 2146 1302 -182 1059 1845 -275 922 2357
3162 2357 824 518 2518 1723 -338 1257 2198 84 1041 2490 1194 187 1979 1587 -539 964
3178 964 2177 -15 303 2301 912 -548 1425 1660 -189 261 1680 40 -408 1222 591 -567
3194 -567 743 981 -394 -326 1084 -578 -1442 838 196 -1519 -165 1036 -1032 -1092 999 -786 -1887
3211 -1887 -67 386 -1560 -678 391 -1279 -1566 -22 -688 -1835 -385 -32 -1904 -900 210 -1140
3227 -1140 -1640 -19 -715 -1922 -733 -62 -1651 -1420 -146 -1066 -1650 102 -341 -2385 -980 99 -1705
3244 -1705 -1732 326 -651 -1662 -239 254 -1789 -1161 408 -1061 -1147 631 131 -1335 48 513 -1154
3261 -1154 -657 843 -689 -1371 841 642 -1193 146 1037 -282 -581 1330 164 -819 665 1089 -682
3278 -682 238 1627 267 103 1568 706 -578 892 1615 -419 688 1814 469 -134 1713 1369 -513
3295 -513 1120 2105 285 151 1764 609 -121 1479 1436 -406 880 1964 296 134 1502 702 -543
3312 -543 1193 1243 -294 81 1641 229 -784 864 722 -823 522 1438 -578 -11 1317 -58 -982
3329 -982 927 694 -1119 -242 1274 -773 -1013 535 -240 -1179 -327 462 -1091 -771 263 -1175 -1014
3346 -1014 385 -120 -1584 -104 197 -1717 -1061 899 -847 -2006 374 -55 -1743 -915 2 -1109
3362 -1109 -1419 -14 -226 -1412 -128 -649 -1424 -374 376 -1141 -1108 689 -295 -1515 -22 484 -1275
3379 -1275 -943 698 -261 -1127 371 372 -923 104 301 -915 -272 961 -35 -1056 829 635 -962
3396 -962 496 1288 66 -408 1422 862 -778 903 916 -300 818 1305 312 77 1517 815 -558
3413 -558 850 1551 -7 406 2057 614 -608 1398 1544 -261 486 1525 156 173 1518 552 -52
3430 -52 1303 1283 -141 720 1313 -136 -255 1570 815 -841 630 1394 -399 -311 1076 279 -608 502
3448 502 598 -346 453 1034 -426 -373 712 -340 -973 592 647 -1297 -454 716 -758 -1157 438 -186
3466 -186 -1304 -47 154 -1371 -918 22 -815 -1227 286 -488 -1693 -492 208 -1694 -1140 362 -787
3483 -787 -1762 -341 -284 -1491 -950 -37 -1316 -1342 71 -679 -1420 -412 -379 -1857 -659 230 -1205 -1319
3501 -1319 513 -88 -1577 -421 331 -1022 -872 486 -362 -1329 -134 8 -635 -136 621 -521 -341
3518 -341 821 -595 -891 831 611 -786 -30 1676 -142 -809 870 706 -411 317 1390 70 -34
3535 -34 1463 242 118 1452 872 -577 1156 1765 -221 299 1531 580 -324 1337 1309 253 638 1410
3553 1410 539 484 1141 964 413 1400 1466 96 268 1602 241 148 1479 1158 -258 660 1650 -180 -312
3572 -312 859 535 -180 818 631 -199 228 522 -441 -40 1176 -194 -977 651 847 -797 -536 955
3590 955 -129 -797 343 43 -943 -486 259 -937 -484 90 -435 -1058 302 -532 -1377 -530 201 -1135
3608 -1135 -1053 352 -714 -1726 -379 97 -1423 -1126 64 -891 -1058 10 -616 -1312 -173 -24 -1733
3625 -1733 -819 370 -936 -1438 149 -420 -1163 -466 627 -636 -850 -70 -299 -827 68 60 -649 327 409
3644 409 -621 -627 837 135 -854 702 577 -620 -10 921 -83 -768 713 588 -619 657 831 -2
3662 -2 354 1351 238 7 1218 715 -175 390 1600 -53 -272 1454 798 -94 1198 1187 12 438 1247
3681 1247 153 -50 1062 799 83 1020 1159 -259 173 1206 234 -105 880 1095 -246 226 878 -64
3699 -64 -78 676 229 -248 931 576 -650 423 971 -319 -440 946 123 -852 503 246 -791 -235
3717 -235 512 -246 -529 330 -447 -1329 -208 97 -682 -344 333 -574 -1191 142 -183 -1429 -519 135 -1001
3736 -1001 -1074 18 -578 -1326 -321 128 -1364 -602 270 -744 -1217 -272 -433 -1298 -349 84 -1057 -928
3754 -928 147 -870 -1085 -66 -8 -1252 -174 25 -949 -664 391 -403 -1222 297 325 -936 -140 595
3772 595 -327 -506 446 84 -558 447 718 -598 -208 779 -42 -462 632 811 -435 458 808 -56 6
3791 6 925 650 -287 905 916 -33 657 1440 -62 46 1250 953 -30 691 820 -185 362 1284 457 -58
3811 -58 1172 722 -57 647 1148 -5 524 1136 401 -41 866 685 -469 309 944 -108 -45 1023 232
3830 232 -589 575 859 -234 119 643 -144 -663 569 -34 -720 25 290 -511 -141 481 -494 -739 242
3849 242 22 -1043 -241 565 -715 -749 419 -610 -1215 -196 -182 -976 -971 327 -785 -832 267 -313 -1288
3868 -1288 -149 133 -1110 -703 56 -743 -948 339 -273 -1155 -495 -12 -1105 -828 -64 -807 -876 266
3886 266 165 -946 -329 182 -689 -646 310 -90 -700 146 343 -821 -181 349 -327 -751 313 219 -355 155
3906 155 521 -564 -346 689 -24 -328 694 725 -356 314 479 -232 -354 1264 255 -244 803 723
3924 723 -167 363 1122 492 95 1107 546 -257 649 929 -72 384 1200 344 -34 740 704 -189 660 878
3944 878 76 189 1234 515 -94 664 937 -164 403 934 182 -237 926 471 -470 593 571 -322 260
3963 260 559 -29 -342 353 162 -578 164 423 -286 -399 769 -205 -718 31 -81 -903 -84 528 -676
3982 -676 -595 214 -131 -707 -160 -224 -878 -674 47 -911 -1157 28 -205 -1042 -411 25 -1221 -830 209 -749
4002 -749 -1288 -174 -272 -1116 -126 327 -838 -956 313 -452 -892 -11 -208 -886 -480 149 -681 -848 312
4021 312 -255 -748 36 249 -336 -291 421 -310 -274 347 397 -801 260 531 -290 -123 955 250 -562 479
4041 479 412 -234 192 869 -138 -202 911 561 -261 422 539 -166 493 1104 206 -255 935 899 -71 557
4061 557 1090 268 262 1213 602 -386 1011 775 -191 724 1149 221 132 994 63 -55 758 667 -94 336 926
4082 926 71 -153 654 682 -255 213 700 -433 103 643 181 -562 677 140 -271 83 283 -404 -257 412
4102 412 -1 -608 258 81 -830 -220 867 -637 -791 279 -495 -906 -90 -264 -866 -472 190 -585 -759
4121 -759 456 -242 -879 -301 75 -1125 -759 247 -348 -1091 -67 -214 -839 -211 -56 -549 -536 133 -513
4140 -513 -820 -120 15 -988 -419 336 -769 -704 213 -139 -707 -286 225 -488 -152 504 -228 -505 89 443
4160 443 -482 156 694 -407 -321 688 56 -487 453 674 -260 93 768 -50 -28 1078 164 -398 659
4179 659 724 -31 114 1073 -71 4 823 529 -128 667 941 90 158 742 352 -214 768 790 -364 590 1044
4200 1044 -198 -313 985 444 -120 642 762 -337 111 811 -134 -315 601 208 -362 399 426 -588 -169
4219 -169 349 -205 -113 304 261 -558 64 537 -456 -278 637 -67 -833 159 249 -975 -556 7 -283 -578 14
4240 14 110 -758 78 189 -1078 -749 150 -696 -1110 162 -167 -1104 -285 330 -808 -909 -74 -364 -1169 -10
4260 -10 -141 -1021 -383 107 -614 -532 7 -496 -987 -396 276 -596 -378 278 -555 -844 -259 163 -659 20 273
4281 273 -633 -237 426 -290 -513 175 278 -397 136 581 -407 -688 520 273 -692 416 920 -391 125
4300 125 699 -156 -69 977 98 54 681 757 -302 25 938 91 122 885 752 -133 594 823 40 124 973
4321 973 525 170 919 848 -95 473 1123 150 -181 806 529 -189 479 728 -255 147 299 116 -330 643
4341 643 703 -315 163 427 -186 -31 617 -125 -522 378 71 -775 3 746 -336 -331 524 58 -626 -329
4361 -329 -29 -551 -508 339 -161 -570 106 -154 -855 -129 87 -657 -598 269 -522 -1129 19 -128 -926 -236
4381 -236 80 -501 -720 4 -232 -680 -209 84 -710 -567 251 -563 -708 152 5 -867 -178 218 -638 -412
4401 -412 217 -486 -783 248 -102 -830 -46 341 -485 -361 -28 -219 -320 316 315 -653 80 587 -203 -484
4421 -484 640 -48 -250 197 129 -49 56 568 -182 -309 720 436 -174 509 660 -87 -61 887 334 -200
4441 -200 669 827 -216 421 994 -121 91 974 306 -185 519 584 -186 531 1090 149 -4 1010 447
4460 447 -286 285 881 157 65 1083 225 -121 260 387 -258 -40 524 -117 -128 507 -324 -217 322 479
4480 479 -566 40 718 -198 -480 417 23 -809 147 317 -831 -361 221 -394 -514 22 -178 -614 -246
4499 -246 195 -661 -479 25 -438 -756 -112 -144 -823 -344 47 -581 -617 -96 -207 -867 -233 -22 -925 -471 62
4520 62 -280 -501 280 -119 -500 170 259 -515 -543 249 -297 -612 -227 53 -577 93 579 -523 -571 293 -196
4541 -196 -482 581 125 -396 -320 599 -203 -564 506 343 -396 142 508 27 -56 576 165 -9 632 719
4561 719 -525 237 763 18 42 1007 167 -303 626 495 95 211 745 -67 181 977 427 7 688 536
4581 536 -48 355 992 -193 50 842 634 -131 584 873 -104 163 834 346 -271 517 584 -189 41 592
4601 592 -195 34 549 154 -491 339 123 -307 -57 267 97 -424 401 166 -565 -386 237 -485 -266 496
4621 496 -258 -601 174 -53 -512 -189 258 -877 -561 104 -353 -838 -174 89 -892 -329 -41 -769 -701 -28
4641 -28 -587 -1042 -194 91 -699 -402 265 -625 -686 299 -15 -698 -172 192 -508 -334 534 -309 -679 -95 67
4662 67 -509 -258 329 -606 -117 316 109 -532 6 424 -535 -247 576 -29 -442 194 421 -245 8 233
4682 233 -364 -52 667 158 -174 275 99 -348 79 867 348 -72 746 45 -66 487 651 164 208 875
4702 875 96 -80 407 588 -351 470 684 45 162 532 275 -250 759 609 251 429 620 170 23 633
4722 633 203 -281 218 525 -145 377 716 109 -144 482 195 -431 464 453 -64 -152 239 -202 -70 157 -43
4743 -43 -291 -260 186 -219 -420 457 85 -498 -86 256 -675 -287 132 -348 -629 256 25 -727 -49 36 -542
4764 -542 -447 -69 -402 -467 148 -169 -928 -401 22 -569 -383 371 -335 -679 16 -19 -692 -110 -76 -568 -537 115
4786 115 160 -675 182 244 -328 -225 360 -136 -206 231 44 -445 56 141 -386 -250 198 -18 -435 143 -39
4807 -39 -454 -87 351 -140 -361 273 173 -271 345 71 -147 127 321 78 -180 756 476 -195 404 622
4827 622 9 198 693 30 -264 686 540 -134 471 549 -168 73 553 -21 -232 477 395 -101 282 564 127
4848 127 -89 500 383 -164 411 482 -282 185 405 -110 -302 498 67 -84 57 375 -352 -45 501 43
4868 43 -280 88 161 -230 -69 186 -336 -469 359 -14 -431 242 100 -565 -339 176 -810 -634 -15 -79 -681
4889 -681 48 -129 -421 -520 234 -456 -753 33 42 -921 -455 90 -430 -173 -41 -25 -832 -16 -71 -368 -143 144
4911 144 -616 -347 361 -571 -577 -38 48 -417 -91 525 -181 -536 226 -176 -725 54 270 -23 -306 291 -167
4932 -167 -562 191 260 -482 -3 433 -42 -161 321 239 9 265 549 103 70 890 227 43 453 484 -143
4953 -143 635 419 -81 86 664 281 -47 455 377 -138 378 363 314 246 577 227 -42 495 391 -283 249
4974 249 424 286 34 722 245 -174 457 664 -177 154 360 190 -395 411 464 -26 -57 274 -83 -104 248
4995 248 -68 -216 200 120 -433 69 283 -429 -414 105 -336 -498 -284 122 -566 -266 75 -253 -585 -48 -363
5016 -363 -429 -338 -35 -477 -383 32 -286 -303 -39 -250 -747 -382 -101 -630 -523 110 -371 -618 -265 90 -632
5037 -632 -192 -59 -409 -373 165 -25 -759 -26 95 -426 -400 188 -371 -758 342 14 -229 -150 367 -153 -342
5058 -342 170 47 -186 410 352 -227 -2 397 164 -11 735 103 -307 465 447 -204 303 339 139 -26 469
5079 469 182 167 363 645 -7 -44 785 201 -2 455 527 95 260 379 65 -36 538 390 70 229 534
5100 534 -153 280 724 43 184 410 434 -169 244 264 -255 372 420 33 -274 182 341 -292 -70 735 101
5121 101 -30 120 -222 -107 307 -44 -398 107 1 -286 -131 153 99 -451 -215 170 -441 -422 197 -94 -526
5142 -526 86 -49 -353 -117 227 -427 -478 227 -334 -332 20 160 -424 -44 205 -318 -646 138 -360 -308 162
5163 162 -169 -534 -702 -106 -526 -263 217 -37 -325 -303 437 -327 -250 1 -29 -388 -96 120 -232 23 259
5184 259 -435 -639 219 -97 -177 402 139 -257 118 521 -177 -199 647 193 -40 211 423 -67 145 548 188
5205 188 -33 366 248 30 509 715 180 279 377 55 -15 394 536 -224 345 446 97 142 608 144 -240
5226 -240 198 409 -80 89 712 145 340 387 166 -203 320 289 -406 -107 667 254 -396 295 221 -154 -114
5247 -114 232 -127 -58 435 55 -420 161 7 -530 -28 390 -292 -493 104 107 -290 30 143 -364 0 22
5268 22 -270 -423 -66 147 -613 -185 208 -400 -321 -28 -388 -564 -26 -15 -362 -343 263 -443 -336 259 -429
5289 -429 -480 -64 -103 -446 -477 169 -385 -264 -141 -142 -661 -231 -134 -361 -321 302 -47 -175 -111 -11 -403 -55 191
5312 191 -108 -187 188 178 -774 -15 464 -301 388 700 221 -70 212 316 -87 330 648 5 -248 334 217
5333 217 -174 485 408 40 207 334 -106 -61 673 86 142 203 337 165 452 713 -44 -26 409 307 28 391
5355 391 742 346 206 175 349 182 89 515 -253 315 757 71 -60 589 303 -453 496 272 8 -186 330
5376 330 -119 -150 411 -115 -198 -86 28 -171 -228 360 -121 -373 129 51 -431 -117 -44 -390 -367 -14 -96 -564
5398 -564 -117 0 -339 -283 338 -406 -425 63 -36 -392 -130 -40 -589 -366 -113 -202 -257 148 -297 -579 -158 150
5420 150 -429 -661 15 -384 -334 285 49 -308 -97 216 -142 -358 26 52 -258 113 290 -435 45 333 -171
5441 -171 -79 241 265 -370 31 -3 -270 5 355 209 -450 495 107 -246 214 400 10 -22 473 361 -141
5462 -141 409 355 5 -27 535 119 -84 456 240 78 258 576 23 198 582 144 102 441 175 -329 246
5483 246 271 110 6 516 462 -161 85 605 -58 207 547 177 -353 370 303 -305 206 62 65 -176 523 -123
5505 -123 -413 281 -129 -399 -19 417 -667 -242 241 -154 -439 -84 140 -409 -182 321 -482 -347 90 -183
5525 -183 -273 -202 3 -478 -270 130 -162 -330 238 1 -619 -143 52 -137 -357 36 -60 -255 -180 23 -669
5546 -669 -137 -170 -260 -363 151 82 -474 -129 1 -234 -362 219 -163 -381 234 40 -213 -55 188 -212 238
5567 238 138 190 -185 -94 -4 -380 193 273 3 -241 491 -158 -172 415 316 -189 -37 353 -7 -216 498 338
5589 338 133 200 140 118 -70 419 -6 63 606 307 -74 519 358 -12 413 310 258 -164 331 468 -161 23
5611 23 452 73 -208 468 13 107 290 321 -86 -48 362 -65 -48 676 -145 -332 130 470 -252 -269 184 -292
5633 -292 7 -96 266 -603 125 207 -503 -249 409 81 -317 211 -156 -488 -449 473 -16 -461 -18 -79 -457
5654 -457 39 -176 -80 -320 79 -140 -450 46 -160 -716 -260 -34 -330 -84 131 -154 -514 237 8 -481
5674 -481 -313 -114 -448 -208 381 -175 -485 -44 206 -554 -485 154 -161 -184 -42 -182 -381 97 558 -11 -268
5695 -268 105 -76 -242 449 151 -398 -202 -27 169 -45 260 209 -313 256 610 80 96 506 206 -170 224
5716 224 147 -3 -90 482 -2 115 329 -154 -149 328 370 -204 295 456 -67 38 586 350 93 456 470 9
5738 9 221 81 71 -58 539 97 -105 304 317 94 159 751 335 -33 309 426 -221 -161 55 -139 -111 124
5760 124 -232 -290 152 156 -369 -53 275 -161 66 231 -187 -344 -111 88 -59 -228 213 -248 -540 95 28
5781 28 -343 -136 -44 -224 -773 -222 -199 -390 -107 215 -419 -168 -43 -539 -511 -150 -23 -714 -9 342 -584
5802 -584 -359 -188 -378 -565 16 -373 -725 -146 -127 -267 -118 266 -136 -620 -2 -7 -610 -322 337 -62 -228
5823 -228 228 -72 -350 171 149 -155 29 420 24 81 261 52 -25 220 378 150 1 300 -175 131 714
5844 714 400 -119 229 -32 -178 19 360 260 -65 279 145 -38 85 359 164 -368 565 240 -213 493
5864 493 419 -4 41 745 247 -81 310 195 -163 130 346 -16 158 271 -126 -142 475 251 5 170 427
5885 427 75 68 366 -100 -266 253 208 -164 -51 -37 86 -579 -22 74 -42 71 171 -62 -103 282 -18 -12 165
5908 165 -348 -120 57 75 -430 -306 60 -133 -268 -73 86 -408 -42 184 -61 -242 195 146 -112 -219 83
5929 83 -408 -443 71 -259 -462 69 8 -218 -169 317 -463 -452 202 -279 -375 106 158 -187 -349 284 -543 -244
5951 -244 277 197 -105 211 230 -234 -113 73 -116 -248 344 242 -109 86 93 -120 99 684 139 -166 530
5972 530 223 -17 369 643 237 137 461 231 -30 295 516 -237 193 233 212 5 482 339 -321 88 490
5993 490 115 -44 159 70 -150 245 165 -108 415 301 -252 137 91 -6 -141 7 81 128 -103 121 -131 -140 203
6016 203 50 -305 -28 193 -194 -315 319 -289 -548 382 79 -251 -147 -25 -114 -91 52 -329 -313 -87 33
6037 33 -247 -307 10 18 -352 -220 -122 -331 106 203 -368 -325 -17 -480 -414 -59 -266 -467 -239 371 -307 -170 -7
6060 -7 -87 158 -330 -77 -527 -304 86 -276 -156 -57 179 -378 94 323 -250 -51 285 -211 45 249 -52
6081 -52 -373 266 318 -421 194 243 -262 -350 474 56 -226 167 473 -121 242 377 165 -78 363 261 -181
6102 -181 4 146 9 116 514 208 -422 181 305 29 18 412 -49 -175 244 198 -132 78 322 -116 336
6123 336 378 19 -60 493 425 -16 -15 315 -187 55 267 40 3 408 207 -243 102 453 185 -67 167 147
6145 147 -249 270 370 -60 81 215 -39 -349 270 -30 -267 130 177 -577 -61 -118 -408 -462 -50 103 -303
6166 -303 -119 -5 -311 -336 91 -137 -281 -245 -132 -439 -296 160 -198 -183 -3 78 -518 134 -417 -347 58 -13
6188 -13 -117 -515 -91 -138 -144 -48 92 -154 -209 -20 -7 -209 -15 155 -167 -344 65 53 -133 221 5 -504 176
6211 176 293 -87 -7 437 13 -169 100 215 -79 282 174 -183 -170 166 -86 67 321 151 -421 -143 328
6232 328 172 56 457 205 -167 302 254 96 127 262 250 -85 330 340 110 478 551 -38 99 324 35 -39
6254 -39 158 -26 -12 137 519 -173 -542 349 132 242 90 -34 -124 286 132 42 -78 170 260 -339 273 210
6276 210 -214 -183 342 149 -211 57 -172 -287 -189 409 -378 -151 374 237 -598 -279 66 -244 -85 -117 -9
6297 -9 -201 141 -152 -425 -55 68 -233 -123 122 -78 -171 20 76 -504 35 243 -94 -344 -142 46 -460
6318 -460 -149 -31 -288 -132 -274 16 -246 210 -61 -219 150 -24 -276 -224 -5 -156 -322 22 -11 -351 55
6339 55 89 -222 -110 164 287 -1 310 142 55 -84 250 11 103 325 83 -121 -221 -55 87 381 378 343
6361 343 54 419 359 -141 141 252 -234 -108 547 -17 -211 114 34 134 232 259 -131 -164 377 153 -86 215
6383 215 422 164 -19 291 188 4 59 377 -28 -13 380 17 -60 -61 103 -195 236 213 -8 98 -54 24
6405 24 -245 116 -41 -112 170 145 -153 -161 149 -336 -32 130 91 -155 -223 99 -89 -193 378 -397 -571 18
6427 18 209 29 -189 -68 -7 -68 -10 126 -351 -19 81 -464 -106 -26 -351 -264 87 70 -297 -122 109 -300
6449 -300 -166 -45 -263 -306 250 84 -252 -144 167 -45 21 142 7 -49 310 312 -219 129 207 51 57 158 -171
6472 -171 -433 -195 37 -73 -5 72 -133 27 139 145 112 -219 287 59 295 316 418 13 345 182 76 15
6494 15 364 203 195 153 115 181 133 316 -173 281 347 -60 -100 428 204 58 455 503 126 107 719 -16 -68 384
6518 384 163 152 -7 67 -142 -158 294 44 -175 234 208 -155 279 86 23 -265 380 364 -27 28 -171 -227 -45
6541 -45 193 14 207 -303 -276 -125 190 252 -325 -386 -41 -133 2 -89 -172 -531 -113 381 -288 -261 54 -34 -282
6564 -282 158 -130 -304 -16 83 -391 -229 32 69 -330 -232 206 -335 -40 337 -254 -195 -2 -25 -485 -43 50
6586 50 -213 -241 -80 234 -125 -175 171 -98 343 190 -363 72 400 -167 -297 262 26 366 -108 196 38
6607 38 -363 505 367 -82 -167 559 226 124 317 -13 141 260 -111 -118 48 -128 328 18 77 171 71 8
6629 8 310 208 -111 95 -15 -17 181 553 -151 458 449 -95 87 -12 328 -279 77 163 45 358 159 146 -191
6652 -191 151 29 -107 -4 458 -207 -105 -119 85 -7 173 37 21 -31 276 -72 -54 65 129 -65 103 -83
6674 -83 -220 -209 160 -195 -44 165 -222 -505 176 50 -332 -189 66 -136 -337 -49 123 -323 -159 101 -380
6695 -380 -309 150 -134 -81 56 90 -482 -152 182 -351 -337 136 -120 -403 21 134 -341 -148 123 -250 -206 -19
6717 -19 19 -77 305 51 -236 -64 -44 -271 -73 380 -146 57 232 222 -298 -218 31 -118 -16 534 210 -175
6739 -175 67 333 58 52 306 -4 -258 -2 213 292 368 268 158 91 118 37 -65 498 251 197 217 434 8
6762 8 15 313 62 23 51 194 -20 233 178 71 6 -69 284 -174 -241 42 105 -127 -108 104 -218 -184 -40 25 -75
6787 -75 618 103 34 266 1 -107 8 13 -77 -226 366 -149 -330 38 179 -225 -5 82 -350 -294 -233 156 -318
6810 -318 102 -182 -7 -50 -50 -112 -202 -165 -46 -159 -285 -6 -398 -39 -201 -107 -216 -144 -55 -403 -274 67 -362
6833 -362 -286 -161 -277 -121 -256 30 -174 -499 88 71 -231 -19 -188 -188 -188 -26 -227 -287 27 139 -313 142
6855 142 -110 -335 259 358 -51 45 240 -84 -72 166 162 -100 218 33 104 -218 137 279 -56 -33 80 46 98
6878 98 186 -39 -83 98 125 52 26 237 -230 224 -40 122 360 -30 101 -47 -197 297 -103 -177 377 59
6900 59 -11 -48 372 -2 298 278 179 310 118 42 -305 36 161 -189 -166 34 105 -113 -31 154 -110 -175 280
6923 280 -294 97 91 -38 -126 25 -92 -13 -48 146 -56 -239 203 -20 -57 -222 95 -313 -232 166 96 -125 175
6946 175 -260 -214 162 59 -215 125 -30 141 -302 -47 -21 -331 -495 54 -5 -324 9 -5 -330 -90 -228
6967 -228 -62 -166 444 -1 -191 280 -114 -9 -197 -37 -6 -198 247 118 -416 -109 112 -353 -8 174
6987 174 -196 197 40 229 -167 222 -305 -47 -34 148 16 -10 286 -39 -31 102 302 248 96 151 -68 11
7009 11 -121 205 244 105 86 -261 87 320 -32 108 112 144 -3 -48 148 2 58 273 329 241 255 227 -267 -171
7033 -171 -64 26 -20 211 226 -256 -81 148 -15 -221 118 35 14 245 38 -272 -61 -199 -68 -216 -44 197
7055 197 -222 89 59 -287 -114 170 -232 -235 287 -94 -313 -212 -175 -19 -206 98 -9 -241 -107 -69 -70 -238
7077 -238 296 -325 -21 -44 -155 -221 -218 54 -234 -46 -170 -484 -112 267 1 -139 66 149 17 53 -286 -152
7099 -152 -316 201 -110 -334 92 78 101 -132 -135 43 51 -38 174 -184 60 80 -161 115 235 -64 -78 31 237
7122 237 203 90 158 -196 275 37 45 -61 324 125 -31 80 262 191 -113 121 -194 -49 217 64 2 20
7144 20 -133 89 -191 169 64 202 9 379 119 -58 0 252 74 0 386 13 -155 239 29 -182 261
7165 261 -71 271 238 211 -132 -241 120 139 -194 188 5 204 58 174 -181 -26 372 177 20 -262 -199
7186 -199 -12 -80 89 -62 -239 90 -80 -381 18 -120 -87 -148 451 21 -88 149 -117 -118 82 -332 16 35
7208 35 -31 -195 -255 -94 42 -27 -149 66 75 -241 -147 53 3 -305 -24 -156 -227 133 55 -25 -125 85 78 -110
7232 -110 381 216 60 58 4 -25 -41 6 170 109 -165 210 -36 139 260 -65 40 -29 -123 -306 -51 108 20
7255 20 196 40 29 -204 32 -23 -211 -152 247 15 48 248 216 142 -1 102 48 46 93 -250 287 252 30 175
7279 175 187 127 -108 163 57 -268 26 102 371 38 97 126 -141 132 154 -88 130 20 -153 -399 33 -5
7301 -5 -135 -143 272 -280 -127 318 155 -310 223 134 -59 -184 -147 119 -151 183 11 -156 149 -92 -263 -205
7323 -205 -13 -232 -113 131 -244 -369 135 -7 -428 -164 -56 -182 -296 -98 -59 -212 -343 179 52 -59
7343 -59 -404 48 -23 38 -61 321 10 24 -37 -194 -181 -261 -30 27 120 -199 26 -135 -52 -286 -13 32 -237 -18
7367 -18 14 149 261 -194 -24 -214 301 323 -154 94 204 268 282 -280 127 145 101 201 -43 160 193 -50 -35
7390 -35 -6 465 174 -243 108 -332 -31 270 383 -24 199 282 -82 409 472 0 103 299 -29 159 260
7411 260 112 -274 57 -181 145 -22 -16 -54 44 218 -58 -135 -37 224 -25 -303 42 -15 -134 -87 152 -66 71
7434 71 193 69 -113 266 35 -197 114 -55 3 -32 277 115 85 -306 -126 -304 -237 141 -231 -117 177 255
7456 255 34 154 -112 -103 -190 157 4 -157 -35 -91 -322 -137 70 -97 -82 116 -214 -107 349 227 -311 -83
7478 -83 13 -461 19 -494 -285 -64 -18 143 -271 -177 -8 -17 -329 -108 -178 -132 108 171 -142 96 57 -126 151
7501 151 95 -40 -47 124 34 -4 -297 -74 -282 -306 90 297 188 -1 13 167 218 136 270 -37 118 -59 22
7524 22 -55 192 -21 67 43 -100 -189 -145 474 -137 89 75 93 82 68 266 -237 57 168 -42 -102 19 54 -31
7548 -31 -369 224 260 146 -16 -116 158 -301 -11 -71 -148 88 -34 19 -135 -132 -13 61 213 -58 -126 95 145
7571 145 -293 -19 72 -275 157 -37 -214 9 17 -150 -166 -20 393 -244 -36 -76 -39 -256 69 -53 -71 247
7593 247 -111 -111 -214 186 -7 -318 312 -103 -336 -225 -27 -507 -248 -26 10 -130 135 -170 -156 -109 -48 -174
7615 -174 90 75 -105 25 -63 103 -99 7 -83 201 -283 8 -173 197 136 78 31 -123 221 -358 -44 250
7637 250 87 94 -153 19 84 -28 141 -37 196 315 177 -34 -25 176 35 59 179 98 -95 159 -37 -515
7659 -515 3 52 26 -96 -117 514 -83 361 181 92 -450 103 384 -94 52 175 21 -105 -142 -287 -86 -91
7681 -91 16 -287 350 245 201 -199 146 -187 33 -93 29 197 152 -215 -65 -94 -12 132 -102 282 153 -104
7703 -104 108 68 -247 -238 251 -345 -1 26 71 -157 23 -142 -44 -94 -120 133 35 -168 316 -310 -97 -186 17
7726 17 -127 -169 337 -90 -181 -173 92 -116 -99 -137 -243 -114 212 -29 -85 -49 -92 66 -58 187 -359 -105 255
7749 255 -180 -82 305 248 85 222 -82 76 -119 -24 -105 133 16 354 347 3 -58 66 -65 82 167 23 60
7772 60 -60 280 -2 169 190 292 61 25 100 309 -157 222 174 99 -91 122 41 -61 -177 314 328 88 -154
7795 -154 35 135 -39 308 -16 158 -93 18 -209 -4 152 165 274 62 -169 -51 -62 -138 -481 18 274
7816 274 198 194 144 210 -148 206 74 -216 -83 186 -92 449 44 1 -519 -233 -1 -163 -266 68 -28 49 194
7839 194 409 -43 -44 61 -56 -48 129 -357 -94 7 39 -136 -193 -114 -279 3 103 -2 -140 62 -233 -49
7861 -49 -354 97 -34 97 -153 164 -237 -264 -29 -96 -104 46 84 -91 -92 266 -147 -461 16 92 60 114 180 -135
7885 -135 -115 229 24 -18 106 -110 248 54 260 189 -68 25 -44 -69 26 -40 -91 240 397 218 -31 173 -137
7908 -137 -42 -173 136 54 147 24 443 307 -12 79 40 -186 173 -316 74 -98 -54 -55 -3 294 45 298 -21
7931 -21 -37 -178 188 -194 219 206 -30 -45 266 -59 -116 -5 -108 -177 -217 155 -84 -93 -184 -21 -82 140 -188 -72
7955 -72 47 9 -87 83 -184 -123 -21 -73 68 191 -378 -233 -248 -236 -179 135 -160 -62 133 -15 -307 -68 73
7978 73 -67 -55 -227 -121 -290 290 129 -250 -26 93 -342 -225 -24 90 -59 -111 99 209 22 374 16
7999 16 238 -65 -141 -152 -217 141 -69 -211 -37 -164 -226 -11 106 174 53 -21 -316 3 111 -128 -88 -203 -37
8022 -37 -209 43 25 48 41 175 137 140 202 -130 -91 -155 -102 43 160 -49 28 91 -7 52 4 -102 132 36 264 72
8048 72 177 -84 -128 -54 -14 -360 -55 242 -193 88 -155 -108 -114 -155 -343 -12 -23 20 -242 -36 41 10 -115 18
8072 18 58 -219 97 272 -30 14 0 341 -20 -230 -95 -61 198 33 -410 -174 252 -217 167 -227 -152 -159 -309
8095 -309 -49 -68 204 153 36 -162 40 129 -75 -41 24 57 -324 -156 195 -84 -204 177 1 -282 204 7
8117 7 -13 -114 334 91 -90 174 85 -121 96 -174 -65 22 131 -284 26 191 132 -188 113 -81 -133 229
8139 229 46 -93 -73 131 -279 -120 -106 -65 -62 -166 -85 -286 76 513 187 -299 76 -130 9 -191 -139 -208 123
8162 123 52 -73 68 -80 137 82 64 -221 16 -221 -178 -156 -195 -57 442 -301 160 -26 -108 -90 57 32 9
8185 9 -218 128 51 30 -113 -91
8191i1
##END NTUPLES=NMR FID
##END=
