##TITLE=1H_SR89_k
 CDCl3,8 sc, 
 29.9.2021
##JCAMPDX= 6.0         $$ Bruker NMR JCAMP-DX V2.0
##DATA TYPE= NMR FID
##DATA CLASS= NTUPLES
##ORIGIN= UXNMR, Bruker Analytische Messtechnik GmbH
##OWNER= root
$$ XWIN-NMR		Version 3.5
$$ Wed Sep 29 12:04:14 2021 Russian Standard Time (UT+4h)  she@DPX200
##.OBSERVE FREQUENCY= 200.1314
##.OBSERVE NUCLEUS= ^1H
##.DELAY= (6, 6)
##.ACQUISITION MODE= SIMULTANEOUS
##.ACQUISITION SCHEME= undefined
##.AVERAGES= 8
##.DIGITISER RES= 18
##SPECTROMETER/DATA SYSTEM= spect
##.PULSE SEQUENCE= zg30
##.SOLVENT NAME= CDCl3
##.SHIFT REFERENCE= (INTERNAL, CDCl3, 0, 15.7039)
##AUDIT TRAIL= $$ (NUMBER, WHEN, WHO, WHERE, WHAT)
$$ ##TITLE= Audit trail, XWIN-NMR		Version 3.5
$$ ##JCAMPDX= 5.01
$$ ##ORIGIN= Bruker BioSpin GmbH
$$ ##OWNER= she
$$ F:/spectra/data/she/nmr/H-F/1/audita.txt
$$ ##AUDIT TRAIL=  $$ (NUMBER, WHEN, WHO, WHERE, WHAT)
(   1,<2021-09-29 12:02:54.75 +0400>,<she>,<DPX200>,
      <created by zg, POWCHK disabled, PULCHK disabled
       terminated by command 'halt'
       configuration hash MD5:
       00 E9 B6 7A A2 85 ED C7 34 08 36 98 17 FE 4E 26
       data hash MD5: 16K
       F3 B6 93 4C E8 CA 5D 72 A7 D1 5C F2 DB 4A 93 AB>)
$$ ##END=
$$ 
$$ hash MD5
$$ A8 DE E6 0E 57 6F A2 7F 00 F7 7B 57 2D 0F B4 A4
##$RELAX= 
##$RELAX= 
##$RELAX= 
##$RELAX= 
##$RELAX= 
##$RELAX= 
$$ Bruker specific parameters
$$ --------------------------
##$DU= <F:/spectra>
##$EXPNO= 1
##$NAME= <H-F>
##$PROCNO= 1
##$TYPE= <nmr>
##$USER= <she>
##$AMP= (0..31)
100 100 100 100 100 100 100 100 100 100 100 100 100 100 100 100 100 100 
100 100 100 100 100 100 100 100 100 100 100 100 100 100 
##$AQSEQ= 0
##$AQ_mod= 1
##$AUNM= <au_zg>
##$AUTOPOS= <>
##$BF1= 200.13
##$BF2= 200.13
##$BF3= 200.13
##$BF4= 200.13
##$BF5= 200.13
##$BF6= 200.13
##$BF7= 200.13
##$BF8= 200.13
##$BYTORDA= 1
##$CFDGTYP= 0
##$CFRGTYP= 5
##$CHEMSTR= <none>
##$CNST= (0..31)
1 1 145 1 1 1 1 1 1 1 1 1 1 1 1 1 1 1 1 1 1 1 1 1 1 1 1 1 1 1 1 1 
##$CPDPRG= <>
##$CPDPRG1= <>
##$CPDPRG2= <>
##$CPDPRG3= <>
##$CPDPRG4= <mlev>
##$CPDPRG5= <mlev>
##$CPDPRG6= <mlev>
##$CPDPRG7= <mlev>
##$CPDPRG8= <mlev>
##$CPDPRGB= <>
##$CPDPRGT= <>
##$D= (0..31)
0 1.2 0 0 0 0 0 0 0 0.06 0 0.03 0 0 0 0 0.0002 0 0 0 0 0 0 0 0 0 0 0 0 
0 0 0 
##$DATE= 1632902574
##$DBL= (0..7)
120 120 120 120 120 120 120 120 
##$DBP= (0..7)
150 150 150 150 150 150 150 150 
##$DBP07= 0
##$DBPNAM0= <>
##$DBPNAM1= <>
##$DBPNAM2= <>
##$DBPNAM3= <>
##$DBPNAM4= <>
##$DBPNAM5= <>
##$DBPNAM6= <>
##$DBPNAM7= <>
##$DBPOAL= (0..7)
0.5 0.5 0.5 0.5 0.5 0.5 0.5 0.5 
##$DBPOFFS= (0..7)
0 0 0 0 0 0 0 0 
##$DE= 6
##$DECBNUC= <off>
##$DECIM= 32
##$DECNUC= <off>
##$DECSTAT= 4
##$DIGMOD= 1
##$DIGTYP= 9
##$DL= (0..7)
0 120 120 120 120 120 120 120 
##$DP= (0..7)
150 150 150 150 150 150 150 150 
##$DP07= 0
##$DPNAME0= <>
##$DPNAME1= <>
##$DPNAME2= <>
##$DPNAME3= <>
##$DPNAME4= <>
##$DPNAME5= <>
##$DPNAME6= <>
##$DPNAME7= <>
##$DPOAL= (0..7)
0.5 0.5 0.5 0.5 0.5 0.5 0.5 0.5 
##$DPOFFS= (0..7)
0 0 0 0 0 0 0 0 
##$DQDMODE= 0
##$DR= 18
##$DS= 0
$$ [...]
##$SUBNAM2= <"">
##$SUBNAM3= <"">
##$SUBNAM4= <"">
##$SUBNAM5= <"">
##$SUBNAM6= <"">
##$SUBNAM7= <"">
##$SUBNAM8= <"">
##$SUBNAM9= <"">
##$SW= 16.9725446903124
##$SWIBOX= (0..15)
0 0 2 0 0 0 0 0 0 0 0 0 0 0 0 0 
##$SW_h= 3396.73913043478
##$TD= 16384
##$TD0= 1
##$TE= 0
##$TE2= 300
##$TE3= 300
##$TEG= 300
##$TL= (0..7)
0 120 120 120 120 120 120 120 
##$TP= (0..7)
150 150 150 150 150 150 150 150 
##$TP07= 0
##$TPNAME0= <>
##$TPNAME1= <>
##$TPNAME2= <>
##$TPNAME3= <>
##$TPNAME4= <>
##$TPNAME5= <>
##$TPNAME6= <>
##$TPNAME7= <>
##$TPOAL= (0..7)
0.5 0.5 0.5 0.5 0.5 0.5 0.5 0.5 
##$TPOFFS= (0..7)
0 0 0 0 0 0 0 0 
##$TUNHIN= 0
##$TUNHOUT= 0
##$TUNXOUT= 0
##$USERA1= <user>
##$USERA2= <user>
##$USERA3= <user>
##$USERA4= <user>
##$USERA5= <user>
##$V9= 5
##$VALIST= <valist>
##$VCLIST= <CCCCCCCCCCCCCCC>
##$VD= 0
##$VDLIST= <DDDDDDDDDDDDDDD>
##$VPLIST= <PPPPPPPPPPPPPPP>
##$VTLIST= <TTTTTTTTTTTTTTT>
##$WBST= 1024
##$WBSW= 4
##$XGAIN= (0..3)
0 0 0 0 
##$XL= 0
##$YL= 0
##$YMAX_a= 135147
##$YMIN_a= -76864
##$ZGOPTNS= <>
##$ZL1= 120
##$ZL2= 120
##$ZL3= 120
##$ZL4= 120
##$ABSF1= 10
##$ABSF2= 0
##$ABSG= 5
##$ABSL= 3
##$ALPHA= 0
##$AQORDER= 0
##$ASSFAC= 0
##$ASSFACI= 0
##$ASSFACX= 0
##$ASSWID= 0
##$AUNMP= <proc_1d>
##$AZFE= 0.1
##$AZFW= 0.1
##$BCFW= 1
##$BC_mod= 2
##$BYTORDP= 1
##$COROFFS= 0
##$CY= 11.3945322036743
##$DATMOD= 1
##$DC= 2
##$DFILT= <>
##$DTYPP= 0
##$F1P= 2.36226072786647
##$F2P= -0.459571619588291
##$FCOR= 0.5
##$FTSIZE= 0
##$FT_mod= 4
##$GAMMA= 1
##$GB= 0.15
##$INTBC= 1
##$INTSCL= 1
##$ISEN= 128
##$LB= 0.24
##$LEV0= 0
##$LPBIN= 0
##$MAXI= 10000
##$MC2= 0
##$MEAN= 0
##$ME_mod= 0
##$MI= 1.114404
##$NCOEF= 0
##$NC_proc= 0
##$NLEV= 6
##$NOISF1= 3.799351
##$NOISF2= 2.8
##$NSP= 1
##$NTH_PI= 0
##$NZP= 0
##$OFFSET= 15.70392
##$PC= 1
##$PHC0= -14084.88
##$PHC1= 25.60088
##$PH_mod= 1
##$PKNL= yes
##$PPARMOD= 0
##$PSCAL= 0
##$PSIGN= 0
##$REVERSE= no
##$SF= 200.130013532006
##$SI= 16384
##$SIGF1= 3
##$SIGF2= 2
##$SINO= 400
##$SIOLD= 16384
##$SREGLST= <1H.CDCl3>
##$SSB= 0
##$STSI= 0
##$STSR= 0
##$SW_p= 3612.71676300578
##$SYMM= 0
##$S_DEV= 0
##$TDeff= 0
##$TDoff= 0
##$TI= <>
##$TILT= no
##$TM1= 0
##$TM2= 0
##$TOPLEV= 0
##$USERP1= <user>
##$USERP2= <user>
##$USERP3= <user>
##$USERP4= <user>
##$USERP5= <user>
##$WDW= 1
##$XDIM= 8192
##$YMAX_p= 0
##$YMIN_p= 0
$$ End of Bruker specific parameters
$$ ---------------------------------
##NTUPLES= NMR FID
##VAR_NAME=  TIME,          FID/REAL,        FID/IMAG
##SYMBOL=    X,             R,               I
##VAR_TYPE=  INDEPENDENT,   DEPENDENT,       DEPENDENT
##VAR_FORM=  AFFN,          ASDF,            ASDF
##VAR_DIM=   8192,          8192,            8192
##UNITS=     SECONDS,       ARBITRARY UNITS, ARBITRARY UNITS
##FACTOR=    0.0002944,     1,               1
##FIRST=     0,             0,               0
##LAST=      2.4114304,     0,               0
##MIN=       0,             -76864,          0
##MAX=       2.4114304,     135147,          0
$$ Real data points
##PAGE= N=1
##DATA TABLE= (X++(R..R)), XYDATA
0@%%%%%%%%%%%%%%qJ6j6J6j6K4l2L2m0M8n6O8p6Q8j04J20j36J53j77K01k25K56
36A36k88L22l60M02m48M98n54O15o80P51q30R14j006J108j221J347j484J636j807
55i49K000k216K465k756L096l501L994m609N405o477Q010j0399J4673k4695R5654
70G9695N5452j41022m8603M2096J01861K977p2887n7189M1800O5244M356p8065
82d285o1536J9314O6593J5791m1640m7975J0336M4481J2348m4907m4022P456M8305
95a9741L0573j4248l3292O02K9218J5936j6905k4350N059L7003K8496m651k2070
108A1630o797J2656J4436n780j8916q57K0218J6637k205k0307j6560K405M573
121A1133n763j1169l732Q435J1712l465j8233j4373k340N007M167l055j116Q319
$$ y = [0, 0, 0, 0, 0, 0, 0, 0, 0, 0, 0, 0, 0, 0, 0, -8, 8, -8, 8, -8, 16, -16, 16, -24, 24, -32, 36, -40, 48, -56, 64, -72, 81, -96, 105, -120, 136, -152, 170, -190, 212, -236, 262, -292, 323, -357, 394, -436, 478, -528, 580, -641, 706, -778, 858, -949, 1051, -1165, 1300, -1456, 1640, -1861, 2133, -2476, 2929, -3548, 4462, -5937, 8736, -15959, 79695, 135147, -5875, -54478, -12382, 89479, 92456, 19569, -37620, 4180, 69424, 73780, -4285, -65821, -46507, 20086, 35877, -5763, -53738, -43402, 1079, 13427, -31480, -75502, -68046, -19741, 10832, -3416, -36708, -36106, -6888, 9048, -7857, -32207, -27148, 9855, 38351, 33700, 11630, 4833, 17489, 31925, 26145, 7229, 6372, 26590, 43227, 41022, 20715, 4155, 6560, 11133, 5370, -5799, -9531, -1096, 10616, 7151, -11082, -25455, -27795, -22788, -18621, -21676, -22792, -14473]
135a4473Q295P9q551p645M33R129Q478L052L695O048N684K392o293o658L45O067
151A0077P233M621N74n92l99m669q206o723k558K686N276K87l051l908n255m951
167i558n640m429p85M472M589K326M12l027k458j222j920P96M902O451P169M861
183F939M12k231j306r98Q03L404M428M968M677m53k514l782m991k730L7J51J419
200H233J716k57k913m589p152n263k089p03J956K800R28p2k211m220l369j140
216a8345J135L971N462L909L104R21j331j391k46Q55L312M784M443L455J734j549
232A4223k699k402k546q6K133K011K234J46k662m325m705m472k212L66R87J750
248b259R08j991k256l496l844j468O51J957L810K953J765M76j167j876o29Q09
$$ y = [-14473, -6178, -6099, -14650, -22295, -21862, -12733, -4255, -1203, 2492, 8540, 14224, 16616, 10323, 3665, 4010, 10077, 17310, 21931, 22505, 21913, 21514, 16845, 8639, 1916, -642, 2044, 7320, 7607, 4556, 648, -4607, -9558, -15198, -19627, -20412, -15940, -11351, -9025, -8613, -11640, -14098, -15320, -17240, -16444, -11542, -5091, 2078, 6939, 7351, 5120, 3814, 2816, 3619, 7023, 11451, 16419, 21096, 20643, 18129, 14347, 9356, 6626, 6663, 6814, 8233, 9949, 9692, 6779, 2190, -4962, -10225, -12314, -13017, -11061, -8261, -7333, -7405, -9616, -13836, -17205, -18345, -17210, -13239, -7777, -3868, -764, 157, -1174, -2565, -2811, -1956, 1356, 6140, 10583, 14038, 15772, 14223, 11524, 9122, 6576, 6490, 8623, 10634, 12868, 13014, 10352, 6027, 1322, -3150, -5362, -4996, -4009, -2259, -1351, -3342, -5598, -9094, -12938, -14406, -13755, -11798, -7988, -5035, -3270, -2794, -3961, -5837, -6466, -5657]
264e657K090M429M359K700J611q97k504j729r02K81K405K957J522M19j708l476
280E900l011l181k059M3J404J100Q62r15k762k881l305k088M61J738K376L314
296c004J102l64j494j688j328J009K010L510L886K561L41j10j527j877o13J001
312C415J616K550J796K35r72k603l515j909j715k38J526J130K98p78k376l273
328d813k696k057J15J333K252J963R90o62j736r32j214M95K178K985L052K374
344C627R46k79j117j242m59J365J613K957K021P98j157j640k986k071r49J52J000
361B579J552K4j500j607l124k641j758n39Q84J617J006M41p96j625j651j124m1
378h303J472K832K469J986R28l91j170j010M7J340K235K105K341O79n90j027j852
$$ y = [-5657, -3567, 862, 5221, 7921, 9532, 8635, 6131, 4402, 3500, 3781, 6186, 9143, 10665, 11084, 9376, 5900, 2889, -292, -2351, -2308, -904, 196, 1058, 143, -2619, -5500, -8805, -10893, -10432, -8694, -6318, -3004, -1902, -2266, -3760, -5448, -6776, -5767, -3757, -247, 3639, 6200, 6541, 6431, 4904, 3027, 2414, 3415, 5031, 7581, 9377, 9612, 8640, 6037, 2522, 613, -1102, -1340, 186, 1316, 1614, 836, -1540, -4813, -7509, -9566, -9451, -8118, -5866, -3903, -2913, -3575, -5311, -6243, -7457, -6962, -4784, -1799, 1253, 3627, 4573, 4294, 3177, 1935, 1476, 2841, 4454, 7411, 9432, 10230, 9073, 7433, 4447, 2376, 1427, 1579, 2579, 4131, 4155, 2655, 1048, -2076, -4717, -6475, -7014, -6130, -4513, -3507, -3066, -3862, -5487, -7138, -8262, -8303, -6831, -3999, -1530, 456, 1384, 993, -177, -1187, -1140, 200, 2435, 4540, 6881, 7560, 6970, 5943, 4091]
395D091k030n1O27R52J314O08p17j720k508k647j321k66L17J280J006L16q69j694
413c312k303r97k12Q14K303K131J516K37k82j240q19k84R66J990K008J911J242
430E669m55j431j204j412l08J044R80J362O35l60j970k088k267j053j15N58J125
447a290J006k02q60j487j584j298OJ086J195K056J415P6l42r95j040J16P72J547
465A77K477J569Q24K6j057j750m91m70Q32J400Q14J276q31j424k107j650j405
482a790j73O54Q48M42K34j128j851j577j671n9P02J232J525J305n5o39p97j032
500c830O2J000J391K059J936P09j5n87p97p24L06P60J563J306N05m81q29j525
518B809j707q07k45Q44O01N56l72r29j646j792j241o86N79J202Q51O91P1j030
$$ y = [4091, 2061, 2010, 2637, 3589, 4903, 5511, 4794, 3074, 566, -2081, -3402, -3668, -3351, -2071, -1065, -749, -1618, -3312, -5615, -6612, -6824, -6010, -3707, -1576, -60, 177, -105, -1345, -2164, -2448, -1482, 508, 2516, 4427, 5669, 5214, 3783, 2579, 1167, 859, 1903, 2883, 4245, 4880, 4520, 2550, 462, -1805, -2858, -2973, -2415, -1290, -284, -486, -1346, -2833, -4417, -5715, -5709, -4623, -3428, -1372, 43, 119, -223, -1218, -2258, -2142, -1370, 177, 2654, 4223, 5047, 5073, 4016, 2266, 1775, 1305, 2137, 3537, 4351, 5627, 4796, 3372, 1265, -385, -1790, -1963, -1309, -461, -19, 215, -913, -2764, -4341, -6012, -6071, -5369, -4137, -2612, -1307, -1362, -2001, -2798, -3830, -3768, -2768, -1377, 682, 2618, 3327, 3312, 2725, 1928, 1204, 1510, 2270, 3833, 5139, 5644, 5163, 4334, 2809, 1102, 295, 50, 894, 1495, 2051, 1679, 750, -896, -2688, -3929, -4615, -4036, -2834, -1983, -1292, -1221, -2251]
536b251j116j091k1O97J576J443J566N85L3m46j046n36L61R81J657J197P61k73
554D077n05j267j314o16L41L98Q85P58k56r88j362j699p66n04J34J260P56M33
572b35k94p36j263p35m81L77J685J347R94O08j05r94m88p27N39J065J083J214
590B854Q32m99k60j145r30r43P15N24P08N47j71p49j519j297j433J03L97K68J383
609f15J63m52p79j044r19l19O53J094J396R38N15j00p06n23j72M23Q45J358J205
628B961O97m4n98q27n91o21Q3R91P38M72j07j065j294q79j109m96L36L78O65K05
648a05o73q29j101j149k43O10M56J256N45M74m51m29n18j52J99J334J200J243
666A667P60k67p0q71q01K98M65J062Q33N11kp14j038j141o51k48M51M14M30N8
$$ y = [-2251, -3367, -4458, -4479, -3782, -2206, -763, 803, 1388, 1421, 975, -71, -607, -246, 735, 2392, 3589, 4350, 4077, 3572, 2305, 991, 375, 716, 1114, 1999, 2757, 2501, 1513, 151, -1548, -2314, -2818, -2684, -1424, -668, -235, -529, -1265, -2528, -3263, -3744, -3367, -1682, -335, 659, 1267, 1162, 168, -320, -1047, -508, 557, 1640, 2854, 3686, 3187, 2927, 1782, 852, -91, 624, 1148, 1856, 2403, 2232, 1483, -36, -1333, -2766, -2663, -2266, -1998, -615, -452, -904, -1683, -2727, -3646, -3965, -3312, -2218, -822, 116, 631, 531, -175, -698, -870, -447, 398, 1756, 2961, 3658, 3614, 3016, 2189, 1598, 977, 1060, 2051, 2789, 3261, 3154, 2089, 795, -84, -1193, -1689, -1353, -975, -310, -105, -778, -1607, -2708, -3857, -4100, -3490, -3034, -1778, -1233, -759, -1210, -1639, -2157, -2309, -2110, -776, 424, 1667, 2427, 2160, 2090, 1219, 418, 716, 1181, 2243, 3076, 3587, 3585, 2871, 1833, 692, 41, -207, 244, 658, 1088, 1146]
686A146n35j255q22j138l65M94N14O56M68J85k09q15o53k98M04R20J090Q18M09
705A014K02n47m04n79J30O76P94J062J49Q9k37p97j168k22m15K45P58M47O4n94
725F67o66q91r84m74L50O00N03K36K71m26n66q63q2L10Q64P95R09O41J08p29P
746E80p85L34K87J655R05k52J02p11n55q97k28j33K19N68L75l97l29q31j054o33
766a780l38j70O31P86J83k59n19l18r13rK85L04Q94P79R30j47k67k62m85L29N40
787A94J075R20K75L62m13o38l39n25o2N32L91M60J30m15r26q28q30m00J93J18
807g26N34k22K08o03q66r04j81J66O51L95N47M58j5k59o97N1L16K54R43O64O50
828A364J12J22l21m09l87J45N17N38P00J08l62p49q42m59l44J19N08J40L36n90
$$ y = [1146, 611, -644, -1466, -2604, -2969, -2475, -1961, -1305, -837, -652, -861, -1676, -2329, -2627, -2223, -1303, -213, 605, 1014, 1216, 669, 265, -314, -184, 492, 1286, 2348, 2497, 2586, 2349, 1552, 384, 162, -253, -8, 750, 1197, 1261, 667, 1, -890, -1874, -2348, -1998, -1398, -895, -659, -388, -814, -1380, -2243, -2325, -2015, -1151, -356, 553, 1194, 1302, 573, 580, -205, 129, 416, 2071, 2976, 2724, 2826, 2115, 1560, 663, 435, 302, 521, 1089, 1464, 1067, 738, -93, -1147, -1780, -2118, -2288, -1657, -871, -688, -947, -1466, -1784, -2697, -2706, -2421, -2117, -1223, -444, 486, 339, 72, -190, -675, -346, 194, 1269, 2189, 2464, 2826, 2413, 1775, 1436, 911, 849, 1381, 1772, 2232, 2362, 1947, 1021, 193, -637, -1037, -844, -726, -192, -414, -206, -809, -1675, -2579, -2760, -2594, -1943, -1548, -1001, -543, -558, -817, -1514, -1463, -1147, -893, 50, 714, 1364, 1476, 1598, 1277, 868, 481, 626, 1143, 1681, 2381, 2489, 2127, 1378, 536, 77, -267, -148, 360, 500, 836, 246]
848B46o04m32q19m25O2L92Q74K41k2o6k13m52n32N10L78N44P35O01J91l32n04
869C73l34k7K65M15N97M21P3j61n55o01m33K5j32L23M74l6k32k78q02q10j23j1
891a569M25K01N99j5l14m82Ml10M5N50N44O84K04L90j99k49n51J58L50L57N76
912A398N92L6P1q74l11n06l31K84M97N3K75m74m20q53p22j88j28L72O92j03j4
933f54k80m37m88q2J84M58M90K35N83K70l02j22q8j89K95P16P44L68j4M7m75l53
955I06j84p7J86J93N06m4k68n17n17l85n36J05K01L6L29nk16m49n60n40M25q4
977a495L59P23K34K0k91j84l01J76J17O21N96K72K94J6l84m54L3r7L21K86L84
998A246j75J32m51l24o22j77N6P9K63M62k58l05m38l65n67N3O60K43L28K47N6
$$ y = [246, -358, -790, -1609, -2034, -1972, -1580, -706, -465, -487, -553, -766, -1218, -1750, -1240, -862, -318, 417, 1018, 1209, 877, 373, 39, 12, 277, 692, 1289, 1710, 1783, 1622, 1067, 466, 33, 58, -74, 249, 723, 687, 455, 177, -625, -1435, -1558, -1569, -1144, -943, -344, -359, -673, -1155, -1151, -1461, -1416, -866, -322, 362, 566, 956, 757, 508, -43, 115, 465, 822, 1398, 1990, 2026, 2097, 1223, 912, 406, 75, 359, 856, 909, 1184, 710, 290, -563, -1285, -1473, -1601, -1229, -537, -640, -654, -934, -1371, -1859, -1941, -1757, -1299, -809, -574, 9, 279, -23, -145, -233, -422, -127, 589, 1333, 1701, 1687, 1734, 1259, 906, 722, 645, 831, 1024, 1530, 1486, 1218, 701, 184, -201, -737, -632, -431, -395, -66, -71, -287, -736, -1296, -1836, -1411, -1495, -1136, -413, -179, -159, -450, -634, -935, -759, -642, -21, 575, 847, 1141, 1157, 773, 319, 352, 255, 576, 862, 1246, 1071, 1203, 752, 428, -194, -371, -315, -236, 27, 489, 231, -74, -512, -877, -1444, -1391, -731, -488, -160, 87, 143]
1019A43l69k02k99Q2j4P68K13N65J44j96l70k35r1J42%L89K99J57k49k10n90k48
1041a71k21QL32K61j20p1l2n32k93k48l69M40K42L71k2K96m01Q9l70k40L86L58
1063c07P61K56K31l94L30n83q9J73J38M35L33P5J4q0o43o27K22o4m1K28J60k19
1085C09j34l72o15k8j42J94L61j92J56M3k5n87j44P8PO05K07N10j6l77K66k31
1107a27k57K30L87K31O25M0j81k39Jk93M8j2q6O49o3k72j80l00o95P0L2K54r8
1130b36O3K67k51j30l18j40m26J84M20K76K47n5M89m86j22l38J16R0N83L71k1
1151E83m8k02n9l08r9K21M8M00K51j14p6o14j54m40J44L5M58KK37k00m24j97k65
1174h21L41p9O9M72J95J3q3m40J82k6K41K12Q4J85K34k50k2q7l28L3K57M5N0J20
$$ y = [143, -226, -428, -727, -645, -659, 109, 322, 887, 1031, 835, 465, 230, 139, 281, 281, 670, 969, 1126, 877, 667, 77, -171, -392, -384, -52, 209, 89, 18, -14, -546, -839, -1087, -1456, -1016, -774, -403, -425, -129, -530, -441, -811, -1051, -665, -307, 454, 710, 941, 547, 877, 294, 205, 378, 516, 951, 1284, 1359, 1373, 1293, 650, 23, 245, 181, 140, 368, 528, 309, 175, -197, -812, -840, -982, -788, -427, -619, -463, -420, -445, -1032, -1176, -1098, -1091, -486, -279, 231, 215, -162, 104, -127, -384, -154, 233, 464, 1089, 1129, 948, 709, 710, 417, 465, 453, 367, 1016, 953, 681, 501, 201, -494, -424, -392, -138, -236, -173, 94, -157, -287, -605, -745, -1171, -987, -567, -291, -44, -99, 390, -96, -218, -556, -440, -350, 233, 604, 583, 535, 333, 274, -34, -133, 88, 136, 536, 787, 673, 597, -17, -171, -611, -467, -432, 26, 28, 265, 65, -359, -556, -821, -480, -559, -490, -18, 177, 190, 107, -333, -151, -177, 64, 276, 360, 545, 779, 529, 507, 420, 92, 125, 382, 427, 477, 597]
1198E97O3J2o98q5k70k5J20R0J42J1k27n5k40l78q4J42L00P9J24J92l8k3l69j02
1222g22K68M20K37L20j47J91l4l78N3J63l3N7N76m4l41K3k46jk10j96K59R4Kq8
1246B23k03j62l48p7k86K79K30J35R9Q4l08k11l82k4N14J59K58L19o5O0l73j57
1268b36J02J9K84J05L76O1j30j99j87k29R4j32K66j35L43j04K41l67j94l21j36
1289d79L0K19J99Q1OK4l03k43j04j99M46K03L03K06k97j69J06j00l1J05J56K39
1311C98K42k01k3m22K45l76L36j29O2P6K02k96j73m7l53J98j54N7J70L6K25l27
1333b54p0l34N2J53K22O5o9N99j09j57l22K65J0R4n6K94N11k71k92J05k13k25
1355bP1Q2L07J56l92n2j03l18j16J66j42J30L17l7n9l32o5k44j42M20J9k49P05
$$ y = [597, 660, 672, -26, -111, -381, -406, -286, -196, -54, -43, -270, -325, -565, -943, -1027, -885, -585, -506, -382, -190, -228, -251, -620, -722, -454, -34, 203, 523, 376, 567, 533, 155, 208, 371, 338, 395, 971, 927, 586, 609, 363, 362, 152, -44, 215, 309, 311, 223, 20, -142, -490, -567, -853, -574, -344, -209, -110, -26, -334, -545, -927, -951, -437, -278, -20, 299, 234, 294, -79, -236, -134, -115, 169, 274, 650, 711, 581, 382, 195, -34, 60, -72, 194, 59, 402, 298, 539, 172, -22, -343, -479, -449, -230, -31, 50, 56, 80, -223, -466, -570, -769, -323, -120, 183, 389, 92, -77, 29, -71, -102, 3, 159, 398, 640, 439, 416, -6, 239, -137, 199, 70, 132, 208, 410, 114, -59, -106, -459, -261, -415, -358, -188, -152, 73, -254, -324, -658, -606, -453, -231, -166, -235, 364, 255, 98, -224, 41, 51, 145, 89, 383, 894, 623, 331, 436, 223, -2, 69, 151, 458, 614, 222, 170, 67, -251, -367, -201, -343, -213, 104, 67, 8, -324, -389, -633, -775, -355, -336, -585, 120]
1378A20K1l01l01K28%J13Q4K92j27J27mQ9r1j70q2KO6N56L8l28J05r4m31L9J39
1403I0Pj85J35k58M65j67k37k69r2L97j39M1K50O3j40j74l7j79K59n6K04J55Q9
1426B22M5K7l06m6q4J51l8L91k5J4j94pk79O1R6J22l56M90j09j0j29n13J53mp4
1451d02N30k59K96M1k74j52P8m9p0J68J53L2J27j20J33p5q1lL1k52O84j47j90
1474A99l35J03N7P0l42K47J0k04M22j67L1m94R0J06k06K34K9K07r1j47m2k96l9
1497e58K0K63J54L16J99Jl30k75M53j22k6K62k19n1J92J0k05K04l53N1L13Q5j8
1520C66j49r4j01j37r8NJ75j4J2K45j28j41k85j19K9r5J17L12k0K28o3k31k28
1543d14m6M40l31M05M4M9J13j60p1j61K44j03K2P5j2K24l43r5O9p5O3J88M7r4
$$ y = [120, 141, -160, -461, -233, -233, -120, -36, 256, 129, 256, 252, 341, 250, 80, -2, 0, 66, 622, 660, 332, 437, 343, -88, -49, 90, 97, -88, 47, -211, 254, 87, -150, -419, -511, -114, -253, -212, 38, 101, -39, -213, -250, -429, -170, -226, -22, 133, 222, 267, 294, -12, -58, -142, 9, -29, 362, 337, 351, 157, 150, -129, -68, 28, 150, -206, 284, 175, 165, 36, -477, -324, -328, -402, 128, -131, 165, 206, -68, -220, -142, -191, -261, -93, 60, 92, 219, 99, 232, 157, 76, 73, 104, -148, 536, 389, 199, -136, -33, 24, 94, -248, -1, 9, -195, 227, 60, 91, -403, -313, -207, -413, -179, -150, 57, -34, -181, -223, -519, -558, -538, -275, -121, 195, 394, 395, 65, -210, 243, 121, 95, 357, 138, 87, 279, 289, 84, 288, -65, -14, 299, 384, 366, 217, 123, 22, -115, -213, -208, -33, -47, -35, 210, 82, -59, -344, -463, -434, -529, -412, -100, -120, 108, 45, -186, -414, -460, -20, -351, 54, 98, 147, 260, 100, 29, -132, 112, 9, 31, 106, 94, 318, -25, -120, -51, -126, -63, 125, 172, 78]
1567G8j03K93l79K21j59j01o5K4k09L58N84o36j71J48k20P2J07K67j25K62m85
1588b39M53j27p4o9j65M06k2k99K16Q0k39k04L2p3J56J89q0J91j78jJ2M2k00J96
1612Ck03J86Kk4K96r3l17K39m19L99J29R4l14P2J97k19J71j35J98j04R6J9n2J09
1636C30o7k61l56K68l5R0k1j8M2K3K8j42j03j23K73n0Q6j74JK26j99M9k37K72
1660i8K29l81M16O6p4j53Q5p9k6K26j84J13K03j51J32l34n6q8K43J99q2p3n4l2
1684D7rJ7l93J85M9L2L98k36P2p5m0k95n9O9M6J8J39K15jo6k70J19n1j09M10k11
1710AJ04q8L7j76K73q4k40O1L58q9p1J52m11O6P5j4j36K21J33l65J91K8l04K37
1734d1j24j39L23o8L33k24j67K52j08q0J08k60K99k7j21K50j28M5J2p2O9k36M17
$$ y = [78, -25, 268, -111, 110, -49, -150, -215, -191, -400, -42, 542, -94, -265, -117, -337, -265, -158, 109, -16, 246, -239, 214, 87, 13, -56, -221, 185, 163, -136, 80, 160, -79, -283, -251, -324, -168, 21, -59, 132, -46, -47, -35, 7, -193, 3, -200, -14, -12, -36, 260, 167, -150, 89, -330, 69, 198, 292, -22, 50, 247, 28, 199, 64, 262, 158, 254, 273, 221, 330, 263, 2, -354, -86, -121, -31, -52, -70, -28, -5, 23, -119, -222, -345, -72, -122, -36, -210, -209, 17, -182, -133, -370, -98, 131, -250, 166, 232, 158, 5, 90, 11, -15, 211, 27, 140, 343, 192, 324, -10, -66, -154, 89, 288, 206, 133, 79, 47, 38, 55, -338, -153, -104, -72, 326, 90, 162, 87, 47, -248, -307, -238, -192, -174, -35, 180, 179, 113, -157, -38, -89, -198, 212, 1, 105, 17, 54, -122, 151, 67, -173, -112, 246, 157, 86, 238, -173, -107, -32, -46, -182, 39, 172, -193, -2, 26, -278, -41, -165, -304, 19, -49, 284, 60, -107, 145, 37, -43, 65, -195, 104, 77, -44, 206, 78, 123, 135, 63, 132, -104, 313]
1757C13j87P1j01r0k73K4j2K91j38L6L1J80j83J8j43k5K93p5J45k56K28j38J2
1780B1J41j22K5j18J65J02j86J05p5p9Q6j63K98k24J59j03J14j5k3l00J59N1K3
1803D1k21p1L85j54l2j8j50J20j75Q2K88j54o2j08M7J5J6j26M50j30q7K46j27
1826G5j75N9J19l0J36l70M40m5j49k2K6l3l15K21K73jk84M05o48N28k20j28L24
1849A86m35K16J42O9o3k23J24q0lo9qR0J23j75J78M0m40Q9M26k83P7L7q5K10p2
1874G1k43L74m5l41pK82l2J36j92o1l5K20j34J55J3J6k34J92k17J35j24m8J29
1897A0j99K64k17K43J2j47J15k68K65k06K61o9kJ59j43k44J76j7o1J89j83J10
1919D8j32K39k97J71o2n9j80J65j68K07L7k6N4J77j94l47K75J15J75o1r8J22j91
$$ y = [313, 126, 197, 96, 6, -267, -243, -255, 36, -102, -66, -35, 145, -38, -20, -163, -188, 105, 30, 175, -81, 147, 9, 21, 162, 40, 65, -53, 112, 214, 28, 133, 58, -21, 65, -98, 200, -24, 135, 32, 146, 131, 108, -192, -33, 18, 41, -180, -251, 134, -20, -52, -70, -220, -100, -275, -193, 95, -59, -121, -229, -182, -167, -151, -277, 173, 43, -44, 202, 75, -100, -41, 78, 48, 184, -186, 254, 209, 60, 38, 64, 31, -284, -63, 210, 209, -75, 330, -318, 210, -10, -138, 186, -249, -33, 109, 178, 115, -108, 16, -64, -67, -136, -144, -54, 69, -106, 72, 112, -328, -239, 187, -96, -19, 18, -67, 143, 71, -172, 202, 157, -184, -191, 91, 59, 195, 3, -58, -93, 127, -7, 148, 161, 177, -57, 135, -82, 53, -71, -119, 10, -189, 75, -142, 101, 113, -34, 81, -187, 78, -128, 133, 64, 62, 221, 78, -166, 10, -7, -68, 121, -62, 48, -84, 155, -142, 29, -33, -92, -272, -107, -275, -68, -31, -57, -3, 174, -20, -367, -92, 23, 198, 137, 39, 161, -30]
1942c0K30K8j95j41K13J08k78K84k09J86k33k26L14k7j28J96Mk1J1j89R4j07J39
1965B3j26J65N5l83K08J30l54nj51N58j73j7J60k4j1o7n7n1J6J91k33L70l43m6
1989a65O6J62j5q5j67J10M3M83m41L00l48J4k38M90j43J97q7j01QK1j44k41K49
2012c2J31J09k87J94k0j5n8MK06k37l7J13jj58k5K58j19M4J03l7j49N2l4Kj77
2037a70K32j96K72j61k05K88Pm21K91Nr1K02J03k61J01O8j76J65k63J37J61R2
2059A80j57q2j1j82L46j18n6j4j64M4m2M67m9j36o4K1j2J42m10K5M90l50L10j58
2083B0K1K4k18L2J27j7p7k35M13k44M6J08k3j38R1k6j13J30N4K76m60J56Q4p3
2107d2J64K6j40M32k97j76L8j03K24p2P7k24L81k36o6qP6M0J9l1n5q0J50j6j02
$$ y = [-30, 200, 228, 33, -108, 105, 213, -65, 219, 10, 196, -37, -263, 51, 24, -104, 92, 96, 75, 86, -103, -9, -116, 23, -103, 62, 117, -266, -58, 72, -282, -287, -438, 120, -53, -70, 90, 66, 55, -12, -69, -120, -104, 87, -146, 224, -119, -165, -99, 63, 48, -37, -204, -94, -51, 432, -9, 291, -57, -43, -281, 209, 66, 263, 176, 75, 83, 104, -40, -281, -32, 99, 208, -79, 115, 95, 80, 22, 26, 232, -5, -42, 71, 70, -88, -113, 145, 26, 70, 173, 136, -13, 39, 5, 7, -170, 62, -134, 138, -23, -228, 60, 67, -354, -63, -58, -149, 53, 156, -105, -4, 64, -112, 53, -210, -73, 88, 180, 23, -59, -70, -252, 94, -24, -80, -94, -258, -214, -256, 211, 162, 26, -38, -17, -29, 113, -297, -272, 218, -132, 178, 20, 41, 65, -153, -121, 6, -11, -88, -323, 90, -154, -108, 0, -23, -161, -70, -96, -209, -79, -25, 251, -209, -53, 31, -42, 122, 148, 8, 440, 143, -33, 5, -98, 126, 54, 131, -93, 288, 52, -14, -22, 54, 94, 113, 82, 27, -53, 97, 81, -21]
2132b1o6J99j20j42K90R9k20l6j80Q0R7L39k05l2r7L27m49K76j41r2J73j5J43
2155B07J15n18L38p4k66M3J94p6j82J21K24l8l0j37K87k14R7p4j34K04k12J97
2177G2PJ46l47l3O4J79J00k52L16k67j89K56L2k03K7K03j26j02L04Q8l48J3L5
2200b5J96k44j58L4L23q7q4j68J53k53K97r3ML37n32M76j45Ql3p5K50J6j98j98
2224a99L80O4j39j73K01o8j36J47j92J2K2Q4J53j13J81K4k35n3J16k3k8j9J31
2247A37j47j53O1K66m5k79K18k63J99Oj31L5J68j25K8r1p9J38L1K62j35J29J1
2270B41k98N9p9J07N0k69K37k22L79k15L59m91K32l6K2n4J12j62M3j81L48m41
2292b59J69l36L66Q3J3J25l53j4L04j6k55P3K23j92j74L13k70L31l6j06o8p6J74
$$ y = [-21, -87, 112, -8, -150, 140, 239, 19, -17, -197, -117, -20, 319, 114, 82, -15, 312, -137, 139, -2, -94, 79, 64, 207, 322, -196, 142, 68, -198, -155, 39, -37, -219, -98, 126, 88, 58, -79, 208, -6, 91, 17, -117, 87, -125, 72, 79, 225, -122, -155, -91, 88, 188, -64, 252, -15, -204, 52, 84, -119, -92, 111, -15, -117, 187, 275, -73, -60, -25, 171, -73, -231, -197, 126, 39, -45, -213, -60, -313, -16, -109, -105, 232, -300, 176, 31, 39, 6, -69, 181, 197, -1, -199, 181, 245, 106, -67, 134, 66, -70, 77, -115, -103, -81, 3, 156, 43, 224, 248, 13, -40, 76, 53, 25, 6, 137, -10, -163, -102, 164, 119, -160, 58, -205, -6, 0, -131, -96, 72, -53, -25, -116, -195, -57, -26, 236, 101, 230, 241, -57, 2, -77, 30, 80, -189, 48, -174, 205, -10, 349, -142, 90, 54, 76, 22, 134, -28, 15, -166, 182, -259, -90, -426, -60, 23, 36, 161, -192, -206, 98, 82, -173, -100, 123, -69, -243, 70, -200, 131, 95, -11, -79, -155, 19]
2315A9m3J93k03M3o9k7l0J13l8l2K38k0l44L9Q5M4R1M5k86K71j59R6J45L8k15
2340fk76K88K9M9j51J79n9j57j09J21J62j36j03R4L0r7L19k9m51L53j4k48K60
2363D8j29J06n1L7j6J10q4k65K93O3m5j37P3k72K82j05J16Q3l12N09l56k3J44
2386F9o3J2kp7j63K96j01J31p6l6n3j60J18oK36o5k82K74Q3J15k87J05j64q0O5
2411a11L6J41j86O8k4M7N0K0L2J49j43k11O9K26L1l37PJ35J18Pk49M3m0L14R6
2436B88l05j48Q1M1%O4J74j53k5Q3j12j87L2J97O5o1k70L18P2k07k16K13o9K56
2460A31Lr9k34L53O3l25J5P5J34o3M8p4n4n3N3j24J72r2L7m4L04l75J93l86N21
2485A79j09k41J70J34K0j42k8k8N2j1M4N7j34n0J46k07J26L23l97M6j06J03j39
$$ y = [19, -24, 169, -34, 9, -60, -87, -117, -4, -42, -74, 164, 144, -200, -161, -76, -32, 59, 104, -182, 89, -70, 26, 171, 209, -6, -282, 6, 35, 84, -67, 112, 53, -104, -213, -92, 70, -66, -169, -75, -45, -142, 177, 148, -303, 50, 36, -212, 48, -81, 25, -26, 11, -5, 105, 21, -244, 49, 112, 67, -70, 3, -269, 13, -92, 24, 107, -205, 304, -52, -75, 69, 6, 18, 16, -61, -224, 72, -29, 102, 26, -10, -63, -223, -105, -111, 125, 60, -222, 52, 135, 250, -37, 68, -96, -176, -111, -75, 66, -120, -52, -76, -29, 21, 41, 73, 222, 79, -132, -63, 163, 194, -143, -136, -1, 117, 124, -125, -82, -122, 192, 288, -17, -165, -84, -43, -43, 21, 195, 42, 17, 100, -12, -199, -167, 30, 95, 34, -236, 82, 154, -53, -269, -56, -125, 131, 134, 35, -199, 154, 217, -108, -93, -18, 116, 53, 101, 27, -27, -80, -27, -151, 21, -71, -34, -78, 226, -149, 44, -342, 179, 70, -171, -1, 133, 153, 11, -17, -45, 7, -4, 40, 97, -37, -87, 59, -148, -22, 301, -96, -50, -156, -53, -192]
2508a92K14J15k79K26j19n6N1L63j20k70l01M49k22L54l58j0J37l8L7j92L49m12
2530b74o2J79J79K16o97K99K43J0lm32M8K55O9k66L72J7R4l91pM81l73j2K16k18
2554e7k30N36k09j23JN2J56j79N2J22k67J40J58j05K21k47J10n6l28J16L60j12
2576A11p4j23K17m4j37K37j81Om9J03m3K41m28p2Q0J11J0O3j10Q0o9J63j73J60
2600G9j54P9r1J20M0k80OJ78J7J98l81K2J62J09n7oq2l5pj6K02k30L8Q8Qn3N4
2627HJ40o2k28J73K5Q1j15J24l29o2K08Q3l1q1Q4p0j12K54m0K2j44J37j7oJ30
2652A72k45m7J9L27J2n20J17M9J08K0p2jJ57J0k80K3M11k17l8L99l64j29J57R4
2676A62j36M0j16O2J44j67q9j2K17j31j17L11k12j72J84J1J73M1j11o6j2M4j58
$$ y = [-192, 22, 137, -142, 84, -35, -91, -40, 323, 203, -67, -368, 81, -141, 213, -145, -155, -18, -56, -19, -211, 138, -274, -336, -157, 22, 238, -459, -160, 83, 93, 90, -342, -294, -39, 30, -236, 136, 153, 247, -144, -151, 330, -43, -55, 161, -57, -287, 249, 40, -83, -82, -30, 126, -53, -1, 121, -146, -6, 152, 47, 268, 21, 131, 75, -253, -137, 223, 111, 37, -86, 131, 87, -50, 187, 6, 12, -37, 66, 23, 264, -164, -236, -156, -45, -35, 28, -82, -2, -71, 92, -81, 79, -75, 4, -87, 33, 73, -207, -201, -23, -6, 192, -189, -167, -5, 104, 47, 41, -41, -76, -83, -99, 103, -127, -89, -1, 7, -46, 8, 148, 86, -142, 31, 56, 137, 22, 146, -183, -245, -37, 46, 15, -66, 18, -52, -164, 90, 50, 72, -72, 65, 48, 42, 172, -73, -120, -101, 226, 238, -282, -165, -116, -8, 12, -60, -61, 96, 106, -174, -151, 260, 43, 5, 404, 40, -89, 68, 162, 26, 66, -50, 12, 156, -11, -100, -112, 105, -26, -143, 168, -44, -216, -32, -21, 152, 193, 82, 16, 4, 48, -110]
2699a10L35j36L2l21J75M8JK02o5j38o3n4k5L99l02p9O9J8K28q2Q7j20j16o1k8
2724a06J39K4L4k35j51L17k39K58k05L16j84LJ04k1j7j71R1P7j36J71k2l9J6N6
2748H0q4K1P5j37Q8K7k82L45l23J95j08J23J33j39J16l10K1J09p2p8J24J77k8
2771G3L5n6k34K15m2J91j69J18l21J21J16R8r7j32K30j22P7J05l78N8J52M9J01
2794A88m6j12nr5J21j27J72k98L79j96j24K22k53J67K69J21m46p3J3L05p7NJ22
2817B32j49J02k52K30q9K07j67j91qj5J43J8J6p2K7J3j21J29m35M06o5m8J30j68
2841a27J22o8O6k05P5R0J12l57K61L4J1j48L1K12M0l86K00J15r0j54L63n7j34
2864FN4j13m1K46M2j92jl25K57N9J7k7q5K67k46j69K0K84j95K6K03J53j57L3M4
$$ y = [-110, 225, 89, 121, -200, -25, 23, 24, 226, 161, 23, -40, -94, -119, 280, -22, -101, -32, -14, 214, 132, 219, 99, -17, -78, -106, 33, 57, 91, -144, -295, 22, -217, 41, -164, 152, -32, -29, 75, 54, 37, -134, -43, 34, -102, 69, 47, 8, 24, 80, -4, 17, 92, -45, 43, 70, -212, 133, -190, 5, -103, 20, 153, 14, 130, -180, -159, -50, -122, -200, -76, 101, 73, 108, 52, -182, 33, -9, 182, 13, 131, -190, -69, 47, 145, 48, -84, 146, 24, 101, 206, -172, -114, 38, 87, 188, 142, 30, 25, -70, 51, -76, 96, -202, 177, -19, -143, 79, -174, -7, 262, 383, -63, -136, -123, 182, 105, 110, 232, 83, 185, -67, 163, 74, 281, 114, -77, -85, -100, 43, 61, 77, 5, 32, 45, -76, 53, -382, 24, -41, -89, 41, -127, -5, -73, -7, -212, -137, -47, 65, -292, -31, 3, 14, -134, -103, 109, 149, -237, -37, 78, -12, -166, 197, 140, 6, 60, -53, -94, 152, 194, 2, 1, -324, -67, -8, 9, -18, -103, 164, -82, -251, -231, 53, -142, -116, 87, 240, 83, 116, 160]
2889A60r5J46k60J24m2m4J70J34j79k35M12l70pj24J39J3M8J10l4m3K39k16J15
2912A61k63J4k1R3j2O1l0K06l70M8K21J18m14Q0J33j68K25P5j7j38m5R8j01R4
2936D8q4M5r2k3o1K50p6j17p4n6L69p5k01N61m48K68k20P4j98L88m20J39j52N0
2960a05K18k37K80k53P1O5K3K12k35M3J51k43l3N0K06k67K65j73j14J43k3M6k33
2983a43K87j75j11J56j3K19j92Jj21L00k63K79l39J10j04K9K16m4J41k45L4j55
3005a33O7j73K11n2O5J09k57J35j92K92k2j49J4OO6j23l5J84L6m13J43M13j94
3028bK25j20q6K75k23K1m8k33K52l0MKJ67j54k12L4L22n8O3j98Lo7K11k1j47Q7
3054F7L28l26l06J59Q1o7R2Q2j67L0M3jj64J24j17M8k56J67L08k62J56k26K31
$$ y = [160, 65, 211, -49, 75, 33, -11, 159, 293, 114, -121, 291, -79, -86, -210, -71, -58, -10, 100, 66, 23, 262, 46, 161, -102, -88, -109, -16, -28, 33, 3, 209, -161, -113, 108, 226, -188, -108, 25, -143, 82, 157, 140, 2, -43, 55, -46, 48, -36, 9, -83, -106, -167, 83, 7, -110, -184, -240, 129, 54, -147, 414, -34, 234, 14, 88, -110, 278, -142, -3, -155, -105, 113, -124, 156, -97, -26, 39, 62, 274, 39, 82, 233, -10, -43, 7, 213, -54, 211, 38, -76, 67, 44, 90, -143, 144, -31, -142, 14, 1, 220, 28, 29, -92, 208, -55, 224, -115, -5, -109, -80, 136, 92, 233, -12, 22, -133, -66, -239, -28, -80, -15, 94, -163, -28, -220, 72, 50, -99, -85, -79, -13, -136, -171, 13, 49, -364, -221, 192, -2, 223, 103, 17, 292, 69, 90, 42, -191, 61, 31, 35, 37, 204, 50, -162, -128, 194, 136, 199, 1, 4, -63, 148, 127, -20, 67, 395, 69, -237, -78, 3, -64, 28, 110, -57, -27, 16, 15, -149, -25, -142, -94, -350, -183, 125, -137, 19, -207, 24]
3077B4k80K68q6K42r5k1O2j34j02J78l4o3J51k27j21L22Q2k33mJ90o7m1L8J65
3101B14j86k13K12k1J6k12K19k95J36J46j56P3J75j31j0j8J0J8j97K92j86l9K39
3124H6k46L24k52J97Kk02K32q8j37K18m42L40j96m7J15p2L75j67K17k13o4Nj75
3147a90K24J63n9k93K03ok59K55m3j97K38Kn0p1L1k20K69O5%j32M8l3J31j31j79
3172b34J52Q1p0K7j2P8r4J83j16N7J32p4l30J89q0N22m35Qj44M9J52n4j9l9J48
3197G7l36J19J52o0P9j48Q2M3K4k49K24o0p4L9n9R6%J03q8K8L6P3M4J8k2j13j15
3224h7K9R8J60k05k44M35k52K42j37j25L08l7r9N4k33j7n8PK82O4p3L0k4r7K4
3249D5o1j26J11l6J86m0J0k5j29l5K17j77L2K48o2j81kL0p0k07N8J39r4L10j40
$$ y = [24, -256, 12, -74, 168, 73, 52, 114, -20, -122, 56, 22, -41, 110, -117, -238, 84, 166, -67, -71, 119, 52, 11, 49, 214, 28, -185, 27, 6, 22, -190, 29, -266, -130, 16, -140, -67, 108, -23, -33, -51, -41, -23, -220, 72, -114, -153, 86, -160, 164, -88, 109, 111, -91, 141, 53, -84, 134, -308, 32, -164, -211, -96, -168, 207, 40, 257, 44, -20, -15, -190, 34, 197, 138, -155, 48, 42, -217, 38, -5, -202, 36, 38, -12, -83, -52, -272, -3, 62, 62, -70, -22, -55, 76, -55, -234, -82, -1, -71, -44, -56, 22, -72, 111, -5, 52, 184, 110, -220, -31, -111, 411, -24, -16, -160, -111, 41, -13, -32, -71, 77, -259, -140, 12, -48, 31, -117, -35, 8, 32, -217, 7, -53, -127, -88, -147, -51, -51, 52, -36, -8, 28, 101, 145, 163, 141, 28, -87, -58, 40, 200, -5, -249, 186, -66, 176, 39, -86, 222, 185, 86, 140, -93, -110, -168, -161, 121, 185, 112, 142, 118, 21, 45, -16, -142, -31, -67, 119, 79, 89, 64, -65, -100, 117, -60, -28, 220, 158, -23, -25, 5, -65, -272, -214, -75, -169, 141, 1]
3274AJ14j71J17M7o5k18K03J59n90L23K7j33N26k88p1J00o4n4L25k76Q5j83m9
3297a35o8K34o8oQ4K9n5j03J57k33L64k82nL79l19P2J22j77P0k13L08m10N1K07
3321CM6m2J65j7M9o1k54L60l49L03L6j53k10q0L60j01k27K16r6p5Q9J47K7j33
3345Cr4K95k47j46J51J5Q1j1k94K31j13J07L4o9k6J15j3l08PQ5J48L7N4o6J81
3370A57k34j00K61M4l42J36J13K18n9n6k14O6k6J60n0J99l48J67kj41m6L37r0
3393A50k40J69j34N5Q4j53L11m49K23q0LJ77k84L32j38M1j91J88j24K4P0j3L35
3416C56o88K86O5p7RK77j63M3k03M8M9l5J06nn5J16m1j63O9m5J18N8k4j09L3k9
3442dM2j16K26l34l5J48R2qN4k9L6J02j08Q3j6j10L1jL3J4k03K16k14J52j20L6
$$ y = [1, 115, -56, 61, 108, 43, -175, 28, 187, -403, -80, -53, -186, 340, 52, -19, 81, 17, -37, 288, 12, 97, -86, -135, -203, 31, -37, -43, 41, 70, 15, -88, 69, -164, 200, -82, -87, 292, -27, 45, 167, -10, 60, -153, 155, -255, -204, 3, 49, 7, 172, 155, 204, 143, -111, 249, -100, 203, 239, 86, -124, -204, 156, 55, -172, 44, -52, -127, -38, 109, 136, 3, -91, 204, -43, -189, -38, -23, 58, 47, -247, -16, -129, -22, 12, -57, -83, 32, 19, -289, -282, -197, -49, -12, 42, -24, 157, -77, -177, 84, 128, -214, -78, 35, 253, 194, 138, -76, -10, -36, 124, 74, 273, -75, 92, 90, -51, -97, 240, 150, -90, 79, -55, 0, 84, -69, 242, -207, 16, -64, -61, 116, -168, 164, 26, 67, -124, 64, -60, -36, 34, 21, 356, -332, -46, 19, -58, -49, 228, 65, 108, -95, -47, 2, -33, 73, 68, 13, 129, 88, -75, -6, -51, 67, 125, 101, -8, 25, -4, 38, -78, 148, -186, -221, -73, 19, 11, 65, 36, 72, 174, 66, 149, 133, 23, 54, 53, 86, 100, -103, 113, -101, 51, -69, -33]
3468c3J29J40l28n6PJ39j28j08L52k72J53p3L7q8L1J04lJ50J5j46k8j68M7K44
3492A17k68K10Ml81K83K18m24M47k44J38k07r8L4J11J24j62K28p5n9J69k22p0
3514a27j8L72k98K33k76J11j99J46OO6LK36k82P9j61r8K28j72J5N7j5J84N5q3
3538F2J11r1K6om3n9nk4r7R7K09k10j22M63o51J93N6k8P1n3J41o7J2M0j63K40
3564A02l29J77j7jL03l57P2o4K16k05rJ15P8k0j24J45j62j00K71J3J08N2l70L74
3588B68j49J2k27J15l3r2L2J08l22J05J39K4J27p6j75J81L7O1l0j04j26L04k72
3611i3K08l78L01K66o6l43J16J5j35PJ76j4j0k2m8J28oj97nJ12N4P6m2k58J34
3636b4k8mLJ51J54j24j24j11N2K36k92N3J25r6J04m4P3j74J00J0q7j9K70j15q1
$$ y = [-33, 96, 236, -92, -148, -141, -2, -130, -238, 114, -158, -5, -78, -41, -129, -98, 6, 3, 153, 168, 22, -6, -174, -127, 117, -151, 59, 63, -318, -35, 183, -241, 206, -38, 100, -107, -205, -171, -60, 64, -98, 130, 55, -4, 165, -57, -127, -145, 227, -71, 162, -114, -3, -202, -56, -50, 16, 19, 255, -27, 52, -109, -207, 21, -151, -136, -79, -94, 90, 145, 62, 173, 82, 108, 102, 59, 0, -5, -29, -126, -29, 180, -30, -152, 311, -340, -147, -91, -119, -48, -101, 40, -27, -15, 25, -138, 102, -227, -50, -67, -68, 235, -122, -50, -114, 102, -103, -112, 3, 81, 61, -63, 82, -80, -180, 91, 104, 212, 264, -106, 268, 119, 131, -96, 19, -14, -106, -74, 34, -288, -183, -44, -20, 107, 31, -144, 37, 74, 135, 105, 1, -125, 179, -93, 115, -263, 38, 304, 238, -105, 11, 26, -109, -102, 74, 60, 50, 28, -20, 108, 102, -95, -100, 12, 66, 142, 100, -158, -24, -52, -56, -53, 98, 252, 128, 4, -107, -55, 181, -111, -58, 67, -29, 75, 31, 104, -70, 30, 40, -47, -66, 204, 89, 8]
3661HK14m63J98J69Rk76J01n7L10k25L1Q7J59k23N7l33J53K6p6K25l24N01J94
3684D65l36k74J08j10J03l0L03j74k34J31J12j89L5j13J96l3K14j63j18K0L43
3705B56m34K50R1k17j36o6L58q7n3P0M4m2j22j6N3m4K09j95J35r9n3K81l77J33
3729f1O2M3j14J05J06j89P5m0j20L19j46q4k08K55L0k6k51M34k04N7n7k67J56
3752a25J65j96K78o6j76J24Ro4J06j36L90n20n6L34m68M64k7j12k39L05J1r5K50
3775A56j53J78j74J42o3j05J5O3R4k16J27K6k48J1P4M2j10J34q7Q7jr8o2P0j1
3800a09J2J77j95J55J81k58J11o5R7K5k77o4L07j1nj74o9K60j16J2J70J77m40
3823i9L1J12J63K4l09R1Jj30K12J83j14j24j92O0k0P7ON0R3J39l16K88n18L54
$$ y = [8, 222, -241, -43, 126, 135, -141, -40, -97, 213, -12, 19, 106, 265, 42, 99, -234, -81, -55, -131, 94, -230, 271, 465, 129, -145, -37, -147, -44, -74, 229, 55, -179, -48, 64, -125, -90, -203, -7, -40, 174, 11, -107, -87, 256, -178, 72, 163, -54, -190, -256, 102, 15, -38, 32, 76, 34, -88, -104, -51, -95, 114, -81, 54, -45, -98, 183, -194, -61, 1, 44, -70, 35, 141, -48, 27, -13, -133, 186, 40, -44, -252, 3, 33, 7, -244, 190, -14, 43, -14, -281, -125, 40, -156, 122, 56, -120, 4, 13, -51, 55, -81, 309, -211, -267, 67, -401, 63, 36, -76, -315, -10, 1, -94, 156, 3, 181, 7, 149, 86, -19, -4, 59, 153, -63, 64, 90, -158, -147, -73, -31, -141, -7, -94, -7, -8, -106, -168, -98, -109, -97, 80, -115, 40, 221, -37, 74, 9, 106, 131, -146, -210, 97, 86, 81, -93, -162, 98, -18, -6, 164, 341, -99, -68, 44, 207, 231, -78, 13, 14, -116, 96, 279, 165, 41, -151, -91, -111, -34, -28, 22, 115, 254, -62, 226, -292, 62]
3847F2j06K07j49k12K14j61K52M6j6j26Jj47J53j92K86m09J99M6p8J06Jj9j68
3870b10K35oq6n9K97j99R8j67oO0J35k17O2J93r0J54j48LJ4J63k80K3M8Q5k06
3895a04L9j99J59J10q3N0j30K06K2j63K38j04j12M7P0r7L5p9J06k7J84l06R9J98
3919A59L4j59n4K10r7l25N0J60J20k82J2L3J86J84l82K02n05P24l41M5l0Q3r8
3942g1J31j66M2j90J40N3J91K8m54J72o3K09K5j69p3K62j77J40j94J31j65Q9J50
3965D1m5n5J97j50j4O1j09N3K66j71m7r8n9J30L5J23k17j01J64J28n1j51q5jK84
3990A28k54K10q4J72k88k6J97Qn1k18K72j98J89k23K92k86L17k34Q9O8j7QJ32
4013B03k97M8j2L36r4k56J55j02l0Q4p6NJ50n4J9ll2j85K33j21L14l09N7k77L28
$$ y = [62, -44, 163, 14, -198, 16, -145, 107, 153, 137, 11, 12, -135, 18, -174, 112, -297, -98, -52, -130, -24, -23, -42, -210, 25, 19, -67, -126, 171, -28, 70, -97, -103, -43, 92, -125, -63, 130, 40, 194, 46, 49, 63, 226, -54, -31, 17, 102, -104, -65, -264, -105, 5, -78, -28, -158, 48, 70, -93, 145, 41, -71, -24, 46, -51, -16, -95, 11, -16, 168, -138, -39, 159, 193, 34, -20, 190, 93, -232, -182, -22, 98, -184, -172, -139, 47, 231, -151, 51, -454, 270, -71, -26, -56, 27, -71, 60, -106, -64, -254, -114, -61, 130, 158, -296, -124, -187, 22, 47, -122, -195, 67, -110, 30, -164, -33, -198, -109, 41, -4, -59, 138, -12, -26, 35, -74, -21, 245, 74, 27, -71, -130, 0, 35, 158, -59, -160, 4, 132, 81, -70, -155, -156, 128, -126, 84, 0, 172, -116, -142, 55, 63, 12, -206, 66, -132, 57, -166, 126, -160, 157, -77, 12, 80, 63, 71, 203, -94, -46, -58, 278, 184, -72, 83, -19, -49, 35, -41, -36, 114, 60, 79, 76, 44, -141, 92, -29, 285, -24, 33, -244, 84]
4038H4l0j54K28q7j22J26q0J52n9p8j05R1mK42k43Q1qj47k3K3mJ15J8r5M5L10
4064B76l45OQ9J03l37O8J44k86q0M97pK8k16m2J69j26K85l01J18J4P8J9l6j05
4088A3P1j47JJ02j47r3M4M69n17J76J34pk48J29J27j06p0J31J16j88o2J64p6k39
4112b23K81%o4k59J49P5j41K84k71qL36j73l9MJ47k26K51J8j27o8J41k31M3J99
4136I8J47q3j70J31k78q2L08j37K68k79p4P0Q1K29l34j1M2m1J84n2r9q2R7R3R0
4161A16r8J43j32nj30J86k52N1L0O1J20j01k57K86o2j26R0l2J82j35j10J89J66
4184A80j74K92n36L44j96M8j8QK2j2J89l55L75j32O1J09p5p0o2Jo5m2K04r5K8
4209B9j30J32p0J54k29m1K72q9j32J58J45k60Plj46J70l2r2K69k31J31K6j40O
$$ y = [84, 54, -100, 128, 41, -81, 45, -35, 117, 58, -20, -125, -34, -38, 204, -39, 42, 34, -113, -136, -113, -117, -2, 16, -79, -34, 276, -69, -63, 26, 129, -208, -140, 4, -282, -362, 135, 128, 156, -60, -102, 67, -59, 226, -75, 43, 57, 135, 154, 118, 13, 84, -63, -62, 40, -107, -200, -156, 313, -204, -28, 106, 99, -149, -20, 107, 1, -69, 62, 178, -10, -72, 92, 16, -223, 58, 58, -6, -265, -116, -41, -182, 102, -169, -177, 159, -14, -53, -49, 98, -128, 123, 141, 14, -54, 87, -144, -101, 98, 245, 162, -8, 123, -155, -237, 71, -66, 202, -77, -151, -81, 0, 229, -105, -116, -74, -115, 69, 17, -82, -164, -67, 26, 116, 18, 161, 29, 24, -106, 80, -172, -121, -91, -30, 90, -11, -268, 18, -44, -170, -80, -112, 70, -65, -175, 14, 180, 6, 298, -238, 106, -90, -42, -60, -52, -30, -42, 147, -208, 167, 35, 96, 205, 130, 60, -2, -1, -66, -108, 96, 1, 29, -101, 31, -39, 115, -114, -155, 117, 28, -104, 54, 199, -61, -54, -57, -203, -33, -65, -157, 112, -119, 12, 38, -102, -96]
4233i6O7rk18K48k43J43J51M9l0K22j51P9l49K51j67L8K04k02n4o8L03r1O0j07
4257C0m1J93j63k3j92K90j17K4l0o6K56nk85K50k95M16n4l12K57K3j62R0j39J96
4281A41k37O1J66J15l62m6K03j12R5N9k03J79j40K08O7o5k85J37J92k03O3P8K3
4304A34k79J63K84j93r0m8r2K2J02k66K64J36j72P3K30l26j12J03J14K6n3j26
4326a06L87n1l10J87j05O3q1r0J6K81j57Q4l42J27R2L5J0l8k9Q9k60M20k20j33
4350a31p7J00J68K9o6j01kJ50R4j95N4j54J54k18J90K65j46M8m7j03k15Q7K24
4373A08l06O7J44j25R9J11Q6j38j84K67k64J23K0r5K33k36j07K39j5Q2j81J57
4395H5k71K95q1l0k58J45Q3o7Q1J15j0o0j00O7P4J27J2k98J26k35K52j31J22L5
$$ y = [-96, -29, -38, -256, -8, -251, -108, 43, 92, 62, 284, 133, 212, -137, 114, -53, -15, 189, -13, -67, -135, 168, 77, 137, 30, -11, 182, 19, -4, -196, 94, -23, 1, -29, -95, 161, 156, -129, 121, -174, 242, 188, -124, 133, 156, -6, 84, -55, 141, -96, -35, 131, 246, -116, -162, 41, -71, 24, 83, -120, 59, -81, 127, 194, 129, -156, -19, 173, -30, 33, 111, 134, -145, 18, 302, 109, 19, -29, -121, -99, 3, -263, 1, 137, -35, 38, 268, -58, -170, -67, 47, 73, 20, -106, 281, 230, -80, 107, 2, 65, -16, -106, -90, 191, 34, 118, -224, -97, -5, 30, 40, 2, -27, 62, -198, 222, 2, -131, -208, -108, 60, 89, 23, -78, -80, 70, 164, -31, 23, -131, 23, -195, -5, 260, 114, 162, 115, 12, -203, -116, 108, -198, -131, 13, -112, -13, 98, 184, 46, -138, 129, -135, -12, 8, -87, 146, -90, -197, 42, 27, 109, -72, 85, -186, 109, 28, -2, -260, -115, -32, -99, -18, 97, 87, 27, -73, -6, 68, 195, 207, -91, 35, -200, 52, -79, 43, 78]
4419G8Q4k8r1q6J03L8m4r3K02k13O6R3k74L48j72q3r8K93j47J42j94O1K4Q6o3
4444C2J69k09j28N0J70l4P2j04J49j46nj05R2Q8j35k0J92j82O8P3Rj85J8lp7P8
4470g3N6Q4k1p7o6R5L12o3m58K11J76j46k2r0L94m24K11Jk37j13J81N5J5N2K77
4495C30l00k72J07k26K02K69j25J77q5o5j53L67l24K00o6j29l4K14l41K17P0j33
4517a00J34K74l32L9j71K50k0k54K49m1k54pK35O4l8Q8j98K2J51j59m4J05L7k9
4541AO8O7k84K72j33J7q5N0J22j87L41k90j9J95k68J33n6J10j98K14J10m1k09
4564g0l7M42k95J78l61K97j41j60K12m8m4j70K68r6J35n9l7k23K06r9K21m4o7
4587Hj79qJ31K34j95J60j35J72j77l4J36O8j02j58K57l08Q2J57K26m36P8J9J06
$$ y = [78, 162, 134, 43, -43, 60, 98, 54, -39, 163, -50, 16, 109, -165, 183, 11, -72, -170, 123, -24, 118, -76, -15, 9, 95, 32, 201, -8, -136, -86, 84, 50, 122, 18, 167, 21, 16, -89, 3, 91, -44, -64, 128, -54, 14, 87, 96, -89, -71, -74, -151, -73, -17, 67, 46, -31, -97, -2, 310, 247, -211, 0, 176, 30, 8, -82, 312, -112, 99, 100, -137, -250, -69, -14, 1, 53, 330, 30, -242, -135, -361, -159, 110, -15, 162, 77, 12, -141, 226, -98, 102, 36, -93, -127, 87, -254, -37, 33, -100, 34, 308, -24, 15, -156, 94, 74, -180, 69, 28, -226, -233, 2, 66, 28, 116, -82, -60, 91, -68, -112, -7, 30, 1, 69, 136, -148, 124, -9, 8, -77, -27, 95, -92, 249, -41, -60, 135, -133, 0, -56, 54, -144, 70, 180, 139, -70, -107, 335, 40, 218, -143, 154, 13, -147, 65, 17, -27, -197, 71, -25, 110, 51, 14, -209, -3, -102, 119, 75, 8, -171, -179, -48, 186, -9, 151, 16, 188, 11, -23, 113, 181, 79, -79, 178, -130, -48, 109, 335, -101, -23, -4, 102]
4610A02j00j50J41k04L00k83p9K72O0L2J49j91J3j99K8p1L94k88P1p9K30j78J26
4633I6N6k90J31L4j6j03j41K71K3J62l73J39k26L15j9P9l30L16j57M4J4m8K93
4656B70j51j01o5J75j64o0J34j8j43R6J04O6j92K79l96K90l38K32p2k4K1L0J19
4679I2k50O8J25j99J93j14L05M7k84J00k62O2KL13j80n7J04l17K85q5O9J72m48
4702b59J51J10L6O6j25J06L5j00k5J82l39L45k60J02L3Qj5N4n8Kr0j3J49j71K05
4727A29p8m2n2K45k16k09K62p6j60M2J00L2l5K66k10J8N3k10R6j7p0O5J25k2j18
4752h2J72j26P6r0n8J26R7m1l15K11r1L18l24J05pJ94k0k01K0K25k85K70n5r5
4776B4n2pJ22j7r0j38K28J89l49j8k08N42j56J3J34k58J47j62l4J46k33rK06j7
$$ y = [102, 2, -148, -7, -211, 89, -194, -273, -1, 59, 91, 240, 49, 62, -137, -109, -180, 214, -74, -3, -82, 148, -30, 96, 152, -138, -7, 27, 11, -92, -233, 38, 61, 223, -150, -11, -237, 78, 59, 138, -192, 124, -33, 11, 25, -23, 270, 119, 18, -47, 128, -36, -96, 38, 20, -123, -27, 77, 143, -49, 230, -166, 124, -214, 18, -54, -78, -57, -27, 92, -158, -90, 35, -164, 29, -85, 220, 267, -17, 83, -179, -117, -115, 198, 18, -39, 65, -252, 33, -52, 17, 189, -259, -108, 2, 38, 104, -21, 85, 120, 20, -5, 177, -162, 183, -77, 25, 58, 66, 51, 105, 47, 49, -41, -54, 95, -76, 129, 51, 9, -43, 202, -14, -223, 39, -37, -197, -155, -55, -23, -58, 208, -2, 16, 69, -141, -45, -62, -132, -67, 58, 36, -82, 90, -36, 40, -50, -108, 18, 115, 74, -241, -30, -121, 197, -127, -22, -29, 165, 145, -56, -36, 189, -96, 174, 119, 24, -28, -35, 87, 70, -20, -158, 70, 259, -90, -108, -316, 226, 70, 83, 217, -41, 106, -56, -90, 56, -177, -186, 20, 3]
4800CJ07o4P6j7Np4M2q1k13K28L5j46K41K08l68k08K09Q5J41k98N9J0J35k03J90
4825A02k38r9K43J4J53k27K35l9n9J0J16j18k00O0Lp4K5L23j55j82K7R6r2J38
4849F2r8N3R4l24J82l9J80k34rL71j75j81o5J56rp4J1K00q5J36j6J38l09Q5nn
4875D0J6PN2q1J20n6r1j19j3J14L5m6p6KJ98r6J57J3P7m47L59k07J01l1jN1n6
4902B2l4j5j01J34K66L0k3j54k32m0L42k70K19q2k0j69K69k42L24k43n1J0L6J19
4926I5k61M28l20R8J6j44J9R9j5M2k32k2L8K65O7j07k61L28k38O6j09J90J21r8
4950F5k17L14j42m6J55j53L2L5j5Q1m0j45O69o59q2N2n2M06k87N9LJ16l77l8j6
4975b82K38o4J02j13J32m8m2n4J61j49K52j15J44k2n7K4j61j26P3J83n2K01l73
$$ y = [3, 110, 46, 122, 105, 110, 36, 78, -3, -216, 12, 47, -99, 142, 350, -18, -226, -17, 68, 209, -89, -30, -20, 115, -88, 102, -136, -235, 8, 22, 175, -52, 183, 144, 85, 95, 211, 93, -107, -47, -44, -118, -93, 230, 75, -107, -80, 16, -76, 62, -36, 17, 111, -213, -31, -70, 110, -124, -133, 238, 63, -118, -183, -27, -36, -110, -99, 101, 16, 152, 136, 274, -35, 50, 45, 40, 56, 63, 115, 34, 154, 98, 7, -112, -125, -11, 24, -22, -98, -96, 102, 6, 163, 176, 253, -194, 165, -42, 59, 28, 27, 78, 22, -12, -27, -128, 6, 272, 302, 279, 125, -107, -147, 195, -75, 144, 62, 42, -127, 142, -100, 224, -19, -70, -60, -24, 95, -166, 262, -58, 40, 56, -88, -69, 30, 15, 57, -175, -197, -159, 106, 173, 66, -195, 133, -105, -39, -148, 42, 163, 65, -152, 162, 20, -26, 129, -24, 8, 43, 28, 109, 69, -76, 593, -66, -148, -96, -148, 258, -29, 30, 33, 149, -228, -266, -282, -44, -108, -6, -119, 13, -35, -77, -131, 30, -119, 133, 18, 162, 140, 83, 107, -54, -180, -107, 76, 24, 225, -148]
4998a48K53L8j19q3LM3j6J30M1l1q9j00r5L03k48K23o5J45j63K6J0nl52M51j97
5023d5L5M1l19M90j99K02j91J49O1j55Oj92K25j23lp0L42l91m1L21l58L57q2o0
5047@j8K83j26m1K3p4J32J00k95o4J51K02o8p7j15j05R4Mj16L49p7j02j7M3j18
5072c2o5L8K29N6l18J91q2O8n5K33m46P7J09J4l22K91lJ16l06K33J17k85Q0O1
5096aJ45J14k75L4J60j16N1k04K50k21pk39K53mK71j20j48l5j13J40P4j36K66
5119A39m7J57r7k5j40j35P3n0O9K63j00j48N8J81j43j35N6K62l46J96j64r6Q8
5142h4J59k2n5K11m67L15j1j11j50J64K32J72l49l1j17J0J09J98k57KKJ68J83
5165B71l29J95j77j3R0j72L3J91k59K17J62j00m6n7O0M9n9L7j78J6K30m28L86
$$ y = [-148, 105, 143, 24, -59, -56, -13, -29, 101, 142, 111, 22, -78, -173, 130, -118, 105, 40, 185, 22, 48, 58, 53, -299, 152, -45, -10, 31, -288, 202, 3, 205, 14, 163, 224, 69, 75, -117, 108, -15, -18, -88, 254, -137, -178, 143, -215, 142, 60, 0, -18, 265, 139, 98, 121, 47, 179, 279, -16, -80, 71, 273, 205, 128, 13, -92, 2, 6, -110, 239, 162, 60, 43, 86, -32, -97, -59, 170, 226, -92, 99, 17, 85, 30, 263, -183, -106, 3, 17, -305, -14, -17, 99, -207, 26, 143, -142, -62, -1, 144, 258, -17, 17, 177, 61, 112, -92, 158, -63, -70, -309, -56, -60, 211, 91, -57, -92, -205, -65, 9, -127, 139, 92, 249, 152, 127, -13, -148, -75, -125, -56, 207, 107, -41, 17, 198, 55, -80, -24, 238, -108, 88, -76, -172, -84, 75, 53, -2, 209, -258, 57, 46, -65, -215, -51, 181, 353, 4, -27, -144, -134, -25, 173, -84, -82, -80, 88, 271, -58, 137, -40, -53, 37, -135, -102, 89, -170, 47, 209, 109, 63, 6, 66, 115, 56, 93, -85, -69, 161, -267, 119]
5188A19J6N8N8k52K58m3l4k71J2J07R8j50J43R4j45J27k69J75O0k16R1j10J95
5211A21j52m0j66L7J21R2J90j68O9k18J98k11k79M83K5m4k52K02J03k19J05j8
5233b1k2N0Jk39J48K36k51M6L35m74l2M44j04J36k60O0J47m96N73k70l38L15l84
5256d00M68n6K01l81J98N8l57K27r3J34K31k08m31M75N3k05J18J21P4k04J5r8
5278f0n8J68o0K15m60N31n4k46j42P8M5o2r2M67j8k12k20K30O4j55K02j92K04
5301A73n3rLq4J7k0j0J45k12K51j25J42m67Q6J04K5J65nj22j57N5K20o4m9N1J79
5327B39j68k52K00o7oM1K22j03l37J45J71j71L77l76J39j29j55K19K6M7lj61K18
5350A16j88K9K16l34L71k31j84M89j60l68K69L7M0j1j9l7P2%k14K3k3O5M4O1q6
$$ y = [119, 135, 193, 251, -1, 257, 214, 180, -91, -79, 28, 126, -24, 119, 213, 68, 195, -74, 101, 161, -55, 36, -74, 121, -31, -71, -237, -200, -79, 13, 203, 35, 104, -114, 84, -127, -406, 77, 102, 58, -194, 8, 111, -108, -3, -21, -43, 7, 8, -231, -83, 153, -98, -52, 283, -191, -223, 221, 117, 253, -7, 53, 200, -296, 277, 7, -331, -16, -400, 68, 12, 213, -168, 30, 88, -269, -42, -135, -1, 230, 22, -409, 66, 119, -86, 32, 153, 227, 23, 38, -60, -118, 50, -10, 205, -255, 276, 222, -24, -166, -88, -43, -105, -197, 270, 252, 40, -180, 50, 114, -41, 161, -31, 173, 120, 111, 114, 30, 47, 27, 17, 162, -50, 201, 76, 218, -249, -163, -59, -34, 131, 126, 4, -153, -98, 122, 58, 9, 60, 239, 71, -181, 19, -48, -54, -13, 209, 106, -231, -86, 85, -86, 291, -85, 54, -75, -230, -11, 15, 62, 59, -102, 116, -72, -43, 173, -161, 210, -21, -205, 284, 124, -244, 25, 62, 102, 91, 72, 35, 107, 107, -107, -84, -107, -42, 2, 63, -23]
5375b3P1k36J22O7k27L64l00J45K1n8J28k1r7j9q9K45m20L10k6J23p5J7P2j57
5399f3j52J7K24j08MJ49N2n2j62l5M35r3j27M2k48j18J35K36k27J60r4K0k2J6
5423a1K87j80n4N5J6j86J41l6q6l9O4Q6K3l30J74J52J15k83l2L10pOk62j4J51
5448F0kq0L29l01Q0o9p8k30N11k04k01L79j72m2L5K43m05j8R4K27k54K67k19J96
5472A46j98k2Q9j90J72RJ22j37k7N1j7r1Q4N7n3po9M82n15K26M2j84J7m7l30K87
5498a03K51l46K38r3M2O3m1K5j24Q3R0j5J0j4j46Q8M4L4m6r7j09R3j12k6K61n1
5524aj50M16l54J09k23Q7L18j57p3j30J72k6N9L4j38k28L51k46K92k78K53o8k9
5547a0Kj25J2J65j41j58L56j45j59K29l3j47J21Q9j36K7J35J58k55l6J70q8K1
$$ y = [-23, 48, -188, -66, 1, -226, 138, -162, -17, 4, -54, 74, 53, -44, -63, -152, 93, -327, -17, -43, 80, 5, 22, 94, -63, -215, -198, 26, -82, -78, 71, 123, 71, -91, -126, 309, 216, 89, 131, -117, -235, -100, 136, -91, 69, -25, -5, -27, -11, 276, 96, 42, 97, 113, -73, 68, 32, -54, -93, -29, 57, 80, -250, -76, 76, 191, -92, -124, 186, 179, 185, -77, -91, 60, 58, -22, 307, 6, 86, 17, -61, -291, 220, 16, -185, 194, 22, -20, 15, 258, -147, -165, -71, 156, -98, 169, -50, 146, -52, -74, 15, -175, -3, 6, 128, -9, -36, 15, -2, -93, -9, 48, -5, -12, -81, 401, -114, 112, 154, -30, -13, -60, -390, -103, 148, -198, 40, -53, -11, 52, 11, 36, -88, -5, 85, 70, 80, 66, -80, 8, 52, 86, 40, -57, -166, -73, -185, -211, 50, -1, -151, 265, -89, 20, -203, -116, 202, 45, -28, -158, 14, -12, 47, 81, -57, -285, 66, -180, 112, -166, 87, 19, -10, -8, -133, -121, 44, -97, -255, 101, -44, -203, 26, -7, -154, -33, 56, -80, -53, 82, 240, -15, -51, 119, 31, 52]
5570E2LRk26R8L05l41K66l63J23J28m03M61j62J66j33K64m04J75O9o5Q7lk59O1
5594i2q3L50m75M60l2k97K07Jo3K12l16J76K0n3R0m7n2l54rM91k28jK01k12p6
5619a82K49l50K10L11l49R8K53j03j60n5k4M04k41P5q4p5k42K70j19NK63j49N7
5642F2o1O2l13K38J29Nj96J14q8N3k1j73K67qp2p7j5J37J22j52j4J35p0k23O0
5667i9K30o1k53J86r9R6q2P6Q2K5J75l09j01lj37K98J27k78J5J33J60k95L42l17
5691h9K18k74J90o6j86K28q7Q7k7J61k42l0Q3J6J24J14j90p2R5J75j93k14J89
5714A0L2Q1l01J3J10Q5J4K52m68Q2j18K92j55o2n0J91n3N6pJ13j29P7j52kj48
5739b37K29J30Lrj42j8J5R1j00L2l2j3j51J41nJ15O2j75Q7R6k46J89N5J23k61
$$ y = [52, 55, 64, -162, -64, 241, -100, 166, -197, -74, 54, -349, 112, -50, 116, -17, 247, -157, 18, 87, 22, 109, 106, -153, -92, -175, 175, -300, 160, 128, -169, 38, 39, -24, 188, -128, 48, 68, 15, 105, 58, 6, -348, -357, 134, -94, -95, 106, -106, -182, 67, -283, -73, 238, -111, -13, 240, 137, -23, -78, -102, 302, 61, 136, 52, -23, -265, 5, -114, -109, 154, 5, 62, 1, 63, -250, -12, 117, 122, -74, 40, -48, 5, -16, -189, 78, 70, -2, -79, -94, 43, 165, 13, -1, 134, 64, -159, -99, 131, 70, -183, 3, -96, 0, -82, -6, 76, 101, 276, -33, -134, -137, -274, 24, 151, -127, -112, 21, 181, -114, 228, -89, 129, -145, 45, -21, -207, 21, -66, 21, -6, 155, -87, -117, -34, -18, 106, 220, 30, -42, 53, 228, 35, -179, 10, 42, 123, -178, -165, -55, 30, 44, 296, -172, -90, -208, 84, -71, -133, -183, 8, -45, 11, 4, 117, -12, 65, -87, -89, -237, -8, 122, 125, 116, -26, -44, -29, 62, -38, -6, -38, -51, -202, -61, -66, 49, 111, -64, 23, 119, -127, 62, 117, 240, -21]
5764b1K39l20J59O7k34K11j92L7j69J5J37K53k43K01k48M01k02k78J59p8J09l61
5786c58M82r1K4R5l36J44%M2L90l55Kl7J27j49R5j66J11m4L4k17L6L29j53O4J21
5811A90p0j32j97L31p2j57j16j4K52R0L7q8J7j21j8L60l55J92J46k32K01k24o0
5834d0m6J42N2k72M1K6J93j42J3j52K75k77Q2K07J01l3k72K43n4Rl41K14K5k8
5858c4K5j00K5O7k56J67J96k01k2J13k3J96j23Q4K5j96K39j35j19J65K9k75K07
5881E4r0k6j75K11J85k13m2K22Ko1J26k01p1J19q1J85m45L72k40K46K2o8K0O1
5905A12j38K33j78J34Q6k88n5J11j85O2J76j73J43J14j82J35J3j47rq1J54J18
5927A55K4pk75K07j56J63j03J24On5j45j67L35l44L17R5o1r4n5K27r6j60K06j05
$$ y = [-21, 218, -102, 57, 124, -110, 101, -91, -54, -223, -208, -71, 182, -61, 140, -108, 293, 91, -187, -28, -106, 3, -358, 124, 33, 57, 152, -184, -40, -40, 2, 392, 37, 39, 2, 129, -20, 75, -91, 20, -24, 10, -207, -171, 158, 5, 69, 190, 120, -12, -209, 122, 50, -107, -223, -237, 15, 105, 142, 54, 71, -50, -68, 292, -63, 129, 275, 43, 244, 20, -40, -86, 56, 108, -164, -123, -97, 96, -46, -33, -185, 90, -187, -105, 102, 203, 170, -102, 141, 87, 96, -245, -31, -6, -34, -9, -109, -84, -17, -273, -106, 90, -111, -133, -20, -43, 153, 30, 114, 139, -57, 182, 47, -72, 93, 122, -153, 54, -36, -62, -237, -26, 159, -54, -96, 126, 128, 67, 193, -8, -79, 40, -41, 144, -301, 71, -169, 77, 99, 31, 51, 112, -26, 207, 29, 163, 249, -39, -94, 17, -168, -106, 70, -103, 40, 154, -28, 107, 120, -27, -36, -117, 37, 155, 179, 172, -103, 104, -52, 111, 8, 132, 138, 83, -62, -229, 106, -238, 79, 174, 113, 19, -36, 191, 95, -65, 141, 36]
5951C6q9l6K26r8k0nnJ23k53J28m4rK13j29j85L03ok48O0J10j61p8K58j37%J1
5977c5L9P6k23O1n5k1P4j8K08j77K2n3O7J27J9l07J71K76k05j66l9K00p1oK5J64
6003A53p2k10K61k8j64O9N5j20J16J03k05lq2M01l75j42K79k2m4J71k0J37m21
6026a63K05M5j05Q2k20K48o9J20j98P2PN0l14J03J1K55k06J28o3j80J00n7K93
6049A44j34Rk42K40l87K81P4j17JP0j44K52l4k00K83p7k20L64j46j1N0k13Q2J39
6073F4j87K66j28j45K38j36K0j1J27j15J03o9J38j51N8q6P8p6J27lJ13k25j00
6096a00P2K88m07O5N1k5K04J0m9Q4k35k0L78k76k70K94O1l44R9j50K14K2q7j52
6120b73K49M7m7k20K57O6%r3Q7Q1k13N2K85k24o3j21J40Qk71L41p4p8j37R7J20
$$ y = [36, -53, -89, 137, 39, 19, 14, 9, 132, -121, 7, -37, -46, 167, 38, -147, 156, 150, -98, -38, 72, -89, -167, 91, -46, -46, -35, 4, 80, -143, -82, -137, -158, -84, -102, 106, -71, -49, -102, -35, 92, 111, -196, -25, 251, 46, -120, -159, 41, -30, -36, -11, 153, 81, -129, 132, 104, -60, 9, 64, -56, 60, 163, -42, -45, -127, 274, -101, -243, 36, 14, -30, 141, 121, 258, -163, 42, 87, -18, 64, -156, 92, 23, 143, -55, 17, 24, 74, -240, -137, -126, 129, -77, 51, -12, -192, -92, -149, 144, 10, 19, -223, 17, -370, -89, -15, -132, -131, -61, -205, 47, 13, -187, 96, 19, -201, 163, 17, 6, 56, -157, -75, 64, -123, 143, 15, -130, 108, -28, -8, -19, 108, -7, 96, 27, 165, 14, 72, -14, 64, -12, 115, 112, 225, 0, -100, -28, 260, -147, -82, -31, -56, 148, 158, 109, 193, -42, -62, 316, 40, -230, 64, 125, -219, -120, -270, -56, -34, -121, -273, -24, 23, -24, -244, 13, 79, 79, -14, 73, 154, -59, -7, 278, 54, -9, -130, 10, 18, -253, 88, 14, -64, -201, -104, 16]
6145A6J55k82P0k77K29O6j00K24l35K58Kk3l7J04r3j16P7K7p4J62l0Ql3J28j84
6170e8J1j67L12k3n8O7j12M5K0j6q6MJ0L7p9K55j62j24%L14k61J9N7j4K63l08
6196e4O6J3J0j17M6J47J49m04M2J40N6k96K15M4K5j56R0K33k35R1m03L80j57Q3
6220Hj18p2L60m04Q3p2K12J90Rl95R6J94pJ21k33J68m1J28k45r9J02N2o2J41j06
6245A0j44Q2J15O2r3N6QPk45N1J39J96lk71J48mk06J45j76k4K95l85L29N8k56
6270a06K62m39J92J20J76q0j92k3J27r6k0NJ29l01K18j14J96K3o8J54j16k2M3
6293F8j68k2R3P3j34o2L77p4k11O8P1q1j43K93k10J92j56p3K31Nj44k15L54o0
6317G2m4L15l29N2O6k33K35j44M6j03L3j25r0L60j19J12k23L47j96r2m6K42j41
$$ y = [16, 171, -111, -41, -318, -89, -23, -123, 101, -234, 24, 26, 3, -34, 70, -23, -139, -62, -35, -109, 53, 23, 31, -2, 126, -58, -47, -214, 98, 75, 17, 84, -28, 17, 37, 21, -65, -61, -51, -14, -93, 162, 0, -124, -124, 190, -71, -52, 5, -9, 254, -54, 12, 25, 35, -82, -36, 111, 260, -144, -102, 38, 94, -202, 13, 57, 82, -74, 16, 249, 14, 105, -298, 82, -75, 8, -110, -182, 178, -226, -143, -215, -3, 187, 196, -199, -103, 91, 84, 205, -28, 140, 99, 227, -18, -117, -15, 37, -25, 116, 10, -134, -52, 63, 125, 32, 88, 96, 103, -142, -91, 48, 244, 241, -30, 118, 114, -92, 53, -123, -147, 148, -237, 92, 150, -106, 156, -283, -91, 29, 205, 125, -67, -90, 37, -59, -79, -74, 55, -246, -28, -142, 54, 77, 9, 163, 47, 25, 68, -100, -122, -29, 44, -90, -152, 225, 151, -60, 8, 79, -2, -145, 148, -62, 130, -26, -99, 132, 137, -7, -222, 132, 72, 28, 343, 14, 66, 132, -101, 134, -10, 36, -67, -34, -159, -249, 111, -8, 104, -119, 228, 32, -60, -106, 136, -5]
6340eK9J63l9J06l83J96pk04o6J60J78k42P0Q0m1J14J50k76P1p5j03J09M2L5n1
6365A1R7j21o3J53K53l01j0o8j30K59J04l42J92J95m87J32K37k24R2j34K90l00
6387a65J26K4m2L73l88L40k80O3o6j40p3M43k09K64k33p4k39K10L0N2j93J04K16
6410A43k69N05n78L19j62O1q8n5J93l9l9L70n88j2L22l01J39J38j77J47j00K79
6432B08l02K74k45J6K91k43j57K33j86J91l13J55K24j93K9o7K88j98J04k26K41
6453A24j65P1j00o4P9J64k58o2R1O2R8j46n6Q2J09j26L73k54K0K5j94P0k1J84
6477A06r3Q6P8k87j9J30P5l1k7Q8j15j01N0J64j93J72k21J47J34M0j66J02k26
6500a07Q4Rl8N8o8l5Q3L00m44R5LK53l04K27l06K86j60M24m39J24M5k65M10m44
$$ y = [-5, 24, 187, 148, 254, -129, 67, 60, -144, -210, -50, 128, -114, -44, 36, -5, 109, 259, -17, 54, -21, -124, -15, 27, 62, 11, 108, -13, -76, 77, 330, 29, 19, -49, -179, 80, 184, -158, 34, 229, -258, -126, 111, -113, -21, -155, 135, -165, -39, -15, -57, 316, -72, 268, -12, 51, -15, -155, -228, 215, 6, 270, 37, -37, -276, -66, -36, 16, -177, -73, 143, -126, 379, -199, 120, -42, 19, -69, -124, 69, 30, -9, 361, -227, -239, 83, -218, -79, 59, -118, 29, -71, 208, -94, 180, -65, -49, 242, -1, -158, 75, -111, 80, -233, -78, 146, -47, -18, -85, 203, 5, 109, -117, 124, -41, 30, -70, -134, -55, 109, -149, -211, -120, -58, 40, -106, -162, -80, 29, -97, 276, 22, 42, 67, -127, -57, -78, 106, 13, 99, 177, -110, -129, 1, 76, 45, 18, 106, -9, -110, -60, 104, -89, 83, -138, 9, 143, 183, 17, 119, -107, -23, -14, -52, 6, -62, -97, -14, 286, -158, -63, -60, 193, -111, 116, -190, 96, -64, 360, -79, 45, 90, -175, 235, -209]
6524b09K31k22K17j05K5O3q5J9M39l20L5k72K15j80N1M0l0N0J71j72o1J92k55
6547a63M1N9PJ03J07l19k3K91k9l65K81J29j14P3j90R1J88j17l44L15j36P3j03
6570a45J52J37p3o8p5J90K5N5q3J16k86P2K3j57p6Q8P4q3l9J65JJ3QJ0l0J41j08
6597D7K09l69K82j53k19K21k00M82l40J60J00q4k23J94o3K9j16J45oj05M5l9k1
6620b4L00k89J5O8rj72K77K1l16K80k71Q6J17k41J77J60l72K61l03N89k55k01
6642a02k1L60l95K02N9k9r6J0m3m5J49rk81m3J42J12J89j70J8J92j74j51Q1J13
6666F8j22o9P1K12j02L6l34J22n2P9K89Nj86J4J18k29K6L87l53K4l0n9K34l54
6690b05L57j9k40o5J76m8k12L55q3o4R3r3j76K85k40K00L1R0j57j28M1O9M5o6
$$ y = [-209, 22, -200, 17, -88, -63, 0, -85, -66, 373, 53, 88, -184, 31, -149, -98, -58, -88, -38, 133, -39, -100, 92, -163, -122, -63, -56, 47, 154, -165, -188, 103, 74, -291, -10, 119, 5, 78, -112, -21, 167, 50, -294, 21, -115, -42, -145, 7, 144, 71, 3, -72, 118, 143, 198, 115, 231, -55, 17, 40, -117, -193, -105, -31, -114, -153, 12, 13, 26, 34, 44, 14, 155, 47, 256, -113, 169, 16, -203, 18, -182, 300, -40, 120, 220, 136, -87, 107, 44, 73, -43, 102, 96, -9, 36, -3, -24, 276, -13, 2, 70, 61, -111, 166, 187, -129, 151, -120, -34, 83, -158, 19, 179, -193, 68, -235, 354, 99, -102, -123, 237, -158, 44, 103, 74, -22, -12, -55, -100, 49, 40, -241, -284, -142, -30, 159, -11, 7, 199, 25, -126, -45, 68, -54, -123, -52, 160, 58, 94, -240, -118, -170, -91, 198, 203, 17, 31, 149, -80, -54, 333, -20, 4, -26, -85, 149, -205, 152, 133, -107, -172, 4, -44, -256, 99, 16, -48, 45, -48, -224, 61, -179, 21, 52, 142, -15, -143, -102, -33, 12, -54]
6714e4J41j34j15J77K56m07K6j13J58LM5j86J93J85k94K8K05J5m9Qq7r2P8q2K30
6739A35j73J51n9R1j42j4j16J64j84J05J6K60k04J1q4NR0k32K62o8K4k52P7n9
6763a96J70j08j17K27K20j46j55J77n4j73K26k13M6j93L17j27Q2j62L28J3j46
6784A6K5k6j00M6O0j59O5J12J00Pj65j1M1q1j45K10J92k77J6Q6j85N2K87l05L03
6809A64%o2k38J82j87j75K07K03j42k30M34j15J06j7J14j2k27L0k76K90Q7j1j13
6832A2J56l91R0L2j27J67J27N8j00J10j82n2O3m5J39K1m5j75J86P4k78R4J10j8
6856B6L1p4j12R3r6j09J93K7K49j89j63J38j36L57k10L1N0q4j36j17L20j75M15
6879C29l50j05l1J51k1m3K2O6j5j63K37j00M0j51j07J61J92O7j14j80K20j58O1
$$ y = [-54, 87, -47, -162, 15, 271, -136, -110, -223, -65, -62, -17, -203, -10, 175, -119, -91, 114, 129, 80, 88, 1, -91, -13, -95, 135, -38, 113, 54, 145, 3, -11, -127, 37, -147, -42, -26, 234, 30, 41, -43, -38, 52, -180, 82, 14, 38, -214, -137, -196, -26, -134, -251, -24, 196, 50, -105, 72, 18, -155, 71, -142, -96, -289, 28, -99, -17, -179, 149, 162, 16, 41, 15, -85, -39, 21, -138, -73, 39, 139, 146, -19, -30, 11, -70, -215, -5, 187, -90, -74, 12, -173, -121, 166, -139, 164, 164, 102, -136, 46, -141, -316, -109, 94, -48, -278, 156, 41, 147, 130, 244, 232, 5, 35, -241, 49, 136, 125, 12, 168, -223, -133, -101, -228, -61, 66, 124, 24, 134, -48, -100, -37, -82, 57, 78, 33, -142, 44, 118, -160, -66, 44, 26, 57, -17, -129, -36, -132, -241, -48, -21, 228, 39, -124, 14, -122, 235, 25, 56, 106, 22, -114, -231, 89, -86, 329, -21, -126, -157, -6, -27, -70, -48, 18, 3, -160, 77, -23, 17, -134, -241, -80, 112, 179, 65, -115, 105, -53, 8]
6902HJ39l1k10J08K98l30K2k2J97m5N1k31m4K76j21k93K68M5k02L07k82K01l13
6925b04J71N5k11K16Q8k79N5J17K03j42j53P2r0O0L23ml12K60k48J54k2j32Q8
6948F5L08o78J63J02K8O7k17K23nJ97k42o2P1J80l00J70k93L87k15k18K97J8O2
6971A08j86n6J29L2po9L1m6j0K60j52N9k56K99m28L44j21J8J14K8J3k31j3k3J79
6996A6RQ4R2k58K00j06J24j08J35l45K57l1J16k6j43k44J35m5K61j61R7p3o5J58
7020G9j97L49j41k23J54K48j23J55m18M7J40m7m22L00J07K8l06M88k10rl1J02
7042G0k68M04j76O7j88O7L65n21J26O6n7M8J35p8j21Q7l0n4K9OJ23j77K62k78
7066i3j80L88j83J76K74m60J91k61J25r1JQ1K63j6K3l35O1J06K1k76J49Q4k01
$$ y = [8, 147, 116, -94, 14, 312, -18, 4, -18, 179, 134, 185, -46, -90, 186, 65, -228, 40, 85, -117, 190, -92, 109, -204, -33, 22, -189, 27, 115, -164, -109, 8, 211, 69, -84, -12, -102, -42, 281, 277, -35, 225, -23, 131, 109, -23, 65, 373, -305, -142, -40, -12, 55, -162, 61, 56, 253, 11, -51, 20, 200, -100, 70, -223, 164, -51, -269, 28, 46, 108, -78, -134, -5, 27, 20, -49, -18, -64, -74, 186, 34, 93, -163, 136, -292, 52, -69, -51, 63, 91, 104, -127, -140, -163, 16, 25, 109, 201, -57, 143, 37, 161, 53, 188, -157, 100, 69, 185, 159, 16, -228, -93, -138, 123, -38, 59, -14, -79, 79, -118, 231, 90, -133, 21, 269, 146, 301, -117, -70, 70, 23, -399, -99, 8, 36, -270, 218, 8, -1, -32, 70, -198, 206, 30, 97, -91, -24, 341, -180, -54, 12, -45, 3, 138, 60, -61, 26, -4, -58, -29, -23, 100, -77, 185, -93, -273, 115, -68, 108, 382, -78, 113, -148, -23, -114, -113, -32, 231, 215, 238, -97, -36, 70, 91, -185, -36, 48, -153]
7089a53K80l2l3K3j14m8j26K75JJ00j0k9k24J33j52R9k2Q5J62l28j2J09p1K43
7113A56k51K6J50j58P5R8k70K67m61L77N0L3o6n5%j7N0M0l3nJ5r8K70k0j97KR9
7140G7j82J4j54K12m0K23r7m2j10L01k9k21k0K55k52J50k61L24r0J92l45p9k7
7163b01L76m03L94k38j16J63R7m4n9J20m0L0O9j55m6Q5k63K56q6j11K54n2j42
7186a12K8m1M45m35L02N8r8j61R3k87J69R2k01JK56k50J56O9m44M44k46L38l71
7209a95J29j9N1P1k01J42kr1K24j25o6Q8p2O4l0Q1j27j65M12r7j7Q3p1J78m99
7234b54M12j12J41M7k98J8l01K65M7N5K02l87J23K08j04P0k7j30jR2R5l38R7j
7258h1Q0j84K21R4q8p2P1K24k22j51j43K95o8K00j69k1J58k55J24K08k02Q5r4
$$ y = [-153, 127, 95, 62, 85, -29, -77, -203, 72, 73, 173, 163, 134, -90, 43, -109, -10, -32, 53, 215, -113, -125, -16, -87, 156, -95, -69, 81, -77, -2, 96, -174, 93, -368, 9, 59, 92, 26, -29, -29, -46, 4, 44, 11, 6, 21, -77, 193, 173, -24, -22, 77, -105, -91, -245, -33, -73, 150, 53, 11, -99, 202, 173, -48, -68, 187, -65, 85, -176, 148, 58, 250, -95, -174, -201, 175, -228, 166, -72, -188, -25, 72, 28, -31, 89, 49, 79, 148, -7, -53, 32, -231, 25, -61, -172, 82, 30, -112, -84, -125, 320, -115, 187, 245, 147, -14, 79, -208, -39, 53, -148, -147, 109, -141, 15, 84, -360, 84, -162, 176, -195, -66, -85, -34, 37, -164, -22, -24, -115, 109, -16, -82, 6, -66, -2, -32, 49, -78, -243, 169, 72, 55, 138, 67, 245, -254, 158, 46, 187, 234, -64, -46, -347, -82, -35, 20, 222, -165, -42, 166, 62, 132, 105, -25, -26, 66, 161, -177, -80, -81, -1, -185, 36, 130, 42, -30, 41, 265, 43, -108, -251, 44, -24, 176, 7, -14, 144, -111, 13, 221, 19, 104, 10]
7281A0L2q4m8p1Q8K53k35Q2j23N4p2K13j59J54Nk34K59N0J0l29o9K19J52O1j03
7306A15M2m6j82j08Q7J82j35K61j07j39K23l39J69lL19q4k10j55J66J22r8m4J82
7329B18j49r0O7Nj85J5Q8l6P8k30J67J7j02j5L38k04K73m35J01q3J34j42K17P8
7353A25k86QJ91k48K5L40r5P3j70J54j36j55K80n3r1j92J1K26L1p1J9rk91L24
7377A0j21L77k55p2pJ55j62O4o5k32Q4K00J01j13L48k97Q9j09J29m01K50J07l26
7400b46J96L46l78K90k69l5J76n1k15L43j33m5K1P6O5k86O8r1L63k26l4L89k71
7423E3K4j46k21K90j59j41L06n5R4k27M20j66j07Q5n4m5Q3j3o0K23j52J4j23J97
7447A20k87Q6P8j38P0J9J12r5J22P3k18N1j06J68J60l30J00R1j19l9K95k89o2
$$ y = [10, 42, -42, -90, -161, -73, 180, -55, 27, -96, -42, -114, 99, -60, 94, 99, -135, 124, 174, 184, -145, -214, 5, 157, 218, 115, 157, 111, -71, -179, -92, 90, -45, 216, 109, -30, 193, -146, 23, 20, 339, 255, 45, -110, 56, 178, 80, 36, 218, 69, -21, 46, 51, -134, -119, -31, -67, 11, -219, -52, -35, -137, -152, 186, -18, 255, -180, -79, -162, -28, -170, 47, 125, -161, -153, 38, -210, -185, 155, 60, 133, -37, 117, -19, -174, 106, 53, -38, -230, -219, 7, 38, -33, -14, -23, -314, 10, -111, 266, 11, -61, -68, 87, -75, -11, -76, -308, -224, -24, 77, -36, 312, 15, 104, -5, 124, -277, -27, 80, -246, -50, 296, -82, 208, -61, -96, 80, 29, -186, 157, 24, -21, 0, 76, 141, -145, -77, -168, 195, -31, -65, 324, 53, 77, -69, -290, 0, -159, -300, 6, -49, 45, -182, 238, 72, -35, 50, -4, -49, 34, 21, -39, 184, 32, 46, -77, 120, -167, -81, -3, -141, -71, -52, 60, -35, 87, 160, -58, -7, -113, 55, 215, -115, -15, 76, -43, -82, 213, -76, -138]
7470a38N3J06l26L65R1j90n3K54J44p9l17jK7J79k25K82k41k19L29k66K48j35
7492a12k9L18q6j09j50J27J66k42Q2Q7L16m26P3P0r3j57m5J88p9N7P7k51K95j86
7516a09J47j86L01l70K66j96m2K06n5%M7k3j47J00J67k02l5K30n1J52l42J56m7
7539c3L7l2k3R8j20o0O4J4J19J7o7J19k04o8P2j2K58m2o4j41p3J26j00K81r8J32
7565B00j28k39K79r4J47q8J14p9l2j99J63k8k82K88m4k74N4L44j85k8J92j34j19
7588a72L59k20K11k50L66l77K09r4k53K62l4j06K8J80q1N0P4j07l1k30K29M8J42
7611B03k65Q0OJ00r6m2J55l8j08Q4l2L18l61K09m6k11K29k37j70K35k26K69j9
7634C7mm1j68P9J65o6k3nJ4j01P3N2n9j0J41k34R5Q2J6M8J17m23L37j19J01Q7
$$ y = [-138, -85, 21, -305, 60, 151, -39, -92, 162, 306, 227, -90, -91, -64, 115, -110, 172, -69, -288, 41, -225, 23, -112, -141, 177, 91, -18, -168, -41, 125, -117, -35, 52, 368, -58, 15, 85, -8, -165, -210, -22, -101, -44, 33, -218, 77, -109, 38, -148, 153, -217, 49, -147, -189, 17, -38, -38, 9, -14, -161, -61, 106, -96, -131, 99, 48, 200, -142, 14, -33, 4, -28, -51, 47, -73, -133, -69, -55, 64, 81, 14, 133, -71, -139, -67, -79, 179, 137, 73, -68, -141, -15, -115, 166, 68, 200, 72, -167, 112, 18, 165, 77, 191, 112, 80, -119, 44, 16, -266, 22, -22, -296, -242, 102, -83, -111, 81, -53, -172, 187, -33, 178, -72, 294, -83, 126, 32, -221, 41, 7, -99, -71, 109, 28, 78, 152, 45, 14, -216, 13, 61, 203, -62, 18, 24, 124, 28, -14, 141, 103, -5, 79, 47, 365, 4, 213, 167, -44, 185, -52, -222, 13, -213, 56, 37, 33, -8, -176, -97, 68, 2, -21, -26, -12, -113, -40, 12, -47, -57, 84, -150, -55, 27, 43, 91, 208, -215, 122, 3, 104, 191]
7660A91j29l5m6j4J1q8P1Q9m5k12J60l6k09K22k3R4J58j11k31L11p9j93q8L19
7684H7k09J90J7J02l09J34K17j72k40L81j8j15J49k39K1j09J7J19j44L5K2P1k61
7707b54mJ18n9N9PN7K20o4Q2k32m5Q9N9k17O8J74j8o2P7j00l1K60j94j01K10k7
7733G2O8J1k48R4j09J39K05k90r4J96j68M2K7J62p1j02M4N8M8k92P6J75j48Q5
7757b0j27k8r9J72K35k00J06j25J13J50j59m7N5m6O6J3K08k67Jk20M31k27o8R0
7781GJ8J79j21k38K41k29j4J91j11Q2Q0M5j11J63l8l19J87J17j47J72J8n9j65
7804e2J6N9j60K12j17O4K06n14RL16J33k22K19l12K05o8m6o0P5J12j65k11K85
7827a6J60J13q5k70K31j47J19M9l30L52k05j95J66q9J28j77J05k43K46M98l84
$$ y = [191, 62, 27, -19, -33, -22, -110, -39, 50, 5, -207, -47, -83, -292, -70, -93, 1, 159, 48, -183, 128, 49, -144, -232, 87, -122, 68, 85, 187, -122, 12, 229, 57, -183, 198, 180, 65, 214, -25, -4, -113, -96, 23, -121, -86, -64, 7, -254, -258, -140, -199, -140, -133, -76, 144, 80, 162, -70, -115, -26, 33, -184, -116, 58, 40, -22, 55, -45, -76, 184, -10, -111, 99, 72, 140, 151, -97, -3, -112, 27, 232, -58, -152, 44, -124, -82, -55, 107, 36, -66, -22, 36, 84, -208, -132, 43, -105, -20, -147, -175, -274, -102, 133, -67, 39, -86, 27, 177, 18, -29, 26, -20, 46, 59, 267, 0, 1, -219, 212, -15, -83, 7, 25, 204, 83, -155, 86, -143, -157, 34, -77, 5, 85, 130, 19, 182, 144, -175, 12, 129, -18, 154, 172, 113, -52, -36, 23, -137, 75, -42, 22, 228, -286, -277, 39, 172, -50, 169, -143, 62, -6, -52, -112, -37, 75, -90, -301, -16, 144, 257, 172, -98, 133, -14, 105, 154, -176, 176, -29, -224, -58, -147, -19, -196, -91, -334, -88, 410, 26]
7848B6j0j60J84r3K09j72P3j09R8R8j52P0r3Q8j3j25J97m5r1R7q1Ro0K14l27K07
7874C9j05J71k6l1l79K39J42m8J05J48k09M5q7l5M0j25M08n01L76l10K44j79J62
7897H4j65J0J17p2o5J64P8l5lJj2k32N9QJ20j20K18l2k66J14O3n9o2o4K17j83
7923a17L42l24N5K10l30K26n5J20k68K08j75J13j57K64k31J02J75l7m8l17K48
7944Dn3K7K51l89J90r9K25j24J1j18j96K98m9L39l97q2j08K85J87j21m1j49L48
7967B39l8o6l04J01J95j70n9J82oj78J44M1j6n3J36m7n5M3k61K56j13J96k98k96
7991d27P07l81K24J00k21L0j13Q4p3r2M0Pk3J8J10%k1n6K17pq4j27nJ77J1J48
8017B43o6j49j90K72k18K22j64J7L5k7N4k81J95J16n6J45l85P3R1j41P5K08j09
$$ y = [26, 16, -144, 40, -53, 156, -16, 57, -52, 46, 144, -8, 62, -31, 57, 44, -81, 116, 71, -20, 77, -4, 5, -55, 159, -168, 39, -66, 105, 79, 48, -331, -92, 50, 2, 107, 255, 46, 91, 4, -31, 9, -116, 292, -209, 167, -143, 101, -78, 84, -81, -71, 46, -26, -91, 73, 151, 116, 113, 114, 102, -130, -71, -63, 57, -63, 155, 123, -143, -29, 34, -25, -87, -151, 66, -117, 225, -99, -44, 166, -164, 62, 7, 127, -141, 67, -108, 5, -152, 112, -119, -17, 158, 121, 73, -244, 4, -49, -22, 229, -160, 30, -69, 156, 32, 43, -75, -271, 27, -22, 317, -80, -162, -270, 15, 202, 81, 40, -109, 239, 201, 135, -169, -68, 127, -43, -102, 80, 74, -104, 40, 81, 65, 12, 148, 101, 46, 89, -172, 84, -29, 167, -131, -427, 280, -101, 123, 223, 2, 32, -81, 3, -70, -162, -122, -115, -138, -120, -10, -10, -31, -87, 130, 123, 39, -88, -93, 84, 95, 243, 177, 28, -162, 110, -108, 114, -50, -33, 2, -25, 29, -252, -57, 59, 3, 148, -237, -164, -73, -214, -139, 69, -40]
8040d0J64k3k03J88Jqj92O2K45k37K56j00k21m2K20L0j80J8K33l07J17p4P2Q8
8064F7N5j47o6K75j77j72K43P5j57J9j87K36J19j37j18m0J68Q8K65m94P0O1j49
8087a03K64n1m4k44J91j76K61k00K00J01n9j44J16k38p7J1K22r8J94r0k08J87
8109A5q2J40k94K89O0j69P6l4j11J97KM5J7j02q7k5J13j29r1K99j08k34J17K77
8133A81j84J36L9l28K78l65J50N7j36P0L44m33L26k05L23O3n59M03j96n7J73j44
8155f4K56j9p0k21J13J02K3OP2k22k08K03N7J51m14L45J64k44K4o0l0q9J51j79
8179a53J87j61Q6Q2J36m3k08K84m34J56K00j68
$$ y = [-40, 124, 101, -102, 86, 87, 79, -113, -51, 194, -43, 213, 113, -108, -150, 70, 100, -80, -62, 171, -136, -19, -93, -21, 67, 122, -25, -91, 184, 7, -165, 78, 153, -4, 15, -172, 64, 183, 46, -72, -112, 56, 144, 409, -85, -15, 46, -103, 161, 110, 66, -178, 13, -163, 98, -102, 98, 199, 140, -4, 112, -126, -203, -192, 30, -68, 126, 36, -172, 15, -67, 73, -221, 68, 128, -41, 35, 1, -110, 87, 89, 134, 151, 49, -38, -63, 50, -79, -170, 129, 21, -213, -96, 181, -3, 133, 172, -156, 122, -243, -93, -36, -172, -102, 242, -191, 135, -70, 253, 316, -243, 160, -36, -93, 80, -64, 192, 173, 103, -118, -5, 97, 120, 126, 198, -24, -232, -29, 28, 179, -235, 110, 274, 30, 54, -6, -36, -125, 26, -153, 34, -127, -41, 41, 177, 134, -74, 210, -224, -68, 132, -36]
8191c6
$$ Imaginary data points
##PAGE= N=2
##DATA TABLE= (X++(I..I)), XYDATA
0@%%%%%%%%%%%%%%%%%qJ6j6J6j6J6k4L2l2M0m8N4o2P2q2R0j04J20j35J52j71J88
39I8k10K35k61K91l22L55l93M35m80N29n83O43p09P81q61R52j052J166j297J446
59G63j619J825k077K387k782L308m044N154p050J1148l6403M4165N3476q5810
73a7559n9305M1131J04321L3692o2277p9078J1495P2759L8233m0661n1848M173
85d924O0646L0995m1783o3810j2343L8310L2743j8441m0697q943L2475J9506k4766
98a032m4238j8022K5987L2674q00k2821j0351J6115J8968n722k5316r626K2451
111b1733K7912R330q448r944Q850J4747j987j3262p115J0894K1917R779r479j2113
125A9348k730J655k091r224q289N287J1598K628q699j4265q946k3om536l481M053
$$ y = [0, 0, 0, 0, 0, 0, 0, 0, 0, 0, 0, 0, 0, 0, 0, 0, 0, 0, -8, 8, -8, 8, -8, 8, -16, 16, -16, 24, -24, 30, -32, 40, -42, 48, -56, 64, -71, 81, -90, 98, -112, 123, -138, 153, -169, 186, -207, 228, -252, 277, -306, 337, -372, 409, -452, 500, -552, 614, -683, 763, -856, 969, -1108, 1279, -1503, 1805, -2239, 2915, -4135, 7013, -29390, 14775, 68251, -17559, -76864, -35733, 68588, 102280, 40003, -39075, -27580, 45179, 83412, 42751, -9097, -4924, 55722, 86717, 44934, -18876, -31219, 7091, 39834, 21393, -19304, -28247, 4228, 23734, -1032, -45270, -63292, -37305, -4631, -5431, -28252, -38603, -22488, -3520, -9242, -34558, -44184, -21733, 6179, 15509, 7061, -2883, 5967, 20714, 18727, 5465, -1650, 9244, 31161, 40940, 31461, 19348, 16618, 18273, 16182, 6958, -1331, 3956, 15554, 18182, 9483, -4782, -13728, -13751, -13757, -18293, -21774, -17721]
141a7721P113M668l668r973m393J649L926L790L500N692R411M770k079n724l256
156b295J876O962O357L059M546K754j068m198o845n304L34K828K392Q20j229k879
172H110l285o836p897l726j042K366L980J186j414j806l396m558k494M98L069
187a7245P165N873K457J586j413j340J58J73K922N878N522M377K129j066l246
202A3930k612k178j132J836K494K780Q83k824m760n912n516l189k7J010J474J756
218a987j460l471m124m285k300N17J788L649L622K480O50n31k215j244J066K757
234e088M242N832L476K327J41k319k263j037L59K443L916K156O17q65m247m153
250E537l310k565l59J468J044P22j094l055l782l541l043m78J588K516K674J976
$$ y = [-17721, -10608, -5940, -9608, -19581, -23974, -22325, -18399, -14609, -11109, -5417, 3994, 8764, 6685, 961, -2295, -419, 6543, 12900, 15959, 20505, 23259, 22191, 17993, 11148, 5844, 6178, 9006, 11398, 12218, 10989, 8110, 4825, -2011, -9908, -13634, -14676, -12310, -8330, -7144, -8558, -10364, -13760, -18318, -20812, -20314, -17245, -10080, -4207, -1750, -164, -1577, -2917, -2759, -2586, 336, 6214, 11736, 16113, 18242, 17176, 13930, 11318, 9140, 8008, 9844, 12338, 15118, 16001, 13177, 8417, 2505, -3011, -6200, -6227, -5217, -3743, -1987, -3447, -6918, -11042, -15327, -17627, -17110, -15322, -11673, -8051, -5571, -4921, -5452, -7667, -8911, -7845, -5088, -846, 4986, 8462, 10789, 10930, 8611, 6348, 5311, 5670, 8113, 12029, 14185, 14802, 13937, 9690, 5537, 2227, -338, -697, 771, 1815, 2537, 1443, -1612, -5394, -8935, -11978, -12456, -10868, -8352, -5678, -3702]
266c702j013j368j686k299R01K255L634M179L480J357m62j487j593m00J312J662
282D770L163K644O51o09k320l512k624j567k11J241J661N35p24k554l919l304
298f679k110p03J721J904J783J270m59k133j508j392MK137K998L322K768J129
314D052m82q47j450o04J232K187K500K556J173m45j799k864k623j137L38R17J723
331D427K89j157j934l616l014j896o08M39J786J539J58j21j991k350j095j7J180
348g981K949K752K476J300m84j054q11j69J023K343K844K421J633j36j888j690
364E528j743o75N70R76J358P18p82j910k475k926k371l82J94J184J394j37r25
381b404j931k267j616n50P20K279K897J199O36j54j511o21p9N52K197K852K038
$$ y = [-3702, -4715, -6083, -7769, -10068, -9167, -6912, -3278, 901, 4381, 5738, 5276, 3789, 2196, 1796, 3108, 4770, 7933, 10577, 11228, 10619, 8299, 4787, 2163, 596, 385, 1626, 3287, 3822, 3098, 544, -3375, -6679, -8789, -9492, -7771, -5867, -4084, -2814, -3273, -5406, -6914, -8306, -8302, -6165, -3167, 155, 2923, 4052, 3570, 2723, 1273, 669, 1901, 4088, 6588, 9144, 10317, 9872, 8073, 5209, 2586, 1449, 1787, 2704, 4427, 4716, 3559, 1625, -1991, -5005, -6901, -7509, -7070, -5284, -3745, -3587, -3708, -5699, -8049, -9144, -9161, -7981, -5032, -2280, 196, 1496, 1012, -42, -853, -1022, 1, 2344, 5188, 7609, 9242, 9106, 7218, 5528, 3785, 3110, 3680, 4656, 6014, 6732, 5950, 4040, 1565, -1361, -3732, -4114, -3920, -2736, -1342, -1479, -2404, -4335, -6602, -8218, -8768, -8048, -5769, -2872, -1673, -1037, -1191, -2702, -3323, -3402, -2850, -653, 2199, 4237]
398D237J543M3j137j522q76l67N41J813J096R62j1j628j990k529j550l88O53R30
416a80Q26M8j160j577j905j809m08M12J748J620J622q9k85j040j388l47J070J534
434a308K012K475J060k6j002j576n83j80P40J661J146J361p43j242k114j457j374
451a150p67J020Q36O61M30j150j928j580j856o44R83J161J744R48L19o80r62r74
469c589l62R51J593K219J933J132j22p76j141p65L76Q83J417J438Q39j95j098
486D733j634j914j069k35M74J025M55m67p22j905j917j272o53j46J420J361N34
503a932Pr71j006q27m80P60J376K022J260J303K07n81o21j032L57J125J772J518
521D257J167J05q41j399j256q04k4N21J020P69j83q64j320k063j554m19JR80J023
$$ y = [4237, 5780, 5823, 4686, 3164, 2288, 1921, 2462, 4275, 5371, 6333, 6322, 4694, 2704, 175, -1375, -1763, -1110, -180, 646, 694, -466, -2043, -3948, -5757, -6165, -5753, -4005, -2385, -763, -852, -1137, -2177, -3565, -3912, -2842, -1308, 704, 3179, 4239, 4213, 3211, 1635, 1052, 872, 1612, 3273, 4419, 5780, 5037, 3795, 1681, 224, -1150, -1917, -897, -61, 600, 1030, -120, -2048, -3628, -5484, -6128, -5145, -3984, -2240, -1292, -973, -1653, -2615, -3589, -3951, -3000, -1407, 812, 2745, 3877, 3755, 2979, 1838, 1073, 1449, 2332, 3749, 5187, 6026, 5831, 4733, 3099, 1185, 116, -119, 355, 1380, 1835, 1368, 646, -1259, -3176, -4448, -5101, -5247, -3827, -2466, -1932, -1925, -2896, -3902, -4729, -5209, -4449, -3073, -1051, 209, 1512, 1719, 1138, 517, -515, -158, 967, 2739, 4257, 5424, 5529, 4688, 3289, 2033, 1229, 1205, 1726, 2746, 3515, 3332, 2468, 1148, -915, -2469, -2888, -2887, -1907, -884]
540h84J61k08p11j643j120k38K83J069J764Q71P74K14p88n75m18n4J094J602J295
559B488R24J82o33r71j033n78K14R82Q40Q00L23j106j328j272j397m80M12N71
577a062Q58M07l35p96j325j230l77K28J010J307J137J73L59o89q11o45P06N69
595e16J549J212J097J56n92j005q56n56K24Q66Q67O24L34r49j528j033j341l91
613a838M24N72O26M25m92j069j159r28o69O30L63J139J189L72o4r30m92m15L42
632a974P62J736J055J129K15n26n68q15p3M17O57J052O72J16n39q85j398q11o03
651c81L03O98M12r6l86j026j281r25r25K31O90J092J90O35q24m75o73n18K78R38
671b043J147J197N90J70p9n88p02K50O04M58J402Q49J40n25o05r30r84J31L86
$$ y = [-884, -723, -931, -1642, -3285, -4405, -4643, -4360, -3291, -1527, -656, 118, 332, -456, -1031, -1449, -1503, -409, 1193, 2488, 3412, 3594, 2961, 1990, 957, 379, 593, 1575, 2415, 3215, 3538, 2432, 1104, -168, -1565, -2045, -1633, -1062, -204, 203, -132, -928, -2253, -3483, -3860, -3632, -2622, -1315, -178, -5, 354, -335, -1146, -1791, -1085, -516, 1033, 2245, 3342, 3498, 2906, 1901, 1045, 489, 713, 1579, 2446, 3070, 3404, 2455, 927, -106, -1447, -1838, -1414, -842, -216, 209, -283, -1352, -2511, -3439, -4108, -3478, -3115, -1976, -787, -415, -479, -1409, -1901, -2316, -1974, -1212, 524, 1579, 2708, 2923, 2397, 1829, 1014, 941, 1358, 2015, 3067, 3739, 3855, 3316, 2431, 1033, 222, -381, -78, 620, 1032, 936, 550, -476, -1757, -2682, -3607, -3376, -2686, -1594, -1404, -769, -1593, -2068, -2741, -3259, -2981, -2043, -896, 301, 891, 1061, 982, 394, -308, -58, 546, 1004, 2406, 3255, 3395, 2870, 2265, 1335, 351, 482, 868]
690H68L58P07K19m83q55j366j065m06K16J89Q59M66Ko43o17n94o37j32P77J178
710i59P88R54j62k73o22m99O8M29R09R18R96K56n75o52n81p84k67J025J61M52
730A582M58o93j026q29o82l22k72N39N29N26l44m96l53r68m48L97O42Q20J072
749A32l26r5M58m36l11J70M98Q41P95Q41J60n01n85l53p66K43O45P1O23J67m91
770A780p47j045q83m17j79N50K65K40j01q66j91r56l00l4O25N94O45L78L7j72
790g77l70l09J56M51Q61J376M08M5K45m47m31n53K73K91P48N13L24l37p02r02
810H63p60k66k5O18M5Q8J03p70r68p79k57j1K81L85M61K60j14m40k98m12n2O01
832a447O84N88O18O95k20m50n21J0L22N41O01O44M16l83n04q92k60l90L44M13
$$ y = [868, 1226, 1933, 2152, 1669, 814, -552, -1617, -2023, -1807, -1618, -759, -293, -291, -934, -1551, -2145, -2782, -2914, -2137, -959, -171, 783, 621, 348, -274, -773, -705, -276, 633, 1551, 2547, 2803, 2228, 1576, 995, 211, -56, 969, 1130, 1582, 2040, 1347, 321, -508, -1190, -1512, -1784, -1245, -716, -190, -534, -1030, -1383, -2351, -2799, -2402, -1760, -940, 132, -194, -289, 169, -267, -578, -408, 90, 931, 1726, 2567, 2727, 2226, 1641, 1288, 522, 765, 1410, 1481, 2104, 2271, 1780, 1033, -12, -895, -1312, -1491, -941, -676, -436, -537, -1403, -1594, -2550, -2850, -2884, -2259, -1665, -1020, -642, -605, -777, -1147, -1456, -1300, -849, 12, 1388, 1796, 1841, 2086, 1639, 1208, 655, 928, 1219, 1967, 2480, 2804, 2467, 1765, 863, 103, -163, -188, 430, 475, 563, 666, -104, -1072, -1851, -2108, -2119, -1838, -1453, -992, -732, -846, -1286, -1584, -1996, -2048, -1447, -763, -175, 443, 1138, 918, 468, -53, -43, 279, 820, 1421, 2065, 2481, 2098, 1594, 702, 442, 52, 396, 809]
852H09K19k4N4n92q75o60k23n3o7O12L83L09k83n30k92o91K63K04P39M01Q31L24
874H58k41k71m19n5K9O45M56P09P5o2n87l13m83j91J19K61M99J08k41n23o38o60
896i25n17J5L67K72K22J74nr58k06k9j75K94M57R61J84M16l27l41k50k0L28M09
918C46Q04O01R5j58k00k14n64l19K70N01J84J41J16r30m39o59m15j85K74L48L8
939c65J61J21j037l39n04m52P20N49M10K58K86p7l56l20j20K75M72P82N70M13
959A447k92k99l12j82K16J69N24K88K72k82l34m49q59O8l27L40K85K32j40j4n97
980b46o49l85M2J33L81J16L17N2m67k28j81mn3P97L47O10R3k63j26k30k65N85
1002C76j96P65J58m4K11l91l00m90k27P8L1L83M2K27l74m43l40n05j06J68N15
$$ y = [809, 1028, 1004, 1058, 466, -409, -1069, -1292, -1345, -1412, -800, -417, -108, -391, -921, -1213, -1904, -1641, -1437, -698, -297, 534, 858, 617, 346, -73, -128, -99, 546, 1002, 1711, 1786, 1724, 1137, 824, 341, 150, 269, 530, 1029, 1137, 896, 373, -265, -925, -1442, -1427, -1060, -788, -566, -392, -397, -1355, -1561, -1590, -1765, -1471, -1014, -53, 131, 547, 220, -121, -371, -391, -63, 346, 1150, 1751, 1846, 1688, 1488, 1274, 710, 391, 661, 1162, 1346, 1487, 1603, 673, 234, -425, -840, -1025, -751, -403, -365, -204, -83, -1120, -1459, -1963, -2415, -1695, -1146, -736, -478, -192, -269, -625, -945, -1065, -790, -318, 464, 1034, 1447, 1155, 856, 544, 362, 578, 747, 1271, 1559, 1831, 1549, 1215, 766, -93, -25, -352, -12, 273, 505, 365, 351, -246, -895, -1280, -1238, -1105, -724, -608, -291, -239, -706, -934, -1115, -1119, -1172, -375, -28, 582, 675, 412, 286, 56, -209, 376, 180, 945, 1103, 1059, 1270, 879, 579, 89, -138, -60, -29, 354, 396, 623, 249, -194, -534, -1039, -1145, -977, -462]
1023d62K33K39l00j12j94j84j56nP32L70L23N7L0l20pk86K42K15K53J61N41j72
1045A198k38p30k27J4j73L95L51p5j55j66l04p65o9j72J32J6M92J63J12m52l95
1066a048J10k11N5M87K71N29M3m4J0l07n3M0M41K95M87o6M86m95l28j43j63j09
1088B87J66L39J14j7m62j23o49j54q5K2R9K18K2J50n24j17l20n48M21L43K24L81
1110b13j09K97l52j1j00K6P3O85K66K11j86k7j34k43j8M1K20J65M36M4l48k30
1132D93l16m19jJ59J44j2J04j46n0m39n6l06J1J68L16N54j96q8j2l81o6k2L51
1155b10K06L62n4K06j12rm05K87q6J90J71K44p9k77j64n07P1j81j05M09K72j1
1177B18l10p4l50l18j48L29J79J77K21J15K3l90M2m53K47L95J45L22L01r1j01
$$ y = [-462, -229, 10, -290, -402, -596, -780, -936, -941, -209, 161, 484, 541, 571, 251, 244, -42, 200, 415, 668, 829, 1370, 1198, 960, 230, 3, 17, -156, 239, 590, 515, 360, 194, -110, -875, -944, -1116, -984, -968, -476, -313, -201, -653, -1048, -938, -1149, -1094, -607, -336, 193, 236, 192, 202, -105, -158, -118, 323, 618, 1105, 1039, 1525, 1030, 702, 559, 396, 287, 453, 792, 906, 889, 427, 304, -345, -499, -584, -562, -463, -245, -223, -73, -597, -714, -1034, -1582, -1161, -818, -594, -213, -322, -25, -377, -388, -488, -462, -389, 296, 562, 773, 587, 560, 426, 183, 165, 206, 426, 591, 1027, 1071, 723, 493, 177, -242, -243, -84, 60, 48, 152, 6, -44, -483, -539, -845, -834, -666, -350, 204, 8, -80, -92, -473, -539, -561, -210, -4, 358, 304, 510, 398, 389, -16, 271, 185, 375, 546, 790, 711, 434, 270, -237, -166, -347, -452, -43, 229, 218, -92, -166, -516, -834, -982, -653, -474, -297, -76, 39, 62, -328, -286, -739, -492, -97, 48, 370, 671, 580, 479]
1198D79j64j95m0J91K78K41O9j22n8j72k56m03K04lJ99Q5J8k05k69l27k68r9k75
1221a092M05K94N3J12J09n86j79L06k41M17J13M42J01L6k92p8J70o7J08M85J40
1242G56M0L9j40p2l47J0j01R0q2L62m7j01k57k85l58N3K18k3J35J74n7m14J36
1265b71l99l2jK96l0K65L64L0l77j42q8L5K84J38M32j96J93j99Q0m73j44K25J5
1288EL04J99J1q5k80n7l86j75K85Q0j09L10K1k80n3m18Q7J65P4K04J05K42j23
1311A26j53o7k44Q7K08K89J86k27N16l66n7K9k35J5j36L24LL5M5o00PJ05j72k
1335b84J76j43J40j14L6k7k34j99j59L85O13j67R8j14jm60J82J20l4L68L67k3
1357E26l0j45M4n26L78J57k77M95j1J62k98J14l51l22p6L94MP2j24j9j92l23j49
$$ y = [479, 315, 120, 80, 271, 549, 790, 859, 737, 679, 507, 251, -152, 52, 49, 248, 333, 351, 146, -123, -450, -718, -817, -1092, -687, -393, -340, -228, -119, -705, -884, -578, -819, -402, -289, 153, 254, 290, -2, -80, 90, 23, 131, 616, 756, 796, 835, 695, 623, 276, 286, 185, 275, 193, 555, 508, 407, 150, -135, -493, -440, -222, -245, -110, 64, 7, -407, -271, -670, -702, -703, -407, -437, -172, 192, 222, -155, -297, -385, -350, -66, 72, 504, 308, 501, 302, 382, -91, -235, -10, 5, 309, 508, 519, 434, 154, 97, -289, -464, -179, -99, -208, 102, 123, -157, -210, -628, -541, -376, -302, -98, 7, 249, 126, -27, -94, -338, -251, -43, 246, 432, 205, 721, 355, 298, 327, 92, 107, -29, 295, 298, 333, 378, -222, -215, -110, -282, -284, -108, -251, -111, -225, -189, -216, -450, -649, -808, -423, 190, 23, 121, 7, 6, -454, -272, -152, -186, 182, 549, 526, 496, 351, 395, -131, 247, 404, 127, 622, 611, 773, 475, 589, 238, -84, -160, 234, 238, 310, 186, 167, -25, -348, -497]
1380d97P1NK36N3J3q8Q2l9mk97jL55MK9L63j08o9l75K15J22k01K56K61J8J09J8
1406E31k04p7k89Q8J4N8N9M4l6j80P8l33n2k9K61J2O7k67L46m15O3j97r5L21J11
1431a21J36J11M6n7k42K92k55q3K23O7J44J2O1l37j0j41J6p5K51k1K64k2K1n40
1455b60mL47k42k14M80o7N6Lj86l17M5N1kK30L02M9k90N3J2O0j13Q4O0q1M30l72
1481A14K60Qj35l23J58L6k9J48O7o9M1l31k68J87j67k8K76J40k51J10j49n0j46
1504d01J79j80N27j78K48j63M1l11K30M9l4j11L86L00k09k54J08O7m16n7L89K87
1526D97O6j77j31P5l40j30J38j31L4K10J23m3k03k2l5j47n9p9L09j87L52j28J82
1549A74k08j71K13l75N48K1Q6j96J26J1j82j00K33k99J58o8K88k32M9o6k63R4
$$ y = [-497, -426, -421, -185, -132, -119, -207, -125, -164, -168, -465, -466, -111, -107, -78, 285, 177, 108, -267, -52, 70, -131, 125, 386, 404, 513, 531, 327, 250, -39, 49, 63, 121, 180, 224, 188, 8, 86, -247, -299, -328, -67, -55, 12, -255, 91, -324, -261, -458, -553, -232, -121, 15, 126, 172, 115, -127, 165, -90, -173, 50, 117, 261, 273, 334, -3, -13, -154, -138, -213, 38, 17, 281, 259, 280, -260, -264, 83, -159, -373, 107, 40, 96, 99, -87, -404, -359, -308, -310, -80, 222, 271, -19, 34, 46, 106, -7, 77, 137, 56, 486, 114, 374, 382, 247, -76, 82, 118, 89, 237, 304, 235, 276, -55, -323, -136, -303, -331, -55, 85, -166, -56, -205, -255, -401, -222, -402, 125, -53, 195, 32, 73, -238, -8, 41, 7, -104, 282, 582, 373, 119, 227, 294, -122, -179, 210, 497, 563, 386, 255, 330, -10, -140, -2, -133, -99, 111, 234, 191, -12, -34, -69, -216, -275, -354, -45, -232, 120, -8, 174, -34, -205, 8, -367, 181, 202, 288, 92, 218, 229, 47, -53, 180, -119, 39, -29, 259, 27, 76, 10, -253, -159]
1571a59J05L87l73Q3J02L5j18n23M39J10k89K03p4J84q5R2j06j96k5J45O9J74
1593A80j87P4J31Rlk76J5j02L78L7j05NN2j71j72k3K65l87O43j68k14pN6L8l25
1618b57K36k08j4K46k0P3j67J31k32K00k15M07j53K39j1j57K8j05j43rL23J1l
1641B00Q0j12q1Q3n7lk26N4K86pj09k72K39l88k3k0N1K80J12k61O2k74J65K17
1665dj68R0p4L7P8K9M1j09j79K37l8J16kK13ql22p7J66N3k11N7J85n1P4j25M4
1691E2k66J91k01J12P8P9pK22j21k00j87J93j78K40n7Q0L35m20L14j74k22j85
1713c22J69Q1K34m6j65K19j28k08l6J08k0N1J9K26j25k31L29l24J60j78R3R3K01
1736B00r1J7k11J1j26J03j42Q8J98L43m21l0r9M4J02LL7J51m35M11O4l69J4J46
$$ y = [-159, -54, 333, -40, 43, 145, 180, 62, -461, -22, 88, -201, 2, -72, 112, 27, 119, 13, -183, -208, -63, 6, 180, -7, 67, 198, 207, 204, -72, -57, -159, 219, 256, 151, 156, 208, 37, -135, -158, 107, -280, 363, 195, -19, -26, 30, 68, -257, -21, -229, -243, 3, -17, 56, -111, 20, -212, -12, -227, 180, 27, 266, 255, 98, 126, 21, -122, -131, 192, 203, 200, 280, 168, 87, 170, 113, 110, -116, -62, 224, 217, 108, -164, 75, -313, -336, -356, -305, -25, 87, -174, -112, -386, -221, -4, -172, -82, -156, -119, -41, -12, 29, -80, -259, -22, -60, 56, 54, 267, 259, -63, -140, 26, 79, -132, -75, 110, 59, 133, 8, 52, -214, -23, -224, -112, -34, 45, 38, 260, 139, -61, -248, -55, -233, 7, -50, 30, 365, -55, 259, 85, -137, -322, -153, -72, 162, 116, -49, 170, 42, -166, -202, -94, -114, -63, -44, 182, 57, -174, 155, -169, -9, -187, -94, -1, 200, 109, 126, -85, -74, -200, -97, -239, -151, 47, 390, -31, -61, -160, -116, -14, -11, 26, 177, -258, 153, 217, -152, -138, 8]
1760HJ06j90o5L48M4l5L9p1k76L52k63J45P9k49K55k86k05J8O7j44L10k12M80
1783B55o05K91P4K6p5oj39L00j80J73k1j47l9K4P3K1j14j26K36K48j34o4o6J09
1807A14k36o5J48K52j45j52N0j68J00O5k28J50m9L06j18O1j28j03j07K97m28L96
1829A2j65J1M77l39p4K48k40K5k39L65J09j17K05k15j51K38j57j3J68m7K51J5
1851C67l31N4l3l23N9L48j06l3L66m08O9P2j56j3J15ok14L69j54m5K05k03k53
1874b54J31K34k70N3J64L10m37K02l04mQ4J07p8K34k94L76l27Q4N9k37J98j64
1896a33O7k8k2N7j58J18l8L02l06J13J33j24R1j18KK32j76o5O3JJ34Qp0k83L25
1921A25m3j1o9j3L47m52J18K06j19j54R0l29L50K04k69R4k59J12o0K01K2k70J49
$$ y = [8, 114, -76, -141, 207, 251, 216, 255, 184, -92, 260, -3, 142, 221, -28, 227, -59, -264, -246, -179, -323, -13, -225, 255, -350, -59, 15, 41, -34, -40, -179, 121, -59, 114, 93, -54, -93, -69, 4, 25, -89, -215, 21, 269, 135, 71, 5, 114, -122, -187, -39, 213, 68, -84, -34, -202, -102, -37, -265, -115, -164, 142, 24, 85, -43, -146, -253, 44, -384, 12, -153, -142, 335, -4, -78, 170, -70, -45, -284, 81, 190, 73, 278, 63, -88, 150, -7, -20, 148, 101, 352, 367, 36, 90, 57, -266, -207, 141, 35, 2, 368, -40, 29, 101, -55, -68, 47, 41, -173, 196, 42, -3, 202, -1, -254, -123, 111, -159, -106, 58, 368, -69, 133, -171, -175, -91, 16, -62, 172, -122, 254, -73, 11, 70, -167, 31, -133, -66, -94, -116, -59, -217, -99, -137, 165, -141, -28, 105, -19, 72, -46, -44, 188, 12, -53, 10, 11, 145, 153, 83, -200, 125, 82, 71, 2, -11, 336, -116, 2, 208, 89, -65, 25, -304, 46, 250, -19, 75, -184, -72, -132, 69, 91, -179, -30]
1944c0pJ3j10%R9j93L01k4j27O8O4k5lQ7k04j20L06j33K09j16J32l20L50j78K34
1969B73l07l3M7J98j34l6K11k05j00L18l20k4M5m2K4J55l18mJ09r0L3J03K34r0
1993D7j63J5l9j8K03p4P4K4j74N2K35k21J66k30J34J85k47J62l55J80J55l9j55
2016h3Q6J03p2J5o6L54m27M6o7K08J7mj32n2J2KL38k08k0j35K20p3j15J01q4J91
2042A55k45Q6J75k59M8N4j45P6J85l3k66J24P2K3j17K61k97J49k36K17j42j10
2064b25J66K45k87J63o0l0p9kK32j25L4j00J24M0j20n1j0K18p2j53J19K5j36o8
2088a52J32O2J01k13k3J58M3k73L25j91J86k95j56K36j42q3K15K00k37j16K15
2109hq2J13L3k78J7K12Nk64J24J26M2o8O3j12L32l91K52k07MJ97k92K58j50K16
$$ y = [-30, -37, -24, -134, -134, -35, -228, 73, 49, -78, -10, 54, 29, 26, 113, -91, -211, 95, -38, 171, 55, 187, -133, 217, 39, 273, -34, -67, -20, 178, 44, 8, 219, 14, -86, 232, -88, -112, -67, -109, -85, 70, -248, -252, -143, -233, -200, -97, 137, 47, -116, -101, -140, -158, 45, -29, 45, 69, -105, -53, 182, -39, 127, -103, 31, 216, -31, 131, -224, -44, 111, 72, -83, 3, 106, 34, 49, -17, 337, -90, -44, -111, 97, 114, 110, -22, -74, -62, -60, 278, 70, 50, -85, 135, 62, -53, 48, -36, 155, -90, -4, 171, -88, -40, 14, -131, -55, 130, 97, -169, -45, 27, 50, -67, 194, -103, 46, -190, 27, -115, -225, -59, 186, -101, 62, 2, -28, -107, -109, 123, -2, 32, -68, 56, 96, -24, -75, -85, 133, 61, -92, 27, 52, -84, -152, -20, 42, 143, -70, -93, 65, 108, -165, 160, -31, 155, -140, -296, -60, -202, -285, -70, 130, -107, -223, -8, -90, 23, 56, -222, -205, 7, 12, -252, -128, -2, 40, -28, 35, -77, 255, -136, 116, -91, -87, 110, -182, 76, -74, 142]
2133A42r7j05j34K39k9lp7J70j8j51K01j58J80j4n6R5j85j22P9J77p0m1j12J10
2157B1J8k96K76r7k1J30M0j6l82K22J05l7K9k33K95m6K65k61J23k55J34j1O3n8
2181HJ76j64L7k29M7J12p5M5p6L78j91N2l00J87J00r7j1l57L52K77k67K52m55
2204a99J59J58k24L6J06j00L6K47k71Q1M4k36L7j58L53m4J03k71L01j46l20L21
2226A3J12j74p2j06M51r3k14K00j19l2J01Q9j32k43J25J73O2J60m63j87K67J26
2248D4j76Q8J89n5J03k23m8Q5L2l5JK0r3l7J36q6P1j30o9K2J65J7J9r8O7O2J03
2275A74J5j30J89k53j81L61K4m81L45k47K91j10R1k11K74j74P9J05J2k6j22j72
2297a47J20j5j44L31j09Rk55K56Mq0N7%J03k95J61J06J8L7j02j9j02K41l45L4
$$ y = [142, 45, -60, -194, 45, 16, 13, -64, 106, 88, -63, 138, -20, 160, 146, 90, 185, 0, -122, -43, 134, 64, 23, -89, 21, 39, -257, 19, -78, -99, 31, 71, 55, -327, -105, 0, -37, -8, -241, 54, 8, 273, 12, 135, -120, 14, 3, 66, 8, 184, 20, 57, -172, -125, -13, -88, -43, -119, 259, 68, 120, -180, 7, 107, 10, -1, -358, -6, 271, 4, 256, -199, -40, 118, -106, -70, 36, -64, -28, 219, -52, 29, 73, -163, -126, -284, 69, 25, 128, -143, 158, 12, -308, 13, 125, -49, -121, -227, 224, 131, -83, 117, -2, -34, 67, 156, 24, -219, -94, 79, 141, 301, -162, -349, -82, 44, -132, -44, 145, 90, 193, -30, -78, 7, 39, 4, 5, 25, -68, -105, 31, -55, 16, -114, -183, -161, 4, 21, 40, -58, 9, 71, 174, 189, 59, 248, -5, -186, 175, 199, -282, 63, -184, 107, -3, 88, -123, 151, -23, 56, 161, 173, 147, 25, -147, -27, -42, -186, 145, 36, 45, -210, 46, 50, -30, 27, 27, 130, -165, -4, 102, 120, 157, 55, 36, -66, 175, -170, -136]
2321a36P7l9M8Q7k7N2q4J27J34k11n6j49J7J43L5p2J40j1k3p4J4J8L3o5Mr1R0
2348a9r8J00J3k20L95k54K5J09j28p1L62j49J21k36n4J98q4j29k3K12j44L9lP5
2372C7J5Lj43OJ90k37J78k49L62j24p9j53O0K97l66K82j61n4J48r1jJ21K36k62
2396A5p4J7jJ78k12Q6O4M5k23J04K54k06n5J84J11k91J10J78m69L10j19Nj80K35
2420F6o4j19K41mn5j3q9k49J44K29k52P2J66k29Rp4K75J47j28l12K70j73K03q4
2444b3j90J80J91m2j19J53o2N0j36L1K4q7J94k49L4L1J39P0k92O2q5O6J62j09
2468gj49O3J76nk32M09m07K06l1j72J21j54Q0qJ44j00j11K02o2o6R5K0j1QnJ33
2494A37j25r5J67N2k59J23p2l4L01j09j84r5J63l5L63l01L7j18J06J54k13K12
$$ y = [-136, -59, -98, -50, 37, 10, 62, -22, 105, 239, 28, -28, -177, -160, -17, 18, -54, 86, 75, 52, -22, -8, 10, 43, -22, -18, -109, -19, -117, -17, -4, -224, 171, -83, -58, 51, -77, -148, 214, 65, 186, -50, -104, 94, 10, -119, -142, 70, -74, -35, -38, 37, 52, 55, -88, -82, 108, -129, 49, -200, 162, 38, -41, -194, -134, 163, -203, 79, -82, -136, 12, -79, -80, 41, 277, 15, -59, -42, -43, 135, -77, 9, 73, 118, -105, -1, 253, 47, -8, 176, 287, -4, 106, 284, -185, 125, 6, 11, -169, 66, 2, -117, 124, 120, 65, 52, -37, -286, -142, 87, -165, -93, 73, -156, -147, -221, 54, 201, 73, -239, 31, -142, 61, -23, -213, -33, 158, 116, -3, 150, 88, 138, 2, 33, 57, -30, 164, -85, -51, -20, 119, 189, -103, -41, -126, -60, 102, -7, -156, -93, 83, 78, -154, 255, -152, 54, 23, -149, -28, -182, -102, -110, 34, -66, -177, 25, -37, -103, -8, 12, 1, 9, 4, 137, 12, -83, 84, 136, -123, 0, -72, -106, 195, 86, -98, -193, -30, -65, 298, -3, 34, -84, 22, 176, -37, 175]
2516A75k65R8j56K05p0k64K35M10m12K4M04m86n3K26r7p3L03r4j3O7l11P2M1k23
2540b57J34J51j94N7J41j56J28l4j14k5J33j76K38o6J61o9k3J6k5M8j5m0L01l78
2564f4J19n9l0j29K98n6j88o2K52j1nl3j19P3l0PK36k27M9k30K59j01K19o6r8
2589Dk20J03K78m25J47J91j53j06J40M9j87K91j60o8J29m2KK90l78J01q7O3kj31
2613a71l7L18p7j27J67Nq6O2K1j03j14K36n3QQ8r6j10Q2J15l45K57j23r4Q2L99
2638C04k00j10l7L02r3l18J00K90j43l67L47j53k3P8lJ02n6K55l27J66K28l19
2660B3m4K40j58M8J31M5k17j67J15Q7K7j47K3k6O1j56J98j71l0K1J93J2k36l5
2684a63R7N1J35Q4k73J0j18K85k63K5r1K22K01l2k01K73k7k71r9Om3P4J09%o4
$$ y = [175, -90, 8, -148, 57, -13, -277, -42, 368, -44, -20, 384, -102, -155, 71, -26, -99, 204, 110, 97, 164, -147, -75, -34, -257, -123, 28, -166, -109, 32, -124, 4, -30, -144, -169, -36, -212, 26, -40, 121, 52, 29, 45, 20, 68, 53, 13, 314, -64, 55, -4, -34, -163, 135, 79, -109, -171, 81, 70, 65, 32, -87, -14, -44, -37, 199, -28, 21, -209, 50, -51, 168, 102, 4, -216, -113, 165, -260, -113, 78, -75, -181, -41, 8, -179, 112, -48, -116, 13, -29, -27, 263, -115, -14, -101, -38, -40, -171, -208, 110, 33, -94, 73, 78, -8, 54, 75, -28, -142, 94, 41, 49, 137, 41, -69, 13, 128, -217, 40, -83, -177, -95, 304, 104, -6, -43, 259, 166, -152, -52, 238, 95, -272, 75, -78, -101, -23, -26, 76, 20, 275, -52, 114, 342, 23, -21, 219, 61, 109, 240, 285, 68, -99, 16, 103, 130, -17, 6, -20, 41, -115, 83, -88, -118, -97, 96, 108, -128, -163, -66, -15, 120, 204, -69, -59, -177, 108, -155, -130, -221, 1, 202, 170, -31, 242, 215, -56, -155, -149, -192, -118, -9, -9, -73]
2709g3J19kJ6n7k0O6o6m9p9M56j74l07K48l9L3n4N4q8M1j16J24k17K74l70M88
2734B08k15K90m44N01n49J92J54j78L32l08K2j47J59K3n0J15k16K02k13P6K57
2755B11r5q4p9J00j10o0J35O1j98J27J31j45j14J4J65k89J76K0j18K65k13K59
2777A59k65pJ38J63k10K83j92L8k80M6J47k68L60L0l33K6N4J26j45J11P6J03p2
2800H8m06K66j27J00m4L6j46J01N1K66j39K2n7j56l2J0J17j20J39N4l2RP8k82
2824b04J02K9j1j26K37P5J33k12m2J5k03L34K64m40p1K98k90J30L91l62k82J7
2846b18L4P4M3J21j71L27j42rJ44j75k0n1O0j5o6L1K05m6j39p3L58j23j81p7Q4
2871b5J69j84%NM0rK4n1j26J05j67K73J79l16L01k34O9j50j1j37L95m0j93M50
$$ y = [-73, 46, 44, 60, 3, -17, 49, -17, -66, -145, 311, 137, -170, 78, 39, 72, 18, 72, -16, 25, -91, 33, -184, 90, -280, 208, -7, 283, -161, 340, -209, -17, 137, -41, 291, -17, 5, -142, 17, 40, -10, 105, -111, 91, -122, -46, 211, 116, 32, -47, 53, -57, -117, 18, 79, -119, 8, 139, -6, -120, -106, 59, -230, -54, -34, -152, 113, -100, 159, -106, -113, 25, 188, -22, 261, 69, 107, -173, -127, 20, -248, 112, 142, -191, -165, -111, 15, -130, -19, 57, 160, 88, -318, -52, -179, -79, -123, -87, -233, -132, -81, 185, 46, 68, 11, -145, -177, -167, -50, -170, -31, 23, -9, 0, 78, -204, -102, -73, -84, -210, 27, 102, 235, 23, -19, -4, -207, 127, 391, -49, -120, 178, -112, 18, 409, 47, -235, -218, -184, -110, -67, 54, -117, 210, 68, 59, 203, 28, 8, -43, 17, 2, -64, -33, 172, 126, -13, -86, 272, 149, -32, -109, -25, 144, -40, -40, -35, 5, -4, 20, -31, -157, -52, -219, 54, 233, -83, 218, -16, 53, -97, -108, -245, 150, 110, -83, 367]
2895C67n04J20J04pl76K95J24k32J2J42O7k47m3rL04k2J08j94N8n3j20O1N9j8
2919dn7L1L2k10K65J6r2L5p4L58k39J12k38M7L2k28K86Nj67J91l70J45J13j02
2943a13O7R4j25jK27J9O1j51k5J48k93R9NK3q1j25P8K9K68l75J60j32L32j72l10
2968b93M53k79Rm3j6K09P0k27J77n3j12j03J95j38J5Q8J59J01l69j04K55J30Q
2991A32k16j14J16J02K2O4j35K50k03n6j9J68J06j97N8k41M3J47O7p0j6l2J52
3014A28k74pJ5K30m1J87l25K7J60q8j47J72J27J2k86Q5k6J32q6L6K88n12K51j20
3038f2j79j60O60k59l4j7n7L02j76j75J79k8n3mM1q0j29K81o%J72k95O6Jj36J50
3064Bj89K0M6R1p9Q5j55j1J06j2O7n5MJ33lJ10k70J27k9j68K15k8P2K5j80J16
$$ y = [367, -137, -17, 87, 80, -296, -1, 123, -109, -97, 45, 112, -135, -178, -187, 117, 95, 203, 9, 67, 14, -106, -45, 14, -4, -61, -30, 2, -208, 57, 73, -19, 16, -58, 300, 61, 173, -65, -18, 14, -214, 72, 77, -90, 101, -269, -124, -11, -113, -46, 48, -77, -78, 149, 168, 229, 78, 53, 201, -92, 7, 12, 35, -46, -171, -93, -64, 204, -171, -11, -143, 189, 17, -293, 160, -119, -110, -153, -169, 40, 110, -117, 60, 7, -105, -208, -13, -151, -136, -48, 111, 212, -157, -261, -6, 124, 132, -84, -198, -82, 20, 42, 106, -29, 221, 18, -38, -57, 111, 217, 20, 78, -163, -120, 27, 94, 24, 8, -24, 128, -146, -153, -138, 92, 51, 238, -87, -60, 100, 12, -135, 37, 164, 176, -110, -25, -51, 81, -5, 31, 319, -193, 58, -62, -241, -401, 259, 0, -34, -51, -108, 194, 18, -157, 22, -6, -59, -63, -22, -102, -231, 50, 44, 44, 216, -79, -13, -12, -148, 2, -187, -167, -121, -30, -109, -24, -179, -190, -84, -96, -29, -84, -80, 53, 50, 160, -110, 17, -12, -180, 35, 7, 79, 104, -76, 40]
3090D0NoM2P3k49j6L64k53k9K05l48K53k0o8j00l2Q2R8l8m8j68M45k23R6j67j13
3116a75Q9R0n3k7K84l79L05k43L0J63k11r6j33J51P8K66k15O6O0j10J96l44J94
3139a4k2j12j45L52j75K36Q7j68M3o5Nj78L0J59j47K35l90J82J54M2M9k60J17
3162A5J2j91j06m0M57j30j04M4K04j09k67K43j7r1P1m9J14J26j73R1q6o5Q9J83
3186B21l53LK06J66m78L00j08L18l20q1J76j98L9K84k57J85k98K60k58K90k04
3207a07J69j64k19M39j50O5J0Q3k07L80l96J7L6N3M1k26O1J14k12M03k07k3J3
3230b7j41N3J33J52l6j24Q9J2l37J88R8K9k42K39j30p3KJ49k89K49q7J10L5M5
3254I7m7J41j18j74J99r6n2J86R3l99J97J64j93J22l92J72J55n0J60k92K02j39
$$ y = [40, 45, 39, 81, 154, -95, -111, 253, 0, -29, 176, -172, 81, 61, -7, -107, -139, -57, 41, 3, -45, -213, 232, 9, 105, -62, -175, -86, 4, -49, -76, 208, -171, 134, -109, -79, 84, -127, -223, -356, -205, -127, 139, -76, -10, 50, -60, 136, -208, -14, -36, -148, -293, 59, -116, 120, 207, 39, 82, 17, 22, -156, -126, 33, -114, 121, -269, -87, 67, 109, 158, -102, 15, 27, -164, -270, -310, 147, 17, -87, -43, 161, 52, -215, 28, 11, -80, -9, -58, 56, 182, 9, 100, 14, -51, 38, 221, -132, -129, 77, 243, -235, 65, -43, 275, -45, -126, 50, -148, -109, 175, -82, 103, -195, 65, -193, 97, -107, 62, -102, -321, 118, -32, 33, 43, 126, -81, 299, -97, -80, -44, 9, 50, -176, -115, -1, -213, 190, -17, -40, -27, -168, -115, 18, 170, 134, 10, 99, 111, -226, -38, 60, 89, -153, 86, -44, -117, -115, 34, -255, -6, -93, 17, 52, 97, 50, 191, 73, -101, 98, 2, -50, 136, 229, -170, 27, 191, -2, 120, -272, -100, 55, 5, 165, -127, 75, -64]
3276f4k6J40n4R2L8k37j5K83k37J51k43L32k34R4J12q2L8r2j32L48k33j22K68
3299A25j35J9J08O0k50rL91k09p8K31k39J13j85j7K67k17j8J29j22Q2R3k75K67
3322A31p5K0l5j52o3P3R0J93j73N5m8j13J50j66K15L5k23k0K15O7n6l96J50K37
3346A11j03J7J52l51K32k3j8N2m8Q1N5j62R3O6l21K99o1j95J0L4p6K61j39K9L18
3371C13j00k17JJ17o2J74k48J61l02K21j27k2K23j92k2o0K40j17J05k19L74k36
3393El0p4K09k34q3K00J3M1o8On1R2j71K37J6k93K3K61k43K72m0O7m1j15nj49
3419a55K19j62Q6N6J03q6r2J12j42j99K36k17M16l75J84j85P2J08M6n8J8J31j7
3442I9j79K07J23j77l85L13r0J3J97l1J50j95r9O5k44L02P8l74J76%O4m9J68k62
$$ y = [-64, -90, 50, -4, 88, 126, -111, -126, 157, -80, 71, -172, 160, -74, 20, 132, 50, 88, -4, -136, 212, -21, -143, 125, -10, 9, 117, 177, -73, -82, 309, 100, 22, 253, 14, 127, -58, -75, 192, -25, -43, 86, -36, 46, 139, -136, 131, 56, 76, 41, -111, -174, -101, -11, 182, 9, 64, 16, -97, 53, -113, 102, 137, -86, -106, 109, 176, 120, -276, -126, 111, 8, 25, 177, -174, 58, 35, 17, 69, 21, 102, 157, -5, 88, 154, -167, 132, 71, -124, -114, -80, -156, 105, -34, -5, 313, 213, -4, -3, 114, 52, 226, -22, 139, -163, 58, -69, -91, 132, -60, -82, -142, 98, -19, 86, -133, 241, 5, -25, -99, 110, -124, -207, -7, 6, 47, -21, -15, -66, 26, -145, 92, 108, -185, -162, 99, -144, 128, 88, 155, 114, -1, -6, -155, 64, -98, -12, 44, 147, 61, -31, 81, -61, -260, -24, -241, 175, -200, -16, -201, -129, -21, 25, -33, -15, 116, 99, -80, 127, 250, 73, -312, 1, -89, -76, 121, 90, 240, 45, -54, 11, -233, 69, 147, -227, -51, -51, 13, -36, 132, -130]
3466a30K77k54q6M92l54M1j61N0J49P4K3j12R4m27K64QJ36K25k57j00M0Qk84J06
3490a78L82l01J29Q9M2l68K50q1K4j31K50k88J31J10q4R7j16L6R8K5R6n0k90L09
3514A81j00j89J69j97J30mn8o3J01m8M2L42o80N29j8m09P4J90K12n7j79L4J48
3537A50k41J16K7K01k88K1K64k57J80l58J62J13k46K12K47l27j07J88m7k9q6K29
3559A24k74N1n3K13Q4j86M2K6Q7k47K49p9j63K28j37Jj37L81l01K9K07j07J63
3582B01j69n9j22Q4K46n68M83Qk18O0jP1k29K82l17L67k18p7K43o6R1j13J07J52
3606B38j42L7j57l1L58l53k0J7J79j05k7J72k32R3J16k33J64j18O9Q1J04r0m37
3629c17L55Q0k20J71j87J01K67j78m5m5l3kK68l49o9R4J16k1K30l73L66j39m0
$$ y = [-130, 147, -107, -193, 299, -55, -14, -175, -125, 24, 98, 121, 9, 103, -324, -60, -52, 84, 309, 52, -48, -8, 0, -284, -178, 204, -97, 32, 121, 163, -205, 45, -36, -12, -143, 107, -181, -50, 60, -24, 73, -43, -7, 91, 116, 212, 162, -128, 181, 81, -108, 61, -136, -6, -10, -68, -131, -30, -78, -36, 306, -374, 155, 137, -272, -198, -8, 204, 147, -32, 2, 150, -91, 25, 52, 253, -35, -14, 250, -7, 173, -185, -23, 90, -156, 56, 303, -24, -131, 57, 10, -19, -105, 124, -150, -99, -152, 61, 145, -41, 1, 27, 114, -133, 116, 37, -126, 102, -35, -34, -171, 210, -91, -62, 145, 38, 201, 32, -27, -149, -65, 181, -387, 96, 104, -114, -54, -55, 16, -213, 69, -248, 119, -99, -176, 67, 1, 92, -21, 86, 238, 96, 133, -24, -55, 303, -50, -70, -53, 126, 21, -6, 166, -66, 27, 143, -90, 74, -44, 25, 106, 210, 120, -317, 38, 118, -102, 69, -118, -17, 250, 72, 27, -18, -51, -53, 215, -134, -203, -109, 7, -14, 216, -157, 209, 70, 30]
3652C0K28k00J11j21m7K66j97m3R1n8J29j63j21K3r7J73L43p5j28l98L86m2K71
3675C61m10J76p4j65m4R6K68j40k08K2J53j48K54j70J94k67j38k9M19j84J12N2
3697A30j20O2N0l5r6J31j83mJ31j38R5j95J20j68K55P6j05J51q1k00J07R0J20
3720A93j71J5j60J53J46j10r6O5R1l1j02j00J39r8K47m79M06j93P3Q4O6m7K05
3743B96n19J60O4j80Q8K29j74J04j30J85k89O9J13K2J44n26N00J22o28K41q5L9
3765a55L38j69j91K94p2n5J64j64lM5q6n1J75J37k31j67L57l28M6K53j17M9l06
3788b37L27J43l50K85j15j06Q9j06J82M0k98R7j50Q8J46j55o7J74l8K08j87J24
3810I4K8k36o8K13M7l33M44k18J87k5L1j64n6j14J44R7k47L23j59J49J74j59j89
$$ y = [30, 258, 58, 169, 48, 1, 267, 70, 27, 118, 60, 189, 26, -95, -72, -169, 4, 347, 272, 144, -254, 132, 90, 361, -49, 127, 53, -112, -156, -60, 208, 68, -140, -118, 35, -113, 141, -29, 165, -102, -240, -269, 150, -34, 78, 130, 10, 72, 122, 87, -9, 122, -61, -65, 66, -72, 23, -172, -52, -220, 35, 111, 6, 157, 76, -124, -17, 73, 193, 22, 37, -123, 30, 176, 66, -30, 35, 126, 95, -7, -107, 32, -66, 181, -298, 108, -85, -12, 72, 138, 91, 296, -223, -63, 1, -179, -91, 138, -36, 68, -62, 123, -166, -97, 16, 38, 182, -344, 156, 278, -350, -109, -194, -155, 183, 14, -177, 117, 45, -10, 154, -10, -13, 32, -54, -105, 70, 207, -24, -191, 166, -162, -116, 137, 20, 69, -237, 90, 233, -117, 168, 53, -53, 36, -70, 112, 152, -146, -49, -199, -111, 35, -120, -187, -13, -51, 157, -30, 94, 122, -114, -182, 31, 78, -255, 189, -29, 158, 133, 164, 0, -56, -170, -26, 71, -176, 147, -12, 137, 311, 152, -37]
3833c7J44k50j7L88k55k3P8P8m0j53J34j25J60m9J91k63R5k53J34J72k4N9l6M1
3857A49k46J32Q4l06J59J80rl04J25nlN9LJ38j56J17l1j62k50J92Q0j02K43k27
3881a40R5Q7l72K47j9K05j87N4Q6Q0k77J40L7k91M58Jk50k3o0O4L5n9OJ53K14
3906B84m90K86j71j33L39k00R1r4K72j07r3J31K36m74J93j91K93k22j09L4J42
3927A7o5j36K26N4J91m55j27L37k42J60o2p5K75J98l41J97j35j78N9Q7qj6j7k8
3951h4J23J20j85O3J10l17M9K47Q1l09Q1N18o20K53p8j72O12m81n5j5J14P4j47
3974a8J23l18J67L78j54n0j44k56N98k29k30O4J9J96j29o1J46j38q8Q0%K36l06
3997a14J09p7K47l44L37k33N5j2q0N49o05K22o1L8N9k04J53j37K04r5J21j77J26
$$ y = [-37, 107, -143, -160, 228, -27, -50, 28, 106, 66, -87, 47, -78, 82, 33, 224, -39, 56, -197, -63, 109, 85, 144, 108, 149, -97, 35, 119, -187, -28, 152, 143, -161, -36, -41, -44, 15, 18, 156, 0, 117, 86, -76, -326, -134, -54, -156, 87, -140, -45, 42, -330, -83, -102, 103, -84, -30, 56, 136, -141, -1, 36, -255, 203, 204, -46, -69, -129, -65, -30, -89, -83, 70, 284, -206, 80, -91, -224, 115, -85, 6, -88, 184, 77, -16, 115, 351, -123, 70, -121, 172, -50, -159, -125, 17, -48, -184, 42, 96, 287, -168, -295, 42, -200, -40, -102, -177, 98, 296, -45, 152, 17, -161, -102, -15, -23, -39, -56, -84, 39, 159, -26, 37, 147, -170, -121, 126, 207, -102, -21, 497, -123, 130, 52, -120, 492, 11, -44, -59, 55, 129, -18, 105, -213, -46, 332, 178, 128, -16, -272, 326, 97, -133, -69, -50, 146, 17, -44, 102, -36, -124, -44, -44, 192, -114, -5, -82, 165, -179, 158, -75, -20, -32, -112, 437, -168, 54, -7, 31, 90, -114, 39, -98, 106, 11, 132, -45, 81]
4020H1J1r9K62q3j73R9q0M1O6j94J99Oj17j04p3Q8P7j35M9O4N6n7q6J77m4J9q0
4047c0j29K28k39q0J58J53J66l16J59j3j1j06L23j39po9j93K22j97J15K01k32
4069c6o5K70j31K3k9j20J54j35K12j96Q0L9l19N57l40K3k43L74j82J03J29m02
4091b34J50m7K16J3J15k51j35K79j36J81J5R8j67k44K34Mk47M15n9k2j73l8j89
4114b22M16j1k19M9m3k39q1J58J07jP6L1r3KK2O2K2K37k62L7P9j11O5M3k05J44
4140F3J50m93J88J44M7l38K33r4m4Q3K55l20M5O5J62r3P3o0l3j98L47j72p4J28
4164F4l94M30j36J01K5j27J77k24K5K08K1l0j81R7M1j6k58L37j15n5K6j03M2j34
4188a79P1J7M2J75J68k94J06l70K46j0L6n6q1J83j67J73p4K11j45M1n0j17J65
$$ y = [81, 92, -7, 255, 172, -1, 98, 18, 59, 125, -69, 130, 136, 19, -85, -158, -70, 7, -128, -79, -15, 41, -16, -102, 75, 31, 50, -30, -159, 69, -170, -250, -92, 61, 227, -89, 70, 57, 46, -60, 263, 124, 117, 48, -145, 77, -120, -5, 196, -36, -101, 169, 38, 61, 32, -88, 66, -69, 143, -53, 27, 66, -253, 304, -36, -13, -256, 118, -64, 39, 168, -234, -84, -131, 85, 98, 213, -38, -173, 106, -30, 151, 166, 264, 97, -147, 87, 91, -156, 259, 200, 178, 5, -33, -222, 194, 183, -36, 13, -30, -269, -350, -192, -85, -86, -10, 21, -72, -70, -48, 14, 36, 273, 11, 48, 127, 16, 81, 124, -81, 63, 213, -280, -92, 52, 99, -239, -6, -100, -144, -61, 194, -126, -81, -16, 146, 53, 126, 66, 33, -165, 182, 10, -64, 64, -330, 100, -36, 65, 90, -37, 140, -84, -59, 149, 170, 140, -41, 56, 97, 81, -177, 160, 45, -10, 16, -87, -45, -179, -108, -91, -49, 126, 294, 0, 106, -264, -18, -28, 8, -48, -129, 54, -113, 60, -14, 197, 52, 93, 43, -74, 91]
4211I1j82Q8J28k9J3m23K59L33l58K95k93M9j87J74J02Rj26J26q4l7J91O3r7k13
4235a08l4O3K73p4n2k78K80n5R0j48p0Rq8L12k68K53k1n2M5R6k90J29k29K17o0
$$ y = [91, -91, -3, 125, 96, 109, -314, -55, 278, -80, 215, -78, -29, -216, -42, 60, 69, -57, 69, -15, -52, 139, 202, 105, -108, -142, -79, 194, 120, 68, -210, 70, 15, 105, -43, -113, -104, -192, 120, -148, 105, 84, 32, 77, 173, -117, 12, -217, 0, -60]
$$ [...]
8191I4
##END NTUPLES=NMR FID
##END=
