##TITLE=1H_SR88_k
 CDCl3,8 sc, 
 29.9.2021
##JCAMPDX= 6.0         $$ Bruker NMR JCAMP-DX V2.0
##DATA TYPE= NMR FID
##DATA CLASS= NTUPLES
##ORIGIN= UXNMR, Bruker Analytische Messtechnik GmbH
##OWNER= root
$$ XWIN-NMR		Version 3.5
$$ Wed Sep 29 12:16:41 2021 Russian Standard Time (UT+4h)  she@DPX200
##.OBSERVE FREQUENCY= 200.1314
##.OBSERVE NUCLEUS= ^1H
##.DELAY= (6, 6)
##.ACQUISITION MODE= SIMULTANEOUS
##.ACQUISITION SCHEME= undefined
##.AVERAGES= 8
##.DIGITISER RES= 18
##SPECTROMETER/DATA SYSTEM= spect
##.PULSE SEQUENCE= zg30
##.SOLVENT NAME= CDCl3
##.SHIFT REFERENCE= (INTERNAL, CDCl3, 0, 15.7039)
##AUDIT TRAIL= $$ (NUMBER, WHEN, WHO, WHERE, WHAT)
$$ ##TITLE= Audit trail, XWIN-NMR		Version 3.5
$$ ##JCAMPDX= 5.01
$$ ##ORIGIN= Bruker BioSpin GmbH
$$ ##OWNER= she
$$ F:/spectra/data/she/nmr/H-F/1/audita.txt
$$ ##AUDIT TRAIL=  $$ (NUMBER, WHEN, WHO, WHERE, WHAT)
(   1,<2021-09-29 12:15:32.06 +0400>,<she>,<DPX200>,
      <created by zg, POWCHK disabled, PULCHK disabled
       configuration hash MD5:
       00 E9 B6 7A A2 85 ED C7 34 08 36 98 17 FE 4E 26
       data hash MD5: 16K
       6D E6 15 FA 5A 30 D0 ED 5B 77 A4 8B 0A 1D 02 47>)
$$ ##END=
$$ 
$$ hash MD5
$$ 6D 54 F0 D1 8B 0E 48 B4 6A 44 AC 2A EB 30 72 38
##$RELAX= 
##$RELAX= 
##$RELAX= 
##$RELAX= 
##$RELAX= 
##$RELAX= 
$$ Bruker specific parameters
$$ --------------------------
##$DU= <F:/spectra>
##$EXPNO= 1
##$NAME= <H-F>
##$PROCNO= 1
##$TYPE= <nmr>
##$USER= <she>
##$AMP= (0..31)
100 100 100 100 100 100 100 100 100 100 100 100 100 100 100 100 100 100 
100 100 100 100 100 100 100 100 100 100 100 100 100 100 
##$AQSEQ= 0
##$AQ_mod= 1
##$AUNM= <au_zg>
##$AUTOPOS= <>
##$BF1= 200.13
##$BF2= 200.13
##$BF3= 200.13
##$BF4= 200.13
##$BF5= 200.13
##$BF6= 200.13
##$BF7= 200.13
##$BF8= 200.13
##$BYTORDA= 1
##$CFDGTYP= 0
##$CFRGTYP= 5
##$CHEMSTR= <none>
##$CNST= (0..31)
1 1 145 1 1 1 1 1 1 1 1 1 1 1 1 1 1 1 1 1 1 1 1 1 1 1 1 1 1 1 1 1 
##$CPDPRG= <>
##$CPDPRG1= <>
##$CPDPRG2= <>
##$CPDPRG3= <>
##$CPDPRG4= <mlev>
##$CPDPRG5= <mlev>
##$CPDPRG6= <mlev>
##$CPDPRG7= <mlev>
##$CPDPRG8= <mlev>
##$CPDPRGB= <>
##$CPDPRGT= <>
##$D= (0..31)
0 1.2 0 0 0 0 0 0 0 0.06 0 0.03 0 0 0 0 0.0002 0 0 0 0 0 0 0 0 0 0 0 0 
0 0 0 
##$DATE= 1632903331
##$DBL= (0..7)
120 120 120 120 120 120 120 120 
##$DBP= (0..7)
150 150 150 150 150 150 150 150 
##$DBP07= 0
##$DBPNAM0= <>
##$DBPNAM1= <>
##$DBPNAM2= <>
##$DBPNAM3= <>
##$DBPNAM4= <>
##$DBPNAM5= <>
##$DBPNAM6= <>
##$DBPNAM7= <>
##$DBPOAL= (0..7)
0.5 0.5 0.5 0.5 0.5 0.5 0.5 0.5 
##$DBPOFFS= (0..7)
0 0 0 0 0 0 0 0 
##$DE= 6
##$DECBNUC= <off>
##$DECIM= 32
##$DECNUC= <off>
##$DECSTAT= 4
##$DIGMOD= 1
##$DIGTYP= 9
##$DL= (0..7)
0 120 120 120 120 120 120 120 
##$DP= (0..7)
150 150 150 150 150 150 150 150 
##$DP07= 0
##$DPNAME0= <>
##$DPNAME1= <>
##$DPNAME2= <>
##$DPNAME3= <>
##$DPNAME4= <>
##$DPNAME5= <>
##$DPNAME6= <>
##$DPNAME7= <>
##$DPOAL= (0..7)
0.5 0.5 0.5 0.5 0.5 0.5 0.5 0.5 
##$DPOFFS= (0..7)
0 0 0 0 0 0 0 0 
##$DQDMODE= 0
##$DR= 18
##$DS= 0
##$DSLIST= <SSSSSSSSSSSSSSS>
$$ [...]
##$SUBNAM2= <"">
##$SUBNAM3= <"">
##$SUBNAM4= <"">
##$SUBNAM5= <"">
##$SUBNAM6= <"">
##$SUBNAM7= <"">
##$SUBNAM8= <"">
##$SUBNAM9= <"">
##$SW= 16.9725446903124
##$SWIBOX= (0..15)
0 0 2 0 0 0 0 0 0 0 0 0 0 0 0 0 
##$SW_h= 3396.73913043478
##$TD= 16384
##$TD0= 1
##$TE= 0
##$TE2= 300
##$TE3= 300
##$TEG= 300
##$TL= (0..7)
0 120 120 120 120 120 120 120 
##$TP= (0..7)
150 150 150 150 150 150 150 150 
##$TP07= 0
##$TPNAME0= <>
##$TPNAME1= <>
##$TPNAME2= <>
##$TPNAME3= <>
##$TPNAME4= <>
##$TPNAME5= <>
##$TPNAME6= <>
##$TPNAME7= <>
##$TPOAL= (0..7)
0.5 0.5 0.5 0.5 0.5 0.5 0.5 0.5 
##$TPOFFS= (0..7)
0 0 0 0 0 0 0 0 
##$TUNHIN= 0
##$TUNHOUT= 0
##$TUNXOUT= 0
##$USERA1= <user>
##$USERA2= <user>
##$USERA3= <user>
##$USERA4= <user>
##$USERA5= <user>
##$V9= 5
##$VALIST= <valist>
##$VCLIST= <CCCCCCCCCCCCCCC>
##$VD= 0
##$VDLIST= <DDDDDDDDDDDDDDD>
##$VPLIST= <PPPPPPPPPPPPPPP>
##$VTLIST= <TTTTTTTTTTTTTTT>
##$WBST= 1024
##$WBSW= 4
##$XGAIN= (0..3)
0 0 0 0 
##$XL= 0
##$YL= 0
##$YMAX_a= 28220
##$YMIN_a= -32519
##$ZGOPTNS= <>
##$ZL1= 120
##$ZL2= 120
##$ZL3= 120
##$ZL4= 120
##$ABSF1= 10
##$ABSF2= 0
##$ABSG= 5
##$ABSL= 3
##$ALPHA= 0
##$AQORDER= 0
##$ASSFAC= 0
##$ASSFACI= 0
##$ASSFACX= 0
##$ASSWID= 0
##$AUNMP= <proc_1d>
##$AZFE= 0.1
##$AZFW= 0.1
##$BCFW= 1
##$BC_mod= 2
##$BYTORDP= 1
##$COROFFS= 0
##$CY= 11.3945322036743
##$DATMOD= 1
##$DC= 2
##$DFILT= <>
##$DTYPP= 0
##$F1P= 2.36226072786647
##$F2P= -0.459571619588291
##$FCOR= 0.5
##$FTSIZE= 0
##$FT_mod= 4
##$GAMMA= 1
##$GB= 0.15
##$INTBC= 1
##$INTSCL= 1
##$ISEN= 128
##$LB= 0.24
##$LEV0= 0
##$LPBIN= 0
##$MAXI= 10000
##$MC2= 0
##$MEAN= 0
##$ME_mod= 0
##$MI= 1.114404
##$NCOEF= 0
##$NC_proc= 0
##$NLEV= 6
##$NOISF1= 3.799351
##$NOISF2= 2.8
##$NSP= 1
##$NTH_PI= 0
##$NZP= 0
##$OFFSET= 15.70392
##$PC= 1
##$PHC0= -14080.64
##$PHC1= 20.20088
##$PH_mod= 1
##$PKNL= yes
##$PPARMOD= 0
##$PSCAL= 0
##$PSIGN= 0
##$REVERSE= no
##$SF= 200.130013532006
##$SI= 16384
##$SIGF1= 3
##$SIGF2= 2
##$SINO= 400
##$SIOLD= 16384
##$SREGLST= <1H.CDCl3>
##$SSB= 0
##$STSI= 0
##$STSR= 0
##$SW_p= 3612.71676300578
##$SYMM= 0
##$S_DEV= 0
##$TDeff= 0
##$TDoff= 0
##$TI= <>
##$TILT= no
##$TM1= 0
##$TM2= 0
##$TOPLEV= 0
##$USERP1= <user>
##$USERP2= <user>
##$USERP3= <user>
##$USERP4= <user>
##$USERP5= <user>
##$WDW= 1
##$XDIM= 8192
##$YMAX_p= 0
##$YMIN_p= 0
$$ End of Bruker specific parameters
$$ ---------------------------------
##NTUPLES= NMR FID
##VAR_NAME=  TIME,          FID/REAL,        FID/IMAG
##SYMBOL=    X,             R,               I
##VAR_TYPE=  INDEPENDENT,   DEPENDENT,       DEPENDENT
##VAR_FORM=  AFFN,          ASDF,            ASDF
##VAR_DIM=   8192,          8192,            8192
##UNITS=     SECONDS,       ARBITRARY UNITS, ARBITRARY UNITS
##FACTOR=    0.0002944,     1,               1
##FIRST=     0,             0,               0
##LAST=      2.4114304,     0,               0
##MIN=       0,             -32519,          0
##MAX=       2.4114304,     28220,           0
$$ Real data points
##PAGE= N=1
##DATA TABLE= (X++(R..R)), XYDATA
0@%%%%%%%%%%%%%%%%%%%Qj6J6j6J6j6K2l0L2l4M2m8N2o0O8p8R0j00J11j26J42
40G5j58J74j92K14k39K63k88L18l52L88m26M70n18N70o30O97p73Q60r59J075j214
61f45J383j589J853k210K715l483M828p901L3269o211j9697J3094o435L756K002
76A4729P831M401r056j3715J954l801n042q99L960K464n721q927M789n57q916
91a6506m005P85M115J648l016O763N783n820m065M45R70L460K709Q166R045l023
107G454l683J309k990J547K215L416R585J088o319R37l936n391J41q54K359M155
123A1033l504j295l2p585n295n75p29J546M71P89K191k731l657k004k479J953
139a1903J857K196O186J476j442L14j683j644J671J798N054M783J22J151q32m211
$$ y = [0, 0, 0, 0, 0, 0, 0, 0, 0, 0, 0, 0, 0, 0, 0, 0, 0, 0, 0, 0, 8, -8, 8, -8, 8, -8, 14, -16, 16, -18, 24, -24, 28, -32, 36, -42, 48, -52, 59, -67, 75, -83, 91, -101, 113, -126, 137, -151, 167, -185, 203, -223, 247, -271, 299, -331, 366, -407, 453, -506, 569, -645, 738, -851, 1002, -1208, 1507, -1976, 2852, -5049, 28220, 22009, 2312, 15406, 8971, 12727, 14729, 22560, 26961, 17905, 4190, 6144, 2343, -2699, -3598, 362, 2826, -2895, -11822, -7033, -7590, -16506, -20511, -19726, -15611, -13963, -16979, -10216, -4433, -10253, -14318, -13873, -12903, -9443, -6734, 1432, 10477, 7454, 3771, 5080, 2090, 3637, 5852, 9268, 18853, 19941, 13622, 14559, 10623, 5232, 5373, 4519, 6878, 11033, 7529, 6234, 6202, -1383, -6678, -7253, -7982, -6436, -5965, -5176, -2985, -5716, -9373, -11377, -13856, -11903, -10046, -7850, -1664, -188, -1630, -1316, -2999, -4643, -2972, -1174, 3880, 8663, 8785, 9936, 9104, 4893]
155D893p85j289Q14M531N44N39O92m596l813k204k531N44J294m2J744m1m273j931
173e910k686j839R81J240K644K799J04l05j332j830r7O38K736M173K552J863Q79
190F610j969j589q10j58K772K451J648K170j295k732j992l171j250J102M41J636
206C864P47j899k363l182l485j327MP30K790O52m22r28k567j552n08M32K775K860
224c379K416J111q5j228r95j05J374K086L033K389J544k22j340j995j168K63P86
241D485K108J684N5r82k234l041k162j203j2J436R69k3p58k144k803k218j167
258h010M97J586J672J705L15j032j548j422l59R42K224K467K080J514m04j451
274G76m94j110Q50K242J695K154P95m33j779j683j650o09J061J169J336J79r34
$$ y = [4893, 4108, 2819, 3633, 8164, 8708, 9247, 9939, 5343, 1530, -674, -3205, -2661, -1367, -1409, 335, 294, -3979, -5910, -8596, -10435, -9454, -8214, -5570, -2771, -2667, -2972, -4304, -6134, -6231, -5593, -2857, 1316, 3868, 5731, 6610, 4641, 3052, 2242, 2084, 4856, 7307, 8955, 11125, 9830, 7098, 5106, 1935, 685, 1787, 2228, 3864, 4611, 2712, 349, -2833, -6318, -7645, -7641, -6911, -4121, -3469, -3891, -4819, -7386, -8938, -9446, -9014, -6239, -3379, -963, 148, 63, -1165, -2160, -2265, -891, 1195, 4228, 6617, 8161, 7939, 6599, 4604, 3436, 3699, 4485, 6593, 8277, 8332, 7350, 5116, 2075, -87, -1290, -1302, 134, 1103, 1080, 322, -1822, -4625, -6843, -8010, -7513, -5927, -4255, -2550, -2235, -3267, -4815, -6237, -6596, -5654, -3430, -963, 1117, 2631, 2227, 776, 282, -828, 22, 2264, 3959, 6113, 6908, 6475, 4696, 3013, 1363, 754, 1815, 2984, 4320, 4499, 3565]
291C565j645k551k097r33N08J324J537P92o78j124j851j897l91Q43J634J970J496
308E02M84p55r43j525m81R75J592J994J780N27l96j566j615r05K12J008J670J108
326C666J36o93j983k062j230n18N73J284J278K30k60j606k009j123k68M06J658
343b521J663J082J88q16j189r53j98R22K116K026J041N35l27j388j338l8j43J529
361B191J772R94m5q03j603j847j165l56M97J147P74J30o88k270j624j294o23P06
379d107J083J128R38o12j319j105q54l47J251J695J688J476J25l73q51q84j0J116
397C8J550J865J305L70o63j408j214l94K78P64J192Q03R8p73j716k093j006l18
415a322M16N69J070P6j072j261j590j220k40R33O64J390Q17m47q77p90j326P73
$$ y = [3565, 1920, -631, -2728, -3661, -3153, -1829, -292, 500, -178, -1302, -3153, -5050, -5441, -4598, -2964, -994, 502, 986, 231, -712, -2237, -2718, -1743, -151, 1843, 3623, 4150, 3754, 2188, 573, -332, -120, 888, 2558, 3666, 3802, 3109, 1126, -936, -2166, -2684, -2111, -827, 451, 681, 421, -1185, -3194, -4317, -4585, -4179, -2521, -858, 224, 412, -404, -1593, -2546, -2744, -1822, 294, 2320, 3361, 3896, 3569, 2181, 843, 805, 662, 2191, 3963, 4957, 4912, 4109, 2506, 659, -506, -862, -365, 782, 1556, 1686, 998, -1272, -2896, -4190, -4813, -4107, -3024, -1896, -958, -1570, -2889, -3994, -4848, -5195, -3944, -2249, -561, 915, 1040, 667, -184, -1068, -1078, 38, 1588, 3453, 4758, 5128, 4465, 3057, 1843, 1449, 1727, 2491, 3683, 4486, 4584, 3811, 2095, 2, -1004, -1322, -906, -337, 733, 809, -263, -1524, -3114, -4334, -4574, -3641, -2977, -1587, -770, -1217, -2094, -2884, -4210, -3437]
433c437P13J736J679P33N31o00j222r05R1M85J633J219J191K56p41j479r07r44
451C2J27Q95P84J130l44q75j300j649q78j55P40R14R75N0p04q04j223o00k71P64
471b392J464J075P00L54j115j044q9n80P51J394J197J059J14j190o87j228o16
488h33Q11P56J180Q59n89p45j301j323p12o5N70J059P68j46n64q79j375k44k33
507c006P66J323Q48N43j0p64r23p69L41R08J428J371J011j17q56j031o16o2M01
526G86Q73J347N80l52o56j562j063l54j32N33Q76K50j15r50j476r61p34l5P66
545b379N95J038q0o72p62r98l51N66P36J064J169O41J13n26p56j13J56N22J656
564A619R59O53M04q16r45m41m89M52Q96N85L27l4q83j313j231q04J80M90P84J83
$$ y = [-3437, -2724, -988, 691, 1424, 1955, 1355, 133, -772, -681, -196, 1437, 2656, 3847, 4103, 3362, 1883, 976, 32, 159, 1054, 1838, 2968, 2624, 1749, 449, -1200, -2078, -2233, -1493, -579, 396, 446, -258, -1062, -2285, -2885, -3156, -2392, -928, 147, 847, 1201, 86, -958, -1047, -1627, -876, 518, 1715, 2774, 2888, 1698, 1011, -217, -833, -22, 734, 1914, 2773, 2184, 1439, 138, -1185, -1897, -1962, -1392, -333, 435, 289, -275, -1154, -2529, -2773, -3006, -2240, -917, -69, 474, 464, -300, -1223, -1992, -1651, -743, 685, 2056, 3067, 2950, 2094, 1063, 447, 385, 786, 1659, 3006, 3586, 3234, 2578, 1016, -47, -401, -533, 0, 876, 1126, 1011, 61, -1415, -2376, -3110, -3145, -2379, -1784, -746, -826, -1498, -2260, -3258, -3609, -3043, -2307, -1243, -74, 567, 680, 154, -602, -715, -559, -37, 1619, 2578, 3231, 3635, 2819, 1874, 1433, 944, 1396, 2292, 2877, 3204, 3170, 2287, 974, -257, -1061, -881, -391, 393, 576]
584E76j30o15j539q42m63l2N80J102L58M7q8l09j016l49L43P54J069R22O88k97
604G59k06o93l16R8O75Q72J231K41j26o04j014o94j42M54M24O39O34q19l51j052
624A0j046m55K5Q67N75L17K94p27r63o07p72M34P88Q21J057K02k18q63n66k3j67
645a017P16R37Q23L65j14p91r27l01k79O73O51N43K41l70n20j104o12n11J31P35
665g31N77O69n80mj027q49m31N72O16R95O03J66m70n75k09n00M18O00J214N73
685A627M52j45n96l71m98j43P30M80O84J98j93p88j145o11k19L30J14R37J00p04
705B39l62j299p97r4J79N10O84M24J34o06r31l66k55P33O84Q95N01M37j69m92
725D9l23l56L18N77J215O45M55j48o16p60j71k97L94N71Q10qp32n09o73j026k78
$$ y = [576, 446, -169, -1708, -2550, -3013, -3045, -2465, -1363, -1005, -958, -1046, -1355, -2371, -2720, -2377, -1623, -554, 368, 1056, 759, 553, -140, -456, -358, 317, 1189, 2420, 2661, 2535, 1931, 917, 223, 81, 535, 959, 1598, 2232, 1413, 1062, 10, -1036, -1491, -1466, -599, -24, 293, 587, -140, -1103, -1710, -2482, -2048, -1260, -439, 618, 820, 602, -261, -827, -850, -1017, -301, 636, 1459, 1824, 1710, 919, -8, -309, -588, 85, 736, 1279, 1520, 1150, 630, -474, -1086, -1597, -1466, -731, -154, 515, -65, -69, -1096, -1945, -2376, -1804, -1188, -193, 410, 576, 106, -469, -678, -1178, -760, -160, 1054, 1627, 2079, 1934, 1338, 967, 469, 326, 1056, 1536, 2220, 2418, 2225, 1437, 292, -319, -538, -208, -94, 843, 943, 239, -123, -1422, -2219, -2313, -2134, -1624, -940, -516, -382, -988, -1919, -2285, -2540, -1807, -1123, -228, 273, 710, 541, 49, -274, -630, -312, 265, 1480, 2125, 2580, 2432, 1816, 1056, 885, 588, 982, 1553, 2363, 2355, 1623, 1114, 441, -585, -863]
746h63N12K54K85K64k82n14r82n03m15L07L93O09N08m6j73o99m62J02K71N66P60
767a08R27J20l56n59k98k04nQ74P05L03M34j55n65q21m98Q1J86M30N00K22M6r61
789B98q79n25n8J73L56J055j46p8k10o98k85m15L24N59N51N55K21k71m74p10K72
810c85q5M18J026L34M4m72o32n44j90K60L45J99N63J04n06n80n60m50N1J51K72
831f37O88J23j79k73o15n89M8K36O85M71K08M47n96m53k36l0M18Q95M88L09L68
852A776p16j77m95Jj11N69M15L85J20l72r49l35n12O0j27N11J52J22k72o07n70
873a132o13j16K45N12M90J1K19q86m54K4k01O21O48N67N55M8k93k0l16k27L65
894D7P50O15M43Q8l29n54l41Rj91J89M30N55L8n05n47n57o71l6K14K02K83j73
$$ y = [-863, -351, -97, 188, 452, 170, -344, -1326, -1829, -2244, -1937, -1544, -935, -427, -473, -646, -1345, -1807, -1705, -1434, -868, -108, 819, 939, 583, 24, -274, -478, -483, 391, 1096, 1399, 1833, 1678, 1113, 292, -206, -125, 61, 491, 991, 1213, 1259, 298, -581, -1106, -1164, -991, -635, 420, 274, 196, -14, -712, -997, -1412, -1088, -529, 22, 577, 798, 527, 53, -657, -385, -470, -52, 974, 1308, 1352, 880, 248, -296, -486, -226, 119, 318, 881, 985, 479, -101, -661, -1111, -1060, -909, -637, 51, 174, -5, -278, -893, -1482, -1434, -1198, -513, -42, 166, 613, 17, -436, -672, -702, -284, 611, 1099, 1408, 1776, 1060, 883, 388, 389, 278, 847, 1262, 1647, 1767, 1395, 446, 111, -401, -341, -468, 43, 195, 317, 45, -562, -1132, -1745, -1861, -1616, -1104, -614, -603, -384, -1270, -1724, -1700, -1901, -1280, -632, -65, 490, 538, 245, 225, -91, -318, 47, 797, 1412, 1855, 1943, 1614, 1060, 719, 728, 537, 726, 1156, 1711, 1749, 1244, 697, 140, -531, -567, -353, -151, 132, -41]
916d1j21m74p99l25J10L73M55J19N22k66l94l09k29O5L65N36O66P13l85j08k62
937B11p05K27N84K39N26M76j87n62l74k06k22r7N12M47k79M90o00k37n23o42K71
958f51K95L66K52m3j99l78k61k70k65O49J35N52N20l93Q5l37n74j47N89L46M55
979G26L90K5l35o31m77K00K29L61k4K98k9k15m87q17k10K38L43Q4M45j82j51l16
1001e35o19l60nO29L47N30j42P0p4k80m9m0J94P20M07M88j06l05k66j55l42N57
1023F64M53P1L41K6o15m91n99J70l63M52J15K63m35N8q90l94l66J54K3L15M40
1044f08J10q6o92k5l01k2Q14M75L38J72m9R1o42KL89K98M38O60j17K71k91n41
1066F84l19j18N93L79Q6K95j10n66k46o71k91lR5N42k9l61j0o58n22N6oJ98K86
$$ y = [-41, -162, -636, -1435, -1760, -1650, -1277, -822, -703, -181, -447, -841, -1150, -1379, -1314, -949, -413, 253, 966, 581, 473, 211, -494, -267, 317, 556, 1082, 1558, 1371, 809, 435, 229, 7, -90, 422, 869, 590, 1080, 480, 243, -280, -922, -651, -356, 10, 262, 219, 20, -358, -619, -889, -1154, -505, -370, 182, 702, 309, 394, 57, -517, -664, -75, 271, 726, 1116, 1141, 806, 175, -302, -102, 127, 488, 464, 762, 733, 518, 31, -786, -996, -758, -415, -331, 114, -68, -219, -535, -1154, -1514, -1519, -890, -543, -13, -155, -85, -159, -439, -488, -528, -334, 386, 793, 1281, 1175, 870, 604, 449, 107, 664, 1117, 1188, 1529, 1555, 940, 449, -150, 20, -343, 109, 224, 487, 52, 110, -780, -1174, -1540, -1386, -1363, -1048, -608, -498, -584, -1276, -1301, -1602, -1624, -810, -335, 3, 175, 126, 217, -425, -423, -34, 264, 702, 1362, 1245, 1516, 1225, 684, 365, 247, 840, 1219, 1305, 1600, 1490, 924, 678, 7, -284, -287, -192, 350, 321, -40, -50, -708, -1230, -1174, -1180, -982, -696]
1089f96K17O3j11l81J49m59k9M84O26L44O5L1k83J2j04K56K5L22M91j09J79l26
1111G66p3n08j08L48L2L82K47l93l38l29l13j24n6K25J96J40J75m43l60l11l26
1132a171N43N6N96L6M70m97k25k80j31L79J56L76N96Q6m35K1k65m88N9L30J65
1153C77L53P0k27k08o48j92j28O5K28R4O57k55m69k13l85k61J46L96M44K33N0
1174A27k19j49l75L77j12L97M67L14J33j48l12j53l72L05L32J99J45J29L5o14
1194E06k29k77n1o0K07M72k38m9q30ql27k92J74K52J57J76R9l36l92j15n5L37
1216h79J67L71M30P9R7o30J26j46M11R4M17K65K10j16r8l13l34L47K13J78K76
1237A165nl04l77l26l08J61j06J62Q7K83l71l03l64n10J66j18N14J11M2J84j81
$$ y = [-696, -479, -416, -527, -908, -759, -1218, -1247, -763, -137, 207, 272, 303, 20, 32, -72, 184, 209, 531, 1022, 913, 1092, 766, 693, 185, 77, 425, 457, 839, 1086, 693, 355, 26, -287, -411, -467, -242, -46, 94, 269, -174, -534, -845, -1171, -628, -572, 24, 60, 530, 33, -192, -472, -603, -224, -68, 308, 904, 990, 555, 576, 311, -177, -118, 212, 377, 730, 800, 573, 365, -283, -475, -603, -538, -310, -216, 441, 186, -283, -496, -881, -1142, -996, -600, -156, 77, 127, -92, -241, -616, -239, -351, 46, 513, 827, 960, 812, 500, 347, -25, 280, 612, 811, 956, 1085, 1120, 506, 277, 0, -51, -111, 96, 568, 330, 281, -549, -557, -884, -1176, -1002, -750, -593, -417, -318, -654, -1046, -1161, -1216, -879, -712, -341, 89, 168, 265, -365, -239, -385, 26, 120, 537, 802, 1012, 896, 798, 485, 151, 498, 711, 889, 1165, 1160, 856, 479, 153, -155, 6, -100, 62, 149, 432, 61, -242, -606, -1116, -950, -1068, -554, -443, -401, -217, -398]
1258c98k08k64J8J73M10J82M2K30J1l92L9j17J28J59L69L98k10K09l63k24j00
1279I2k79P13j80O8j9j14m4k70l59l29N02k04N92m9k13k34M0l23o1L43J33L58
1301A63K85j10k11k48j19J60m6M60L08j58K9q5l31R3m54J89J17K11o0N03o66l92
1323c62P1l97K11j52O28O2J65p6l86q6m76p2J45M83J92M90j84l23q7l83N27k2
1345c2J19M99J28J08l16P9m73P5k5K56J94J34L1m53J00m91j53L8J59J3N01l02
1367A89k35k63m73M9k25O23j8L74k65k16k98O6j39j04L10M78L97j79K31j66k48
1388a12k06J61M42J22L1M88j43p3m14R7l48N5M40J39K84l40j11l20k3n12J03O7
1410a73M24Q5k06n0l50Jl89J47j28L89M1L30l55j14j16j24n4J24L40K75L06j09
$$ y = [-398, -606, -870, -852, -679, -269, -87, -45, 185, 196, -196, -157, -274, -146, 13, 382, 780, 570, 779, 416, 192, 92, -187, 526, 346, 414, 395, 281, 237, -33, -392, -721, -219, -423, 169, 120, -93, -327, -287, -610, -671, -328, -195, 163, 448, 338, 127, -121, -240, -80, -126, 334, 642, 484, 513, 428, 97, 190, -264, -75, 42, 253, 193, 696, 30, -362, -291, -688, -477, -629, -1, 61, 226, 150, -236, -322, -798, -870, -725, -242, -50, 440, 256, -67, -154, -537, -10, -32, 87, 586, 714, 822, 506, 585, 112, 187, 162, 418, 612, 746, 777, 324, 424, -67, -220, -182, -23, -10, 491, 189, -46, -309, -782, -733, -958, -335, -353, 21, -244, -460, -758, -692, -831, -935, -625, -147, 250, 71, 302, 136, -112, -318, -157, 285, 407, 438, 926, 783, 710, 296, 393, 45, 100, 540, 679, 963, 623, 512, 192, 169, -343, -240, -173, 251, 336, 130, 80, -270, -269, -658, -511, -639, -250, -209, 121, -234, -348, -464, -588, -642, -518, -178, 97, 403, 294]
1432B94o6m26j47J15J39K99K55K56j25p7m37oJ2k4N8O5L22K96o94q7Qm47j6K47
1456a86K29J67N5lk93l09j25ML98K28K2K05k69J20l68j34o3L30J66L43j23R4m33
1479E5n09K52k5K41k52J97J11J11n0m79j24j34K43J06K34M1R1l39k5j92j05J49
1501d03m1N78J13N0l77K36q7l64J65J63L97J66J73k09k82P8k02j83L26L47m5k32
1523C67J53k91R4m94n4J29J17O1K37l34k51r7k75J77R2j90K08M49j78l17j18K36
1545b79j82K0J19K40J11K56j41k05n6l0j8J60L38K69j1J4j68k28j51m2K00OK17
1568D39L02k26k58l46kM8N3m1j58O00j98l53r0K6k42J93J01r5J1K73R1k35l09
1591d16m9L21k09N63j51J43m4k68k0j85M8K66J03o4L20j35oj95j03j96QK89K28
$$ y = [294, 228, -198, -345, -230, -91, 208, 463, 719, 594, 517, 80, 74, 86, 62, 120, 185, 507, 803, 109, 22, 30, -417, -433, -186, 43, 210, 265, 262, -31, -340, -465, -461, -63, 165, 187, 392, 123, 243, -125, -259, -322, 8, 174, 517, 394, 488, 55, -454, -202, -227, 14, -238, -41, 70, 181, 131, -348, -472, -606, -363, -257, -23, 18, 109, -230, -255, -447, -552, -403, -444, 134, 247, 297, -80, 156, 69, -295, -130, 33, 430, 596, 769, 560, 278, 356, 154, -29, 297, 644, 599, 367, 520, 229, 323, -171, -225, -96, 21, 82, 319, -15, -266, -363, -638, -461, -369, -559, -351, 98, -80, -397, -515, -279, -461, -441, -322, -82, 29, 285, 144, -61, -117, -147, -165, -5, 333, 602, 591, 605, 437, 209, 58, 16, 216, 222, 439, 741, 515, 257, -89, -91, -43, 10, -31, -189, 411, 213, -140, -230, -204, -446, -253, -152, -247, -236, 37, 128, -107, -416, -465, -144, -353, 210, 59, 202, 158, -110, -130, -315, -267, -1, 102, 38, 358, 223, 217, 22, -81, -277, -269, 20, 248]
1614B48j54N7o9k07l2k8K3M2L57J0j51j47j17R0p5J70KJ50K73j23j89j21m2m9
1638h2K4Q0l0J77K38l8m21l9m80K83K23J33J40j79L28n12q8k56J22j8L5N71k97
1661h6Q6n8o8l09p8M22J5L10N6J6k86k12m9K54J28Q9J7n6L66l11m4oj09L4J11
1686B32J75j00O0J24l36l12J19j76L15M9p4k38O8o4n9k05Ooj33M62J1j18j17N
1710c12k14J02N9pM12J40q9j85np7J22J69J2J1N19k60j17o4m50P7K82J00J22M1
1734C88j45J6J2j76r6l4m9J54N3Q2k72j70J92k51nq2K68K56k36m4K25l41pm4o7
1759c73M30J89j10J6j44m3j51K33J4k44L35J20Q2k42o5j39J44n4J34J22J13k27
1781A40J15j70P9l88Q3J16Q3J06K40l74Jj69j77K22K61j70L19j89Jk09R4j14M0
$$ y = [248, 94, 151, 82, -125, -157, -185, -162, -120, 237, 247, 96, -51, -168, -78, -153, 17, 19, 169, 442, 319, 130, 9, -33, -82, -58, 22, -8, 169, 407, 369, -52, -91, -571, -288, -65, 68, 208, 29, 357, -155, -243, -499, -377, -395, -360, 211, -86, 0, -58, -126, -435, -513, -91, -76, 234, 290, 306, 20, -192, -241, 13, 141, 230, 247, 191, 557, 246, 202, 196, 87, 121, 232, 407, 307, 367, 491, 155, -157, -38, -214, 101, 150, 76, -162, -94, -158, -217, -422, -416, -422, -555, -93, -82, -200, -317, -312, -526, -424, -365, -372, 40, 180, 91, -94, -99, -176, -54, 115, 127, 138, 657, 397, 280, 216, -234, -157, 125, 225, 347, 388, 243, 259, 271, 95, -1, -35, -84, 70, 123, 205, -67, -237, -45, -296, -301, -383, -115, 141, -95, -139, 86, -255, -262, -306, -373, 57, 246, 136, 152, 8, -35, -186, 47, 61, -183, 152, 272, 354, 112, 47, -92, 52, -2, 132, 254, 367, 140, 255, 85, 164, -224, -141, -25, 58, 164, 404, 30, 31, -138, -315, -93, 168, -2, 317, 128, 129, -80, 14, -100, -60]
1804f0l8l3M43l87L93j66j50k5k4R4k75J07J26J14N8m41j20nN16l71k9K20J57
1827A04p5j24k2k87qK23J21J82j15j80L97m71j7K11N8K30J31j72J36l10M01j71
1849B42k75K27R6N02m63M2l08L0p2O9j89k62M62r7M13l46k4p8l52J25J17m8J91
1872Bm1J24m69j2J17R6k6K96J21k30M45m10k68m2M29l25K15N23n96M21k95K85
1894C60l51M19j24p4J3N6O5j03M4m75R5K74q7k0r0J25m9r2k09j44J70j70L23k1
1918f5O5j06P8m85J67j02M36j86K19p5J03P7j64j05R6J51K1K22k29J02jk88o0
1941a29L23k55J64R7j28j98J62q0j30K42k78j58M98o1r4j48L28k54rl78K92K79
1963H5qj57J92J15n30K05j86K28J47K11j40J50j51k23J45j58J13J32j94L51j65
$$ y = [-60, -98, -131, 312, -75, 318, 152, 2, -23, -47, 47, -228, -121, 5, 119, 177, -264, -384, -389, 127, -244, -273, -53, 104, 29, -95, -117, -404, -412, -189, -68, 114, -1, -181, 216, -255, -272, -61, -3, 227, 358, 186, 322, 12, 413, 242, -33, 194, 290, 792, 329, 371, 63, 93, 21, 90, -99, -361, 101, 4, 417, 71, 47, -31, -383, -258, -141, -189, 2, -39, 85, -384, -396, -279, -183, -209, 87, 208, -22, 423, 13, -255, -297, 132, -193, 22, 545, -51, 370, 75, 360, 9, 428, 304, 230, 243, 299, 364, 261, 305, -170, -75, 199, 112, 92, 2, 127, 78, -14, -223, -367, -197, -367, -44, -65, 0, -106, -28, -513, -346, -448, -12, -198, 21, -54, 49, 126, -38, -143, -47, 104, 125, 347, 118, 220, 219, -69, -129, 194, -61, 103, 200, 72, -126, 36, -44, -174, 68, -210, -368, 130, 69, -25, -173, 155, -99, -108, -486, -194, 85, 77, -80, 112, 227, -303, -98, -284, -56, 91, 302, 162, 312, 161, -62, 83, -75, 38, 170, -24, 327, 162]
1984A62J43j37k39j61K29k7RN5n1K1k29O1K20l29K84j80J94N8N6m05K18m2R0L5
2008C5K40J74m3K0l04J01p2j43M6K24K49j99m2j22j19J97m75K11j15L25l0J6m17
2031b43J49k7j66j52N5P8L32r9j60jm9l1P8R2r9Q5J15l4l0N6l8L5m4J65J75r7
2057A45j50M6j63K95M0M0l2M4l5O7j61j8K07l49R0r5P0l0J88k5j60k54K5l1J30
2082a16J10J52k63K14l60m3J09m6ML6Q8J75n0p2K0k27J60Q0K80j17N4N7K28n62
2106h9j00J35J39j57K26J01k12O4m3j13j4p6K00J70j3l23n4P9N1m5k8J49o9P5
2130E3LJ0n6j02L0J11q5oK19j4o0L8J50m46L00k74J07L17j06j56j34K1q6n1L3
2155a84k19L17O3K3j67r7j21J10K09l4L5K71l52J27K11m18l9K36k2J68K40p3L
$$ y = [162, 305, 168, -71, -232, -3, -30, -21, 34, -17, 4, -225, -164, 56, -273, 11, -169, 25, 83, 139, -266, -48, -90, 0, 35, 275, 449, 406, 426, 122, 223, 151, 8, 54, 278, 527, 328, 286, 164, 45, 242, -233, -22, -137, 188, 158, 174, -243, -94, -121, -287, -439, -384, -306, 26, -73, -233, -234, -283, -314, -236, -144, -243, -158, -43, -77, -107, -51, -89, -54, -98, 67, 242, 145, -5, 41, -122, 173, 213, 253, 221, 265, 230, 297, 136, 118, 325, -24, 66, -29, 41, 11, 199, 174, 14, -240, -215, -246, -116, -6, 146, -117, 97, -263, -306, -197, -243, -239, -203, -115, 60, 10, -62, -42, -269, -109, -29, 251, 134, 188, 245, 473, -89, -189, -54, 85, -72, 154, 255, 43, 107, 64, -49, -63, -139, 61, 231, 218, -105, -159, -80, -29, -74, -102, 47, -22, 53, 56, 66, 10, -92, -62, 49, -36, -42, 177, 163, 103, 141, 291, -155, 145, -129, -22, 295, 189, 33, -101, -80, -166, -217, -184, -403, -86, -23, 0, -167, -264, -385, -275, -66, -100, -65, 206, -146, -19, 192, -226, -265, -29, -51, 117, 357, 284, 287]
2178B87k82J4k64J12K74J00OJ67o4l41J39j97J98j97K35p5j31P5l30k9Q1J62n4
2201a14l51L42O1l1J01k04L8k94K47K24J2m5p6K44l3k24K17mj12L67l47J04R4
2224B16m2P9p4Q8k41M5J53k20J33j08N9j09K28l68K64j67K43k15rJ36q2O2m25
2247c54K41k96K81P1j33J3l4J18j90K72j90J32K1o5j74K55q9J11j1MJ16o3O8l
2271A01%L7pk63J64J73J20j14k66j34K6o4K3L41j49R8Q7k48L6N9k1k38K67n5P3
2296D6Q1j37j24k55M18j99K58Q3k11J08j95L26k55k21L51j97J09K67j85o8j11
2317a11j61M9K92l15K19o4K93k60k78Q4K50K3k12K29k23K04m7p0j1J75P0j4k59
2340a37L11L9j43Q9J2k00O6k53N9J94j03K34Kj83j22Q8J94q3N5r9j29K68k62Q5
$$ y = [287, 5, 19, -245, -133, 141, 241, 247, 414, 350, 9, 148, -49, 149, -48, 187, 112, -19, 56, -274, -303, -222, -60, -114, -465, -123, -62, -93, 8, -196, -158, -452, -205, 19, 31, -14, -90, 154, 121, -103, 114, 110, -2, 365, 18, 122, 216, 174, 253, 179, 267, 26, 71, 224, 4, 137, 29, 88, -21, 207, -161, 103, -64, 179, -36, -45, 91, 9, 71, -354, -113, -409, -128, -57, -190, -177, -211, -93, -283, -11, -201, -69, -48, -113, -287, -32, -121, -10, -21, -17, 99, 36, 104, 101, 101, 138, 131, -132, 32, 205, 325, 211, -55, -189, -163, -227, -204, 137, -12, 86, 173, -75, -39, 20, -1, -239, 28, -27, 46, 127, -10, -134, -389, 29, -170, 88, 171, -40, 68, -127, 199, -56, -277, 74, -123, -14, 253, 68, 0, -111, -272, -223, 69, -246, -27, -91, 202, -58, -336, -252, -2, 21, -191, 38, -185, 19, -28, -98, -109, 66, 136, 122, -137, 174, 213, 70, 159, 171, -29, 37, -216, -157, 37, -66, 168, 170, -13, -135, -47, 147, 64, 119, 20, -109, 159, -103, -18]
2364a8R6j59M2p8P6j58R1J6m2k24J59K0J99j09J9r2K67J2l19J01K46L5O3Lk08
2389C8N76l42l06n0J23m0k1K09J4o9k7l0l10L49j22j22L38k65J91j08l00j52L25
2412a01j01J43j90k9K03K1Oj12j21J76K0J63m6k72L59qk54j1J38l0l3J47k16J66
2436A8j77P1J63l7K2mL2L4j35N0R8l17nJ69J87m2j70R7p9o6oP9j45K49k30M1J57
2463E4K31l96l0J5j4J62RJ25K03l51N0k60L40K5k58k5J15j1j86J03J15k21j33
2486c38L50n9L41j00m54L72j26k58K62J0O1k5J13j07N1k90N4L6R1P1Q2n6j36M6
2510ip4K41q2J35m5j90J59k41K67j25j07J67k26J3L03l18K66N7n7k85j4J29j67
2533b03j52K66K43l89J0o3K72l50K76m3J89lr2k5O1N0p7K29J32k95J37K41m56
$$ y = [-18, 78, -81, -39, -117, -41, -199, -108, -92, -134, -358, -199, -179, 20, -89, -70, -162, 105, 117, -202, -101, 145, 180, 243, 246, 38, 614, 272, -34, -84, 39, -1, -22, 187, 201, 132, 105, 75, -235, 114, -8, -130, 208, -57, 134, 26, -274, -426, -101, -202, -59, -249, -278, -75, -54, -48, -160, -281, -105, -85, 78, 32, -240, 119, 111, -143, -154, -16, -46, -79, 68, -148, 18, -159, -88, 75, 38, 60, 56, 88, 122, -13, 37, 135, -182, -187, -18, 169, 127, -43, 54, -25, -91, -97, -18, -163, 86, -144, -103, 54, 285, -111, -141, -126, -140, 22, 31, 156, 359, 8, 58, -202, 138, 163, -95, -120, -5, -16, -202, -99, 16, -205, -338, 12, -47, 294, 194, -260, 112, -14, -272, -10, 0, 61, 36, 149, 42, 93, -197, -143, -107, -16, 55, 137, 81, -55, -9, -83, 158, 76, 211, 166, -24, 135, -106, 161, 36, -71, 96, -130, -117, 186, -132, 134, 191, 134, -151, -165, -36, -203, -355, -89, 154, -235, -225, -288, -16, -366, -90, -133, 56, 53, -39, -64, -3, 47, -30, 199, 331, 36, 173, 414, -42]
2556d2J26J44k04K04n9k31L88m18K61J6j33j47q3J39k6O1J28q4l07J8K23j31r9
2579b56K0K77j87j73L19o0N2Kj79J94J38j41J54j63k21J00QJ07l7j36L22l06J83
2602A7l09K88k6K22k00Q5r6P0O9r6K15l54L48j75p8K08l29K15p0J1k3K05q4J01
2626B14k94K43qk3J1k00O3j71J81P8mj31l4J05j06M4J79j77q5Q0R2j06j62m2K04
2651d9j9J2Q4j58K60Lk38j11K01j0l9j58M88k76J07l29k2K94n3j42K23k7Q6l10
2675a83K82Q3j48L4K1R5N9l51L16k50JJ80k29O9j04P7N6N1k29oN0N7j40K40q0
2700d9o6p7J66j25J29j66J98q5r1J56qo2k3K40l05L70l15J93R6R0k71r0Q9k8J13
2725G9j04qj66L07j1o0q5M3L0p6J64L8l0K1j04j10ok14M8n5L03qk37J94j05J08
$$ y = [-42, 84, 228, 24, 228, 169, -62, 326, -92, 169, 185, 52, -95, -178, -39, -65, -4, 124, 40, -267, -249, -26, -157, -256, -236, 41, -146, -319, 0, -60, -8, -6, -185, 9, 147, 6, 160, -3, -224, -124, -116, -9, -46, -182, 140, -166, 17, -292, -4, -30, 192, -8, 77, -19, 51, 120, 24, 239, -115, 233, 58, -20, 188, -141, 74, 4, 15, -8, 197, 113, 214, -80, 163, 155, 132, 143, -57, 6, -165, 16, 94, 90, -41, -75, 30, -76, -32, 147, -30, -115, -35, 57, -49, -211, -253, -49, -68, -56, 28, -130, 130, 133, -105, -216, -15, -25, -64, -222, 266, -10, 97, -232, -254, 40, -13, -155, 68, 41, 127, -183, 99, 182, 34, 68, 89, 184, 243, -108, 208, -42, -41, 139, -90, -21, -125, -48, 8, 59, -170, -176, -126, -69, -209, 31, -49, -115, -192, -26, -151, -22, -188, 10, -75, -166, -10, -18, -80, -103, 137, -168, 202, -113, 80, 176, 266, -5, -95, -6, -34, 79, -25, -33, -199, 108, 97, 37, -48, -5, 25, -51, 113, 151, 121, 142, 38, -72, -78, -292, -244, -299, 4, -4, -241, -47, -152, -44]
2751d4q7N6n0O1L7P6j50K4J51n7k52Q9J16J10N3j97L43m16k1J58j06R3m4J24M6
2776A13l63M81k89M4j37J71J70q4l0J9j42L9j40L55j47j6O5j0j73J17j96K18K7
2799I2j36K92k85P4j22K65o2k26J82j52P7K4J43J61n10J64J02j07J19K9o9pk28
2822a80K64o7Jj72m5P9j39J92P1J17q5J20p2k17J73R2Pq4p1N7J69j09j73J11j68
2847a29J56lk39K01P6Q6J44k47l8o9j8R9j66K61j77k82J72J48K14q5k36K63k83
2870a52J98l71K73k8rJ47k04K13K84k98j95K82m70L22K36j77Q9k77Q8K19l92K73
2892E1j42oK36M4k67L05k42J3m3r7K05j36J95j72J26k58K16j64K28j45L9L2M8
2915F6n2o5N7k72M50k68qm0L01j83k48J62K53n71M55J99k57J48k82K02R5Pj31
$$ y = [-44, -131, -75, -125, -64, -27, 49, -101, -77, 74, 17, -235, -146, -30, 80, 133, -64, 279, -137, -158, 0, -106, -13, -57, 67, 113, -250, 231, -58, -14, -151, 20, 190, 106, 76, 95, -47, -8, -148, 207, 60, 44, 109, 99, -74, 43, -153, 65, 92, -44, 248, -37, 37, -85, 180, 118, -108, 74, -78, -1, 23, 166, 327, -183, -19, 83, -24, 95, 124, 55, 48, -180, 84, 17, 18, -154, -199, -120, -259, -67, 4, 121, 36, 156, 84, -133, 40, 132, 139, 55, -16, 41, 210, 101, -72, 39, -129, 27, 24, -215, -14, 62, 148, 292, 45, 7, -62, -80, 19, -147, 114, -63, -345, -173, -25, 189, 104, -132, 131, -152, 46, -325, -52, -80, -89, 58, -146, 67, 351, 53, -142, 140, -330, -8, 228, 51, 140, -137, -49, 170, -222, 51, -91, -97, 139, 183, -84, 221, -21, -8, -51, -148, 57, -79, 116, -56, 70, -188, 28, -136, 92, -53, -14, 18, 66, 14, -51, 6, -266, 184, -84, -92, -132, 169, -14, -262, -100, 153, -418, 37, 236, -21, 127, -155, 47, 142, 149, 18]
2938A8j82O9L28k91L7P1j78K40j93P8m0J96j89n0N1j58J35k52L80p6J03j48K55
2961B04j43Q2l39J67l0J21l8ol9K39j55m4K1r6n7L17l6l33K14j81J30L2r9K89
2985B20l7j62o4j9K16j19q2K13k49j4J16j38J60rM3k0j91K23M8j7Q9Lj19q0o5
3010e4R7K14k31m9o4J98j13j18K34K6j32m7Np2n6K32o8K1k72P5RR6L7j39J90J41
3036A60l87K24k11J81L3l6j9k4J35J02l66J61J92K1j65J86j5l88M60j48k18J24
3058BM3k19L82k89R4l51J06k8L53k7n6l8Q8j16J70j4l39M22j36p8K26k6j32l82
3082c45M35j87J4K5J58j63K6N3l3J6K7j29rL45l31K40j86O2j15l0K64j23j8Q8
3106H4j2l4j34J06L7n8J00j91K31o3o9m7p0J35j0k6j56K71M4n8j96J36r5K30j54
$$ y = [18, -164, -95, 233, -58, -21, 50, -128, 112, -81, -3, -43, 153, -36, -86, -35, -193, -58, -310, 70, -6, 97, -51, 204, 61, 143, -196, -29, -59, 62, 24, 18, -21, 218, 63, 19, 40, -56, -113, 204, 168, -165, 49, -132, -2, 30, -69, 220, 183, 21, -43, -62, 154, 35, -47, 166, -83, -97, 19, -119, 41, 32, 75, 55, -136, 87, 135, 118, 207, 210, 91, 11, -54, 43, 257, 26, -23, -87, 111, -2, -120, 114, 140, 8, -39, -34, -106, -162, 70, 2, 23, -249, -174, -165, -69, -32, -171, 19, 160, -227, -3, -214, -33, 0, -36, -55, -79, 56, 158, -208, -47, 145, 166, 1, 187, 172, -216, 244, 96, -122, 2, 45, -174, 208, -81, 13, -338, -232, -260, 93, 66, 10, -28, 60, -56, 114, 100, -239, 183, 47, -31, 195, 169, 37, -345, 90, -97, -83, -58, 100, -63, -37, 16, -17, -1, 26, -103, -112, 233, -98, 142, -44, 18, -97, -127, 137, 14, -4, 84, 72, 38, -96, 10, 47, -11, 89, -102, 129, 66, -3, -50, -120, 15, 5, -21, -177, 94, 138, 80, -116, 20, -75, 155, 1]
3131AP5J72j97J09l33L17j25q4J0J15q5Q0j34J03J60k72j53P4J71J13J00j27k40
3154a50M77k23Q4l3k76J42j26m0K07l5q5J10n9n0J72Q4l92K04L18k19k09J30N1
3177H2l34L95j43p6j82J00K45k40K29k20l9L91j69j75K20J53m21K42J20k41P6
3198A3J35j63n4l8Jk33M71k1n9n6r0K89l00K86j50j73j03K59n5K02r7R5l32K28
3222E5P9j24L0J38k12P3L2kj11j95L54m2m1j60J19P5j85Qp6P7J91J7p7j00J09
3247C2k69L75p0M1k6Nj85J24j45K54j47K1Q7O2M4Oj15J14J5j94M1n0J94l82J39
3272b9n9K33j58Q9l91J67J86J6k1N3k90K61j64m0J48K2K48p5KK7J18o24K98j60
3296a43k3R5J10j66k67N49j8o7j06J88l98K04m2r4j3J57J23j02k6j11O5J8K1q5
$$ y = [1, 76, 248, 51, 160, -173, 144, 19, -65, -55, 60, -25, 55, -79, 24, 184, -88, -241, -167, 4, 117, 217, 90, -150, 327, 104, 188, 155, -121, 21, -105, -145, 62, 27, -58, 52, -7, -57, 115, 199, -193, 11, 329, 110, -99, 31, 82, -252, 143, 0, -76, -258, -158, 87, -153, 76, -144, -183, 208, 39, -136, 84, 237, -184, 58, 178, -63, 13, 148, -15, -69, -107, -106, -339, 132, 111, 52, -4, -94, 195, -105, 181, 31, -142, -245, 14, -41, 161, 64, 159, -173, 55, 134, 10, 40, 178, -34, 39, 71, 69, -42, -237, 117, 75, 34, -126, -7, 68, -117, -109, -185, -108, 83, 100, 23, -77, 32, -237, 138, 68, 109, 83, 88, -97, 27, -118, 136, -11, 10, 97, 159, 203, 209, 94, 208, 223, 29, 70, 20, 214, -168, -29, -88, 145, -13, 76, -315, -148, 38, 54, 33, 86, -204, 57, -107, -147, 1, 23, 271, 196, 198, 225, 343, -281, 17, -143, -166, -71, 39, -127, -394, 155, 137, 70, -36, 152, -246, -42, -84, -178, -191, -34, 89, -13, -39, -150, -85, -67, -46, -131]
3320a31K76m5k58J03L0J64M3j95o6J64r3j69J2J69J89j08J40Rj28j54Q6j66Q0
3343d8K22M6k38N6m7r0o9J37R8O5p6j16J29j97j17J62P4J50k75L0J14k8m9K87
3367B20j64P7l24J30J04j59J78p6J77j66j21J89k7K76j14R7p03M93R0p4O0k78
3389a15R4M5k45K95O2k94L55j85j03J66l7N8p6m3R5K43j21l29O0m5R7P6N4l9k35
3414a67J43K14l27o0J75q4Ln8J86J75j36p1J71j67l5J24J22j80N7j99K84l11J68
3437B7l4J84r5k08L85l98L37j58K5o0n1J61l61K80l7K34l01K3N6j08Q0J33p1l8
3461EP3j23J6j74M15q3o1l4n2o3J76j14P4Pj69L60l49J80j08jp4j2J83j29j31
3486a88Q6j27L91k89P6K37M4l7j51J66r5j14j1j15M51j69l17K2L94Nj10K7P5j52
$$ y = [-131, 145, 100, -158, -55, -25, 139, 182, -13, -79, 85, -8, -177, -165, 4, 193, 85, 225, 234, 106, -48, 38, -128, -48, 174, 220, -18, 38, -9, -99, -168, -31, 67, 132, 56, -60, 69, -128, -245, -83, -9, 141, -134, -104, 10, -18, -67, 220, 56, 133, -191, -61, 43, -116, 62, -14, 163, -3, -124, 65, 38, 314, 200, 297, -406, 87, 177, 103, 163, -115, -21, 24, -221, 74, 136, -158, 197, 12, -91, 75, 38, 96, 20, -23, 72, 315, 194, -135, -75, -120, -23, 53, 107, 68, -167, -24, 190, -137, -197, -22, -106, -103, -161, 25, 200, 64, -7, 164, -3, -38, 86, 208, 28, 85, -114, 170, -141, 27, -7, 177, 82, -126, 259, -139, 198, 40, 65, 5, -46, 115, -246, 34, -3, 231, -70, -47, 9, -99, -19, 114, 43, 5, 78, -45, -29, -203, 212, 129, 68, 34, -18, -81, 95, -19, 55, 62, -107, 253, -96, 84, -24, -25, -99, -111, 72, -57, -188, -102, -229, 162, -127, -51, 186, 230, 193, 42, 208, 113, -1, -12, -127, 324, 155, -162, -140, 254, 259, 149, 176, 251, 99]
3510I9J54l54q6M05j91K19l90j42J06M26l26j60L47m08L60L0l5n8q9l0P5J4J45
3533A11k41q4J43k1k4J12l6o2J12m9lM1K56m78J77J52j7q1M0l7Q6l29M66M1k36
3558C9Q5j52j35K72K9m2j33k2r6M5l5J67O8k77J9J62j5l30N24j63M2l01P9J83
3582A3j56M8NJ96p4o5j48K86J15j10k22J07J63l4O8k33p4J17J73j59k99L07j26
3605a02j18K9M2K37Q0l31l1R0m4K7P3J34J54l93J45J26j08j03L01n8k56R6k01
3628b11J67J69p3j23J22k92K16r7K54l62mK64Q9q5j70MK30j60q3L6K12j67N1k54
3652b67K09j18L3K44j17J10k25K11%N1k76J54K55k53R7P8j22j29q8K49K0L0j78
3675c2k0J23j52K01K6j80J67l47K23n7R2N5j79K16k68M8j6kJ0N2l5R6j56J97k59
$$ y = [99, 253, -101, -187, 218, 27, 246, -144, -286, -180, 246, -80, -240, 107, -301, 59, 89, 54, -4, -93, -123, -48, -34, 111, -130, -214, -71, -92, -116, -4, -40, -102, 10, -39, -42, -1, 255, -223, -46, 106, 89, 8, 48, 11, 97, -232, 234, 275, 39, 124, -28, -163, 109, 138, 96, -37, -59, -155, -110, -145, 22, 90, -187, -168, -6, -21, -351, 173, 10, 52, -249, -170, 13, -143, -95, -90, 106, 32, -33, -181, 105, 220, 110, -112, -5, 158, 124, 192, -41, -115, 2, 175, 16, -283, 24, -102, -220, -191, -149, 88, 168, -163, -194, -104, -148, -121, -48, 86, 240, -153, -8, 118, 10, -93, 208, 150, -106, -10, -211, -44, 125, 52, -71, 51, -241, -25, -122, 132, -230, -234, 30, 119, 34, -136, -132, 98, -62, -145, -109, 103, -64, -13, -267, -58, -176, -143, 101, -16, 94, -131, 80, 80, 131, -145, 9, 264, 11, 108, 186, 64, -65, -153, 96, 116, 146, -32, -52, 71, -81, 120, 146, -34, 133, -214, 9, -48, 44, 99, -80, 136, -132, -84, -100, -102, -92, -40, -75, 21, -135, 62, -197]
3700a97P9J54k9J4k5j35K1J44n4J43K69m99J52r4Q9o7k40L54J24k95j30K52m3
3723a3j45J65q3j9K87l61J98j64J49J35k21K17m31J55L9Q5j38J58r8p3K07j38
3745h9L23j97K7r9m1J06K85m01P2M1Q8n53N21j88J03m2j20K28p1l81K39J77l3
3768el6l2Q6m2K23k40QJ25p2q5J15l55M45k32Jk6J7k0J63O8J76j60J22k84K24
3793A84j98j94R9L65k36j98J18Q0p6l0K9q7K01k52N8K69o0P3qj99J25om3k85M32
3818A61k5j12m1J68m3j02J29p5J96j09P4m07L63P4k09j48J83J69m29K64r0j20
3840a29K50n8J4j42J69k13J65Pj48k3R3j88o3O77n87J36O6J09L7j33p4J60k96
3863a71K95j51O5j57N4j61J81l8L6j16JR6o2R8j56K54j20mR1K64l84J46j09J75
$$ y = [-197, -118, 36, 7, 21, -4, -139, -118, 26, -28, 115, 384, -115, 37, -57, 32, -35, -275, 79, 203, -92, -222, 30, -13, -158, 7, -76, -95, 192, -169, 29, -135, 14, 149, -72, 145, -286, -131, -92, -7, -145, 13, -85, -158, 49, -89, 234, 37, 64, -35, -76, 30, 315, -86, -14, 27, 115, -438, 83, -105, -2, -44, -164, 64, -7, -388, -149, 28, -5, -41, -73, 13, -29, 194, -46, -38, 87, 15, -70, 45, -310, 135, -97, -96, -122, -105, -125, 38, 106, 282, 122, 244, -40, 184, -14, -208, -109, 256, 20, -178, -60, 20, -56, -86, -57, -144, 57, -195, -137, 132, 72, 145, 137, -62, 63, 57, 14, -271, 161, 136, 24, -17, 151, 108, 6, 135, 60, 256, 147, 221, -186, 177, 251, 42, -106, 77, 246, -183, 81, -9, -129, 121, 63, 77, -65, 104, -109, 56, 63, -85, -108, -15, -203, -266, 411, -176, -40, 26, 135, 172, 39, -35, 125, -171, 124, -27, 38, -119, -65, -226, -45, -83, -47, -163, -162, -66, -128, -30, -186, 68, -52, -56, 35, 299, -85, 61, -48, 127]
3887A27J21m09p9R5M41k64J31k09N8%J62j66j48K98j66P6JJ4k8j02J30m1l2J3
3911B3m17K40%L06k21L4j0l0P3M1J0Qj61K35l3l91N11q4J31k83l6j05J66K05k04
3936HK37l29L66m32K93l16K56J7k8j23J05J59j91%j02J36o5j09j03M64k49m9J32
3959G7m9o5j99J75j9K07j96R6j11K67m26J08K70k29p1J33r9Q3k7Q8j60K56J37
3982B46j77j43M1p5M4J63j49l3L4k3J23K33q7Qk35J60k05J80J05k60P0J36k82
4005a26J30q0J41k34K06K7Q0OJ05m02K63l95L71p1j80J30J81o9q9R8j00p2N1J69
4029A40k82J04R7j64L04k36N7oJ64j92j69K42k9J1R5o1J28k30P5p4L6j8L28l71
4053e1L0J07N4l14j2M28k10K6l5N4l95M53m54L73p4Kj79J37L8K70j38k36J25j96
$$ y = [127, 248, -161, -240, -145, 296, 32, 163, -46, 12, 12, 174, 8, -140, 158, -8, 68, 69, 83, 55, -47, 83, 42, 10, 23, -394, -154, -154, 152, -69, -35, -45, -75, -2, 39, 49, 57, -104, 131, 98, -293, 218, 134, 265, -18, -54, -159, 7, 212, 8, 245, -84, 282, -150, 143, -173, 83, 100, 72, -51, 54, 213, 22, 22, -80, 56, -9, -118, -221, 243, -6, -55, 77, 28, -37, -236, -61, -80, 127, -69, 27, -84, 183, -243, -135, 135, -94, -165, -32, -131, -48, -75, 13, -147, 109, 246, 69, -74, -33, -108, -64, 99, -50, -83, -49, -72, 51, 284, 197, 205, -30, 130, -75, 105, 210, -50, 20, 156, -126, 4, -76, 65, -169, 37, 64, 144, 150, 255, -147, 116, -279, 92, 21, -159, -29, 152, 83, -6, 92, -8, -80, -29, 140, -142, -38, 59, -105, 199, -37, 20, 14, 178, -14, -183, 59, 30, 41, 136, 75, 203, -27, 48, -26, 10, -8, 320, -51, -21, 86, 140, -174, -186, 242, 32, 58, 23, 77, -318, 135, -319, 54, -20, -18, -197, -60, -22, 248, 110, -126, -1, -197]
4077a97J64kn2J89q7m6K44r7j34J02o9k01J92k0O8N8o2k23N6J05r4o6J20L53k32
4102F9j40P4N7J6k2k58L18j07r2M16m66J78k42K06r7J27n6NK30k52p3K0L4Ol9
4127h8J83j75N8%j4jN7k5R6k54J86K5J44m8j44j43J41K58l07n8q2K16L7j09n0
4152i7N0J56l1kqJ43l62K54m7K4k09K24J49k59K61m18m9L33q8l9l6J50K10k96
4176A3L9k45L54K2q8l3j33J74qpk48Mj68O99m31J75j33r7MJ73j72k39N01j59q9
4201i2o2K17l53M83k12m5M6K70M3k17j97J98O0J08j69j50J88j56R4m9K3k41L48
4224A35j65J88j59m3R2q2k7J00n2j04J83j38J82j39J41j07p8K67n7m05Q8P3P2
4247c5L8Q2N8l16J2mO5K46M3k49J35q3o6J21j85Q5j09J76m4M5j56J14M4P8P2j39
$$ y = [-197, -33, -35, -87, 102, 15, -31, 213, 116, -18, 84, 15, -186, 6, -14, 54, 112, 50, -173, -117, -12, -106, -172, -52, 301, 69, -71, 3, 60, 76, 54, -204, 114, 7, -85, 331, -135, 43, -199, 7, -90, 37, -19, -14, 216, -36, -109, -89, -55, -49, -88, 95, -80, -22, -22, -36, -37, 20, -5, 91, -163, 23, 48, 192, 144, 0, -143, -2, 256, -51, -109, -191, 25, 62, -47, -97, -47, 109, 78, 76, 68, 211, -151, 103, 56, 80, -129, 95, 244, -15, 246, -172, -221, 112, 24, -15, -51, 99, 309, 13, 52, -193, 161, 183, 95, 62, -71, 103, 95, 88, -160, -156, -324, 375, -56, 119, -14, -111, -107, 66, -106, -345, 156, -3, -92, -154, 63, -290, 193, -19, -64, -18, 252, 295, 78, -119, 79, 139, 247, 78, -72, 116, -40, 54, 5, 28, -213, 135, -30, 158, -1, -44, 48, -34, -61, 39, -13, -117, 66, -72, 110, -29, 112, 5, -73, 194, 137, -268, -180, -107, -35, 3, 85, 143, -173, -161, -165, -100, 146, 189, -60, 75, -8, -74, 47, -138, -53, -162, 14, -30, 15, -141, -27, 17, 95, 167, 28]
4273B8j36K94j06j49Q9o4N5O4j7p0J23l5Qk1j46k8J52k4qrJ86j93N5K3k33L49
4299A87j01j73K09j04L6l8j06L4J2J04j41j90M00r8k29QK30K26l75L88j77j03
4321aJ47j21K19j79k29K37j10j43J05J34j68m3jK98k07J12O2j78J51j28m3K36
4343A50k17J95j99J08k2o6J16N6R0j19k2j76L67m83K51l18N6N63l34q0J10k65
4365b39K64J20l5j85J11j03J95j7n9K2P7k58J26J57n6r0J85r0k48J56l0P6J2l8
4389E3J25j87p4%R9O9j30lO3J19K7j74K09j41j05j23L4K16J03l68M06k84m1O9
4413c8p4M27l87J56q2L3N3m5j2J50l26Q1Q1j9j17K74k69K41n5j06j95L01M6q0
4437C8K03k58J12nQ0P2k79J3J16jj37jJ54l25K19j62K62o5j39L31l12p3J79k32
$$ y = [28, -108, 186, 80, -69, 20, -44, 11, 75, 58, -12, 111, 76, 84, 63, -83, -111, 41, 17, 9, 0, 186, -7, 48, 71, -162, 187, 86, -87, 122, 18, 54, 16, -90, -56, -44, 60, -81, -271, 129, 31, -198, -190, 40, 266, -109, 279, 102, -1, 146, 25, 244, 65, -164, 73, -37, -180, -75, 59, -109, -152, -153, 145, -62, 50, 112, -66, 85, -43, -86, 150, -67, 128, -71, 37, 15, -51, 65, 121, 211, 92, 70, -106, 261, -222, 29, -289, -233, 330, -4, -84, 26, -239, 25, 145, 110, -75, 36, -67, 128, 111, 52, 74, 151, -107, 19, 176, 120, 30, 215, 125, -123, 33, 3, 79, 91, 53, 178, -9, -83, -83, 16, 85, -45, -48, 15, 134, 161, -13, 196, 55, -50, -173, -139, 77, 180, -188, 218, -66, -107, -38, -112, 315, -72, 84, 2, 35, 88, 43, 31, 181, -145, -64, 17, -2, -119, 155, -114, 127, 72, -34, -229, 72, 118, 38, 241, -17, 95, 90, 170, 242, -37, -24, 92, 91, -46, -47, 107, -218, 1, -161, 101, 36, -103, 228, -84, -157, 22, -210]
4461b10K40p7k37K78j91O3J82rL1K4k4j21J5pp8L25l74j8j70K46r1J32kJ4J57
4486I8j73p1R0J27K4k56K33j51J16K3m0j54J35q9K86o5Qr8o0k0K5j27L19k24R8
4511E4%l0L00k14p8lJ47l00K01j03N3r4j27Q9n7K54K3r0j6k8j9J26j29J24j55
4536g2P5qm4P4l4N9j79R4J54k43P6K7J73k70J83Q7k06l2J03p5K70j45j75K09j32
4561c1J12l7j78O07m19k40K15k21K32M2j67l46M75j88K43K5j95qJ85l80L23J60
4583B09k63O6j19K45k13J26K9Jn9J49J1k26j06K24l9J24j41J0j02K45l7j64K49
4606B19j04J13Q1n66K55M6Nk15M11Qk30J52L8Q2l37j1R6k60L91q3k56K28l24L46
4630H5j94K95j07k51k06M14L9m5p6K76m93J53J84p6M4M8j18r2K62q7J43m57L44
$$ y = [-210, 30, -47, -284, -6, -197, -134, 48, 39, 70, 94, 70, -51, -36, -43, -121, 204, -170, -188, -358, -112, -203, -71, -73, -59, 98, -75, -146, -56, 71, 95, -161, 72, -79, 37, 60, 20, -134, 1, -88, 198, 133, 141, 43, -17, -37, -12, -139, 180, -44, 54, 54, 24, 324, 110, 32, 29, 176, -124, 77, -26, 27, -67, -194, -105, -162, 92, 115, 25, 9, -19, -38, 88, -41, 83, -72, 3, -5, -49, 25, -9, 50, -129, -35, 119, -124, -48, -21, 152, -118, 65, 152, -54, -86, 17, -58, 212, 67, -108, 101, -31, 81, 44, -134, 473, 54, -186, 29, -192, 40, 82, -85, -431, 44, -144, 99, 124, -71, -79, 106, -274, 49, 209, -54, 12, -107, 138, -75, 51, 80, 81, 22, 171, 182, -44, -150, 74, 35, 159, 18, 28, -74, 171, 134, -30, 219, 115, 228, 309, -257, -2, 44, 49, -166, 245, 253, 23, 175, 213, 295, -42, -53, 43, -217, 174, 91, -165, 63, -261, 85, -109, 186, 79, -172, -378, 36, 75, 30, -46, 230, -263, -110, 74, -2, 42, 90, -28, -120, 142, 55, 198, -259, 85]
4653H5k51J06K47j92j0l6J9K55q6j5k09K03p9j00R6J3o5J0R1N7j13l1j1o9L4K23
4679A72n2k03J93j02J55j51k41p5K77L3Q7k67N7K71l29L32M4j68J37j71p5J20
4701D4P8j06j31O9j14Q8M01k48k01j52L43j29j47L76j08r3J19J29j58p0Ml6J45
4724A03j8j09J15j58N2J41k4j75J22K9j1j40Q1j13P4L7J52k69L9r3P9J82q8Qp7
4749f1R6J06Nk87K68j04JM6l62M79k33J08k25P6J41J27j57j21J48q4J98n5k51
4772a41L94j42j74R8j52J4J20K24k63J81k49r9J02KJ59o0k41L67m7p0J2k17M07
4795B25r7j66n8K68k69L35k52J9J0j0q3J00k7j2K0m21N73j66K30k76J6k8Km1P9
4820b9j73L55m5k13K27J08j15J84m96k53M85J28J5O4o8k11J18o8Ml41L01K40k70
$$ y = [85, -166, -60, 187, -5, -15, -51, -32, 223, 137, 122, -87, 116, 37, -63, 33, 46, -19, -9, 82, 139, 26, -5, -16, -85, -51, 172, 120, -83, 110, 8, 163, 12, -229, -304, -27, 6, 93, -174, -117, 154, -175, 157, 201, 33, 170, -1, -76, 44, 122, 16, -115, -46, -160, -72, 329, 81, -120, -272, 71, -58, -205, 171, 63, -30, 89, 218, 60, -10, -6, -42, 103, 85, -24, 91, -67, -15, 126, 102, -73, 49, 78, 67, -73, 8, -105, -31, 6, 158, -111, -72, -165, -86, 96, 8, 16, -61, 35, 141, 146, -141, 127, 23, 24, 70, -292, 187, -46, 62, -163, -87, 54, 181, 24, -97, 51, -33, 165, 110, -141, 253, 111, -63, 35, -117, -103, 17, 241, -22, 159, -90, -189, -87, -85, 74, 14, -227, 140, 93, 23, 35, -182, 225, 128, -38, -96, 172, -97, 238, -14, 5, 15, 5, -78, 22, -5, -17, 3, -418, 155, -11, 219, -57, -41, -69, -67, -108, -29, -202, 153, 108, -105, 122, 230, 115, 299, -197, -450, 35, 163, 178, 242, 174, -37, 81, 13, 17, -324, -23, 217, -53]
4843e3j11j50K93j2K09k36j46j5L23k54O9K98k63N2m6m7J28r8J07k08K33M1l13
4866a99J42J52k39Q3JJ17J37j94K03r2j64J69J73m56J95R0m06N57j56L0k1k79
4888a57K46Q6j85Q2r3k0p5K82k97J87j29K18k97J23nO7N7j03j39o5k5J74K5J40
4912I7m2m00M07r9L4j82L55j65j57mJ93j57J95J06k81K8J19J03k7m24K89n3Nm6
4936a06J36n3q3K13p8L7j74n6L29j86k2M9P7l65L78k57J09J28l34R9R9O2O3j31
4960f6O6P6j70L9K76l36N6O9j96L39k91N4R9m19N48q9N8l13R3N0p3J02r5r5Q2
4985a36J65j49p4K32K73k42j85K22OQ1k26J26nj62J3L5k08L80O3k94L20k55p9
5008i9K58k71J51k6j29K8j06P4L38l90O6Q5j01r4j00K69q0J85j53M5m6m1K23J24
$$ y = [-53, -164, -314, -21, -33, 176, -60, -206, -221, 102, -152, -83, 215, -48, 4, -42, -89, 39, -59, 48, -160, 73, 114, -199, -57, 95, -144, -61, -60, 57, 194, 0, 203, 111, -53, 116, 289, -167, 28, 118, -288, 269, 113, 143, 122, -157, 89, 175, -10, 72, -21, -41, -116, 166, -131, 56, -73, 145, -152, -29, -34, 33, 90, -13, -152, -217, -242, -68, -43, 97, 55, -345, 62, -37, -3, -185, 170, 5, -152, -156, 37, -120, 75, 181, -100, -72, 47, 150, 123, -301, -12, -65, -60, -106, 30, -23, -106, 107, 29, 66, -108, -164, 165, -21, -43, 6, 83, -282, 96, -161, -52, 76, -258, -159, -60, 2, 65, -66, 0, 76, -94, -55, 221, -115, -59, 10, -186, 153, -138, -84, 15, -404, 144, 55, 113, -200, -107, -57, -130, -28, -123, -218, -136, 29, -120, -194, 38, 311, 69, -116, 106, 112, 193, -33, 93, 88, -74, -61, -26, -234, 146, 209, -85, 235, -20, -99, 159, -112, 39, 13, -116, -88, -194, -120, 218, -172, -106, -21, -122, -216, -316, -47, -127, 58, -95, -50, -96, -137, 86, 210]
5032B10j08j67k23J54J02J26l0J1k27O4J25p7J38J5m79K97K44o5k42J83k00L14
5054A65k8k73K61j7M1L5j21k73L21N3r7o4k31K79o8LPk71K23J20j33M1K9L0Lr0
5080e5j46K38k73K25M5K23j77j17J01j14J42j11j4L4j29K21j75M7k7J40p7J03
5102A04j07j08m4J64mJ05m6m2N2k51K20k5o7j74M12p6O6k07R8l7j22J97l3k47
5126a72J96Pp5j90K91R7j43j1j02j72J44J17lK54m01L17j55j41K09j21j62K41
5148B5j67L07k7j90J72J11l45J03K72l00o9l7J92j93n8K23nJ83k37J13n5J7j41
5171a06L08m17J33j07K96m24M62Q6m91M39k24J3K8J7j16O4j51K03m0K81l39Q1
5193dj8K23k29q2J53J18q2L9j64L5J69j18r2J32K16j47l35NJ67J50R3k96K70j75
$$ y = [210, 102, -65, -288, -134, -32, 94, 64, 75, -152, -88, 37, -40, 98, 113, -366, -69, 175, 110, -132, 51, -149, 165, 137, -136, 125, 108, 149, 184, 63, -210, 111, 164, 67, 3, -228, 51, -17, -14, -7, -278, -55, 65, -68, -27, 2, 32, 35, -55, -201, 37, -236, -11, 34, 257, 80, -37, 64, -50, 92, -19, -33, 1, -128, 93, -82, -35, -62, 78, 1, 104, -3, -111, -155, 9, 5, 110, 64, 22, 74, -177, 43, 18, -49, -223, 189, 113, 179, -28, 70, 33, -89, 108, 75, -172, 24, 31, -44, -234, 57, 154, 11, 0, -102, -274, -130, -13, -16, 238, -163, 154, -1, -142, 67, -54, -216, 25, -142, 165, 138, -52, 120, 231, -114, -11, 261, -39, -108, -145, 47, -146, -204, 19, 14, 197, -40, 73, 18, 35, -106, 202, -215, -82, -189, 107, -317, 145, 231, -260, 179, -45, -32, -4, 13, -103, -39, -190, 13, -27, 254, -85, -4, -22, 201, -28, -110, 43, 161, 79, 118, -46, -11, 158, 40, -52, 80, 296, 149, -186, -181, -14, 136, 229, -67, 203, 28]
5217B8M0j38J93J21j93l10K43N8j67J70J62k61K28j12N4j62J1l8m0K1o7J48j16
5240a27N2J37r5J42m08L93k51J42k8J78N8k13O7j14p0M5M7j9P4j10J73n2qp3j94
5265b54m2L11q2k5J48l8n3M3O5q6n0K45j82K18q8j19M9N5r8Pj70Q6k3M8j01M24
5291B88p1m36J20%Q0J04l8j8N3J8l08J48j02J60J4q0K5J90k32K26j86j03J85L8
5315G5j68K19M5j42n2J52n4k3M2L7k93J36j30J07l7K00J0q6j68J77L9o2k9J58
5339A53R4m4j97J88q9j27k9k8K76k62K30j29j09O9Pj63L96k66J02j21J6k74K67
5362d0k3J26k5j11j12L26k46K16k45K37k90J64l10M83k74K70Qk38O1q8j81K57
5384c5k05N1R1l3J42k0J11k7o1P3l92L72J50l52P0J01j9L3k5J21k34Q0J73l63
$$ y = [28, 68, -70, 123, 244, 51, -259, -16, 42, -125, 45, 207, -54, 174, 62, 116, -46, -35, -73, -113, -92, -159, -11, -127, -75, 62, -33, 109, -299, 94, -157, -15, -43, 135, 193, -20, 47, -67, -137, -92, -45, -64, 10, -100, 73, 21, 13, -60, -254, -296, 15, -67, -92, 56, 18, -35, 8, 73, -13, -63, 182, 0, 218, 130, 11, 60, 115, 17, 24, -146, -60, -83, -35, -136, 288, 217, -219, -99, -99, -19, 85, 47, 29, 82, 100, -208, -60, -162, -2, 12, -68, -43, 147, -85, 141, -45, -148, 37, 75, -93, 126, 171, 29, -23, 129, 75, 52, 94, 131, -162, -26, -156, -49, -86, 114, 124, 38, -130, 47, 86, 24, -5, 153, 247, 203, 6, 194, 105, -22, -51, -79, 197, -65, 165, 36, -73, -4, 3, -160, 236, -30, 72, -49, -33, -307, -40, -63, 63, 38, -73, -185, 141, -105, 111, -134, 103, -187, -23, -333, 150, -124, 146, 154, -84, -23, -111, -292, -35, -240, -189, -98, -131, 11, -9, 102, 75, 14, 87, -305, 67, 217, -135, -65, 36, 17, 50, 25, 146, -88, -8, 165, -198]
5408a98J06m8R3j8q3L49k13Q5J41j14m8O8r9k00L63m42K68M4L7j34J14j04J6k3
5432d0Rk91K81K27j88J17j94n1m0J70mK20q5l46N7J32O4Oj66Q5j09K17p6J92j52
5457C5p3O5J9l5k6n3J16R3k93J88l51J85K04j48O3m6K43k34K26k10j9J57p9J86
5481B13l24qj47M43k71K0K3j30M46k30j84L38p1j25j81J86o5Oj13J51J45j21j72
5504a71L65k20N2j7J4k92K95j48J86n2J0J72m8j10j82O4j77J86k38M33r4N7k98
5527b13k9J94J04O3j90k7O4k10K84l6j25K99n01M10r6J63l47J20L78l74O6mj12
5550a19kL03k42K09j41q3J08j4J88j45j61L89j62K3j84J94k90QK56l49K83l6K8
5573F1K3R9k35Q1m2L2n7J11M1q8m5J57l47L54k81Q4K43k64j22K02M9L9l6P1k94
$$ y = [-198, -92, -140, -47, -65, -148, 201, -12, 73, 214, 100, 52, 120, 21, -179, 184, -258, 10, 54, 91, -43, 71, -33, -17, -40, -31, -322, -41, 186, -2, 115, -79, -130, -170, 0, -4, 216, 131, -215, -158, -26, 38, 44, -122, -37, -146, 71, -5, 187, 35, -38, 27, 46, 11, -15, -68, 48, 141, -152, 36, -315, -130, 74, -74, -11, -57, 186, -48, 178, -32, -51, 106, 27, 213, -111, -119, -266, 177, -94, -74, -51, -181, 265, 35, -149, 189, 118, -7, -188, -2, -67, -61, -174, -23, 122, 1, -171, 194, -26, 26, 9, 23, -269, 26, -122, 64, 12, 22, 194, 146, 36, -146, -82, -259, -73, -311, 122, 28, 85, -213, -242, -48, 56, 119, -71, -98, -34, -244, 40, 4, -121, 178, -323, 87, -9, 154, -193, -73, 305, -69, -3, -7, -119, -121, 182, -60, 149, 8, -75, 33, 19, 207, 62, -99, 290, 128, 151, -33, 161, -129, -121, 135, -214, 69, 33, 61, 84, 183, -52, 29, -13, 19, -38, 73, 114, 26, -19, 138, -209, 145, -136, -52, 191, -73, -195, 7, 56, 95, 59, 130, -164]
5598a64J74j8K3J39l24Q3J76k90L88m22K60J9J47j56K3L3J00p3l86L33J29k30
5620c6j02L18j45N5j41M47l85r4M0j04K82r1K7j19O3J60k72J62j36J58j26P3n2
5643a8k48J60J05k04J52L23l74K55l31Q3J40P8j57j10J41k28K99k36J50k19K70
5664C1J49l21L11o2n4J18k47J36R3j90J04pj92J50l4R6j11J39j03J74k0p0N6o2
5688H4k72K37q6P5J38j20j17k6o1p3J48K7nK03j01j18K19k3J51l68pJ41j71m5
5712a70L54n92L24Q0j7J63k96K83q5j91J40k20J60L39m80J44J1J02Q0K4j17M8
5734H4p6n5J87k47K42j70m8J72N6k36M2K3M4r3R3k2J05k38K81q3k68J86L4q2q2
5759a51L16k66K02P2j77J19j18J05r9j21J27M4M0J79j18k56J61j20K3n5K26j97
$$ y = [-164, 10, -8, 15, 154, -170, -87, 89, -201, 187, -235, 25, 44, 191, 35, 58, 91, 191, 118, -268, 65, 194, -36, -138, 180, 35, 90, -51, 396, 11, -83, -43, -147, 135, 44, 71, -48, 15, 175, -97, 65, -71, 87, -39, 34, -18, -266, -106, -1, -205, -53, 270, -104, 151, -180, -97, 43, 121, -36, -146, -5, -233, 66, -170, -20, -239, 31, 180, -141, 170, 108, 54, 172, -75, 61, 154, -36, 68, 61, -131, 19, -15, 81, -30, 109, 6, 180, 160, 90, 146, 84, -188, 49, -37, 38, 176, 56, -61, -87, -148, -221, -73, -46, -51, 152, 51, -67, 152, 129, 280, -88, -95, 46, -125, -170, 184, -408, -84, -4, -21, 142, -154, 129, 44, -147, -7, -227, -67, 272, -208, -64, -53, 49, 129, 153, 36, 84, 8, -47, 140, -107, 135, -35, -83, 89, 145, -91, -49, -26, 18, -75, 18, -4, 101, -137, 144, 61, -207, -21, 13, -69, -151, 165, -101, 101, 173, -4, 115, -3, 102, 3, -118, 9, 53, 93, 272, 154, -102, 59, -61, -38, -93, 133, -64]
5781f4k41K82J22J95j53pj44P7j1pj79Q0q9P4J21m9j55K12p3L5R4j09j13Mj6M5
5807f9J4L4o6K70k33j00J78j92J42M3K1R4j18J95l50K24m3N9L3k63J61l5N9j58
5831a00J74j34M45l20k55J30R6j04M1j16o6J65J06j95J32k71L13j43J80j21Q2
5852C9j50j10L56j07l2K48j92j16K84k22l1J47k09J15k7J67k5k02N9L6L0Q6oj43
5876ej34J96Q8j15LL3m1N3r0Q3p3J02N0M7j75n4k9J40J52K2m04J72J65m08L10
5901H8j15K95l62K26l59k1L46k42M23l51J18Nj45K88K7l19R1K06k14ML1j50j16
5924b46p5N45l07n2Q2q4Q4r6M01k60p9K03O8l6k58M56k18j26j00o9j4L6K13j22
5948e4R8j34p6K25j01o1p9J13J16k07L0jK18k83P9J22r0O6K99m39l1K12k08M65
$$ y = [-64, -305, -23, 99, 294, 141, 134, -10, 67, 56, 49, -130, -50, -139, -65, 56, 7, -148, 64, -9, 26, 120, 11, -102, -98, -114, -69, -55, -21, -87, 183, -50, -150, 28, -164, -22, 21, 42, 136, 18, 213, -137, 87, 44, 103, 136, -127, 34, -1, 58, -100, 74, -60, 385, 65, -190, -60, 36, -68, -27, -143, -209, -44, 62, -133, -1, -272, 41, -102, 78, -43, 39, -111, -221, 135, 28, -4, 244, 52, -64, 220, -2, -33, 114, -95, 20, -7, 160, 135, -67, -8, 28, 58, 144, 138, -5, -139, 57, 145, 30, 33, 66, 25, 78, -12, 71, -2, 100, 150, 197, 22, -32, -61, 79, 231, 253, -151, 21, 186, -222, 88, -27, 268, -94, 132, -227, -248, 98, -144, 279, -72, 46, 51, -94, 194, 221, -98, -7, 199, -15, -11, 20, -130, -246, -321, 224, -83, -135, -53, -137, -53, -149, 252, -8, -87, 116, 184, 148, -110, 346, 128, 2, -98, -167, -181, -145, 68, -54, 44, -90, -166, 59, -42, -103, -182, -69, 47, -160, -130, -131, 87, -196, -117, 5, -85, -19, 280, -159, -190, 22, -186, 279]
5972B79k19q4J15p5M5m2j90J42J69j35k69L33k04L14k52k9o6L63q4j57P9J29j08
5995E4r5LJ08o2r3q6K60J64Ll08J06n6j39K78k25r0K50l87L81j02j07J33J00Q6
6019A76r8q3J64L3k14k47K80O4J11j54M7r0J35k29J88k4k18J38j00J13j10J52
6041C4J07r8j85K69k05k07J66J53O8K8j86J04R3%m0K7k6L6k54K95k76J12L4J17
6065A66l03N7J49K3M8j67J24j38k67J70M13l57K33j52JlJ30r0K38m83K18o2L13
6088B61l10J69k79K03l37J48QJ57j29J98j68Q4J07k0k26K68o1l38K92k90K31r
6110d1P8q3L39j61j86P8j38K07j13KJ69j27J43k37L0O3n9j3j89L73j38N9k50J21
6134g3L9O6o3p4R1j30L74m13k6Q3L65k6r3j58J8o5K94l18Q5K05k0k38K5J72P1
$$ y = [279, 60, -24, 91, 16, 61, 19, -171, -29, 140, 5, -264, 69, -135, 179, -73, -102, -168, 195, 111, -46, 33, 162, 54, -41, -38, 70, 8, -85, -171, 89, 253, 256, -52, 54, -2, -141, 137, -88, -178, 72, -315, 66, -36, -143, -10, 90, 176, 78, -5, 159, 192, -22, -269, 11, 75, 186, 32, 79, -11, 124, -105, 83, 59, -159, -21, -121, -8, -118, 34, 141, 43, -142, 127, -78, -285, -119, 34, 102, 130, -56, 48, 141, 141, 101, 128, 102, 138, -116, 179, -97, 15, 49, 166, -137, -80, 69, 92, 140, -27, 97, -41, -308, -138, 275, -82, 151, -1, 0, -3, 127, 37, 275, -208, 10, -52, 261, -49, 120, -159, 44, -293, -145, -137, 20, -109, 89, -79, 5, 112, 92, -134, 134, 73, -265, 27, -263, -32, -41, 37, -46, 293, 132, -54, 24, -114, 93, -20, -18, 151, 24, 167, -70, -40, 23, -36, -49, -238, 135, -3, 56, -194, -73, -34, 32, -31, -105, -14, -144, 230, -183, -209, -126, 239, 213, 120, -38, -20, -85, 209, -109, -24, 181, 161, -77, -52, 120, 191]
6159A91l78K53p2n9J42J1Jl9n8n17N20J04J79l01M3O7N9rJ9k45J51j22J0R5M4
6184H9r7j84J27K63m20J27J58p5J62k20L9L07m14Q7m9k1J17L4p1K00P6l21P3K75
6208B62q7o6j49P3M2l7r0M6j29M66j67j96j38M06l07J79k96K97q3q8J36j46J91
6231A19k08M45k57k08K41l0j70J25j2R1l71K10O0p9o3qKL3m0K47l27J80k92N13
6255B01j21q2j65J98K54k45r4j89K43jrj09R9L6k5J53r3Kj39K39n31L06%J15J30
6280A73j60O2k65L90k66R8j90O5J36J18k91q2M42j55j45J51L3n8%k34K9L1J85
6303F7P0j3l26L14j81N8j94K00j30J67K5j08R0l1M0k71o4M15O1j3r6K0k27Q4M1
6328bo2J27k4K3O4p3p8j73J56J8j29j2K3J4P3J72j01j7q3J83j33j6L42k56J4k70
$$ y = [191, -187, 66, -6, -65, 77, 88, 89, 50, -8, -525, -5, 99, 278, -23, 20, 87, 146, 137, 156, -89, 62, -60, -50, 45, 89, -8, -192, -65, 198, -222, -95, 63, -12, 150, -70, -31, 276, -138, -51, -100, -121, -4, 30, -41, 159, 235, -86, -13, 262, 175, 109, -40, 33, 75, 38, -52, -6, -135, 331, 164, -32, -170, 236, -71, 108, -188, 109, 26, -62, 74, -72, 119, -89, 356, 99, -109, 132, 102, -68, 57, 45, 136, -235, -25, 35, -44, -107, -115, -113, -80, -120, 127, -200, -20, -312, 201, 80, -2, -167, 31, 285, 40, -54, -243, 0, -1, -10, -119, -20, 16, -9, 144, 51, 53, -86, 153, -378, -72, -72, 43, 173, 13, 75, -190, 200, -66, 32, -158, -93, 43, 161, -130, -212, 230, 75, -70, 81, 114, 56, 56, -178, -149, -118, 67, 137, 124, -202, 112, -69, -11, -205, -5, -135, 32, 57, -51, 39, 8, 48, -223, -287, 128, 189, 176, 80, 100, -127, -43, -2, -64, 63, 39, 62, 126, 53, -25, -198, -42, -24, -153, -165, -142, -128, -55, 117, 16, -1, -84, 99, -34, -50, 292, 36, 50, -220]
6354b20J54J33j82L23l64J03J75jk24J04O5j47r2P8J46j0n9K83l25J95j1j7k1
6377H6K8J39k12j98K13J41j78L8p2OR0J6Qj55l5J34k62K45j03n1L6J01j70J17
6401c8J52j02O3j4j9q4J6k75K73j07Q7J15j40P9J3k0J26J0j69P7j11Q5j28J11
6425@J38j22P2j07J81q4m2j33K39O3k65O1j58L41k70L2p3N2K32j2r9J1j4j31J29
6450D1o0J57l2K0j22j81K10j77j51L46n1k3K9K3j17K32n9R4l88J84J32p9j53p6
6474b01K36r3L4J58k03N6J08j39j1J79j46O6q8N3k03J38n1j5p3Q4J44p3j44p7
6498b61M97l93L34j56j09j2R3j51J56n3M2P6j93K60k82K1J92j45O3J9Q3k67K41
6521E5J5Nk69K60Q1k03K3J62j83j6n2J79j0K76n07L05k06j33J43J0J85j85P0k20
$$ y = [-220, -66, 67, -115, 208, -156, -53, 122, 121, -103, 1, 66, -81, -173, -95, 51, 41, -18, 265, -60, 135, 124, 107, 86, 114, 253, 41, -157, 56, 197, 19, 57, -15, -9, 81, 97, 105, -50, -85, 49, -213, 32, -71, -122, -86, 15, -155, -38, 114, 12, 75, 61, 42, -42, -26, -301, -28, -135, -48, 67, -73, 6, 19, -1, 125, 135, -34, 43, -68, 17, -111, 0, 138, 16, 88, -19, 162, 78, 36, -97, 142, 205, -60, 1, -157, 184, -86, -54, -127, -75, 157, 145, 46, 57, 43, -88, 41, -19, 138, 106, 126, 4, -177, 33, -144, -295, 51, 0, -23, 6, 29, -88, 144, 85, 179, -209, -25, 107, 28, -125, -201, 35, -58, -24, 134, -69, -13, 95, -44, -55, 124, -22, 44, -44, 9, -194, -56, -107, -122, -195, -111, 33, -40, -184, -261, 236, -157, 177, 21, -88, -100, -7, -158, -2, -55, -13, 63, -130, 130, -152, -131, 61, -84, -21, -2, 81, -186, 55, 70, 75, -194, 66, 147, -56, -33, 129, -54, -70, -122, 57, 47, 323, -184, 121, -85, -218, -75, -65, 120, -65, 5, -215]
6545b15mK97O1m66L12j0MK79L0j25K9k15K27j74l1p0J13j2j18L9N2J09j8j11n7
6570g4J38j23kL7k3J64n18L92j93K49j64K00pK5k42J0O5L69l30J99j51nP6q3q8
6595g9L90l34N9J86l5l74J65K4l58L01J44j17J34p1n5lN0K11k39P1K2j85J70m0
6619C7J09j15r0J3J37k34J56l7K1J21j60o1K41r2k35J22K94k33N1k7r1O8Q0l4
6643D1jJ14k89K68j92J51j56J8m0J52k25M8L9J5k21L58n6J72l72J07K29r8P4k35
6667i9J61j39J08Pk7J54O2j65j37J02J35l00N3L49j35k06j0O9j67kjK31J9l12
6691b50J94j33J20L28k79q3N4J9j6q6J65j56J09OqK09k50J23R9m09L55j00J05
6714A16k73M17mk06j46J42J50k41M14m82Q3j34J11P7m08N03k37P8O5k06J73K95
$$ y = [-215, -219, 78, 139, -327, -15, -25, -21, 258, 288, 163, 192, -23, 204, 30, -1, -71, 42, 30, -88, -49, 3, 112, 94, -17, -74, 64, -59, -61, -24, -47, 117, -401, -9, -202, 47, -117, 83, 76, 101, -141, -131, -66, 303, -27, 172, 21, 16, 92, 9, -79, 311, -23, 36, 222, 187, -187, -22, 2, -356, -55, 89, -28, 106, 35, -20, -23, 27, 238, -1, 70, 92, -93, 77, 37, 146, 31, -59, -46, 91, -143, 13, -24, -3, 118, -42, -103, 138, 46, -189, -67, 227, -6, 45, 18, -73, -5, 75, 41, 40, 154, -135, 133, -59, 92, -64, -46, -86, 66, -159, -111, -72, -57, -278, 80, 24, 196, -176, -69, 160, 62, 136, -99, 62, -77, 31, 38, 11, 165, 227, 62, -75, 27, 162, -138, -85, 264, 129, -77, -87, -18, -185, -187, -188, 43, 62, -250, -56, -189, -69, 259, -20, -103, -49, -30, -46, -132, 33, -123, -14, -8, -16, 193, -57, 66, 165, -244, 111, 11, 116, -157, 260, 256, 50, -96, 46, 196, -45, 369, -113, -30, -164, -53, 24, -384, 119, -118, -40, 25, -181, -8, 287]
6736B87p9j98j8J9k63R3pM84k64Q5o7J74k69L3q5J43j9m6Mr4MP1P5j14k1l0J47
6763D5k87L37o7j52p0K23n1k95L02k23q7K14J53q6K10k66lq8M89k34l2K3l01J13
6787a33J67P3k85j60L74j45M33l81OM2K48k63j50Q4J84j08J37k1o6j43L3l5J73
6810F4n2j74K51l43K42OR2p9n8J32l33K49O1k09R0K16j17K6j74J63k8l7o1J02
6834B9J01j12nj04j22J98J03j14o3K19k04J27J89l15Q3j72M37l04L2Q6k4jp6J0
6858bj04J98Lj66p3mL22k14j11J25l75M65q0J78q2j43KK02l53L48J42l38R9k60
6882b21L12l28J07k5j28J84J53m8L1m7k37M54k31K99l54O5J29k15J85n8L5J89
6904B51m10J13L3j47K34j99P0k41L29j03K78k02q0Q6J16o0p8J03N7j05n1j36L34
$$ y = [287, 208, 10, -8, 11, -252, -159, -166, 318, 54, 139, 72, 246, -23, 10, -75, 68, 49, 3, 7, -87, -83, -12, 63, -51, -72, -102, 45, -242, 95, 28, -124, -194, 29, -22, -317, -15, -238, -325, -111, 42, -44, 166, -100, -103, -191, 298, 64, 32, 55, -246, -133, 34, 107, -178, -338, 36, -109, 324, -57, -51, -9, 239, -24, -174, -90, 94, -14, 123, 102, 36, -107, -74, -109, 64, 12, -162, 89, -254, -12, -6, 86, 7, -51, 81, -252, -3, 58, -151, -61, 155, 38, 64, -110, 53, 25, -12, -73, 29, 130, 18, 13, -91, -213, -15, 88, -26, -89, 130, -74, 53, 242, -73, 10, -162, 275, -29, 3, 89, 65, 64, -12, -2, -106, 92, 95, -71, -144, -148, 174, -40, -151, -26, -401, 64, -16, 162, 80, -63, -61, 141, -212, 136, 278, -60, 39, -221, 91, -237, -130, -155, -283, -99, 54, 6, 37, -10, -247, 207, -24, 275, -79, -14, 115, -100, 85, 27, 62, 251, -159, -46, -13, -160, 74, -125, -55, -296, 33, -70, 208, 6, -74, 12, 128, 68, -10, 93, 150, 45, -6, -142, 192]
6927A92k31Q7l19K81r7Q6J52p3j55K1j97J22J11j44J58J02o5R2rk0o3n2l17L83
6951D5j53K00j35K27l87K33k6q3L47j1j14j35q5K02j25q4j15M07k10k04%ML04
6974A02j84J40q7J15k14J22%l78M24o6q7J78j77L96l34K2P5j9k7j24m1J68J89
6997A93n4j60QOk64M02L4k36O3J46LL0k08J21k48K99k9m1k27J20O9j06J34j43
7021h8J67l58K17Q6j87n9K95k94K71J55p8m4k37Q8K75j37J3k01J64J22l50K7J73
7044B0L0J66l51J56j62j33L03k0J45j58l3J21r4l8M14m39O0O4O9k05r7K81o7K91
7068C23l02N1j20K28r8l04L55L4J9l04N3m2j44K53J40j37K16k50K26Ml12K46j02
7091C3L2k69K34O8m3j01k14L40n5k48J76O2J77k20l5R7j73K54k7j36j15P5J44
$$ y = [192, -39, 48, -271, 10, -87, -1, 151, 78, -77, -56, -253, -131, -20, -164, -6, 96, 31, 123, 114, 94, 31, -21, -338, 45, -108, 92, -43, 184, -203, 30, 4, -79, 268, 257, 143, 8, -77, 125, 0, -84, -199, 208, -2, -206, -206, -202, 102, -82, 58, -29, 86, -128, -6, -6, -384, 40, -26, -113, 65, -112, 284, -50, -28, 47, 28, 1, -123, -164, 4, 193, 139, -21, -13, -7, -271, 131, 165, -71, -8, 138, 141, 171, -37, 84, -164, 135, 106, 65, -162, -42, 27, -79, 55, -88, 79, -279, -62, 24, -163, -222, 73, -221, 50, 205, 127, 83, -154, -66, 209, 72, 85, -116, 48, 170, -180, -153, 20, 50, 216, -135, 21, -141, -274, 29, 9, 154, -4, -37, 84, -10, -48, 366, -73, -13, 51, 120, -85, -182, 99, 32, 323, 21, 72, -48, 180, 82, -222, 133, 167, 186, -118, -65, -107, -251, 2, 142, 5, 221, -29, 197, 201, -111, 135, 33, 65, -204, 30, 98, 55, -46, -260, 80, 25, -223, -47, 15, 192, -28, -63, 34, -139, 115, 88, -48, -163, -88, 56]
7114E6n1rP6k12O1J75p4j85J71J18l8M5p0q4o8K08j59O6p8M3p6J13k18L65j47
7139B8o8N1J62j32j46J18J10j98r8J26p4R4q0K76o1p9N3j18M0Jm7J79Qp2k1pl34
7166b89N24m69K43J05k50J96k06q3K75p4k3Q6Q6k28O9J19n5R0q6l3O7J12j3j22
7190D1K58m09QJ60J45Q3l88K39j39J41j05j5k27K54r9J76p1R1j8l11l9J93j1K0
7214b3L91l74j17R6L39l31J8O6K43k10J88j27j35M8l99K45L77j88K5q6Q1k24J07
7237A0n6p7M30%l48o1J6K2j27M6J04J15j04q2J65n0M3j77K16j26r7O6J40K43k92
7262A9L3q5L3R6j28j9J42k40K12Mn7j18L03j66J24Mj80K10j85J12J5K0L9j29q4
7287b5k7J00j28J78j56K73j77J39j09k06K30j41Q9p5J33k01L0L6j1O0rJ44j91
$$ y = [56, 5, -4, 72, -140, -79, 96, 22, -163, 8, 126, 88, 133, 63, -21, -89, 119, -40, 26, -52, -9, -85, 28, -190, 175, 28, -40, 11, 173, 41, -105, 13, 123, -75, -173, -47, -121, -27, -107, 169, 108, 29, 82, -36, 4, 5, -42, 137, 145, 73, 52, 45, -289, 235, -234, 9, 114, -136, 60, -146, -229, 46, -28, -51, 35, 121, -107, -38, 81, 26, 116, 30, -3, 64, 176, 163, 41, 299, -110, -102, 58, 203, 286, -102, 137, -2, 139, 34, 19, -208, 46, -53, 123, 52, 143, 125, -186, -225, -32, -43, -23, 368, -6, -123, -27, 312, -19, -1, 65, 308, 98, 286, 159, 24, 72, -327, -82, 295, 107, 132, 46, 127, -97, 10, -46, -123, 307, 307, -41, -102, -86, -64, -191, -145, -41, 74, -30, -112, 53, 3, 46, -131, 85, -41, -138, -72, 68, 311, 19, 52, -33, 0, 96, -32, -51, 91, -149, 63, 67, 10, -108, 195, 29, 153, 157, -23, 187, 2, 114, 129, 149, 188, 59, -25, -52, 48, -80, 98, -58, 215, 38, 177, 68, -138, 92, -49, 40, -35, 98, -103, -73, -37, -48, 12, 3, 147, -44]
7310d4L0k19K67L1J2q0q8%K38m1j58J00J86k5m01J62p6K01k19Q1n6K63k85J55
7334C4Q4j98J31M0j35J66p2P1k40L15k03N4P1l10K2j1K36m1j18K66l43Q5M0R1
7358C5j16j0R9l2k89K22j23J90J4j30r8J40J37j98l3L16j39J02J6l9n8p2O5J32
7382A31k72K1L38j57j14j1k0JK09m0j10J19k59n5L26M6j87j46K43r2J15k07J30
7405Ij72K21k78J17k8n7P1N2j74J98j81L48j45J20j62n1J52R0j08j90K11J38N4
7428B35j87j80K00p8O9K60k32J07k90K32j50k01J93J12q7n0J50L2k53O1J44j85
7450i8L1L60m82L37l05R3K40k61P6J76k51J45j30J00l01K45J62k04M3N7L9n2J32
7473A52j05k56L63r9j0o5M7k17L2J21K1l2j33J1P0M55m23J41J54k72J12J38j15
$$ y = [-44, -14, -233, 34, 65, 77, -3, -91, -91, 147, 106, -52, 48, 234, 209, -192, -30, -106, 95, -124, -43, -99, 164, -121, 34, 118, -80, 51, 91, -44, 122, 50, 121, -119, 196, -7, 47, 118, -192, -170, -181, 55, 14, -104, 162, -181, -96, -56, 35, -81, -91, 8, -24, -313, -91, -214, -24, -10, -140, -238, -98, 39, -159, -192, 124, -15, 87, 103, 64, 6, -66, -1, 131, -141, -120, 218, 61, -53, -64, -84, -83, 126, 86, -24, 95, -164, -219, 107, 153, -34, -180, 63, -29, 86, -121, 9, -163, 58, -220, -103, -131, -188, -117, -65, -239, -41, -222, 126, -19, 101, -61, -112, 40, 130, 22, -168, 43, 181, 235, 48, -132, 68, -10, 59, 319, 87, 194, -96, 136, -14, -215, -22, 90, 3, -47, 103, 135, -118, -57, 87, -98, -67, 293, -189, 148, -157, -64, 176, -85, -9, 167, -84, 61, -69, 31, -270, -25, 137, -67, -24, 33, 72, 20, 152, 47, -209, 154, 55, 45, -20, 27, -190, -158, -37, -16, -48, -181, -170, -100, 355, -68, 73, 227, -45, 67, 205, 90]
7496I0R6j25j23L7J56j11k2j3J59K3j3j16J4j39L5k33J44R5j56L52p5J9q3k46
7520b35L36l88K93J66k5k09KJ03j61J85j49K34j27l5j67J75J99l61L6L6MO5K8
7543ENPR5j98L40r2jl50O1J23n2j8L74j32k22q4K42rk3K3k85Q7n4J56p3p6K33
7570H2k30n8O4J54k25K84K24k23J48l42R5L11l18q3Q5j26J89m2K91l33O0K0J7
7593D4o5k8Q8Q9j74O2J2p4J94M5j97k31K91k7l6Q4j46K93l09J15J40j93j23K29
7617H3J08k82J83l03K75J40l12K9j9j1K96k22J48q9j09J8Q5l2n2QJ13K7l1l62
7641c11M43j8m3K0O3m7k23K25j14n2K25j51j76M74k77k36L47j15M0J%J8j80K79
7665A92j78o7J52J9o2J02k61K16k03J4O1J01k70L84j69l8j97K31r7O9Q6K9k49
$$ y = [90, 186, 61, -62, -25, 131, 20, -2, -15, 144, 167, 154, 38, 52, -87, -52, -285, -141, -46, -202, 150, 75, 94, 11, -235, 101, -287, 6, 172, 147, -62, -60, 43, -118, 67, -82, 152, 25, -10, -177, -2, 197, -164, -128, -92, -88, -23, 5, 10, 17, 112, -86, 254, 162, 161, -189, -128, -5, -57, -75, 299, 167, -55, -139, 103, 94, 71, 94, -191, -104, -158, -2, -75, -151, 82, -148, -206, -142, 12, -213, 71, 295, 72, 220, -122, -27, 284, -34, -117, -32, -158, 31, -11, 280, -53, 7, 27, 44, -21, -49, 39, 128, -46, 16, 28, -46, 148, 193, -4, -235, 56, 29, -7, 77, -69, 224, -85, 30, 170, -23, -146, 83, 191, -91, 92, -211, 64, 204, -108, -79, -98, -109, 187, -35, 113, 24, -85, -67, 18, -14, -66, -58, 55, 82, 51, -311, 132, 114, 71, 91, 154, 107, -116, 109, -5, -57, 168, 17, -159, 315, 38, -198, 149, 34, 74, 75, 75, 93, -87, 192, 14, -53, 99, 118, 56, 158, -103, 113, -90, -76, -15, 86, -184, 200, 31, -7, -204, 27, -70, -1, 85, 114, -135]
7688a35k3j47K85j40K32J90j31j59O0rj14K38k28K60r1p7j74L15j45m8K4R0K0
7711I3n4J80k15l19M22J49k08j18j63K04J6j4P3N3q9k2Nj35J02K36l0l9l35J32
7735g6k1J91j77K71k61J94k08nQ2n9M7k58K00K24j91O3j58J55n8q6J34L24m27
7758a00l3K84r7j66J89N5q8k2J39J6j28j55m2J94n2J3k29M15k86L3K04J0j66j06
7782a18J77j13L5j72J40k9J22J71o4k42K54p6j26mk43J36J84p6k05L35Q7K1j93
7805Aj58Q2O4j31J85k11K49j6O4l12l3K11k38L23N6k08K51Pl15K29l13K51j32
7828i4k03M45k52J62j63K67r3Q8j20j24j0J51m1j37K43p5j38l4J87m6j07j76M63
7851A93r1k96O6l5J69J8k45M24j01J02l72R7R2oL1J25n0l61K15L2n4o4j8P9J2
$$ y = [-135, -158, -305, -20, -160, 72, 262, 131, -28, 32, 23, -91, 147, -81, 179, 88, 11, -163, 152, 7, -41, -17, 73, 93, 39, 219, 4, -315, 107, 256, 48, -70, -233, -29, -13, -27, 46, 99, 10, -12, -7, -142, -40, 196, 166, 127, -208, -76, -97, 94, -83, 188, -73, 121, -87, -92, -10, -69, -22, -280, -80, 144, -47, 16, -142, 13, -45, -131, 3, 327, -100, -133, 151, 54, -112, 77, 132, 44, 22, 161, 177, 49, -106, -148, 46, -6, 7, -222, 193, -93, -60, 144, 154, -12, -118, 59, -54, -19, -191, -51, -80, 42, 213, 149, -93, 161, 85, -41, -45, -288, -152, 32, -44, -249, 86, 173, 194, 1, -157, -75, -11, -142, 43, -168, 81, 65, 129, -183, -216, -5, -243, 80, 136, -72, 179, 186, -129, 100, -213, 38, -94, -297, 148, -104, 58, -105, 162, 69, 157, 37, -87, -97, 54, 13, -124, 119, 44, -94, -128, 59, 13, -94, -270, 193, 102, -194, -128, -163, 6, 24, -221, 203, 102, 204, -168, -71, 21, 15, 46, 171, 121, -240, -25, 7, -47, -111, -129, -50, -38]
7876c8J10k7o7M0q6J78q2j66J59j27K30j38R5j9q5L6J80p0Qk51J70Jj84J95j60
7901i8K43k10J95r6J8m4k3J95k77J28j56r8N99k58o6j03j14J70j52J72j48L4j22
7924b11K45m1J04J29m26L10p0K0j76L5k6J45K44k58P1p7J40j64l0J16L7j02l58
7947c43L38J56ok20K51j50l15L20Q5J12j65j89J1N3m2m9K34l7j67K35j91%K07
7970A28O7l75N8k0k7K51o2j37M05k04J36n1l12r4K70o4M3p0j0J69j52J54m4j23
7994f4L3L2m0%L4j15K61j95J14Mm3k2J66j39l5k27K30J95j84k04L38r9K9K03n77
8019c05L42m9R4k4k44J05R7o0K04k94J03J05j96M09j52P3j83n8R1n3J43j51J04
8042A01j36J63j96p8L4L04n5j43R1j16N5kL9o8n3L8j70K68k33K13J54j91j34K0
$$ y = [-38, 72, 45, -22, 18, -68, 110, 28, -138, 21, -106, 124, -14, 81, 62, -23, 13, 193, 123, 131, -120, 50, 51, -133, 62, -98, 145, -65, 130, 34, 52, 8, -15, 180, -97, 31, -125, -223, 376, 118, 52, -51, -165, 5, -147, 25, -123, -89, -211, 34, -7, 97, 226, -200, 110, 40, 60, -116, -81, -107, 38, 282, 24, 95, 18, 158, -6, -36, 80, 117, 15, -343, -5, 151, 145, -75, 176, 26, -289, 31, 116, 228, 63, -126, -115, -62, -104, -153, 81, 44, -123, 112, -79, -79, 128, 195, -180, -122, -142, -169, 82, 20, -117, 288, 84, 220, 169, -143, -237, 33, -31, 12, -58, -68, 101, -51, 103, 59, -64, -31, 1, -39, -39, -5, -120, 141, -54, 60, 64, 21, -1, 165, 26, -9, -236, -6, 189, 5, -199, 139, 40, 69, 272, -305, 37, -12, 82, 58, -186, -81, 16, -44, 160, -134, -31, 74, -122, 287, 135, 208, 25, -33, 58, 5, 148, -3, 101, -35, 128, -68, -146, -112, 192, 137, -6, 85, -31, 24, 22, 61, -7, -60, -22, -192, 76, -157, 56, 210, 19, -115, -95]
8066i5l7M9R5K81l70N2K14KJ99l78O3j14k40K16L9j54J91J50k5k02J69j41Q6O6
8090A16j76j61J89q8K70kK4r5k16J4l0J54l0K02j27n0N9j8j62J44j91Q6N9J05
8114G6k65o3M09j41K5J65j19j09m7J79j54p7J49J24l34J75j37J32o9K2K14k20
8136f5J41k4J76j71L7k57Q5N2K1j22J52J16k15r4N0N6qj10J13j16K42J06m07K82
8160D0J03j74K28J55m75J56o1R2j9j89l7J37l8k7J75q5m6K42j09K3k11K69J20
8183B69k87J92n25K98n5k5nJ94
$$ y = [-95, -132, -83, 12, 293, -77, -25, 189, 191, 390, 12, 75, -39, -279, -63, -24, -178, 13, 163, 138, -64, 105, -36, 50, 116, -60, -221, -32, -120, 150, 148, 172, 77, -139, -125, -155, -1, -31, 171, 44, -6, 53, 35, -127, 17, -174, -88, -29, 76, -189, -252, 157, 16, 41, 206, 87, -22, -69, 110, -44, -121, 28, 152, -182, -7, -144, -12, -81, -59, 155, -65, 76, 52, 228, 57, 94, -163, -78, -26, -5, -127, 25, 141, -74, -168, -118, -62, -70, -180, -67, -183, 59, 165, -242, 40, 143, -31, 197, 352, -123, 33, -28, 64, 45, -144, -181, -44, -82, -109, 66, -19, -65, 177, 68, 91, -120, 149, 269, -18, 174, -351, -53, -108, -133, -138, 56]
8191E6
$$ Imaginary data points
##PAGE= N=2
##DATA TABLE= (X++(I..I)), XYDATA
0@%%%%%%%%%%%%%%%%%%%%%%KrJ5j6J6j6J6j8K5l0L1l4M1m6M9n7O3p1Q0q8R6j06
44e7J20j32J44j57J73j92K13k34K56k83L13l47L88m33M82n39O10p00Q11r55J152
65F33j436J885k706M675j9280j6290K5333N388M172P835O020J981o945j0179P850
80H936O428j933L413N910R18m967q631L316J713r031l148L075J982m05o325m52
96G99J236j0448p660J348O57K368J513J891K967p392p554K848N95K172O409L331
112d920O527R09p840J169K516k235N465N485L417M907k759l337J760l923l154
127C987L749K321J441M02k069n17m933n723j332q37J284J780p18J020k054n769
143g968k421j197j393L020K692L021K736k642j379m70k383J397L946L292N089
$$ y = [0, 0, 0, 0, 0, 0, 0, 0, 0, 0, 0, 0, 0, 0, 0, 0, 0, 0, 0, 0, 0, 0, 0, 2, -7, 8, -8, 8, -8, 8, -10, 15, -15, 16, -18, 23, -23, 26, -31, 32, -39, 41, -47, 49, -57, 63, -69, 75, -82, 91, -101, 112, -122, 134, -149, 164, -183, 205, -228, 254, -285, 325, -375, 436, -519, 633, -803, 1082, -1624, 3051, -16229, -32519, -7186, -1798, 2374, 10209, 16229, 18210, 11265, 1086, 8936, 15364, 13431, 16844, 22754, 23672, 18705, 10074, 13390, 15103, 6072, 2924, 5999, 7981, 7576, 1251, 799, 2035, -8413, -16073, -14725, -14068, -11700, -10187, -8296, -5329, -12721, -20275, -17427, -16832, -14660, -8251, -4920, 1607, 2516, -5324, -4155, -1639, -3874, 1591, 7076, 10493, 15400, 12641, 9304, 11064, 7141, 3987, 7736, 10057, 11498, 11900, 9831, 9314, 4381, -1342, -2674, -3511, -2227, -447, -1165, -145, -2199, -7968, -10389, -11586, -12979, -9959, -7267, -4246, -1510, -4152, -5531, -6001, -8384, -6987, -3041, 251, 5340]
158E340J645j516P92l066k438K251J215K559L668j59l84j640m809k460j39j165
174c06J806J295M00L0l813l517k433k384Q6J675K222J805K25j904j392k303j127
191i635J797K156L627L286O88N75p48k416J04R89K287L632K218J049M81k152k684
208E254j063j087O72K162Q34J011r43l345k704l230j898M31R70J155J097j643
224b327j629k788k225j033L34K252K043J822R53o74j382j029j62J081K692K678
240F06K642J804k69j138j013r84L36K234K189K115O41j143j769j987k122q21O17
257A938J143J178K33j174k201k898k313j098J92Q50J736J001p38j266j777k039
273g233k47R19J788K500J751M70k11j062j622j11J248J623K640J825Q16j15j662
$$ y = [5340, 6985, 5469, 6261, 3195, 757, 3008, 4223, 6782, 10450, 10291, 9907, 8267, 3458, 998, 859, -306, 1500, 2795, 3195, 3225, -588, -4105, -6538, -8922, -8836, -7161, -4939, -3134, -2909, -4813, -6205, -8508, -9635, -7838, -5682, -2055, 1231, 1919, 2494, 1746, -670, -566, 423, 2710, 6342, 8560, 9609, 10090, 7938, 5254, 4191, 3104, 3776, 5938, 6772, 7783, 6840, 3495, 791, -2439, -4337, -3906, -2936, -1781, -684, -2327, -3956, -6744, -8969, -10002, -9668, -7416, -5373, -3551, -2598, -3272, -4654, -5683, -5845, -4764, -2072, 606, 3248, 5052, 4783, 3645, 2632, 1648, 1984, 4218, 6407, 8522, 9163, 8020, 6251, 4264, 2142, 1321, 1938, 3081, 4259, 4492, 3318, 1117, -1781, -4094, -5192, -5000, -4150, -2414, -1413, -2151, -3417, -5194, -7233, -7480, -6561, -4773, -2273, -522, -52, -263, -1325, -2947, -3058, -1810, -187, 2453, 4278, 5094, 4979, 3317]
290C317j614j011J21R74J939J448J21n71j977k323j771q97P28J051J537M75m14
307A133j748k363j358o24M92J837J827J032N86j329j533o74m57P35J859K168J227
324B810P95m22j732j038p11K58J281J575J232O45j093j688j915j443k62O76J222
341A90Q55M75p74j942j636j418n63L69J632J944N02K1j225j180j235r8J313J450
359a320J888J835J42n94j028p92m23J145J210J729J347L26q55j123j867q38j5
376G67Q57J266O10j47r52j606j853j612n93M50J083J028K30q71j119j940r56j70
394e528N95J599J563Q67L32o42j037r42J14J183J872J732J295M07o93q01q19m28
412F69O20J290J329Q91M39j056j420j312j182j76P11J241M31J93j053j796j684
$$ y = [3317, 1703, 692, 813, 1787, 3726, 5174, 5295, 4724, 2747, 424, -1347, -2244, -1516, -465, 1072, 1547, 1133, -615, -2978, -4336, -4960, -4468, -2631, -804, 228, 814, -515, -2048, -2722, -3179, -2444, -585, 1583, 2810, 3605, 3183, 1451, 413, -298, -40, 1241, 2816, 4048, 4693, 3600, 1912, -3, -1446, -1708, -1032, 190, 1045, 1520, 746, -1196, -2832, -4250, -4813, -4444, -2812, -868, -366, -345, -1570, -2750, -3985, -4083, -2770, -1320, 568, 2403, 2545, 1951, 923, 131, -292, 853, 2063, 3792, 5139, 5465, 4610, 3487, 1620, 782, 767, 1624, 2890, 3500, 3353, 2401, 795, -1058, -2670, -3263, -2813, -1730, -702, -472, -1343, -2462, -4402, -5358, -5528, -4933, -3334, -1771, -904, -572, -1214, -2251, -3193, -3079, -1896, -24, 1708, 3003, 3410, 2717, 1916, 1097, 669, 1289, 2579, 3908, 4799, 5238, 4182, 2762, 1450, 268, 92, 803, 2044, 2475, 2668, 1615, -181, -1865]
429a865r88o65P34R79J026N21q54q68j169j179q2J499Q88J363J258L2o20p23j119
448a832K37O35J361J745O40L47n52j314q24o75K65J276J123L43M83q51j650r07
466a50j481L40P70P54Q85J21p90j199j122j178L03M43J113J596L69m00l35j416
484a377p47N38L53J370J239R26L0m09j550l79n53M84J415R31O30j14j153j173
502D61q35p75k20R37Q16O55l84q96o87j444o04j11O47J160R57K83l85r91q85k92
522b593j33J019J588J132N86J71l89q04m11j57P90J147J108Q14j33j058r97p01
540I79n15K00N98J012L59l47r53j507j335o39J06K18R90M99K7p79j320p42p38
559c887Q2Q55R47J208L57Mq42m63p13O67P39J007J286R26K14n42r26n15K17O70
$$ y = [-1865, -2853, -3518, -2784, -1805, -779, -258, -1112, -1980, -3149, -4328, -4410, -2911, -2023, -660, 598, 630, 10, -713, -1832, -1595, -960, 401, 2146, 2786, 3133, 2581, 1267, 443, -232, 33, 1309, 2432, 2775, 3258, 2407, 757, -150, -1631, -1291, -521, 233, 1118, 1239, 449, -750, -1872, -3050, -2747, -2304, -1191, 405, 774, 374, 39, -1377, -2124, -1586, -1233, 137, 1376, 2302, 2332, 1923, 373, -6, -559, -75, 1340, 2271, 2901, 2787, 1634, 461, -374, -1149, -1369, -432, 384, 1039, 655, -241, -928, -2372, -2976, -3087, -2440, -1280, -323, -40, -425, -1416, -2301, -2593, -2726, -1707, -119, 1013, 1599, 1770, 1381, 577, 166, 9, 799, 1946, 3054, 3868, 3735, 2677, 1680, 979, 464, 664, 1262, 2274, 2633, 2286, 1333, -174, -1509, -2148, -2042, -1824, -834, -335, -308, -1087, -2407, -3149, -3887, -3805, -2950, -2003, -795, -438, -434, -1276, -1739, -2452, -1785, -1046, -39, 1247, 2173, 2387, 1845, 919, 404, 621, 1291]
579A291P58J168J14M19r67j333q89m21k15R11P50P9p7q42j151j007q62LN24R19
599h28N47q8m38o47j006o41L45O06J196J030M16j30o10p74k88j30J094J189Q27
618A670M55k79m89j082j41m11M58Q93P82L48k42o68q07q54o20L15M10P61N61k18
638H42p66r81o55n05J12P31J206N59R8k80p82m38l92J48Q82Q88N89M02k68m90
658I00q44k77L6J51R27P82J65j40q13p53p85n93M40Q07M03j18O8n01r75p38l62
679b220P7N21J087L34K71m39n54p54j14K84Q50Q96P97K05K61o65m23n36K21N32
699F31Q20R59o5j05n50q20n83m2K91M11O73j42j22q50j040n85n01L44K78N28L16
720a54k97n22r35n18l01K37J006N78N18K8M3p79j80q3K10J061P32P80J84N8q60
$$ y = [1291, 2049, 3217, 3331, 3750, 2783, 1450, 561, 140, -75, 836, 1586, 1665, 1588, 746, -405, -1412, -2274, -2271, -1747, -828, -281, -369, -807, -1454, -2460, -3101, -2756, -2150, -954, 76, 492, 362, -248, -1022, -1310, -1440, -346, 843, 1670, 2125, 1846, 1357, 275, 134, -277, 181, 1074, 1856, 2204, 1962, 1294, 487, -367, -987, -672, -262, 499, 1060, 842, 76, -905, -1560, -2065, -1953, -1222, -16, 543, 641, 361, -421, -859, -1251, -1103, -221, 667, 1256, 1658, 1390, 900, 56, -221, -185, -34, 893, 1675, 1840, 1700, 887, 134, -651, -1244, -804, 3, 406, 288, 356, -145, -1120, -1858, -2220, -2143, -1622, -535, -201, 70, -369, -923, -1677, -1791, -1507, -657, 239, 1036, 1241, 1502, 837, 414, -122, 99, 631, 1451, 2410, 2345, 2240, 1690, 870, 287, 245, 536, 947, 1620, 1478, 1356, 506, -534, -1119, -1620, -1276, -998, -470, -154, -451, -973, -1908, -2426, -2727, -2490, -1484, -906, -388, -360, -317, -1096, -1276, -1359, -1149, -88, 644, 1424, 1608, 1666, 806]
741H06k01l18J38R20K46N59L76m10p49o33k82k74R9L58O56j13k57m52j083q38
761a452k16J60N84O95L6q7o08m69m57m0L24L71O14R78j17k13m78m45k4P2O97M95
783D20Q57J29j45m01r99p6R2P75J83N28Qk17p00o80n19Q6NP45L93M57l76p80n15
806g30m01j29J54N29P22K37K47m73k25m73j46K49N34Q52K05K59m32l56p80o5j41
827c63N02P65K07J61l69o26o57m23J63m2M16L95J91n01j63q58m26j6L06L76P04
848b58N37k62m19m65m85K23K89N93R14N15N9k08m15n55q1L55P47L41K88J68l45
869A536o54l27l58M2mO31J87N3m36p37n74p32J68Q2M18M45j28m10l64n70l61J62
891a931K88O22L94M81N5m06l38j82M9K26R37M83O02K25k74o44j96j64M72L78K50
$$ y = [806, 605, 287, 425, 1345, 1591, 2150, 2526, 2116, 1367, 734, 452, 178, 277, 635, 1291, 1178, 921, 469, -614, -1452, -1668, -1508, -924, -229, -193, -280, -888, -1357, -1814, -1854, -1530, -1159, -545, 433, 316, 103, -375, -820, -844, -772, -75, 420, 1277, 1406, 1261, 860, -139, -215, -123, 652, 835, 1363, 1371, 1154, 454, -226, -745, -659, -654, 91, 484, 941, 565, -215, -730, -1131, -1260, -1106, -577, 145, 382, 629, 156, -69, -542, -688, -439, 95, 947, 1152, 1411, 979, 623, -157, -222, -363, 139, 904, 1111, 1272, 903, 277, -380, -803, -640, -682, -266, 129, 320, -181, -344, -1202, -1628, -1644, -1338, -962, -258, 279, 17, -402, -867, -1352, -1129, -840, -247, 667, 1182, 1241, 1033, 618, 63, -18, 337, 1084, 1425, 1713, 1881, 1536, 882, 555, 197, 239, 235, 866, 1053, 1106, 670, -67, -641, -1373, -1205, -1123, -705, -260, -388, -798, -1162, -1732, -2093, -1931, -1643, -1021, -627, -146, -91, -497, -835, -1017, -968, -742, 195, 678, 1280, 1505, 1231, 587, 391, 227, 699, 1077, 1327]
912A327N80j41j53q08j87n27K2O1N23P5J41m07m56n98p13J43K00N10J57l9R6m50
934f44n77l15P6L8O86O23J93J66j76m66j69J84J61N80N15L53j54k46m22l93j09
955i6K62J13L74M04j19n8n86p26j94o2K38L06M87K99p22j27n08l87J2N21L73L93
977A97J03K09n23l84k01K9K60P14K42M34J30o58m70j43qL5M34M23J80k13l44k85
999A61o53j62Q0N29J81K34l19m95L3o65n04L76J87K08O55j69J92l27o02k1L46
1020g35K05M87O37J44k29L28n88j71J70J50N09M51K78k3m28n17k70k16K08L32
1040G22N20l57Mm53p75j7n81Q2L66P9J86l02l4o55j94k36j05N05L68K18M13j55
1062d01k39k01l6L5N72N17K00L09J76J4o29n5J94P5M71L55J71L6l46m22k31n45
$$ y = [1327, 1907, 1766, 1613, 805, 618, 91, 113, 174, 697, 772, 913, 506, 50, -548, -1261, -1118, -918, -408, -251, -290, -194, -644, -1221, -1536, -1460, -1422, -736, -113, 80, 246, 70, -396, -565, -381, -220, 360, 875, 1228, 1074, 828, 406, 13, -96, 166, 279, 653, 1057, 938, 880, 294, -432, -626, -688, -450, -144, 343, 642, -80, -207, -715, -1102, -1090, -569, -196, 197, 300, 509, -14, -398, -599, -570, -310, 404, 646, 1080, 1210, 552, 82, -61, -69, -34, 400, 823, 1003, 790, 446, 161, -492, -654, -574, -45, 136, 370, 51, -444, -411, -1076, -1580, -1204, -1017, -809, -154, -323, -131, -458, -1060, -1081, -735, -530, -43, 594, 738, 509, 837, 249, 78, 248, 398, 907, 1358, 1636, 1613, 1185, 668, 398, 182, 390, 722, 1242, 885, 889, 436, -339, -356, -937, -855, -489, -410, -224, -526, -560, -1215, -1409, -1645, -1750, -1245, -877, -659, -246, -401, -640, -841, -877, -842, -270, 247, 447, 756, 932, 946, 317, 262, 456, 531, 1002, 1357, 1528, 1564, 1218, 796, 565, 20]
1084B0L58M4L64j41q8k14n55n93p3K7K38K92L56k99k05j38n65k20N24M2L03M47
1106g6J56j0m09j17j17K87J69N13J23L04K4m43j33k10j37K14M56M6L08j06l56
1127D86n72k20p8l2L61L25J57j71m95k40o9l24m8M95O31p8K63m20o1k69k67N56
1149g0k4L32N60q8P7k10n99J0p1K49L84K27J50j72k73n28j62k64n2L47O00j1k89
1172A23n79j78l59j65K68P7O13j52M43k62l80j81l02J84M37N05M24K2n9l11j91
1193b3J27M05j0L48L31L38m41L9r29j07J05L83K09r4k4j02j16p27l04r5J90K15
1215b82J88j22j26j84m09j05k1oK88M24m2J09j70j04k65K61r0M62K03P05J32L0
1237H76p12j46N3Q0M15J35L95K61k66n27k99kk62M39N1O3k7n7k86n33k33k2N6
$$ y = [20, 378, 422, 786, 645, 557, 343, -212, -805, -878, -851, -613, -321, 35, -264, -469, -607, -1172, -1392, -868, -826, -523, -76, 80, 70, -339, -456, -573, -286, -117, 396, 519, 823, 847, 404, 271, 61, -76, 138, 594, 640, 948, 842, 486, -86, -306, -384, -416, -55, 270, 427, 256, -239, -479, -548, -872, -920, -425, 206, 128, 391, -29, -90, -359, -626, -70, -94, 238, 798, 710, 787, 577, -22, -12, -83, 166, 550, 777, 927, 755, 482, -46, -208, -472, -524, -177, 423, 412, 123, -456, -634, -993, -1158, -890, -813, -200, -352, 91, -171, -551, -732, -1034, -850, -413, 92, 516, 538, 479, 168, -23, 104, 509, 499, 847, 1178, 1516, 1075, 1114, 185, 78, 183, 566, 775, 681, 657, 555, 439, -288, -592, -687, -497, -282, -94, -216, -342, -526, -935, -1040, -1061, -1067, -779, -355, -397, -288, -458, -562, -827, -566, -656, -194, 9, 714, 846, 876, 164, 18, 71, 151, 566, 701, 1096, 1357, 1091, 564, 265, 263, 1, 440, 491, 554, 527, 470, 184, -349, -582, -604, -548]
1260e48K28K07P1j11l51Q3o28j0K32M73L97Q2j35k98q6l4J41MJ98K94N30j07N3
1283F85n87q6j02k8L34L7L03j04j38p3j52l74m3N5M69J8P0J10n87l54j47K82o1
1306d73NN16L13j33k34k14l1j00j7M99K48J31K8Qk79k46J10l8L9K1M72Nk49m65
1330h4k75m1J76k2OM05j06n1j02l31n03J86M1L68N8K74k61j85k6j57M8K43L60
1353B1J75L4L18l22j57QJ3J73J66L76M9q0j96p4l46k64J88K05J22J3P1k09l76
1376i2k63j30j76J03K54N07k84j94l99J61j24j8J84kR0J30Q7q0J07l34j8K95J62
1399c4N3L79k26K11m69J23M59l44L9M89Q0J81k58k63k65Q5k93L73j13K15lp0l89
1422d0j98m15K29J67L4K26j56J36k86J2k72oK2M01M7K03j88j3n08M33m2L24Q8
$$ y = [-548, -320, -113, -42, -153, -504, -421, -1049, -1059, -827, -354, 43, 125, -10, -308, -394, -428, -287, -283, -85, 209, 739, 632, 685, 98, 12, -90, -118, 216, 253, 556, 452, 314, 241, 89, -285, -328, -273, 196, 214, 284, 394, -193, -547, -694, -412, -473, -468, 48, 361, 228, -6, -220, -251, -351, -368, 131, 379, 510, 538, 546, 267, 21, 131, 93, 132, 153, 625, 630, 381, -84, -359, -400, -224, -246, -240, 165, 59, 8, -94, -425, -928, -742, -701, -333, -275, -1, -262, -447, -473, -630, -582, -339, 21, 196, 230, 548, 226, 69, 77, 90, 263, 429, 805, 854, 774, 578, 504, 158, -106, 82, 287, 409, 422, 493, 284, -92, -355, -485, -661, -558, -304, 203, -81, -275, -674, -513, -637, -655, -471, -473, -383, -253, -166, -246, -139, -473, -491, -196, -34, 19, 398, 172, 383, -86, 37, 496, 152, 191, 680, 760, 941, 683, 420, 155, 240, -53, 320, 207, 422, 419, 349, -40, -238, -653, -424, -257, -223, 3, -153, -17, -303, -291, -563, -569, -547, -146, -99, 104, -84, -97, -605, -172, -214, 110, 198]
1445A98k02N05l71On9m02n7N24M1J92M9l23j5k22j12q5p1K68L50J37l28J89l93
1468a81k26J06J50k9K75J31l8K6o5l44J71r7J77J51K5M94k09l44k86j81K04m3
1490a33L62K25l8k56p3k88j77m0J67J40M0K68k94p7R7m80m6M7R3M74K39j79k09
1513a38n0o1p4M1J83L05J52R5r4J8j9l76J75M27j99K70j01l7l2j74o2m11M01O0
1537B99k62Q1L49l13n60n5m2J30J82K91j94L01m80r4k96p5J42J91J68j15K00P6
1559g6j24k58r4N02N4K22J08K99j92l21k20M81l40L9pL58M2nj51l09n9L6J44R2
1583B21J19l58M08m25J14m97J4K93Q6KK87o9m25L6o6l04J83M10%N6J25j30l47
1606b67m3m7l0L42K23M1K10j88M8n08q5J31L6L13n0J36k93J03k44o6j96K11L06
$$ y = [198, -4, 501, 130, 136, 77, -325, -382, 142, 183, 375, 424, 101, 86, -136, -248, -333, -404, -136, 214, 351, 23, 212, -181, -407, -301, -151, -180, 95, 226, 188, 214, 149, -195, -24, -121, 56, 207, 232, 726, 517, 173, -113, -294, -90, -133, 229, 454, 416, 160, 87, -201, -378, -418, -251, -111, -71, 197, -97, -174, -77, -557, -603, -556, -463, 11, 250, 71, -138, -188, -249, -323, -282, -99, 206, 358, 453, 359, 377, 358, -18, 157, 584, 385, 655, 554, 517, 485, 311, 249, -162, 239, 299, 37, 118, 467, 154, -406, -461, -503, -373, -191, 100, -94, 207, -273, -367, -663, -738, -596, -405, -237, -352, -152, -76, -200, -458, -552, -50, 4, 226, 334, 633, 441, 120, -100, 381, 41, 80, 73, 431, 473, 468, 317, 8, -51, -15, 129, 221, 340, -18, 390, -35, 79, -418, -404, -111, -25, -23, 264, 195, -230, -194, -260, -564, -381, 29, 29, 85, 210, 80, -267, -310, -357, -387, -45, 178, 219, 429, 241, 289, -219, -304, -173, -137, 176, 126, 262, -31, 72, -172, -238, -434, -223, 83]
1629H3m6K70j31k1n22j34L50l7L82q8L32k09k2k52k40J84K50k82P60n3l2l39J39
1652C42m15j40J73J96p5K11O8k71j23k20j07l6K0R7K65M3J4n17j1Q1m88K70N05
1675a18j41L48j80L04n77l6R3J04K51L49J44k57O0l4k66J9K06J41r4L82P5k91
1697D82j47k02P5j37K61n8j42L16j11k34l31j52R2P7m4q4L30k70J50o74L70Q2
1719c51o7l7K15K93j31j3r9k21k3L19J31J97J98j66Jq7M0l18J80K92M4PO9j33
1743C40j4j41m54J07K22L5p1M35k00k91j75p6M2J92P7J33k39j00J32j63j52p3
1765d34J49O4L27j7L3O7n31Q9J84k53O7L49R7J2j29k56K60k09O9p7M70n0j36J15
1789B60k28l08j09K45k02K85R5L27k27j33l22N7m1K4M10r4M0j17Q7K7j19R9p8
$$ y = [83, 37, 307, 176, 155, -367, -501, -151, -188, 194, 106, 438, 229, 207, -45, -285, -101, 149, -133, 627, 574, 542, 203, 342, -73, -213, -40, 156, 81, 292, 360, 89, -34, -254, -361, -397, -377, -280, -15, 28, 42, -475, -486, -405, -893, -623, -118, -259, 89, -91, 213, -364, -400, -307, -203, 48, 397, 541, 284, 344, 310, 44, 63, 269, 410, 316, 698, 773, 482, 335, 133, 208, 71, 332, 274, 132, 448, 337, 103, -228, -380, -288, -211, -255, -339, -9, -279, -129, -803, -433, -351, -418, -455, -240, 53, -78, -91, -190, -411, -434, -115, 16, 213, 411, 245, 246, 159, 199, -119, 61, 353, 397, 404, 473, 340, 326, 185, -269, -162, 60, 95, 24, 459, 259, -32, -207, -283, -241, -49, 28, 161, -78, -178, -46, -209, -361, -434, -285, -221, 106, 89, 122, 189, -342, -253, -69, -322, -255, 94, 191, 203, 74, -182, 78, -131, -62, -139, 331, 281, 145, 260, 32, -276, -385, -140, -342, -57, 38, 365, 138, 5, -317, -260, -301, -277, 133, 39, 79, -38, 49, 76, -43, 56, -22]
1812b2J21l4K89j77O7l42J68k92L43k98L87K13j80k92K20m23k3J76q2J8J8L08
1834A63j71k50j88J77P2r3LK52J80m10k4l4J77j05K07Q9K14j7nk22K97m43R0K11
1858A70P7m2M41l00J03j50j20k10J58J03K2J41l67J82l23j37K05l2j82K48J24
1879A11Kk48j98p0mp3N6L67j82K42j00L0l91L25j46K30j18L14k05K64R4j46j81
1902b7M7J14j2J49K53qk74k6j35Q6l4J14n9M60l67k19J2p0o2k73J44O8J62P6o3
1927E6ro3r8J9l24L10J46J18Po5l4l96J94j50J56L51l69L17j55r0Q7k81K92k1
1951bK11m5R1l37J27J45k0k12K0J45n4J92j66j48j88J85J26K3P1nj15K93l35n0
1975d8l7P0m8L43j42k7N2M7l07J29j40lJ45O6J17k3k17K70k79k10J18L2J75k65
$$ y = [-22, 99, 65, 354, 177, 244, -98, 70, -222, 121, -177, 210, 423, 243, -49, 171, -252, -275, -99, -181, -163, -145, 163, -8, -258, -446, -269, -197, -290, -287, -35, 145, -265, -289, -323, -146, -251, -44, 45, 259, 242, 237, 15, 312, -131, -41, 170, 247, 205, 646, 346, 449, 299, 179, -31, 127, 230, 252, 393, 26, 208, -115, -252, -47, -79, -261, -13, 111, 113, -135, -333, -403, -407, -480, -424, -57, -239, 3, -97, -67, -458, -133, -279, -49, -167, 147, -58, 206, 300, 154, -27, 20, 134, 122, 271, 524, 516, 242, 216, 81, 167, 133, 247, 188, 648, 281, 62, 74, 4, -58, -331, -187, -119, 43, 119, 56, 47, -16, -114, -95, -419, -109, 37, 155, 162, 97, 63, -333, -139, -289, -133, 218, -151, 166, 11, -79, 8, -273, 19, -2, 209, 164, 255, -82, 45, 190, 170, -42, -22, 123, 69, 261, 95, -53, -241, -56, 70, 93, 164, 159, 44, 337, 2, -48, -85, -15, -63, 280, 138, 111, 163, 210, -97, 32, -108, -111, 34, 100, 217, 194, -23, 247, -32, -242, -124, -92, 83, -182]
1999a82q2K73n3k79Q4n6r4L00J8j46J05Q9k68N8l5J78J54MJ26k11R3k83J75K50
2023B18o4J97j61K09r9%k65jJ64p5K99j00q9k0j54j27R0N0p2j13p8N2J74p8p5
2048a18k19J31k19K18k31K35K60m0r4j55J1K21N6j75J22M06k08j49J8n0o3J32
2070H9L41j6j18l5k29J29m0J26j78M1J35j52J87k30o7Qj53m9R4j2K92M0k25j03
2094a25L3j48j22J63J50L0j4j96k6J48j50L46J58k35r4K42N7l71J21r3J56j24
2116i4O1J78o0N1j36j40J72j6j21n0K70J70l6k56j75J27m6J21j52K63k56J30R4
2139I9j20N9Qn6M1J67j11J81q2j14l7o7Q9Q0r1R4J60j99j9j42J22j4m8j4J83k12
2165d3k3Q5j56p9R2J22j23J39m3LjL6k13K9Q2n5K09K89j23k74P4J2K5j47%K38
$$ y = [-182, -264, 9, -44, -323, -239, -295, -389, -89, -71, -217, -112, -23, -291, -233, -268, -90, 64, 68, 194, -17, 76, -207, -32, 218, 154, 351, 190, 399, 300, 300, 35, 34, 198, 123, 422, 322, 233, 213, 59, -68, 22, 72, 0, -113, -191, -139, 35, -43, -118, -337, -206, -425, -207, -438, -203, 57, 17, -77, -232, -221, 0, 56, -119, 3, 409, 201, 52, 70, 20, -43, 89, 430, 414, 296, 261, 32, 161, 121, 247, 69, 110, 245, 93, 280, 50, -17, -9, -162, -211, -117, -129, 163, 203, -22, -125, -92, -240, -362, -199, -49, -19, -33, -229, -255, -107, -257, 89, 247, 12, -82, 160, 217, -154, -33, -126, 30, -94, -33, 145, 85, 136, 0, -140, 32, 16, -105, -155, 115, 285, 249, -7, -182, -55, -101, 20, -132, 131, -125, 5, 99, -21, 38, 46, -10, 31, 198, 87, 268, 186, 72, 35, -32, 57, 137, 46, 140, 300, 101, 82, -60, 62, 48, 0, -14, 169, -43, -66, 19, -137, -216, -124, -2, -125, 14, -29, -26, -27, 9, -204, -175, -93, -148, 61, 350, 227, -47, 27, 39, 64, -83, -83, 155]
2191A55L8l9L41l97l28N00j93L8K60l05j43J12j34K08N7l94N16l56O5o6j56M49
2213B28p18M82j48O0o2M2j0O5J81r0k31O5N5L59l00j2nJ21j66J20K3R7j27j0P6
2238I5n1K07j89j3L10l49j35K95j18m3K43k57J93l35j32K32j84J07j20K46n7M5
2260a0k91L38j45l05L55K07k95J04q2l0O1j34L15o1n7J38l9j17K9N5j37j8L79
2283B60r5l2n9m3j50L9j14NK28j4o2pp4M6q2j37r2K32K73J45j54k32J05l6J17
2308F7k33r8K94J8n8J96Q0l16n3J50k67J38J42P4J68N1k40l4j63J22rj42N8m7
2332a02j05K53j80j05J24K6j3M2j70P7J7l9j25J69j8L19N0k09rN8K0L5l15J78
2356b2R9K78j60K7k4l64M83K6j06m18M32J8N3k19j1n82O78j33q2k23K51L6k96
$$ y = [155, 193, 154, 495, 98, -230, 270, 77, 115, 375, 70, -73, 39, -95, 113, 170, -224, 292, -64, 1, -65, -221, 228, -490, -8, -156, -96, -158, -116, -126, -61, 120, 30, -201, -136, -81, 278, -22, -34, -39, 82, -84, 36, 59, 156, 29, 19, 95, 44, 251, 62, 49, 359, 10, -125, 170, 52, 9, 252, -5, 188, -147, -279, -47, -231, -124, -244, 2, -55, -10, -301, 37, -108, -413, -58, 149, -146, -42, -124, -154, -93, -227, 88, 27, -30, 108, 69, -48, -19, 36, -101, -119, 260, 165, 133, 74, 31, -119, -80, -194, -189, 39, 25, -37, -44, -118, -72, -154, -291, -383, -151, 122, 267, 113, -119, -14, -50, 67, -166, -264, 30, 48, -10, 186, 266, -50, -103, 47, -220, -82, 60, 134, 302, 353, 113, 79, -84, 38, 29, -113, -55, -102, -207, 46, -134, -239, -115, -89, -102, -60, -230, -153, -136, -175, -300, -131, -149, 170, 220, 11, 2, 60, 80, 115, -200, -22, 77, 355, 195, 222, 198, -166, 317, 343, 237, -181, 251, 269, 322, 103, 92, -490, 188, 55, -27, -250, 1, 37, -259]
2379b59R6L1N0Q2j68K26q9K6j18j57J26ko2r0N50L2l54J54k24P1j09J63kK25p1
2404A27j18J9J02l5j49qn1K72Q4j64j05nm8O3n9NJ29k5n3O4j97j8%nK0L9j0Q2
2432d4K56m73QJ43j4J44j72M89k38Nkr0j16J85p3L5j47K69R5k51J2j03L1K2M2
2457A3N8m0L8j26m1j06J90J51l09L47j4l56nK44q7J00j67J3K1J62R3J99m22Q7
2481D3r2J09K15l41J09l6L50l62j38J92j21j50K99pk79L84l01k01J34J9n6J19
2503a11K22q1k14K52j15j1oL7m1oJ85N0k64J88k6r2j17L49m7p9K07j34Q4j4r7
2528A19L3j84j36K96n7J0l0J02l1j73P6O2j7k73K12k13L2J49K4l30K07j26L45
2551I7m97L73o6l7J97j60K80l6PJ8j39m1n7Q3J04J00o3m43M68q0j35n7L6R8J10
$$ y = [-259, -163, -132, -82, 0, -168, 58, -31, -5, -123, -280, -154, -156, -218, -308, 242, 274, -80, 74, -150, -79, -188, -25, -27, 198, 127, 9, 28, 130, 95, -54, -62, -113, 159, 243, 79, -26, -31, -79, -16, -75, -70, 59, 34, -19, 45, -152, -170, -170, -175, -155, -116, -126, -44, 212, -261, -253, -110, -124, 20, -152, 337, 99, 104, 102, 12, -104, 81, 8, 43, -104, 165, 260, 9, 21, -82, -51, -29, 13, 71, 31, 69, -57, -98, -204, -14, 137, -172, 175, 161, -195, -200, 44, -43, 57, -110, -97, -76, 86, 179, 378, -44, 43, -49, 60, 275, -66, 43, 7, 357, -5, -143, 49, -72, -222, 77, 70, -209, 175, -126, -327, -193, -174, -230, -111, 111, 30, -184, 68, -47, -58, -64, -27, -68, -74, 111, 161, -103, 85, 59, -33, -150, 199, 152, 73, 280, 146, 230, 216, 119, 152, -32, -168, 128, 71, 81, 51, 153, 122, -51, 25, 87, 70, -203, 9, -204, -172, -23, 1, -329, -122, -248, 97, -400, -27, -93, -130, 67, -93, 187, 151, 158, 176, 37, -4, -61, 22, 126, 226, 163, -280, 188, 108, -27, -84, -48, 50, 160]
2576A60k81K34J22m7k75o8M68k37nK34j34k28R4Q3k22J75m50M12l7M8q7J97r2
2599F4k10K73j39j54J00J10L8j07J3N5o4J1n2Q2j3J79k0j60J93l18j00K78Jm21
2623c61M85k1n7k8j36J14o0j51J77R7k4J53j94mlJN0r5Q9J50O8k06p6lp0k02L56
2650D9n4J40q1mj07r4J46j27p2K37k78M4K96l82J3j24J94OJ88nJ72j98p3j7l2
2675a63J29m6n7K87K0j57J9J57j31N4j69j06K36J19k1j27J28j36k84L39m2o0n
2698a6j14L02m8m95N17j13k28M09j13n7l13K04l5k10K49M0j03j09L46k33K31m2
2720F9j72P1J68k47N6L20l2J06k88K3M4m6k05L37j10j06Q1l49M65R4j74j31K06
2743A80k99M15q3k20j50rK29n5o4j04J05J77l4o6m7J58j76QJ32j39K29k08k5J95
$$ y = [160, -121, 113, 235, 188, -87, -155, 313, 76, 71, 305, 171, -57, 37, 120, -102, 73, -377, 35, -2, 46, -41, 156, 64, -146, 127, -12, -166, -66, 44, 82, -25, -12, 43, -21, -10, -62, 20, 7, 186, 166, 6, 199, -119, -219, 59, 60, -361, 124, 103, 46, 18, -118, -4, -64, -215, -38, 59, 35, 188, -6, -10, -13, -12, 38, -57, 32, 182, 250, 44, -32, -35, -105, -307, 49, -5, 135, 54, 50, -57, -151, -5, -132, -204, 33, -245, -201, 95, -287, -274, -398, -204, -198, -10, -15, 157, -41, -114, -131, -163, -34, -80, -137, 150, 170, 13, 32, 189, 58, 112, -57, -163, 73, 192, 171, 44, 172, 36, -248, 91, 49, -11, -16, -130, 172, 124, -371, 146, 33, -195, 214, 101, 44, -269, -65, -100, -310, -61, -21, -124, -233, 113, -120, 111, 69, -103, -32, 136, -111, -55, 265, 233, 339, 51, 74, 118, 72, -133, 204, 94, -12, 69, -280, 185, 279, 105, -26, 180, -119, 296, 213, -7, -157, -166, 63, 8, -56, -160, -55, 122, 88, 22, -25, 133, -43, -35, 97, -42, 187, -21, -46, 149]
2767A49k52p4K35O7Q7j00K5P2L5k78q5oP3K91j27j74J9M1J4j80K20p8L00m12J43
2792Ej4k12J96J39m1p2K57l03K69l98N4J55L5j19J11J1K00j87k18P2j42O4J15
2815b3j80m3J75l8K08j44j34o9k8P2J06N7l2q4J72r0l8O4NM3o5p7J52R7j49k11
2841b54L2N4J04J4R9j36J10PK9o3n1K19r1p1L50l31J43l96M31k29k27L40J34n2
2865A65M8m17K29l4j18K40J35k60j03J78j91P2o5K08j92J98r7m4j06K85q3L0m72
2888c94J65K59m5J98k02j69L59J42l47j19K07J1m8k6J08k55K70n4L8Kr6J5j6l
2912@O0j44k8J68p0q9J86k7j21R3R1j42Q1k01kJ19J66k16J69j53j30L05l1k0l17
2937b53L86k64K12K19l98J13L7J93m50K19J93k63j9K05ok26J60n0J22j60K60P9
$$ y = [149, -103, -177, 58, 125, 212, 112, 137, 209, 244, -34, -119, -125, -52, 239, 112, -62, -43, -2, 12, -168, 52, -26, 274, -138, 5, -9, -221, -25, 114, 73, 1, 258, -45, 224, -174, -120, 35, 70, -49, 62, 73, 273, 86, -132, -60, -202, -138, -23, -203, -246, -71, -109, 99, -45, -179, -248, -276, -204, -98, -41, -73, -157, 15, -75, -113, -49, -44, -1, -66, -143, 9, 106, -43, -254, -222, -168, -64, -50, 49, -87, 23, 30, 59, -4, -55, 164, 73, 2, 352, 21, 164, -232, 199, -30, -257, 83, 217, 165, 213, -204, 25, -9, -127, 113, 248, -12, -115, 63, -128, -56, -121, 87, -105, 93, -4, -48, -154, 131, 48, 78, -394, -229, 30, -15, 183, -19, -188, 171, 313, -34, -153, 54, 65, 17, -9, 99, -156, 114, 60, 98, 100, 4, 19, 3, 0, 60, -84, -112, 56, -14, -103, 83, 56, -65, 28, 119, -23, 58, -143, -145, -26, 140, -76, 93, -60, -190, 115, 84, 64, -253, 133, -131, 81, 300, -98, 15, 52, 245, -205, 14, 207, -56, -75, 130, 124, -102, 58, 8, 130, -30, 230, 309]
2959C09l95K2L7J14j19l6J32pk06M65l55J42j70K80j73P1J65l62R0pl17K41K54
2982A75l11J76k5L05r5j60q1k72J50K23j09N7J1k37K49l68M39k55M2L45n25QK80
3005B2J73j86j99J36j7K82k62lJ04J14l51K67j46K3m2J46MO7j26j00M09j17q1
3028A17j51P7j04K70j00l34J25R7O6K10m03k6n5K42n2j78K24J38Kk72J11N1k23
3051a68K8J53J20j87J05J66l14k3J14J38m03K90K10k16R0N0N0l84K39J13L00o15
3073a44J55M7J78k60o6L38q1j29k56L32j83p2J43k12P8O6%K64m01O6J12k03K44
3096A6n8l17P21m37J6L76j33k06J06OM9j03m8k66K06N0M9l3o1K94m08J23J27j78
3120a09lJ17N1j58Q1J0j9j6k15P0L93k47K10j65K41q8m28L68j39K05j12k1j73
$$ y = [309, -86, -64, -27, 87, -32, -68, 64, 57, -149, 316, -39, 103, -67, 213, 40, 111, 276, -86, 4, -3, -320, -79, 175, -136, 40, 15, 320, 225, 65, -16, -288, -138, 85, -24, 33, 44, -193, 56, -312, 127, -128, -86, 259, -266, -258, 22, 195, 9, -190, -54, -71, 211, -51, -54, 50, 164, -187, 80, -66, -43, -85, 61, 65, 132, 6, -94, 315, 198, 117, -34, 43, -61, 209, 109, -225, -100, -3, 63, 273, -130, -156, -211, 31, -21, -199, 25, 163, 165, -107, 4, 55, -168, -140, 13, 133, -54, 51, 217, -97, -120, -6, 132, -271, 19, 229, 13, 103, 153, 203, -181, 58, 171, 471, -144, 11, 58, 236, -24, -90, 248, 167, 38, -218, 114, -69, -141, 2, -210, -132, -66, -66, 198, -203, -137, -25, -228, 16, -42, -359, 362, -75, -59, 317, 184, -22, 84, 90, 139, 36, -12, -278, -72, -22, 27, -6, -67, 227, -181, -58, 69, -109, -112, 5, 56, -102, -21, -11, -30, -46, -261, -191, 202, -45, 165, 0, 241, 153, -275, 93, -46, 159, 47, 26, -147]
3143a47m3K51q4J17P0j82P4K42m46O0R4J16j18k86K26J06Rq2j71q8L06j18O6O
3167b2J01j76j79l5K43j53M68J1k48q4J73n7m1l08K41J79k09M21l83K78m5Q5j30
3190A30k56ML19k13O6j31L9P7k20M8j09M6L90k41P3k59L00j12r5J49N6j6j46L2
3214f9p8l5K03M0o1k6J43k79J67J14l9j59l09L63j88K31q3J28J66m7k00K6J09
3237A17J4j70p5K17j6J55k27LK18n4j23k68L00k47K5K50j17O3j9j63J61o5J3j08
3261a16J56J17k03J76k17J49N7l47K80O3n4k99L62k5K2p6K20j29l87L32qQ4j72
3284a5j18K12j05P6K4n6j64J96j33J32L25m35J23l2pK89k79N3j4J18k5j42O8L2
3308A23p1P4r3p1J11k7j56J26j7J82j71M4l9K1k00p6O8L3L3J06J16j74L5l9RO0
$$ y = [-147, -190, 61, -23, 94, 164, -18, 56, 298, -148, -88, 6, 122, 4, -282, -56, 50, 59, -23, -194, -282, 24, -94, -28, -22, 79, -97, -276, -311, -68, -221, 247, 258, 10, -74, 99, 42, 1, -307, -66, 113, -96, 325, -58, 220, 175, 260, 130, -126, -122, 197, -16, 50, -81, -42, 35, -185, -137, -246, -200, 190, -51, 22, -237, 63, -49, -144, 5, 61, 45, -101, -69, -147, -182, 21, 61, 0, -26, 117, -162, 5, 119, 80, -79, -388, -25, -213, 18, -65, 63, 229, 182, -18, 8, 117, 131, -39, -114, 103, 87, 242, 15, 18, 236, 182, 59, -209, 91, -156, -131, 119, 2, 65, 46, -117, 44, -21, -8, -116, 40, 157, -46, 130, -87, 62, 119, -228, 52, 115, 61, -238, 124, 99, 121, 45, 265, 136, -251, 81, 73, 157, -15, -133, 79, -26, 50, 74, 18, -146, 50, -83, 49, 374, -61, 62, 30, 23, 312, 33, 86, 72, 190, 165, 23, 91, 123, 52, 126, 33, -38, 73, 46, -110, 16, -1, 181, 10, 54, 15, 36, -164, -240, -172, -139, -106, 0, 116, -58, -23, -62, -53, 7]
3334Gj9Q4k41L9QK51j94pk5m3rL74l9MN0k48J28R0l12J73J32q8j47j65J52P1P3
3361I9k03K1N9J14L3j5j05p7o7K54J4j04l0k01K75ljO5l16K62J69l35K02p1p1
3386c2K10k46q2L77j50j89q0r0L15k58L02J08k63J5J32q9R3J43k48l1L6m0Q4j55
3410a38J45o0m7J5J61j40o1q9K14k29N5j09J77j6K38q3r1j00J74j65L29k33J49
3433I6J4R6k81j58M32m31M1J17nJ73k84m4M10l79O4j41L31m5P1P4rj12J64l96
3457b02J87j43M07k38K02Lk04k91K38L8Q2k53K94pk4j80pK25k30Q2K33j02j65
3480e5J34l22J53L5l3P4M4mo6K39j33j73J18j8M2l8J21k37J88p6J0J28J72j68
3504A35j46J31Pk29J49j39K49l31R4J7q2L52rL5k01j04J06n7J5p6m1J22%Mn2K97
$$ y = [7, -12, 72, -169, -130, -122, 129, -65, -72, -97, -140, -149, 225, 186, 190, 240, -8, 120, 210, -102, 71, 203, 115, -32, -197, -45, 26, 99, -104, -83, -24, 90, 123, 108, 3, -74, -141, 113, 127, 23, -7, -208, 67, 64, 63, 128, -188, 74, 243, -92, 110, 39, -32, 178, -68, -150, 227, 77, -112, -192, -282, 33, -225, 77, 185, -78, -63, 69, -20, 73, 216, -32, -63, -27, -67, 17, -138, 7, -53, -100, -85, 76, -64, -125, -214, 0, -229, -174, -283, -106, -122, 116, 33, -58, -158, 16, -149, 180, -53, 96, 110, 206, -75, -233, 199, -232, -191, -74, -79, 94, -190, -234, 176, -203, -139, -280, 51, 6, 77, 151, 142, 30, 194, -202, -15, -158, 249, 11, 213, 216, 12, -279, -41, -3, 79, -174, 120, 113, 89, -91, -98, 127, -103, -21, 212, 110, -55, 79, -243, -90, -55, -88, -14, 30, 26, -40, 199, 66, -107, 11, -7, 35, -3, 118, -119, 69, -7, 3, 131, 303, 135, -11, 120, 127, -102, 47, -92, 157, -174, -80, -63, -145, 207, 198, 233, 32, -72, 34, -23, -8, -84, -125, -3, -3, 1, -51, 246]
3530B46p5j61P9j87K71l9m37K09nK05J89k28l38K10j5o9L0J12j78R5J06j2n6J54
3554A06r9J04j97K3RQ4K01l74k5J72J32Q6k31J18m1p2J14j18N1r4k3K15j11J55
3578A85m87J77K18j02n8J21k11J33K42k95K57k06Q9q0j76L10j66M4o3Q9J69l18
3600a28K98j61k16J64K9k3J10p7J11%L5q0J9l7p4J68m97O83k64r1N0j20K3L28
3624B50l46Q2l0J46r7l7k04J48K0L5M7r3K78l04J76q6k02N23m27j8KN0K15k04
3648g6J87j78j60P1m4J23K39j39O0l70K33O4N1k20J08j40P1J61L7j81J11k5q0
3671i7L3J3p1m0K58J97j48j74P5k49K68K38k78P6n6J85k79R5k53R5K18k7J31l51
3695a41J24J7p9l3K55q6%j8j42K47k07J91j53o4J29k29N8L36j22l60o4L47J31
$$ y = [246, 171, 10, 89, -98, 173, 134, -303, -94, -99, 106, 295, 67, -271, -61, -76, -145, -115, -3, -181, -86, 20, 8, -48, 106, 7, 111, -86, -63, -54, 30, 231, -143, -168, 4, 136, 222, -9, 109, 68, -4, 110, -8, 43, -51, -74, 141, 30, 185, -302, -125, 93, -9, -67, 54, -157, -24, 218, -77, 180, -26, 63, -17, -193, 117, -49, -5, -68, 21, 190, -128, 170, 9, -207, -43, -14, -37, 73, -4, 107, 107, 142, 62, 81, 44, -30, 138, -359, 324, 60, -31, 19, -101, -78, 250, -96, -14, -44, 102, 5, -32, -236, -88, -68, -33, 14, -79, 199, -105, 71, -15, -217, 306, -121, -139, -137, -87, 128, -76, 111, -67, -227, -156, -200, -77, 162, 23, 83, -287, -54, 10, 61, -159, -51, -191, -120, 41, 78, -103, 8, -17, -97, -64, -51, -122, -162, 96, 293, 145, -29, 46, -203, 65, 303, 25, 101, 45, 230, -49, 46, -207, -112, 106, 79, 210, -141, -17, 0, -79, -112, 143, 57, 57, 39, -103, 144, -63, 128, -25, -89, 40, -189, -131, 205, 83, -277, -341, 6, 137]
3718A37j74J78j87m3N8j00J67jj69P5J49r3K13j03j78Q6j24K61j42k04K69j80
3740a05M3J98M2m33J04J27j2J73q9R1l51L17k15O7j66J48k55K42J12M4nj92k8
3763a43J37NL4m0r7K14M1p2j51J4J59j81J0J06L7k62J98k2k1o7K42k9k2k53K02
3788C9j80J68J15j74o9qK20o1q8J19p2L6K5k1J17j71p0k27K43Q1k92L08k44p0
3812b76L25j18L70l94M8M0m7m0J56j52K08j99P3n0N9pQ2j05m2j86L0Q9J7Q5J21
3837H7j16J63k00L0M3j39J81k56K35L0nk82K91J46J2nk35J55J3j10Q7Nj59O2k28
3862a95K87j15n4K19j72J94k94K03k13K36r7l9j70K10k9J85K0j56j36qm1J82K1
3885C8%R1J75j38N5l79J89q6j48Q7M1J17M6l7o2r2J36K50l50L25j82k6nj56M0
$$ y = [137, -37, 141, -46, -89, -31, -131, 36, 35, -134, -59, 90, -3, 210, 107, -71, 15, -109, 152, 10, -194, 75, -105, -62, 136, 178, -255, -151, -24, -36, 137, 48, 139, -212, 105, -110, -43, -209, -61, -316, -74, 38, 82, 77, -115, -143, -6, -1, 33, -7, -104, 110, 151, 79, -72, -58, 101, -80, -70, 36, 73, -189, 9, -13, -34, -101, 141, 112, 90, -163, 39, -141, 27, 142, -32, -101, -109, 111, 50, -38, 81, 9, 45, 70, 49, 166, -5, -75, -302, -59, 22, -270, 38, -206, -276, 49, -69, 301, -93, -45, -5, -52, -92, 64, -88, 120, -79, -6, -56, 3, -4, 78, -27, -69, -255, -225, -136, -119, -34, 87, -29, 134, -66, -36, 7, -132, 49, -207, 28, 58, 53, -229, 62, 208, 220, 215, -20, 135, 148, 38, 125, 130, -29, 33, -195, 92, -23, -77, 142, -30, 164, -130, 73, -140, 96, -1, -40, -210, 0, -29, 156, 176, 20, -116, -124, -165, 17, 38, 38, 129, 304, 166, 221, -158, 31, -55, -203, -116, -75, 42, 88, 51, -11, -103, 33, 283, -67, 258, 76, 50, 45, -111, -71]
3910g1j56J01L07j44j55K13kj33m46P10j40l29L36l6j7k44O0Q3k6J68j88q3J26
3933f6M2J16Pn7N7j97J13J68q2nM8k11l1j80K36O2O3J82l94J68j29P5Or0L72j09
3959A64k43K26o8r1P7Kk10K24j22K85l26k53M84l87L58o5q2J31l4n8L08l79k57
3982c16M99l35K13l0j00J31L6k5n1j02J7Q4N1j14K2km4K08j60l4l2K23R6K2k65
4007hK4N2l09J02L72k83J79K0m3Q4k01K7J30k03K8P3l8J46R2J6k50M3j87K0K64
4032A50j81l5ok06J46N1J42j50J66J17r4J19j50l55J50K18k3j52J92J94j99j08
4054a4J43N5r2P0p2J63l58M7J69j70M3k1L11l99Q1K78m8j68Nk3J02j56p5J87R0
4079A48l32J79j00J44k21K22N5J09k16J59k07j06J61N3j72m7j44L84K4j01K9j09
$$ y = [-71, -227, -126, 181, 37, -118, 95, 93, -40, -486, 224, 84, -245, 91, 55, 38, -206, -146, -63, -89, 79, -109, -192, -66, -24, 92, 99, 42, 99, -98, 15, 183, 101, 96, 144, -67, -98, -278, -42, 20, 83, 265, -129, 39, -90, -15, -9, -99, 273, 164, -79, 147, 79, -12, 65, 67, -143, 81, -41, 244, -82, -335, 149, -238, 120, 55, -27, 104, 70, 12, 320, -59, -316, 183, -152, 61, 31, -69, 62, 98, 73, 22, -80, -63, 21, 72, -42, -20, -22, -66, 142, -18, -52, -84, 139, 235, 257, -8, 16, 68, -241, -139, 233, -50, 129, 149, 106, 190, -11, 16, 146, -57, -29, 44, 6, 152, 244, 260, 10, 53, -134, -114, 150, -31, -66, -72, -278, -132, -81, 61, -89, 77, 194, 100, 219, 69, -286, -136, 82, 59, -93, 99, 293, 94, -14, 129, 184, 92, 162, 90, 253, -105, -58, 111, -59, -16, -37, 274, -125, -44, 234, 186, 18, 23, 0, 102, -54, -129, 58, 148, -184, -5, -105, 39, -182, 40, 95, 204, -12, 147, -60, -166, -5, 48, -124, -171, -315, 69, 93, -8, 21, -88]
4101h8J35r5K3r7L23k32jJ98m6k31J34j86K12j9O8R5l11J45J5J08n2J05m50M49
4125B02k23M7j07j42J92Q4J3j18kj04K13m4K02P0p8k85N0J26k8j97q9Q3P5j08
4149a68M8L6r1Q1J22J36J48l34N4j82Q8j69L53Q0l9j53j10J71j85L37k33l9J0
4172c9p2l0J79k5J28j7j46j46M50m04L59p0k98J22k73M03J81l08pl7L20k38O9
4195A01q8J07j19j17J11M9J04Ok49K88j58J76k94J52pk58K94j07n6p1K28kJ5K4
4219A29j10n7M4L4j33J11P9L16k57j55O7j33K27r1k85P7K5K54l38M34q1m4j04
4242IOM8n2K36m76N29l35j23r0K33k23M40k27K4j78K56n6R1k99J18J1R2J41j08
4266F7j34P7j47J37j88K89K0j67K02k94J58q0M3j6q0n3K49Q6j31R7N1o8J37q7
$$ y = [-88, 47, -48, -25, -122, 201, -31, -32, 166, 120, -111, 23, -163, 49, 30, 98, 193, -118, 27, 42, 150, 98, 203, -247, 202, -21, 26, -81, -223, -31, 53, 66, -52, -54, -158, 55, 11, 213, 283, 205, -80, -30, 96, 68, -129, -218, -135, -60, -168, -120, -84, -175, -94, 28, 164, 312, -22, 32, -150, -62, -231, 122, 202, 163, 10, -100, 71, -114, 223, -10, -49, -39, -111, -141, 38, 13, 141, 124, -22, -168, 282, -122, 237, 167, -131, -9, -282, 121, 302, -6, -13, -50, 270, 32, 101, 13, 120, 1, -116, -5, 44, 148, 154, -95, 193, 35, 211, -83, 69, 62, -196, 98, -9, -65, -136, 92, 90, 105, 129, 19, -38, 6, 40, -93, 18, 97, 413, 156, 1, 68, -65, 162, 71, -214, -137, -112, 142, -196, 238, 157, 113, 9, 15, 63, 11, 247, -229, 300, -35, -158, -248, -15, -238, 202, -25, -1, -179, 77, 21, 112, -187, -69, -58, 34, 175, 67, -67, 10, -137, 0, -188, 101, 121, -46, 156, -138, 20, -60, -17, -33, -113, -166, 83, 169, 38, 135, 186, 118, 255, 168]
4290A68j60J77j62J8J20j38o6l1p7L68l3j99N8j3J67l52Q9R9m9Q2j90L98k63J10
4314A21n2m6l3L6K5m6j10m5K57j11J16j32K47m0j11k59K08j02L14j44l25K49L19
$$ y = [168, 8, 185, 23, 41, 161, 23, -43, -74, -151, 217, 184, -15, 43, 30, 197, -155, -66, 33, -16, 66, -124, 274, 11, 121, 69, 23, -10, 26, 51, 5, -105, -150, 107, -4, 112, -20, 227, 187, 76, -183, 25, -77, 237, 93, -232, 17, 336]
$$ [...]
8191h1
##END NTUPLES=NMR FID
##END=
