##TITLE=1H_SR87
 CDCl3
 8 sc, 
 11.1.2022
##JCAMPDX= 6.0         $$ Bruker NMR JCAMP-DX V2.0
##DATA TYPE= NMR FID
##DATA CLASS= NTUPLES
##ORIGIN= UXNMR, Bruker Analytische Messtechnik GmbH
##OWNER= root
$$ XWIN-NMR		Version 3.5
$$ Tue Jan 11 12:09:40 2022 Russian Standard Time (UT+4h)  she@DPX200
##.OBSERVE FREQUENCY= 200.131346
##.OBSERVE NUCLEUS= ^1H
##.DELAY= (6, 6)
##.ACQUISITION MODE= SIMULTANEOUS
##.ACQUISITION SCHEME= undefined
##.AVERAGES= 8
##.DIGITISER RES= 18
##SPECTROMETER/DATA SYSTEM= spect
##.PULSE SEQUENCE= zg30
##.SOLVENT NAME= CDCl3
##.SHIFT REFERENCE= (INTERNAL, CDCl3, 0, 15.7039)
##AUDIT TRAIL= $$ (NUMBER, WHEN, WHO, WHERE, WHAT)
$$ ##TITLE= Audit trail, XWIN-NMR		Version 3.5
$$ ##JCAMPDX= 5.01
$$ ##ORIGIN= Bruker BioSpin GmbH
$$ ##OWNER= she
$$ F:/spectra/data/she/nmr/H-F/1/audita.txt
$$ ##AUDIT TRAIL=  $$ (NUMBER, WHEN, WHO, WHERE, WHAT)
(   1,<2022-01-11 12:08:15.50 +0400>,<she>,<DPX200>,
      <created by zg, POWCHK disabled, PULCHK disabled
       configuration hash MD5:
       00 E9 B6 7A A2 85 ED C7 34 08 36 98 17 FE 4E 26
       data hash MD5: 16K
       3D F5 7A 4A EA 84 9E 6A AA DF 4E D1 D6 17 01 F3>)
$$ ##END=
$$ 
$$ hash MD5
$$ 6A 45 9D 6B FC EB E5 6A 48 FD 33 84 3E F3 44 CE
##$RELAX= 
##$RELAX= 
##$RELAX= 
##$RELAX= 
##$RELAX= 
##$RELAX= 
$$ Bruker specific parameters
$$ --------------------------
##$DU= <F:/spectra>
##$EXPNO= 1
##$NAME= <H-F>
##$PROCNO= 1
##$TYPE= <nmr>
##$USER= <she>
##$AMP= (0..31)
100 100 100 100 100 100 100 100 100 100 100 100 100 100 100 100 100 100 
100 100 100 100 100 100 100 100 100 100 100 100 100 100 
##$AQSEQ= 0
##$AQ_mod= 1
##$AUNM= <au_zg>
##$AUTOPOS= <>
##$BF1= 200.13
##$BF2= 200.13
##$BF3= 200.13
##$BF4= 200.13
##$BF5= 200.13
##$BF6= 200.13
##$BF7= 200.13
##$BF8= 200.13
##$BYTORDA= 1
##$CFDGTYP= 0
##$CFRGTYP= 5
##$CHEMSTR= <none>
##$CNST= (0..31)
1 1 145 1 1 1 1 1 1 1 1 1 1 1 1 1 1 1 1 1 1 1 1 1 1 1 1 1 1 1 1 1 
##$CPDPRG= <>
##$CPDPRG1= <>
##$CPDPRG2= <>
##$CPDPRG3= <>
##$CPDPRG4= <mlev>
##$CPDPRG5= <mlev>
##$CPDPRG6= <mlev>
##$CPDPRG7= <mlev>
##$CPDPRG8= <mlev>
##$CPDPRGB= <>
##$CPDPRGT= <>
##$D= (0..31)
0 1.2 0 0 0 0 0 0 0 0.06 0 0.03 0 0 0 0 0.0002 0 0 0 0 0 0 0 0 0 0 0 0 
0 0 0 
##$DATE= 1641888495
##$DBL= (0..7)
120 120 120 120 120 120 120 120 
##$DBP= (0..7)
150 150 150 150 150 150 150 150 
##$DBP07= 0
##$DBPNAM0= <>
##$DBPNAM1= <>
##$DBPNAM2= <>
##$DBPNAM3= <>
##$DBPNAM4= <>
##$DBPNAM5= <>
##$DBPNAM6= <>
##$DBPNAM7= <>
##$DBPOAL= (0..7)
0.5 0.5 0.5 0.5 0.5 0.5 0.5 0.5 
##$DBPOFFS= (0..7)
0 0 0 0 0 0 0 0 
##$DE= 6
##$DECBNUC= <off>
##$DECIM= 32
##$DECNUC= <off>
##$DECSTAT= 4
##$DIGMOD= 1
##$DIGTYP= 9
##$DL= (0..7)
0 120 120 120 120 120 120 120 
##$DP= (0..7)
150 150 150 150 150 150 150 150 
##$DP07= 0
##$DPNAME0= <>
##$DPNAME1= <>
##$DPNAME2= <>
##$DPNAME3= <>
##$DPNAME4= <>
##$DPNAME5= <>
##$DPNAME6= <>
##$DPNAME7= <>
##$DPOAL= (0..7)
0.5 0.5 0.5 0.5 0.5 0.5 0.5 0.5 
##$DPOFFS= (0..7)
0 0 0 0 0 0 0 0 
##$DQDMODE= 0
##$DR= 18
##$DS= 0
##$DSLIST= <SSSSSSSSSSSSSSS>
$$ [...]
##$SUBNAM2= <"">
##$SUBNAM3= <"">
##$SUBNAM4= <"">
##$SUBNAM5= <"">
##$SUBNAM6= <"">
##$SUBNAM7= <"">
##$SUBNAM8= <"">
##$SUBNAM9= <"">
##$SW= 18.0517287032376
##$SWIBOX= (0..15)
0 0 2 0 0 0 0 0 0 0 0 0 0 0 0 0 
##$SW_h= 3612.71676300578
##$TD= 16384
##$TD0= 1
##$TE= 0
##$TE2= 300
##$TE3= 300
##$TEG= 300
##$TL= (0..7)
0 120 120 120 120 120 120 120 
##$TP= (0..7)
150 150 150 150 150 150 150 150 
##$TP07= 0
##$TPNAME0= <>
##$TPNAME1= <>
##$TPNAME2= <>
##$TPNAME3= <>
##$TPNAME4= <>
##$TPNAME5= <>
##$TPNAME6= <>
##$TPNAME7= <>
##$TPOAL= (0..7)
0.5 0.5 0.5 0.5 0.5 0.5 0.5 0.5 
##$TPOFFS= (0..7)
0 0 0 0 0 0 0 0 
##$TUNHIN= 0
##$TUNHOUT= 0
##$TUNXOUT= 0
##$USERA1= <user>
##$USERA2= <user>
##$USERA3= <user>
##$USERA4= <user>
##$USERA5= <user>
##$V9= 5
##$VALIST= <valist>
##$VCLIST= <CCCCCCCCCCCCCCC>
##$VD= 0
##$VDLIST= <DDDDDDDDDDDDDDD>
##$VPLIST= <PPPPPPPPPPPPPPP>
##$VTLIST= <TTTTTTTTTTTTTTT>
##$WBST= 1024
##$WBSW= 4
##$XGAIN= (0..3)
0 0 0 0 
##$XL= 0
##$YL= 0
##$YMAX_a= 73305
##$YMIN_a= -59958
##$ZGOPTNS= <>
##$ZL1= 120
##$ZL2= 120
##$ZL3= 120
##$ZL4= 120
##$ABSF1= 10
##$ABSF2= 0
##$ABSG= 5
##$ABSL= 3
##$ALPHA= 0
##$AQORDER= 0
##$ASSFAC= 0
##$ASSFACI= 0
##$ASSFACX= 0
##$ASSWID= 0
##$AUNMP= <proc_1d>
##$AZFE= 0.1
##$AZFW= 0.1
##$BCFW= 1
##$BC_mod= 2
##$BYTORDP= 1
##$COROFFS= 0
##$CY= 11.3945322036743
##$DATMOD= 1
##$DC= 2
##$DFILT= <>
##$DTYPP= 0
##$F1P= 2.36226072786647
##$F2P= -0.459571619588291
##$FCOR= 0.5
##$FTSIZE= 0
##$FT_mod= 4
##$GAMMA= 1
##$GB= 0.15
##$INTBC= 1
##$INTSCL= 1
##$ISEN= 128
##$LB= 0.24
##$LEV0= 0
##$LPBIN= 0
##$MAXI= 10000
##$MC2= 0
##$MEAN= 0
##$ME_mod= 0
##$MI= 1.114404
##$NCOEF= 0
##$NC_proc= 0
##$NLEV= 6
##$NOISF1= 3.799351
##$NOISF2= 2.8
##$NSP= 1
##$NTH_PI= 0
##$NZP= 0
##$OFFSET= 15.70392
##$PC= 1
##$PHC0= -15868.37
##$PHC1= 13.00079
##$PH_mod= 1
##$PKNL= yes
##$PPARMOD= 0
##$PSCAL= 0
##$PSIGN= 0
##$REVERSE= no
##$SF= 200.130013532006
##$SI= 16384
##$SIGF1= 3
##$SIGF2= 2
##$SINO= 400
##$SIOLD= 16384
##$SREGLST= <1H.CDCl3>
##$SSB= 0
##$STSI= 0
##$STSR= 0
##$SW_p= 3612.71676300578
##$SYMM= 0
##$S_DEV= 0
##$TDeff= 0
##$TDoff= 0
##$TI= <>
##$TILT= no
##$TM1= 0
##$TM2= 0
##$TOPLEV= 0
##$USERP1= <user>
##$USERP2= <user>
##$USERP3= <user>
##$USERP4= <user>
##$USERP5= <user>
##$WDW= 1
##$XDIM= 8192
##$YMAX_p= 0
##$YMIN_p= 0
$$ End of Bruker specific parameters
$$ ---------------------------------
##NTUPLES= NMR FID
##VAR_NAME=  TIME,          FID/REAL,        FID/IMAG
##SYMBOL=    X,             R,               I
##VAR_TYPE=  INDEPENDENT,   DEPENDENT,       DEPENDENT
##VAR_FORM=  AFFN,          ASDF,            ASDF
##VAR_DIM=   8192,          8192,            8192
##UNITS=     SECONDS,       ARBITRARY UNITS, ARBITRARY UNITS
##FACTOR=    0.0002768,     1,               1
##FIRST=     0,             0,               0
##LAST=      2.2672688,     0,               0
##MIN=       0,             -59958,          0
##MAX=       2.2672688,     73305,           0
$$ Real data points
##PAGE= N=1
##DATA TABLE= (X++(R..R)), XYDATA
0@%%%%%%%%%%%%%%%Qj6J6j6J6k3L1l2M0m8N5o3P2q4R3j06J22j39J58j80K03k28
$$ 0 0 0 0 0 0 0 0 0 0 0 0 0 0 0 0 8 -8 8 -8 8 -15 16 -16 24 -24 31 -32 40 -44 49 -57 65 -74 84 -96 107 -121
37a21K57k88L21l58L98m42M92n42N98o63P31q03Q86r79J076j186J309j444J597
$$ -121 136 -152 169 -189 209 -233 259 -283 315 -348 383 -420 466 -513 563 -623 686 -758 839
56H39j771J970k200K468k786L175l658M277n109O286q099J1284j8555O9909J5275
$$ 839 -932 1038 -1162 1306 -1480 1695 -1963 2314 -2795 3491 -4608 6676 -11879 58030 73305
71G3305m6440L0349m1167j8771J6048n357k1263J8736q249j6221J477r562k0894
$$ 73305 26865 57214 16047 -2724 13324 7967 -13296 5440 -2809 -19030 -17553 -27115 -48009
84d8009J0903j346o843J8550Q765q644K5717K0273k681J4979M578k4921N797J2100
$$ -48009 -37106 -38452 -45295 -26745 -17980 -26624 -907 19366 16685 31664 36242 11321 17118 29218
98B9218j7507J752J8492o705j56Q593j8603j8378k767k0524j2083J3393l740n364
$$ 29218 11711 13463 31955 25250 25094 33687 15084 -3294 -6061 -26585 -38668 -25275 -29015 -34379
112c4379J8210j905q389K0929K348j5369J5266O780j2600J5249J3808j1668J1825
$$ -34379 -16169 -18074 -26463 -5534 -3186 -18555 -3289 3491 -9109 6140 19948 8280 20105
125B0105K1461q528n134P004j7178j7878N50r233o164R298k731l842P368q135
$$ 20105 41566 33038 27904 34908 17730 -148 402 -8831 -14995 -5697 -8428 -12270 -4902 -13037
139a3037r492L874p267o472J4881O067j225J5109Q521k781J0603P220q507J730
$$ -13037 -22529 -18655 -25922 -32394 -17513 -11446 -12671 2438 10959 8178 18781 26001 17494 19224
153A9224K809j2350k084N053p556J95P944q120m581J957j4724j1314J930n556
$$ 19224 22033 9683 7599 12652 5096 5291 13235 5115 534 2491 -12233 -23547 -21617 -27173
167b7173j737J3021M784O01J1495L634o010M902L233n905M951P109k779M265O114
$$ -27173 -28910 -15889 -11105 -10504 991 4625 -1385 3517 6750 845 5796 12905 10126 14391 20505
182B0505m211r4J431p884n965l305j0611m887J503k898J571O732j01r81L606l288
$$ 20505 16294 16200 17631 9747 3782 477 -10134 -15021 -13518 -16416 -14845 -8113 -8214 -9195 -5589 -8877
198h877n025L960J620R67J0509P158J296O899K442n290Q5j469p569j959n10n122
$$ -8877 -13902 -9942 -8322 -7355 3154 10312 11608 18507 20949 15659 15744 14275 6706 4747 4237 -885
214h85q89J864l773j237J051m616m802k08l711k916M920M267L797Q819N528J232
$$ -885 -1774 90 -3683 -4920 -3869 -8485 -13287 -13495 -17206 -20122 -15202 -10935 -7138 1681 7209 8441
230H441L192l21k989Q2r2j023K389J877k06k62j395m821m498m257n735l635j329
$$ 8441 11633 11312 8323 8405 8313 7290 9679 11556 11350 11088 9693 4872 374 -3883 -9618 -13253 -14582
247a4582k121J082L805J868K705M383O25r6J528m50O14L421L983L472M307K933
$$ -14582 -16703 -15621 -11816 -9948 -7243 -2860 -2235 -2331 -803 -1253 -639 2782 6765 10237 14544 17477
263A7477m89j440l027n877m674l059l774j573M53o02nm2j221j328j723j046RN56
$$ 17477 16988 15548 12521 6644 1970 -1089 -4863 -6436 -5983 -6585 -6590 -6632 -7853 -9181 -10904 -11950 -11941 -11385
281a1385K931M047M356M618M709K671P85j37j576k466k033q95o86l40J104j003
$$ -11385 -8454 -4407 -51 4567 9276 11947 12732 12595 11019 8553 6520 5625 4939 4599 5703 4700
297D700j757k052m194m281k996k545j621J254K005K793L815L250K106J204R48
$$ 4700 2943 891 -3303 -7584 -10580 -13125 -14746 -13492 -11487 -8694 -4879 -1629 477 1681 2629
312B629K51l97Q92J424J447K174K396P84j52j941k616m106m726k738k601j384
$$ 2629 2880 2483 3375 4799 6246 8420 10816 11600 11448 9507 6891 2785 -1941 -4679 -7280 -8664
328h664Q08O61J131J534K11j218rk37n31O19K602L004K750L895K448Q81N66j211
$$ -8664 -7856 -7195 -6064 -4530 -4319 -5537 -5546 -5783 -6314 -5695 -3093 -89 2661 6556 9004 9885 10451 9240
346I240k449k179j833k439l07p3q1J75j15j264k010k360j733j631k28J061K217
$$ 9240 6791 4612 2779 340 33 -40 -121 54 -61 -1325 -3335 -5695 -7428 -9059 -9287 -8226 -6009
363f009K853L189K471K017N41l60m54j408k60K99J34R50J312J35n21j188k174
$$ -6009 -3156 33 2504 4521 5062 4702 4248 2840 2580 2879 3013 3963 5275 5410 4889 3701 1527
380A527l035k633k074j106l74J693J290J536K567O38k56L91p80m36L45J148J603
$$ 1527 -1508 -4141 -6215 -7321 -7695 -6002 -4712 -3176 -609 29 -227 164 -616 -1052 -707 441 2044
397B044J741J984J205n2m04j891k933k079j858j929j66N84K96J359M49J97o48
$$ 2044 3785 5769 6974 6922 6518 4627 1694 -385 -2243 -4172 -4338 -3754 -3458 -2099 -1650 -1453 -2101
414b101r38n17p15O4J305J717K809K727J101J046N07j680j260j658j725p36l47
$$ -2101 -3039 -3556 -4271 -4207 -2902 -1185 1624 4351 5452 6498 7005 5325 4065 2407 682 -54 -401
431d01k72R55j05j51q95j470j894j143r39m67J139J485J582K554K680Q19M05Q96
$$ -401 -673 282 177 26 -869 -2339 -4233 -5376 -6315 -6782 -5643 -4158 -2576 -22 2658 3477 3882 4778
449D778j212j362M43j93l22J838P55p28M45j090k746j959k388j775j284M41M66
$$ 4778 3566 2204 2647 2454 2132 3970 4725 3997 4442 3352 606 -1353 -3741 -5516 -6800 -6359 -5893
466e893Q25K336N98N20J088m37m51J065O8P46K009J472J415J666K46o43q24k328
$$ -5893 -5068 -2732 -2134 -1614 -526 -963 -1414 -349 -281 465 2474 3946 5361 7027 7273 6630 5806 3478
484C478k372j696j059j660J76P87l86M92Mk062m76m6j395R03J698J019K067K893
$$ 3478 1106 -590 -1649 -3309 -3133 -2346 -2732 -2240 -2236 -4298 -4774 -4820 -6215 -5312 -3614 -2595 -528 2365
502B365J519Q18J235l56j078n06p64j446L90K08m84M58N4k106j122j730k315j303
$$ 2365 3884 4702 5937 5581 4503 3997 3233 1787 2177 2385 1901 2359 2413 307 -815 -2545 -4860 -6163
520f163k15k59J039J911J262J555J280K50p6M93j87p8J493Q95O6J992K25n46M5
$$ -6163 -6378 -6637 -5598 -3687 -2425 -870 410 660 584 1077 890 812 2305 3200 3266 5258 5483 4937 4982
539D982j127k728j142j531k332K47k15M9J173J012l60l82N10j427m54R73Q69J204
$$ 4982 3855 1127 -15 -1546 -3878 -3631 -3846 -3797 -2624 -1612 -1972 -2354 -1844 -3271 -3725 -2752 -1883 -679
557f79K462J418N82J312q0j277j54j180j553n6m05q92K92J58p28J51n81j425j139
$$ -679 1783 3201 3783 5095 5015 3738 3584 2404 851 795 390 -502 -210 -52 -780 -629 -1210 -2635 -3774
576c774k09j148O30J484P90K005K356J17O28L56j175p77O76p09J01J186L1l14
$$ -3774 -3983 -5131 -4501 -3017 -2227 -222 2134 2251 2879 3235 2060 1283 1959 1250 1351 2537 2568 2254
594B254K6p90j378j144q77j683o42N86l23R60J545N47N34J316p22m11P99r23L89
$$ 2254 2280 1490 112 -1032 -1909 -3592 -4234 -3648 -3971 -3011 -1466 -919 -385 931 209 -202 597 -326 63
613F3J476Q86J133P77K85j484o92r61j918j241n47o66K39K41P0L47K32n38K83
$$ 63 1539 2425 3558 4335 4620 3136 2444 1483 -435 -1676 -2223 -2889 -2650 -2409 -2339 -1992 -1760 -2298 -2015
632b015Q1o18L88J009L65J735J413J186O69N82n67j116p76r18j460L53j39k88
$$ -2015 -1934 -2552 -2164 -1155 -790 945 2358 3544 4213 4795 4228 3112 2336 1418 -42 311 172 -116
650a16J46k64j184o38r28j481l71L11N54Q48J171J406J223Q03P64M32K53O4q03
$$ -116 30 -234 -1418 -2056 -2984 -4465 -4836 -4525 -3971 -3123 -1952 -546 677 1480 2244 2676 2929 2993 2190
669B190M60L26k28O02k85J78l52j670j475j634j505q04m63k8Q19O41N47P44R1
$$ 2190 2650 2976 2748 3350 3065 3243 2891 1221 -254 -1888 -3393 -4197 -4660 -4688 -3869 -3228 -2681 -1937 -1846
688a846L57o0L68Q27R57J086J431K88J224N91l99l34p30j676r71j165p27m78k12
$$ -1846 -1489 -1549 -1181 -354 603 1689 3120 3408 4632 5223 4824 4490 3760 2084 1113 -52 -779 -1257 -1469
707a469k30L1p44j92q87q11j54J3Q30J214J412J495J150Q31R84j40n9Q8m63q7
$$ -1469 -1699 -1668 -2412 -2604 -3491 -4302 -4456 -4443 -3613 -2399 -987 508 1658 2489 3473 3333 3274 3362 2899 2812
727B812J31m66K87l45q21m50j118j199r48j684m61nK07L70Q23P61R47N69J26N3
$$ 2812 2943 2477 2764 2419 1598 1148 30 -1169 -2117 -3801 -4262 -4267 -4060 -3690 -2867 -2106 -1159 -590 -464 -411
747d11M35L14P02P41J382N20K43K2j96p30r22r43j114q97q24n8l01K8p0LO3l88
$$ -411 24 338 1040 1781 3163 3683 3926 3948 3752 3022 2100 1157 43 -854 -1678 -1736 -2037 -2009 -2079 -2076 -2013 -2401
769b401m60K70j8K01J416J293P64J513N36L51j34m82n15q21q8r1l71o0l73j82
$$ -2401 -2861 -2591 -2609 -2408 -992 301 1065 2578 3114 3465 3331 2849 2334 1513 1425 1334 963 903 530 348
789C48l75j051r20k95q02n52N33L72N00J247P06Q70N82M2K27j69K6J38L93N12
$$ 348 -27 -1078 -1998 -2293 -3095 -3647 -3114 -2742 -2242 -995 -289 581 1163 1205 1432 1263 1289 1427 1820 2332
809B332N5j8L5p21o53q92j071r70m32k17k26R00k24L28O95Q6J64R8K69J13K39
$$ 2332 2387 2369 2404 1683 1030 138 -933 -1903 -2335 -2552 -2778 -1878 -2102 -1774 -1079 -993 -829 -731 -462 -349 -110
830a10J204L99O14J077j3j32k88j073o36p96q61l62k76j04J07k69l50K49n17j61
$$ -110 1094 1493 2107 3184 3171 3039 2751 1678 1042 246 -615 -977 -1253 -1357 -1250 -1519 -1869 -1620 -2137 -2298
850b298k83M7Q85O60Q79J156N75O48M44J10j09k79m67k65l47n5j54k51m94o14
$$ -2298 -2581 -2534 -1649 -989 -110 1046 1621 2269 2713 2823 2714 2435 1968 1703 1356 1301 1147 896 402 -212
870b12o41r19r30j92m30k78O36P07L20R16Q20L12O66J66K84M76N2L79L41O35J84
$$ -212 -853 -1772 -2702 -2894 -3324 -3602 -2966 -2259 -1939 -1023 -203 109 775 941 1225 1701 1753 2132 2473 3108 3292
891C292l20m84o35r97p71q90q59q71N1L3J09q5k7L63l02K17N06L77N81Q66P67
$$ 3292 2972 2488 1853 856 85 -805 -1664 -2535 -2484 -2451 -2342 -2427 -2454 -2091 -2393 -2176 -1670 -1293 -712 154 921
912I21J161N52M11K18J22k07o52o11o02m80n34j89l15m73k77o68n03q31l54j36
$$ 921 2082 2634 3045 3263 3385 3178 2526 1915 1313 833 299 110 -205 -678 -955 -1623 -2126 -2957 -3311 -3447
932c447J86L02J056M76J154P68K38P26M36m3l3L98o5N10r1m5l62l28o98p40j251
$$ -3447 -3261 -2959 -1903 -1427 -273 495 733 1459 1895 1852 1819 2217 2152 2662 2571 2526 2164 1836 1138 398 -853
953h53n26n50q48K50J7j88M92J23M40L60M5K88L65M86O78O43M94J053Q6j81J26
$$ -853 -1379 -1929 -2777 -2527 -2510 -2698 -2206 -2083 -1643 -1283 -1238 -950 -585 -99 579 1222 1716 2769 2855 2674 2800
974B800q24l19l86n38m19n81j01m23m6o32J41o06k02J70l43L24K87O04Q66O26
$$ 2800 1976 1657 1271 733 314 -267 -368 -791 -837 -1469 -1328 -1934 -2136 -1966 -2309 -1985 -1698 -1094 -228 398
994C98P34J88K48N8N2j42o8NR5n7l99k42l54q63q7q07l53k88r8J29K44K78L53
$$ 398 1132 1320 1568 1626 1678 1536 1468 1473 1568 1511 1112 870 516 -347 -434 -1241 -1594 -1882 -1980 -1851 -1607 -1329 -976
1017i76N23K95J19K15kJ64L39O18k5K69P16m99l0l60o21o67m22o29p6J18k61q9
$$ -976 -453 -158 -39 176 174 338 677 1295 1270 1539 2255 1756 1726 1366 745 78 -344 -973 -1049 -931 -1192 -1281
1039a281M9L24p5j22j2J73J02L50L15M25R07m1O09K12j05l16l36m02k49p97Q0
$$ -1281 -1232 -908 -983 -1105 -1117 -944 -842 -492 -177 248 1155 1114 1723 1935 1830 1514 1178 776 527 -270 -190
1060a90R7k89j84q2k28l98k66p0j79j33N87M30O22P16O16j5P81n89N1J87k81r2
$$ -190 -93 -382 -566 -648 -876 -1274 -1540 -1610 -1789 -1922 -1335 -905 -283 433 1049 1034 1815 1226 1277 1464 1183 1091
1082A091K53j49J0m35l09j82p44n93n58k81j23J07nN55L42K88K51J06K39M65K16
$$ 1091 1344 1195 1205 770 461 279 -465 -1058 -1616 -1897 -2020 -1913 -1918 -1363 -1021 -733 -482 -376 -137 328 544
1103E44K31L62K25M82L75rl7m00k92o03o22m41n49n8k86j37o6k9l48Rk22K04K93
$$ 544 775 1137 1362 1844 2219 2210 2173 1773 1481 878 256 -185 -734 -792 -1078 -1215 -1281 -1310 -1658 -1649 -1871 -1667 -1374
1126a374L88K60N88P81M30M55L7M15p7j29j37j84l10mm85j69Q4q59o0o99m44j66
$$ -1374 -986 -726 -138 643 1073 1528 1565 1980 1903 1774 1637 1453 1143 1139 654 485 569 -290 -350 -1049 -1493 -1659
1148a659l99K18n0J08K82N81N06J26N17Q3J07M12K37J40K50K41o7K25n86j01l66
$$ -1659 -2058 -1840 -1890 -1782 -1500 -919 -413 -287 230 313 420 832 1069 1209 1459 1700 1633 1858 1272 1171 805
1169H05j80n30o47l18l14M6j09k76J68J69J82q2l56N82M52J48N20K91M06K61N58
$$ 805 625 95 -552 -870 -1184 -1138 -1247 -1523 -1355 -1186 -1004 -1086 -1442 -860 -408 -260 260 551 957 1218 1776
1190A776r3n34j28J83n58m1j69j12j18l00j19l29k13o05p2J50L0J61J89L45L74
$$ 1776 1683 1149 1021 1204 646 605 436 324 206 -94 -213 -542 -755 -1360 -1432 -1282 -1252 -1091 -902 -557 -183
1211a83L19K21K72o2j6K22lQ0j79J31m2j62j16k25k85m9n15l39O1j40K77J5K46
$$ -183 136 357 629 567 551 773 770 850 671 802 760 598 482 257 -28 -77 -592 -931 -870 -1010 -733 -718 -472
1234d72J77N5P3L5O5M1J11m6M32L82l26L9K01pl01L2m36j43m39MN5l37O2J20l20
$$ -472 -295 -240 -167 -132 -67 -26 85 39 471 853 527 566 767 760 459 491 55 -88 -527 -523 -468 -805 -743 -623 -943
1259i43N53l45J55QL79M1J72P1N60J17q5L48r5m74J57k66j43j87k30J85l88J33
$$ -943 -390 -735 -580 -572 -193 -152 20 91 651 768 683 1031 936 462 619 353 210 23 -207 -22 -410 -277
1281b77k77m06q8N6n7J49K70J09M78K76J3K98R4J68K0J36n5j31K5M7p5J7j39m92
$$ -277 -554 -960 -1048 -992 -1049 -900 -630 -521 -43 233 246 544 638 806 826 962 907 776 801 848 773 790 651 159
1305A59j14m95m01k97r3l17M06J6L20J56J79J6K32K25pL57J99L76J31L35l7j7
$$ 159 45 -450 -851 -1148 -1241 -1558 -1152 -1136 -816 -660 -481 -465 -233 -8 -15 342 541 917 1048 1383 1346 1329
1327A329ol33l25k87l16M1n00j13n2k57k52l5J49k49N6j51M91K4M33M66j80N68
$$ 1329 1323 990 665 378 62 103 -397 -510 -562 -819 -1071 -1106 -957 -1206 -1150 -1301 -810 -786 -353 113 -67 501
1349E01N15k78M98K29m15n4J7q9j09k9j87l87m61p1k88o02K02m25O6J63J66K95
$$ 501 1016 738 1236 1465 1050 996 1013 924 815 786 599 212 -249 -320 -608 -1210 -1008 -1433 -1367 -1204 -1038 -743
1371g43P1J55J40J76L87M8L39j6K66K18J09J41q5k33P4m31n68%l11j32k73j16
$$ -743 -672 -517 -377 -201 186 234 573 557 823 1041 1150 1291 1206 973 1047 616 48 48 -263 -395 -668 -784
1393g84K03k07P4j17m6L4J84r8M15m1O08L2N11oK17r8j46J07l60L0Ml28J08mm69
$$ -784 -581 -788 -714 -831 -877 -843 -659 -757 -342 -383 225 257 768 762 979 881 735 842 482 512 516 188 296 292 -177
1418a77J37n07J9q4j22j73K13l7J73J05M76j22N5J40Q5J59K4Q6K19J84k98P2j66
$$ -177 -40 -547 -528 -612 -734 -907 -694 -731 -558 -453 23 -99 -44 96 181 340 364 450 669 853 555 627 461
1441D61K3p7o40q5J64l40j80R9J27j14J35K19j79J08K33O5p5M26o1L32o6M4j2
$$ 461 484 407 -233 -318 -154 -494 -674 -575 -448 -562 -427 -208 -387 -279 -46 19 -56 370 309 641 575 619 607
1464F07J07j03l48j70j61L9k81K3Nj33L64n70J01q4n7j3R6M62M27M4j5K52K70
$$ 607 714 611 263 93 -68 -29 -310 -287 -282 -415 -51 -621 -520 -604 -661 -674 -578 -116 311 355 340 592 862
1487H62j95K16j93m74K03j24n2J27l02J50n44m2N4j43o43L18k09J7L03P8L20J60
$$ 862 667 883 690 216 419 295 243 370 68 218 -326 -368 -314 -457 -1100 -782 -991 -974 -671 -593 -273 -113
1509a13K31J03J29M3J80j9K43Q4k97K19K69m90J31m55j01m99j52P8k90j39J19
$$ -113 118 221 350 393 573 554 797 881 584 803 1072 582 713 258 157 -342 -494 -416 -706 -845 -726
1530g26j35J57j88K24L18j80J27K13K98J56J06K00K67J85K40p7l25m66J08j37
$$ -726 -861 -704 -892 -668 -350 -530 -403 -190 108 264 370 570 837 1022 1262 1185 860 394 502 365
1550C65m14K23k01k71k02k61j58j57J58l16l1L10J72L52M35J79J21J09L22j96
$$ 365 -49 174 -27 -298 -500 -761 -919 -1076 -918 -1234 -1265 -955 -783 -431 4 183 304 413 735 539
1570E39K81K02j20J22J29l31m7l4l10k38m3m25m43KO3k28L4j69O1L76J35k71N
$$ 539 820 1022 902 1024 1153 822 775 741 431 193 150 -275 -718 -716 -653 -881 -847 -1016 -955 -579 -444 -715 -710
1593g10N37mN03qJ33K64K07J18q0J1m44K87k15l76k64O6k03j76k9Q0r0n22j24
$$ -710 -173 -177 326 318 451 715 922 1040 960 971 527 814 599 223 -41 25 -178 -354 -383 -303 -393 -915 -1039
1616a039J02O7K05J73K59M5M25O4J64l0J0J13k91M12j74J4N8J18m68j1j72j70
$$ -1039 -937 -870 -665 -492 -233 -188 237 301 465 435 445 558 267 679 505 519 577 695 227 216 44 -126
1638a26j97j59r7N0k44jK71J37P7l8K80K23L2rK38j71K46j29J04m5M0Q9j28o57
$$ -126 -323 -482 -579 -529 -773 -774 -503 -366 -289 -327 -47 176 208 199 437 266 512 383 487 442 482 571 443 -214
1662b14K19J78o78J88J09j66o8K55l35J84q4J0J75J70J32O8K66P3K1k12L16k82
$$ -214 5 183 -495 -307 -198 -364 -432 -177 -512 -328 -412 -402 -227 -57 75 143 409 482 503 291 607 325
1684C25k44K83j55k90j8j0k14Qq1K14k50J7Kjm7L70L2J55J71r2m2K74J4k43L71
$$ 325 81 364 209 -81 -99 -109 -323 -315 -396 -182 -432 -415 -413 -414 -461 -91 -59 96 267 175 133 407 421 178 549
1709E49m8k54j2O0p4P2k47m2j8o44p3j8R3J24L2O2J62j7L39Q3j24K8L14J74J10
$$ 549 501 247 235 295 221 293 46 4 -14 -658 -731 -749 -656 -532 -500 -438 -276 -293 46 129 5 33 347 521 631
1734F31K19O0k42J27j4l04Mm91J4r9k55l12K77l6k80k9K21k16J84K01j09M44n2
$$ 631 850 910 668 795 781 477 481 -10 4 -95 -350 -662 -385 -421 -701 -730 -509 -725 -541 -340 -449 -5 -57
1757e7Q5L31j67N40L5j39m6r1m8p6O0j12j04ll45j33j66j03j82j33R8J41r1L37
$$ -57 28 359 192 732 767 628 582 491 443 367 427 315 211 208 -137 -270 -436 -539 -721 -854 -756 -615 -706 -369
1781c69J17l5J79l1j7R2J88O44q9j19K09m3J40k66l7j4k77j54O4l92l63K39l07
$$ -369 -252 -287 -108 -139 -156 -64 124 768 679 560 769 726 866 600 563 549 272 118 182 -210 -573 -334 -641
1804f41K02Pm55P8J20K83k1R2J29J58M43j29K39q0M8K19p8m2l44J60o4l50J62
$$ -641 -439 -432 -887 -809 -689 -406 -427 -335 -206 -48 395 266 505 425 473 692 614 572 228 388 324 -26 136
1827A36J19l52k24j35q0K03O1l86r3K39K10K8K71L3j07M52j44J05J44l37M45j88
$$ 136 255 -97 -321 -456 -536 -333 -272 -658 -751 -512 -302 -274 -3 30 -77 375 231 336 480 143 588 400
1849D00Q5k86n4J40Q0l53p6r0k57J53k58K92oq4P7n7K53l45J98K14N0J52L28l97
$$ 400 485 199 145 285 365 12 -64 -154 -411 -258 -516 -224 -230 -314 -237 -294 -41 -386 -188 26 76 228 556 159
1873A59K35k0J6j06j33%k5k28J49J5l60j71K98Po7J51o2j58J94o3q9L46J1J22
$$ 159 394 374 390 284 151 151 126 -102 47 62 -298 -469 -171 -164 -231 -80 -142 -300 -106 -169 -258 88 99 221
1897B21ON1P3L48o30J86o9p9m6J10m11l2J19J22j55P9j39r5J52J53k10j53N78
$$ 221 227 278 351 699 69 255 186 107 61 171 -240 -272 -153 -31 -186 -107 -246 -341 -189 -36 -246 -399 179
1920A79j19Q9J5L2r3J89pL0L3o0R1j34n7m5l48j54k73K76j13O3J00n8J5J33k93
$$ 179 60 149 164 196 103 292 285 315 348 288 379 245 188 143 -205 -359 -632 -356 -469 -406 -306 -364 -349 -216 -509
1945e09L64k0P7K07K04o1J51L41k56p6J53j48O3l18j44n5o5J13k21l47J33j92
$$ -509 -145 -165 -88 119 323 262 413 754 498 422 575 427 490 172 28 -27 -92 21 -200 -547 -414 -606
1967f06K42k93J76J20j50j58M75K59j85L30J19j6J00J99l50K54j39n5J81j33j95
$$ -606 -364 -657 -481 -361 -511 -669 -194 65 -120 210 329 313 413 612 262 516 377 322 503 370 175
1988A75N4j67j08k95J17m05J37Q0j77P6J38O6O3m3J81K1M13k50J1J16L95Rn6j17
$$ 175 229 62 -46 -341 -224 -629 -492 -412 -589 -513 -375 -309 -246 -289 -108 -87 326 76 87 203 598 607 551 434
2012D34j10L06l43l24O2k01N4m1k88k6J49k16JJ58k14L52j81L05J22mM4k7J72
$$ 434 324 630 287 -37 25 -176 -122 -163 -451 -477 -328 -544 -543 -385 -599 -247 -428 -123 -1 -5 39 12 184
2035A84M5J54M3q6J46j19j62M8lK9k69J14q2l79q7L20J1m76K84Q4k29J06J45j25
$$ 184 229 383 426 340 486 367 205 253 250 279 10 124 42 -337 -424 -104 -93 -569 -285 -201 -430 -324 -179 -304
2059c04k1L62l1M35k27l7P4M5j25K62l24R1k08P3o9o7j05J79l38K97j48J67j08
$$ -304 -325 37 6 441 214 177 251 296 171 433 109 200 -8 65 -4 -71 -176 3 -335 -38 -186 -19 -127
2082a27o8J05K18J4K5Q4j40J9k73M94k04J5J04j17j46K74m95M4K95m7k7j6l26
$$ -127 -195 -90 128 142 167 251 111 130 -143 351 147 162 266 149 3 277 -218 -174 121 74 47 31 -295
2105b95JJ55J28k27J33J03P5J06J06m27K81K29l88J2J54j38L9j11N0Q3o3o3j17
$$ -295 -294 -139 -11 -238 -105 -2 73 179 285 -142 139 368 -20 -8 146 8 47 -64 -14 69 6 -57 -174
2128a74R1k53J45r6m3J19N6O2NJ86j17j35J9r2M63k4J46j69l6l9k37M08R3r4j95
$$ -174 -83 -336 -191 -287 -330 -211 -155 -93 -88 98 -19 -154 -135 -227 236 212 358 189 153 114 -123 285 378 284 89
2153H9j83j45O6K8k9j69L9L16j17LN8K72l18J1L82l26L08K00m97K48J73m57M9
$$ 89 -94 -239 -173 -145 -174 -343 -304 12 -105 -102 -44 228 -90 -79 303 -23 285 485 -12 236 409 -48 1
2176AJ00J6k31l2J5j97K04Q6j95J7j49J22k47L03O4l9j84K54Q3K52J78q3K99j16
$$ 1 101 117 -114 -146 -131 -328 -124 -38 -233 -216 -365 -243 -490 -187 -123 -162 -346 -92 -9 243 421 338 637 521
2200E21j75k34J8J21m38M97l31J3P2l72oJ31L9j25p5J26n3q2K04O2J06R7l2r9
$$ 521 346 112 130 251 -187 310 -21 -8 64 -308 -314 -183 -144 -269 -344 -218 -271 -353 -149 -87 19 116 84 -15
2224a5L07j55J32M3K36l17J06P3j78J1n5k58J2O5R5k62j89M3K9rP8n4K70j96j39
$$ -15 292 137 269 312 548 231 337 410 232 243 188 -70 -58 7 102 -160 -349 -306 -277 -286 -208 -262 8 -188 -327
2249c27M48r7L1N3oJ32k87J56j01M60m74J34J01j15J02J0k98J9j28J89L8n24M30
$$ -327 121 24 55 108 102 234 -53 103 2 462 -12 122 223 108 210 220 -78 -59 -187 2 40 -484 -54
2272e4j38K66j24l1P3p6k6j26L31J97j19j4J53r7rj87k81L99J0J24k05J24k63
$$ -54 -192 74 -50 -81 -8 -84 -110 -236 95 292 173 159 312 215 206 19 -262 137 147 271 66 190 -73
2295g3L28q8l22O6m4J28l01K67J55n0j1o7l7J51k64J23K47j53PQ6p9j11J46j53
$$ -73 255 167 -155 -89 -133 -5 -306 -39 116 66 55 -12 -49 102 -162 -39 208 55 62 148 69 -42 104 -49
2319d9J73l65J75N3K7K22m78K49J58k69J98Q9n1J0j67J85j38L49m68N9K16N8k68
$$ -49 124 -241 -66 -13 14 236 -242 7 165 -104 94 183 132 142 -25 160 22 371 -97 -38 178 236 -32
2342c2Qo4l4LK32m52k77N27j14R3j12J13K91j32j03M4L58j43j63J70m4k00L01
$$ -32 -24 -88 -122 -119 113 -339 -616 -89 -203 -110 -222 -109 182 50 -53 -9 349 206 43 213 169 -31 270
2365B70l03K73j30r3k33J06p9j23K71Ql17j48L55N2k11L43k3p6J90j12J01J1j38
$$ 270 -33 240 110 17 -216 -110 -189 -312 -41 -33 -350 -498 -143 -91 -302 41 18 -58 132 20 121 132 -6
2388fJ78p9J35K4q6R9R3k14l43K17L4K4l78M72l32q1P1rj67R0L93p5j91j88L47
$$ -6 172 93 228 252 166 265 358 144 -199 18 52 76 -302 170 -162 -243 -172 -181 -348 -258 135 60 -131 -319 28
2413B8o8J48p8j06L61j04K2j12J15o8k7J49j46j14J46k0j75j37k9l0J99j93r9
$$ 28 -40 108 30 -76 285 181 203 91 206 138 111 260 114 0 146 126 -49 -186 -215 -245 -46 -239 -338
2436c38P9J55K3j2J23M8J0K01k62J47K78m81K16L54l17N3m00J05K16p8j36NL9
$$ -338 -259 -104 -81 -93 30 78 88 289 27 174 452 -29 187 541 224 277 -123 -18 198 120 -16 -11 28
2459B8j75K02k63k1J71j97K01j04J25j17N3K51k62J20m0L04l61K39j77K12j72
$$ 28 -147 55 -208 -229 -58 -255 -54 -158 -33 -150 -97 154 -108 12 -28 276 -85 154 -23 189 17
2480A7K15j44j33L9k02J21J03k42Q6j1L2q7o1K61n5p1Rn2P8K60j94M1J12K06j98
$$ 17 232 88 -45 -6 -208 -87 16 -226 -140 -151 -119 -206 -267 -6 -61 -132 -123 -175 -97 163 -31 10 122 328 130
2505A30kJ56r2j51j8j23M7k9l9L5n9J89K06l07L04k89j2k9J10P4j16o5j28M27
$$ 130 128 284 192 41 23 -100 -53 -82 -121 -86 -145 44 250 -57 247 -42 -54 -83 27 101 -15 -80 -208 219
2529B19j81j05K92m59k2M1M96l91p8J60k11p3J24J08n0Q0n8K1K37q0j31L71k63
$$ 219 38 -67 225 -234 -256 -215 281 -110 -188 -28 -239 -312 -188 -80 -130 -50 -108 -87 150 70 -61 310 47
2552D7K54j65j04J77J45n20J63N2k2J16k33Mp0J05o1R6l37J91k9J04K9K3j33K86
$$ 47 301 136 32 209 354 -166 -3 49 27 143 -90 -86 -156 -51 -112 -16 -353 -162 -191 -87 -58 -35 -168 118
2576A18R7j96P0j57M58k96O9K09k16K2j22jj39Q4Kk06J30j9q1J92K2k30k6K66
$$ 118 215 19 89 -68 390 94 163 372 156 178 56 55 -84 0 2 -204 -74 -93 -174 18 40 -190 -216 50
2600E0j75R6J40M7m7K05n3j71j2K66l92J07K35k24K0J55j20l02R1O1l5Q7j75j
$$ 50 -125 -29 111 158 111 316 263 92 80 346 -46 61 296 72 92 247 127 -175 -84 -23 -58 29 -146 -147
2624a47m7J93j70R3j29N7M7j16M86j66K78j89P3n9k06M34m17k5j4j02K18K3r2
$$ -147 -194 -1 -171 -78 -207 -150 -103 -219 267 101 379 190 263 204 -2 432 15 -10 -24 -126 92 115 23
2647B3k03j03K08%j70O7l5N6K37k92K50j05o1j65J24J25M6J42k39R9K8r7K18P0
$$ 23 -180 -283 -75 -75 -245 -178 -213 -157 80 -212 38 -67 -128 -293 -169 -44 2 144 -95 4 32 -65 153 223
2671B23l71K65k94L17j25j66p4L41r7k40k00M72k74J8K13j83j2L47l32n8K17J98
$$ 223 -148 117 -177 140 15 -151 -225 116 19 -221 -421 51 -223 -205 8 -175 -187 160 -172 -230 -13 185
2693A85k35K17j88l1K47n4K8j7j08l78M03j36J17j89J53K5j9M3J82J1k36N3K3
$$ 185 -50 167 -21 -52 195 141 169 152 44 -334 69 -67 50 -139 14 39 20 63 245 256 20 73 96
2716I6j60n3M9M55l10K10k16j06Q7K59j61j55K69k15j43J12J35k4L8k44j21J61
$$ 96 -64 -117 -68 387 77 287 71 -35 52 311 150 -5 264 49 -94 18 153 129 167 -77 -198 -37
2738c7M0J5p9Mk29O2L07%j96J49l6j04J96j38J18j84J07K18k74j23P4o1M1n6J65
$$ -37 3 18 -61 -57 -286 -224 83 83 -113 36 0 -104 92 -46 72 -112 -5 213 -61 -184 -110 -171 -130 -186 -21
2763b1RJ17k6O3k81N0M3oP7m4J71J30k71k7p1j34K56r1J40M6j95k43M33l32k44
$$ -21 -12 105 79 142 -139 -89 -46 -52 25 -19 152 282 11 -16 -87 -221 35 -56 84 130 -65 -308 125 -207 -451
2788d51J93J93P9P4j45N9J37m5k12L3L23j31J01j41k24J94L39l96m0J63l04j40
$$ -451 -258 -65 14 88 -57 2 139 94 -118 -85 238 107 208 67 -157 37 376 -20 -60 103 -201 -341
2810c41L06l9J30r9OQ3r3j49J35L4J3m9m4J72N0l1j03J41l8J21j54K25k36P3k02
$$ -341 -35 -74 56 -43 -37 46 -47 -196 -61 -27 -14 -63 -107 65 115 84 -19 122 84 205 51 276 40 113 -89
2835h9M2J11k33R6kJ97k71L00j06j75K16q4j38K4j1J33J42q4J8K14l16J60p3q8
$$ -89 -47 64 -169 -73 -75 122 -149 151 45 -130 86 2 -136 -112 -123 10 152 68 86 300 -16 144 71 -17
2859a7j3K28l75L17k5j25j51J27J33L0j74J98k82K61j54l93N18k28K50l0j24n4
$$ -17 -30 198 -177 140 115 -10 -161 -34 99 129 -45 153 -129 132 -22 -415 103 -125 125 95 -29 -83
2881h3J01P0J79j76J75r6j04NO5j42j42R7Nj43j71J56j45M53j65j91L00j15M5
$$ -83 18 88 267 91 266 170 66 71 136 -6 -148 -51 -46 -189 -360 -204 -349 104 -61 -252 48 -67 -22
2904b2J52j52p9R3K55k93J34r4k56M26k76j78L03Q3j75l6J53j36J92p0L2M4k88
$$ -22 130 -22 -101 -8 247 -46 88 -6 -262 164 -112 -290 13 96 -79 -115 38 -98 94 24 56 100 -188
2927a88L11l77L43m51L00K21k04o4O6O1r2N6k1q8M5j25P2L61m39J36J19j15M6
$$ -188 123 -254 89 -362 -62 159 -45 -109 -43 18 -74 -18 -39 -127 -82 -207 -135 226 -213 -77 42 -73 -27
2950b7O7j92K67j06R7K20m5j6l20K54n4O7l48K31j41L8k6j22K7J72q7J5P3J66
$$ -27 40 -152 115 9 106 326 281 265 -55 199 145 212 -136 95 -46 -8 -34 -156 -129 43 -44 -29 44 210
2974B10j97j32J27p0o6J0OL31k61J05J18k03K7lL12l23K35o3n78O55r9l08l0p6
$$ 210 13 -119 8 -62 -128 -118 -112 219 -42 63 181 -22 5 2 314 -9 226 163 -415 240 141 -167 -197 -273
2998b73L49j58j08j01j5J03K28n2k77L21k58J58r9J35q3J92R7j04R3j13j61K40
$$ -273 76 -82 -190 -291 -306 -203 25 -27 -304 17 -241 -83 -182 -47 -130 62 159 55 148 35 -126 114
3020A14o9p3J15l8L86o17K94p9K84r5k91J21l17L09l60J50J26j39L29j85P9P7
$$ 114 45 -28 87 49 435 -182 112 33 317 222 -69 52 -265 44 -316 -166 -40 -179 150 -35 44 121
3042A21K60q0o7k30rJ51M6J14m14j2J09MJ16Qj56J88j28k67L8L6j6R3j5j18K31
$$ 121 381 301 234 4 -5 146 192 306 -108 -120 -11 -7 109 117 -39 149 21 -246 -208 -172 -188 -95 -110 -228 3
3067CJ27k75J15j43K85L9k92K63Q9J53j90k04l1j52J29O7p2L9J48j47p4LK36r0
$$ 3 130 -145 -30 -173 112 151 -141 122 211 364 174 -30 -61 -213 -84 -17 -89 -50 98 -49 -123 -120 116 26
3091B6k2n87N49J96m89N29j38J16k24k35L86q6n2j1J58o8r0J44L0j61L47k40n
$$ 26 4 -583 -34 162 -327 202 64 180 -44 -279 107 21 -31 -42 116 48 -42 102 132 -29 318 78 73
3114G3j77J04q9R5k24L53j7l0j31J95j49j73L7J87m2j98J1J31l72M76J6r1N0J14
$$ 73 -104 0 -89 6 -218 135 118 88 -43 152 3 -170 -133 54 12 -186 -175 -44 -416 60 76 -15 35 149
3138A49k44j22J64j3L1oj3l6K07p6j2q6J93J18k38N9j50J13j59K11r2j71L61l2
$$ 149 -95 -217 -53 -66 -35 -41 -54 -90 117 41 29 -57 136 254 16 75 -75 38 -121 90 -2 -173 188 156
3162A56n0j93j98M40k76P0L6L5J53l19K27Lp1K0r2J38J59j32K8k48J32K01j65
$$ 156 106 -87 -285 155 -121 -51 -15 20 173 -146 81 84 13 33 -59 79 238 106 134 -114 18 219 54
3185E4K1j36R1k2q8L21l98jj18L23l02N55l17k36R7Q7J52J8j47KK49j22R4m8l71
$$ 54 75 -61 30 8 -80 241 -157 -158 -276 47 -255 300 -17 -253 -156 -69 83 101 -46 -44 205 83 177 129 -242
3210b42K58M2m7L7J0K20k75L5L3N5k00J85j68R4q0J52j07OM0j39P2KK05j25j42
$$ -242 16 58 11 48 58 278 3 38 71 126 -74 111 -57 37 -43 109 2 8 48 -91 -19 -17 188 63 -79
3235g9J56q4q5J2K49J01p0N3l18R0J21j75j4j92J26J31mJ11k88J33k43M29j11
$$ -79 77 -7 -92 -80 169 270 200 253 -65 25 146 -29 -43 -235 -109 22 18 129 -159 -26 -269 160 49
3258D9m2M9q7J68K6m58K69k71L28k21K33j21l79N22j26R7m9J21m00L54J23j13
$$ 49 7 56 -31 137 163 -295 -26 -297 31 -190 43 -78 -457 65 -61 36 -13 108 -292 62 185 72
3280G2N0o2N2o6pP2j08J08l91J89P5j37L86l45L21r3k45j10J78n8Q0J54N2k30
$$ 72 122 60 112 46 39 111 3 111 -280 -91 -16 -153 233 -112 209 116 -129 -239 -61 -119 -39 115 167 -63
3304f3J25r7j1OL1J20l6R2J33m14K12j61K9K62k90m0J07J12m7P4J0k37P3r9k16
$$ -63 62 -35 -46 -40 -9 111 75 167 300 -114 98 -63 -34 228 -62 -102 5 117 70 144 154 -83 -10 -109 -325
3329c25L23J02j67K05l09J87L8nK45k76O3Nqk86R5K77l43M3J70j19J15Q5n6k09
$$ -325 -2 100 -67 138 -171 16 54 49 294 18 81 86 78 -208 -113 164 -179 -136 34 -85 30 115 59 -150
3353a50P6JJ67j77J38k65L10M0m17L30k92N58l49L6k7j08j3J6J78l91J66p8J39
$$ -150 -74 -73 94 -83 55 -210 100 140 -277 53 -239 319 -30 6 -21 -129 -142 -126 52 -339 -173 -251 -112
3376a12J11r4J31j86N0J24O6p9o4l85L57j29L71P3k66l4P1k3n7l1k6J34k50K37
$$ -112 -1 -95 36 -150 -100 24 90 11 -53 -438 -81 -210 161 234 -32 -66 5 -18 -75 -106 -132 2 -248 -11
3400a1n1J29j25j40P4J66JQ7j59J33K4l8k51j6P7J87n3q7J69q4J24l72J34O0j92
$$ -11 -62 67 -58 -198 -124 42 43 130 -29 104 128 90 -161 -177 -100 87 34 -53 116 32 156 -216 -82 -22 -214
3425b14N48l1k46N9O9p3j03k03J67n2J37m1N0M7j68j22q0k4K67l2L72m04J91j65
$$ -214 334 303 57 116 185 112 9 -194 -27 -79 58 17 67 114 -54 -176 -256 -280 -13 -45 327 -77 114 -51
3449e1r4J13Q6j94L70n7k91P0K69p4j49lk1K53j35k86J93n8j85K14j06Q3j32J88
$$ -51 -145 -32 54 -140 230 173 -118 -48 221 147 -2 -5 -26 227 92 -194 -1 -59 -244 -30 -136 -53 -185 3
3473Cj41J21j17J70j67K85j03N9l11K75K8r8j47J39j16J77j13j0j0N9J40j4k14
$$ 3 -138 -17 -134 36 -131 154 51 110 -201 74 102 4 -143 -4 -120 57 -56 -66 -76 -17 123 109 -105
3496a05J16OqM9n4K83m35j29J37J04J27j44J34k6NQ9j30j8j5R0k14M9O2l26M14
$$ -105 11 17 9 58 4 287 -148 -277 -140 -36 91 -53 81 55 60 149 19 1 -14 76 -138 -89 -27 -353 61
3521F1n0O5j90J71j93M34j83J16k7M3Q5k74J94n7j24j21K71j93l4k13J47j15N29
$$ 61 11 76 -114 57 -136 298 115 231 204 247 332 58 252 195 71 -50 221 28 -6 -219 -72 -187 342
3544C42m07M2J96m68R2rJ42j59k8K39j5l49K22o5M67j43m1j96K36K9j42j95L64
$$ 342 -65 -23 173 -295 -203 -212 -70 -229 -257 -18 -33 -382 -160 -225 242 99 58 -138 98 127 -15 -210 154
3567A54o1j42J46m1N3R8l50J71p6l9kK35r3Q5k12J94j49j10K19J81j53j02k05
$$ 154 93 -49 97 56 109 207 -143 28 -48 -87 -89 146 53 138 -74 120 -29 -139 80 261 108 6 -199
3590a99K61R7r3r0M7L7j22j2R6K07j98k52J96k50L56j42j30L1J08j0J48J28o6
$$ -199 62 159 66 -24 23 60 -62 -74 22 229 31 -221 -25 -275 81 -61 -191 -160 -52 -62 86 214 148
3613A48j12mJ35j03k65K77n3j15K77j97k22L82j86j50L13k5j49N7nJ78j80j35
$$ 148 36 32 167 64 -201 76 23 -92 185 -12 -234 148 -38 -188 125 100 -49 8 3 181 1 -134
3635a34J72O7j40j62L42k64K00k43K35l1J48O1k75K16L3k03Mo0J34o6N1k29K07
$$ -134 38 105 -35 -197 145 -119 81 -162 73 42 190 251 -24 192 225 22 26 -34 100 34 85 -144 63
3658F3k96K26J4J00k00J11k14K59K7j80Qk2K89l91L49l4o3k90J44M4J76J26j17
$$ 63 -233 -7 7 107 -93 18 -196 63 90 -90 -82 -104 185 -206 143 109 46 -244 -100 -56 120 246 129
3681A29k17N1J61j68l1J73k37J69k5Qq0L2J44l51M22j73K77l04O0r0L3oK43l38
$$ 129 -88 -37 124 -44 -75 98 -139 30 5 13 -67 -35 109 -242 180 7 284 -20 40 -50 -17 -23 220 -118
3705a18p5J04r7L49J05J6l60J26j96J86j93Q8RK06k9j77j9J36k90K58j5j63J03
$$ -118 -193 -89 -186 163 268 284 -76 50 -146 40 -153 -65 -56 150 121 -56 -75 61 -229 29 14 -149 -46
3728d6J81j60K53j68j27K05j54j18K61l48K78J07j47K7K03l30J05j28K79j70J37
$$ -46 135 -25 228 60 -67 138 -16 -134 127 -221 57 164 17 44 247 -83 22 -106 173 3 140
3749A40K8k89J97O4k6j59M9p0L8Q5J18j94p7J22L3O7Ol43J11N6J84k68K6K01m1
$$ 140 168 -121 76 140 114 -45 4 -66 -28 57 175 -19 -96 26 59 126 132 -211 -100 -44 140 -128 -102 99 58
3774E8j33J52j21j87K7K05k8k37M48k91q2K3Q9K32p5J76k17j73J12M8k67K64j94
$$ 58 -75 77 -44 -231 -204 1 -27 -264 184 -107 -189 -166 -77 155 80 256 39 -134 -22 26 -241 23 -171
3797a71N2l2K53k49J26J46P5Nk35k6M68m94j2j08R0K24j10m4K24k82j2j37L04
$$ -171 -119 -151 102 -147 -21 125 200 205 -30 -56 412 -82 -94 -202 -112 112 2 -42 182 -100 -112 -249 55
3820E5L1l9R6J3p3l92N59l82K74n8j15j9J00l16K96K30l21N0p5L3J4J80j85o4
$$ 55 86 47 143 156 83 -309 250 -132 142 84 -31 -50 50 -266 30 260 -61 -11 -86 -53 -39 141 -44 -108
3844a08K03j81oJ55k88O7K13n6L7j25j19K12k8kM7J07J21j07k00M9rJ06m6k54
$$ -108 95 -86 -92 63 -225 -158 55 -1 36 -89 -208 4 -24 -26 21 128 249 142 -58 -9 -18 88 42 -212
3868b12K5K58j79K56n2k13J65P3q4j7j11J65M2k9p7j88K29n8Q0O8k44J86p9p6
$$ -212 -187 71 -108 148 96 -117 48 121 37 20 -91 74 116 87 10 -178 51 -7 73 141 -103 83 4 -72
3892g2o7R4N6K8J8k23J67m5K29m33J44M2L15k31k97K57K2J64J2m63J41J34k6J61
$$ -72 -139 -45 11 39 57 -166 1 -44 185 -248 -104 -62 253 22 -275 -18 4 168 180 -283 -142 -8 -34 127
3916A27j0jk21L05k09J61O4l27K84%k27R6j42L28k06j9P1J27m1k93K92P0k26Q1
$$ 127 117 116 -105 200 -9 152 216 -111 173 173 -54 42 -100 228 22 3 74 201 160 -133 159 229 3 84
3940H4j68NM3k36M14kj28q4K03k07k3j24J50K10M8k72K38k04J35O4j5j83J3N5
$$ 84 -84 -79 -36 -272 142 140 12 -72 131 -76 -99 -223 -73 137 185 -87 151 -53 82 146 131 -52 -39 16
3964A6j25M7J06k02J43J15J8q9j40K45k72J34L2j38j1R8J96l30L3p7P6K72K6K9
$$ 16 -109 -62 44 -158 -15 100 118 29 -111 134 -138 -4 28 -110 -121 -23 173 -157 -124 -201 -125 147 173 202
3988B02O6l39J27K97l13QJ44l79K09J53r8k10L33k36L3j26m7J9J27j1J38Oq7J84
$$ 202 268 -71 56 353 40 48 192 -187 22 175 77 -133 200 -36 -3 -129 -176 -157 -30 -41 97 103 16 200
4012B00l01R0K66k44O7j85K1q9K77p7K8rMk80J62J86k22K24l02K04ql2L2K94k38
$$ 200 -101 -11 255 11 78 -107 -86 -175 102 25 53 44 48 -232 -70 116 -106 118 -184 20 12 -20 12 306 68
4037F8L8j68p1L03k78j16K68J12O4k99J49J32k30J38j80n0J38P1k02K46LJ62l21
$$ 68 106 -62 -133 170 -108 -224 44 156 220 -79 70 202 -28 110 -70 -120 18 89 -113 133 136 298 -23
4060b3l4J96kp8k00K69j22J62j54l60J94L4l4M40l16m4J91p9o6Q9k13K9K30k9
$$ -23 -57 139 137 59 -141 128 6 168 14 -346 -152 -118 -152 288 -28 -72 119 40 -26 63 -150 -121 109 80
4084H0k00K15J1j23kl06K87PJ54k98J00P2j47K23j73K76l05R1j27j4J55N5LJ7
$$ 80 -120 95 106 -17 -19 -325 -38 -31 123 -175 -75 -3 -150 73 -100 176 -129 -38 -165 -179 -24 31 34 51
4108E1QJ75l06R5J3j09J94n7J14j50k16K79m4o6K89k66J72m46J49J86o7j4l5J64
$$ 51 59 234 -72 23 36 -73 121 64 178 28 -188 91 47 -19 270 4 176 -270 -121 65 -2 -16 -51 113
4132A13k33K17j28P3q1J40j1l3m9L18k89k04j64L36j76O9J0N6r9J22J40q8J26
$$ 113 -120 97 -31 42 -39 101 90 57 8 326 37 -167 -331 5 -171 -102 -92 -36 -135 -13 127 39 165
4155A65l66L00j06r8K27o8l8j86K6J35M4j04j31L03%j95K46k30J70j34j95J09
$$ 165 -201 99 -7 -105 122 54 16 -170 -144 -9 35 -69 -200 103 103 -92 154 -76 94 -40 -235 -126
4177a26J72QM1Q7N4L5o3k93l0J01k3J04p9M2n4L11k66j08K0J26K08j39k73J70
$$ -126 46 54 95 182 236 271 208 -85 -115 -14 -37 67 -12 30 -24 287 21 -87 -67 59 267 128 -145 25
4201B5P0l71L54j96K6J94j37k0J37j19k2j33L83j43k90R6L2O0J14K38m25L61j75
$$ 25 95 -276 78 -118 -92 102 -35 -55 82 -37 -59 -192 191 48 -242 -146 -114 -54 60 298 -127 234 59
4224E9r5M9K1q6L24k65j94J59K23l68mJ37K43p4k23K11m7j85K0N6J45J17m32L60
$$ 59 -36 13 34 -52 272 7 -187 -28 195 -173 -177 -40 203 129 -94 117 70 -115 -95 -39 106 223 -209 151
4248A51j17mn6K82l25j3J59k07J19J92j47k12N4K36j40p6Q5j7O5J15j31o1O6q2
$$ 151 34 30 -26 256 -69 -82 77 -130 -11 181 34 -178 -124 112 -28 -104 -19 -36 29 144 13 -48 18 -64
4272f4J96k44J79r9j32K14j20N8K54j94Q2MJ5k92J53J02m4k52N8M58j81o6o1P4
$$ -64 132 -112 67 -32 -164 50 -70 -12 242 48 130 134 149 -143 10 112 68 -184 -126 332 151 85 24 98
4296I8q5j6q9J9J25J3l84M01Nj41J27J61k68J78K0j56j27K5N60k65l35J00m9j74
$$ 98 13 -3 -92 -73 52 65 -319 82 87 -54 73 234 -34 144 164 8 -119 -94 466 201 -134 -34 -83 -257
4320b57K39J33j09k5m0j47J97n3J49l67J45j29K34L03j59j21k34N19l68p5J26
$$ -257 -18 115 6 -19 -59 -206 -9 -62 87 -280 -135 -264 -30 273 114 -7 -241 278 -90 -165 -39
4341c9K85j60j6l08L09L1k19l3M8k7K49j19l28J06L99q8m41K42R8n6J76K6j57
$$ -39 246 86 70 -238 71 102 -117 -150 -102 -129 120 1 -327 -221 178 90 -351 -109 -11 -67 109 135 -22
4364b2l37N60l0k35J9n8M1m8P5r3K78K5k72l9K07K1M5qJ3j80L51n98K63j06J49
$$ -22 -359 201 171 -64 -45 -103 -62 -110 -35 -128 150 175 -97 -136 71 92 137 129 142 -38 313 -285 -22 -128 21
4389B1O1j67J8J46m1r3k08K74k23N3J42J27k74J34j6k3R0R8j8m9J43L8q9k41r2
$$ 21 82 -85 -67 79 38 -55 -263 11 -212 -159 -17 110 -164 -30 -46 -69 21 119 101 52 195 233 144 -97 -189
4414a89L81k72K64j20k45K75j11o6LK69j63Nk93L59j10j2po7J24j82J52j19L26
$$ -189 192 -80 184 64 -181 94 -17 -83 -80 189 26 31 -262 97 -13 -25 -32 -99 25 -157 -5 -124 202
4437B02k12Lm3j99L82j97k3J16J70k14K4K18n00P2K18l84N41l39J54o0k05L85
$$ 202 -10 -7 -50 -249 133 -64 -87 29 199 -15 9 227 -273 -201 17 -367 174 -165 -11 -71 -276 109
4459A09j80M7l23L23M0j49K99k26j48L43l14J48J29k40J47M0m2j7j14K51R2j85
$$ 109 -71 -24 -347 -24 16 -133 166 -60 -208 135 -179 -31 98 -142 5 45 3 -14 -128 123 215 30
4481C0k12J08l4N9l3Lj62P1M8P0L88m33rJ64k9L6l7O4J24q1k44N7J08k10Q0q3
$$ 30 -182 -74 -108 -49 -82 -79 -241 -170 -122 -52 336 -97 -106 58 29 65 28 92 216 135 -109 -52 56 -154 -74 -157
4507a57J45oJ7j53K43j69j2J49n9J10l01J17L8J40l14L80j61M3p6K36r0q7j01
$$ -157 -12 -18 -1 -154 89 -80 -92 57 -2 108 -193 -76 -38 102 -212 168 7 50 -26 210 120 33 -68
4530f8J5J56q1p2m0l9J56j97J83R3j80Q0k46J89Q0l43K39k8R1J22j60r7O5q6L15
$$ -68 -53 103 22 -50 -90 -129 27 -170 13 106 -74 6 -240 -51 29 -314 -75 -103 -12 110 -50 -147 -82 -168 147
4555A47l13J7K43k57K02j17J55j07k0L2J01J28k31k5N6K75k81K01j66pn9N5N3
$$ 147 -166 -149 94 -163 39 -78 77 -30 -50 -18 83 211 -20 -45 11 286 5 206 40 33 -26 29 82
4578H2J03j78j54P6L3L00k42n6Q8k35J31J31n2J60l66K36J31l40oL11j71J58k11
$$ 82 185 7 -147 -71 -38 262 20 -36 52 -183 -52 79 27 187 -179 57 188 -152 -158 153 -18 140 -71
4601g1l2O4K2pM7J49r1O7r1J3j29k78J93J74L15k96m4j26Q3l0L6j60L98o9j07
$$ -71 -103 -39 -17 -24 23 172 81 148 57 70 -59 -337 -144 30 345 49 5 -121 -38 -68 -32 -192 206 137 30
4626C0k41J75J33J56k74J1j1n0LR4K48m0j70L02l82n0J96j0j31Orj17K91m14L44
$$ 30 -211 -36 97 253 -21 -10 -21 -71 -68 26 274 234 64 366 -16 -66 130 120 -11 -5 -14 -131 160 -254 90
4651I0j91Q0o5K11Lj73JL34l37j03J00J17j32L4J8k13L27l67L42k20L03j0k99
$$ 90 -101 -21 -86 125 128 -45 -44 290 -47 -150 -50 67 -65 -31 -13 -226 101 -266 76 -144 159 149 -150
4674a50q7rN75k99k5j99J48n5K33j05J1j57j42K50j37L11j39p4p3J31M2q4j68
$$ -150 -237 -246 329 30 5 -194 -46 -101 132 27 38 -119 -261 -11 -148 163 24 -50 -123 8 50 -34 -202
4697b02J72LQ0r1o6j0J29J11j71L05q9J4r0k90L9K58O5k16P0J65o9l1k47J59K97
$$ -202 -30 -27 53 -38 -104 -114 15 126 -45 260 171 185 95 -195 -156 102 167 -49 21 186 117 86 -161 -2 295
4722B95l64M6J95Qj73J06L0l14L19k42K52j35Q4m7q9r4J84k23p2K82J68j64j06
$$ 295 -69 -23 172 180 7 113 143 -171 148 -94 158 23 107 60 -29 -123 61 -162 -234 48 216 52 -54
4745e4K64k3Qk74J10r8O7j16m8L47k08J21J69o12M61j1j95n1L1J2J36o0J32p5
$$ -54 210 187 195 -79 31 -67 0 -116 -164 183 -25 96 265 -347 114 103 -92 -143 -112 -100 36 -24 108 33
4769C3j01J90k43O7K8J43q2j59K00L0l3q7K18k3N4j84j68K53k17K27K3j37l8k73
$$ 33 -68 122 -121 -54 -26 117 35 -124 76 106 73 -14 204 181 235 51 -117 136 -81 146 169 32 -6 -279
4793b79L10m1j66K8K54j33kJ54K0q0j15K1r1K30q8J44o9Q3j36q0N5M2m03K63J76
$$ -279 31 -10 -176 -148 106 -27 -29 125 145 65 -50 -29 -120 110 22 166 97 180 44 -36 19 61 -342 -79 97
4818I7K6l31N6J31J5J45j39n6J9j23M4L60m79J87l7L6J75k65jJ32J55l7o4r2l00
$$ 97 123 -208 -152 -21 -6 139 0 -56 -37 -160 -116 244 -235 -48 -85 -49 126 -139 -140 -8 147 110 46 -46 -346
4843c46M70j70j1Q3k39p4K14J73r1j08K0m4K17lj03J59j71J29O2J16J05m08K6
$$ -346 124 -46 -57 26 -213 -287 -73 100 9 -99 -79 -123 94 91 -12 147 -24 105 167 283 388 -20 6
4866FP9q4M7K9n6j97J66L5l24L93J0lj01k9pJ81j43%R5k53J08j54N56l74Ml48
$$ 6 85 1 48 77 21 -176 -10 25 -299 94 104 101 0 -29 -36 145 2 2 97 -156 -48 -202 354 -20 -16 -364
4892c64L77l08M08k82p5L07k2k55K66j07n0L40j85k68J70J36J36rm56J07N2J10
$$ -364 13 -295 113 -169 -244 63 41 -214 52 -55 -105 235 50 -218 -48 88 224 215 -241 -134 -82 28
4914B8j59J08q5K68J33o38J46K11O1P2j6o1m6K4J36j53M14k94m4j46J67p0j63
$$ 28 -131 -23 -108 160 293 -345 -199 12 73 145 129 68 22 46 182 29 443 149 105 -41 126 56 -107
4937a07K27oJ21j91J53k35R3j59M4R8p0q1p5K24j43J63J07k33J92R3j14n1j12
$$ -107 120 114 235 44 197 -38 55 -104 -60 38 -32 -113 -188 36 -107 56 163 -70 122 215 101 50 -62
4960f2J55j10Q7q9j74J80J46k06J55m0J32M0m81M73j09j63K9O6j65K15J66n38
$$ -62 93 -17 70 -19 -193 -13 133 -73 82 42 174 214 -267 206 97 -66 -37 29 -136 79 245 -293
4982b93L58l04L56l10J64j13K05k06Q1J45j19R2l55M81k69J25M1k0n9r2J69jL3
$$ -293 65 -239 117 -193 -29 -142 63 -143 -62 83 -36 56 -299 182 -87 38 79 59 0 -92 77 76 109
5005A09j46j14j31M03j11M8o9K12p9j21o5j10J77j35K14k40Q7P9j31R6p0J5K43
$$ 109 -37 -151 -282 121 10 58 -11 201 122 1 -64 -174 3 -132 82 -158 -71 8 -123 -27 -97 -82 161
5028A61j77L7l3J2R0P0k10r3R2K9R6j76k61N34j23j43J22k67L53j20O5l67L1K39
$$ 161 -16 21 -12 0 90 160 -50 -143 -51 -22 74 -102 -363 171 48 -95 27 -240 113 -7 58 -309 -278 -39
5052c9k17K29j4L2J33k02K86l13O7N9J47j47k8l7K6jkQ4j72K80l77R3J47N7j26
$$ -39 -256 -27 -41 -9 124 -78 208 -105 -38 21 168 21 -7 -44 -18 -19 -21 63 -109 171 -206 -113 34 91 -35
5077c5P4K4l0l6k41K76Q7l3L4J08j25J38j83Q5J42l67O1J35l96J93r1L14j35K0
$$ -35 39 63 33 -3 -244 32 119 86 120 228 103 241 58 143 285 -82 -21 114 -282 -89 -180 134 -1 19
5101A9J50j32k01L44j99Q3k19K0M01k15m30O27m43K66j29p7J03K09m25L17j55
$$ 19 169 37 -164 180 -19 64 -155 -135 266 51 -379 248 -195 71 -58 -135 -32 177 -248 69 -86
5122h6L82k27k41J33p5N4PJP3K37m21N73m13J39o8r3p9P3L10n94j2L55J2L7j50
$$ -86 296 69 -172 -39 -114 -60 -53 -52 21 258 -163 410 -3 136 68 -25 -104 -31 279 -315 -327 28 40 77 -73
5147g3R7L9j02j22J0L70n83M47l09J18o8K61j44k0L3P5J68l75J56k33J47Q9r1
$$ -73 24 63 -39 -161 -151 219 -364 83 -226 -108 -176 85 -59 -79 -46 29 197 -178 -22 -255 -108 -19 -110
5170a10J44K4p1o9r3P3L8J6p6J0K74j69J0J22j17J47l25K95j07l1J52m03L13j91
$$ -110 34 58 -13 -82 -175 -102 -64 -48 -124 -114 160 -9 1 123 6 153 -172 123 16 -15 137 -266 47 -144
5194a44J36R8k35L35j86K3Q2jkJ22j17k99K55j91M31l60K5J5p0J07j90J68J62
$$ -144 -8 90 -145 190 4 27 109 108 106 228 111 -188 67 -124 307 -53 -28 -13 -83 24 -166 2 164
5217A64j67k3m5R7P7k8j35q3K11k93K01K51m13L43k16N9M1j07p2O0P6OJ08k55
$$ 164 -3 -26 -71 26 103 75 -60 -143 68 -225 -24 227 -186 157 -59 0 41 -66 -138 -78 -2 4 112 -143
5241a43L15k71O4j02J14j34J8k7N65p39M93k50K97j14p8k29N95k72k07M8J04K89
$$ -143 172 -99 -35 -137 -23 -157 -139 -166 399 -340 153 -97 200 86 8 -221 374 102 -105 -57 47 336
5263C36l47q9k4K00j85J03j46j73L57R3j96R9r0o1J77R4k41J97o2j73l0J59P8
$$ 336 -11 -100 -124 76 -109 -6 -152 -325 32 125 -71 28 -62 -123 54 148 -93 104 42 -131 -161 -2 76
5286G6k48J09M9J20J15k55J94l41J58M5K3pR5q1j51O2l6n3K60J12j77J9O5j89
$$ 76 -172 -63 -14 106 221 -34 160 -181 -23 22 45 38 133 52 -99 -37 -73 -126 134 246 69 88 153 -36
5310c6J6L07n19J98p2K3j0J22K6j97M4J23Q2M1k70M41j69k98L04o7r2j42L57m67
$$ -36 -20 287 -232 -34 -106 -83 -93 29 55 -142 -98 25 107 148 -122 319 150 -148 156 89 -3 -145 212 -255
5334b55O5J40p6l8L55l48J65J71Q4n00M56j16o7J69k82N0j17J54j56J76j34J38
$$ -255 -190 -50 -126 -164 191 -157 8 179 263 -237 219 103 36 205 -77 -27 -144 10 -146 30 -104 34
5356C4l87K86j6J06j26J14q6k8N6J84j23l5J89l16L62j99p6J55r5p9Q9J4l58K36
$$ 34 -353 -67 -83 23 -103 11 -75 -103 -47 137 14 -21 168 -148 214 15 -61 94 -1 -80 9 23 -335 -99
5380i9K00k45K65j85J66R3m10K83M4k06J3J85J11m59l6L92j37J82l2k63R0L6K45
$$ -99 101 -144 121 -64 102 195 -215 68 112 -94 -81 104 215 -244 -280 112 -25 157 125 -138 -48 -12 233
5403B33k79J5RJq1Q6L2j12K64L6k83j09n0l3J97M4J92j64R1o5M4j47m5K18j89
$$ 233 -46 -31 -22 -21 -102 -16 16 -96 168 204 -79 -188 -238 -271 -74 -30 162 -2 89 24 68 -79 -124 94 -95
5428i5P7P3j91K86r8j74j25L64j37m1K26j46j99J58K22j68q4P1O7Q6j22J02j01
$$ -95 -18 55 -136 150 52 -122 -247 117 -20 -61 165 19 -180 -22 200 32 -52 19 86 172 50 152 51
5451E1m3j01j58L03K92k87l1j57k4J15m8LK85n59L93J60k06M7R0J31j93j94r8
$$ 51 8 -93 -251 52 344 57 26 -131 -155 -40 -88 -85 200 -359 34 194 -12 35 125 256 63 -131 -229
5474b29J78l7J27K71j35k40J03L7Kj72p1J58K1j21J09p1j90J00J20L3j76K59J78
$$ -229 -51 -88 39 310 175 -65 38 75 77 -95 -166 -8 13 -108 1 -70 -260 -160 -40 -7 -183 76 254
5497B54m64J74o9J85k90K86k50J86n5J1J3j8J88j45j49j06J24L38n04O1K28j9
$$ 254 -210 -36 -105 80 -210 76 -174 12 -43 -32 -19 -37 151 6 -143 -249 -125 213 -291 -230 -2 -21
5519b1j00K4P5k36J93k42M30m07K66O6K28l92J73k5p5L50l38J22k61M17m94K33
$$ -21 -121 -97 -22 -258 -65 -307 123 -284 -18 48 276 -116 57 32 -43 307 -31 91 -170 247 -247 -14
5541a4K03l26o0K07k76K85lk48K69p9j77M39j58k34m6K76q2L4k6k94K58j44J22
$$ -14 189 -137 -197 10 -266 19 16 -232 37 -42 -219 220 62 -172 -218 58 -24 10 -16 -310 -52 -196 -74
5564g4J78q0r0M0J08j0j55P9OJ42l19J26R2K3J06k45n0J13j82K46m3O8p5O8r2
$$ -74 104 24 -66 -26 82 72 -83 -4 2 144 -175 -49 43 66 172 -73 -123 -10 -192 54 11 79 4 72 -20
5589b0j64l6K76M1j74R9L5j9r7J01L7j22J88j77J03J6j83K1K9k0j87N12m3p1M0
$$ -20 -184 -220 56 97 -77 22 57 38 -59 42 79 -43 145 -32 71 87 -96 -75 -46 -66 -253 259 216 145 185
5614A85m06K00J52j16P9j08O2J72k36N9L02m69l2k8Q7P5J25J04j83j58K70l01
$$ 185 -221 -21 131 15 94 -14 48 220 -16 43 345 -124 -156 -184 -97 -22 103 207 24 -134 136 -165
5636a65J03J49j22p2n9J57R8q9r0J47n8j2o4P0O7k1o7j21J83r0L98n48J1J13K50
$$ -165 -62 87 -35 -107 -166 -9 89 0 -90 57 -1 -13 -77 -7 60 39 -28 -149 34 -56 342 -206 -195 -82 168
5661A68j79j83K27M4r8jJk94K88JJ13p3P5N6r4j91J29M5P6k67J81Qj0K9j41L0
$$ 168 -11 -194 33 77 -21 -22 -21 -315 -27 -26 87 14 89 145 51 -140 -11 34 110 -157 24 32 22 51 -90 -60
5687f0J84j65r8J8P1j02R3N4m61M53O7J62k29l9J07m04M12j81r4l4K67j8P9k0
$$ -60 124 -41 -139 -121 -50 -152 -59 -5 -466 -13 54 216 -13 -52 55 -349 63 -118 -212 -246 21 3 82 62
5711F2l6k54K14J58J51k02j20l1J85q7M4Q6j24j2j34J57m5j04K43j59L31l27J7
$$ 62 26 -228 -14 144 295 93 -27 -58 127 40 84 170 46 34 -100 57 12 -92 151 -8 323 -4 13
5734A3j36l7J25J97k58K08Ok50M80m85J75p0j11M04m29J73mNk95M00n9j06j94
$$ 13 -123 -160 -35 162 -96 112 118 -132 348 -137 38 -32 -143 261 -168 5 1 6 -289 111 52 -54 -248
5757b48K99m5L6J37O9l31L3K50k07J52j71N7k51L24k94n8K69j46L20k91K91k64
$$ -248 51 6 42 179 248 -83 -50 200 -7 145 -26 31 -220 104 -190 -248 21 -125 195 -96 195 -69
5779f9K08j25On2K74k23j0p6N4pJ07o7J46o3N2m44R0J52j18M74k45M2j5l3l4q3
$$ -69 139 14 20 -32 242 19 9 -67 -13 -20 87 20 166 103 155 -289 -199 -47 -165 309 64 106 91 58 24 -59
5805e9J78l23J25J7M1J04l50J8J79N9o2K79j06j33r7J70qJ20k91J59J34j49j5
$$ -59 119 -204 -79 -62 -21 83 -267 -249 -70 -11 -73 206 100 -33 -130 40 32 152 -139 20 154 5 -10
5828a0L2o0P0Q9p0j07j1K15k75J73k87J92m4J38LK5L1L0j61J19k6K2J26k71J47
$$ -10 22 -38 32 121 51 -56 -67 148 -127 46 -241 -49 -93 45 48 73 104 134 -27 92 66 88 214 -57 90
5853I0j53j66K30j88j40K21L33q4k30J02K1M4L4m07L86j20l5k44J66k31N12J17
$$ 90 -63 -229 1 -187 -327 -106 227 143 -87 15 36 80 114 -293 93 -27 -62 -306 -140 -371 141 258
5875B58j31k20K10l5o2k45L80l04J52M3L97m95j12L04n7q4j21j57J81O3J81j38
$$ 258 127 -93 117 82 20 -225 155 -149 3 46 443 -52 -164 140 83 -1 -122 -279 -98 -35 146 8
5897Hj04j31%N3J91N7j04k7rj5R2k3N5k6q6P1l20O19m12M4K3J09m0J70j62p0m13
$$ 8 -96 -227 -227 -174 17 74 -30 -57 -66 -81 11 -12 43 17 -69 2 -318 301 -111 -67 -44 65 25 195 33 -37 -450
5924d50L72o8J16j47O9K71k37l7Q8j64J69j8j91L48k39K88l79J05j83L85J3j88
$$ -450 -78 -146 -30 -177 -108 163 -74 -111 -23 -187 -18 -36 -227 121 -118 170 -209 -104 -287 98 111 -77
5946g7L5l13K75J61j19L35l83K80J4p8j23k0j80O3L93n14L95k65K62N9k26L3P6
$$ -77 -42 -355 -80 81 -38 297 -86 194 208 130 7 -13 -193 -130 263 -251 144 -121 141 200 -26 7 83
5969H3O9l69K29o6O9p2J38j17J55r2N3L4j02J65k89J5J49k83L61o1J6l36K89l6
$$ 83 152 -217 12 -54 15 -57 81 -36 119 27 80 114 12 177 -112 -97 52 -231 130 69 85 -251 38 2
5993Bm0L4R0J2k55L46l72R2J4j80K78j19O2jJ97p2N1j68R0M1j76L2j31K33O8l57
$$ 2 -38 -4 86 98 -157 189 -183 -91 -77 -257 21 -98 -36 -37 160 88 139 -29 61 102 -74 -42 -173 60 128 -229
6019b29J97j23K9J27j98L37j57MJ7j55J54lk44K53m6k0J27J77k59J63k9j72n9
$$ -229 -32 -155 -126 1 -197 140 -17 -13 4 -151 3 0 -244 9 -37 -57 70 247 -12 151 122 -50 -109
6042a09J59Nq3J93l13j6J83M7Jk15J23pJ40k12K12l5m41L62k69K28jK09k32K30
$$ -109 50 55 -28 165 -148 -164 19 66 67 -148 -25 -32 108 -104 108 73 -368 -6 -275 -47 -48 161 -71 159
6066A59j92k77N89m59K54k14K52Po7L3L8J01J65k72j39r2P5K61j8k58J01r7L7
$$ 159 -33 -310 279 -180 74 -140 112 119 52 85 123 224 389 117 -22 -114 -39 222 204 -54 47 -50 -13
6089a3o8J42n9P5r7J10j85j9l6J50RK14j62j20J88j66N0O5k1j44p0J70K21j69
$$ -13 -81 61 2 77 -20 90 -95 -114 -150 0 9 223 61 -59 129 -37 13 78 57 -87 -157 13 234 65
6113F5r6L80k14j67M6P8j83J7K01j57R6Lo3O9R4l06p6K62k46L13j77O9J15L4j20
$$ 65 -31 349 135 -32 14 92 -91 -74 127 -30 66 69 6 75 169 -137 -213 49 -197 116 -61 8 123 157 37
6138C7R5j43J66J03k60j09J6K87k28l04K36R5kJ51j06R4l5p6M0k11J66J17j84
$$ 37 132 -11 155 258 -2 -111 -95 192 -36 -340 -104 -9 -11 140 34 128 93 17 57 -154 12 129 -55
6161e5l3K09J40n05j7M34k51K7J29j81K6k22J75J39j40K60J7l21M02j90P4k45
$$ -55 -88 121 261 -244 -261 173 -78 -51 78 -103 -77 -299 -124 15 -125 135 152 -169 233 43 117 -128
6183a28K48l00K60q3j21J40Q2l72M34m44K70l0J95m9k8R0j36j32J18kn6J99k23
$$ -128 120 -180 80 -3 -124 16 98 -274 160 -284 -14 -44 151 102 74 164 28 -104 14 12 -44 155 -68
6206f8k10J24K13J15l85J59lrJ43j34N6n2j92J72j03J23j17L18l4p8k54k9L50
$$ -68 -278 -154 59 174 -211 -52 -55 -64 79 -55 1 -51 -243 -71 -174 -51 -168 150 116 38 -216 -245 105
6229A05K7j98Q5oj02J06R2k36J96n4J21q2j66P6M9j07J31M5Q5j00M2J90l96l7
$$ 105 132 -66 19 13 -89 17 109 -127 69 15 136 54 -112 -36 13 -94 37 82 167 67 109 299 -97 -134
6253a34L55j75k5N4l83N43r6j21J6l05O33j43k87j97K12K14j60N4P2m16P7J97
$$ -134 221 46 21 75 -308 235 139 18 34 -271 362 219 -68 -265 -53 161 1 55 127 -289 -212 -15
6275a5J05J1j69r5K69r4j07K39j68p8J38j60R2J43J1k43K94J2k09jj00L50k83
$$ -15 90 101 -68 -163 106 12 -95 144 -24 -102 36 -124 -32 111 122 -121 173 185 -24 -25 -125 225 -58
6298e8J89%q6j36j6J59l2j38J39kk07K04Qm9J23J54l39m1K83l81Q6L9K49k78K64
$$ -58 131 131 45 -91 -107 52 20 -118 21 19 -188 16 24 -25 98 252 -87 -128 155 -226 -140 -101 148 -130 134
6323A34n1r3L43l34j43K41j10R4k29J74o4l4L59k74p9K32j38j70J29M9Rp8L06
$$ 134 83 -10 333 -1 -144 97 -13 81 -148 26 -38 -72 287 13 -66 166 28 -142 -13 36 45 -33 273
6346B73k33l8n8k3o2K19J49l03J84j96k9J51J75j0q2j83N8j67J48J10l4l08N67
$$ 273 40 2 -56 -79 -141 78 227 -76 108 -88 -117 34 209 199 117 -66 -8 -175 -27 83 49 -259 308
6369C08o31K80J61j99mk2J62m4j38K33l9J01k22J66J26k00j51K77k0l06K29pj78
$$ 308 -323 -43 118 -81 -85 -107 55 11 -127 106 67 168 -54 112 238 38 -113 164 144 -162 67 60 -118
6392a18K49K3l21K23j21R2O2j30j8Lj21K43j47P8J51k25L2J07j09q1J45nj14J63
$$ -118 131 154 -167 56 -65 27 89 -41 -59 -56 -177 66 -81 -3 148 -77 -45 62 -47 -128 17 12 -102 61
6416F1j85J28k3k13J44N6J75l40L53l19J69M2j52K15j13l02L92L2r5j65J0K9J11
$$ 61 -124 4 -19 -232 -88 -32 143 -197 156 -163 6 48 -104 111 -2 -304 88 120 25 -140 -130 -101 10
6439A0q0J72k74j3N9J25j84p9J11K38J27l53J05k8K07J13j05n4l13K53J74q7j11
$$ 10 -70 102 -172 -185 -126 -1 -185 -264 -153 85 212 -141 -36 -64 143 256 151 97 -216 37 211 124 13
6462A3q5J33k5J74j51n6j5j0OJ35p6n5m6O0J51k19j32m3J78j71K72k51J71K41
$$ 13 -72 61 36 210 59 3 -12 -22 -16 119 43 -12 -58 2 153 -66 -198 -241 -63 -234 38 -213 -42 199
6486A99m72L18K04r3m00L06n2m6j16L01j33j05J23j61K30j40J97n08L98K11l37
$$ 199 -273 45 249 156 -244 62 10 -36 -152 149 16 -89 34 -127 103 -37 160 -348 50 261 -76
6507g6j86K93k56L42o9k86O3K32q1n7J70o9k1J38p6q8j68L69j63k6l4j14K00j61
$$ -76 -262 31 -225 117 48 -238 -175 57 -24 -81 89 20 -1 137 61 -27 -195 174 11 -15 -49 -163 37 -124
6531a24L75l44N4J68k11N4J95l46J17J83N3k48J4L7J0N6J39j54j73L28m10L04
$$ -124 251 -93 -39 129 -82 -28 167 -179 -62 121 174 -74 -60 -23 -13 43 182 28 -145 183 -227 77
6553G7rL3j23K40k31j71J77n3k8J88j15m2M2J06k77L16k99J86r7J43j88J89K2
$$ 77 68 101 -22 218 -13 -184 -7 -60 -88 100 -15 -57 -15 91 -186 130 -169 17 -80 63 -125 64 86
6576H6l84L01J02j02J0l4n9j31N0J16Q6l1K5j03J28M3l39J43K18m65M74Jj73J80
$$ 86 -298 3 105 3 13 -21 -80 -211 -161 -45 41 10 35 -68 60 103 -236 -93 125 -340 134 135 -38 142
6600A42qj75R8NJ39j75j4l6K03r1l60L58J12J35l55k1j23K16K4K3N8m23J86k3
$$ 142 134 -41 57 62 201 26 12 -24 179 88 -272 86 198 333 -22 -43 -166 50 74 97 155 -268 -82 -105
6624a05j24K04L9j43K15k8K92m68J66p3l92M06r3K8O7P9k58J51m2j91M82k81K
$$ -105 -229 -25 14 -129 86 58 350 -118 48 -25 -417 -11 -104 -76 -9 70 -188 -37 -79 -270 212 -69 -67
6647f7J11j85L62k29k10J76L32j89M7m00K90j54R0j87K46J3j49L1L53r8k15J40
$$ -67 44 -141 221 -8 -218 -42 290 101 148 -252 38 -116 -26 -213 33 46 -103 -72 281 183 -32 108
6669A08k64K23j54J9K9j45K93n5P8N0l53L76o3k66M06j15o8J14l69P9j04J83M9
$$ 108 -156 67 -87 -68 -39 -184 109 54 132 182 -171 205 142 -124 282 167 99 213 -156 -77 -181 2 51
6692E1l8j99J86Q1q1k7J62j93Q3k2P9J71k33j15J17p8J9J82j57o5j7o3j1J46K1
$$ 51 13 -186 0 81 0 -27 135 -58 25 3 82 253 20 -95 22 -56 -37 145 -12 -77 -94 -157 -168 -22 -1
6717ak76M59r6n09M91k25j08M59j54m5L0k47K77j30M0k9J35l41K92j26M70k95
$$ -1 -277 182 86 -423 68 -157 -265 194 40 -5 25 -222 55 -75 -35 -64 71 -270 22 -104 366 71
6739G1j91N2J28K4k8q6O0r5j43J19J02j64J98R9N6j66J2j09j74m7J15k4P0R9Q6
$$ 71 -120 -68 60 84 56 -30 30 -65 -208 -89 13 -151 47 146 202 36 48 -61 -235 -282 -167 -191 -121 -22 64
6764F4J06j76q1J04R0j78l83M42j72O3L6J4M26l99j97oL12J04k01l7k1j00L97
$$ 64 170 -6 -87 17 107 -71 -454 -12 -184 -121 -85 -71 355 -44 -241 -247 65 169 -32 -69 -90 -190 207
6787B07L3p2k24P5L8j88P7M8J94j15K7l39J24J04J28r1R8K26m20j29L19l5j03
$$ 207 240 168 -56 19 57 -131 -54 -6 188 73 100 -239 -115 -11 117 26 124 350 -70 -199 120 85 -18
6810a8J03k37J20K9j52P5K11l00Q7M9N4q0N3K16l95L61N5j28k87j5L28k87J17
$$ -18 85 -152 -32 -3 -155 -80 131 -169 -82 -33 21 -59 -6 210 -185 176 231 103 -184 -199 129 -158 -41
6833d1Q5m8k69M41j88n2M07k03j74J83k1k68K05p2L5K8j0j10L22m51L49k39J28
$$ -41 44 -4 -273 168 -20 -72 335 132 -42 141 120 -148 57 -15 20 48 38 -72 250 -201 148 -91 37
6856C7Q8k74J14q5r1L30P8j48j91P8J45j28J26O9q9J04k90K50j06J7r6R1p8K97
$$ 37 125 -149 -35 -120 -211 119 197 49 -142 -64 81 -47 79 148 59 163 -127 123 17 34 -62 29 -49 248
6880B48j96qM8j34J48P3j23j16j52K63j4k0P0k08J29J52k8J03j26p0k02K09R9
$$ 248 52 44 92 -42 106 179 56 -60 -212 51 37 17 87 -121 8 160 132 235 109 39 -163 46 145
6903A45k40r4M9j70J78M38k34j01l12K82k08K01O5O1j81J32l0j67K41m2m0P9q1
$$ 145 -95 -189 -140 -310 -132 306 72 -29 -341 -59 -267 -66 -1 60 -121 11 -19 -186 55 13 -27 52 -29
6926b9j27J1O3L5J27k61N6L3O5j45J92j19NR3j30K40l80L80r5m3J05L0j34j02
$$ -29 -156 -145 -82 -47 80 -181 -125 -92 -27 -172 20 -99 -94 -1 -131 109 -271 109 14 -29 76 106 -28 -130
6950a30J68j5j83M09j33K9l90K71pL11n50J08r4p8o7L09k11Q6M36n01K82l06N35
$$ -130 38 23 -160 249 116 145 -245 26 19 330 -220 -112 -206 -284 -351 -42 -253 -167 269 -232 50 -256 279
6973B79l42J32o5Q3k59J36j01J22l4q8J08J62k48L97k93P6K0pL6j12M9p3P0j35
$$ 279 -63 69 4 87 -172 -36 -137 -15 -49 -137 -29 133 -115 282 -11 65 85 78 114 2 51 -22 48 -87
6997h7K19N8k84K31oj18M2PN7k39L47j1m40L50N4r5n5RK0N5m06M12k5k03l6P1
$$ -87 132 190 -94 137 131 13 55 62 119 -120 227 216 -224 126 180 85 30 39 59 114 -292 120 95 -108 -144 -73
7023g3L93k76j46M7l7J17j69K15k20K51o7j95K46N5j25K5k85L05n4J15l7q6j87
$$ -73 320 44 -102 -55 -92 25 -144 71 -149 102 35 -160 86 141 16 41 -244 61 7 122 85 -1 -188
7046a88M12k35p2N9l0lJ31j36J5Q5n5J17j66K46j85K38l64O4J76j38J09k96K93
$$ -188 224 -11 -83 -24 -54 -57 74 -62 -47 38 -17 100 -66 180 -5 233 -131 -67 109 -29 80 -216 77
7069G7mk35J45J72k25j14J86JN6N7n8o8n0p7K74J31k29K27m35K58l21J14M6J14
$$ 77 73 -162 -17 155 -70 -184 2 3 59 116 58 -10 -60 -137 137 268 39 266 -169 89 -232 -118 -72 42
7093D2k34j6nK36q7qJ26j08J25K3J27l78o2J72J19j92J41l4K0J34j49j96N4K03
$$ 42 -192 -208 -213 23 -64 -72 54 -54 71 94 221 -157 -219 -47 72 -120 21 -13 7 141 -8 -204 -150 53
7117E3r8P9l91M14q5J9j04J44J43l43j08M27l94J74J82K04l57J97p7J48j88l7
$$ 53 -45 34 -357 57 -28 -9 -113 31 174 -169 -277 150 -244 -70 112 316 -41 156 79 227 39 2
7139Bj71R8k1K28k79L48l86r7M51j50O5j31J3l6J92l35L86r1j83O2J29j56L50
$$ 2 -169 -71 -92 136 -143 205 -181 -278 173 23 88 -43 -30 -66 126 -209 177 86 -97 -35 94 -62 288
7162B88j42j96N6L8j20J12j28j9j25L25q0j05K61k90L39n8p3j72J40%J79k61j26
$$ 288 146 -50 6 44 -76 36 -92 -111 -236 89 9 -96 165 -125 214 156 83 -89 51 51 230 -31 -157
7185a57J98J38j24m0j16k6j30K43j44l2L45j72J11j89J05N9J07p6o3l93L39J6
$$ -157 41 179 55 15 -101 -127 -257 -14 -158 -190 155 -17 94 -95 10 69 176 100 37 -356 -17 -1
7207aJ45m02K16J0J34m5j74J16Nk39K64j49K62k78J60N8O4j7p7J06l96J82o3N3
$$ -1 144 -258 -42 -32 102 57 -117 -1 4 -235 29 -120 142 -136 24 82 146 129 52 158 -238 -56 -119 -66
7231f6K08j78L6k84L72Lq6J52k55J08k38M06m2r4r0J31q5M8K2j38N1K20p1O6j25
$$ -66 142 -36 0 -284 88 91 5 157 -98 10 -228 178 136 42 -48 83 -2 46 68 -70 -19 201 130 196 71
7256G1j41R9l3J90m65M11k66K65p5N7J44n50M63j63J04l8j23j4O3N6K1j87P6J83
$$ 71 -70 29 -4 186 -279 132 -134 131 56 113 257 -293 170 7 111 73 -50 -64 -1 55 76 -111 -35 148
7280A48j02k12K59j49K56J2j05l18M50j29k8l6n4K5j93K9K77n7J52j25J52j98
$$ 148 46 -166 93 -56 200 212 107 -211 239 110 82 46 -8 17 -176 -147 130 73 225 100 252 54
7302E4J12q8l47K78j43K27k02K03q5k9j08L0J25j05J76M5j54L1J91l72R1K18k12
$$ 54 166 78 -269 9 -134 93 -109 94 9 -20 -128 -98 27 -78 98 143 -11 20 211 -161 -70 148 -64
7325f4K6j50K82j88j77K45K26Lk56J91k68J20o4J9K81l75Q2k15M55j09r9J7l7
$$ -64 -38 -188 94 -94 -271 -26 200 203 -53 138 -130 -10 -74 -55 226 -149 -67 -282 173 64 -35 -18 -55
7348e5K06n8k14N48o04K79q3k10J10J61M6J9M6k70P4K16l23J64J85l38J21J32
$$ -55 151 93 -121 427 -177 102 19 -191 -81 80 126 145 191 -79 -5 211 -112 52 237 -101 20 152
7370A52k9j71N4J23k37K65k47J87j54R4j85J22L0n9K01L8j96n0K13j92q6J02k53
$$ 152 123 -48 6 129 -108 157 -90 97 -57 37 -148 -26 4 -55 146 184 -12 -62 151 -41 -127 -25 -278
7393b78J39L00m00K22K7N0k5N1k49J22J36q5O6J29k18J20j20J41j34k35K09J40
$$ -278 -139 161 -239 -17 10 60 35 86 -163 -41 95 10 76 205 -13 107 -13 128 -6 -241 -32 108
7415A08n1j54j09K36N1j36K26m55L79J89l59J31J0m47L86o0j96L24Jj17R9m33
$$ 108 57 -97 -206 30 81 -55 171 -284 95 284 -75 56 66 -381 5 -55 -251 73 74 -43 56 -377
7437c77L63j05Qn1K51K3J25j37p9j1K58l76n9Q7J90j2jJ54l66J82P4o2L9j22L2
$$ -377 -14 -119 -111 -162 89 112 237 100 21 10 268 -108 -167 -80 110 98 97 251 -115 67 141 79 118 -4 28
7462B8r4j6K81k04k59J38J29j44J75l46J46L36j78J64k22p9M09p3ol43QO7j31
$$ 28 -66 -82 199 -5 -264 -126 3 -141 34 -312 -166 170 -8 156 -66 -145 264 191 185 -158 -150 -83 -214
7485b14%L14j49J02j75K27K25l53j77P2J87K18k93J22J37k69L22j01j06Q8j19
$$ -214 -214 100 -49 53 -122 105 330 -23 -200 -128 59 277 -16 106 243 -26 296 195 89 177 58
7506E8M6J42k61o7o5K10j72K7MR0j79k69M93j09k9k6J59O8n6j32j7M6O5R1k34
$$ 58 104 246 -15 -82 -147 63 -109 -82 -78 12 -167 -436 57 -52 -81 -107 52 120 64 -68 -85 -39 26 117 -117
7531a17K03o2k60K30k30K49n7O2j34K0K47k11K04k10M9N9j69J27j69J52n3M4R8
$$ -117 86 24 -236 -6 -236 13 -44 18 -116 -96 151 -60 144 -66 -17 42 -127 0 -169 -17 -70 -26 72
7554G2K18k61j50J97j6k04k49K48K89j63p9NN7j48J03R5L1o5N8J92l71J97j29
$$ 72 290 29 -121 76 60 -144 -393 -145 144 -19 -98 -93 -36 -184 -81 14 45 -20 38 230 -141 56 -73
7577g3J41L3m86L73J14k53J52j9rK91k59J56l25L13k75L24j55j60K6Q6ql6K96
$$ -73 68 101 -385 -12 102 -151 1 -18 -27 264 5 161 -164 149 -126 198 43 -117 -91 -5 -13 -49 247
7600B47k46j62J52j60K46Q8k54J32k78M12j68nj47L17J6k90L21k01M1L7j73K47
$$ 247 1 -161 -9 -169 77 165 -89 43 -235 177 9 4 -143 174 190 -100 221 20 61 98 -75 172
7622A72k96K34j22j7J35j26Jj82J36P8n0o8m4J08J7k2j14J35o6l9L4L77l1j77
$$ 172 -124 110 -12 -29 106 -20 -19 -201 -65 13 -37 -105 -149 -41 -24 -46 -160 -25 -91 -130 -96 281 250 73
7646G3M5j57J36k38m2L09r1K33m84L19J2L9K3k22J87k97J10J73j69J45l17J90
$$ 73 118 -39 97 -141 -183 126 35 268 -216 103 115 154 177 -45 142 -155 -45 128 -41 104 -213 -23
7668b3K03q6kp4q5J2J73j46j78L22q7o9K32k82OJ68p2Q2p0j43L7N9L06m95N9J3
$$ -23 180 94 92 18 -67 -55 118 -28 -206 116 29 -40 192 -90 -84 84 12 94 24 -119 -82 -23 283 -212 -153 -140
7694a40N3j12K29k21N65m76p2K27P9m1r5j33J79p3j7j99J82J01j38Q0L80k02m38
$$ -140 -87 -199 30 -191 374 -102 -174 53 132 91 -4 -137 42 -31 -48 -247 -65 36 -102 -22 358 156 -282
7717b82J04J53Qj25r5J36j82J63J26k22K0K22M1P7k45J68p0M6j13K76M2l29L67
$$ -282 -178 -25 -17 -142 -237 -101 -283 -120 6 -216 -196 26 67 144 -101 67 -3 43 -70 206 248 -81 286
7740B86l12o4J92k72J4j53K25m8P3M4R2Q0k28l5K06k82J41J94m9m8Q1Nk53P4J00
$$ 286 -26 -90 102 -170 -156 -309 -84 -132 -59 -15 77 157 -71 -106 100 -182 -41 153 104 56 137 142 -111 -37 63
7765F3n6K71r4k17J02m5j25LJ06l7P9O0P0l22pj3k8L83j00j10Q6o7N3l44L87j75
$$ 63 7 278 184 -33 69 24 -101 -98 8 -29 50 110 180 -142 -149 -162 -190 193 93 -17 69 2 55 -289 98 -77
7791g7j2m8O0j51M95k22J33p9p5k22JK50n9j13J47J68j58j8m7r9MR8J93l6k43
$$ -77 -89 -137 -77 -228 267 45 178 99 24 -198 -197 53 -6 -119 28 196 38 20 -27 -126 -122 -24 169 133 -110
7816a10p6J85K5m2k02K51l35J02J40K29j20j09L28j14m3k4o5J74j73k63K17l1
$$ -110 -186 -1 24 -18 -220 31 -304 -202 -62 167 47 -62 266 152 109 85 20 194 21 -242 -25 -56
7838e6M9p1L14k06k0l3J52l39L22j00j6m0o9J12q1J58n0O2o4l6J71k51J01M2N2
$$ -56 -7 -78 236 30 10 -23 129 -210 112 12 -4 -44 -113 -1 -82 76 26 88 24 -12 159 -92 9 51 103
7863A03J26j16l42N25m03L66l50J84M4m4m6Q7l1m07N73k34n3J28j21L9J16k46
$$ 103 229 113 -229 296 -107 259 -91 93 137 93 47 134 103 -304 269 35 -18 110 -11 28 144 -102
7885a02r9J53K05l57J20J17K62n13J42k9J22J02j84k34M36j7j64p9J07R7J77m6
$$ -102 -201 -48 157 -200 -80 37 299 -214 -72 -101 21 123 -61 -295 141 124 -40 -119 -12 85 262 216
7907B16m02L60k03jL2N0j68Q8J6k7K53n6j05K3K5k67K17K19m75J62K9j52J16J2
$$ 216 -186 174 -29 -30 2 52 -116 -28 -12 -39 214 158 53 76 101 -166 51 270 -205 -43 -14 -166 -50 -38
7931c8P9J21j72K9J26q8j49K0J65j97R3K26rm0k96j86J47Q2J59j32P8j32M4M2
$$ -38 41 162 -10 19 145 57 -92 -72 93 -104 -11 215 206 166 -130 -316 -169 -87 72 -60 18 -114 -70 -28
7955b8J8m4P6K87l10m1q2K7L36l99JK71o6K4j00J76l51K61J24o8j70K82m47M02
$$ -28 -10 -54 22 309 -1 -42 -124 -97 239 -160 -159 112 46 70 -30 146 -205 56 180 112 -58 224 -223 179
7979A79q0n7j51K74l22J52O9j3n2o6M17k51q1j95K89j25J60P4M1m82K08l4%L11
$$ 179 99 42 -109 165 -157 -5 64 51 -1 -67 350 99 18 -177 112 -13 147 221 262 -220 -12 -46 -46 265
8003B65k69j91K66q2j77K51K26n53J37K21l07J76k78K77j43L36j02K5J14j62k10
$$ 265 -4 -195 71 -11 -188 63 289 -264 -127 94 -213 -37 -315 -38 -181 155 53 78 192 30 -180
8024a80J73J38k83J42m39N52l50j1J58P6j70J94J15k22K09j28O4n0K01m1j38p5
$$ -180 -7 131 -152 -10 -449 103 -247 -258 -100 -24 -194 0 115 -107 102 -26 38 -12 189 148 10 -65
8046f5j04L26m52L35N2J5k97K28J25k34k09K84Q9o3k70j3J65J8P1n3m3L17j95
$$ -65 -169 157 -295 40 92 107 -190 38 163 -71 -280 4 93 30 -240 -253 -88 -70 1 -52 -95 222 27
8069B7P3n5j47K22k45L62l61R4K7o2M2m5K19j99o%J55r0O6k30K49L1q1J64k61
$$ 27 100 45 -102 120 -125 237 -124 -30 -3 -65 -23 -68 151 -48 -54 -54 101 11 77 -153 96 127 46 210 -51
8094e1j09K2J27n5N0j71r0K86k88N10k50K30m63J32L31m20J74J52m7o9K48k63
$$ -51 -160 -138 -11 -66 -16 -187 -277 9 -279 231 -19 211 -252 -120 211 -209 -35 117 70 1 249 -14
8116a4j49J20mJ70l59J2J12K42l75J35R2r0L9Q7J50l68J04J35k22K71j45J05k1
$$ -14 -163 -43 -47 123 -236 -224 -112 130 -245 -110 -18 -108 -69 18 168 -200 -96 39 -183 88 -57 48 27
8139B7j14J64l13K93q8J81l45J51J50J44l27J3K17o6k1J26k33K2J06j04L09k45
$$ 27 -87 77 -236 57 -31 150 -195 -44 106 250 -77 -64 153 87 66 192 -41 -19 87 -17 292 47
8161D7j2mM1q0K13j80J94k12m9K7J46j60N4j53M1J70M2k48J04l9MJ58k25OP6m0
$$ 47 35 31 72 -8 205 25 219 7 -42 -15 131 -29 25 -128 -87 83 125 -123 -19 -58 -54 104 -121 -115 -39 -79
8187g9J11Q0k68L4
$$ -79 32 112 -156 -122
8191a22
$$ Imaginary data points
##PAGE= N=2
##DATA TABLE= (X++(I..I)), XYDATA
0@%%%%%%%%%%%%%%%%%%%%Mj2J6j6J6j6J6k0K8l2L3m0M7n0N8o5P3q2R1j01J10j24
$$ 0 0 0 0 0 0 0 0 0 0 0 0 0 0 0 0 0 0 0 0 0 4 -8 8 -8 8 -8 8 -12 16 -16 17 -23 24 -26 32 -33 40 -42 49 -52 58 -66
42f6J40j55J70j88K08k28K50k76L04l34L68m08M53n01N53o15O91p78Q82j013J178
$$ -66 74 -81 89 -99 109 -119 131 -145 159 -175 193 -215 238 -263 290 -325 366 -412 470 -543 635
63F35j392J687k117K800m067P155k6709l7950N4332L584r808L7721J6634j5847
$$ 635 -757 930 -1187 1613 -2454 4701 -22008 -59958 -5626 -2042 -11850 25871 42505 26658
77B6658J9933O023k1475k533n127k3521K422K357j7387K674L703k1916N007J1949
$$ 26658 46591 52614 31139 28606 23479 -42 2380 4737 -12650 -9976 -6273 -28189 -23182 -11233
91a1233j9186m626N307k0048O660K9419j024P170L1466M491k611J2332q977j5439
$$ -11233 -30419 -35045 -29738 -49786 -43126 -13707 -14731 -7561 23905 28396 25785 38117 29140 13701
105A3701P725k441p148J6287J311j6710M539o560k3947L232k365k6840K959J0299
$$ 13701 21426 18985 11837 28124 29435 12725 17264 10704 -13243 -10011 -12376 -39216 -36257 -25958
119b5958j4186Q235J9964p874O427K4876n314q867J2700l195q970J4872R002j55
$$ -25958 -40144 -31909 -11945 -19819 -13392 11484 6170 -2697 10003 6808 -2162 12710 21712 21557
133B1557J2604R96j0992l41r605j8230r58n073j1661R002M157j0469L946M728
$$ 21557 34161 35157 24165 23824 14219 -4011 -4969 -10042 -21703 -12701 -8544 -19013 -15067 -10339
147a0339r693K069P320p817R99J1566j533M105J6397L439K094J1701l787q737
$$ -10339 -20032 -17963 -10643 -18460 -17461 -5895 -7428 -3323 13074 16513 18607 30308 26521 17784
161A7784K193r323j1891N427j7n025P380o32j1847j106k532j3319j136M561m180
$$ 17784 19977 10654 -1237 4190 4173 -852 6528 5896 -5951 -7057 -9589 -22908 -24044 -19483 -23663
176b3663M124J1721Q16M031J0486m06J66O349k757k860L985k388o45O509N6k472
$$ -23663 -19539 -7818 -7002 -2971 7515 7109 7275 13624 10867 8007 11992 9604 8959 15468 15524 13052
192A3052K110n724j0069m073o707r153J874K715j231O255N691k851K124K984m495
$$ 13052 15162 9438 -631 -4704 -11411 -20564 -18690 -15975 -17206 -10951 -5260 -8111 -5987 -3003 -7498
207g498J862N320j15M100P741J256K663N222k069l915n88n486p745k201l255m350
$$ -7498 -5636 -316 -431 3669 11410 12666 15329 20551 18482 14567 13979 8493 748 -1453 -4708 -9058
223i058K018J874j993R18m03n275j896p50k018L193N654M526O197O129K651J575
$$ -9058 -7040 -5166 -7159 -6241 -6644 -11919 -13815 -14565 -16583 -13390 -7736 -3210 2987 9116 11767 13342
239A3342R66k280j502n88j971j245R87j211j250N73k999m712k652n107n308j391
$$ 13342 14308 12028 10526 9938 7967 6722 7709 6498 5248 5821 2822 -1890 -4542 -9649 -14957 -16348
255a6348j335L42M525M617L521M050K881k5PP77L2J251L786K473K292K734k73
$$ -16348 -17683 -17341 -12816 -8199 -4678 -628 2253 2228 2235 3012 3044 4295 8081 10554 12846 15580 15307
272A5307k287k509m648m885m404l376k529j028K37J148P00M15P66q54o90j72Q32
$$ 15307 13020 10511 5863 978 -3426 -6802 -9331 -10359 -10122 -8974 -8274 -7859 -7093 -7947 -8637 -8809 -7977
289g977J515L549M512M813L859L307P23j165j507k806l509j369j759r27L97n83
$$ -7977 -6462 -2913 1599 6412 10271 13578 14301 13136 11629 8823 5314 3945 2186 1259 1656 1073
305A073j443j074k766k969k833k391r17n7K360L434L386M038L097K195Q12n14
$$ 1073 -370 -1444 -4210 -7179 -10012 -12403 -13320 -13377 -11017 -7583 -4197 -159 2938 5133 5945 5431
321E431J1k64o76J146J756L36J517K97k005k545l395m280l537j805j797n0J727
$$ 5431 5442 5178 4502 5648 7404 7740 9257 9554 7549 5004 1609 -2671 -6208 -8013 -9810 -9860 -8133
338h133J653J240J628J131o97K10M76n95J582K493K103K920L083O65N30j242k400
$$ -8133 -6480 -5240 -3612 -2481 -3178 -2968 -2492 -3087 -1505 988 3091 6011 9094 9759 10289 9047 6647
355F647k503l199j874j339r66P83J0M65O6j131j587j174j437k18O69J636L130
$$ 6647 4144 945 -929 -2268 -3234 -2451 -2441 -1976 -1910 -3041 -4628 -5802 -7239 -7457 -6788 -5152 -2022
372b022K652K632K667N95l90o12j494j453n03l34L28L32Q99n7j406j252k270k761
$$ -2022 630 3262 5929 6524 6134 5522 4028 2575 2072 1738 2066 2398 3297 3240 1834 582 -1688 -4449
390d449j748j126n67J292J954K160K175J713Q96L1n43k10o86L66R99P53J310J704
$$ -4449 -6197 -7323 -7890 -6598 -4644 -2484 -309 1404 2300 2331 1788 1578 892 1258 2257 3010 4320 6024
408F024k26o76j015k783k411k170j813q08M9J306R05J560J088n0l77n12q27L57
$$ 6024 5798 5122 4107 1324 -1087 -3257 -5070 -5878 -5829 -4523 -3618 -2058 -970 -1020 -1397 -1909 -2736 -2379
426b379J223R56K187K302J469J339n1j168j354k282k017j422r36k69J02P01J10
$$ -2379 -1156 -200 1987 4289 5758 7097 7046 5878 4524 2242 225 -1197 -2133 -2402 -2300 -1599 -1489
443a489o44mj214j641j25o14L0J881K359J579L047K164nL22m74j621r11k76k91
$$ -1489 -2133 -2137 -3351 -4992 -5117 -5731 -5701 -3820 -1461 118 3165 5329 5324 5646 5172 3551 2640 2364 2073
462B073K77O63p4q65j36j549k781j481j398k366R27K77R72J964J688J237J509
$$ 2073 2350 3013 2939 2074 1938 389 -2392 -3873 -5271 -7637 -6710 -6433 -5461 -3497 -1809 -572 937
479I37L50j50Q0J59k0Q63J890R71J153J149j187j577j076l217k124n86j659n87
$$ 937 1287 1137 1217 1376 1356 2219 4109 5080 6233 7382 6195 4618 3542 325 -1799 -2385 -4044 -4631
497d631J297m07P0J211m68j018K99K7n35J163J650P74K702K807L24R00O21j499
$$ -4631 -3334 -3741 -3671 -2460 -2928 -3946 -3647 -3620 -4155 -2992 -1342 -568 2134 4941 5265 6165 6786 5287
515E287j638o08j781p36M48l45j56O96j227j541j129j726j514k26K05M06J880
$$ 5287 3649 3041 1260 524 972 627 471 1167 -60 -1601 -2730 -4456 -5970 -6196 -5991 -5585 -3705
532c705J967J073J703J686n73O34K95j238L83O57l47J000J090l40l80n75j859
$$ -3705 -1738 -665 1038 2724 2151 2785 3080 1842 2225 2882 2535 3535 4625 4285 3905 3330 1471
549A471k620j152j721j292R09Q37J27J427Q38p43M98L17j088R59J112j32J968
$$ 1471 -1149 -2301 -4022 -5314 -4405 -3568 -3441 -2014 -1176 -1919 -1421 -1104 -2192 -1233 -121 -253 1715
566A715J555N94P49N82q07q75j198j595j538m83l06m05J100j02p0j16j019j494
$$ 1715 3270 3864 4613 5195 4388 3513 2315 720 -818 -1301 -1607 -2012 -912 -1014 -1084 -1200 -2219 -3713
584c713L59p36L61J544J229J201K180Q22M8o1J83j061n50j18q94j18P66n39l97
$$ -3713 -3354 -4090 -3729 -2185 -956 245 2425 3247 3295 3234 3417 2356 1806 1688 794 676 1442 903 506
603E06N06r53j576l28j781j164M00L44Q33J678J500P64J006K95p19l24K90k52
$$ 506 1012 59 -1517 -1845 -3626 -4790 -4390 -4046 -3213 -1535 -35 729 1735 2030 1311 987 1277 1025
621A025K97J209L30O58J66j144q21p58j542j379m23j284j66M54J94P71J063M8
$$ 1025 1322 2531 2861 3519 3685 2541 1720 962 -580 -1959 -2382 -3666 -3832 -3378 -3184 -2413 -1350 -1302
639a302J40Q4J8l29R85Q17P32J709J720K8K25m8j813q28r51j608m12j92j28k76
$$ -1302 -1162 -1078 -1060 -1389 -404 413 1145 2854 4574 4602 4827 4779 2966 2138 1187 -421 -833 -1025 -1153 -1429
659a429J6m28p97n35k00o11J20J64N30J479J599J090J611Q55J76K99m41n59m16
$$ -1429 -1413 -1841 -2638 -3173 -3373 -3984 -3864 -3700 -3170 -1691 -92 998 2609 3464 3640 3939 3498 2939 2523
678B523j52R9L58m08k43n56j191j537j334j224p93o63M75P31L50J103Q27K40J303
$$ 2523 2371 2470 2828 2420 2177 1621 430 -1107 -2441 -3665 -4458 -5121 -4646 -3915 -3565 -2462 -1635 -1395 -92
697i2N8P7O38Q45N78O95R60P39L81l4o63j349r04j459j686r44j20m44L97j03j74
$$ -92 -34 43 681 1526 2104 2799 3759 4498 4879 4845 4182 2833 1929 470 -1216 -2160 -2280 -2724 -2327 -2430 -2604
718b604l81m84K5n20M67R63O53J219J271J420Q98J077k7o6k20o63q04n00K34j66
$$ -2604 -2985 -3469 -3444 -3964 -3497 -2534 -1881 -662 609 2029 2927 4004 3977 3911 3691 3028 2224 1724 1958 1792
738A792n82j56o94r40q23j283j164m15k19M65O96R15Q82Q74Q15N76L5J39N57K76
$$ 1792 1210 1054 360 -580 -1403 -2686 -3850 -4265 -4484 -4019 -3323 -2408 -1526 -652 163 739 774 913 1470 1746
758A746L02P48L80K05k4M5o82r40j229q42j539m79m43n7J56O14M1J37J93l58j
$$ 1746 2048 2796 3176 3381 3357 3402 2720 1780 551 -291 -1830 -2309 -2752 -2809 -2653 -2039 -1998 -1861 -1668 -2026 -2027
779b027L63O63N88R70Q57J176O83N0r2m47m42j001o28m62p9m88mj74M8r81l71
$$ -2027 -1664 -1001 -413 557 1414 2590 3273 3323 3231 2784 2342 1341 713 251 172 -316 -320 -494 -446 -1427 -1798
800a798m21o29m42L34M13R51J133J038O54L13P41l11m33L69l52k13M33k10k52
$$ -1798 -2219 -2848 -3290 -2956 -2543 -1592 -459 579 1233 1546 2287 1976 1543 1912 1560 1347 1780 1570 1318
819A318N31q60p06p98j029m75o69l39j08M60P18M02Q03Q26M9J04M29K16l7M71
$$ 1318 1849 989 283 -515 -1544 -2019 -2688 -3027 -3135 -2675 -1957 -1555 -752 74 123 227 656 872 835 1306
839A306M24M75N90J80k19l86r78o58j077p54m32n12j9o8K91m6K85k01N9l83N17
$$ 1306 1730 2205 2795 2975 2756 2370 1392 734 -343 -1097 -1529 -2041 -2060 -2128 -1837 -1883 -1598 -1799 -1740 -2123 -1606
860a606P15L50Q01J332J89J029N51o7l08m21m92q95l01m33l51k73k11q40l31l42
$$ -1606 -891 -541 260 1592 1781 2810 3361 3294 2986 2565 2073 1178 877 444 93 -180 -391 -1231 -1562 -1904
880a904j042j73p3o7M60O43Q09Q24R20P39L46K42JL45j14M01K66j82J97l27j12
$$ -1904 -2946 -3119 -3192 -3259 -2799 -2156 -1347 -523 397 1136 1482 1724 1725 2070 1956 2357 2623 2441 2638 2311 2199
901B199p59j030r97q74j076k98p7k38M67L39K00L12K69K22M18K02N75N75R10R32
$$ 2199 1440 410 -587 -1461 -2537 -2835 -2912 -3150 -2683 -2344 -2144 -1832 -1563 -1341 -923 -721 -146 429 1339 2271
921B271O77O23Q0m36k51n42p34p13q99m66p0o36j54j38q07K15q35k62K09J2M90
$$ 2271 2948 3571 3651 3215 2964 2422 1688 975 76 -390 -460 -1096 -1250 -1388 -2195 -1980 -2815 -3077 -2868 -2856 -2366
942b366O80P45J053R13N57N65J42Q2o2o8j08j02q8J19m29o74k18o78p00j052p31
$$ -2366 -1686 -941 112 1025 1582 2147 2289 2371 2309 2241 2133 2031 1943 2062 1633 959 741 63 -637 -1689 -2420
963b420k67k23O9K94N24L54N97K60K54M43L31K47L26P14O84L49J78J11n18j77
$$ -2420 -2687 -2910 -2841 -2547 -2023 -1669 -1072 -812 -558 -115 216 463 789 1503 2187 2536 2714 2825 2307 2130
983B130o98n60q43n44n79M6p4j22k3j88j12k50j36K81qO93M70P52M34P01K30M29
$$ 2130 1432 872 29 -515 -1094 -1048 -1122 -1244 -1267 -1455 -1567 -1817 -1953 -1672 -1680 -987 -517 235 669 1370 1600 2029
1005B029j03k48j25n59J5j2m89j36J02m85p8o90m25k97j88l50O4J26O67N36N19
$$ 2029 1926 1678 1553 994 1009 997 508 372 474 -11 -89 -779 -1204 -1501 -1689 -2039 -1975 -1849 -1182 -646 -127
1026a27L25L34J46M23m84J15M71j18K93K01k96j45l02k24p17o99l29n9l25j87
$$ -127 198 532 678 1101 617 732 1203 1085 1378 1579 1283 1138 836 612 -105 -804 -1133 -1192 -1517 -1704
1046a704L47k60Q12O4J39J23nK85K67M92M00M14K46J36R0k51j25l77o71m92p4
$$ -1704 -1357 -1617 -805 -741 -602 -479 -484 -199 68 560 960 1374 1620 1756 1846 1595 1470 1093 422 -70 -144
1067a44n90k67m2j53O1J58l85j37kL09k57L53M87Q11N39K64O06J57JL9l13k57
$$ -144 -734 -1001 -1043 -1196 -1135 -977 -1362 -1499 -1501 -1192 -1449 -1096 -609 202 741 1005 1611 1768 1769 1808 1495 1238
1089A238k5l77r4N7p14J55m51o16k16p05k11mk66M18L37O74L53K43L76N27nJ88
$$ 1238 1213 836 742 799 85 240 -211 -827 -1043 -1748 -1959 -1963 -2229 -1811 -1474 -800 -447 -204 172 699 694 882
1111H82K87K33J7N83Np4j55l05l73n39n97n70n71j28o6l38J43j90K96m9j3n0M04
$$ 882 1169 1402 1419 2002 2007 1933 1778 1473 1100 561 -36 -606 -1177 -1305 -1371 -1709 -1566 -1756 -1460 -1509 -1522 -1572 -1168
1134a168K17M71O33M17Q17K78L23K8q8j31j8m09m59k10k44n68j5j67l05o20L6
$$ -1168 -951 -480 153 570 1387 1665 1988 2016 1928 1797 1779 1370 911 701 457 -111 -126 -293 -598 -1218 -1182
1155a182m25r8k92K14K03L86N36M12L97K36N72q7qN70m1K96k53n1j23n3j76o78
$$ -1182 -1607 -1705 -1997 -1783 -1580 -1194 -658 -246 151 387 959 872 864 1434 1393 1689 1436 1385 1262 1209 1033 355
1177C55j30p71j75n52j70N6r7L59q9J97Q6N0M40k01K69N31L69P2K70J91N72j90
$$ 355 225 -546 -721 -1273 -1443 -1387 -1484 -1125 -1214 -1017 -931 -881 -441 -642 -373 158 527 599 869 1060 1632 1442
1199A442N7l94l07l09l36o9j85k02J87m53p6l93Q3j31k18K58j76M20O76J8L60
$$ 1442 1499 1105 798 489 153 84 -101 -303 -116 -569 -645 -1038 -955 -1086 -1304 -1046 -1222 -802 -126 -108 252
1220B52M30J76l52L47q6O7j07o20P60j52k93p9M2o28m6m52j55j07J7R1J19L68
$$ 252 682 858 506 853 767 834 727 107 867 715 422 343 385 -243 -289 -741 -896 -1003 -986 -895 -776 -408
1242d08K30J42q6K40R9J95J01J28l86P94l50j75L47j67m16l20l26q5n75M2J74
$$ -408 -178 -36 -122 118 217 412 513 641 255 1049 699 524 871 704 288 -32 -358 -443 -1018 -976 -802
1263h02k52M37J72jJ25J06j07L11j08J83K18N1M02J86J23K42k24j90n79J02m55
$$ -802 -1054 -617 -445 -446 -321 -215 -322 -11 -119 64 282 333 735 921 1044 1286 1062 872 293 395 -60
1284f0j68J4m51l3j59J72J4k79N7J0n0q1O95L36M11O7L64MJ57P7j11L58k54L0
$$ -60 -228 -214 -665 -698 -857 -685 -671 -950 -893 -883 -933 -1014 -319 17 428 495 859 863 1020 1097 986 1344 1090 1120
1308A120l54l67l7k09j91j33o89K38m40m34K06J36J67n0L85J26M71P2Q3K54K94
$$ 1120 766 399 362 153 -38 -171 -860 -622 -1062 -1496 -1290 -1154 -987 -1037 -652 -526 -55 17 100 354 648
1329F48K61k1L11L38n49N45l32j73l27k38l27n36l42Lm0l14J17j50j43k2L43j13
$$ 648 909 888 1199 1537 988 1533 1201 1028 701 463 136 -400 -742 -739 -779 -1093 -976 -1126 -1269 -1291 -948 -1061
1351a061K95L54J95N81R5K89M98j15K38j33j35j51j66J23k71nm09q9n34j54j0
$$ -1061 -766 -412 -217 364 459 748 1246 1131 1369 1236 1101 950 784 907 636 631 222 133 -401 -555 -565
1372e65m13m72J76m5K05o1N57P8M73LR3J09Q5K56J23L94j54L85k22n7%n60n5j68
$$ -565 -978 -1450 -1274 -1319 -1114 -1175 -618 -540 -67 -64 29 138 223 479 602 996 842 1227 1005 948 948 388 333 165
1396A65l14l60k12n2N6j46K14j12j44K76j20K58J74P1K11M27J70R4J89K42l62
$$ 165 -149 -509 -721 -773 -717 -863 -649 -761 -905 -629 -749 -491 -317 -246 -35 392 562 656 845 1087 725
1417G25o0r1L4l24k74K40k59J36k95o4k77K1k87l7J72k87N85j89M64M61m1Q5Q1
$$ 725 665 574 608 284 10 250 -9 127 -168 -232 -509 -488 -775 -812 -640 -927 -342 -531 -67 394 353 438 519
1440E19j49j44J96l5j96M67l55p6J63l4m22k18p6k81J72j30o1K26J39N6j39L37
$$ 519 370 226 422 387 191 658 303 227 390 356 -66 -284 -360 -641 -469 -599 -660 -434 -295 -239 -378 -41
1462d1k63L85nj3L72N2p0n9K19M8k65j5O6k51k23l17j00m2R0l8k53K7K87J65l
$$ -41 -304 81 76 63 435 487 417 358 577 625 360 345 411 160 -63 -380 -480 -522 -432 -470 -723 -696 -409 -244 -247
1487b47k94J94O3M09L34P9J76o9K61M7l12n6l43M9N0n75N9J52m97j10m4k45k8
$$ -247 -541 -347 -284 125 459 538 714 645 906 953 641 585 242 291 341 -234 -175 -23 -520 -630 -674 -919 -947
1510i47J3K85j64J44O2N63R4K24K50M9JJ57R6J47l70P6n2J12j0l91m15K1m22O9
$$ -947 -934 -649 -813 -669 -607 -44 50 274 524 573 574 731 827 974 604 680 628 740 730 339 -76 -55 -477 -408
1534d08m73q6L00l64j22M85r0P8M28j18J68K58R9L38L12L59R1j48q0o1j52k99
$$ -408 -881 -967 -667 -1031 -1153 -668 -758 -680 -252 -370 -202 56 155 493 805 1164 1255 1107 1027 966 814 515
1556E15P8l98k07k07j29K5j63j69j86j91j26J15J77J98J38J00M19p1Q35k36J56
$$ 515 593 195 -12 -219 -348 -323 -486 -655 -841 -1032 -1158 -1043 -866 -668 -530 -430 -11 -82 753 517 673
1577F73J61j39L00j88j19K31j23k51r7k07k22l27l49n1k17j17J20r3J54K83J25
$$ 673 834 695 995 807 688 919 796 545 448 241 19 -308 -657 -708 -925 -1042 -922 -1015 -861 -578 -453
1598d53l04O21j63L51n4L54M2M68j33K09J00M3m27N8j94m43Nj59l7j03k59p2K9
$$ -453 -757 -136 -299 52 -2 352 394 862 729 938 1038 1081 654 712 518 75 80 -79 -116 -219 -478 -550 -521
1621e21j64k9J43jj54K3R4L92O7M14Q2L69j41l09K63k45N02k08l76j44K48k72
$$ -521 -685 -714 -571 -572 -726 -703 -609 -217 -150 264 346 715 574 265 528 283 785 577 201 57 305 33
1643C3j04l0k33P1j91rj16J51J07k1J02L76n2J4L4K10l93M46j08N4K00n4k77j
$$ 33 -71 -101 -334 -263 -454 -463 -579 -428 -321 -342 -240 136 84 98 132 342 -51 395 287 341 541 487 210 209
1667B09Q2k26n4j40Nm05R7K36l65J48Q2J67L6N8m9J7L09Q7O8k95O19j87m4r5J04
$$ 209 291 65 11 -129 -124 -529 -432 -196 -561 -413 -331 -164 -128 -70 -119 -102 207 294 362 67 686 499 455 360 464
1692D64o2l94j43L1r2k33L13k80k91L36j85J47J81k37L71j91M27r7L60jJ67k75
$$ 464 402 8 -135 -104 -196 -429 -116 -396 -687 -351 -536 -389 -208 -445 -74 -265 162 65 425 424 591 316
1714C16M3J91j30J04j89k71K07j65l29J24k42k8j68K8j84j15K70jK10J41L3p9
$$ 316 359 550 420 524 335 64 271 106 -223 -99 -341 -369 -537 -509 -693 -808 -538 -539 -329 -188 -155 -234
1736b34M60jJ15L24l06N6J75J52O3o3j94j47j86l02L5m18L08l22j62Q4o9J21q4
$$ -234 226 225 340 664 358 414 589 741 804 741 547 400 214 -88 -53 -471 -163 -485 -647 -563 -632 -511 -595
1759e95J2n6J66j6K58J55M19J07JJ62L04j18j28J00n24L90q2m16j49qQ6k50l12
$$ -595 -583 -639 -473 -489 -231 -76 343 450 451 613 917 799 671 771 247 637 555 139 -10 -18 68 -182 -494
1782d94j06m8j67J51k9J77j95M7K78M93Pj1N00k30J88j83M12j26k52K63j37J02
$$ -494 -600 -648 -815 -664 -693 -516 -711 -664 -386 107 114 103 603 373 561 378 790 664 412 675 538 640
1804F40k04l50j94j16k69P1j74O6k10R1j1OM9L39l6k4J67L99j94K55M57n02J37
$$ 640 436 86 -108 -224 -493 -422 -596 -530 -740 -649 -660 -654 -605 -266 -302 -326 -159 240 46 301 758 256 393
1827C93M90j15n09K88r1r8j08l46J15j97l4m03R4L0J57k55L29o8J6QL12J34k9
$$ 393 883 768 259 547 456 358 250 -96 19 -178 -212 -615 -521 -491 -334 -589 -260 -328 -312 -304 8 142 113
1850A13K45l2j74K89L8k04Rj34P2rj11k54O6q6M5J6r0j4m0j55K22l04K69J54O3
$$ 113 358 326 152 441 479 275 284 150 222 213 102 -152 -86 -172 -127 -111 -201 -215 -255 -410 -188 -492 -223 -69 -6
1875frK08p3J50l06K39L35l11m0K12k47j90J95k77n3Q2o4l9j68K24O3r3j12l5
$$ -6 -15 193 120 270 -36 203 538 227 187 399 152 -38 157 -120 -173 -91 -155 -194 -362 -138 -75 -168 -280 -315
1899c15K45q3j80L72j95K49K19J7P5k08K48l8l59P8J9k94O3j42R8m03J57J16j65
$$ -315 -70 -153 -333 39 -156 93 312 329 404 196 444 406 47 125 144 -150 -87 -229 -131 -534 -377 -261 -426
1922d26J12j69M04JJ24J41k39M05K75k41r7p9L1P8k57K58p8l60k61K08J9M2k65
$$ -426 -314 -483 -79 -78 46 187 -52 353 628 387 290 211 242 320 63 321 243 -117 -378 -170 -151 -109 -374
1945c74j61N7m1K36p2J35j70M96j35RK02J53J43k22J14J14l19N56l55M3q9k44
$$ -374 -535 -478 -519 -283 -355 -220 -390 106 -29 -20 182 335 478 256 370 484 165 721 366 409 320 76
1967G6L8k73k42J38j13j62j06N2K04n8l20L73o7J33K76O5Q4l2L52Q0P8Nk24J93
$$ 76 114 -159 -401 -263 -376 -538 -644 -592 -388 -446 -766 -393 -460 -327 -51 14 98 66 418 498 576 581 357 550
1991E50R6k17j0l06K4j16j33J28l87q5l9M8K5k17K22O9k64L28L8K83K25%l7K47
$$ 550 646 429 419 113 137 21 -112 16 -371 -456 -495 -447 -422 -639 -417 -348 -612 -284 -246 37 262 262 225 472
2015D72k8k63L89j0j11J58l03j89Q6k05J60m92J40l19K07j17J88j11n4J0j15M24
$$ 472 444 181 570 560 449 607 304 115 201 -4 156 -336 -196 -515 -308 -425 -237 -348 -402 -392 -507 -83
2037h3l88L34J60K68M3k63K60R5j55nj28L91l81j33J71j42K5k53R9p9j75q0K65
$$ -83 -471 -137 23 291 334 71 331 426 271 266 138 529 148 15 186 44 69 -184 -85 -164 -339 -419 -154
2060a54m9j09k27K2M04J34q2k26N7N35j46J15J50k18J84l60K00M0j35K11k64j04
$$ -154 -203 -312 -539 -517 -113 21 -61 -287 -230 305 159 274 424 206 390 30 230 270 135 346 82 -22
2082b2N5K1j40n2J39j34N6N8L8j38O4J29j04J58o2K82P9j30l54J19M3K2rk06K
$$ -22 33 54 -86 -138 1 -133 -77 -19 19 -119 -55 74 -30 128 66 348 427 297 -57 62 105 127 118 -88 -86
2107h6J05k57K28j65Pj60j1N33l67J26j31N00j65Q6k97K47J7qj89K58j99pk2q5
$$ -86 19 -238 -10 -175 -168 -328 -339 194 -173 -47 -178 322 157 243 -54 193 210 202 13 271 72 65 43 -42
2131d2J77k99J69l04J02j95L02q5j26j75M93r1j82L36q2k1L40k3J39k37J50L0
$$ -42 135 -164 5 -299 -197 -392 -90 -175 -301 -476 17 -74 -256 80 -2 -23 317 294 433 196 346 376
2153C76m8j17O0r6l6k40j06j58K52k55q3K48m0q8L9r1M59j23j68K74J62j17J19
$$ 376 328 211 271 175 139 -101 -207 -365 -113 -368 -451 -203 -243 -331 -292 -383 76 -47 -215 59 221 104 223
2176B23K1j21L53j58K27j55j65J23Ok57l1j44L2j73j03J74j73j16L06j58q4J01
$$ 223 244 123 476 318 545 390 225 348 354 97 66 -78 -46 -219 -322 -148 -321 -437 -131 -289 -373 -272
2198b72K35j00j9K91k20L10K3k5J04j19K34q9j68j14Pkj44j69J96k3o5k5j1r2
$$ -272 -37 -137 -156 135 -85 225 248 223 327 208 442 353 185 71 78 76 -68 -237 -41 -64 -129 -154 -165 -257
2222b57j24j69J15L79j39J05l51N71j66L26k63N46k75J88l32J76R8k27J59k02
$$ -257 -381 -550 -435 -56 -195 -90 -441 130 -36 290 27 573 298 486 154 330 428 201 360 158
2242A58j63k0J02k4j30j08r2J8k09R3L68l11K43P7l0J29j91N5K01j11J69p8j16
$$ 158 -5 -25 77 53 -77 -185 -277 -259 -468 -375 -7 -318 -75 2 -28 101 -90 -35 166 55 224 146 30
2265C0J73k2J18r7r2r8k37N8K30n1j45J1o9Q6k91M22k25N2J45n4L7n6J8J4J90
$$ 30 203 181 299 202 110 12 -225 -167 63 12 -133 -122 -191 -105 -396 26 -199 -147 -2 -56 -19 -75 -57 -43 147
2290A47o2j20L3J17qk11M7p8OR6r2J77l92N86j83j9K15m71L47m71L96Ll2l3L21
$$ 147 85 -35 -2 115 107 -104 -57 -135 -129 -33 -125 52 -340 246 63 44 259 -212 135 -336 60 63 31 -2 319
2315C19l62K21m9%J43m53K58j01j96K17J28j56j47J84mk43L03J18j20k28M92j93
$$ 319 -43 178 129 129 272 -181 77 -24 -220 -3 125 -31 -178 6 2 -241 62 180 60 -168 324 131
2337A31m8j86L08q3KK7RJ61k09k8l45J33J16j95Q4L0O4k30j2O1Q1p2J08K75k27
$$ 131 83 -103 205 122 124 151 160 321 112 84 -261 -128 -12 -207 -123 -93 -29 -259 -271 -210 -129 -201 -93 182 -45
2362d5O5Q3j4j18L6M08k38L04j44Q7l95J75k01J29J9j22j48j43J20j31o2K45p7
$$ -45 20 103 89 -29 7 415 177 481 337 424 29 204 3 132 151 29 -119 -262 -142 -273 -335 -90 -167
2385a67j86K70l9Q2p0m5J47n4J73q5R9J17K19j98Q8k10J52l08l20N96k94o3O4
$$ -167 -353 -83 -122 -40 -110 -155 -8 -62 111 26 125 242 461 263 351 141 293 -15 -335 261 -33 -96 -32
2408c2j55k7P9k23K4K20j73j7L34k72K19k02K72P7j23J4J10K19L4j04rk98P2J22
$$ -32 -187 -214 -135 -358 -334 -114 -287 -304 30 -242 -23 -225 47 124 1 15 125 344 378 274 265 -33 39 161
2432A61k57J37J29n8l73J66k0J24k48J32j24J42k49K26j74L68n0r9K58j14k27
$$ 161 -96 41 170 112 -261 -95 -115 9 -239 -107 -231 -89 -338 -112 -286 82 32 -67 191 77 -150
2453a50K59K2K49j60L21j42j24l47K31kn9j62j29N1k36K50j4k77J89J52j22J04
$$ -150 109 131 380 220 541 399 275 -72 159 157 98 -64 -193 -142 -378 -128 -142 -419 -230 -78 -200 -96
2475i6J04k7j13j5K65N1k83L33r8J09j19R5j69Q8R6n30M19P0n6l81K28j42p7L46
$$ -96 8 -19 -132 -147 118 169 -114 219 121 230 111 206 37 125 221 -309 110 180 124 -257 -29 -171 -248 98
2499I8j52j7j5j27K77k76L38k34l1K29m5K66k36l0J32L7q9k11J08j91j39K15j38
$$ 98 -54 -71 -86 -213 64 -212 126 -108 -139 90 45 311 75 45 177 214 125 -86 22 -169 -308 -93 -231
2522b31qJ58K24k07J33j8J63j31J2j70J39j6Mk41J78M00m90J81o4j85K30J22m66
$$ -231 -239 -81 143 -64 69 51 214 83 95 -75 64 48 52 -189 -11 389 -101 80 16 -169 61 183 -283
2545b83K12rj46K16O1j6j7j59J16j59J29L36k21J12o3J51j74P6j38l11N04Ml22
$$ -283 -71 -80 -226 -10 51 35 18 -141 -25 -184 -55 281 60 172 109 260 86 162 24 -287 217 221 -101
2568a01K6N9j31J6L4j27J52J18l87mJ89K59j99M9L74j12p8k86M52m3j85L1K94
$$ -101 -75 -16 -147 -131 -97 -224 -72 46 -341 -345 -156 103 -96 -47 327 215 137 -149 303 260 75 106 400
2591D00k19Nk07j6L1k3Q6j90J28j92j2J29k66J75j01%K2K22k33K84Q7j59K72J12
$$ 400 181 186 -21 -37 -6 -29 57 -133 -5 -197 -209 -80 -346 -171 -272 -272 -250 -28 -261 23 110 -49 223 335
2615C35l24J07K78j14r9n8p9j68J08j49J22m5J96j88k24K20k5j97J82J12J75j78
$$ 335 11 118 396 282 183 125 46 -122 -14 -163 -41 -86 110 -78 -302 -82 -107 -304 -122 -10 165 -13
2637a3N7n9j84L64m28L59J18o5N8j76q0J50K3J62l17K37l9n6p3o4k00M8J34J55
$$ -13 44 -15 -199 165 -263 96 214 149 207 31 -49 101 124 286 -31 206 167 111 38 -26 -226 -178 -44 111
2661A11k14k46L16J28r6M4Q0j47k3J67o6l4j12K92k40J80m2K95m68J4K49k43j5
$$ 111 -103 -349 -33 95 -1 43 123 -24 -47 120 54 20 -92 200 -40 140 98 393 -75 -61 188 -55 -70
2684g0J39p3k23J06Q9Q5jJ31j16r7k8o4J84l53L89j50K08k33K0J27k07K14M8p1
$$ -70 69 -4 -227 -121 -32 53 52 183 67 -30 -58 -122 62 -291 98 -52 156 -77 -57 70 -137 77 125 54
2708E4p6k18K0K31p2J87k28j84L30k19j30J80k5LK26n2J61k63J99N0k76K21j29
$$ 54 -22 -240 -220 11 -61 126 -102 -286 44 -175 -305 -125 -150 -147 79 27 188 -75 124 174 -102 119 -10
2731a0r3l7KK28j49l8N9j25L6q0K50rO6J16j34j40R5l0m7L29n86K78J90j37j95
$$ -10 -103 -140 -138 90 -59 -97 -38 -163 -127 -207 43 34 100 216 82 -58 37 7 -40 289 -297 -19 171 34 -161
2756a61j67L56k09J84R6K04k24j84L3K0m1M4N3k33J92J00j16Q8L72m05J36L38
$$ -161 -328 28 -181 3 99 303 79 -105 -72 -52 -93 -49 4 -229 -37 63 -53 35 407 2 138 476
2778D76m23K34k12Q8q9Q0j24l59L86m5J30M5j76j89K95k12n7M73m11K21k09P6
$$ 476 53 287 75 163 74 154 30 -329 57 12 142 187 11 -178 117 -95 -152 321 -90 131 -78 -2
2800bJ25m0J50j32J9j73L16Q1j02Kn5O7k62JN0l07K78J25j22k2j39q1j58M53P0
$$ -2 123 83 233 101 120 -53 263 344 242 244 189 256 -6 -5 45 -262 16 141 19 -3 -142 -223 -381 72 142
2825A42j54l48M87r2L2j00k7K63k06K83q3m8P8r9J39j14q9J43n52K85o2O2j2j47
$$ 142 -12 -360 127 35 67 -33 -60 203 -3 280 197 149 227 128 267 153 64 207 -345 -60 -122 -60 -72 -219
2849b19JJ2J08j11K9m9J11l5J10K4Q1qN5j37O6K32j26qj79M21m73P8q1J8j64R9
$$ -219 -218 -206 -98 -209 -180 -229 -118 -153 -43 -19 62 54 109 -28 38 270 144 136 -43 378 -95 -17 -98 -80 -244 -145
2875a45K56p6j87K7L3m2L0m4j2J50Qj15K54Lk14JO5k0r0Q5r8K31p3J08J2ml53
$$ -145 111 35 -152 -125 -92 -134 -104 -148 -160 -10 -2 -117 137 140 -74 -73 -8 -28 -118 -33 -131 100 27 135 147 143 -210
2902b10J03N8L0J5Q5k39J21j58K61k84M03J5r9j58p5Q9P0j45k24J13K32N3J90
$$ -210 -107 -49 -19 -4 81 -158 -37 -195 66 -218 185 200 101 -57 -132 -43 27 -118 -342 -229 3 56 246
2925B46k01j91K60m8l5Lj27J52j29K42k92N6L2N3k6J14j50k11J36L84mj80R2k23
$$ 246 45 -146 114 66 31 34 -93 59 -70 172 -120 -64 -32 21 -5 109 -41 -252 -116 268 264 84 176 -47
2949d7N0j12j40J99j15J08J6K94k70L11k24j77N2p0K10l40N41m1k42lk6oj97J10
$$ -47 3 -109 -249 -50 -165 -57 -41 253 -17 294 70 -107 -55 -125 85 -255 286 245 3 0 -26 -32 -229 -119
2973a19J3k04M21j99K37j41p5J47j28kj36l1K72M8J5k99K63j73k51M72l00L20
$$ -119 -106 -310 111 -88 149 8 -67 80 -48 -50 -186 -217 55 103 118 -181 82 -91 -342 130 -170 150
2995A50j34n5P4q5K63p0k78J52J96k98k12J39J70K4l58L35j91J0K4j51L83j9m5
$$ 150 16 -39 35 -50 213 143 -135 17 213 -85 -297 -158 12 36 -322 13 -178 -168 -144 -295 88 69 24
3018B4oJ4P5R4J44l55j42K11k2n5K34p2j39M63p07p9N55n26P6Q1j2j35J95J7K50
$$ 24 18 32 107 201 345 -10 -152 59 37 -18 216 144 5 468 -239 -318 237 -289 -213 -132 -144 -279 -84 -67 183
3043A83l32K88m86N01k96K0P4k7K36k42N02m47J72o0m6J49m26L91K8j00n4j18
$$ 183 -149 139 -347 154 -142 -122 -48 -75 161 -81 421 -26 146 86 40 189 -237 154 182 82 28 -90
3065i0J3P2k12K44k46J18J8R1K0JN0l22L25P4j0O2k20J23Mj05l1m8K19k23J76
$$ -90 -77 -5 -217 27 -219 -101 -83 8 28 29 79 -243 82 156 146 208 -12 111 115 10 -21 -69 150 -73 103
3090A03n67O59j52l4j29N5K46K0m21K00J08j96O5J03n2J01K5l32j19M83J01k22
$$ 103 -464 195 43 9 -120 -65 181 201 -220 -20 88 -108 -43 60 8 109 134 -198 -317 166 267 45
3112D5p1N0J56k34n9K3K68K25j58n30L05k30K98k32J83Q8k95K2l7PK9J87n2r3
$$ 45 -26 24 180 -54 -113 -90 178 403 245 -285 20 -210 88 -144 39 127 -168 -146 -183 -176 -147 40 -12 -105
3136a05R3Mp1%M26j96m09Q9J53Pj23Q3M11l34j78R5j60K12r4K89k11j42L5j77
$$ -105 -12 -8 -79 -79 347 151 -258 -169 -16 -9 -132 -49 362 28 -150 -55 -215 -3 -97 192 -19 -161 -126 -303
3160c03L20L7j43k22M41o1MM2j53M7k00n7L7K06R9k32O2K3J09K37r3l26R6N6N5
$$ -303 17 54 -89 -311 130 69 73 115 -38 9 -191 -248 -211 -5 94 -138 -76 -53 56 293 200 -126 -30 26 81
3185H1J21l60K52k17K58n5J13l13Q8N0K9q3J00l18L93j03j42j32j36L64L59m97
$$ 81 202 -158 94 -123 135 80 193 -120 -32 18 47 -36 64 -254 139 36 -106 -238 -374 -10 349 -148
3207a48L9N3J04Mj47M03k78l30M70k0l12k0J39n8K00n4j10O2J2j91J50j54J29
$$ -148 -109 -56 48 52 -95 308 30 -300 170 150 -162 -182 -43 -101 99 45 -65 -3 9 -182 -32 -186 -57
3230e7J0j3Oj01J57R5j06P8k55K27K21k92mJ91l76K97n4l06L96j26k8j13K92M7
$$ -57 -47 -60 -54 -155 2 97 -9 69 -186 41 262 -30 -34 157 -219 78 24 -282 114 -12 -40 -153 139 186
3254A86k95K23m25M20m1j51M6L4j53P7K48j43o4L4M81m82P9mJ5k4n4j23M0L81
$$ 186 -109 114 -311 109 68 -83 -37 -3 -156 -79 169 26 -38 -4 477 -5 74 70 85 61 7 -116 -76 305
3278C05k08n06N15l84L46k4j87K36k20J42L4q1J3j43J59J21j19n7L95j8j42o5
$$ 305 97 -409 106 -278 68 44 -143 93 -127 15 49 -32 -19 -162 -3 118 -1 -58 337 319 177 112
3300A12JO8l58K21M3j2o4K05j83j52J72o1q0J10j31J45M9j21K05k03l1J29rJ76
$$ 112 113 181 -177 44 87 75 11 216 33 -119 53 -8 -88 22 -109 36 85 -36 169 -34 -65 64 55 231
3324B31l52o9P6PJ10j62j4m5J61p1M3J95l1J90l44J93j79J1K0lL09l19k19J52
$$ 231 -121 -190 -114 -107 3 -159 -173 -218 -57 -128 -85 110 79 269 -75 118 -61 -50 -30 -33 276 -43 -262 -110
3348a10J79q5M6N1J05k84J05k43M24l44k2J13m8K23j67J48l35K68l8P8M6j98L00
$$ -110 69 -16 30 81 186 -98 7 -236 188 -156 -178 -65 -113 110 -57 91 -244 24 -14 64 110 -88 212
3371B12l07P2r3J46p9N0RL4K86m90P8O8j17M0L13k17j13O0Q4K7j86J19m1r8R1
$$ 212 -95 -23 -116 30 -49 1 10 44 330 -160 -82 -14 -131 -91 222 5 -108 -48 36 63 -123 -4 -45 -143 -52
3396e2J37L1j14J45j14P7kPj24j96k9M62k1j24r7J4k29K05K0J49J47j49J9k48
$$ -52 85 116 2 147 33 110 108 115 -9 -205 -234 228 207 83 -14 0 -229 -24 -4 145 292 143 162 -86
3420h6K54l39J71J65j34k75J32K35J3Q3k96L83k74P6p8p2P4qj75L78k08k54J87
$$ -86 168 -171 0 165 31 -244 -112 123 136 219 -77 306 32 108 30 -42 32 24 -151 227 19 -235 -48
3443d8J67k01L31k54l55K63K9q0j9M2L6j11L16P7k18J22k20Q4j57K97l09N04k85
$$ -48 119 -82 249 -5 -360 -97 -68 -148 -167 -125 -89 -200 116 193 -25 97 -123 -39 -196 101 -208 296 11
3466A1N1k32n3J42M5n4P1J3J98q0j23j56Q1JJ98Q3n6r5J13j38P7j99N1k9j5K96
$$ 11 62 -170 -223 -81 -36 -90 -19 -6 192 112 -11 -167 -86 -85 113 196 140 45 158 20 97 -102 -51 -80 -95 201
3492B01l59K52qo8J05j82Q9j32M1K3Q3L8L3j66J90k49j21L34j28K6l0q2J37ko7
$$ 201 -158 94 86 18 123 -59 30 -102 -61 -38 45 83 116 -50 140 -109 -230 104 -24 2 -28 -110 27 25 -42
3517d2N4O4l28M04j78p2K67K60l19l27j7L28q7j3K35K0j99k3l2j27m6K42k97J86
$$ -42 12 76 -252 152 -26 -98 169 429 110 -217 -234 94 7 -6 229 249 50 27 -5 -132 -178 64 -233 -47
3541d7K05l5k04J55m0p3j18L06l03L70m26J31P3r7K34j7k58K17l47L15J22k8k36
$$ -47 158 123 -81 74 34 -39 -157 149 -154 216 -210 -79 -6 -103 131 114 -144 73 -274 41 163 135 -101
3564a01n1J80J47j47j92L05l03L61l17m9K97k32N9l9J05R6j84q4J03P4J2m1J61
$$ -101 -152 28 175 28 -164 141 -162 199 -118 -167 130 -102 -43 -82 23 119 -65 -149 -46 28 40 -1 160
3587A60M9m3l01K85J08r4k86L97l19K19k21M1Lj90J17roK46o5j41L1k3j30J20
$$ 160 209 166 -135 150 258 164 -122 275 -44 175 -46 -5 -2 -192 -75 -84 -90 156 91 -50 -19 -42 -172 -52
3611e2q6P3K2Q9K12k73M7J5J41j6m11K3N17l67J84J08m58J90R8J81j27k64K11
$$ -52 -138 -65 -43 46 258 -15 32 47 188 172 -239 -216 301 -66 118 226 -232 -42 56 237 110 -154 57
3634E7l47L78j86K68l02K7J54j51M2j7J50k14K6K50l9M6k00J00J09r0o1J1r4Q9
$$ 57 -290 88 -98 170 -132 -105 49 -102 -60 -77 73 -141 -115 135 96 142 -58 42 151 61 0 11 -83 6
3658FL0K78l82J54L7k50J98J54k48j25J56kJ10k11J44m3l1k01M1J11%j0K19m6
$$ 6 36 314 -68 86 123 -127 71 225 -23 -148 8 6 116 -95 49 6 -25 -226 -185 -74 -74 -84 135 89
3682H9j20J37k00J09j10M4J13k38J59k71K43j3o7Q0L2j54j7P0J03J02L6O8l68
$$ 89 -31 106 -94 15 -95 -51 62 -176 -17 -288 -45 -58 -125 -45 -13 -167 -184 -114 -11 91 127 195 -173
3705a73J09Q5J13k24J09k32L67l45P7J89J2J31l93P4j04K01r1K76k15J20J90l81
$$ -173 -64 21 134 -90 19 -213 154 -191 -114 75 87 218 -175 -101 -205 -4 -95 181 -34 86 276 -105
3727a05J51j78K07Q0q5k50K43J85l12n5N5J39m4P2L6l28Q3kN8Q9o9J0p8J89J40
$$ -105 46 -132 75 155 70 -180 63 248 -64 -119 -64 75 31 103 139 -189 -106 -108 -50 39 -30 -20 -98 91 231
3752B31k06j16N9J86q3p7n6n8K36j56K43J54n74L40k35K68o5M2l23L00N6j93k2
$$ 231 25 -91 -32 154 71 -6 -62 -120 116 -40 203 357 -217 123 -112 156 91 133 -190 110 166 -27 -49
3775d9j2k6K13k87K65j30j46L22O3n1k19l2k7N6N7K08l53L17l6j43nL5pN2n5q4
$$ -49 -61 -87 126 -161 104 -26 -172 150 213 162 -57 -89 -116 -60 -3 205 -148 169 133 -10 -15 20 13 65 10 -74
3801g4M3P7k28K69k4k19m5O3L51k6k33j2j29L02K3j75%K92j65p6J75k13J38r4
$$ -74 -31 46 -182 87 63 -156 -201 -138 213 187 -46 -58 -187 115 138 -37 -37 255 90 14 189 -24 114 20
3825B0o2n3p2J68J10J7o2m1j68k0Q7J39j23K74k56j5K34k53q4K68O0k22Q8m9K7
$$ 20 -42 -95 -167 1 111 128 66 25 -143 -163 -76 63 -60 214 -42 -57 177 -76 -160 108 168 -54 34 -15 12
3850A2MJ78J01k40J0k34Q8m3K02Qj50J14r1k54N3l3K37j27K12k9J5n1k00L87m32
$$ 12 16 194 295 55 65 -169 -81 -124 78 86 -64 50 -41 -295 -242 -275 -38 -165 47 18 33 -18 -218 169 -263
3875b63M18k55J00O4j51r2L44k2r2j18R9n5R3kq2n9M0R1k56M59l80K70J64k23
$$ -263 155 -100 0 64 -87 -179 165 143 51 -67 32 -23 70 68 -14 -73 -33 58 -198 261 -119 151 315 92
3899I2K4P6k45l5K5K08k13L7j26J43k0J41M4r5l9J67J64j70r5j37J5K02m7K67
$$ 92 116 192 -53 -88 -63 145 -68 -31 -157 -14 -34 107 151 56 17 184 348 178 83 -54 -39 163 116 383
3923C83k63r2k7j22J21P4o9j48N3J91k23L50m0n03P5L93M2j76N9J60m99K18K14
$$ 383 120 28 1 -121 0 74 5 -143 -90 101 -122 228 188 -315 -240 153 195 19 78 238 -261 -43 171
$$ [...]
8191a98
##END NTUPLES=NMR FID
##END=
