##TITLE=1H_SR85
 d2O,8 sc, 
 3.9.2021
##JCAMPDX= 6.0         $$ Bruker NMR JCAMP-DX V2.0
##DATA TYPE= NMR FID
##DATA CLASS= NTUPLES
##ORIGIN= UXNMR, Bruker Analytische Messtechnik GmbH
##OWNER= root
$$ XWIN-NMR		Version 3.5
$$ Fri Sep  3 12:01:51 2021 Russian Standard Time (UT+4h)  she@DPX200
##.OBSERVE FREQUENCY= 200.1314
##.OBSERVE NUCLEUS= ^1H
##.DELAY= (6, 6)
##.ACQUISITION MODE= SIMULTANEOUS
##.ACQUISITION SCHEME= undefined
##.AVERAGES= 8
##.DIGITISER RES= 18
##SPECTROMETER/DATA SYSTEM= spect
##.PULSE SEQUENCE= zg30
##.SOLVENT NAME= D2O
##.SHIFT REFERENCE= (INTERNAL, D2O, 0, 15.7039)
##AUDIT TRAIL= $$ (NUMBER, WHEN, WHO, WHERE, WHAT)
$$ ##TITLE= Audit trail, XWIN-NMR		Version 3.5
$$ ##JCAMPDX= 5.01
$$ ##ORIGIN= Bruker BioSpin GmbH
$$ ##OWNER= she
$$ F:/spectra/data/she/nmr/H-F/1/audita.txt
$$ ##AUDIT TRAIL=  $$ (NUMBER, WHEN, WHO, WHERE, WHAT)
(   1,<2021-09-03 12:00:19.39 +0400>,<she>,<DPX200>,
      <created by zg, POWCHK disabled, PULCHK disabled
       configuration hash MD5:
       00 E9 B6 7A A2 85 ED C7 34 08 36 98 17 FE 4E 26
       data hash MD5: 16K
       BB 91 3F C5 AD 90 9A 63 DC 21 0F 74 35 52 C1 82>)
$$ ##END=
$$ 
$$ hash MD5
$$ FF 28 A0 01 E5 56 B1 13 12 08 AC E9 B4 E9 85 25
##$RELAX= 
##$RELAX= 
##$RELAX= 
##$RELAX= 
##$RELAX= 
##$RELAX= 
$$ Bruker specific parameters
$$ --------------------------
##$DU= <F:/spectra>
##$EXPNO= 1
##$NAME= <H-F>
##$PROCNO= 1
##$TYPE= <nmr>
##$USER= <she>
##$AMP= (0..31)
100 100 100 100 100 100 100 100 100 100 100 100 100 100 100 100 100 100 
100 100 100 100 100 100 100 100 100 100 100 100 100 100 
##$AQSEQ= 0
##$AQ_mod= 1
##$AUNM= <au_zg>
##$AUTOPOS= <>
##$BF1= 200.13
##$BF2= 200.13
##$BF3= 200.13
##$BF4= 200.13
##$BF5= 200.13
##$BF6= 200.13
##$BF7= 200.13
##$BF8= 200.13
##$BYTORDA= 1
##$CFDGTYP= 0
##$CFRGTYP= 5
##$CHEMSTR= <none>
##$CNST= (0..31)
1 1 145 1 1 1 1 1 1 1 1 1 1 1 1 1 1 1 1 1 1 1 1 1 1 1 1 1 1 1 1 1 
##$CPDPRG= <>
##$CPDPRG1= <>
##$CPDPRG2= <>
##$CPDPRG3= <>
##$CPDPRG4= <mlev>
##$CPDPRG5= <mlev>
##$CPDPRG6= <mlev>
##$CPDPRG7= <mlev>
##$CPDPRG8= <mlev>
##$CPDPRGB= <>
##$CPDPRGT= <>
##$D= (0..31)
0 1.2 0 0 0 0 0 0 0 0.06 0 0.03 0 0 0 0 0.0002 0 0 0 0 0 0 0 0 0 0 0 0 
0 0 0 
##$DATE= 1630656019
##$DBL= (0..7)
120 120 120 120 120 120 120 120 
##$DBP= (0..7)
150 150 150 150 150 150 150 150 
##$DBP07= 0
##$DBPNAM0= <>
##$DBPNAM1= <>
##$DBPNAM2= <>
##$DBPNAM3= <>
##$DBPNAM4= <>
##$DBPNAM5= <>
##$DBPNAM6= <>
##$DBPNAM7= <>
##$DBPOAL= (0..7)
0.5 0.5 0.5 0.5 0.5 0.5 0.5 0.5 
##$DBPOFFS= (0..7)
0 0 0 0 0 0 0 0 
##$DE= 6
##$DECBNUC= <off>
##$DECIM= 32
##$DECNUC= <off>
##$DECSTAT= 4
##$DIGMOD= 1
##$DIGTYP= 9
##$DL= (0..7)
0 120 120 120 120 120 120 120 
##$DP= (0..7)
150 150 150 150 150 150 150 150 
##$DP07= 0
##$DPNAME0= <>
##$DPNAME1= <>
##$DPNAME2= <>
##$DPNAME3= <>
##$DPNAME4= <>
##$DPNAME5= <>
##$DPNAME6= <>
##$DPNAME7= <>
##$DPOAL= (0..7)
0.5 0.5 0.5 0.5 0.5 0.5 0.5 0.5 
##$DPOFFS= (0..7)
0 0 0 0 0 0 0 0 
##$DQDMODE= 0
##$DR= 18
##$DS= 0
##$DSLIST= <SSSSSSSSSSSSSSS>
##$DSPFIRM= 0
$$ [...]
##$SUBNAM2= <"">
##$SUBNAM3= <"">
##$SUBNAM4= <"">
##$SUBNAM5= <"">
##$SUBNAM6= <"">
##$SUBNAM7= <"">
##$SUBNAM8= <"">
##$SUBNAM9= <"">
##$SW= 20.0188988654967
##$SWIBOX= (0..15)
0 0 2 0 0 0 0 0 0 0 0 0 0 0 0 0 
##$SW_h= 4006.41025641026
##$TD= 16384
##$TD0= 1
##$TE= 0
##$TE2= 300
##$TE3= 300
##$TEG= 300
##$TL= (0..7)
0 120 120 120 120 120 120 120 
##$TP= (0..7)
150 150 150 150 150 150 150 150 
##$TP07= 0
##$TPNAME0= <>
##$TPNAME1= <>
##$TPNAME2= <>
##$TPNAME3= <>
##$TPNAME4= <>
##$TPNAME5= <>
##$TPNAME6= <>
##$TPNAME7= <>
##$TPOAL= (0..7)
0.5 0.5 0.5 0.5 0.5 0.5 0.5 0.5 
##$TPOFFS= (0..7)
0 0 0 0 0 0 0 0 
##$TUNHIN= 0
##$TUNHOUT= 0
##$TUNXOUT= 0
##$USERA1= <user>
##$USERA2= <user>
##$USERA3= <user>
##$USERA4= <user>
##$USERA5= <user>
##$V9= 5
##$VALIST= <valist>
##$VCLIST= <CCCCCCCCCCCCCCC>
##$VD= 0
##$VDLIST= <DDDDDDDDDDDDDDD>
##$VPLIST= <PPPPPPPPPPPPPPP>
##$VTLIST= <TTTTTTTTTTTTTTT>
##$WBST= 1024
##$WBSW= 4
##$XGAIN= (0..3)
0 0 0 0 
##$XL= 0
##$YL= 0
##$YMAX_a= 252138
##$YMIN_a= -330307
##$ZGOPTNS= <>
##$ZL1= 120
##$ZL2= 120
##$ZL3= 120
##$ZL4= 120
##$ABSF1= 10
##$ABSF2= 0
##$ABSG= 5
##$ABSL= 3
##$ALPHA= 0
##$AQORDER= 0
##$ASSFAC= 0
##$ASSFACI= 0
##$ASSFACX= 0
##$ASSWID= 0
##$AUNMP= <proc_1d>
##$AZFE= 0.1
##$AZFW= 0.1
##$BCFW= 1
##$BC_mod= 2
##$BYTORDP= 1
##$COROFFS= 0
##$CY= 11.3945322036743
##$DATMOD= 1
##$DC= 2
##$DFILT= <>
##$DTYPP= 0
##$F1P= 2.36226072786647
##$F2P= -0.459571619588291
##$FCOR= 0.5
##$FTSIZE= 0
##$FT_mod= 4
##$GAMMA= 1
##$GB= 0.15
##$INTBC= 1
##$INTSCL= 1
##$ISEN= 128
##$LB= 0.24
##$LEV0= 0
##$LPBIN= 0
##$MAXI= 10000
##$MC2= 0
##$MEAN= 0
##$ME_mod= 0
##$MI= 1.114404
##$NCOEF= 0
##$NC_proc= 0
##$NLEV= 6
##$NOISF1= 3.799351
##$NOISF2= 2.8
##$NSP= 1
##$NTH_PI= 0
##$NZP= 0
##$OFFSET= 15.70392
##$PC= 1
##$PHC0= -13717.05
##$PHC1= 6.800974
##$PH_mod= 1
##$PKNL= yes
##$PPARMOD= 0
##$PSCAL= 0
##$PSIGN= 0
##$REVERSE= no
##$SF= 200.130013532006
##$SI= 16384
##$SIGF1= 3
##$SIGF2= 2
##$SINO= 400
##$SIOLD= 16384
##$SREGLST= <1H.CDCl3>
##$SSB= 0
##$STSI= 0
##$STSR= 0
##$SW_p= 3612.71676300578
##$SYMM= 0
##$S_DEV= 0
##$TDeff= 0
##$TDoff= 0
##$TI= <>
##$TILT= no
##$TM1= 0
##$TM2= 0
##$TOPLEV= 0
##$USERP1= <user>
##$USERP2= <user>
##$USERP3= <user>
##$USERP4= <user>
##$USERP5= <user>
##$WDW= 1
##$XDIM= 8192
##$YMAX_p= 0
##$YMIN_p= 0
$$ End of Bruker specific parameters
$$ ---------------------------------
##NTUPLES= NMR FID
##VAR_NAME=  TIME,          FID/REAL,        FID/IMAG
##SYMBOL=    X,             R,               I
##VAR_TYPE=  INDEPENDENT,   DEPENDENT,       DEPENDENT
##VAR_FORM=  AFFN,          ASDF,            ASDF
##VAR_DIM=   8192,          8192,            8192
##UNITS=     SECONDS,       ARBITRARY UNITS, ARBITRARY UNITS
##FACTOR=    0.0002496,     1,               1
##FIRST=     0,             0,               0
##LAST=      2.0444736,     0,               0
##MIN=       0,             -330307,         0
##MAX=       2.0444736,     252138,          0
$$ Real data points
##PAGE= N=1
##DATA TABLE= (X++(R..R)), XYDATA
0@%%%%%%%%%%%Qj6J6j6J6k4L2m0M8n6P2q6R6j14J36j52J76k08K40k72L07l50L98
34B11m51N12n76O43p18Q05r01R99j107J229j361J504j661J833k019K224k450K700
52A416k976L283l626M009m444M940n513O184o981P947r148J0687j2737J5627k0046
67a1378K7707m4729J54537q0557k53564J14798K4078q1336M3539K63046R5997
78B52138j40269j54019k0647m4579n9211N3719J74398J03719n565m6308p4983
89C8393j45120r6029M8199J14324P0306P9921Q0545m5873j71302j04771R116J5849
101a06442K9158J31301J30609k8166j28458p2091l3781o6546j6933J29510J66897
112A35058L6425p2577n3915l9283j00913r2810N1538J55819R8717J595k3255m0932
$$ plain form
0 0 0 0 0 0 0 0 0 0 0 0 0 8 -8 8 -8 8 -16 16 -24 24 -32 40 -46 50 -64 72 -80 96 -112 128 -144 163 -187 211
34 211 -240 272 -304 339 -379 426 -475 524 -583 646 -715 789 -872 961 -1058 1166 -1284 1416
52 1416 -1560 1723 -1903 2106 -2338 2602 -2911 3273 -3708 4239 -4909 5778 -6959 8668 -11378
67 -11378 16329 -28400 126137 45580 -207984 -93186 -69108 -150444 -106905 156141 252138
78 252138 111869 -42150 -62797 -107376 -166587 -112868 61530 165249 159684 113376 38393
89 38393 -106727 -202756 -154557 -40233 30073 109994 190539 144666 -26636 -131407 -122291 -106442
101 -106442 -77284 54017 184626 156460 28002 -44089 -77870 -144416 -161349 -31839 135058
112 135058 171483 98906 44991 5708 -95205 -188015 -136477 19342 118059 119654 96399 55467
124E5467q9920r2304j9944O2499J09271R7823K2198n8871p5117o2317o6589l5470
136a53274O6398J36002Q3953j2923m8801m5974p1975q6141j0843R9479J13956
147F9857L7837j0110j7743o2570j11017n9082N3015R4522O2849M1868K4580m1537
159H2469j05573q9177j2835M6779O4942O7297N5234P344o0900r4786o5810o813
171a11829M1976O9775P2202M0119j2065o0926q5991o7561j557O2206P4425N2393
183G3167L2480n606p1004r8096m7267K4673N4350N5850N7856L7236k6598q5119
195A922q0250k4059K1580M2681O3483O8071K0993n1353p9864n6801k1884J2603
207h2878N4147P6544N2717k536n0408p0475n7580j8617K6453N9004O8721M4873
$$ plain form
124 55467 -34453 -126757 -146701 -84202 25069 122892 145090 86219 11102 -51215 -117804 -153274
136 -153274 -86876 49126 133079 120156 71355 25381 -46594 -132735 -143578 -44099 69857
147 69857 107694 97584 79841 17271 -93746 -152828 -99813 -5291 57558 99426 124006 82469
159 82469 -23104 -112281 -125116 -78337 -13395 53902 109136 116480 55580 -39206 -105016 -111829
171 -111829 -69853 -78 72124 112243 100178 39252 -46739 -114300 -115857 -53651 20774 73167
183 73167 105647 100041 29037 -69059 -116326 -91653 -37303 18547 76403 113639 87041 1922
195 1922 -78328 -102387 -80807 -38126 25357 93428 114421 63068 -16796 -73597 -95481 -82878
207 -82878 -28731 47813 100530 97994 47586 -22889 -80469 -99086 -72633 -13629 55092 99965
219I9965p398n6028o9241m7936j0768K8384N9409O7300L6032j9508o0573o2604
231d2966l9260p229L3745O8744O5238J9418k9429n5251n9452m1856o27M5426O6778
244B3279N2210J4413k9501n7525n6530l1431Q312M7669O5151M5985K858l7724
256D7166n7210n3299k7078J5784N5816O5503L7735l986l7039n5695n3642k2184
268h8129K6142N6652N3410K9139n184m0988o0599m4348o446L1638N4475N4012
280E9774K6319j7162m9593n6228l9544n700L4841N9036N0664J6542j9822m4736
292A4391n3302l7127M214M3605N4143L7544J0501k2236n2469n6101k4689J7114
304f4412M3379N1094M1170R276l3095n6502m6709j7738J3702M1222N3326L5950
$$ plain form
219 99965 92567 36539 -32702 -80638 -91406 -63022 -3613 63687 99719 80211 19638 -42966
231 -42966 -82226 -89455 -55710 13034 78272 97690 68261 13010 -46442 -88298 -88925 -43499 23279
244 23279 75489 89902 60401 2876 -53654 -85085 -76773 -29104 36047 82032 84890 47166
256 47166 -10044 -63343 -90421 -74637 -18821 46682 84417 80431 43392 -12303 -65945 -88129
268 -88129 -61987 -5335 48075 77214 72030 31042 -29557 -73905 -80351 -48713 5762 59774
280 59774 86093 68931 19338 -36890 -76434 -82134 -47293 11743 62407 78949 59127 14391
292 14391 -38911 -76038 -71824 -28219 25924 63468 73969 51733 -736 -56837 -81526 -64412
304 -64412 -21033 30061 71231 80507 47412 -9090 -55799 -73537 -59835 -18613 34713 70663
316G0663l297l7052m8424l9255j4815K1803M9995M9663K4615j0520l8467n1966
328b7057m0684p744K9026M9276M6238K3213j1449m1599m9344l2387k113K9594
340c5030M7333M2232J3476k1001m2733m5120k8212N224L7708N0799L7017Q049
352F9742k2085m4915m8098k4990J1558L8211M3983L3351P192k5772m7011m0622
364d9456j2991J6337L6946M3795L0184k863l5822m6616l4910j1157J7956M3124
376e473M6968K4547q904l3739m2022l4585q649K3486M3527L8041J5639j1748l4892
389A2196m2768k9370J859L0287M2533L5592J4292j6812m0858m3723k3788M619
401e5941K9223M1684L5022R938k1835l9282l6077j8168Q060L1655M2236K9202
$$ plain form
316 70663 67366 30314 -18110 -57365 -72180 -50377 -382 49281 73896 63376 24909 -27057
328 -27057 -67741 -75485 -46459 2817 49055 72268 60819 19220 -30124 -62511 -64624 -35030
340 -35030 12303 54535 68011 47010 4277 -40843 -69055 -63831 -26123 24676 61693 69742
352 69742 47657 2742 -45356 -70346 -58788 -20577 23406 56757 63949 38177 -8834 -49456
364 -49456 -62447 -46110 -9164 34631 64815 61952 26130 -20486 -55396 -66553 -48597 -5473
376 -5473 41495 66042 57138 23399 -18623 -53208 -61857 -38371 5156 43197 58836 47088 12196
389 12196 -30572 -59942 -58083 -27796 14737 50329 64621 47809 6951 -36772 -60560 -55941
401 -55941 -26718 14966 49988 59926 38091 -1191 -37268 -55436 -47376 -15721 26515 55717
413E5717m35k7116l9197l4348j5383J3823L7549M2199K5176m126k7166l8548l3592
426d5447j1730J7149L7787L7113J8765q342k9317l6937k8315m990K2967L9961
438H664L4806J2968j3522l1392l7882k7374j425K7300L9723L0949R116j3102l1236
451G593l7199k2925N474L0409L5808K5103N288j6725l5620l6338j6263J2528L1912
464a0955L5414K4235K458k1632l6770l2976j2725J3848L2960L2727J9258j514
476D4328k2199l5285l1226o572K1612L2912K8181J6017l132k7127m0463k7611
488e0565K967K3277K8143K7963J8472o943l4255l7717j6453N189J8970K8680L0595
501C8323J2031j7418l4313l0127j3701N319K3171L2961K7031N521j9007l4245
$$ plain form
413 55717 55282 28166 -11031 -45379 -60762 -46939 -9390 32809 57985 53859 26693 -11855 -45447
426 -45447 -57177 -40028 -2241 34872 53637 45295 15978 -20959 -49274 -54264 -31297 8664
438 8664 43470 56438 42916 11524 -26358 -53732 -55157 -27857 11866 42815 51931 38829 7593
451 7593 -29606 -52531 -47057 -16648 19160 44263 49551 32826 -2794 -39132 -55395 -42867 -10955
464 -10955 24459 48694 51152 29520 -7250 -40226 -52951 -39103 -6143 26584 45842 44328
476 44328 22129 -13156 -44382 -50954 -29342 3570 31751 47768 44636 17509 -22954 -50565
488 -50565 -47598 -24321 3822 31785 50257 43314 9059 -28658 -45111 -39922 -20952 7728 38323
501 38323 50354 32936 -1377 -31504 -45205 -39886 -16715 16246 43277 48798 29791 -4454
513d454l0370j1771J0288K5057K9802K4124L711k3336l6198k4268l173J0532K1994
526h062L2479K4668o000l0924l0832j6534n995Q356K9844L6707J5279j4555k6101
539H330k4729k0179p590J7640L4306K8167P223j2541k5618k8278j7632K191K0102
552a8608K9744K6841P263j8666k9522k2497j1916r67J9018L6753K6767m324k3069
565A6817k0575j8817j9200P29L3609L7023J0317r826j2563j9363l0143j6347J8321
578c0018L4358K2428P107r72j4000l0272k6979k952K0026K4913K1868J2956m983
591C3480k3535k8358j7643k139J6795L0022K4402M130j1848j9041k5154k1728
603d0617K223K6378K7999J3585L171o153k1904l1523j5870J3185K4602J8969J3801
$$ plain form
513 -4454 -34824 -46595 -36307 -11250 18552 42676 46387 23051 -13147 -37415 -40588 -30056 -8062
526 -8062 24417 49085 43085 12161 -18671 -35205 -41200 -32844 -3000 33707 48986 34431 8330
539 8330 -16399 -36578 -44168 -26528 7778 35945 43168 30627 5009 -23269 -40901 -38710 -18608
552 -18608 11136 37977 45240 26574 -2948 -25445 -37361 -38328 -19310 17443 44210 39886 16817
565 16817 -3758 -22575 -41775 -41046 -7437 29586 39903 30077 17514 -1849 -31992 -48339 -30018
578 -30018 4340 26768 33875 32903 18903 -11369 -38348 -41300 -21274 3639 25507 38463 33480
591 33480 9945 -18413 -36056 -38195 -21400 8622 33024 37154 25306 6265 -18889 -40617
603 -40617 -38394 -12016 15983 29568 32739 26586 4682 -26841 -42711 -29526 -4924 14045 27846
616B7846R040j0109l2207k8051l329J3253J7468K1476J9592K349k0465k9284j9349
629c1770l430J2806K1474K2035J3533k720j9152k7414j8722n60J5793K1133J9104
642B2110J1652k183k2199l0047j4586O982J4444J7119K2065J3804j1846k9170
654a855k1486o992K319J2479K5008K3037L777j7637k3289j6451r029J742J7366
667a1011K6550J7069k015j5079k0182j9492r338Q887K0439K2147J4566j317j8855
680A2369k3904j5117l447P839J9661K4536J2538q165k0162j8935j2477m312R208
693b0368K3372K3521N945j2096j6778j6073j5873l686J6771K5801J5869K678q566
706B0517j7302k1577j3190L948J7705K1749J4871J603j1245j8889j9120r055O096
$$ plain form
616 27846 36886 26777 -5430 -33481 -36810 -23557 -6089 15387 34979 37328 16863 -12421 -31770
629 -31770 -35200 -22394 -920 21115 34648 31928 12776 -14638 -33360 -33920 -18127 3006 22110
642 22110 33762 31579 9380 -20667 -35253 -28271 -13827 3292 25357 39161 27315 -1855
654 -1855 -23341 -30333 -28014 -15535 9473 32510 36287 18650 -4639 -21090 -30119 -28377 -11011
667 -11011 15539 32608 30593 15514 -4668 -24160 -33498 -24611 -4172 17975 32541 31224 12369
680 12369 -11535 -26652 -30099 -22260 -2599 21937 34475 26310 6148 -12787 -25264 -29576 -20368
693 -20368 3004 26525 32470 20374 3596 -12477 -28350 -32036 -15265 10536 26405 29083 20517
706 20517 3215 -18362 -31552 -27604 -9899 11850 26721 28324 17079 -1810 -20930 -29985 -23889
719b3889J8102K0652J3262q63j3714j8934j6777q345P419K1240K0307Q945k997
732B4408j1867j9940j8647l946J2861J9667J6344Q009l406j5364k1230j4343P61
745b6693J3670J7845J5747P615n823j8390k0248j0487J840J3575J8281J5760M599
758B7291q667j8084j8603r497M821J5948J7352J3336K508j0201j9883j7531n980
771b7190P002J5693J7305J2186K41j2512j9018j5392m007Q114J5735J7129J0479
784B5765k921j4295j8122j3386k703J0397J7332J6059P566m780j5235j7840j1572
797b3735M4J1066J6903J5760N145p212j5970j5952r621R64J2969J7795J3861K330
811B4347r332j6055j5153q221L262J4672J7728J1230J98r537j6336j4952o293
$$ plain form
719 -23889 -5787 14865 28127 27264 13550 -5384 -22161 -30506 -23087 -1847 18460 27405 24408
732 24408 12541 -7399 -26046 -29992 -17131 2536 18880 26889 23483 8119 -13111 -27454 -26693
745 -26693 -13023 4822 20569 28184 22361 3971 -16277 -26764 -24924 -11349 6932 22692 27291
758 27291 18624 540 -18063 -27560 -22739 -6791 10561 23897 26405 16204 -3679 -21210 -27190
771 -27190 -20188 -4495 12810 24996 25237 12725 -6293 -21685 -25692 -17578 -1843 15286 25765
784 25765 22844 8549 -9573 -22959 -25662 -15265 2067 18126 25692 20912 5677 -12163 -23735
797 -23735 -23691 -12625 4278 20038 25183 17971 2001 -13951 -23572 -22608 -9639 8156 22017 24347
811 24347 15015 -1040 -16193 -24414 -21152 -6480 11248 22478 22676 13139 -3197 -18149 -24442
824b4442O021J5264J5921R841j108j1662j6414j3389l556P969J5406J5214Q030
837B3095l009j2921j6517j1808j560R657J5198J4581O508n197j3730j6090r879
850b1672P43J0744J5348J3201M311o780j5047j4720p981K240J1810J5755J2160
863B0112J684q493j4602j4130o719M260J3148J5192R579K59r429j4772j3204m719
877b1834O868J3184J3974Q547j143j1159j5444j1568k383P631J3320J4117P363
890B1473l402j2670j4693r432o72Q049J4339J3118M806n553j2684j3660q499M55
904a9025J0042J4580J1687L073o959j2862j3294p053K035J1561J4413R499J266
917A8963p811j2875j2665n840M830J2259J3294Q159o7r095j3734j1720l016O100
$$ plain form
824 -24442 -18421 -3157 12764 22605 21497 9835 -6579 -19968 -23524 -15555 -149 15065 23095
837 23095 20086 7165 -9352 -21160 -22720 -13063 2135 16716 23224 18027 4297 -11793 -21672
850 -21672 -20929 -10185 5163 18364 22675 15895 848 -13872 -21853 -19613 -7803 7952 20112
863 20112 21796 13303 -1299 -15429 -22148 -17888 -4740 10452 20031 20290 10861 -3911 -17115 -21834
877 -21834 -14966 -1782 12192 20739 19596 8437 -7007 -18575 -20958 -13327 -7 14110 21473
890 21473 18071 5401 -9292 -18724 -19396 -11347 2992 16110 20916 15363 2679 -10981 -19480 -19025
904 -19025 -8983 5597 17284 20357 13398 536 -12758 -19811 -17776 -6215 8198 17697 18963
917 18963 11152 -1723 -14388 -20228 -15398 -3139 10155 18314 18247 9152 -4582 -16302 -19318 -13218
931a3218J2376J2278P725k337j0431j3599r709j604P035J2610J2304N438l896
944A4972j0981j2859q762l1Q264J2982J1373L622n157j1857j2643o990K131R072
958f864J2486J0370K170o618j2560j1444n355L200R822J2466R018O99q140j2592
972c342j0405l727M301J0696J2300P558j113r285j2584r009k469N589J1167J1624
986A1301O233k733j0295j2055p563j489O397J2123J1244M147m629j0009j1514
999h842p129p7Q321J2440R577K525n903j0111j0751o562J575R594J1933Q146J170
1014A5906o325j0764j0607m778K896J0121J2462O848j313p035r921r881m465M667
1028a2189J1524J1071M967j942p568j0381r579k624P162J1299R209L996k259q028
$$ plain form
931 -13218 -842 11436 19161 16824 6393 -7206 -16915 -18519 -11484 1126 13430 18868 14972
944 14972 3991 -8868 -17630 -17661 -9397 3585 14958 18580 13423 1566 -11077 -18067 -15936 -6864
958 -6864 5622 15992 18162 11544 -1016 -12460 -17815 -14615 -4793 7673 16691 17390 9250 -3342
972 -3342 -13747 -17474 -13173 -2477 9823 17381 16268 6983 -5601 -14610 -17079 -11490 -323 11301
986 11301 17534 14801 4506 -7549 -15112 -16601 -10204 1919 13163 17310 12681 2672 -8842
999 -8842 -15971 -16048 -7727 4713 14290 16815 10912 801 -9950 -16512 -14937 -5343 6590 14736 15906
1014 15906 9581 -1183 -11790 -16568 -13672 -3551 8911 15759 14446 7411 -2510 -12391 -16856 -12189
1028 -12189 -665 10406 15373 13431 5863 -4518 -14097 -16721 -9559 1740 10949 14945 12686 4658
1042D658j1810p939L33P252J0397R109L401m114r661j0224o484J034Q615J0532
1056E099P882J903m895r783j0570n398K856R176J0103O725R71n186j0557j0856
1070a2530l167N317R057Q303O501J055p467j2057q065p46M540Q456R552O234j653
1085A3330q648j1082o742k41N270Q901R331M634l172r182r610o470OP076R734
1100C135P713L135l206j0075j0215m410K692O309Q483Q656K148n958j0372p904
1114i869k760J851O634J0009Q166k42q177r153o032l628K300R029J0769M907k393
1129A1411o322r081p624j864N099Q856Q606M280k297p937r170n718n87N362Q567
1144A581Q624L229l792q764p778m554p25N540J0819Q282r1n385o227p995o020
$$ plain form
1042 4658 -7152 -15091 -14758 -7506 2891 12000 15401 11287 1626 -8598 -15082 -14048 -5433 5099
1056 5099 12981 14884 9989 206 -10364 -15762 -12906 -3730 6373 13098 14069 8883 -1674 -12530
1070 -12530 -15697 -10380 -1323 6980 13481 14536 7069 -4988 -13053 -13799 -9259 -803 8749 14983 13330
1085 13330 4682 -6400 -13142 -13383 -8113 788 10119 14753 11581 2399 -7211 -13681 -13675 -6599 3135
1100 3135 10848 13983 10777 702 -9513 -13923 -11231 -4922 3561 12217 14365 8407 -1965 -9869
1114 -9869 -12629 -10778 -4144 5865 14031 13789 5612 -3541 -9573 -13201 -10901 -1872 8897 13804 11411
1129 11411 5089 -3992 -11616 -13480 -8381 475 9081 13361 11064 3127 -6043 -11761 -12348 -6986 1581
1144 1581 10205 13434 9642 878 -6900 -11454 -12179 -6639 4180 12462 12371 6986 759 -7236 -13256
1159a3256J389Q783R213N116J83m380p965q356l829L250Q417Q126M479J99n085
1174F284r510p424j661L562Q048Q524M863k217o923p457o678k279N362R562O979
1189I035J944j604o162q695o422J47O515Q193O014K131j618p656r531m799K779
1204i729O257O500O795K508m548q895p518k778J806O643Q135N827J05m982q175
1219b049p035k277L027P035P486M370k91n045q696o906j262N030O707O692M617
1234A1403r21p033q945m924L29M176P108P018L736l517p173p131m246J83M390
1249e547Q311O713J774m244p033o504m116J011N991P831N692J023m316p766o773
1264g953k864K395O166P564N176k95n465p401n699j686K413O607P789L913j510
$$ plain form
1159 -13256 -11867 -3084 6129 11245 11428 7048 -917 -9273 -13102 -9852 -1435 6691 11170 11369 6284
1174 6284 -3226 -10650 -12311 -8749 -701 7823 12686 10469 3546 -3911 -10589 -12868 -7506 2056 9035
1189 9035 10979 9375 3213 -5482 -11904 -11757 -5242 2951 8965 11096 9478 1822 -7709 -12508 -9729
1204 -9729 -3472 3028 9823 12331 7783 -1112 -8630 -11408 -9602 -2959 5176 11003 11108 6126 -2049
1219 -2049 -9084 -11361 -8334 -1299 6187 10557 10266 5221 -3475 -10381 -11643 -6613 94 6786 11403
1234 11403 10482 3449 -5496 -10420 -10091 -5915 1193 8211 11947 8430 1257 -5874 -10120 -9937 -5547
1249 -5547 2764 9477 11251 7007 -26 -6530 -10646 -9635 -3644 4187 9879 10902 6586 -1180 -7953
1264 -7953 -10817 -8422 -2256 5308 10484 10189 4724 -2677 -8376 -10062 -7649 -1042 6747 10660 9150
1279I150n843o605n539j801L927P549O522L033k006n814p138n225l14M659P491
1294B046O046K069k490o542p208l939Q65N384O670N765J475l396o894o566l409
1309a0124J785N418P504N079J01m427o759o224k692K575O588O811L682j50m700
1324D467p185o198j063L704O338O071L525j110n326p032m830o50L907O417N943
1339F978L065k690n769o675l950K25M320O999N653J419k884o428o011l598R47
1354h399M926P024M628J359l937o334n694k748J532N644O715M313j73m243o765
1369b152n051k061K563N661O680L486j068n115o079m593j127K947O569N668K634
1384H962j570n313n980m485l56M140O173N465K012k501n590n992l865O76M856
$$ plain form
1279 9150 3307 -3298 -8837 -10638 -6711 838 7360 10393 8387 2573 -4565 -9790 -10104 -5445 2046
1294 2046 8092 10161 7671 1129 -6079 -10018 -9153 -3769 2901 8666 10141 6745 -149 -6715 -10124
1309 -10124 -8339 -2921 4583 9662 9763 5336 -1423 -7647 -10339 -7764 -1176 5635 9317 9167 4467
1324 4467 -2718 -8916 -9979 -6275 63 6134 9659 8549 3223 -3809 -8639 -9289 -5382 1035 6978
1339 6978 10043 7353 1584 -5091 -9041 -8816 -4496 2503 8156 9575 6691 263 -5748 -9346 -8399
1354 -8399 -3473 3551 8179 9538 5601 -733 -6427 -9175 -7643 -1999 4716 9029 8856 4613 -2152
1369 -2152 -7203 -9264 -6701 -1040 5640 9126 8058 2943 -3136 -7729 -8856 -5909 660 6328 8962
1384 8962 7392 2079 -3901 -8386 -8742 -4602 1571 7036 9048 6547 957 -5035 -8900 -8224 -3368
1399c368O113M769J275k979n935n810k937J150N546N978L982N66l585n796n521
1414f552k199K017N456N929L454j10m092n959n064j467K799N564N824L178j614
1429G164m585n711m464o32L831N328N137K549j806n139o011l737J95L764N890
1444A773N083J720k618n402n683k863P93L994O149M608N23l109n417n522k411
1459h382J572N063N711L487N5l515n604m956j557K229N103N552K975m07m254n823
1475b751l961j179K895N445N208K252j457m514n582l564k18L240N469M936J926
1490H145k156n267n121l270O25L674N717M227J289k974m913m967k929J311M611
1505a998N288L765L49l002n193n190j642J678M744N219L062o2l586n316m177j589
$$ plain form
1399 -3368 2745 7514 8789 5810 -125 -5935 -8872 -7722 -2176 3802 7784 8350 4765 -1031 -6552
1414 -6552 -8751 -6734 -1278 4651 8105 7995 3903 -2056 -7120 -8587 -5788 -224 5600 8778 7164
1429 7164 2579 -3132 -7596 -8228 -4397 931 6068 8617 6811 1672 -4339 -8076 -7881 -4117 1773
1444 1773 6856 8576 5958 556 -5127 -7990 -7197 -3203 2946 7554 8077 4968 -449 -5971 -8382
1459 -8382 -6810 -1747 3964 7451 7506 3991 -1613 -6569 -8126 -5897 -794 4758 7733 7326 3072 -2751
1475 -2751 -6712 -7891 -4996 449 5657 7909 6452 1938 -3644 -7208 -7426 -4186 1283 6219 8145
1490 8145 5989 722 -4399 -7669 -7044 -3370 2347 6574 7863 4889 -24 -4991 -7920 -6609 -1998
1505 -1998 3290 7055 7404 4402 -791 -5981 -7623 -5945 -1201 4018 7080 7018 3432 -1884 -6061 -7650
1521g650K770M750M794K844j191l789n244l952j144L348N295M306K431j805m304
1536A459n256l575O65L502M820L916J720j753n253m666k616J075L310M866M072
1551F286R50k850m798m493k030O97M658M876L281J04k984n042m286j418J894M178
1567i77M997K640k36l605n141l478o93K193M581M462K245j313l992n145k957m2
1583f461K686M564M574J443k128l591m889k793K84L168N251L733N74j818m443
1598A54m468k627J290L723M542L584L54k949m552m001j868J592L881M976K712
1613F343l68k726m548l913j513J819M842M581J630o32l314m174m068m12K711M157
1629D15M198J808j292l695m388l070j79K925M544L697J523j907m036m095k872
$$ plain form
1521 -7650 -4880 -130 4664 7508 6317 2528 -2716 -6668 -7812 -4464 831 5137 7568 5763 1459
1536 1459 -3797 -7372 -6707 -3205 1615 5531 7251 5498 245 -4421 -7037 -5962 -2652 2214 6286
1551 6286 7236 4386 -412 -4905 -6935 -6238 -1580 3296 6577 6681 3697 -1345 -5631 -7049 -5155 -977
1567 -977 4020 6660 6424 2819 -2322 -5800 -6493 -4300 281 4743 6988 5675 1683 -3462 -6419 -6461
1583 -6461 -3775 789 5363 6806 4678 1087 -3802 -6595 -6311 -3143 2108 5841 6415 4597 154
1598 154 -4314 -6941 -5651 -1928 2614 6198 6552 3603 -949 -4950 -6818 -5226 -1345 3631 6343
1613 6343 5975 3249 -1299 -5212 -6725 -4906 -64 4517 6147 5515 2201 -1973 -6041 -6453 -3742 415
1629 415 4613 6421 5129 1434 -2954 -6024 -6203 -3278 1266 4963 6486 4579 543 -3552 -6424
1644f424Q69L186M559L512L07k337l814m202k314J543L913L821L069K81k363m676
1660a070l861j289J924L542M119K605m08l097m383l346p14K114L981L805K230
1675F152p73l761m207k759p65K852M218L572J375j306l517m525k332O57K504L876
1691A261L669J229k426l549m008k079Q66L201L940L622J56k622m215l180j462
1706e597P77L607M734K131p56k118l913l528j014J772L675L962K251j116k823
1721B044l999k920n54J885L997L572J776r52l518m374k056j78K461L884L728J300
1737F096k119l289l848k351M03L060M148K988M27j870l788l521j952O37L694L868
1753B583K325M06k251l756l936o16J431L121L605K597l29l027l799l040r50J774
$$ plain form
1644 -6424 -5555 -2369 2190 5702 6009 3672 -142 -4344 -6658 -5115 -1202 2619 5688 5969 3606 -1070
1660 -1070 -4931 -6220 -4296 -754 3365 5970 5562 2465 -1918 -5264 -5978 -3864 117 3922 6152
1675 6152 5379 1618 -2589 -5348 -6113 -3261 957 4529 5904 4598 1081 -3444 -5776 -5119 -2615 1261
1691 1261 4930 6159 3733 184 -3824 -5903 -5037 -1836 2104 5726 5882 3260 -955 -4135 -5597
1706 -5597 -4820 -1213 3521 5652 4896 2778 -1135 -4663 -5677 -3905 -230 3732 5983 4867 2044
1721 2044 -1955 -4875 -5429 -3544 453 4025 5801 4849 1331 -3043 -5099 -5277 -2816 1068 4796 6096
1737 6096 3977 688 -3160 -5511 -5108 -2048 2100 5088 5515 3645 -143 -3664 -5616 -4979 -1285 2583
1753 2583 4908 5314 3063 -693 -4629 -5245 -3814 -693 2912 5509 5180 2153 -1646 -4686 -5636 -3862
1769c862L931L566J441l12l372l800k271l77J933L615L476J149j083k902l953
1784b821k607M19K999L514K798J303j846l928l317j521M03K683L908K693K76j946
1800C010l414l639j239J251K839L977K113n9k637l597k735j050J382L601L375
1815C178K006n61k743l582l050k36J795L292L799J307j328k666l576j977k55K084
1831b513L224L088J228j137l466l064k298J99K498L944K699L27j378l610l139
1846c398j437O72L044L258K118L97j911l672k953j027J365K812L594J742k71k162
1862B171l536k310j019J358L326L134J554m64k891l225k451n60K006L370L072
1877C535J125q65k904l428j969O4K411L259K640Q57j403l149l339j595P43K340
$$ plain form
1769 -3862 69 3635 5076 4764 1392 -2408 -4679 -5056 -3123 492 3968 5117 4034 1132 -2821
1784 -2821 -5428 -5009 -2010 1504 4302 5605 3759 -169 -3486 -5007 -4604 -1921 1987 4680 4956 3010
1800 3010 -404 -4043 -5282 -4031 -1192 2785 4898 4839 2202 -1395 -4130 -5180 -3798 -197 3178
1815 3178 5184 4623 1880 -1702 -4752 -4988 -3193 99 3898 5205 3877 1211 -2365 -4342 -4597 -2513
1831 -2513 711 3799 5027 3890 424 -2640 -4938 -4739 -2241 1703 4402 4729 3351 -259 -3398
1846 -3398 -4835 -4163 -1119 2139 4257 4654 2743 -929 -3882 -4909 -3544 -732 2862 4604 4333 2171
1862 2171 -1365 -3675 -4694 -3336 -10 3124 4678 4214 1323 -1902 -4353 -4913 -2907 463 3535
1877 3535 4660 3795 891 -2537 -4506 -4442 -2031 1228 3868 4725 3322 173 -3166 -4761 -4018 -1678
1893a678L313K234Q46j920l011l254j075P33K914L061K102J34j965l440k824o29
1909d459J107K983K982J606L3k526l269k316p73K079K659K731J593n55k672l212
1925b009j907l56K017K986K886R67j247k676l264j566J83K160L372K199O58j523
1941B880k860k651j646M92K375L163K269K54j859l048k727p82O81L022K936J751
1957D250k30j967k986k772o40J374K985K742J373l67k345k849k286n22J759K726
1973B45K767J213r07k636k789j954l4K322K577K405R14r27k762k943j482J75K192
1990a624L087J946N23j126k941k867j023P50K268K766K012j35j543k852k365j341
2006d465J557K592K389J580P1j957k871k381n34J678K568K283J632p43k265l097
$$ plain form
1893 -1678 1635 3869 4715 2795 -216 -3470 -4545 -3812 -898 2163 4265 4399 2434 -1006 -3830 -4459
1909 -4459 -3352 -369 2613 4219 4252 1726 -1543 -3859 -4632 -2553 106 2837 4430 3875 1203 -2009
1925 -2009 -3916 -4272 -2255 731 3617 4584 3337 661 -2603 -4169 -3986 -1826 1546 3745 4403 2880
1941 2880 20 -2631 -4277 -3785 -1410 1753 4022 4276 2417 -631 -3358 -4140 -3459 -437 2499 4250
1957 4250 4020 2053 -933 -3705 -4345 -2971 14 2756 4129 3762 1417 -1432 -3718 -4240 -2481 245
1973 245 3012 4225 3318 682 -2107 -4061 -4095 -1773 804 3209 4123 3196 434 -2509 -3991 -3816 -1624
1990 -1624 1463 3409 3932 2806 -135 -3002 -4025 -3275 -1007 1759 3771 3636 2093 -759 -3124 -4465
2006 -4465 -2908 -316 2073 3653 3724 1767 -1104 -3485 -4019 -2341 227 2510 4142 3399 1134 -1963
2022a963j976L62J288K775K552J098p77k741k834j390k70K187K758K143O77j584
2038B305k035k830j316O95K016K538J979L74j636k511k454r50O21K459K633K004
2054C892n3k076k380k275o43P73K174K887J056n1k034k544k090l15J312K752K495
2071B880J005q61k212k560j774m46K110K552K176Q13j034j980k728j471J04J865
2087a561K827J889N22j268k651k142j030L82J961K822J561l6j320k475k590m82
2103c591R30K065K591J465k71j715k328k223q47J880K269K188J087m42j816k779
2119a537j700j40J368K344K090J421j054j979k608j514j57J991K557J641N78r83
2135B318k112k547j085K30K018K655J390N54j114k679j895j295O31J995K562J445
$$ plain form
2022 -1963 -3939 -3577 -2289 486 3038 4136 3359 618 -2216 -3606 -3876 -1689 1069 3212 3889 2305
2038 2305 270 -2560 -3876 -3181 -1165 1373 3352 3726 2090 -421 -2875 -3825 -3204 -745 1888 3892
2054 3892 3839 1763 -617 -2892 -3535 -2762 -588 2299 3355 3304 1270 -1274 -3364 -3679 -2367 385 2880
2071 2880 3885 3024 812 -1748 -3522 -3968 -1858 694 2870 3683 2649 669 -2059 -3530 -3426 -1561
2087 -1561 1266 3155 3677 2409 -242 -2384 -3414 -3032 -1071 1751 3312 3276 1956 -519 -3109 -3591
2103 -3591 -2661 -596 1995 3460 3189 1474 -854 -3077 -3924 -2044 225 2413 3500 3058 1242 -1537
2119 -1537 -3237 -3377 -2009 335 2425 3846 2792 813 -1795 -3309 -3466 -1475 1082 2723 3301 2318
2135 2318 206 -2341 -3426 -3196 -1178 1477 2867 3421 2307 -372 -2267 -3562 -2931 -936 1626 3071
2151C071K18j528k490k069n52J097J869K611R46k14j355k599k022k91J194K272
2167A58K052J243p20j941k181j784R4J326K278K048O92n17k400k223j298J22J766
2184a285J941K389J75j073j937k480r67M95J702K447J457K94j308k166k002q87
2200c205P41J772K262J425k3j499j930j939o07O30K392J910J283l39j829k272
2216a228j586k90J289K014K014Q51o85j734k076j605J70J099K262K047L33p83
2232B092j621k068j387J12J736J893J980J57j065k033j881q38N96J766J860J524
2248B823P6j402k087j806m13O74J653J954J698m25j576k055j525n80J028K009
2264D6J901R84n73j266k197j539m1J051J850J699J250j069j072k589j411L46J476
$$ plain form
2151 3071 3289 1761 -729 -2798 -3350 -2253 -384 2227 3173 2959 1604 -995 -3017 -3308 -2114 158
2167 158 2210 3453 2733 792 -1389 -3173 -3079 -1753 525 2573 3265 2748 348 -1875 -3173 -3051 -1285
2184 -1285 656 3045 3220 2147 210 -2270 -3237 -2742 -1040 1407 2864 3158 1850 -316 -2318 -3205
2200 -3205 -2464 -692 1570 2995 2972 1473 -457 -2396 -3003 -2373 19 1929 3212 2873 1044 -1228
2216 -1228 -2814 -3104 -1815 199 2213 3064 2379 645 -1431 -3036 -2866 -1767 495 2542 2875 2092
2232 2092 471 -1597 -2984 -2872 -1136 757 2737 2894 1829 -204 -2085 -2923 -2327 -561 1299 2823
2248 2823 2899 1497 -590 -2396 -2809 -2135 -482 1472 3170 2745 1169 -886 -2411 -2991 -1963 46
2264 46 1947 2931 2358 1092 -1105 -2644 -2685 -1634 216 1915 3165 2096 1024 -1565 -2976 -2630 -1154
2281a154K188J309L67o09j922k054p89L02J475J707J969K05j359j848j780r06
2297b899O94J649K029J383l6j474j990j627l27M79J832J834J087l48j498j733
2313i45j516k01Q66K002J754Q49n91j495j979j312l0J528J461J591R37q57j581
2330D81j606j546L00J377J810J461K36p31j810j763r12O01J449J853J102L55j274
2347A383j759j684l01O59J147K302R97j93j503j778j284m19M08J742K156O77l07
2364B243j649j462j433j73J080J621J554J076m80j925j884j044J99J320J613J327
2380A983O54n69j981j661p77J12J357J461J964n4j280j508j561n94M08J518J724
2397A196J232m1j230j706j375m05M30J459J967Q61k22j183j787j384k79Q47J232
$$ plain form
2281 -1154 1034 2343 2710 2101 179 -1875 -2664 -2362 -887 820 2789 2994 1635 -213 -1993 -2899
2297 -2899 -2205 -556 1473 2856 2820 1346 -644 -2271 -2598 -2119 -287 1547 2634 2286 788 -945
2313 -945 -2461 -2662 -1796 206 1960 2809 2218 723 -1256 -2568 -2598 -1070 391 1982 2919 2062 481
2330 481 -1125 -2671 -2371 -994 816 2277 2513 1782 -28 -1791 -2703 -2102 -653 1200 2302 2657 1383
2347 1383 -376 -2060 -2361 -1702 -555 1747 2744 2551 1048 -730 -2014 -2433 -2025 -283 1873 2550 2243
2364 2243 594 -868 -2301 -2474 -1394 227 1781 2857 2377 452 -1432 -2476 -2277 -957 656 1983
2380 1983 2637 2068 87 -1574 -2351 -2239 -882 579 2543 2489 1209 -299 -1860 -2454 -2046 -528 1196
2397 1196 2428 2387 1157 -549 -1924 -2329 -1899 -440 1527 2388 2166 983 -804 -2188 -2467 -1620 -388
2414c88J664J210l72j390j674j273l06J092J488J952M28p55j416j515j045l31
2430b631J795J362J621L86r21j557j386j167M87J477J500J292J29r61j757j599
2446a930n51O14J481J287J388q8j268j341j593l35O41J428J517R95j52p74k102
2463g83j031n23R56J696J091P44l63j391j578q08k61J514J274R64Q15o89j586
2480D1j376r94L82J256J290J166O65j084j444j204j036M67J109J540J107L90j169
2497A106j496j506k65N37J286J589R96l05j340j293j090m15R25J173J476O85j51
2514A912j638j092j084k97J011J420J339Q12o86j416j405r05k68J231J639J151
2530A724M41q59j196j449o08J8R28J746J418J73j360j309j105p51O26R92J710
$$ plain form
2414 -388 1276 2486 2114 724 -950 -2223 -2529 -1437 51 2003 2431 1676 260 -1255 -2300 -2631
2430 -2631 -836 526 2147 2533 1612 55 -1331 -2498 -2011 -534 966 2258 2387 1426 -331 -1930
2446 -1930 -2481 -1867 -386 901 2289 2201 933 -408 -2001 -2336 -1695 -267 1250 2245 2093 1319 -783
2463 -783 -1814 -2337 -1381 315 1406 2150 1787 396 -1182 -1990 -2251 -737 537 1501 2316 1627 41
2480 41 -1335 -2329 -1947 -691 599 1765 2430 1346 -98 -1302 -2338 -1871 -762 778 1885 2275 1106
2497 1106 -390 -1896 -2161 -1624 -338 1251 2247 1942 602 -691 -1781 -2196 -1271 -98 1378 2063 1912
2514 1912 274 -818 -1902 -2199 -1188 232 1571 2383 1697 281 -1124 -2029 -2297 -1066 573 1724
2530 1724 2165 1306 110 -1339 -1947 -1929 -1001 745 2163 2336 976 -333 -1438 -2189 -1563 -571 1139
2547A139Q52N8j262j147j129l62M33J305J490M45j7j019j494r62m03Q91J488J041
2565A347N25l61r61j440q92j60J020J368J115L52n41q29j761n15j9J309P83J358
2583A698J73k29j695j304q58L47J229J375Q81K78p87j271j467m94P01Q44J658
2600A079O29K47j168j086j362k43M83J226J560O01l01r76j452p73n19J031J218
2617A94J076O39l84j134j315j042K14Q28J201J193M45o90j193j058q44K6J268
2634e76J097J049L71o26j298j595j58L05R44J504O28L20j003j244q86n37L63J014
2652c28J458N41J27j207j228p08o24P28J182J374N90m14r06j357o10m30J048J184
2670D20J034L92n76j043j294p08K26P31J330R32N01q21j132r34q11L83Q03J217
$$ plain form
2547 1139 1991 2049 787 -360 -1489 -1851 -1418 -113 1377 1822 1805 786 -708 -1670 -2073 -1182 306 1347
2565 1347 1872 1511 550 -890 -1782 -1942 -922 446 1561 1913 1372 543 -1218 -1733 -1752 -443 340 1698
2583 1698 1871 1642 -53 -1357 -2215 -1868 -639 736 1617 1895 1108 -163 -1630 -2124 -1423 -579 1079
2600 1079 1708 1955 787 -299 -1661 -1904 -1421 -195 1365 1966 1665 689 -763 -1536 -2055 -1024 194
2617 194 1270 1909 1525 391 -924 -1966 -1752 -924 277 1470 1915 1225 32 -1026 -1870 -1844 -576
2634 -576 521 1570 1941 1315 17 -1578 -1736 -1431 -487 1017 1645 1965 962 -282 -1168 -1705 -1342 -328
2652 -328 1130 1671 1798 591 -637 -1345 -1969 -1241 -59 1315 1905 1491 585 -772 -1382 -1812 -764 420
2670 420 1454 1846 1270 227 -1067 -1775 -1549 -818 512 1444 1945 1124 -8 -942 -1753 -1370 -567 650
2688F50R93j69n17q03j422l44J50J203J124N67O1o33j357r34m33N60J116J411
2706A223M48j9r27j097r46l83P27Q44J334O03n49q37r68j252L66P03J134J008
2724A412L56l59j344r34p09n3J056J232Q72m5p90l98j451o86O46P93R22J019J16
2743A655p02j283q14l84J37J239R72P90l73n32j104q18l64O15P26J105Q81k98
2761A448r65j085p73k04P84J143Q47N22o66j088o45q82oO74J191R33K78l84p61
2780C61j402m25K64M11J426M38M40p21n63j237m53K05J142Q20Q55l58k85j096
2798a78j345l18Q38P17J160O03l00n90q87j202n9M01R88J245M20j08r69j268n75
2817a427j32P23J088R47L15m17r67q18r17J94J128N97R70m0j96j152p34o28L64
$$ plain form
2688 650 1643 1474 957 154 -1268 -1612 -1462 -259 865 1432 1493 860 -497 -1431 -1864 -1304 -188 1223
2706 1223 1671 1652 725 -372 -1318 -1701 -974 -130 1204 1807 1258 421 -547 -1799 -1433 -730 404 1412
2724 1412 1768 1409 65 -869 -1578 -1631 -575 657 1529 1484 694 296 -1155 -1841 -1195 -402 520 1539 1655
2743 1655 953 -330 -1144 -1528 -1391 -152 820 1610 1237 705 -399 -1217 -1581 -966 -240 865 1746 1448
2761 1448 483 -602 -1375 -1579 -795 348 1195 1717 1051 -37 -682 -1564 -1570 -896 295 1228 1506 1122 361
2780 361 -1041 -1466 -1202 -791 635 1073 1513 792 229 -1008 -1461 -1256 -114 706 1561 1203 918 -178
2798 -178 -1523 -1841 -1003 -286 874 1477 1177 587 -300 -1502 -1561 -1160 -172 1073 1493 1385 416 -852 -1427
2817 -1427 -1559 -836 252 1199 1514 1097 130 -688 -1605 -1411 -283 314 1284 1244 1048 -104 -838 -1466 -1102
2836a102N20J235O13K36o21j039r90k96M14Q70R46N51K2o89j106q95j39L49J248
2855A27Q54M05j54q90j067n18M2M50P93Q32L62j74q58p05j171L19M77J317L02
2874G43L64k74o08r85p13J36R15J115M81K90l84j341m73p00L15J000R20K96L42
2893A439q30p86j192Q4J6J167R40M69K3o91j236n20r4L33R36P96M10N0j030n96
2913c12q44K11J87R04R19J10l79o22o32j033K89O98P38R79j51k06l11j341n03
2932a299JQ54P51J018P0l97j081p59l56M62N87Q05N65p7l90r90o01l99M38P07
2952i1O30P17j83p43o54p15k35L29Q09Q06N84r0r11r04o01j40N81R65Q36M47p38
2973F99m21r28k47l92O95P27P74K64n13o23q90l52Q1O13R12N68J12o51m94p33
$$ plain form
2836 -1102 -582 653 1266 1502 881 -158 -1148 -1444 -1030 -160 786 1337 1359 670 -436 -1331 -1470 -1121 127
2855 127 981 1386 1232 342 -725 -1243 -1201 -751 42 874 1236 1062 204 -501 -1672 -1353 -876 441 743
2874 743 1107 833 225 -760 -1473 -1337 -422 693 1174 1464 1080 -261 -734 -1434 -1119 -119 801 1097 1439
2893 1439 609 -177 -1369 -1285 -1269 -102 838 1307 1330 639 -597 -1117 -1211 -878 58 854 1264 1314 284 -312
2913 -312 -1156 -945 -758 146 1065 1175 796 174 -458 -1491 -1202 -504 234 1213 1062 856 545 -796 -1299
2932 -1299 -1298 -444 307 1325 1395 998 -83 -842 -1198 -736 -149 656 1221 1144 754 -236 -837 -1236 -798 -91
2952 -91 539 1256 1073 330 -324 -1039 -1274 -945 -136 670 1254 1164 253 -651 -1252 -1392 -811 154 990 1437 699
2973 699 278 -650 -897 -1289 -594 133 907 1171 658 35 -855 -1207 -1126 -513 399 967 1079 428 -66 -799
2993g99m61K71N36R45P96j4p31q35o73m7R2Q29R87L43m48n90o60q71N8K98J034
3014F0P28M36k66o72q95n61j3P16M82P55K01J81r11r08n67J19N94Q45O27L40m18
3035H73r41m75m07J01N71R37L43K18m94p10p41l04L89M95O02M94M99p89r37n75
3055h51j33K15J024L37N46p1o03j017m21J08j42J116P30M18k52o82j091k08l49
3074a326P70R82N22L18n23o91p39n4m22P23O25M82O72j003j47j127j26K85M38
3093c41Q76O23m68l39l24j049O8J88M50J030M15k37l80r02o52J31RJ105M04M48
3113A055j35o70p02l75rJ42Q28M89N49k03r20l30o46r0P40N43P91n5k83p34m92
3134e07m52J35O16O41N97k19l10n53q68l00M85O26P15M20l80o7n15p85j14R2O60
$$ plain form
2993 -799 -1260 -989 -453 492 1288 1274 543 -292 -965 -1012 -920 -91 896 1239 791 201 -459 -1330 -1272 -974 60
3014 60 788 1224 958 286 -609 -1170 -1183 -467 15 770 971 1152 241 -667 -1234 -1115 -521 324 951 1291 873
3035 873 -68 -543 -950 -849 -278 659 1002 1220 726 16 -725 -1029 -640 -145 457 951 1450 661 -276 -851
3055 -851 -984 -769 255 592 1138 1067 464 -553 -974 -866 -1008 108 838 1256 1004 322 -769 -977 -1326
3074 -1326 -556 426 948 1266 743 52 -687 -741 -1163 -440 185 667 1339 336 189 -938 -1064 -779 -341
3093 -341 535 1158 690 351 27 -1022 -954 -766 -316 714 1129 892 512 -390 -1042 -911 -902 203 607 1055
3113 1055 920 250 -452 -827 -836 -694 134 623 1172 969 49 -281 -927 -1017 -277 266 1057 1002 719 -15 -507
3134 -507 -959 -824 -208 433 1030 811 501 -52 -920 -1220 -735 -109 606 1026 646 579 64 -721 -835 -743 -83
3155h3O86J88K10o92p30n62O7r8Q98Q71K24j40o01n82l89k46L73P95K71L46j38
3176F68m39n54n65K11J81Q63L40J71j58q23o00j43K91K13P31O83k73l22m54q43
3196h22j63k04R01Q83J57Q8o16l38q47j13M57L91O36O13J7q81n01j31l94N01N35
3217A69M07K85k71n15o22j01j49L02N54R80j48m93n25k27n75J89O09L39O00L46
3237A154m70o51n71l24L06L91L79N64K50n40o85m81k95M24K85R85P8R5l67o92
3257a65o53r3N46L60M82L69j55l65m36o63J42l9P55M88L64o3p21o44k97j18N35
3278c71O51K80R4J9o68j34o25j35P60N32K93j55j20n66k88m87L48N53K27O84j26
3299G66l06m90l66l79K09M51P15L86l91l43q18p2l58K57P92M46P6k6j46o62n78
$$ plain form
3155 -83 603 791 1001 309 -421 -983 -916 -1014 -116 755 979 839 238 -344 -733 -979 -606 189 460 806 668
3176 668 229 -325 -890 -679 -498 365 705 876 718 -105 -705 -848 -557 -344 387 1070 797 475 21 -822
3196 -822 -985 -1189 -288 595 752 840 224 -114 -961 -1074 -617 -226 410 1023 1040 159 -342 -473 -867 -366 169
3217 169 576 861 590 75 -547 -648 -797 -495 59 1039 891 398 -127 -354 -929 -740 -131 208 808 1154
3237 1154 684 33 -538 -862 -556 -165 214 778 1028 488 -197 -678 -973 -549 -264 721 799 894 527 -165
3257 -165 -818 -911 -365 -5 477 846 691 326 -110 -773 -631 -670 85 573 937 874 153 -491 -788 -906 -371
3278 -371 280 560 654 673 5 -129 -754 -889 -129 403 696 541 421 -145 -433 -920 -572 -19 208 892 766
3299 766 460 -30 -396 -775 -566 -115 600 986 595 252 -566 -638 -996 -739 53 499 575 549 403 -259 -837
3320h37K9L75N14K26M45k26j43n73n03j7M04L82P23K12m28n04n54l99K3Q57L38
3341C44K13J80l59l15k33p58L42L25M03O15J65o33j86p13m81M69M77P13M01j56
3361H13p99l12m46j1L07L51P03j2j20k30m47n56K31O1P01M90j79j6l89o96q2K80
3383c58J77Q57O3O3j72p90m82j10O2N64M42N88k10P8q15n56k84L66L51N34L03
3404F71j4n07n08m81N6M90K96N01K19k0n54l44k33nO0L15N64J00k19m27l65k85
3426f90J5N09K43O13J7k33m15n41L0k55K19N95L90K19j43n28n06j10M4M00M62
3447C35K67m7p7r57M9j88J71L80O58J7K12m52l71m73l59N57M02L51K46k05l32
3468A84p63k7j09M21M71M02J76l49m00o70j20J30L28K74O50K14r4o78m62k68P1
$$ plain form
3320 -837 -808 -433 81 307 752 526 383 -190 -693 -710 -306 76 799 1011 583 79 -475 -874 -851 6 344
3341 344 557 737 378 63 -170 -928 -586 -261 142 757 922 289 103 -610 -1091 -622 -145 568 969 813
3361 813 14 -298 -744 -755 -448 -97 606 594 474 244 -203 -759 -528 -467 234 724 545 529 140 -556 -638 -358
3383 -358 -181 676 739 802 630 -160 -642 -752 -690 -126 316 904 694 772 -43 -599 -883 -517 -166 368 671
3404 671 657 150 -358 -839 -783 -293 3 504 723 703 149 -195 -428 -433 -373 -58 506 606 387 -40 -405 -690
3426 -690 -675 -166 77 690 707 474 59 -482 -452 -707 -488 107 497 716 573 45 -461 -571 -527 -127 335
3447 335 602 555 478 -479 -430 -618 -447 -67 591 608 820 368 -3 -476 -835 -278 124 475 721 516 184
3468 184 -579 -606 -715 -294 177 579 755 406 6 -664 -784 -654 -326 -52 598 812 718 40 -422 -690 -619
3489f19Q43J50K16j17k35k87k83k11K48k7N30O09k57q9r37K2m8NL83L25M91p4
3511F38o5r04m01J51M7N50L93K63j00p03n9l89J35j6N68J29M45l41M4p58o6l77
3533h16N63N41L63k30M6m78m32n3J05N17j1M06J31j37j116L85l34J0M84J34L67
3554D45L13m14n12l02K11k30L10O68K88j95k64n79k93K60j54L46L51L19j51m12
3574El07N9l43K93L43K73J22j50j34m77j50jJ20M83O8L14k26k83m27m60N68K27
3596h3L69K73R0n27k30j42l51k1O05K45K49L01m35m46n17L71l27M39N94j59Nk97
3618Fj72l79Q6j33Q63J9K11j92j16o38L6j39K48L67L66J20j61n49j51l01j31N66
3640a74K91K58K60j19m53m33n9M6J07M94K13J53m40k23k47k75K74M65K36L85m86
$$ plain form
3489 -619 224 374 590 473 238 -49 -332 -543 -295 -322 208 817 560 471 -466 -444 -492 -487 -104 221 712 638
3511 638 573 -331 -732 -581 -534 16 409 672 572 -131 -190 -579 -444 -460 108 237 682 341 385 -373 -439 -816
3533 -816 -253 288 651 421 467 -11 -443 -496 -391 126 115 521 652 515 -601 -216 -550 -540 -56 78 445
3554 445 758 344 -168 -470 -259 -489 -179 489 777 582 318 -261 -554 -294 -448 -102 249 568 417 5
3574 5 -302 -243 -586 -293 50 323 445 295 161 -316 -466 -467 -347 136 204 518 292 9 -418 -878 -310 -83
3596 -83 286 559 649 122 -108 -250 -601 -622 -17 228 477 778 343 -103 -620 -249 -576 -137 457 298 303 6
3618 6 -166 -545 -459 -592 271 290 501 309 193 -445 -409 -548 -300 67 433 553 392 -157 -308 -609 -740 -174
3640 -174 117 375 635 516 63 -370 -429 -383 -276 218 431 584 144 -79 -326 -601 -327 138 374 759 273
3661B73k50l5l37m51O60L38P1J27N7j19n82n17K44L31L13L34jK6o34N7k42j60
3683d97L68L14K47J11j00n93l05j36J28O25p9M07K09l90j71q28N71k15L63K62
3703B91J29M4k71j93l43k54N19o3N25L37k93j51n41l8n3J67J98M5O06m41k71l06
3725c57o1N8J27J80L48L32l83j44n14k26M15K13L10J29K9j06k72n15M58n03K44
3746b38M18N4P9k56l38O6j87O1L99J61M47q6j99l92k54k58r0M82L03J63Q9p8n39
3769a93m50J79K62K00N80R4j40m00n02R7l4o4M60J13K65m75N4k84l4p7J97N50
3791C98nO2k10j20n80Q4j91N36L23J01Ml72j20k01q3J31j00N65J48m2m1l44n85
3814f42RM12M19K2J41jj93n09K19k24K52J44J65J38J41o97j16nj44K90K29J59
$$ plain form
3661 273 23 -12 -349 -800 -140 198 269 396 453 334 -248 -765 -521 -190 123 457 456 482 -152 -95 -337 -497
3683 -497 -129 185 432 543 443 -150 -455 -591 -463 162 83 490 699 309 138 -690 -119 -334 29 291
3703 291 420 464 193 0 -343 -597 -78 -141 384 721 428 277 -264 -302 -355 -188 10 55 661 220 -51 -357
3725 -357 -418 -360 -233 -53 295 627 244 100 -414 -640 -225 -12 298 427 456 350 78 -437 21 -482 -238
3746 -238 180 234 313 57 -281 -215 -402 -341 58 219 666 580 381 -11 -265 -523 -613 -131 172 335 424 346 -193
3769 -193 -643 -464 -202 -2 578 672 532 132 -370 -273 -307 -371 89 202 467 -8 46 -238 -272 -349 -152 398
3791 398 393 455 245 125 -455 -371 -562 -26 297 398 402 30 -90 -291 -374 -243 -343 222 370 328 287 -57 -642
3814 -642 -633 -221 198 220 361 360 167 -342 -123 -347 -95 49 214 352 493 -204 -320 -325 -469 -179 50 209
3836B09J74J0k46l07k69L82j69L68Q3L59k21m16m97J63J83K75mM06p0m17k89R8
3858a95j78RL28K25J62j56j67k1p8k60j3M25N04o8k09j06l03j33n3J09K37N82
3880F41k09r7j78m03n8J83J80J72M0mJl73n4Ql03K65L66Q9J75l36l79K91m93J75
3904c01L50j55K65K36j17l73j41J5M1M19J27J47j97j88l9o19J02K08L07J33L26
3925E46l50j50j59k21J97J30K50L4J75k54j35k66j1l4p0L55L76k79J06k02m19
3946c81J37k07L20M32p5r5j18l2o5j52m1J84L57j67N04k92k82k70k75L03J45K71
3968B01P6o7j67j99j2j93L0L38K85K6j76r7j64j94k17L16K41L07J04J3j22k98
3990C1l60j13M93K9K94M5l04p2k85l03M50P6l2L02k10Rk36p9k64J92M16r6L23
$$ plain form
3836 209 383 393 147 -160 -429 -47 -216 152 235 594 373 -43 -540 -377 -194 81 77 483 413 -4 -293 -195
3858 -195 -373 -364 -36 189 351 195 28 7 -71 -331 -344 81 585 517 308 202 -101 -234 -287 -178 59 641
3880 641 432 335 157 -246 -304 -121 59 231 271 267 268 -105 -159 -151 -454 -189 177 266 441 105 -274 17 -476 -301
3904 -301 49 -106 159 395 278 -95 -236 -221 -180 239 366 513 316 128 89 -530 -428 -220 87 220 546
3925 546 196 46 -113 -334 -137 -7 243 277 452 198 63 -203 -214 -248 -318 37 413 134 240 38 -381
3946 -381 -244 -451 -131 301 226 131 13 -19 -84 -236 -277 -93 264 97 601 309 27 -243 -518 -215 -70 201
3968 201 277 210 43 -156 -168 -361 -331 7 292 318 142 45 -119 -313 -530 -214 27 334 438 451 329 31
3990 31 -329 -442 51 80 374 419 115 43 -242 -545 -95 -19 -51 251 41 50 -186 -265 -529 -337 79 -17 306
4013C06J07r8m59n5r6P2L38L2K28m7j66k36k88j08N42m3L23l0p3q2l82o6on2L16
4038b3L35L0j39pj93Pj87N5J59K96Q6l68j54k08K00k00L21K06Q5Jj39k76k2k81
4062d16K10M16J24P8m37K80m39k29J31m5L94J42J57p5m16Q0l88K22J04O6N35l24
4084A70K94n88k01p6K8J40M51J11m8j55k20k44L44o2j01M21m0K33m25M0j20k22
4106b70r3L59L32L81m42l33j12l07R8J10M81rJ83J32n44k7o3k07M31p2j17L33
4128B44k10K37n66K8K8rK55J61P3m24L51k77k06j24K02K21J14L38j13m03j65l12
4150e57L05L23L47m2J7j67k93k99N1K69Q9K01r6J2j56j02k42J34P5J89J21J61
4172C40j09P5m17j66m9L73J22q9K53l06k9K14l31k5P3J16L33j58j36k17N9k02
$$ plain form
4013 306 413 315 -144 -199 -295 -223 115 147 375 328 162 -74 -362 -470 72 29 352 322 249 167 -215 -281 -287 -339 -23
4038 -23 312 342 203 196 3 10 -177 -122 37 333 419 51 -103 -311 -111 -311 10 216 301 302 163 -113 -135 -416
4062 -416 -206 210 334 412 -25 255 -184 -413 -282 -327 67 209 366 291 -125 -45 -433 -211 -107 -41 494 170
4084 170 464 -124 -325 -401 -373 -233 218 329 281 126 -94 -338 6 -56 -157 264 224 457 32 72 -48 -270
4106 -270 -363 -4 328 709 267 -66 -178 -485 -387 -277 204 195 378 510 -34 -61 -124 -331 100 28 -89 244
4128 244 34 271 -295 -267 -239 -248 7 168 241 -183 168 -109 -315 -439 -237 -16 98 436 323 -80 -245 -557
4150 -557 -252 71 418 376 393 226 -67 -366 -315 -46 43 244 148 160 4 -98 -340 -206 -131 58 179 340
4172 340 231 306 -111 -277 -326 47 169 80 333 27 -2 212 -119 -144 -71 45 378 220 84 -133 -74 -276
4194b76K19m3K05J08K00l05K3m5j73k74M18K16l4P4M2m26P8k30L45R2k25J86l12
4217a37L96l56M3Kj73L44J36K23l99J3l09j5L9j4L73n1L55m9m34j04j07QK10k4
4241c0J40K58j08k53q2q6J77L1J50l3OJ67l57k90J05J49J7K52K1R5q9k03r3j17
4265a73kK09l3J66M7j10j46kk05K86k46O41k37j7p1l58m7J72J44Pp0L38k93j88
4289a88O1m88L61M14n9m5J73q0k80j19n1M1K63Q0J56j39M5m8j31q0O7k16L85j24
4313bN7P8k93K55l53L0j7L69J32l47J50k62j51K95J82J81j30m2p0R7k55m2Q7N2
4337Aj67L80r1j01j44K44m76K27K28O9P1K53n82L2j15K87k76L8K64j43J77q1j59
4360f4k94J93kJ88j6J58k6L1j94j54J86o0Q2L18l11P6k10Ml07J40O2K52K4j2n
$$ plain form
4194 -276 -57 -100 105 213 413 108 131 86 -87 -361 57 273 239 313 355 -71 7 -223 122 214 -11 175 -137
4217 -137 259 -97 -54 -52 -225 119 255 478 79 92 -217 -232 -193 -207 166 115 470 421 -13 -117 -224 -216 -6 -30
4241 -30 110 368 260 7 -75 -161 16 47 197 164 170 337 -20 -310 -205 -56 -39 213 234 329 240 37 -56 -173
4265 -173 -175 34 1 167 214 104 -42 -44 -249 37 -209 432 195 178 107 -251 -298 -126 18 25 -45 293 0 -188
4289 -188 -127 -615 -254 160 101 56 229 149 -131 -250 -301 -260 3 83 239 100 145 97 -34 -114 -47 -263 122 -2
4313 -2 55 133 -160 95 -258 -228 -245 124 256 -91 59 -203 -354 -59 123 304 174 132 62 159 -96 -138 -51 1
4337 1 -166 214 123 22 -122 122 -354 -127 101 170 241 494 -88 -56 -171 116 -160 -122 142 -1 176 95 -64
4360 -64 -358 -165 -167 21 5 163 137 168 -26 -180 6 -54 28 346 35 111 -99 -95 -402 -262 -200 52 76 64 59
4385E9M9j26p6p0J40n3M58j5l38kj71O2k13M24j60j24o5K62k86j30j62L67J03
4408f7N5j10K00K2j74J14Ok03K58M0k26K64k19J6j84j74K52L27k07j0L37l39l05
4431c27K58o9J08K1K95j5k25k24J54Q0m79M24j21L03j09Q0k55K92n21L54q6J55
4453I3J42q9l33K14O8j33j34J28m8L46j0l77m5J48j42j16J24l7M85J7n74K43O2
4476C2p8j37K75J71o7Q5j46j99K35o00L84R6M08j94j1k18J05k56k00L81j00OK08
4499A80j02n9j7j53Q4j82L86j63K8R4M4k86J4p8J9M7K38q7j30k3k32M8K46J73
4523H9J35r7Pj33J99j41j00q4J32J14l97K18j2p9N1k0pM1M46k29k64N1j83J79
4547h4q3j37M13J62M4q6l12J21j83Lol4L42K05k81k70nJ71j2j12K07p4L50j07
$$ plain form
4385 59 108 -18 -94 -164 -24 -77 381 366 28 26 -145 -83 -296 128 -32 -156 -221 41 -245 -375 -537 -170 -67
4408 -67 -12 -122 78 100 -74 40 46 -157 101 141 -85 179 -40 -24 -208 -382 -130 197 -10 -20 317 -22 -327
4431 -327 -69 -138 -30 -9 286 271 46 -178 -24 56 -423 1 -120 183 74 154 -101 191 -330 24 -62 93
4453 93 235 146 -187 27 95 -38 -172 -44 -92 254 244 -133 -178 -30 -172 -288 -164 -201 284 301 -273 -30 32
4476 32 -46 -183 92 263 196 281 135 -64 171 -429 -45 51 459 265 254 36 141 -115 -315 66 -34 -28 180
4499 180 78 19 2 -151 -67 -249 137 -26 2 96 140 -146 -132 -210 -191 -144 94 7 -123 -146 -378 -330 -84 89
4523 89 224 127 134 1 200 59 -41 -125 7 121 -276 -58 -70 -149 -98 -118 -125 -84 362 133 -131 -80 -263 -84
4547 -84 -167 -304 109 271 315 229 -83 38 -145 -142 -148 -182 160 365 84 -186 -191 -20 -32 -144 63 -11 339 232
4571B32k21l9j94L69k95K12J66J35j93l3k30o7J92J39j2o6%l28K34l12L22q6j19
4594a94N78k27k09j9M7j38k6J69J33j9j44L48l44lJ87l71L9L30j61K20j91R0j53
4617e8K92l05J39j78L91J8J3k67pj27q2L05j79J86j9k27j16l6L10jj6j79J76j36
4641a03J94k23J02J13K00l46L86k65o6J31r9r8p9M84l18L96m15J19o8n7j56j5
4663a83M27j41K38k49j30r3J2J14K7m6k9O4J35n5l9k61j12K12j57L93J29j84j3
4686E9k7j45J47j65K20r3K8J05rl04K28O7j52J64r2j4o8K13l24K74r3j26J97M7
4710A37k5Kl80N0N64o63L18L2J4L1R2n9j89k2J23k67M90k98N14l32J35l57k92
4733c82L33k6J55J86K1k60q2j9Q4O1j86J15L30l93r1p6j75P0K36J81j26n9K63
$$ plain form
4571 232 11 -28 -222 147 -148 64 230 365 172 139 -91 -158 34 173 161 95 95 -233 1 -311 11 -75 -194
4594 -194 384 157 -52 -71 -24 -162 -188 -19 114 95 -49 299 -45 -48 139 -232 -193 137 -24 196 5 95 -58
4617 -58 234 -71 68 -110 281 299 312 45 38 -89 -171 134 -45 141 122 -105 -221 -257 53 52 36 -143 33 -103
4641 -103 91 -132 -30 83 283 -63 323 58 -8 123 24 -74 -153 331 13 409 -6 113 45 -12 -168 -183
4663 -183 244 103 341 92 -38 -131 -119 -5 22 -24 -53 11 146 91 52 -209 -321 -109 -266 127 256 72 59
4686 59 32 -113 34 -131 89 -4 24 129 120 -184 44 111 -41 123 31 17 -51 162 -162 112 19 -107 90 137
4710 137 112 114 -266 -216 348 -315 3 35 49 80 172 113 -76 -98 25 -242 248 -50 464 132 267 -90 -382
4733 -382 -49 -75 80 266 287 27 -55 -74 10 71 -115 0 330 -63 -154 -230 -405 -335 -99 82 -44 -103 160
4756A60j13j07q7J53J78J44j64j42%k60Q2J20j19j2J61m4N0P7n2o7j70L85j19
4779E4Q1J52j31j36k72K64o9J39Kp8NK70k51n9J11l76M09k19L81k62K27o0j94
4802a2k2k11L41o3j17J43J18j43L0k82L22j74n0M20J76l09j83M2k2p4J31J13m6
4825A28p7l31M68q7j21LQ7j03R7n9M1J04m13J71K5P6M8J0M1m48N1L23L7j66J28
4850C3k01K24%O5m6j26N1L7j74J90P9J4K4p5j51o2J23j62J22Q8J67J5k46M2oq5
4876f0J40l5O7n4M6l32M62j13j37J04m2j66J37l3L7j36j53M44o2J89j52j01l75
4899c25K44O4J90r3j3l0L2q3j7k13R4r7J52L65Kl10O4J6o1j2J93k3J07l15Q5k07
4925a91P2r7L48J01l66L38k43K75l40O2l6N0M01k56j69K10k09j95M8K74l15K96
$$ plain form
4756 160 47 -60 -147 6 184 328 164 22 22 -238 -156 -36 -155 -167 -6 -50 0 77 25 -42 -212 173 54
4779 54 135 287 156 20 -252 12 -57 82 84 6 11 281 30 -29 82 -294 115 -104 277 15 242 182 -12
4802 -12 -34 -245 96 33 -84 59 177 34 64 -218 104 -70 -120 300 476 167 -16 26 4 -70 61 174 128
4825 128 51 -280 188 101 -20 -17 70 -33 64 5 46 150 -263 -92 -67 9 57 67 108 -340 -289 34 71 -95 33
4850 33 -168 56 56 121 75 -51 0 37 -137 53 132 146 170 95 -56 -118 5 -157 -35 53 220 235 -11 31 25 -60
4876 -60 80 45 112 58 104 -228 234 121 -16 88 46 -120 17 -16 21 -115 -268 176 114 303 151 50 -325
4899 -325 -81 -17 173 80 67 37 69 -14 -31 -244 -150 -247 -95 270 272 -38 26 42 -19 -31 162 139 246 -69 16 -191
4925 -191 -119 -216 132 233 -133 205 -38 237 -103 -41 -77 -27 374 118 -51 159 -50 -245 -197 77 -238 58
4947E8o2k42K89K4Q6k28P1K48j08L0j61R7j82j64M56l55K72P1O3k02J43O3r5k53
4971h1j61N00j37j22L14n82K86k11j1n5L70k40K28j14K87j27k79N5%J44R7Q3%
4994B44j54K6k43J54L6K77l19QK34l40k4n2K02l43L77l4l35O68n59O3J57j26J67
5017H4Q2j97n0J95j68J30k27K3J68j09OK1L2j27m5j87N29o0j53J56j2r2j23Q7
5041c7K8N7m8J45R8j69n4j05J78j04j20K48k3k0J33k22K1m30J94K58K53m0k71
5064c0J60m3m6k04n9J24J38Q0O3k46J6j6r1K24N2n3O7j07J20j22l3j69J41J6J18
5089A00K55m70J31m3j18Q6j39N8M38m9q0J38l41r5k7Q6K43m7p7k89K41J98j70
5112B9L8o6k13K07K3J09l6k3k17p3N7K22p6p3K09Q7l45J80n3m6J03L4P3j39rK45
$$ plain form
4947 58 -4 -246 43 67 153 -75 -4 244 136 166 5 102 -80 -244 212 -143 129 200 263 61 204 267 172 -81
4971 -81 -242 258 121 -1 313 -269 17 -194 -205 -260 110 -130 98 -16 271 144 -135 -80 -80 64 161 244 244
4994 244 90 116 -127 27 63 340 21 29 263 -77 -101 -153 49 -294 83 49 -286 382 -177 -114 43 -83 84
5017 84 166 -31 -81 114 -54 76 -151 -128 40 -69 -63 -42 -10 -137 -182 -369 160 100 -53 103 91 -1 -124 -37
5041 -37 -9 48 0 145 243 74 20 -85 93 -11 -131 117 94 74 207 -15 6 -424 -230 28 281 241 -30
5064 -30 130 87 41 -163 -222 -98 40 120 183 -63 -47 -63 -154 70 122 69 136 29 149 27 -6 -175 -34 -18 100
5089 100 355 -115 16 -27 -145 -59 -198 -140 298 249 169 307 -34 -129 -156 -70 173 126 49 -240 1 199 29
5112 29 67 1 -212 -5 18 127 91 68 -149 -222 -165 57 -19 -92 117 204 -141 39 -14 -60 43 77 150 11 2 247
5138B47l93L3M9K05jM1j41Q3k91K86l71O3K33j8j3r2j33R6K25j72k80L45O1R4
5162A56P0o22N76l90K95J29n3j43pr9J48l5m8k9L64mk10o4j64J55Ln2j74K6L09
5187A37l7l11J53k5j76K43J8K0J52j96R9j0J52k64J41p9J86n0k82K18Qj83K68
5210A82j08q9j4J72L6l08L0M0l0P0K23L8j54r8j38P3k35L02J5L3l2j29J23L6j49
5235a11L1O6m1K23n0J8j23q2k89L44p2J7J44q9N9R3j51r8Mq8L43J0m40J05J69
5260hj4j24j22J82R1p8j1K96k55K30m60M11n12N66m28J56J40l10j13K55j83J69
5282a22j32J30J93J72j70k79J68n0J63p2K58L3j28j80J21j66K39j19j14K50j62
5303C3j27J45j95m5K08J46jK0Mj52K23l81R6L6j1R9P2k57Oj26J82J28l5J54p7
$$ plain form
5138 247 -146 -113 -64 141 140 181 40 123 -168 118 -253 -190 43 25 12 -80 -213 -117 108 -64 -344 1 62 156
5162 156 226 -396 180 -210 85 214 161 18 11 -88 60 25 -23 -52 312 308 98 34 -130 25 28 -24 -198 -172 137
5187 137 100 -211 -58 -83 -259 -16 2 22 174 -22 77 67 219 -45 96 17 203 153 -129 89 97 -86 182
5210 182 74 -15 -29 143 179 -129 -99 -59 -89 -19 204 242 88 -10 -148 -75 -310 -8 7 40 8 -121 2 38 -111
5235 -111 -80 -14 -55 168 118 136 13 -69 -358 -14 -86 -69 75 -14 45 138 -13 -111 -107 -195 148 158 -282 -177 -8
5260 -8 -22 -146 -268 -86 5 -73 -84 212 -43 187 -273 138 -374 192 -236 -80 60 -250 -363 -108 -291 -122
5282 -122 -254 -124 69 241 71 -208 -40 -90 73 1 259 292 164 -16 105 -61 178 59 -55 195 33
5303 33 -94 51 -144 -189 19 165 164 184 188 36 259 -122 -26 10 -1 98 170 -87 -81 -207 -25 103 68 222 145
5328A45j31J60k68J08k13K32O0J0O1n6j09j92L04l92K06J14J28j70J07j99k0L20
5350B05l04K49k87j70J05J14P9Q8l3j48n7K6M8L5K13j39J69j7J33k08o5k77M56
5373B15j14k70lN3k5K56l56J86J07k4j62n2K21j13j97M19K8j67J5n5M1r7K05k45
5397a34J25N7M7k35J83K3k89J91Q3k92O56k17k37J86j37k78N3M45n8j39K5J3n8
5420A3j75Q3j13K56j9K05l10PK56l6K01m46%k26J88J97P7l84J01p1L97j15k03
5443a17P7p1M64l56J1P4k3r8N4m8P7j85O8L22m25J79O7k0j25J94l3ko8j21J51
5468D6J78l29O3l7K2L8j59j70K72O7K6J88j28n0j84L48j78M2L9J3J6k48M24l70
5492g1l6J80k37K53R6R4m20L3O2r7P0M9J0l6N3l%K05j51r1K34k65L8J85k50l88
$$ plain form
5328 145 14 174 -94 14 -199 33 93 103 164 108 -1 -193 111 -281 -75 39 167 -3 104 -95 -115 205
5350 205 -99 150 -137 -307 -202 -88 -9 79 46 -102 -159 -133 -85 -50 163 24 193 176 309 101 36 -241 215
5373 215 101 -169 -172 -119 -144 112 -244 -58 49 25 -137 -189 32 -81 -278 141 169 2 17 -38 3 -94 111 -134
5397 -134 -9 48 95 -140 43 66 -223 -32 51 -241 415 198 -39 147 10 -268 -215 230 172 33 58 71 13
5420 13 -162 -79 -192 64 45 250 -60 -53 203 167 368 -78 -78 -304 -116 81 158 -226 -125 -196 201 86 -117
5443 -117 -40 -111 353 -3 8 82 59 -39 15 -33 44 -141 -73 249 -176 3 70 50 -75 119 86 84 16 -105 46
5468 46 224 -105 -42 -79 -57 -19 -178 -348 -76 -9 17 205 77 27 -157 191 13 55 94 107 123 -125 299 -71
5492 -71 -107 73 -164 89 185 279 -141 -108 -46 -143 -73 -24 -14 -50 3 0 0 205 54 -37 197 -68 -30 155 -95 -483
5518d83N38n0Pj23Q2P8r1K7l07J32K08j65o6J93j33J48q3l3J21l3MK18k83J39
5542D5P4j40j8j3M1p9j5K93j57k59P9J01J23k35J81J26j99J8J53j21j4kJ1j9k7
5567e3j11j03K08k9K5k31J54J87j12J74N0j94K25j60m6j17K76R0l76J50L4J0j50
5590i9l3K56J43k15J18Mn5j12j35o0K51J98l83J6Q7j38J25J77j35k97J85j6j40
5613b58J14K74Rl35J14Q4M4K8J50k95PK15k72k86M79m3O1l9k31K49j6R4j23P0
5637I4pk45J62J22k36J20LL9M5Kl51K13j93J59J86n11M77P5o8o7l44L95k36J14
5661e2J59J8M3j85K2J06J15l37j87L97j80J02R8j51J59j64pJ75J62j54k26J91
5683A04K2j74k01L64k74M49k30m75K13L21r9k86L93m3k30L36l30J38j6K3K9k44
$$ plain form
5518 -483 55 5 12 -111 -29 49 -42 -15 -322 -190 18 -147 -213 -20 -153 -5 -88 -121 0 -33 -29 189 -94 45
5542 45 119 -21 -39 -52 -11 -90 -105 188 31 -228 -149 -48 75 -160 21 147 -52 -34 119 -2 -16 -18 -7 -26 -53
5567 -53 -164 -267 -59 -88 -63 -294 -140 47 -65 109 159 -35 190 30 -16 -133 143 233 -143 7 41 51 -99
5590 -99 -132 124 267 52 170 174 119 7 -128 -188 63 261 -122 -106 -19 -157 -32 145 10 -287 -102 -118 -258
5613 -258 -144 130 139 -196 -82 2 46 74 224 -71 -64 151 -121 -407 72 29 90 51 -180 69 53 147 24 94
5637 94 87 -158 4 126 -110 10 13 52 97 99 -252 -39 -232 -73 113 -398 79 154 86 19 -325 70 -166 -52
5661 -52 107 125 168 -17 5 111 226 -111 -298 99 -81 21 119 -32 127 -37 -44 131 293 139 -87 104
5683 104 126 -48 -249 115 -159 290 60 -415 -202 119 20 -266 127 84 -146 190 -140 -2 -18 5 34 -210
5705b10J02N8J27k4k03K02J8L2k64JR1K42o4J03l26J15m7o1J61q9J7j54L08l35
5729b00N8K36o4j29L6j30P6L3M5J9j49K29J26j7l6k12J71k74J95r6J88k43K01
5752F3L7k13k48K03J71Q9j07K55l90L47p5k01j9j50J32op1n8J44K10j00K22l52
5775a17O2M2l2K69q1l36J00L31j05k76K40j33j66N22n82K83j91J91l29M67p1o7
5797B1L04p5l70L16j44J62l31j05K06K3j06P1k1O5j85L92j39L24n76M56k19m2
5819B7J10j99J84j22%m01L26K03k68K10j20J34j28q7K54k31J04j87J01jJ0P9J8
5842A6K31l39K37m73K71j57K95j4k17N1J24p3m3N5k20L56j70O6l1r6k8M02m76
5865b33Q8K47k43J95r3J12J8j1K13k60J79l18J70j36k2Q6l5J14R4k51L79k16k8
$$ plain form
5705 -210 -108 -50 77 53 -150 52 70 102 -162 -161 -70 172 108 211 -115 0 -47 -108 53 -36 -19 -173 135 -200
5729 -200 -142 94 30 -99 -63 -193 -117 -84 -39 -20 -169 60 186 169 133 -79 92 -182 13 -83 105 -138 63
5752 63 100 -113 -361 -158 13 102 -5 250 -140 207 132 -69 -88 -238 -106 -112 -183 -241 -97 113 13 235 -117
5775 -117 -55 -13 -45 224 143 -193 -93 238 133 -143 97 -36 -202 320 -262 21 -170 21 -308 159 88 21
5797 21 325 250 -120 196 52 214 -117 -222 -16 7 -99 -28 -49 16 -169 223 84 408 -168 288 69 27
5819 27 137 -62 122 0 0 -401 -75 128 -140 70 -50 84 -44 -131 123 -108 -4 -191 -90 -91 -81 -2 16
5842 16 247 -92 145 -328 -57 -214 81 67 -150 -99 25 -48 -91 -36 -256 100 -70 -4 -35 -131 -159 243 -233
5865 -233 -145 102 -141 54 -39 73 91 80 293 33 212 -106 64 -72 -94 -8 -43 71 165 -86 293 77 49
5888D9j83K7K69k35J31Q8l89L82k66J23j29J80J4K8p9J26Ll78Q5R7L14qk70n8
5912g9r6L15r2J96j66p9J45j16jj20J36j24O0n1o7J11J10K6j8l23K57K2m9M1K8
5937F6Q6m1Ok09J95j92k9L6O2J26Pj98r5K49j01j80N9N08l27J73l22RO2Q7K8j92
5963a27N5o2N0k8J79o9K35l02q0q6J85p1J33o4K66l14o2j7K10K16m56K88j54Q3
5987Hj10q0n2K89J44k64L7n3m8j58J94m5K12J42l29P1J35L4K2K2k39K64k16K85
6011B65k70k34J89K66j91K16j76j11q8J87K3k73K59q3K53k51q3J10r0PQ0J41q7
6034E9k30L03k28p6J9K05j44L7J68k7MJ41m79J25O1K63j11L2m7p1j63K70k09N3
6058d5p8M10k36Q8o8r7N7k41R2N00k22j0k2j06k5R1j95j83N1J1K24M1J41k36j82
$$ plain form
5888 49 -134 -107 162 -73 58 146 -243 139 -127 -4 -133 47 61 89 10 136 139 -239 -154 -57 257 249 -21 -79
5912 -79 -175 140 48 244 78 -1 144 28 27 -93 43 -81 -21 -72 -139 -28 82 108 90 -233 24 46 -3 38 66
5937 66 152 111 117 -92 103 -89 -118 -82 -20 106 113 -85 -180 69 -32 -212 -153 355 28 201 -121 -112 -50 37 65 -127
5963 -127 -72 -134 -84 -112 67 -2 233 -69 -149 -235 -50 -121 12 -52 214 -100 -162 -179 31 247 -209 79 -75 8
5987 8 -102 -182 -234 55 199 -65 -28 -81 -129 -287 -93 -138 74 216 -113 -42 93 127 149 171 -68 196 -20 265
6011 265 -5 -239 -50 216 25 241 65 -46 -134 53 76 -197 62 -21 232 -19 -102 8 -82 -75 5 146 59
6034 59 -171 132 -96 -172 -153 52 -92 -55 113 86 90 231 -248 -123 -62 201 90 122 75 4 -159 111 -98 -45
6058 -45 -123 287 51 139 71 -26 31 -210 -118 382 160 150 128 22 -3 88 -107 -290 -239 -228 -4 37 178 -58 -240
6083b40J39K75p6K07l83m0J44l56L56o6j09q4L39k1o5l3j8J34j17j63J20J14j36
6106g9PJ52j92J62q7l7p1J5M8M81k54l6l69J93J11k65K52j11K08k6j92M2K45k83
6130h6j74L25N7k68K01L6j67k44L97j11J2K13r0k24N0J13l33J54J07K7j78N4J00
6153b9j51K39o7r2J26J33k57J76l1J43j59P0j22L0k10M0K09j74n8j3L10k49K94
6176A58J2M7m48N2N8k39J41M03j09l7n4J25L6j31J79k04j41L23R2k43J50q4K5
6199A11l98L29k2L6j51o1L24J6r3N0j91q4M31k22r0J38K7K1p3o9N2j54k2P5pJ94
6225A67r3k07L27n1j30k0k2J36k75J30R9k10J77J88l9k84K76j27r3k4l8J0j54
6248b57K15M4l7r5K60m7O1k74J0j63L8J6J16K68j30k0kj66R6M25m80K00q8P7k35
$$ plain form
6083 -240 -101 174 98 305 -78 -118 26 -330 26 -40 -149 -233 106 85 20 -13 -31 103 -14 -177 -57 57 -79
6106 -79 -72 80 -112 50 -37 -74 -145 -130 -82 399 145 109 -260 -67 44 -221 31 -80 128 102 -90 -48 197 -86
6130 -86 -260 65 122 -146 55 91 -76 -320 77 -34 -22 191 101 -123 -73 40 -293 -139 -32 -5 -183 -129 -29
6153 -29 -180 59 -8 -100 26 159 -98 78 47 190 31 101 -21 9 -201 -161 48 -126 -184 -197 113 -136 158
6176 158 170 217 -231 -179 -121 -360 -219 184 75 38 -16 109 145 14 193 -11 -152 171 263 20 170 86 111
6199 111 -287 42 20 56 -95 -156 168 184 91 141 -50 -134 297 75 -15 123 150 171 98 29 81 -73 -95 -20 -27 167
6225 167 74 -133 194 143 13 -7 -29 107 -168 -38 61 -149 28 216 177 -107 169 42 -51 -75 -113 -103 -257
6248 -257 -42 2 -35 -130 130 83 144 -130 -120 -283 -245 -229 -113 155 25 5 3 -163 -67 358 -122 78 -10 67 -168
6273a68K20J60l40J23l2oL3L7J28J7k24qK36k88Q4J25l0J5q5K40j07j57m4K44
6297A73k82J44J42k10J66J6j84N0j40K80m3O9k78J71j71j1K07j37N3qK0J40l22
6320a55L39m05K67o4p1J87j26L16j14j22Q0k43K66k35r3K91l17J05Q0NO9q8m7
6343g5J24R3j67P2k60K47j90O7K33k70Q6LJ35J2p1m7%j25k8J87P4q3J40j22j6
6368A9K17l24L6J33k5q1J19j84K56j48L4o0o5o3L74m05K08k36K04J86k13o4J11
6391B9n9K0o1K64J22j96j50L17l46j74K60j24K41r0j13j64K63K3j99J14j16pN0
6414i6P7J57j66R8o0m6L36j53q2j4N9J8j14k16J16M23j62j56M5M3k10K11j89L20
6438B39j38j46K47j34r1J47J2m24L13j85K00j17j43K92R9k97P3k17K72k16L07
$$ plain form
6273 -168 52 212 -128 -5 -37 -43 -10 27 155 172 -52 -60 176 -112 -28 97 67 82 -3 237 130 -27 -71 173
6297 173 -109 35 177 -33 133 149 -35 15 -125 155 112 181 -97 74 -97 -108 99 -38 15 7 27 167 -155
6320 -155 184 -221 46 -18 -89 98 -28 288 174 52 132 -111 155 -80 -173 118 -199 -94 -14 -9 60 -28 -75
6343 -75 49 142 -25 47 -213 34 -156 -89 144 -126 -40 -37 98 110 39 -8 -8 -133 -161 26 100 17 157 35 19
6368 19 236 -88 -52 81 56 -25 94 -90 166 18 52 -8 -73 -136 238 -167 41 -195 9 195 -18 -82 29
6391 29 -30 -10 -71 193 315 119 -31 286 -60 -234 26 -98 143 53 -60 -224 39 62 -137 -23 -139 -146 -96
6414 -96 -19 138 -28 70 10 -36 300 147 65 51 110 128 14 -202 -86 337 175 19 64 107 -103 108 -81 239
6438 239 101 -45 202 68 -23 124 136 -288 25 -160 40 -77 -220 72 171 -126 -53 -270 2 -214 93
6459I3j48k03K33n3q7N34j84j65j88K3K6K04j00L4j37L60q4m88L55J51j99k39
6481b62M22k8J44r4J35l71K41j60Nk3k01J51J00k05l1J34J34r0L6Po1n8J51M1
6505A17n3k09J08Nl0J10j37N2j23J12j33K27k11J35J1N6J22k51Q4J55J8k19Q1
6528B7MK24m19j3JP6K71No21M43l3J37m48L39K03k72j41J2M19m82K1J67J6L24
6552B60o24L38N8J13k06J44j16j30J68J07L4m5k79J87J6P8p8Lq2k0q4O5K78k43
6576e8J34j85J59J90l15J66o4j44K19k05j9J62L09m28J53K4o3J97n06L88j81j50
6598b17J95L8n7pj43M5K09Lj56L7M9LM6K00k76j37L51lk51J35OJ99l76j46K76
6623B3M3j52L0K35k55J26k28lK95m41K78l1J92j45K81m51N7J59j47L00k24J43
$$ plain form
6459 93 -55 -258 -25 -78 -165 369 185 20 -168 -145 -119 85 -15 19 -118 242 158 -330 25 176 -23 -262
6481 -262 160 132 276 182 317 -54 187 27 32 9 -192 -41 59 -146 -177 -43 91 1 37 44 -17 -75 76 117
6505 117 64 -145 -37 -32 -62 48 -89 -37 -160 -48 -181 46 -165 -30 -19 37 159 -92 -8 147 165 -54 27
6528 27 31 255 -164 -177 -176 -100 171 176 -445 -2 -35 102 -346 -7 196 -76 -217 -205 214 -268 -247 -80 -64 260
6552 260 -364 -26 32 145 -61 83 -33 -163 5 112 146 101 -178 9 25 103 25 28 -54 -74 -158 -93 185 -58
6576 -58 76 -109 50 240 -75 91 27 -117 102 -103 -122 40 349 -79 74 98 35 232 -274 114 -67 -217
6598 -217 -22 16 -41 -48 -191 -146 63 66 -90 -53 -4 -1 45 245 -31 -168 183 180 -71 64 70 269 -107 -253 23
6623 23 66 -86 -56 179 -76 50 -178 -181 114 -327 -49 -80 112 -33 248 -203 -146 13 -134 166 -58 85
6645H5J04j46J36l96L22j37rP0Mj2j08P5j67M63n03M34k73R7M0J13J4j70o3j32
6669a59Q7J09q6K25k36j8M37l06L9k65L21K6j51j14J70k0m23K81p4K42rl19L20
6692G7P8k08K30l25J44o8K3K01j90j37J75j24L68m72L90MK1n4l19N88j49j08l37
6715a92J48K68r3k76J10k67N84n20J28K89l40L53j06k03j7K6J48j52q9Q4K47l33
6737b03J65j43L24J63k97q8K10j09k00Q7q6J27K4J62j3k23p6J16K68j24j00j57
6759a73L90j05j64K69k81p4L59j26J9l25Q8K93n2R1l41J02Q6j02L1k34L50l03
6781b02K83n1k0j58J29J7O2J55k97J23N7j84M2O0k11J22j43J56r7K65k53K12M0
6804A07j83p5J13K08k63J16J23k85K68j26k21M21j29O4k61Q3j8j3L41l61o8K57
$$ plain form
6645 85 189 43 179 -217 105 -32 -41 29 33 21 -87 -12 -179 284 -219 215 -58 39 79 192 206 36 -27 -159
6669 -159 -72 37 -49 176 -60 -78 359 53 92 -173 148 174 23 -91 79 59 -364 -83 -157 85 76 -243 77
6692 77 155 -53 177 -148 -4 -72 -49 152 -38 -175 0 -124 244 -228 162 166 187 133 -186 402 253 145 -192
6715 -192 -44 224 131 -145 -35 -302 282 -238 -110 179 -161 192 86 -117 -134 -108 40 -112 -201 -117 130 -203
6737 -203 -38 -181 143 306 9 -79 131 22 -178 -91 -177 -50 -26 136 123 -100 -176 -60 208 84 -16 -173
6759 -173 217 112 -52 217 -64 -138 221 95 114 -211 -123 170 118 209 -132 -30 56 -46 -15 -249 101 -202
6781 -202 81 30 10 -148 -19 -2 60 215 -82 41 98 -86 -44 16 -195 -73 -216 -60 -157 108 -145 67 107
6804 107 -76 -151 -38 170 -93 23 146 -139 129 3 -218 203 74 138 -123 -40 -58 -71 270 -91 -159 98
6826I8k93%L45k76O2m3J25L8m9K32j28p3K0j56K4n2n4J09qK94j57o3k5K02j59
6851A3O7N0j12k5J55j32j37J33j60M48l99k2K99l07M9K9L6Q2k08R5l00K73j5J19
6875C1K01k12k5j14J54j47MJ04m7L13q0p4j55j85L05n39O81l23K75O7j14k73J79
6898B6J05j69j12M40k43l5n3l21J84K07j13j19J53m7N6j44J84%J6n2K68r6J8j37
6922A6nm6k66K25M1J30J37j96m1k8n5L39m41L49j22K7k23K93q6L24k25Lj43j0
6946cj03m3k2J71J1K47j40o5k8J49k31P6K71l99K92j28P2m0l5M0j26M1R7K6j50
6971b0j3j5J03P5l58M42l71j6R9K00j11J84m24J56K02k75J18k01M67k32j00J62
6993G2m8J20O7l06J91Q8j06j86J47j92K33n2k15L12k42J84M1k60J79j06n6n5J51
$$ plain form
6826 98 -195 -195 150 -126 -64 -107 18 56 7 239 111 38 58 -98 -74 -126 -180 -71 -79 215 58 -5 -30 172 13
6851 13 80 130 18 -7 148 16 -121 12 -148 300 -99 -121 178 -129 -80 -51 -15 67 -141 -46 -346 -73 -88 31
6875 31 232 20 -5 -119 35 -112 -108 -4 -51 262 182 108 -47 -232 73 -466 215 -108 167 234 120 -153 26
6898 26 131 -38 -150 290 47 12 -41 -362 -178 29 -84 -203 -50 -97 -41 -185 -1 -1 15 -37 231 135 153 16
6922 16 11 -35 -301 -76 -35 95 232 36 -5 -33 -88 251 -190 159 37 64 -159 134 48 372 147 150 7 -3
6946 -3 -106 -149 -171 0 11 258 118 53 25 174 -57 19 290 -109 183 55 127 87 52 92 -34 7 104 130 -20
6971 -20 -33 -48 55 130 -228 214 -157 -173 -74 126 15 199 -225 -69 133 -142 -24 -225 242 10 -90 72
6993 72 24 144 211 -95 96 184 78 -108 39 -153 80 28 -187 125 -117 67 108 -152 27 -79 -135 -190 -39
7016c9Qk69K39j40L63j07j35J31J00L0l26j8M1K97j84MP3j58J2J33j11J53l31
7039b34J14%L35J8l3Lm02J09K51m8j40J63o4j09K04m07J39K01J32k71L26k62j42
7062a17J43k04J51PM1L0m3l7l6J58j09J03j69K01j52K44j54p3j85L49k14J46l28
7085b48M41r3J16k46j29K90j15r9r8RK63L8j13J3q2nR3j36K28q7K20p2k56J37
7109F9n5K08P4K6l17K17Q1l96R9J01J35k13j29jO4q8R3k63L98RJ33k12l5k72M03
7134A29j46j41J65O6P8l09J13j56K24J31j97J10o7L2r6N2j10L3Q9K46l11K17Q6
7157B38q6j65k2k02K42k76K68K46l89M54l19K7m9O7k84J05K63j82%L7J05l9kJ89
7181B26k52J41j3J7k0n9N3j4jL4J51n53J39M11l82m4L78J9k85J39k84J57O3k33
$$ plain form
7016 -39 -31 -300 -61 -201 162 55 -80 51 151 181 -145 -163 -122 175 -9 -5 68 -90 -78 55 -56 97 -234
7039 -234 -120 -120 215 233 200 203 -199 -90 161 113 -27 136 72 -37 167 -240 -101 100 232 -39 287 25 -117
7062 -117 26 -178 -27 -20 21 51 8 -29 -65 93 -16 87 -82 119 -33 211 57 -16 -201 148 -66 80 -248
7085 -248 193 100 216 -30 -159 131 16 -83 -181 -172 91 129 16 29 -53 -58 35 -101 127 40 260 188 -68 69
7109 69 14 222 296 322 5 222 303 -93 6 107 242 29 -100 -101 -37 -125 -32 -295 103 112 245 33 -2 -274 129
7134 129 -17 -158 7 73 151 -158 -45 -201 23 154 -43 67 0 32 -64 -12 -122 -89 0 246 -65 152 238
7157 238 152 -13 -35 -237 5 -271 -3 243 -146 308 -11 16 -33 34 -250 -145 118 -64 -64 -27 78 39 37 226
7181 226 -26 115 102 119 99 40 93 79 78 112 263 -290 -151 260 -122 -166 212 231 -54 85 -199 -42 21 -212
7205b12L23j49k6M4O2P1k7k74P8j05J10m4J26R0J7l0k8rl3l5R9j09K12k77J99
7230G3Q1p8j17j34L18p0R4j56j84K06J43k97K78r6J7k51K57K8j66k06K50q1j42
7253b33N00k70o8J4K06J36l36K3R3Q9l93mN24n88M07k86K22j5j08K22l91K41k78
7276b93L07L60k14j35k2r7J6l7J55j03P8J50k22J51N5l06K97j21k04K40k74J36
7298h3m7K87k30k8j10M05l71J77q9J42J58j38r6j77MQ6R6K05j51j87M24j40J92
7321C29k21m19K68k4n4j00K34J21j16N3J83j46p8m4J10l62J36J66l61L68k70K66
7343C9R8p6n4j1J23k15J61P1J4l04r0K21j24Q5K94k85J45j41K6M8P5m3k94K15
7367b2j06N99n78J12m5j27M6m6J32J69j72%K8m6K8J24m1j42L05k22j45lM12j86
$$ plain form
7205 -212 111 -38 -64 -20 42 113 86 -188 -110 -215 -105 -149 -23 67 84 54 26 17 -16 -51 48 -61 151 -126 73
7230 73 154 76 -41 -175 143 73 167 11 -173 33 176 -121 157 61 78 -173 84 112 -54 -260 -10 -91 -233
7253 -233 267 -3 -71 -57 149 285 -51 -28 65 154 -239 -243 281 -307 100 -186 36 21 -87 135 -256 -15 -293
7276 -293 14 374 160 25 3 -94 -78 -115 40 -63 15 165 -57 94 149 -157 140 19 -185 55 -219 -83
7298 -83 -130 157 -73 -101 -211 194 -177 0 -89 53 211 73 -23 -200 -196 -110 -14 191 40 -147 277 137 329
7321 329 108 -311 -43 -67 -121 -221 13 134 18 71 254 108 30 -14 96 -266 -130 36 -325 43 -227 39
7343 39 137 61 7 -4 119 -96 65 136 150 -154 -244 -23 -147 -62 232 -53 92 -49 -23 25 100 57 -237 -22
7367 -22 -128 471 -107 5 -40 -167 -121 -167 -35 134 -38 -38 -10 -56 -28 96 55 -87 218 -4 -149 -152 260 74
7391G4j54J80Q3k39J46K1k43o1j64L82j36M61r2l97J27r7R7j27j88P08j89k56
7413f4J86q0k96M79k70j39N73l58l2R0j40r0K21j26L9n4K56n45L22N5j19J83J9
7436A10N3pp7j89J56m6L6J06K0p5Pr5m02N06R9l87Q7R6PK7k59m4J34K96l76J28
7462h9N4o5L5K41j36n7j45k03M96j89J07j69J50k63N20m29k1J07K6J92j25O1L2
7485A30k80L16j24Oj32o8L52k55R5j31O9K22j93n5J11q6J56N3k73J02j69N8K48
7508A52j47k0p5K81k10j37L13l09n8J81j41K09J6j95J04K47k64j26L17j69L8M1
7530D8k11L79k32M37k45j53M12l48K6l66J57L06l64K20L26m60J2r0L72n9k64Q1
7552a6j02L2J16J34k34K45k01j04J64l56M13M3j40j24J61j1O3K4p8J06j30m7j22
$$ plain form
7391 74 -80 100 183 -56 90 111 -132 -193 -357 25 -111 350 258 -139 -12 -109 -12 -139 -327 381 192 -64
7413 -64 122 42 -254 225 -45 -184 389 31 -1 89 -51 -141 80 -46 -7 -61 195 -350 -28 27 -92 91 110
7436 110 163 156 79 -110 46 0 36 142 162 87 94 -1 -403 103 202 -185 -98 -2 5 32 -227 -271 -137 159 -217 -89
7462 -89 -35 -100 -65 176 40 -17 -162 -365 131 -58 49 -120 30 -233 287 -142 -163 -56 -30 162 37 98 130
7485 130 -150 166 42 48 -84 -152 200 -55 40 -91 -22 200 7 -48 63 -23 133 186 -87 15 -154 -96 152
7508 152 5 -15 -90 191 -19 -156 157 -152 -210 -29 -170 39 55 -140 -36 211 -53 -179 138 -31 7 48
7530 48 -163 216 -16 421 176 23 435 87 113 -253 -96 210 -154 66 392 -68 -56 -146 226 167 -97 -16
7552 -16 -118 -86 30 164 -70 175 -26 -130 34 -322 91 134 -6 -130 31 20 83 107 29 135 5 -42 -164
7575a64K35N0J42l64J76N4k74q2M38j76Q8p6L5j38k4j17K37J87l30K8O9q1L1j7
7599g3r4J19j0q9J93L9n8k0k36L91k26J20p0p6J84o6j6K2k09K4k5K15n7p2q4O7
7625a07p9M0l7J65j77P0J96k10J62Jj40R0K57m47J39J08K13j94K41m74K48j35
7647g0P2J03p5R1n9K91l22J4j42j6K56l07M78k18r4n4n5P2J45QN1k81J03O7q6
7672b8o2O0o0k6J49l4J97j51Lo9j77L22r2j16K38m26M41p9l5j96K68q4R4k34J75
7697G8j95O5J24r7K11P0j41q8Q4k0L5j76M7k70K20J07K9%Oj14j39J53J03j71J03
7722B4P1P4j46m1J86j92QL2j05J60J37j15J12n30K60k4J56L5j35K38M1j93m8k7
7746b2k7J3Q0k01J93l94L47J14l64M46l6k48K53k54k09J61K15l95M39m1j42k00
$$ plain form
7575 -164 71 121 263 -101 75 129 -145 -227 211 35 123 47 82 -56 -80 -197 40 227 -103 -75 -6 -87 -56 -73
7599 -73 -167 -48 -58 -147 46 85 27 7 -229 162 -64 56 -14 -90 94 28 12 34 -175 -151 -176 39 -18 -90 -174 -107
7625 -107 -186 -146 -183 -18 -195 -125 71 -139 23 24 -116 -26 231 -216 -77 31 244 50 291 -183 65 -70
7647 -70 2 105 30 121 62 353 31 45 -97 -113 143 -164 314 96 2 -52 -107 -35 110 118 169 -112 -9 58 -28
7672 -28 -90 -30 -90 -116 33 -1 196 45 48 -21 -198 124 32 -84 154 -272 169 90 55 -141 127 43 137 -97 78
7697 78 -117 -52 72 -25 186 256 115 27 111 91 126 -50 -3 -273 -53 54 83 83 89 -25 -164 -11 92 -79 24
7722 24 95 169 23 -18 168 -24 -16 16 -89 71 208 93 205 -325 -65 -89 67 102 -33 205 246 53 5 -22
7746 -22 -49 -36 44 -157 36 -358 -11 103 -261 185 149 -99 154 -100 -309 -148 67 -328 111 70 -72 -272
7768b72K00j70L27j81Q0L32l91M0k66M26j21j06J92n2k84K49j14L74Q3m55j78
7789b87M16l97K37p1J03J88j16k31M0Q4J38k81J92j10q2J61n6l37J66K79K55k82
7811Ij97K19j10P0K12l76K97k78J25k53K78J85q6J24j55k8q4k5N4Q7j16n9K33
7834A26kq4j78J14J38o8k75k4M19j41J12k50J81k13J02j6J22J36R9q6l92K39j9
7857D0K8j36J70j88K20O6j48p0Q8p0J01J61m11J42J39j41m6J43J09k19J77k67
7879a12K15m1j9J4q3J62k69J55O3j65O2j91J90l28O28j85l3K8p2k61K38K06n7
7902A45k32%K08m2k03K94l83K06o7L18j56j06O1o9L1J5j39J0L94j41O6j89r9J65
7926H7J36m27J83J8M0j73K08k61K78k20j9R1J59k12J77j15J34j39J02k4j55J33
$$ plain form
7768 -272 -72 -242 85 -96 -16 316 -75 -35 -301 125 4 -102 90 38 -246 3 -111 263 346 -109 -287
7789 -287 129 -268 -31 -102 1 189 73 -158 -118 -34 104 -177 15 -95 -177 -16 -72 -409 -243 36 291 9
7811 9 -188 31 -79 -9 203 -173 124 -154 -29 -282 -4 181 95 219 64 36 -48 -73 -19 68 -48 -107 126
7834 126 124 40 -138 -24 114 46 -229 -253 166 25 137 -113 68 -145 -43 -59 63 199 298 212 -180 59 40
7857 40 68 -68 102 -86 134 200 52 -18 70 0 101 262 -149 -7 132 -9 -55 88 197 -22 155 -112
7879 -112 103 62 43 57 -26 136 -133 22 85 -80 -18 -209 -19 -347 281 96 63 91 19 -242 -4 202 145
7902 145 -87 -87 121 79 -124 170 -213 -7 -74 244 88 -18 43 -26 5 20 -119 -109 285 144 210 21 -78 87
7926 87 223 -204 -21 -3 37 -136 72 -189 89 -131 -150 -59 100 -112 65 -50 84 -55 47 23 -132 1
7948AK43k46l04L10n8M8j65L29k45K10J06j6q2j67M1j75oK05j78J1K65K7p9j92
7972a17k3J47J24n5J7k49k6L17k51K6q4L67k08R0j17P5Q0K8j29j38J98q7pJ72
7996A50j6j80j1Q1J54j79j26J03j25L15j14j47m8L42j31j96J20J0j65R8J50l32
8018b47J54L03l19J57J4j54j40K89o8j28K3K27qj90L40j38J2j86R7l33N96j29
8040A72j97J00J09k77k34N72j17j95j16p5K25p8p8R6Q9J59j54K5j66J70N5O7j6
8063A36j63J14k33J82n6P4l7m6k38K01J54j74K18l16J33J62j88J35J41Pj93j7
8085dJ30k15N2L5J08j00p8j01M8J81K34k27k21R5J89J02j67J59k16R2l3L09j38
8108B34j71K76n59O9L47m36K15J24k77K98L3l01O3J1L57k70M2pj43K2l3L77l91
$$ plain form
7948 1 244 -2 -306 4 -54 -6 -171 158 -87 123 229 213 131 -36 5 -170 -176 29 -149 -138 127 154 75 -117
7972 -117 -140 7 131 76 93 -156 -182 135 -116 -90 -174 193 -15 75 -42 33 113 141 12 -126 72 -15 -22 150
7996 150 134 -46 -57 24 178 -1 -127 -24 -149 166 52 -95 -143 199 68 -128 -8 2 -163 -65 85 -247
8018 -247 -93 210 -109 48 62 -92 -232 57 -11 -139 -116 111 103 -87 253 115 127 -59 38 -295 301 172
8040 172 -25 75 184 -93 -327 245 128 -67 -183 -258 -33 -111 -189 -93 -4 155 1 26 -140 30 85 152 136
8063 136 -27 87 -146 36 -20 54 17 -29 -267 -66 88 -86 132 -184 -51 111 -77 58 199 206 13 -4
8085 -4 126 -89 -37 -2 106 6 -72 -173 -125 56 290 63 -158 -63 126 228 61 220 4 96 63 372 234
8108 234 63 339 -220 -151 196 -240 -25 99 -178 120 153 -148 -85 -74 283 13 55 48 -95 -73 -106 271 -120
8131a20R0J2O7r3K2p9J63j75J25K3J31rj02j60J51j1j65j05R4j31K96P0l1j29
8155f6Lj39K35n7j72n1J55n0J54J36l80J02L32r1k76K29R1k51J10L8L5j19P2O
8179D6k40M63r7j34Jk7J9J00j41j98L1K81
$$ plain form
8131 -120 -30 -18 49 -44 -22 -101 62 -113 12 35 166 157 55 -105 46 35 -130 -235 -141 -272 24 94 63 -66
8155 -66 -63 -202 33 -24 -196 -247 -92 -142 12 148 -232 -130 202 111 -165 64 155 -96 14 52 87 -32 40 46
8179 46 -194 269 172 38 39 12 31 131 -10 -208 -177 104
8191A04
$$ Imaginary data points
##PAGE= N=2
##DATA TABLE= (X++(I..I)), XYDATA
0@%%%%%%%%%%%%%qJ6j6J6j6K4l2L2m0M8n6P2q0Q8j04J20j41J64j86K11k37K67
35A42l03L42l83M26m76N31n89O53p23Q00q84R73j074J186j305J438j582J743j925
54a010K127k357K617k914L262l672M165m769N529o526P890r878J3052j8933L3414
69B1997j36000k16304K18492J43675l3163L6146J94819m38k37386j75643L7117
80a46688N3052J3532Q6414J51557L1184j05360j12785o7217o6210L298J30306
91b8917J45627L4535j9002k4752j05647j64652m2490J05285R9162N1485Q5084
102A35718N0981j04906j66712n1604L7091J7977L9996J28797J05794n6283j49431
113a2582p9823o426k2612j887J14710J59617L7350q9957r4020n9477n9586k8129
$$ plain form
0 0 0 0 0 0 0 0 0 0 0 0 0 0 0 -8 8 -8 8 -8 16 -16 16 -24 24 -32 40 -40 48 -56 64 -77 87 -99 112 -125 142
35 142 -161 181 -202 224 -252 279 -310 343 -380 420 -464 509 -565 621 -684 754 -828 915 -1010
54 -1010 1117 -1240 1377 -1537 1725 -1947 2218 -2551 2978 -3548 4342 -5536 7516 -11417 21997
69 21997 -114003 -330307 -111815 31860 -1303 34843 229662 229224 -8162 -183805 -146688
80 -146688 -93636 -80104 6310 157867 189051 83691 -29094 -96311 -162521 -159223 -28917
91 -28917 116710 151245 132243 107491 1844 -162808 -205298 -100013 -851 50634 135718
102 135718 186699 81793 -84919 -136523 -99432 -81455 -41459 87338 193132 136849 -12582
113 -12582 -92405 -98831 -121443 -123330 -8620 150997 188347 98390 4370 -55107 -114693 -142822
125a42822N5790J10612R3805K8706n5829j06256p6920j5293J1514L8594R8176
136D0077J07302Q911r6205j00979m8021k5123j0089N9504J27968Q7834k6388q0062
148D4729n7976n3690n8598J0353J06556J03259J9076l0728m1638p0124q4987k5861
160a39629O5248R8899O7944K4100j3053n6564q9846p5275p769N9569Q1505O4083
172G9212K7468k1275o3211p5000n1826j293O1289R1239N7385k554l5985n7128
184H321p9253n9449J8313Q4837Q0635L8748P313k2562o7334q5700l9674L5069
196h0736P0126N6007L5526J1719l7284q2972o9261o628M2438N9550O3303M5387
208A07175n424o1027p8846n5883j0048L7264O5234O2302L4179j0323n5166p1623
$$ plain form
125 -142822 -87032 23580 117385 146091 90262 -15994 -92914 -108207 -96693 -58099 40077
136 40077 147379 156290 60085 -40894 -88915 -114038 -124127 -64623 63345 151179 124791 44729
148 44729 -13247 -66937 -125535 -115182 -8626 94633 113709 82981 41343 -28781 -113768 -139629
160 -139629 -74381 24518 92462 116562 103509 46945 -42901 -118176 -125945 -66376 15129 79212
172 79212 106680 85405 22194 -52806 -104632 -105925 -44636 46603 103988 101434 65449 8321
184 8321 -70932 -130381 -112068 -27231 53404 92152 99465 76903 9569 -76131 -115805 -80736
196 -80736 -10610 45397 80923 92642 55358 -27614 -96875 -103503 -61065 -1515 61788 107175
208 107175 101751 40724 -38122 -94005 -104053 -66789 -1555 60747 94926 84603 29437 -42186
220d2186m5944L429M3381N9093N3541K4555k2917o5616p1906l4644J4155M5877
232c9182O1893N8982K3050l4436o8906n9888k8209Q928M4435O4235M8537N310
244H4749l8232o0680n3324j9599K2145N2731O1508M1248k610m7775o5487m9978
256g5304j4978K3724N4138O2968L7868j0007m8926n6811m0955j0848K6913N8349
268F131N6757K0211k0913m7743n5680m0871p41M1866N9616M9554J8936k1473n4174
281A1476n8019l2900N660L8199N5421M7528J1371l0427n2581m6644k4523R422
293f6017M5127N9780L8316k992l4438n0120m9613k4633J9973N3509N3383K9766
305G2041r26l2304n5100m7696j1346K7201M6319M5730K8161o914m2948n5016l5475
$$ plain form
220 -42186 -88130 -84701 -41320 17773 71314 95869 72952 7336 -64570 -99214 -85059 -39182
232 -39182 22711 81693 104743 70307 1401 -58487 -86696 -77768 -33333 30902 79439 84749
244 84749 46517 -14163 -67487 -87086 -64941 -12210 49298 90546 87936 40161 -25326 -75304
256 -75304 -90282 -66558 -12420 50548 88416 78409 29483 -27328 -68283 -79131 -52218 6131
268 6131 62888 83099 62186 14443 -41237 -82108 -82849 -40983 18633 68187 87123 65650 11476
281 11476 -46543 -79443 -73783 -35584 19837 67365 78736 48309 -4272 -50916 -75439 -66017
293 -66017 -20890 38890 77206 74214 39776 -10344 -59957 -84590 -64617 -11108 42275 72041
305 72041 71115 38811 -16289 -63985 -75331 -48130 -1811 43919 72080 65166 22218 -32798 -68273
318f8273k336K8184M9079M9021K2296j7611m5609m9600l3505k066L2770N1716
330A4066M2589J3611j9580m3969m8117k7441P592L6848M8178L7533Q908k6801
342D3417m8281m4892k0423J1156L9224N0170L5284J067l0776m4797m1088j8610
354f8549J5658M4025M6771K5376m481l0362m5502m0514j0465K5156M4064M0408
366D1585K2925o077l6135m9344l3563k130K5999M1230M1214K0615j4189m0849
378A1281m3801k6094K18K7298M4310L9222J1337k0483l9515l9818k4934M261L3691
391b3027M5362L2373N187k1655m0005m0574j9981J2350L6083M0820K8127K794
403E7854k5215m3106l7121j2421J6815L5202L8953K6365k258l1127m2567l0814
$$ plain form
318 -68273 -70609 -42425 6654 55675 77971 60360 14751 -34849 -68354 -70420 -37650 14066
330 14066 56655 70266 50686 6717 -41400 -68841 -61249 -24401 23777 61310 70218 43417
342 43417 -4864 -49756 -70179 -59023 -19799 30371 65655 66722 35946 -8851 -49939 -68549
354 -68549 -52891 -8866 37905 63281 58800 28438 -17064 -57578 -68043 -42887 1177 41585
366 41585 64510 58433 22298 -27046 -60609 -62739 -36740 4490 45704 66319 52130 11281
378 11281 -32520 -58614 -58396 -31098 13212 52434 63771 43288 3773 -36045 -60979 -56718 -23027
391 -23027 22335 54708 59895 38240 -1765 -42339 -62320 -49970 -13887 26933 55060 57854
403 57854 32639 -10467 -47588 -60009 -43194 -7992 30961 57326 55068 23941 -18626 -49440
415d9440o751J8204L6728L9016K1535r658l4318l9710k7274l329K1678L9249L7125
428D3055J5480j4358l4888l7406k3996P00K4901L9128L3445R833j9077l5665l4751
441c3599j9217M623K8263M0531L0418K846k2751l5304l2136j7547P494L2824M0040
454B6485K3999k220k2853l3222l1660j3765J3982L5423L5752J8636n332k5922
466A9303l5206k9224p838J8659L6215L4187J5765r907k7754l3361k5807n815K1456
479b9327L8155L0316Q232j2613k5487l2902k6122Q94L0334L7066K2440M516j0963
492C4539k8664l8336k1222J1035L0653K9975K0971P380j4647l4309l4235j1018
504d7878J3377K6816K9752K0595J703k1663l3986k9140p935J6121L1059K9781
$$ plain form
415 -49440 -56191 -37987 -1259 37757 59292 49634 15316 -24394 -51668 -54997 -33319 5930 43055
428 43055 58535 44177 9289 -28117 -52113 -51413 -26512 12616 46061 55894 36817 1152 -33599
441 -33599 -52816 -48193 -19930 20601 51019 53865 31114 -4190 -36326 -53873 -46379 -13555 26485
454 26485 50484 48264 25411 -7811 -39471 -53236 -39254 -3831 31921 50557 45225 19303
466 19303 -15903 -45127 -52965 -34306 1909 36096 51861 41954 14200 -19161 -44968 -50783 -29327
479 -29327 8828 39144 47376 34763 9276 -23626 -49748 -48854 -18520 18546 40986 45502 34539
492 34539 5875 -32461 -53683 -42648 -11995 17980 38951 46331 31684 -2625 -36860 -47878
504 -47878 -34501 -7685 22067 42662 44365 22702 -11284 -40424 -48359 -32238 -1179 28602
516B8602J5845k051k1778l5446k9146k491K2277K7334K2800J6290j066k7948l8361
529b5139j9375O990J9386K2969K6724J7167j1636l5553l1630j1529M093J6863
541b0670K9995L0016P734j8366l0330k6278j3362N826K3715K8754K0366L959j7117
554B4242l2506k7194n503J2689K0203K5690K4937L510k7439l5836j6542r18M727
567b9940J9047L6046K3658j2713l1275k0766j1621r953P083L3569L3683N614j6979
580B5453k0228k0331k1391n975K0400L3358K2312M349r778k1710k7948j7045L617
593c4917J9503K6565K3316N425j7741k7045k0063j0393J228K1666L3572J9206
605D0322n994j8697j8611k1401j6445O315L0631K9327Q372n922j0611k0908k7534
$$ plain form
516 28602 44447 42396 20618 -14828 -43974 -46465 -24188 3146 25946 42236 41170 13222 -25139
529 -25139 -44514 -37524 -18138 4831 31555 48722 37086 1533 -30097 -41626 -37533 -20670
541 -20670 9325 39341 47075 28709 -1621 -27899 -41261 -35435 -11720 17034 37400 41359 24242
554 24242 -8264 -35458 -40961 -28272 -8069 17621 42558 46068 18629 -17207 -33749 -34667 -29940
567 -29940 -10893 25153 48811 36098 4823 -15943 -27564 -37517 -30434 3135 36818 42432 25453
580 25453 5225 -15106 -36497 -42472 -22072 11286 33598 37947 28169 6459 -21489 -38534 -34917
593 -34917 -15414 11151 34467 39892 22151 -4894 -24957 -35350 -34122 -12456 21116 40322
605 40322 34328 15631 -2980 -24381 -40826 -34511 -3880 25447 33819 27897 17286 -3622 -31156
618c1156j1205J8828K8758J8441Q228p43j6786k9316k1827j44J7832K5295K0615
631B6820Q357p188j9785k4420j8676K57J8929K5526J7924L822q142j7953k5057
644a9586j8592N502K5160K2729J1642M722n776k5740k9169q685J3448J8850J8287
657A2792J6494N561j5249k7990k0531k087J0089J6373K0477J7317j411k0492k3732
670a2389j5211l727R600K1773K2445J0728m584j8566k4861j6650J233J4637J8663
683C091J8875J1055o442k2911k3882r742M577J2673J8609J9670Q772j2363k4475
696b493j8629o583K012J2073K4060K0330L87j5392j9578j6837r183M456J8616
709f761K2636J3562j666j5194j9974j6300n704Q135J9172K0663J1201l578j6353
$$ plain form
618 -31156 -42361 -23533 5225 23666 31894 31151 14365 -14951 -36778 -36922 -19090 6205 26820
631 26820 35177 27989 8204 -16216 -34892 -34635 -15706 9820 27744 31566 23424 5471 -19586
644 -19586 -38178 -32676 -7516 15213 26855 31577 25801 61 -29108 -37793 -24345 -5495 12792
657 12792 29286 34847 19598 -8392 -28923 -31010 -20921 -4548 15929 33246 31835 11343 -12389
670 -12389 -27600 -31327 -21727 46 22491 33219 28635 10069 -14792 -31442 -30209 -15572 3091
683 3091 21966 33021 26579 3668 -20214 -29956 -25379 -12706 5903 25573 34345 21982 -2493
696 -2493 -21122 -27705 -25693 -13620 10440 30770 31157 15765 -3813 -20650 -29833 -25377 -6761
709 -6761 15875 29437 27771 12577 -7397 -23697 -29401 -21266 -2094 18569 29770 26192 9839
722I839k0498j4484k584Q962J8610K1012R823q036j7436j7420j3098k982J2077
735a6215K2592J7828L919q902j5666j8770j2938J169J6025K1089J4057K365q578
748A7975j6895j9351j0297N114J6631J8323J3138J827j1313j8831j6650p603O835
761b1097J7172J9129J0683j905j1735j8202j6960m576R410J7890J6839Q797k945
774B2500j3270j8742j4395k147J1417J7480J5394P867n221j5324j8735j1593N04
787b4265J2285J7602J5395M790p782j5968j6914j0217K843J3275J7531J3138L222
800B4935r254j7219j6164p077M918J3697J6846J2590R89j1663j7270j4822m573
813b4067N971J4566J6745J0845j853j3201j6305j2758l757P952J6109J5784P892
$$ plain form
722 9839 -10659 -25143 -27727 -18765 -155 20857 30680 22644 5208 -12212 -25310 -28292 -16215
735 -16215 6377 24205 28124 19222 3556 -15214 -28152 -26983 -10958 10131 24188 26553 17975
748 17975 1080 -18271 -28568 -23454 -6823 11500 24638 26465 15152 -3679 -20329 -27932 -21097
761 -21097 -3925 15204 25887 23982 12247 -5955 -22915 -27491 -18081 -191 16648 25445 22500
774 22500 9230 -9512 -23907 -26054 -14637 2843 18237 26104 20883 5559 -13176 -24769 -24265
787 -24265 -11980 5622 21017 25807 18025 2057 -14857 -25074 -22231 -8956 8575 21713 24935
800 24935 15681 -1538 -17702 -24779 -19861 -6164 10682 23272 24261 12598 -4672 -19494 -24067
813 -24067 -18096 -3530 13215 24060 22207 9006 -7299 -20057 -23814 -15862 247 16031 23923
826B3923m048j3062j6658j1220j939R706J6471J4463N776n542j3921j6109j0267
839b2427O44J1698J6405J2785L643o865j4942j5324q353K968J2567J5768J1411
852A9978K018q799j5090j4502o408N316J3109J5102J0423j90j0193j5509j2929
865a7674l999N799J4126J5085Q420k565j1351j4990j1581l033Q217J4465J4181
878A5100O136m063j1634j4724j0978l34J0162J4235J2158N142n015j3455j4876
891a2146q421K002J0238J4029J1583L436o803j4077j3563o486L030J1413J3888
904H123J0466J413r076j3744j2448m816M672J1621J4463Q909j224r780j3734j1195
918a6350l706O385J3141J3390O686k973j0313j3285j0450j911P963J3404J2356
$$ plain form
826 23923 19875 6813 -9845 -21065 -23004 -13298 3173 17636 23412 17870 3949 -12160 -22427
839 -22427 -21783 -10085 6320 19105 22748 15883 941 -14383 -22736 -19768 -7201 8567 19978
852 19978 21996 13197 -1893 -16395 -22803 -17487 -4378 10724 21147 20957 10764 -4745 -17674
865 -17674 -21673 -15874 -1748 13337 21757 19192 7841 -7149 -18730 -21763 -13546 919 15100
878 15100 21236 17173 5539 -9185 -20163 -20497 -10335 3900 16058 21200 16185 2730 -12146
891 -12146 -20567 -18565 -8327 5702 17285 20721 13918 -159 -13722 -20208 -17178 -5765 8123
904 8123 18589 20002 10926 -2818 -15266 -20082 -15410 -3789 10674 19583 18359 8579 -5155 -16350
918 -16350 -20056 -13671 -530 12860 19546 16573 6260 -7025 -17475 -19386 -11423 1981 14337
931A4337M877l846j1605j3266q870K39R395J2822J1212L679n520j2348j2656p170
945a8720K095R858J3222J0108J855p088j2493j1883n722L713J1250J2265Q420
958A6880O08q070j2571j1282m018N213J1225J2017P412j277q939j3082r580k029
972a7493O101J1722J1439N886k362j0612j2120q873l20P292J1900J0180M654l771
986A3623j0874j2469p045J570P911J1193J0160L378n802j1661j1194n359K004
999a4565R174J1626R134J277p051j1539j0370m193L255R705J1966P761p54q022
1013G404j1455r140l279M835J0550J1104O480k067r379j1366p568j578M838J1285
1027F64J1377M950m384r664j0287o991r19O505J1769J0568K597n408r508r953
$$ plain form
931 14337 19214 15368 3763 -9503 -18373 -18134 -8739 4083 15295 18974 13454 1106 -11550 -18720
945 -18720 -16625 -6767 6455 16563 18418 11330 -1163 -13046 -18768 -15055 -3805 8460 16880
958 16880 17488 9418 -3153 -14435 -18453 -13240 -2015 10002 17414 16137 7198 -5884 -15464 -17493
972 -17493 -11392 330 11769 17655 15293 4681 -7439 -16312 -16632 -9340 2560 12740 17394 13623
986 13623 2749 -9720 -16765 -15195 -7284 3909 14069 17447 11645 -16 -11210 -16569 -14565
999 -14565 -5391 6235 15369 16646 9595 -1944 -12314 -16507 -13252 -3547 8419 16180 15426 7404
1013 7404 -4051 -13191 -16470 -11635 -1085 10019 16499 14432 5053 -6313 -13881 -15459 -10621 664
1027 664 12041 16991 12607 2943 -7344 -14335 -15254 -8749 3020 13588 16185 10777 1269 -8684
1041h684o518M94Q505J1809Q155J393n539r833j0148n124K646Q804J1128P407
1055A4495j12o525j0162r176l668L231R948J1176N708j596p288r935q472l424
1069a5800N653J0723J0090L248j925o660j0461r481l99P383J0165P561L694k002
1083A1789q595j1019o710J020P599R413P884L048m073r736j0165m508J504P742
1097d807J0211P421Q02n212q888r812m623L620R474Q866M783J159n219j0864q756
1112a1845j940M960P694Q406N945k16p126j1414o865Q9M563P434R284N770l269
1127A1470r514q493n301p84N475R377Q112K873l114q517r269n116J405O213Q841
1142C658P056K717m319r216r151l676K831N883Q462P909J668p312r737n774k543
$$ plain form
1041 -8684 -15202 -14708 -6203 5606 13761 15154 9615 -218 -10366 -15490 -12844 -4040 7088 14495
1055 14495 14383 7858 -2304 -11480 -15148 -11917 -1969 9207 14915 13319 6031 -3904 -12376 -15800
1069 -15800 -10147 576 10666 13914 11989 5329 -5132 -14613 -15012 -7629 2536 10097 13791 11789
1083 11789 3194 -7825 -14535 -13515 -5916 3497 11381 14429 10356 620 -9545 -14053 -12549 -4807
1097 -4807 5404 12825 13627 8415 -473 -10285 -14908 -11288 -1814 7052 11835 12994 7775 -3089 -11845
1112 -11845 -13785 -8825 -1131 7275 13220 13004 5878 -5536 -12401 -12312 -7749 -315 8969 14739 11470
1127 11470 1956 -6537 -11838 -12622 -7147 2230 10342 13215 10101 1584 -7685 -12801 -11396 -5183 3658
1142 3658 10714 13431 9112 -104 -9255 -12931 -10100 -4217 4245 12154 13822 6510 -3227 -9001 -11544
1157a1544J412P101J0376N875j919o740p637o601l121L725Q501R122L946k123
1171A0373o485q159o849j315N335Q579P189L724k255q253q940m119K3M850Q656
1186B354Q671J393m932p091o938m685l82P095R179O396J60m668o495p719m944
1201a2606J875Q554Q654L657N28l975q431q405k161M493P208P255M716q43o142
1216D377q058o490j046L785P977P242L294j562o042p919n787j287N295Q403O366
1231H548K022k169o052q643n634J524O570P221N251K527l060q162p908k983K171
1246h777N527P153O126J075m801p891o494k676K279O346P643N233l31n544p488
1261b620o382j829L428O807P471L580j054n746p847n333o56M342O390O591L803
$$ plain form
1157 -11544 -10132 -3031 7345 13220 11301 4561 -3076 -9677 -12798 -9073 -572 8550 12496 10373
1171 10373 3888 -4271 -11120 -12435 -7100 1479 8668 12392 10137 1884 -7056 -11175 -11152 -6302 2354
1186 2354 11025 12418 7486 395 -6543 -11228 -11610 -4515 4664 11060 11220 6552 57 -7662 -12606
1201 -12606 -10731 -2177 6477 10134 10662 6687 -1744 -10149 -12310 -7817 -609 6646 11362 10519 4377
1216 4377 -3681 -10171 -11217 -7432 545 7787 11081 9519 3477 -4442 -10229 -11516 -6221 2182 8548
1231 8548 10570 8401 2349 -6294 -11928 -10404 -3834 3387 8638 11165 8105 -57 -7965 -10948 -8777
1246 -8777 -3250 3903 10029 11104 6303 -1588 -8082 -10758 -8479 -2133 5510 10743 10412 4868 -2620
1261 -2620 -9002 -10831 -7403 -596 6875 10455 9401 3655 -4192 -9525 -10181 -5839 551 7142 10945
1276A0945k210o881p191m176k35M513O869P074K276l618o769o564l770L42N308
1291d087P718N864O91l976o570o631l501K088N992P194M525K36m266o757o090
1306g570k896K923O439O665M518p87n238p239n519j367L485O533O948L217k070
1321H042n343o937m555j116M465P312O050J705k257n616o909m131K15N120O513
1336B558N351J526k651o493o536l505J469N202O840M956O82m024o425n981k426
1351i457K044N677O313M253J34m446o791n302j869K802N901O208L490o35m823
1366C499o849n069m92L378O007N804K991j447n776o412m499O6M245O389N246K207
1382I288k608n753o344l271O59M646O099N105J112l211n888n879l200J668N278
$$ plain form
1276 10945 8735 1854 -5337 -9513 -9748 -5235 1634 8708 10984 7366 597 -5967 -9737 -9395 -4087
1291 -4087 3631 9495 10186 6210 -360 -6991 -10492 -8404 -2412 4782 9307 9543 5277 -1480 -7570
1306 -7570 -10466 -7543 -1104 5561 10079 9292 4054 -3185 -8704 -10071 -6586 -53 6895 10112 8042
1321 8042 2699 -4238 -8793 -9909 -5444 1868 7918 9623 7366 1750 -5159 -9290 -9075 -3955 2558
1336 2558 7909 9435 6784 291 -6245 -9750 -8281 -3079 3761 8717 9399 5375 -1050 -7031 -9457
1351 -9457 -7413 -1736 4577 8830 8964 4518 -2273 -7575 -9444 -6642 -741 5467 8957 8322 3499
1366 3499 -3350 -8419 -8911 -5533 474 6278 9269 7822 2046 -4366 -8865 -8799 -4554 1835 7081 9288
1382 9288 6680 927 -5417 -8688 -8029 -3383 2716 7821 8933 5722 -166 -6045 -9245 -7577 -2299
1397b299O143M434K63l836o348n306k067K486N459N850L698n67m238n871n127
1412g326j176K708N832N899K622j270m992n730m365n55L188O118N427K370k151
1427F599n065n704m000K08M353N717N097J185k977n078n534l101Q74M512O135
1442C221M158P42l078n910n101k353J820M683N884L626J97l795n971m860j100
1457g837K239N040N306L073q06m170n856m015r38L063N624N009K169j480m657
1472A764n908l355l48L784N595M306K141j965n374n215l351J096L648N525M332
1487F675J364k972n583m890k399J179M409N336M544k36l433n186m488j945J725
1502e900M386N800L082m83l533n375m236j415K348N141N272K506j250m154n190
$$ plain form
1397 -2299 3844 8278 8541 4705 -1643 -6949 -9016 -6530 -1071 4779 8477 7910 3672 -2199 -7326
1412 -7326 -8502 -5794 38 5937 8559 7289 2297 -3433 -7798 -8353 -5165 953 6380 8750 6599
1427 6599 1534 -4170 -8170 -7962 -3609 2108 7205 8390 5413 335 -5199 -8300 -7426 -2914 3221
1442 3221 7379 8121 5043 -867 -5968 -8321 -6501 -1818 4066 7692 7889 4094 -1877 -6737 -7837
1457 -7837 -5598 -558 4748 7821 7015 2845 -3011 -7026 -7964 -4901 723 5732 7901 6421 1764
1472 1764 -4144 -7499 -7847 -4063 1532 5838 7979 6014 640 -4575 -7926 -6830 -3182 2343 6675
1487 6675 8039 5067 -516 -5406 -7805 -6626 -2217 3119 7663 7427 3994 -1192 -5680 -7625 -5900
1502 -5900 -1514 4286 7368 6885 3352 -2023 -6259 -7674 -5326 -185 5087 7593 6343 2189 -3001
1517c001l894n01K986N290M558J792j429m294n110l405K77L366N189M379J328
1532G531k640m635m825l025Q45M284N243L734O70k845m568n060k207J620M376
1547a502N124L042J34l406m773m372j260K036M278M867K898n06l926n071l908
1562f345o94K432N048M499J916j082l930m748l581l40L545M701L479J994j671
1577E223m336m640k813N87L259M485M075J054k293m853m244k131P66L900M715
1592B754L678L12l245m373m057j949J582M454M369K800M8l242m849l819j126K201
1608d462M200M329K697q97l564n082l040o02K396M350M556J837j929l593m196
1623c000l329j06L426M370M187R59j951l984m360k530N33L309M765L190P94k281
$$ plain form
1517 -3001 -6895 -7396 -4410 880 5438 7230 5801 1507 -3603 -7008 -6731 -3365 1824 6203 7531
1532 7531 4891 256 -4569 -7594 -6749 -2465 2778 6512 7182 4337 -231 -5291 -7498 -5878 -1502
1547 -1502 3622 6664 6798 3392 -1381 -5753 -7013 -4977 -699 4168 7066 6560 2634 -2437 -6345
1562 -6345 -7039 -4607 441 4940 6856 5774 1844 -2904 -6485 -6825 -3280 1421 4900 6894 5223
1577 5223 887 -3753 -6566 -5979 -2720 1765 5840 6894 4601 -252 -4496 -6627 -5861 -1961 2754
1592 2754 6432 6744 3499 -874 -4931 -6880 -5298 -844 3525 6325 6373 3131 -1718 -5537 -6663 -4462
1608 -4462 -262 4067 6764 5867 2303 -2779 -5819 -6421 -4025 325 4881 6718 4789 1196 -3000
1623 -3000 -6329 -6435 -3009 1361 5548 6507 4556 572 -3788 -6318 -5785 -2476 2289 5479 6273 3992
1639C992m424l973j881J223L486M629K834L66l259m182l676j397J212M339M637
1654C926K097q36k888m101l720q20K480M336L769J533o33l250m494k917p34L121
1670c131M211L430J569j071m255m087k373R6K963M602L366Q81k506l495m010k410
1686f220R87L545M316K645M30k273m388l751j403J150M162L840K516J12k808m569
1702a709l490n21J742L472M054K825j156l466m319k521m94K170L771L640J968
1717E966j197l634m007k415J29K379M016L709P87j660l485m082k371R14L044L610
1733A703L079R92j922m489l328j652J263L312L693K485n8k535l630l260r87J323
1749d011L281L853K656j140k366l845l034j062J892M282L111J490k90l142m076
$$ plain form
1639 3992 -432 -4405 -6286 -5063 -1577 3052 5886 6252 2993 -1189 -4865 -6262 -5050 -711 3926
1654 3926 6023 5187 2299 -1802 -5522 -6342 -3862 474 4243 5776 5143 1893 -2601 -5518 -6252 -3131
1670 -3131 1080 4510 6079 5008 753 -3334 -5707 -5611 -2648 1954 5320 6201 3695 200 -3810 -6220
1686 -6220 -5233 -1688 2628 5273 5703 3430 -958 -4709 -6112 -4962 -800 3040 5556 5668 2860 -1709
1702 -1709 -5199 -5720 -3978 -506 3548 6373 5217 1751 -2568 -5089 -5583 -3413 358 3998 5966
1717 5966 4769 1135 -2872 -5287 -5158 -2779 1237 4946 5733 4073 588 -3494 -5865 -4951 -1907 1703
1733 1703 4782 5774 3852 -637 -3965 -5617 -4354 -1042 2651 5136 5078 2543 -1087 -4347 -5334 -4011
1749 -4011 -730 3123 5779 4639 2273 -1572 -4606 -5668 -3776 506 3617 5107 4817 1675 -2401
1764b401k454k68K194L948L353R63j251l488l506k409K82K521M061L184L82j583
1780C528l563l330j735J11L375L861K714j64j793l624l456j416J658K911L641
1795B718K498l58k724l490l077j031J853L449L417J853m84k699l951k616j09J512
1811c239L460L500J415r52k951l573k720j02K729L367L097J196j344l171l890
1826c178j849L19K686L741K492L94j324l706l206j211P52K810L301K595K74k404
1842B486l346k885j367J441K752L682J785P9k654l218l131m48J639L047L392J566
1858D820o78k833l021k624m42K289L270K562J696j243l331k945j879j76K230L454
1874A149K913P56j597k958l159j827P07K681L173K488M38j796l656k831j184J217
$$ plain form
1764 -2401 -4855 -5123 -2929 1019 4372 5335 4084 596 -2910 -5319 -5037 -2516 1545 4729 5111 3528
1780 3528 -35 -3365 -5100 -4989 -1614 2247 4961 4797 3004 -620 -4076 -5492 -3834 -923 2718
1795 2718 5216 4858 2134 -1356 -4433 -5464 -3611 -162 3255 5108 4624 1925 -2026 -4642 -4751 -3239
1811 -3239 221 3721 5136 4184 1233 -2340 -5060 -5162 -2433 934 4031 5227 3883 712 -3178
1826 -3178 -5027 -4708 -2022 1719 4211 4605 3281 -425 -3631 -4842 -4090 -1280 2021 4616 4890 2486
1842 2486 -860 -3745 -5112 -3671 -919 2763 4548 4627 1973 -1245 -4376 -4824 -3185 -138 3254 4820
1858 4820 4142 1309 -1712 -4336 -4778 -2489 781 3343 5039 3796 465 -2480 -4359 -4535 -2305 1149
1874 1149 4062 4818 3221 263 -2896 -4723 -4016 -1335 1838 4326 4764 2968 -688 -3519 -4703 -3486
1890c486K438L455J794L60k425k895k767j244J342K677L839J649p89k330l022
1905a404k583o54J841L136K911J403q77k446l503k095j85K250L172K589P83j065
1921C273k711l282j600M74K350K989K307N72j451l125k918j290P61K636K921K289
1937D195M05k223l075k244j273R35K573L012K022m03k019l118k348p87J432K681
1953b35L139J423p91k436k808j859l25J157K810L057J192j016k533k932j832J74
1969c815J827K931K617P26j428k489k861j714N88K097K923K438L73j789k577k704
$$ plain form
1890 -3486 -1048 2407 4201 4561 2136 -759 -3526 -4770 -3428 -751 3088 4737 3948 1618 -1404
1905 -1404 -3987 -4641 -2800 336 3247 4650 3773 1327 -2176 -4271 -4456 -2206 966 3555 4338 3273
1921 3273 562 -2720 -4320 -3846 -1496 1493 3800 4372 2921 -204 -3122 -4412 -3651 -1015 1906 4195
1937 4195 4600 2377 -698 -2942 -4215 -3280 -707 2305 4327 3924 1905 -1213 -3561 -4348 -2916 -235
1953 -235 2904 4327 3536 1100 -1708 -3567 -3892 -2735 75 3132 4324 3308 775 -2157 -3989 -3815
1969 -3815 -1988 943 3560 4286 2858 369 -2492 -4206 -3618 -1521 1402 3840 4213 2424 -153 -2857
$$ [...]
8191g4
##END NTUPLES=NMR FID
##END=
