##TITLE=1H_SR84
 CDCl3,8 sc, 
 3.9.2021
##JCAMPDX= 6.0         $$ Bruker NMR JCAMP-DX V2.0
##DATA TYPE= NMR FID
##DATA CLASS= NTUPLES
##ORIGIN= UXNMR, Bruker Analytische Messtechnik GmbH
##OWNER= root
$$ XWIN-NMR		Version 3.5
$$ Fri Sep  3 09:46:10 2021 Russian Standard Time (UT+4h)  she@DPX200
##.OBSERVE FREQUENCY= 200.1313
##.OBSERVE NUCLEUS= ^1H
##.DELAY= (6, 6)
##.ACQUISITION MODE= SIMULTANEOUS
##.ACQUISITION SCHEME= undefined
##.AVERAGES= 8
##.DIGITISER RES= 18
##SPECTROMETER/DATA SYSTEM= spect
##.PULSE SEQUENCE= zg30
##.SOLVENT NAME= CDCl3
##.SHIFT REFERENCE= (INTERNAL, CDCl3, 0, 15.7039)
##AUDIT TRAIL= $$ (NUMBER, WHEN, WHO, WHERE, WHAT)
$$ ##TITLE= Audit trail, XWIN-NMR		Version 3.5
$$ ##JCAMPDX= 5.01
$$ ##ORIGIN= Bruker BioSpin GmbH
$$ ##OWNER= she
$$ F:/spectra/data/she/nmr/H-F/1/audita.txt
$$ ##AUDIT TRAIL=  $$ (NUMBER, WHEN, WHO, WHERE, WHAT)
(   1,<2021-09-03 09:45:09.67 +0400>,<she>,<DPX200>,
      <created by zg, POWCHK disabled, PULCHK disabled
       configuration hash MD5:
       00 E9 B6 7A A2 85 ED C7 34 08 36 98 17 FE 4E 26
       data hash MD5: 16K
       F6 B7 23 0E 3A E7 6A FC 0E 20 A8 D5 AB A5 B3 47>)
$$ ##END=
$$ 
$$ hash MD5
$$ FD 25 01 87 95 E2 86 13 78 90 19 AB 79 63 B0 D1
##$RELAX= 
##$RELAX= 
##$RELAX= 
##$RELAX= 
##$RELAX= 
##$RELAX= 
$$ Bruker specific parameters
$$ --------------------------
##$DU= <F:/spectra>
##$EXPNO= 1
##$NAME= <H-F>
##$PROCNO= 1
##$TYPE= <nmr>
##$USER= <she>
##$AMP= (0..31)
100 100 100 100 100 100 100 100 100 100 100 100 100 100 100 100 100 100 
100 100 100 100 100 100 100 100 100 100 100 100 100 100 
##$AQSEQ= 0
##$AQ_mod= 1
##$AUNM= <au_zg>
##$AUTOPOS= <>
##$BF1= 200.13
##$BF2= 200.13
##$BF3= 200.13
##$BF4= 200.13
##$BF5= 200.13
##$BF6= 200.13
##$BF7= 200.13
##$BF8= 200.13
##$BYTORDA= 1
##$CFDGTYP= 0
##$CFRGTYP= 5
##$CHEMSTR= <none>
##$CNST= (0..31)
1 1 145 1 1 1 1 1 1 1 1 1 1 1 1 1 1 1 1 1 1 1 1 1 1 1 1 1 1 1 1 1 
##$CPDPRG= <>
##$CPDPRG1= <>
##$CPDPRG2= <>
##$CPDPRG3= <>
##$CPDPRG4= <mlev>
##$CPDPRG5= <mlev>
##$CPDPRG6= <mlev>
##$CPDPRG7= <mlev>
##$CPDPRG8= <mlev>
##$CPDPRGB= <>
##$CPDPRGT= <>
##$D= (0..31)
0 1.2 0 0 0 0 0 0 0 0.06 0 0.03 0 0 0 0 0.0002 0 0 0 0 0 0 0 0 0 0 0 0 
0 0 0 
##$DATE= 1630647909
##$DBL= (0..7)
120 120 120 120 120 120 120 120 
##$DBP= (0..7)
150 150 150 150 150 150 150 150 
##$DBP07= 0
##$DBPNAM0= <>
##$DBPNAM1= <>
##$DBPNAM2= <>
##$DBPNAM3= <>
##$DBPNAM4= <>
##$DBPNAM5= <>
##$DBPNAM6= <>
##$DBPNAM7= <>
##$DBPOAL= (0..7)
0.5 0.5 0.5 0.5 0.5 0.5 0.5 0.5 
##$DBPOFFS= (0..7)
0 0 0 0 0 0 0 0 
##$DE= 6
##$DECBNUC= <off>
##$DECIM= 32
##$DECNUC= <off>
##$DECSTAT= 4
##$DIGMOD= 1
##$DIGTYP= 9
##$DL= (0..7)
0 120 120 120 120 120 120 120 
##$DP= (0..7)
150 150 150 150 150 150 150 150 
##$DP07= 0
##$DPNAME0= <>
##$DPNAME1= <>
##$DPNAME2= <>
##$DPNAME3= <>
##$DPNAME4= <>
##$DPNAME5= <>
##$DPNAME6= <>
##$DPNAME7= <>
##$DPOAL= (0..7)
0.5 0.5 0.5 0.5 0.5 0.5 0.5 0.5 
##$DPOFFS= (0..7)
0 0 0 0 0 0 0 0 
##$DQDMODE= 0
##$DR= 18
##$DS= 0
##$DSLIST= <SSSSSSSSSSSSSSS>
##$DSPFIRM= 0
$$ [...]
##$SUBNAM2= <"">
##$SUBNAM3= <"">
##$SUBNAM4= <"">
##$SUBNAM5= <"">
##$SUBNAM6= <"">
##$SUBNAM7= <"">
##$SUBNAM8= <"">
##$SUBNAM9= <"">
##$SW= 20.0189088683792
##$SWIBOX= (0..15)
0 0 2 0 0 0 0 0 0 0 0 0 0 0 0 0 
##$SW_h= 4006.41025641026
##$TD= 16384
##$TD0= 1
##$TE= 0
##$TE2= 300
##$TE3= 300
##$TEG= 300
##$TL= (0..7)
0 120 120 120 120 120 120 120 
##$TP= (0..7)
150 150 150 150 150 150 150 150 
##$TP07= 0
##$TPNAME0= <>
##$TPNAME1= <>
##$TPNAME2= <>
##$TPNAME3= <>
##$TPNAME4= <>
##$TPNAME5= <>
##$TPNAME6= <>
##$TPNAME7= <>
##$TPOAL= (0..7)
0.5 0.5 0.5 0.5 0.5 0.5 0.5 0.5 
##$TPOFFS= (0..7)
0 0 0 0 0 0 0 0 
##$TUNHIN= 0
##$TUNHOUT= 0
##$TUNXOUT= 0
##$USERA1= <user>
##$USERA2= <user>
##$USERA3= <user>
##$USERA4= <user>
##$USERA5= <user>
##$V9= 5
##$VALIST= <valist>
##$VCLIST= <CCCCCCCCCCCCCCC>
##$VD= 0
##$VDLIST= <DDDDDDDDDDDDDDD>
##$VPLIST= <PPPPPPPPPPPPPPP>
##$VTLIST= <TTTTTTTTTTTTTTT>
##$WBST= 1024
##$WBSW= 4
##$XGAIN= (0..3)
0 0 0 0 
##$XL= 0
##$YL= 0
##$YMAX_a= 227104
##$YMIN_a= -190136
##$ZGOPTNS= <>
##$ZL1= 120
##$ZL2= 120
##$ZL3= 120
##$ZL4= 120
##$ABSF1= 10
##$ABSF2= 0
##$ABSG= 5
##$ABSL= 3
##$ALPHA= 0
##$AQORDER= 0
##$ASSFAC= 0
##$ASSFACI= 0
##$ASSFACX= 0
##$ASSWID= 0
##$AUNMP= <proc_1d>
##$AZFE= 0.1
##$AZFW= 0.1
##$BCFW= 1
##$BC_mod= 2
##$BYTORDP= 1
##$COROFFS= 0
##$CY= 11.3945322036743
##$DATMOD= 1
##$DC= 2
##$DFILT= <>
##$DTYPP= 0
##$F1P= 2.36226072786647
##$F2P= -0.459571619588291
##$FCOR= 0.5
##$FTSIZE= 0
##$FT_mod= 4
##$GAMMA= 1
##$GB= 0.15
##$INTBC= 1
##$INTSCL= 1
##$ISEN= 128
##$LB= 0.24
##$LEV0= 0
##$LPBIN= 0
##$MAXI= 10000
##$MC2= 0
##$MEAN= 0
##$ME_mod= 0
##$MI= 1.114404
##$NCOEF= 0
##$NC_proc= 0
##$NLEV= 6
##$NOISF1= 3.799351
##$NOISF2= 2.8
##$NSP= 1
##$NTH_PI= 0
##$NZP= 0
##$OFFSET= 15.70392
##$PC= 1
##$PHC0= -13353.86
##$PHC1= 9.80097
##$PH_mod= 1
##$PKNL= yes
##$PPARMOD= 0
##$PSCAL= 0
##$PSIGN= 0
##$REVERSE= no
##$SF= 200.130013532006
##$SI= 16384
##$SIGF1= 3
##$SIGF2= 2
##$SINO= 400
##$SIOLD= 16384
##$SREGLST= <1H.CDCl3>
##$SSB= 0
##$STSI= 0
##$STSR= 0
##$SW_p= 3612.71676300578
##$SYMM= 0
##$S_DEV= 0
##$TDeff= 0
##$TDoff= 0
##$TI= <>
##$TILT= no
##$TM1= 0
##$TM2= 0
##$TOPLEV= 0
##$USERP1= <user>
##$USERP2= <user>
##$USERP3= <user>
##$USERP4= <user>
##$USERP5= <user>
##$WDW= 1
##$XDIM= 8192
##$YMAX_p= 0
##$YMIN_p= 0
$$ End of Bruker specific parameters
$$ ---------------------------------
##NTUPLES= NMR FID
##VAR_NAME=  TIME,          FID/REAL,        FID/IMAG
##SYMBOL=    X,             R,               I
##VAR_TYPE=  INDEPENDENT,   DEPENDENT,       DEPENDENT
##VAR_FORM=  AFFN,          ASDF,            ASDF
##VAR_DIM=   8192,          8192,            8192
##UNITS=     SECONDS,       ARBITRARY UNITS, ARBITRARY UNITS
##FACTOR=    0.0002496,     1,               1
##FIRST=     0,             0,               0
##LAST=      2.0444736,     0,               0
##MIN=       0,             -190136,         0
##MAX=       2.0444736,     227104,          0
$$ Real data points
##PAGE= N=1
##DATA TABLE= (X++(R..R)), XYDATA
$$ [...]
1820b09k5J66q7j43L69J17M1J05k40j79L9O9J70M3N3mq5l85j94Q2J91Q8l0k76
$$ -209 -234 -68 -155 -298 71 188 229 334 94 -85 -46 23 193 236 289 285 200 -185 -379 -297 -106 -18 -48 -324
1844c24N9J6j39L12K74j40j64L13l93K24M9L3Q2J4j66j62m2rQ3K07M7j89J80m11
$$ -324 -265 -249 -388 -76 198 58 -106 207 -186 38 87 120 202 216 50 -112 -154 -163 -80 127 174 -15 165 -246
1868b46M9K11J56k87J30l05K84k43K79J71j25l0J55J25k58j78K15J88k54N1l25
$$ -246 -197 14 170 -117 13 -292 -8 -251 28 199 74 44 199 324 66 -112 103 291 37 88 -237
1889b37m6L1j53J76J30L58l89K65k89j38K73J98j04K46j78j3k33J33J10N4j72
$$ -237 -283 -252 -405 -229 -99 259 -130 135 -154 -292 -19 179 75 321 143 130 -103 30 140 194 22
1910B2K92n23J68q6L16n37O73n83n7K11j09L64k97L43j37L14o19K14o1L25n7R2
$$ 22 314 -209 -41 -127 189 -348 325 -258 -315 -104 -213 151 -146 197 60 374 -245 -31 -92 233 176 268
1932B68J9j08j22l23J40J32j45J74q5j39j6o6J18P7k15L67k1k15j63N22j30J13
$$ 268 287 179 57 -266 -126 6 -139 35 -50 -189 -205 -271 -153 -76 -291 76 55 -160 -323 199 69 182
1954A82MJ02p3k95J23l9m0j08K08K19k85k95p6J89K3M2K23n30L17j3L19j93K26
$$ 182 186 288 215 -80 43 4 -36 -144 64 283 -2 -297 -373 -184 -161 -119 104 -426 -109 -122 197 4 230
1977B30kj52J20j00l91J56J4K64M2l78n5j01K06Ro2K66k10J36m7J80N3K7Pj36
$$ 230 228 76 196 96 -295 -139 -125 139 181 -197 -252 -353 -147 -138 -200 66 -144 -8 -55 125 178 205 212 76
2001G6L04j79l20L20k74L57r5M2k04k09j05K01K24k33J6j0k5K3M1o3K49R7j74
$$ 76 380 201 -119 201 -73 284 189 231 27 -182 -287 -86 138 -95 -79 -89 -114 -91 -50 -113 136 233 59
2024E9J36j49o0m5K10k69K36K48m96J12j70K32L7J64q1k65k18L36J73m0Kk20J85
$$ 59 195 46 -14 -59 151 -118 118 366 -130 -18 -188 44 81 245 164 -101 -319 17 190 150 152 -68 117
2047A17j20k47K63l4J80j72J14j22j55J06q0L03j35j01l4j75j1J15L03j54j84
$$ 117 -3 -250 13 -21 159 -13 101 -21 -176 -70 -150 153 18 -83 -117 -292 -303 -188 115 -39 -223
2068b23L71k22J46j35o5J48J20q3N9j11J99k04K48j84K0P9J9l28j97N3L39l22
$$ -223 148 -74 72 -63 -128 20 140 57 116 5 204 0 248 64 84 163 182 -146 -343 -290 49 -273
2090b73M17l09p3J55n8r6L22R3q3rk77L36l7L53k32m1k19O0k84N8Q1P0J05M8N8
$$ -273 144 -165 -238 -83 -141 -237 85 178 95 86 -191 145 108 461 229 188 -31 29 -255 -197 -116 -46 59 107 165
2115A65j10n11N09m5LM4j11jJ16j45K80k63J23k3k3J62l83J69J58k0mm81O9L53
$$ 165 55 -456 53 8 11 55 -56 -57 59 -86 194 -69 54 31 8 170 -213 -44 114 94 90 -391 -322 31
2139C1j26J21K5J6n9j09J51N2n9m3Q6pL06k67l60K70J50J9j64k25L01l31Pk4J14
$$ 31 -95 26 51 67 8 -101 50 102 43 0 86 79 385 118 -242 28 178 197 33 -192 109 -222 -215 -239 -125
2164a25M67l69m1P6P2k60J23m2L89j7mk10L9J05j80r4J26J60k09L9j11j9J53k60
$$ -125 342 -27 -68 8 80 -180 -57 -99 290 273 269 59 98 203 23 -71 55 215 6 45 -66 -85 68 -192
2188a92M0J9q4r4N46K5k32k9J36k2L5n9K82l09O5jk43j06P7j36M30l2n6O1j42
$$ -192 -152 -133 -217 -311 235 260 28 -1 135 113 148 89 371 62 127 126 -117 -223 -146 -282 148 116 60 121 -21
2213b1k33K05J53j26j01Qk5oM06k96M44j76k56K89l00j42J00N0J52O9J6l11j01
$$ -21 -254 -49 104 -22 -123 -115 -140 -146 260 -36 408 232 -24 265 -35 -177 -77 -27 125 194 210 -101 -202
2236b02N3J70r4K33M8l55j44K49Q2j9M1l3m0J24m6J17O1j35j56Q1J41j4l57j8
$$ -202 -149 21 -73 160 208 -147 -291 -42 40 21 62 29 -11 113 67 184 245 110 -46 35 176 162 -195 -213
2260b13J79M49n94J12k68M16k00R5L50m23N01l87qK9p4j52L68k02J0R3j88J91
$$ -213 -34 415 -179 -67 -335 81 -119 -24 326 -97 404 17 9 38 -36 -188 180 -22 -12 81 -107 84
2282H4l1o1M0J18m37N1J15P3M1o0j90J32K04p5qQ4J23k35L65k72k29J27j26M90
$$ 84 53 -8 32 150 -287 -236 -121 -48 -7 -67 -257 -125 79 4 -4 80 203 -32 333 61 -168 -41 -167 323
2306C23n6k28L24l90J91m18N30m24K44j06R7j22J38l63J82K30q1K01n80L99k81
$$ 323 267 39 363 -27 164 -254 276 -148 96 -10 87 -35 103 -260 -78 152 71 272 -308 91 -190
2327a90J82k1L29l84J02K55l92j5J83j74J18M02n86L1R7J16k76M19k19mk8O5r7
$$ -190 -8 -29 300 -84 18 273 -119 -134 49 -125 -7 395 -191 -160 -63 53 -223 196 -23 -27 -55 10 -87
2350h7K18j81O2J37o7j63Q2r0K03l5j15j62P6l7k4L22n1J20m58J94l7l1RL27J05
$$ -87 131 -50 12 149 82 -81 1 -89 114 79 -36 -198 -122 -159 -183 139 88 208 -250 -56 -93 -124 -115 212 317
2375C17o7j66j47r0J83J68k27n6N0m2J4k04K98j24J27j33O5p6J01q5J67O6N5j9
$$ 317 250 84 -63 -153 30 198 -29 -85 -35 -77 -63 -267 31 -93 34 -99 -34 -110 -9 -94 73 139 194 175
2399A75j1l43L2L0J02Qj52J93j34L5nQOJ55k56K08k23M2K62K2Oo8Pj25M2RJ36
$$ 175 164 -179 -147 -117 -15 -7 -159 34 -100 -65 -70 -62 -56 99 -157 51 -172 -130 132 154 160 92 99 -26 16 25 161
2426A61k7O3j05k01k7K26K9k4q2J05m77L01J89j06L9o7LK6j49K96K9j13R1j44
$$ 161 134 197 92 -109 -136 90 119 95 13 118 -359 -58 131 25 64 -3 0 26 -123 173 202 89 180 36
2450C6N3j59j99N40k80j41K58J51p7l43R7m29N26Qm9j01L02j19j29J99PJ99m79
$$ 36 89 -70 -269 271 -9 -150 108 259 182 -161 -64 -493 33 41 -8 -109 193 74 -55 144 151 350 -129
2473a29M42m55J60k51J94J68j18M2l18J60mN1K16j1j19O7j04J8Q5l86M95J04k87
$$ -129 313 -142 18 -233 -39 129 11 53 -265 -105 -109 -58 158 147 28 95 -9 9 94 -292 203 307 20
2496B0p6j02L12k00nJ93p1Q7j99N5J29n5j54L1j2J33o8J21L1kl24K21N9O5k44
$$ 20 -56 -158 154 -46 -51 142 71 158 -41 14 143 88 -66 -35 -47 86 18 139 170 168 -156 65 124 189 -55
2521e5j5K55j03K28l04K83k97j75J32J12k05J73p1n7k7j13M56j2k04K37j32k08
$$ -55 -70 185 82 310 6 289 -8 -183 -51 61 -144 29 -42 -99 -126 -239 217 205 1 238 106 -102
2543a02J52J3J37N0j79K21k31j52Q1K32j29P1k46q9K21m23J24M34l74J20K34k21
$$ -102 50 63 200 250 71 292 61 -91 -10 222 93 164 -82 -171 50 -373 -249 185 -189 -69 165 -56
2565e6P8M5k0r1J14RNJ2j16q1QK58j23J88l81M7J3K28M4j60N0j31J53j49k7K36
$$ -56 22 67 47 -44 70 79 84 96 -20 -101 -93 165 42 230 -151 -104 -91 137 181 21 71 -60 93 -56 -83 153
2591A53Q5m19N0J9L16j99J20j95K96j31j39p1j8J47q2O0j48j46L69l15K58o3P7
$$ 153 238 -181 -131 -112 204 5 125 -70 226 95 -44 -115 -133 14 -68 -8 -156 -302 67 -248 10 -53 24
2614B4J53j96N2j26MR4q2L61m44O3N7j98k5M47l42Q0K94k41k2k10K02N2q8K7j63
$$ 24 177 -19 33 -93 -89 5 -77 284 -160 -97 -40 -238 -263 184 -158 -78 216 -25 -47 -257 -55 -3 -91 -64 -227
2639b27L70j81O8r4j58J55K49j71q7r5J84o3O7J40j49j08L9k18Q4L62k44J79k22
$$ -227 143 -38 30 -64 -222 -67 182 11 -76 -171 13 -50 17 157 8 -100 -61 -279 -195 167 -77 102 -120
2662a20J9m8K53k96L47j44L2j17L00j77J0pJ45o5J7km6k80K05l6k21K05j61O7
$$ -120 -101 -149 104 -192 155 11 43 -74 226 49 59 52 197 132 149 147 101 -179 26 -10 -231 -26 -187 -120
2686a20m7J41J56N1O0j79N1k92L26r5p1K48k87P2j03K48m00J13J17J95k82K6j92
$$ -120 -167 -26 130 181 241 62 113 -179 147 52 -19 229 -58 14 -89 159 -241 -128 -11 184 -98 -72 -264
2709b64K53j05M7J95r2q2J50Q0j87K58M0ok19p2K7j54J01K2J23k17P9j02K24k61
$$ -264 -11 -116 -69 126 34 -48 102 182 -5 253 293 287 68 -4 23 -131 -30 -8 115 -102 -23 -125 99 -162
2733a62N3K15j65k7N9m6K13q5K06J7k67J11j45R2j07J46J8j99MJJ9k83M9M55j15
$$ -162 -109 106 -59 -86 -27 -73 140 55 261 278 11 122 -23 69 -38 108 126 -73 -69 -68 -49 -332 -283 172 57
2758E7l33K76j19j9j4M05J9M9n8k35N7r5N2O2j42r6L15k56j38J10K92k73K13n3
$$ 57 -276 0 -119 -138 -152 253 272 321 263 28 85 -10 42 104 -38 -134 181 -75 -213 -103 189 -84 129 76
2782G6n7J17o5l3k14J88p4J7k06K77KK32k88j33M17k02l11K70j56J68o8J62M7
$$ 76 19 136 71 38 -176 12 -62 -45 -251 26 28 260 -28 -161 256 54 -257 13 -143 25 -43 119 166
2805A66j95j43L34M3m49L07j16P6K2J02Kj7j99o8K13j0k53K37N8j44L4M3qk09
$$ 166 -29 -172 162 205 -244 63 -53 23 45 147 149 132 -67 -135 78 68 -185 52 110 -34 0 43 35 -174
2829a74L70k90q7K06l9k37N2J00Q7p7L8K60j64p7o6K00J09m17J72J33p1O0k56
$$ -174 196 -94 -181 25 -14 -251 -199 -99 -12 -89 -51 209 45 -32 -98 102 211 -206 -34 99 28 88 -168
2852a68J51j00J08P2j1k57o5J95j5k9J78o5j8J03k0k03o3K09J86J34m74rQ6M5
$$ -168 -17 -117 -9 63 52 -205 -270 -75 -90 -119 59 -6 -24 79 59 -144 -207 2 188 322 -152 -161 -75 -30
2876c0K77j44j52J0J58k78L17k30J58o6P9L2j98J39n1R7J06r6r4J60k42j8j2P6
$$ -30 247 103 -49 -39 119 -159 158 -72 86 20 99 131 -67 72 21 118 224 128 34 194 -48 -66 -78 -2
2900bk19K24r6L6K08j59l55K88J32k29L16k98K30m6k26m4L15M9J31l32J52K06
$$ -2 -221 3 -93 -57 151 -8 -363 -75 57 -172 144 -154 76 30 -196 -240 75 124 255 -77 75 281
2922B81j46k01j27K62k04L2N2Q0M8j36j81L23l3j03Q8J56l28J23m2J0J49o3n0
$$ 281 135 -66 -193 69 -135 -103 -51 29 77 -59 -240 83 50 -53 35 191 -137 -14 -56 -46 103 40 -10
2945a0RK5K51m04M2J56L12l41L2J6Qq8JK34j20j87l9K01r1J74j11lRmo8O6j32
$$ -10 -1 24 275 -129 -87 69 381 40 72 88 96 8 9 243 123 -64 -103 98 7 181 70 67 76 72 4 70 -62
2972f2N6N4N6O5n3O4l4k16K38j22m3j55l1q5Q7k6J94N0p3J79k04n9K28k52K44
$$ -62 -6 48 104 169 116 180 146 -70 168 46 3 -152 -183 -268 -181 -207 -13 37 -36 143 -61 -120 108 -144 100
2997A00l85J88j02q0K92j30K03j16L3j24l2J67j51N62m06j03J85j26K25k26O9
$$ 100 -285 -97 -199 -279 13 -117 86 -30 3 -121 -153 14 -137 425 19 -84 101 -25 200 -26 43
3018D3k49L38O8k76K91k16j28Rk11K41K12L0n2k45J19r5J74j58K61k98mJ20J94
$$ 43 -206 132 200 -76 215 -1 -129 -120 -331 -90 122 152 100 -145 -26 -121 53 -105 156 -142 -146 -26 168
3041A68j36J4o9q5J52r2K4KJ93k52K1K07j40K32k74k49L55K8j76J23J26N3K0l41
$$ 168 32 46 -23 -108 44 -48 -24 -22 171 -81 -60 147 7 239 -35 -284 71 99 -77 46 172 225 245 -96
3065i6M72m43k6J02O6O9j15K36m36K02J21j78K41o9l11M29l07Q7Om9J57J8j75
$$ -96 376 -67 -93 9 75 144 29 265 -171 31 152 -26 215 146 -165 264 -43 44 50 1 158 176 1
3088AJ27Q9k0k70J4%L6j07K78k17K27j34Q6j39k9L27l00J40l39J62J86j45m0Q8
$$ 1 128 217 197 -73 -59 -59 -23 -130 148 -69 158 24 110 -29 -58 269 -31 109 -230 -68 118 -27 -67 21
3112B1l4Q0j80K77j33J45N5j44k38J46J23K23o45K65K35j89j46J30j98J94q3L7
$$ 21 -13 67 -113 164 31 176 231 87 -151 -5 118 341 -304 -39 196 7 -139 -9 -207 -13 -96 -59
3134e9R9j47L5Q6J91j93j63j6J36J52k39k11M35l1L0j98q7L49k68O5J8P9j83o9
$$ -59 40 -107 -72 14 205 12 -151 -167 -31 121 -118 -329 106 75 105 -93 -180 169 -99 -34 -16 63 -120 -189
3158a89J54j2m5J72l1k03J70m8j18k6J71J71j92K2J19r1R1p7Q7k43J91rq3k8m9
$$ -189 -35 -47 -92 80 49 -154 16 -32 -150 -176 -5 166 -26 -4 115 24 115 38 125 -118 73 64 -19 -47 -96
3183i6m0J15O0Q6l5r1L14j09k38m2n4pM71m82L96k37n2J53Ll04j25L35k01N62
$$ -96 -136 -21 39 125 90 -1 313 204 -34 -76 -130 -137 334 -148 248 11 -41 112 115 -189 -314 21 -180 382
3207C82o76K42J67p9j75K30k75J13k26J63L71l14k36J99J31R5j00%l1l89K95O8
$$ 382 -294 -52 115 36 -139 91 -184 -71 -297 -134 237 -77 -313 -114 17 112 12 12 -19 -408 -113 -45
3229d5J87j71J27n4J35k34M7K1K17k30o9r1K75j67Q0p6J09Q6j54j39j83L64lk1
$$ -45 142 -29 98 44 179 -55 -8 13 230 0 -69 -160 115 -52 28 -48 61 147 -7 -146 -329 35 32 11
3253A1o1l1m4l2QN5k0R2q0J48M0K09k58l52J74l76O93q1pk8po9j82K34m8K3m4
$$ 11 -50 -81 -125 -157 -149 -94 -114 -22 -102 46 86 295 37 -315 -141 -517 176 95 88 60 53 -16 -198 36 -12 11 -33
3280c3j12K48J16m13K56P3K04k24N1j32J08o8K09j20m08j8K26R4j16K3p8J93k23
$$ -33 -145 103 219 -194 62 135 339 115 166 34 142 74 283 163 -245 -263 -37 57 -59 -36 -114 79 -144
3303a44Q6K60l22J07K41k72J58j2k29J13K7J57Q5l57L25l11n6L69k40K01k78n7
$$ -144 -58 202 -120 -13 228 -44 114 102 -127 -14 13 170 255 -102 223 -88 -144 225 -15 186 -92 -149
3325a49L15l22K75j35R2k34J79k17J00J9k07L97N0M8n2J4k82L25l41K42j34o5
$$ -149 166 -156 119 -16 76 -158 21 -196 -96 -77 -284 113 163 211 159 173 -109 216 -125 117 -17 -82
3347h2j2J66L4j23j11M51q03K35K37R3k64L21j5k73K28Ok77K47k46K81j42J10
$$ -82 -94 72 106 -17 -128 323 -480 -245 -8 85 -179 142 127 -146 82 88 -189 58 -188 93 -49 61
3369F1lj87Q7j11Q1J92j5l08K64j05K12n4Q9m03R4l9J69J68q9J52m00K24p5j30
$$ 61 58 -129 -42 -153 -72 120 105 -203 61 -44 168 114 203 -200 -106 -145 24 192 103 255 -145 79 4 -126
3393a26P6k5O4M16n69K22k08J15L44k83k72L73n4m9J26k42J92l0k8K9m2k01L12
$$ -126 -50 -75 -11 405 -164 58 -150 -35 309 26 -246 127 73 24 150 -92 100 70 42 71 29 -172 140
3416A40j0L7k39p3K06K9j8J38j72L9J66r0p6m71N30l60QL40l01O6R0N5P9mp2Q
$$ 140 130 167 -72 -145 61 90 72 210 38 77 243 153 77 -394 136 -224 -216 124 -177 -111 -21 34 113 109 37 45
3442D5j64k3M5K03l00j2K82j64j03L09q1J25m29PL87k71M2J96j77K42k5q5q4j06
$$ 45 -119 -142 -97 106 -194 -206 76 -88 -191 118 37 162 -267 -260 127 -144 -102 94 -83 159 134 49 -35 -141
3466a41K32P1k44L75o52K06P0J27k44K33Nj13J40n5Q9j45R0o2J31O5k24q2K20
$$ -141 91 162 -82 293 -359 -153 -83 44 -200 33 38 -75 65 10 99 -46 44 -18 113 178 -46 -128 92
3489I2l4j38J56k20L20j20j53K65r8J37k33l64K17K19k67L61r6K20k63j3q5J35
$$ 92 58 -80 76 -144 176 56 -97 168 70 207 -26 -390 -173 46 -221 140 44 264 1 -12 -97 38
3511C8k61K69p6j55L45k11l20L51j13M6K5J85k59M1Q6k7N9qk41P9M7R3j70K0K14
$$ 38 -223 46 -30 -185 160 -51 -371 -20 -133 -87 -62 123 -136 -95 -9 -36 23 15 -226 -147 -100 -7 -177 -157 57
3536E7J94q4J9j75k36J67n2M5n4j63L70j86J54l1l2R5j86J04R9m41J7M56r6R6
$$ 57 251 167 186 11 -225 -58 -110 -65 -119 -282 88 -98 56 25 -7 88 -98 6 105 -336 -319 137 41 137
3560A37k45j5K64j30J50k98K69l1l5q3j15J33j81J4J05p1K71k10QJ69n00L86Q3
$$ 137 -108 -123 141 11 161 -137 132 101 66 -17 -132 1 -180 -166 -61 -132 139 -71 -63 106 -394 -8 75
3583G5k50K36j55L64j75J84m46P8R4j96J54O4M1j14J12j74J78J3N0j08j5k10K48
$$ 75 -175 61 -94 270 95 279 -167 -89 5 -191 -37 27 68 -46 66 -108 70 83 133 25 10 -200 48
3606D8k52K20J09Rj81N1K53n32L61o8n6J39q2J80l1k39J96j68L8J16J20o4m7m59
$$ 48 -204 16 125 134 -47 4 257 -275 86 18 -38 101 19 199 168 -71 125 -43 -5 111 231 167 120 -339
3630c39M88J89j31j21jl8k44L58k19L34l72R6J2k8J2j22J40j36J23j39J38k6j36
$$ -339 149 338 207 86 85 47 -197 161 -58 276 -96 0 12 -16 -4 -126 14 -122 1 -138 0 -26 -162
3653a62K63R1m13J91K67n1k37K11L0l74K13J9M1o0j26j07J21n7pJ68oJj10k0J30
$$ -162 101 192 -221 -30 237 186 -51 160 190 -184 29 48 89 29 -97 -204 -83 -140 -147 21 15 16 -94 -114 16
3678A6P5j41k2J28O1l57K99j4Q1j53N1J96l49P6J65j48K63j76j10j09K52j25n8
$$ 16 91 -50 -72 56 117 -240 59 45 126 -27 24 220 -129 -53 112 -36 227 51 -59 -168 84 -41 -99
3701i9J22k06k1L86k61Q0j97L77l20K06k19J41j40L15j61RO2P8K8n9j89j50M18
$$ -99 23 -183 -204 182 -79 1 -196 181 -139 67 -152 -11 -151 164 3 12 74 152 180 121 -68 -218 200
3724B00m42J98k71K09J37J11j47N2J79j17J1o9k13J98k20N4J82o6K25R3k95k23
$$ 200 -242 -44 -315 -106 31 142 -5 47 226 109 120 51 -162 36 -184 -130 52 -14 211 304 9 -214
3746b14M59j40j39M2p4j59k0K15j7P5j70PrK16P3o8J9k20J11j04j2oJ95j61K82
$$ -214 245 105 -34 8 -66 -225 -245 -30 -47 28 -142 -135 -144 72 145 77 96 -124 -13 -117 -129 -135 60 -101 181
3771A81Km42L61ql3jol32M07k62O5O2j35Q4K69j75j1K10j54j65PJ88P8j05j50
$$ 181 183 -259 102 94 61 60 54 -278 129 -133 -68 -6 -141 -57 212 37 26 236 82 -83 -76 112 190 85 -65
3796f5K05P2o4o5J83j60k29M37k52J50k22j56J3rJ14K6l8R3n0K02l84J43on7P5
$$ -65 140 212 148 83 266 106 -123 314 62 212 -10 -166 -153 -162 -48 -22 -60 33 -17 185 -199 -56 -62 -119 -44
3821d4r2m9K67j04Q0j08K77j60k32R6L5O7J35k68J74J37j93N5q3q4N2N2k69K09
$$ -44 -136 -185 82 -22 58 -50 227 67 -165 -69 -34 33 168 -100 74 211 18 73 -10 -94 -42 10 -259 -50
3845e0j70O2L47k44mk48K61N2M4J26N0PKl12J75O4j99J8k44L54J8P2k02r3J47
$$ -50 -220 -158 189 -55 -59 -307 -46 6 50 176 226 233 235 -77 98 162 -37 -19 -263 91 109 181 -21 -114 33
3870C3r8j32J39j58K78j21M5m7K73l35L61k44J19k9oQj76J43P6l8n1j93O2J96
$$ 33 -65 -197 -58 -216 62 -59 -14 -61 212 -123 238 -6 113 84 78 86 -90 53 129 91 40 -153 -91 105
3894A05k15Kk5K18O4j4L9q1j16k11L45j23P2n2J85n2J05l7k17j18N5J33l8K1l34
$$ 105 -110 -108 -133 85 149 135 174 93 -23 -234 111 -12 60 8 193 141 246 209 -8 -126 -71 62 24 45 -289
3919b89L31k19k5K38l9%k59K10RP6J79n8j59j8j02r1L3J58l3M36m18j08L28j0
$$ -289 42 -177 -202 36 -3 -3 -262 -52 -43 33 212 154 -5 -23 -125 -216 -183 -25 -58 378 -40 -148 180 170
3943A70l52k13O46m5j30m36K69LK67k27j35K26j84K1j38J75J21q5L01l27P0l52
$$ 170 -182 -395 251 206 76 -360 -91 -88 179 -48 -183 43 -141 -120 -258 -83 38 -47 254 -73 -3 -355
3965c55M79j23N2O5l25r9K09R4K5r5K26j62J15k2j21l3J81l82K03J72j20j73K99
$$ -355 124 1 53 118 -207 -306 -97 -3 22 -73 153 -9 106 84 -37 -70 111 -271 -68 104 -16 -189 110
3988A10Qj87p1J4M2J06j03pO8J0j11K38m6M6k73K21kk56K67n4n6q0P1J11j65R4
$$ 110 118 -69 -140 -126 -84 22 -81 -88 -20 -10 -121 117 71 117 -156 65 63 -193 74 20 -36 -116 -45 66 -99 -5
4014eR6j76K70m33O6J24j08K06j12J3K80k5k39k2J11L44j78j70j3K44k21K7p0
$$ -5 91 -85 185 -248 -182 -58 -166 40 -72 -59 221 196 -43 -65 46 390 212 42 29 273 52 79 9
4037Ij17K02k43O5M2J73R4l64MO4N6J17j96K28J03k13r6Q7q3M59n53M6K00j83
$$ 9 -108 94 -149 -84 -42 131 225 -139 -135 -71 -15 102 -94 134 237 24 -72 15 -68 391 -162 -116 84 -99
4061i9j28J75k37L44j35L7P3Q3p8n8K2l4k4L32j0l11j27L56j41k7L8O4K17l80
$$ -99 -227 -52 -289 55 -80 -43 30 113 35 -23 -1 -35 -59 273 263 -48 -175 181 40 13 51 115 332 -48
4085d8q1J92J28J01j80k24K20j20Q2j06J7k6J56n3lk26J03J99j55J30k37L50l86
$$ -48 -129 63 191 292 112 -112 108 -12 70 -36 -19 -45 111 58 55 -171 -68 131 -24 106 -131 219 -167
4108a67K09l1l9j5k30M22J44k8k47l9n1n0J86j03q5K32J7k29OL20m22J98o1k30
$$ -167 42 11 -28 -43 -273 149 293 265 18 -21 -72 -122 64 -39 -124 108 125 -104 -98 222 -200 -2 -63 -293
4132b93J83J11j02N5K38k1ml42R6Q6J0l47L38j90O5K25kno0N6k8j21j05J1L5J07
$$ -293 -110 1 -101 -46 192 171 167 -175 -79 7 17 -330 8 -182 -117 108 106 101 41 97 69 -52 -157 -146 -111 -4
4158dj4j54J63k12J36R5K30j60l1K2%k54K35L4Q2j43j89K45j39j54n5J03J46m2
$$ -4 -18 -172 -9 -221 -85 10 240 80 49 71 71 -183 52 86 168 25 -164 81 -58 -212 -267 -164 -18 -60
4182f0p3J99j87L28k13j33N9R6j81P2N9L1q6K56k18r4P6L1P0j85K71j29j10J49
$$ -60 -133 66 -121 207 -6 -139 -80 16 -165 -93 -34 -3 -89 167 -51 -145 -69 -38 32 -153 118 -11 -121 28
4206B8j86K62L9n6k96J41J49r4n0M02l55N7K48m31k67L81Q6p6R3j4J6j00J95k08
$$ 28 -158 104 143 87 -209 -68 81 -13 -63 339 -16 41 289 -142 -409 -28 58 -18 75 61 77 -23 172 -36
4230c6J06k05J6J09n8N6o1J10j61O23n57J05r6J57L7j82P1l25M39k06K43k49J54
$$ -36 70 -135 -119 -10 -68 -12 -73 37 -124 499 -58 47 -49 108 145 -37 34 -291 148 -58 185 -64 90
4253I0j95k0j31M34k16J58j9J0l8M0j89J91k69K50l28K12M9j02K7M6K65j75j55
$$ 90 -105 -125 -256 178 -38 120 101 111 73 113 -76 115 -154 96 -232 -20 29 -73 -46 0 265 90 -65
4276f5N1J90l63P8J43j27K05l00L28r4K7r9J35j99l8J25n9K17k34M0k60L69j9
$$ -65 -14 176 -187 -109 34 -93 112 -188 140 46 73 -26 109 -90 -128 -3 -62 155 -79 -39 -299 70 51
4299E1j98J15J37k97K01r4M8J13Qr9J19o2k6o6O4J14j44r4J66Q8j18n7j48L58
$$ 51 -147 -32 105 -192 9 -85 -37 76 84 -15 104 42 16 -50 14 128 -16 -110 56 144 26 -31 -179 179
4323A79J2k04MNP1r5J55k57L49n00J12L65j88j20o4L72j77m1j65M28l56j32K83
$$ 179 191 -13 -9 -4 67 -28 127 -130 219 -281 -169 196 8 -112 -176 196 19 -22 -187 241 -115 -247 36
4346C6j53k8J41N7Nk36L02j76J5J49l80K44k04Q8J80r2J27p2K02l02n3Q7J58K4
$$ 36 -117 -145 -4 53 58 -178 124 -52 -37 112 -268 -24 -228 -140 40 -52 75 3 205 -97 -150 -63 95 119
4370A19j64j59J04j3J69L16k67J21m08O1K0L7j27K92n2P3q0r4j76J83j53j0K51
$$ 119 -45 -204 -100 -113 56 372 105 226 -182 -121 -101 -64 -191 101 49 122 42 -52 -228 -45 -198 -208 43
4393D3N7p4P9J08m37L57M1k72r9L13j61N0J2K2O9J17k73l04N81r7k44LL9O3j71
$$ 43 100 26 105 213 -224 133 174 -98 -197 116 -45 5 17 39 108 225 -48 -352 229 132 -112 -109 -70 -7 -178
4418a78M30k33j00j10K67K9k07m0K20k25k5K61n5R6l06J83q7M9k40J61J07J1j18
$$ -178 252 19 -81 -191 76 105 -102 -142 78 -147 -172 89 34 130 -176 7 -80 -31 -271 -110 -3 8 -110
4441a10n8K69k08J9m4L87k08j58J02J14k14N0J47j38R5j74J96J07j57j33K7J32
$$ -110 -168 101 -107 -88 -132 255 47 -111 -9 105 -109 -59 88 -50 45 -129 67 174 17 -116 -89 43
4463D3j22K96j32k76L81k51K21k2p6j92N9Pq6J33k70M27p2Nk17P5J01j39K35k17
$$ 43 -79 217 85 -191 190 -61 160 138 62 -130 -71 -64 -150 -17 -287 140 68 73 -144 -69 32 -107 128 -89
4487h9rJ48j29K9K30j74k2r9M50l74K02j50jj39J66o8J31p2R0j7k41M6P4J1j46
$$ -89 -98 50 -79 -50 180 6 -16 -115 335 -39 163 13 12 -127 39 -29 102 30 120 103 -138 -92 -18 -7 -153
4512a53K97m02K40L78l29N7j04j9J64k07n9K11L0j75L7K40j89r8k7O4K9J47p0
$$ -153 144 -258 -18 360 31 88 -16 -35 129 -78 -137 74 104 -71 -34 206 17 -81 -108 -44 -15 132 62
4535F2l04K99l33L84j44p3J88l02L46j56l5o7J22j76J97j30L25k83J67O4l36P6
$$ 62 -242 57 -276 108 -36 -109 79 -223 123 -33 -68 -135 -13 -189 8 -122 203 -80 87 151 -185 -109
4557a09J2j00J09J25R7k25J49J0k17J50k2j47J97J06Nk96p1o3J84J51k96M27k8
$$ -109 -97 -197 -88 37 134 -91 58 68 -149 1 -21 -168 29 135 140 -156 -227 -290 -106 45 -251 176 148
4580A48j22J1R1k43J57j66J31j61j37L67j86K80k78K92o7k7k9L8l63R0J71m7K13
$$ 148 26 37 128 -115 42 -124 7 -154 -291 76 -110 170 -108 184 117 90 61 99 -264 -174 -3 -50 163
4603A63j74P3n7k7K7m4k73J24J87NL2J06k18K60j29j52N1Q0j32j7P5J32m3r6r0
$$ 163 -11 62 5 -22 5 -39 -312 -188 -1 4 36 142 -76 184 55 -97 -46 34 -98 -115 -40 92 49 -47 -137
4628a37J53j17QJ24J98l04k22L25M51n39K48k17n2K02n9j02J4r0lJ74m4j01K58
$$ -137 16 -101 -93 31 229 -75 -297 28 479 -60 188 -29 -81 121 62 -40 -26 -116 -119 55 11 -90 168
4651A68j42j79M00l38K06j39q8m6j43M37j53k27J07K19k30j53N9NL38P3j45J21
$$ 168 26 -153 247 -91 115 -24 -112 -158 -301 136 -17 -244 -137 82 -148 -301 -242 -237 101 174 29 150
4673A50n5K1n09N78q3J8l00J73J35M7J2k48n7Q3J76j60k7J46j21L9J8k5K89l54
$$ 150 95 116 -393 185 102 120 -180 -7 128 175 187 -61 -118 -35 141 -19 -46 100 -21 18 36 11 300 -54
4697e4K47J81l22J02m0k47j60K2K93k73J22L21j44l30K3K23Q1n2mK50l83K26k7
$$ -54 193 374 52 154 114 -133 -293 -271 22 -251 -129 192 48 -282 -259 -36 45 -7 -11 239 -144 82 55
4720E5k15Q2j17K72k03J85J42J45m01L29k40n8j26J81j42j31L72J33k44J28n2
$$ 55 -160 -78 -195 77 -126 59 201 346 -55 274 34 -24 -150 31 -111 -242 130 263 19 147 95
4741I5Jk57K25j08P3jn3Q9j19l4J48m7R1k09N09l98J72k4J5j07k0j12mM7j81J78
$$ 95 96 -161 64 -44 29 28 -25 64 -55 -89 59 12 103 -106 403 5 177 153 168 61 41 -71 -75 -28 -209 -31
4767c1R8J00K4k28k05J00J73j91K50j30k10M51k56Nj5K36m12L25j55j38L45pj10
$$ -31 67 167 191 -37 -242 -142 31 -160 90 -40 -250 201 -55 -50 -65 171 -241 84 -71 -209 136 129 19
4790A9p7J62p4r6k34L69n0KPn9m2p8LJ62O8j28J45K7k2Kk83K13L4j71L22j22j09
$$ 19 -58 104 30 -66 -300 69 19 21 28 -31 -73 -151 -148 14 82 -46 99 126 104 106 -177 36 70 -101 221 99 -10
4817a0j92M11j69j3K3K40m26K69p7Rj52J54j94J63k53L78j77J59N2l88K89K8o4
$$ -10 -202 209 40 27 50 290 -136 133 56 65 -87 67 -127 36 -217 161 -16 143 195 -193 96 124 60
4840F0l33L99j90K71l6j5k97K1k31L68P2j07J26M7j12j97J5m0J89j98K15o4j2
$$ 60 -273 126 -64 207 171 156 -141 -120 -351 17 89 -18 108 155 43 -154 -139 -179 10 -188 27 -37 -49
4863d9K79j37k00j01K75J92j18n8j79L81j55k61M2lk5K71k53Q3N9M3j08J64k66
$$ -49 230 93 -107 -208 67 259 141 83 -96 285 130 -131 -89 -92 -117 154 -99 -16 43 86 -22 142 -124
4886a24K23p3j98K76p6r9Q2O0o5k9K77k84J7P8J6P0J3j90j13K02R2k17l9J53r7
$$ -124 99 26 -172 104 28 -71 11 71 6 -23 254 -30 -13 65 81 151 164 -26 -139 63 155 -62 -101 52 -45
4911d5L33j27j09j5l59J59M39j65o0l45L10qNk2M1j64K35j28j98L32k12J58k72
$$ -45 288 161 52 37 -322 -163 276 111 51 -294 16 8 13 -9 32 -132 103 -25 -223 109 -103 55 -217
4934b17M7J54pJ13k09j44M77m45m4J2M77l03n6K70o5m3K5O4j23R2k3J86m16M43
$$ -217 -170 -16 -23 90 -119 -263 214 -231 -275 -263 214 -89 -145 125 60 17 42 106 -17 75 52 238 -178 265
4958B65m24O8J09K70q1k60j03j07M50k88J56r5J79J91k84j95K46j05M3r3N0N7
$$ 265 -159 -91 18 288 207 -53 -156 -263 187 -101 55 -40 139 330 46 -149 97 -8 35 -58 -8 49
4980D9j69J65R4j2k96J08M8Q3j94J48r3M2k7r8M07k14o1J78r2J14l19J52o2N5
$$ 49 -120 45 139 127 -169 -61 -13 70 -124 24 -69 -27 -54 -152 255 41 -20 158 66 180 -139 13 -49 6
5004Fj23j23L39J41k48J5j82J11K65k50K07r6P6l41L67j70K8p6k9J99j74J61j45
$$ 6 -117 -240 99 240 -8 7 -175 -64 201 -49 158 62 138 -203 164 -6 22 -54 -83 116 -58 103 -42
5027d2j49O8J68P3l23P7L52j68J7j09Pj01K47j49p4p4k1O0K1j4o6J85o2KPL8j47
$$ -42 -191 -123 45 118 -205 -128 224 56 73 -36 -29 -130 117 -32 -106 -180 -201 -141 -120 -134 -200 -15 -77 -75 -68 -30 -177
5054a77K27j60P6M00o47K19l6J27J6j58K32k28Q7j23J72j79J57J1M9J95j66j7
$$ -177 50 -110 -34 366 -281 -62 -98 29 45 -113 119 -109 -22 -145 27 -152 5 16 65 260 94 77
5076G7L0o7J49k78j60K64J45l17LJ55ljK44K38m12m51N04QQ3K0m06j25O9J46J73
$$ 77 107 40 189 -89 -249 15 160 -157 -154 1 -2 -3 241 479 67 -384 120 128 211 231 -175 -300 -231 -85 88
5101H8k0o9K00l37K33l55K57R5r9J27J1k46J50k57M42m5j0k29P6J53n01K34L28
$$ 88 68 -1 199 -138 95 -260 -3 92 -7 120 131 -115 35 -222 220 175 165 -64 12 165 -336 -102 226
5124B26p2J07m30O8L9P0l22M15n03M91q2K26l37M10n98J41M19l37O3j79P5L22
$$ 226 154 261 -169 -101 -62 8 -314 101 -402 89 7 233 -104 306 -292 -151 268 -69 -6 -185 -110 212
5146B12k04%K35j43j16J27P5nn7k06J31J19l9j7k10K6K6O1q0J60mk07J25L57k81
$$ 212 8 8 243 100 -16 111 186 181 124 -82 49 168 129 112 -98 -72 -46 15 -65 95 91 -116 9 366 85
5171H5N1p7m06K45OQ9K26k17K1k42J73o7J87j36j86K14J71j82R5J07k23J00l37
$$ 85 136 59 -347 -102 -96 -7 219 2 23 -219 -46 -113 74 -62 -248 -34 137 -45 50 157 -66 34 -303
5194c03M11K7n7r1q3j05K26K58m87L13qj14J60l10K32N1k90J57j14L45j85l2p1
$$ -303 108 135 78 -13 -96 -201 25 283 -204 109 101 -13 147 -163 69 120 -170 -13 -127 218 33 1 -70
5217g0J45j93L50K57m24q3PK79l17p3K25j27kJ37N7l03J97j11j30J13O7mJ7L1
$$ -70 75 -118 232 489 65 -18 -11 268 -49 -122 103 -24 -26 111 168 -135 62 -49 -179 -66 1 -3 14 45
5241D5K2j20K06p5K48q9l94P9K40j75j54L11j65L29K2n27J34J02l5J39k16j61
$$ 45 67 -53 153 78 326 237 -157 -78 162 -13 -167 144 -21 308 330 -197 -63 39 4 143 -73 -234
5263b34R6O2K79k94K46k58K98m02K72k61K49J8n0mJ3k57L33l4j1j04M5k43M08
$$ -234 -138 -76 203 -91 155 -103 195 -207 65 -196 53 71 21 17 30 -227 106 72 61 -43 2 -241 167
5286A67j99j38L07k84K9K1op8K9P0q1J22o6K88j52k65J63j85M31k67j31M22k42
$$ 167 -32 -170 137 -147 -118 -97 -103 -181 -152 -82 -163 -41 -107 181 29 -236 -73 -258 173 -94 -225 197 -45
5309d5j52K19j24K54M4l07N5J39j57J44k53J11L68K4q5p1n0j09j65L87j06j16
$$ -45 -197 22 -102 152 196 -111 -56 83 -74 70 -183 -72 296 320 235 164 114 5 -160 227 121 5
5331Ej73N8L18j35k98K58j34J00p2J39j29l7o6K73j2o9K11j31jn1L2j38J17k00
$$ 5 -168 -110 208 73 -225 33 -101 -1 -73 66 -63 -100 -166 107 95 26 237 106 105 54 86 -52 65 -135
5355a35n3L21jj11k7j64K03q9j01J70M2K43j14j04r6J27J0P3l68M39l76J45N4
$$ -135 -188 133 132 21 -6 -170 33 -56 -157 13 55 298 184 80 -16 111 121 194 -174 265 -111 34 88
5378H8j78n8N7J17j0N5j21K11lj83j18K48r0RJ49j15j06M4r3J65j07m9P6J30m1
$$ 88 -90 -148 -91 26 16 71 -50 161 158 -25 -143 105 15 24 173 58 -48 -4 -97 68 -39 -88 -12 118 77
5403G7k21O1J27j92K42k07m8N4M76j96n1q0j71J56k31J2N94m84K16n0j38L05k12
$$ 77 -144 -83 44 -148 94 -113 -161 -107 369 173 122 42 -129 27 -204 -192 402 -82 134 84 -54 251 39
5426C9J52N8j71j91M3r4L40k1k46K0J09N8N4l0O6l66j07L12j45o9L74j34K7r2
$$ 39 191 249 78 -113 -70 -164 176 155 -91 -71 38 96 150 120 186 -180 -287 25 -120 -189 185 51 78 -14
5450a4l72P70j4l32r0J04l9k4j52K04j28L43l65J01k68J99j05K29N9q8j93K15
$$ -14 -386 384 370 38 -52 52 13 -11 -163 41 -87 256 -109 -8 -276 -77 -182 47 106 18 -175 40
5472D0Q7j18J76K22m72J16rJ81j78J10k05K39k33K39j94k28K19k55K32P8J12j52
$$ 40 127 9 185 407 -65 51 42 223 45 155 -50 189 -44 195 1 -227 -8 -263 -31 47 159 7
5494Gk26o7L00j09J26L2K2j4n6r7J94j18O6l04N06k33j68L10J91p1l34j27J64
$$ 7 -219 -286 14 -95 31 63 85 71 15 -82 112 -6 60 -244 262 29 -139 171 362 291 -43 -170 -6
5517fk0j27m8k9L36k01nr9K24k1j90J99K00k57J76J24j76j25J92k08J56j98p8
$$ -6 -26 -153 -201 -230 106 -95 -100 -199 25 4 -186 13 213 -44 132 256 80 -45 147 -61 95 -103 -181
5540a81j77K81P6k30L03R5j22l1Kr4J27j42pOK42k09K54l06K7Q3J05p3J01J41
$$ -181 -358 -77 -1 -231 72 167 45 14 16 -78 49 -93 -100 -94 148 -61 193 -113 -86 -3 102 29 130 271
5564B71k21P8L5j60j24L16j19Rk61M25l34J43j33O8j78m4K21J23Lk17J71M1j64
$$ 271 50 128 163 3 -121 195 76 85 -176 249 -85 58 -75 -7 -185 -229 -8 115 118 -99 72 113 -51
5587e1k05J04O1J33j54P3k15J75j6L05j65K17k66r9k2k08K55j43J03K87j83j61
$$ -51 -256 -152 -91 42 -112 -39 -254 -79 -95 210 45 262 -4 -103 -125 -333 -78 -221 -118 169 -14 -175
5609a75K58l72J22J68K61l01L48k93L10j40l11K8K93J8l26J15l5L2R3j95K48j15
$$ -175 83 -289 -167 1 262 -39 309 16 326 186 -125 -97 196 214 -112 3 -32 0 93 -102 146 31
5631C1j52L89l13J04j34m5L9Q0K07l03Q8r8K96p3j07j98K16j01q0L96Jm31o0J07
$$ 31 -121 268 -45 59 -75 -120 -81 -1 206 -97 -9 -107 189 116 9 -189 27 -74 -154 242 243 -188 -248 -141
5655a41n6K93J96n01kK51K6l36K61k26J24K73q3k02K55j86M0M6l68K64K24k47
$$ -141 -197 96 292 -209 -211 40 66 -270 -9 -235 -111 162 79 -123 132 -54 -14 32 -336 -72 152 -95
5677i5J47J48j25j60nJ99j58M1r2j14L33j06l0J24l06N6J21J03k05q2K36K03q3
$$ -95 52 200 75 -85 -90 109 -49 -8 -100 -214 119 13 -17 107 -199 -143 -22 81 -124 -206 30 233 150
5700A50j79n4j45M62q7n5J36l18J18k1q8J66M2k14M7o2p6J50j41J85j61J11J6
$$ 150 -29 -83 -228 234 147 92 228 -90 28 7 -81 85 127 -87 -40 -102 -178 -28 -169 16 -145 -34 -18
5723a8Qk0rmQ3R2j62K86j15J4k34M3l9M9J78l9j25J4n6K28j09j77j87L72j80Q3
$$ -18 -10 -30 -39 -43 40 132 -30 256 141 155 -79 -36 -75 -26 152 113 -12 2 -54 174 65 -112 -299 73 -107 -24
5749b4q6K07P6j4k24j84K26j21K55j59J73k72K64k61l9K74m3J44m88M56k55K16
$$ -24 -110 97 173 159 -65 -249 -23 -144 111 -48 125 -147 117 -144 -183 91 48 192 -296 160 -95 121
5771A21p6o7j76J70K08j54j77m3L38k44J6j2r5M61q0l14p6J25q3N8O0J20p5k06
$$ 121 45 -22 -198 -28 180 26 -151 -194 144 -100 -84 -96 -191 270 190 -124 -200 -75 -158 -100 -40 80 5 -201
5795b01K06n2J88j97jK55k33mm9K03k79l6KJ01%J72q9k30K20K2P5k54M64j62Q1
$$ -201 5 -47 141 -56 -57 198 -35 -39 -88 115 -164 -200 -198 -97 -97 75 -14 -244 -24 -2 73 -181 283 121 202
5820B02j93j78K04N5o2M2k05r0J77N3J24o0j00J93j26k84R8p8J0J61K07l45J84
$$ 202 9 -169 35 90 28 70 -135 -225 -48 5 129 69 -31 162 36 -248 -150 -228 -218 -57 150 -195 -11
5843a1j06J53q5K81m14J18r5O1J6J78k55r6k9K83K61j03n6Mj18N8Q0j3p9P0j15
$$ -11 -117 36 -49 232 -182 -64 -159 -98 -82 96 -159 -255 -284 -1 260 157 101 105 -13 45 125 112 33 103 -12
5868a2J59m1k76L0K19m33N06l58p7K49J28k27J32J25Q2j73K2o0KJ10k03L79n70
$$ -12 147 106 -170 -140 79 -354 152 -206 -283 -34 94 -133 -1 124 206 33 55 -5 -3 107 -96 283 -287
5891b87J77L0Q8J70j12q7m4J62r5o4%L09L5l80l7L07m20K88O8j54j61K40m9m6
$$ -287 -110 -80 8 178 66 -21 -65 97 2 -62 -62 247 282 -98 -135 172 -248 40 108 -46 -207 33 -16 -62
5915f2K86k16J83j76J81l19l6r0K26J1j01K92l92J70j09J05j61P9K05k6L2N5J4
$$ -62 224 8 191 15 196 -123 -159 -249 -23 -12 -113 179 -213 -43 -152 -47 -208 -129 76 50 82 137 151
5938A51k57K14p5J4j92J32J25M5n6k64J65r7k41L35K37j08j96J6r4J69j04J44
$$ 151 -106 108 33 47 -145 -13 112 157 101 -163 2 -95 -336 -1 236 128 -68 -52 -146 23 -81 63
5960F3K50l11J78K4k21J3Q5N2J88p25J87K42j99Q8j28M09k68M4p5K05J82j75j83
$$ 63 313 2 180 204 -17 -4 81 133 321 -404 -217 25 -174 -86 -214 195 -73 -29 -104 101 283 108 -75
5983g5k2K2j93K57K11k7l89K78K01k71K10J6pl17K34j49J57j19k99K27M50o17
$$ -75 -97 -75 -268 -11 200 173 -216 62 263 -8 202 218 211 -106 128 -21 136 17 -282 -55 395 -222
6005b22K35j08K18r5Q6j95K94j47M0k70o2K62n3K47k01J06j87Q6j80K66l25K07
$$ -222 13 -95 123 28 114 -81 213 66 106 -164 -226 36 -17 230 29 135 -52 34 -146 120 -205 2
6027BJ0k8k8J38J84j71Q1J9m22M13l88L09o2k84J80L4Q5r5k6K63m42K01k67QL02
$$ 2 12 -16 -44 94 278 107 188 207 -215 198 -190 119 57 -227 -47 -13 72 -23 -49 214 -228 -27 -294 -286 16
6052A6k4J40k27L2L4J35j14j32M13l83M79m43m3K15k9q2P2M3j65j59M5K50J29
$$ 16 -8 132 -95 -63 -29 106 -8 -140 273 -110 369 -74 -117 98 69 -13 59 102 -63 -222 -177 73 202
6075B02q0L2r5k02M9N2p7J0K99k99J93j57K72j79L9L1j78J09K22k86K54l22Q2
$$ 202 122 154 59 -143 -94 -42 -119 -109 190 -109 84 -73 199 20 59 90 -88 21 243 -43 211 -111 -29
6098b9K92k83K31j99n8o7r6n8K73l11L28j52N4Q5k2M1J21L1pj14lj86L42m58K09
$$ -29 263 -20 211 12 -46 -113 -209 -267 6 -305 23 -129 -75 10 -12 29 150 181 174 60 57 -129 213 -245 -36
6123c6J91n50M98k83J47j94n1L91r3P5j31R8p5k35L18l38M32l54J88j96K50M4
$$ -36 155 -395 103 -180 -33 -227 -278 113 20 95 -36 62 -13 -248 70 -268 164 -190 -2 -198 52 96
6145I6P7j07K80m81J08J8k32K9L38m0J93r3j11J5k8k05J84L3m7j00L04l78R0J92
$$ 96 173 66 346 -135 -27 -9 -241 -212 126 86 279 186 75 90 62 -143 41 74 27 -73 231 -147 -57 135
6169A35q3L6j75LM5L3j54R5j01K14J48j7q9k02J99J22m37J4J53J85J0j12R6j30
$$ 135 52 88 -87 -84 -39 -6 -160 -65 -166 48 196 179 90 -112 87 209 -228 -214 -61 124 134 22 118 -12
6193a2J05k03r1N2J11k02L05N1l27K13L14l21J24j5p1j38J88j0l03L00m01N49
$$ -12 93 -110 -201 -149 -38 -240 65 116 -211 2 316 -5 119 104 33 -105 83 73 -230 70 -331 218
6215B18j72P9L9j38J66q0j3k57j0J08K43j06r9J51j47K80m48J00j29K45j39mJ63
$$ 218 46 125 164 26 192 112 99 -158 -168 -60 183 77 -22 129 -18 262 -186 -86 -215 30 -109 -113 50
6238E0L9N7o1l9p9j44J61j49P5K76k76k8Q6k03L26q2J31j99o3n9L05l88P1O5r6
$$ 50 89 146 85 46 -33 -177 -16 -165 -90 186 -90 -118 -32 -235 91 9 140 -59 -122 -181 124 -264 -193 -128 -224
6263b24P5N5K96l28J64J13Kn7l2J63l75K86j75J64n1l3k6r4N6J7PK68j82L0l42
$$ -224 -149 -94 202 -126 38 151 153 96 64 227 -148 138 -37 127 76 43 17 -77 -21 -4 3 271 89 119 -223
6288b23j05M54k76R9R7P4k3J56j17k71K99j6n7j90K22r6R4k68K81j50j05J48q4
$$ -223 -328 126 -150 -51 46 120 97 253 136 -135 164 148 91 -99 123 27 121 -147 134 -16 -121 27 -57
6311e7O1J13j00P5j61K64k00j0r0J32J07j3k32K95l2p8l8j10K03j87K3r7J8J44
$$ -57 4 117 17 92 -69 195 -5 -15 -105 27 134 121 -111 184 152 74 36 -74 129 -58 -35 -132 -114 30
6335C0L0j57N1R0J00l37L43l12O7nq4L87k19o3J53J29k44jJ66Ll13J38L9K62k45
$$ 30 60 -97 -46 44 144 -193 150 -162 -95 -100 -184 203 -16 -79 74 203 -41 -42 124 127 -186 -48 -9 253 8
6360Hj89J82J21J4n2j11P6j24j9K77l63P4J49r9P9K44j64k1j31r3J13q4K39n3
$$ 8 -181 1 122 136 84 -27 49 -75 -94 183 -180 -106 43 -56 23 267 103 82 -49 -142 -29 -113 126 73
6384G3O9j74q9L01j38J02n2Q6m26J77K9J9m4l0RJ82J86k91J40ql51K63O1j8j86
$$ 73 142 -32 -121 180 42 144 92 178 -248 -71 -42 -23 -67 -97 -88 94 280 -11 129 121 -230 33 94 76 -110
6409a10K18J7l2o3j77J46k01J54J03k13J94J96k72Q0k88J21J0J90m9m45L76J34
$$ -110 108 125 93 30 -147 -1 -202 -48 55 -158 36 232 -40 40 -248 -127 -117 73 24 -421 -45 89
6431H9mKK1ro4q4K5j85J66j71J94J15n7p2j5R7k47L68j52J6j93o1K51n6J76k06
$$ 89 85 87 108 99 35 -49 -24 -209 -43 -214 -20 95 38 -34 -49 48 -199 169 17 33 -160 -221 30 -26 150 -56
6457e6J98q1L4N0k77K28j40J76q7J68o23L39j53J95K3m03N31j62j0N3J72j04J3
$$ -56 142 61 95 145 -132 96 -44 132 45 213 -410 -71 -224 -29 -6 -409 122 -40 -50 3 175 71 84
6480H4j29l2k20L23J31j33q1K62j00r3j32J75K04m7j24r2p1J54k5r9Q2k34J72
$$ 84 -45 -77 -297 26 157 24 -57 205 105 12 -120 55 259 212 88 -4 -75 79 54 -45 37 -197 -25
6503b5j78J0J01K16n8j08K2m0p9N1j88M11k59J01K69l72j98L86q7O4k00j02M49
$$ -25 -203 -193 -92 124 66 -42 -20 -60 -139 -88 -276 135 -124 -23 246 -126 -324 62 -25 39 -161 -263 186
6526A86k71k98L57L64l27R1R1j48p1J49k25O9J42Q1k25j82K06K47Q6k80k49J98
$$ 186 -85 -383 -26 338 11 102 193 45 -26 123 -102 -33 109 190 -35 -217 -11 236 322 42 -207 -9
6548iJ74l10K73J07l66O7k2P5R2N1j50J05n3m9k45J84J20l95L21ON3j65K36J39
$$ -9 165 -145 128 235 -131 -64 -86 -11 81 132 -18 87 34 -15 -260 -76 44 -351 -30 -24 29 -136 100 239
6572B39l60K04O5j91K49k11k3J47j25j63J06L08l93Q0m9j01j6M29k33L10l8j47
$$ 239 -121 83 148 -43 206 -5 -28 119 -6 -169 -63 245 -148 -68 -117 -218 -234 195 -38 272 234 87
6594H7j05j05J41r7M2j5J77m5L3o1r1k4r2J10N0k13J31N0j47L83l11n1L87l10
$$ 87 -18 -123 18 -79 -37 -52 125 80 113 52 -39 -63 -155 -45 5 -208 -77 -27 -174 209 -102 -153 234 -76
6618g6R2q4J13J44k17l26M61n8k18K16k3J21L5j66r5J58O9j86K92j97k10J71q2
$$ -76 16 -68 45 189 -28 -354 107 49 -169 47 24 145 180 14 -81 77 146 -40 252 55 -155 16 -66
6641f6J5Q8P3K09n25M18k70K58j25j61r2K14K7J62o3j49Ok57J99l5M4J98l21L9
$$ -66 -51 37 110 319 -206 212 -58 200 75 -86 -178 36 63 225 162 13 19 -238 -39 -74 -30 168 -153 -114
6665a14R9J81k03J03K06j31J24M9l40K58l83J14M9j73J71j2K96j07k09J56k02
$$ -114 -15 166 -37 66 272 141 265 314 -26 232 -151 -37 12 -161 10 -2 294 187 -22 134 -68
6686f8j48L21j24K47l01P3k4Jl6K8q0K02j06j7K56j74nj91K25K9r1l9k06K19l1
$$ -68 -216 105 -19 228 -73 0 -24 -23 -59 -31 -111 91 -15 -32 224 50 45 -146 79 108 17 -22 -228 -9 -40
6711d0l5p5J33j17Q7J33j88K00m0j5kj11K9K21l7m86K11Q4l24K69J71J22J48m11
$$ -40 -75 -150 -17 -134 -47 86 -102 98 58 43 41 -70 -41 180 143 -343 -132 -48 -372 -103 68 190 338 -73
6735g3o5K33P7j03j77r6R7lK15n2j81K20j48Q7k14L32j12n0m3j92M7J22OJ6r7
$$ -73 -138 95 172 69 -108 -204 -107 -110 105 53 -128 92 -56 31 -183 149 37 -13 -56 -248 -201 -79 -73 -57 -154
6760a54J18Q4p0K26j42J38j89k66J00K29m9r9K16m10M16J98m57k1J63P9j68N7
$$ -154 -36 48 -22 204 62 200 11 -255 -155 74 25 -74 142 -268 148 346 -111 -132 31 110 -58 -1
6782aj60L02O7k88R9%n1K0J97K7l11%J19Mj8j01J08k03K31j60J49L4l2J00l31
$$ -1 -161 141 208 -80 19 19 -32 -12 185 212 -99 -99 20 24 6 -95 13 -190 41 -119 30 64 32 132 -199
6807a99L49o1p8M4j64j68M17n6n0k80mmK99P3r5Q6K17l99K23L8l0k34j6K3M21
$$ -199 150 89 11 55 -109 -277 140 84 34 -246 -250 -254 45 118 23 109 326 -73 150 188 158 -76 -92 -69 352
6832C52l01j76N0K12j16j41J10k21K13R3m3K25k01O2l41J75L2j31J59j75K08J13
$$ 352 51 -125 -75 137 21 -120 -10 -231 -18 75 32 257 56 118 -223 -48 -16 -147 12 -163 45 158
6854A58J45l55k5L2J65p0j37K34N8l19K01j12K38k80p9L0M79k14p4Q1Jn6j87J14
$$ 158 303 -52 -77 -45 120 50 -87 147 205 -114 87 -25 213 -67 -146 -116 363 149 75 156 157 101 -86 28
6878B8Q7j51q1L41l53L13k01N6m25M38j42K34q0oN1m59J85K21k32K27j49J39J53
$$ 28 115 -36 -117 224 -129 184 -17 39 -386 52 -90 144 64 58 109 -350 -165 56 -176 51 -98 41 194
6901A94j54O5j73R8m6lk4q3J31N6K7m7j08l1K66m06L31K8j70M1j47oJ88k94N22
$$ 194 40 105 -68 30 -16 -19 -43 -126 5 61 88 41 -67 -98 168 -238 93 121 -49 -8 -155 -161 27 -267 255
6926B55j10o9j0m1m0M8j51K54k75K33J16pk47J97k5j27J5J00J6j9p1K0k64K31
$$ 255 145 76 66 25 -15 33 -118 136 -139 94 210 203 -44 153 128 1 16 116 132 113 42 62 -202 29
6950B9k7j40N3J69P3j27O4m4J56k50J92K7k37R9r4K03l50K28J60rn0l05L81k31
$$ 29 2 -138 -85 84 157 30 94 50 206 -44 148 175 -62 37 -57 146 -204 24 184 175 125 -180 201 -30
6974c0K63l40Q5J8j78m3J29k47J96K78j26L6q3K62m13K71j90R4J96o38O63l11
$$ -30 233 -107 -22 -4 -182 -225 -96 -343 -147 131 5 41 -42 220 -193 78 -112 -18 178 -460 203 -108
6996a08k9J05O7n8r7pN8K35l45j13L86l74L14j78L14k93K44q4Q5Q8j60J25k20
$$ -108 -137 -32 35 -23 -120 -127 -69 166 -179 -292 94 -280 34 -144 170 -123 121 37 122 210 50 175 -45
7019d5l3R6J28m7J01l78L79k70M0j4J80j2oq1R0j8k12P4J3N9R9j51K3K31j42j85
$$ -45 -78 18 146 99 200 -178 201 -69 -29 -43 137 125 119 38 128 110 -102 -28 -15 44 143 -8 15 246 104 -81
7045h1Q2J93lq4j63N1j9K3n4P3M9j08J45P2o3k8j69k13L00j03L29j95L2k27R6
$$ -81 1 194 191 107 -56 -5 -24 -1 -55 18 67 -41 104 176 113 85 -84 -297 3 -100 229 34 66 -161 -65
7070f5J78k97J55M9J82k44J45l17J05Q4j1J83l43K58O0m5r2K1K14k19q9J53q7
$$ -65 113 -184 -29 20 202 -42 103 -214 -109 -25 -36 147 -196 62 122 77 -15 6 220 1 -88 65 -22
7093b2J34j87R1oJ59Q8l08k48K94J00j63J17K23j63j25q8J10k41K06L4j53J69
$$ -22 112 -75 16 10 169 257 -51 -299 -5 95 -68 49 272 109 -16 -104 6 -235 -29 5 -148 21
7115B1p2k9J89k98K54J8k82L14j97j23M24n22K66J37l10M0o4P6k0P9K10ko1J1
$$ 21 -51 -80 109 -189 65 83 -199 115 -82 -205 219 -303 -37 100 -210 -170 -234 -158 -178 -99 111 109 48 59
7139E9n2K41l5j17k02j32M94k46l95N65k39J90k42Q6J38k16P0nP8P5l01K80J09
$$ 59 7 248 213 96 -106 -238 256 10 -385 180 -59 131 -111 -25 113 -103 -33 -38 40 115 -186 94 203
7162B03m0m56K58K54k20P7j39j1L0K43pl88%J25k8j57M05j19m8J26j59p3R7q7
$$ 203 163 -293 -35 219 -1 76 -63 -74 -44 199 192 -196 -196 -71 -99 -256 149 30 -18 108 -51 -124 -27 -114
7186a14J01K54l48K06q4J62R6m02M2J14p3N1J11m06J12R9j6J79k21M2J39n2J08
$$ -114 -13 241 -107 99 15 177 273 -129 -87 27 -46 5 116 -290 -178 -79 -95 84 -137 -95 44 -8 100
7209A00l55R2K28J18k94J97j15Q5m5J55k7l65J61j9J46K7L4j52L95m75k7J40J0
$$ 100 -255 -163 65 183 -111 86 -29 56 11 166 139 -226 -65 -84 62 89 123 -29 366 -109 -136 4 14
7232A4L3R2O5j6k67q7J97K33k62lL5J31J7k23J50r4Kk37J80p1M09j44K8n95L44
$$ 14 47 139 204 188 -79 -166 31 264 2 -1 34 165 182 -41 109 15 17 -220 -40 -111 298 154 182 -413 -69
7257f9J41qp1J7n3P7J29k40J56j53p5K75j77K82j05k15K68pk63PJ37k1K03n50
$$ -69 72 64 -7 10 -43 34 163 -77 79 -74 -149 126 -51 231 126 -89 179 172 -91 -84 53 32 235 -315
7281c15M11ml91J98k22M90j35n6K48j12oj47k7K80k40j75K92m1P6m82M16l6j91
$$ -315 96 92 -299 -101 -323 167 32 -24 224 112 106 -41 -68 212 -28 -203 89 48 124 -358 58 22 -169
7304a69L84J72j01Kl72K31k23j49K53J06%j12n1j31K65p4j05J48j8l7J86j69j91
$$ -169 215 387 286 288 -84 147 -76 -225 28 134 134 22 -29 -160 105 31 -74 74 56 19 205 36 -155
7327a55J32J20K09k67r7J48j25K18k24L45l89k56L72K38l08Q0n4m2Q5P7l24K95
$$ -155 -23 97 306 39 -58 90 -35 183 -41 304 -85 -341 31 269 -39 41 -13 -55 30 107 -217 78
7349G8k21K40q8k4o6J62j24M4k66L14K80k5k17k34j18M38m5J7j07J1k79K61P7
$$ 78 -143 97 9 -15 -81 81 -43 1 -265 49 329 304 87 -147 -265 173 128 145 38 49 -230 31 108
7372A08J11l49o1K35K2r5J63k37M05n67K49L80m60Rl1J82J41j69k83M68J0m1j25
$$ 108 219 -130 -191 44 66 -29 134 -103 302 -265 -16 364 -96 -87 -118 64 205 36 -247 221 231 190 65
7395F5k85L5K63j07l7K13j02J17Kj2J46l92K31k26L93m45L57k00n0J65q7k66P1
$$ 65 -220 -185 78 -29 -66 147 45 162 164 152 298 -94 137 -89 304 -141 216 16 -34 131 44 -222 -151
7418a51J88k21P7L0N0q8K9j6P7P8J66L6l36k05L20m91M60P7P4k60M2k34K62K4
$$ -151 37 -184 -107 -77 -27 -115 -86 -102 -25 53 219 255 -81 -286 34 -457 3 80 154 -106 -64 -298 -36 -12
7442a2K26j05j38p5J53j02L75k92k4J44J12k76J96m3p4J8k41L37k76j88J89j13
$$ -12 214 109 -29 -104 49 -53 322 30 6 150 262 -14 182 139 65 83 -158 179 -97 -285 -96 -209
7464b09J13J19n7o4p5K53J41l10j1L7j33J45J61M5r7Qk19m4J21K2L6J68j93J88
$$ -209 -96 23 -34 -98 -173 80 221 -89 -100 -63 -196 -51 110 155 58 66 -153 -197 -76 -54 -18 150 -43 145
7488A45m0j56M9p0J4K56o9j94K03j73r4L7K81m11Q2M34n58J70L23l26J6N8J51
$$ 145 105 -51 -2 -72 -58 198 129 -65 138 -35 -129 -92 189 -222 -140 294 -264 -94 229 -97 -81 -23 128
7511A28j62O7m3L1k66L34n0j22K38L3k60q9N7J68p2P7qj15J1J24m38J77L11k88
$$ 128 -34 33 -10 21 -245 89 39 -83 155 188 -72 -161 -104 64 -8 69 61 -54 -43 81 -357 -180 131 -157
7535a57J00j53L66l19l7K99j14P5r5k5J92j76L6J12Q9l09K65n65N91J2k56rM7
$$ -157 -57 -210 156 -163 -200 99 -15 60 -35 -60 132 -44 -8 104 193 -116 149 -416 175 187 -69 -78 -31
7558c1K0O8j07n5j50L17q4K56k87Q3k40K24o0j37J42O7M4Jo2K1j07L10j1l80J58
$$ -31 -11 57 -50 -105 -255 62 -22 234 -53 30 -210 14 -46 -183 -41 26 70 71 9 30 -77 233 222 -158 0
7583@r4K01K9j68Q6Q0j23j55J38R1j76J37j51J0J09r6M7j8J37j68J84j64P4p2
$$ 0 -94 107 136 -32 54 134 11 -144 -6 85 -91 46 -105 -95 14 -82 -35 -53 84 -84 100 -64 10 -62
7607f2K11o3l30L61j48m1j90P2M6L64l02r8J37J90l15K66m4J49k26M7j72J93k11
$$ -62 149 86 -244 117 -31 -72 -262 -190 -144 220 -82 -180 -43 147 -168 98 54 203 -23 24 -148 45 -166
7630a66J15l8j3K31m0j12J26k00nK1M8M3o7K14l47L58k75N4n0Q2M0j8J9Pj79M6
$$ -166 -51 -89 -102 129 89 -23 103 -97 -102 -81 -33 10 -57 157 -190 168 -107 -53 -103 -21 19 1 20 27 -152 -106
7656a06R0m6J24N4l52L12K9j02L4n9j15K03p8J05l45J85L04j26L7p3j38N8Q5j64
$$ -106 -16 -62 62 116 -236 76 105 3 37 -22 -137 66 -12 93 -252 -67 237 111 148 75 -63 -5 80 -84
7680h4J46n7J99j31j51k22O04k75j82K93k83M3J04K0q5jJ93K2k4j49lK8l0j82
$$ -84 62 5 204 73 -78 -300 304 29 -153 140 -143 -100 4 24 -61 -62 131 153 129 -20 -23 5 -25 -207
7704b07J40o8j34L04K77j83j84l3J13N1j28O0k37K24j54L36j46m9J62k29J73j18
$$ -207 -67 -135 -269 35 312 129 -55 -88 25 76 -52 8 -229 -5 -159 177 31 -18 144 -85 88 -30
7726c0P4j38j17K20Q5J43k22j91L79k77O3K4r7J09n6p6K57Ml02L01L1k31J36L1
$$ -30 44 -94 -211 9 94 237 15 -176 203 -74 -11 13 -84 25 -31 -107 150 154 -148 153 184 -47 89 120
7750A20M6j40q8k08M08N8j55J32j73n8K7o1J18m16L60J19j06J10j76J5J17p6j19
$$ 120 166 26 -62 -270 138 196 41 173 0 -58 -31 -92 26 -390 -30 89 -17 93 -83 -68 49 -27 -146
7773a46K52l96M38k60N5J0K37l15L40l49L11J10n35mP3J61M8J99k96j94K0K31
$$ -146 106 -290 148 -112 -57 -47 190 -125 215 -134 177 287 -248 -252 -179 -18 30 229 -67 -261 -241 -10
7795a0n7J44N2M7k21M7KK8r9K4JJ54q7J01l4k89K15j24O5m7k3R7J0k0K09m88L70
$$ -10 -67 77 129 176 -45 2 4 32 -67 -43 -42 112 25 126 92 -197 18 -106 -41 -88 -111 -14 -4 -24 185 -303 67
7822F7j06J61k26J83p2k2J82k37O1J46K8p4j43K67k23J94J67k77Q1k35K48l03
$$ 67 -39 122 -104 79 7 -15 167 -70 -9 137 165 91 -52 215 -8 186 353 76 157 -78 170 -133
7844a33P1K3OJ24k9J75l89J18j22J7J23P9J92j02l00J69q%K50k20j30R1N5j60
$$ -133 -62 -39 -33 91 62 237 -152 -34 -156 -139 -16 63 255 153 -147 22 14 14 264 44 -86 5 60 -100
7868a00j57M80r2l02K61q5q6J69j76L69l76j%k2m3K39o4L9j25j83L67m2M5j00
$$ -100 -257 223 131 -171 90 5 -81 88 -88 281 -95 -96 -96 -118 -161 78 14 53 -72 -255 112 70 115 15
7892A5K08k67K3L4p4M2K21k09Oj03jJ72r4j22m4K36L37o27L36p9j48P9j06L43
$$ 15 223 -44 -21 13 -61 -19 202 -7 -1 -104 -105 67 -27 -149 -193 43 380 -247 89 10 -138 -59 -165 178
7916A78n2m2l03J35M03l78J23R2p6J38j01J0l8l0l2ql4J26Q5k44j39O2Q6j31L82
$$ 178 126 84 -219 -84 319 -59 64 156 80 218 117 127 89 59 27 19 -15 111 196 -48 -187 -125 -39 -170 212
7941B12m20K00j40K32k24L9L20N2o8k47J43K9j39l3j89L43O1j57J1j55M9k4J32
$$ 212 -208 -8 -148 84 -140 -101 219 271 203 -44 99 128 -11 -44 -233 110 171 14 25 -130 -81 -105 27
7964B7Lj10Q4L9r8J55n0j95M41l81l08J62K14O4J0L3j51K75k67p5R6j35K58q8
$$ 27 30 -80 4 43 -55 100 50 -145 296 -85 -393 -231 -17 47 57 90 -61 214 -53 -128 -32 -167 91 3
7988Cm7r9J4j5J94J10j74J26m2K23k00J18k65r5P7j06J73r9k36M03j02J40k16
$$ 3 -44 -143 -129 -144 50 160 -14 112 70 293 93 211 -54 -149 -72 -178 -5 -104 -340 63 -39 101 -115
8011a15R1k25L99j42l0m6M8n2m5Q7K1p2M2j22P9Q7P6l32M31k25k24L45J67l22
$$ -115 -24 -249 150 8 -22 -68 -20 -72 -117 -30 -9 -81 -39 -161 -82 5 81 -251 180 -45 -269 76 243 -79
8035g9K01k67K64k65j12P7J26J06L2q8J18p6n2K26m68M40j54r1P0L8k14p2K49
$$ -79 122 -145 119 -146 -258 -181 -55 51 83 -5 113 37 -15 211 -257 183 29 -62 8 46 -168 -240 9
8058Ij39K08Q1j76Q3j48P7J78k55K33o4L1k89N7L06l8k65M0Q0k17O6J22K2J49
$$ 9 -130 78 159 -17 66 -82 -5 173 -82 151 87 118 -171 -114 192 154 -111 -71 9 -208 -142 -20 2 151
8082A51l38L23j54r7L9l6J81n4N1o3J61k40O0n5Q5j98M96k66l0j30j47J72K61
$$ 151 -187 136 -18 -115 -76 -112 69 15 66 3 164 -76 -16 -71 14 -184 312 46 16 -114 -261 -89 172
8105A72k0k10j22M01m03J00mO9J88j83Q7p8p5P2L04l32j00j2L10J53l22q9k52
$$ 172 152 -58 -180 221 -182 -82 -86 -17 171 -12 75 -3 -78 -6 298 -34 -134 -146 164 317 -5 -94 -346
8128c46K14k09L13n6K64j4k83o7K39l4k5q6K03j4m2r5k0o5j52K18J96k1l7k26
$$ -346 -132 -341 -28 -84 180 166 -117 -184 55 21 -4 -90 113 99 57 -38 -58 -123 -275 -57 139 118 81 -145
8152a45j42L56K18m61K03L7m5J37k24J37K42l31r1K39L0k05j59L30k36L94k54
$$ -145 -287 69 287 -174 29 66 21 158 -66 71 313 -18 -109 130 160 -45 -204 126 -110 284 30
8173C0j06n7O9J52J77k35l6j12j53M09l23K21q8Q7q7kr1r1
$$ 30 -76 -133 -64 88 265 30 -6 -118 -271 138 -185 36 -52 35 -52 -54 -145 -236
8191b36
$$ Imaginary data points
##PAGE= N=2
##DATA TABLE= (X++(I..I)), XYDATA
0@%%%%%%%%%%%%%%%qJ6j6J6j6K4l2L2m0M8n6O7p5Q8j04J18j34J52j71J93k17K45
$$ 0 0 0 0 0 0 0 0 0 0 0 0 0 0 0 0 -8 8 -8 8 -8 16 -16 16 -24 24 -32 35 -40 48 -56 62 -72 80 -91 102 -115 130
37A30k76L08l42L81m25M73n22N78o41P04p74Q57r46J042j148J264j395J540j702
$$ 130 -146 162 -180 201 -224 249 -273 305 -336 368 -406 451 -495 547 -601 663 -732 808 -894
56h94J888k100K343k628K966l379L892m548N428o670Q575j1897J9317o6320M9080
$$ -894 994 -1106 1237 -1391 1575 -1804 2088 -2460 2968 -3702 4873 -7024 12293 -54027 -4947
71d947J91672J6160j41380j98072n3569R3949J49572P9640l263o5085p9607p4762
$$ -4947 186725 202885 61505 -136567 -190136 -96187 53385 133025 129762 64677 -14930 -89692
83h9692l0273L5472J02353R7928J7873q7629j22685p3374K1628R5374J15684O2125
$$ -89692 -119965 -84493 17860 115788 133661 46032 -76653 -150027 -128399 -33025 82659 144784
95A44784l7816j16982j04721j6239P6703J06588P2859K281o8954j03314p2218
$$ 144784 106968 -10014 -114735 -130974 -54271 52317 125176 127457 58503 -44811 -117029
106a17029Q891Q6213J03113M7441m3233j04142r0613j7138N8428Q7927O6387J1622
$$ -117029 -108138 -21925 81188 128629 85396 -18746 -109359 -126497 -68069 19858 86245 97867
118I7867n3200r1146o7080J0565Q2795R5300M5478l0089q2726q3514k8197M6289
$$ 97867 44667 -46479 -113559 -102994 -20199 75101 120579 90490 7764 -75750 -103947 -57658
130e7658Q7779O9971N156o1948r0071n9415R796O9741Q0677M0213k3591p2257
$$ -57658 30121 100092 105248 43300 -46771 -106186 -96390 -26649 54028 94241 70650 -1607
142a607p7229k9837M2278Q7540P0760P472n4884p6555n0912N814N8378P5277M2283
$$ -1607 -78836 -108673 -66395 21145 91905 99377 44493 -32062 -82974 -77160 -18782 56495 98778
155I8778j8939o9091p6257l3479L2728P6053O4566Q800n0049p2320m9710L538
$$ 98778 79839 10748 -65509 -98988 -66260 9793 74359 83159 33110 -39210 -88920 -85382
167h5382N4969P2895M2773j5013n9916o4439k6868K8882O7365O1411J4133m2199
$$ -85382 -30413 42482 85255 70242 10326 -54113 -80981 -52099 15266 76677 90810 48611
179D8611o9442n1253j697M7965O4731L7854j4307n7118o1591k8553K2260N9562
$$ 48611 -20831 -72084 -73781 -25816 38915 76769 62462 5344 -56247 -84800 -62540 -2978
191b978N8894J8657l3945o2412m7336o56M5334O1812L9037q216m9440n7524k8452
$$ -2978 55916 74573 40628 -21784 -69120 -69776 -24442 37370 76407 68191 18751 -38773 -67225
204f7225J7517N2049N2187J7155l0304n9147m7802n941L7678N6071L8096m613
$$ -67225 -49708 2341 54528 71683 41379 -17768 -65570 -71511 -33833 22238 60334 55721
216E5721m4326n3428k6623J8011M9927N0794J9235k3558n0919m4386q210L3149
$$ 55721 11395 -42033 -68656 -50645 -718 50076 69311 45753 -5166 -49552 -57762 -24613
228b4613N2135L6562l872m2394n2785k9309J2468M3888M5573J8448k0700m7716
$$ -24613 27522 64084 60212 17818 -34967 -64276 -51808 -7920 37653 56101 35401 -12315
240a2315m2496r206L0873N0975L7187L47l5245m6690k7337J0674M1256M5242J9490
$$ -12315 -54811 -64017 -33144 17831 55018 55365 20120 -26570 -53907 -43233 -1977 43265 62755
253F2755j8861m5286m2030j1919K5327M3815L4194P76l2575m5573k8803O881L8639
$$ 62755 43894 -1392 -43422 -55341 -30014 13801 47995 48771 16196 -29377 -58180 -51299 -12660
266a2660M4001K1227j5085l9741l7687j0011K3060M2390L4338M373k8893m3442
$$ -12660 31341 52568 37483 -2258 -39945 -49956 -26896 15494 49832 54205 25312 -18130
278a8130k8881M250L4054L9399J9024j4261l8071l7549j3349J9269L8804L3139
$$ -18130 -47011 -42761 -8707 30692 49716 35455 -2616 -40165 -53514 -34245 4559 37698
290C7698O087k5365l8862k5825M326L2106L8599K1101r704l3303l5424j3716J7104
$$ 37698 43785 18420 -20442 -46267 -41941 -9835 28764 49865 40161 6858 -28566 -42282 -25178
303b5178L5624L0460M336k4062l7070k6755J72K6660L4448K0569q024l1064l3156
$$ -25178 10446 40906 45242 21180 -15890 -42645 -42473 -15813 18635 39204 31180 116 -33040
316c3040j2885J6042L4411L0179O896j8815l2649k4582j36K4668L3549J9915p336
$$ -33040 -45925 -29883 4528 34707 41603 22788 -9861 -34443 -34579 -9911 23638 43553 36217
329C6217k9752l2082j4519J1878K9499K7645O548j8022l1664k4320j088K3164
$$ 36217 6465 -25617 -40136 -28258 1241 28886 35434 17412 -14252 -38572 -39660 -16496
341a6496L2388J9747l715k5317k8518j3310J1425K8790K7216P675j6233k9454
$$ -16496 15892 35639 31924 6607 -21911 -35221 -23796 4994 32210 39885 23652 -5802
353e802k3790k917J9269K8302J7886m657k4084k8338j4397Q980K6534K5180Q971
$$ -5802 -29592 -32509 -13240 15062 32948 28291 4207 -24131 -38528 -29548 -3014 22166 31137
366C1137j3116k6090k0822k639J8650K8292J9022k124k1371k6268j3702P274K2857
$$ 31137 18021 -8069 -28891 -31530 -12880 15412 34434 32310 10939 -15329 -29031 -21757 1100
379A100K3236P854j2970k5147k2092m783J5406K5251J7895j064j9521k3692j2354
$$ 1100 24336 32190 19220 -5927 -28019 -32802 -17396 7855 25750 24686 5165 -18527 -30881
392c0881O658K1791K3170J0006r252k2342j9789m449J3727K2987J6958j239j8084
$$ -30881 -24223 -2432 20738 30744 21492 -850 -20639 -25088 -11361 11626 28584 27345 9261
405I261k3339j3662M147J8745K0399Q664q896k0755j8895m353J2912K1972J7258
$$ 9261 -14078 -27740 -23593 -4848 15551 24215 15319 -5436 -24331 -28684 -15772 6200 23458
418B3458J258j5243k0558j1601M360J7769J9702R081p908j9523j8669n853J0502
$$ 23458 24716 9473 -11085 -22686 -18326 -557 19145 28226 20318 795 -17874 -23727 -13225
431a3225J8836J4823Q45j4580k0407j2774L555J6562J8630R354n531j7261j6205
$$ -13225 5611 20434 21279 6699 -13708 -26482 -22927 -6365 12265 21619 16088 -1173 -17378
444a7378m839J0810J8505J5288J959j2717j8556j2691J808J4719J7032Q025o081
$$ -17378 -22217 -11407 7098 22386 24345 11628 -6928 -19619 -17811 -3092 13940 21965 15884
457A5884j7129j6855n827Q572J6854J4039K364j0290j6540j1934J871J4076J7937
$$ 15884 -1245 -18100 -23927 -15355 1499 15538 17902 7612 -8928 -20862 -18991 -4915 13022
470A3022R321m461j4726j5131n583P528J5221J2896J748j0023j6440j2302m28
$$ 13022 22343 17882 3156 -11975 -17558 -10030 5191 18087 19835 9812 -6628 -18930 -19358
483a9358J1638J5729Q602m166j3673j3760n751P170J5301J3296L331q328j3671
$$ -19358 -7720 8009 16611 12445 -1228 -14988 -20739 -13569 1732 15028 18359 10031 -3640
496c640j0683pJ0535J5086Q406l032j3002j4464o583M805J3390J1904K289q454
$$ -3640 -14323 -14330 -3795 11291 19697 16665 3663 -10801 -17384 -12579 811 12715 15004 6550
510F550j3608r919o90R232J4221R194j333j0694j2889n200N179J2518J2567K894
$$ 6550 -7058 -16977 -17667 -8435 5786 14980 13647 2953 -9936 -15136 -9957 2561 15128 18022
524A8022p349j2688r674j384P881J1354Q053j866j0820j2403o231L692J1193J1669
$$ 18022 10673 -2015 -11689 -13073 -5192 6162 14215 12349 1529 -10874 -17105 -13413 -2220 9449
538I449L853n989j1787r126K36Q638J1877P752q53q595j0819o570K751J0118J0551
$$ 9449 13302 7313 -4474 -13600 -13364 -4726 7151 14903 14050 5455 -5364 -11934 -9183 935 11486
553A1486L487o330j1761r859j419P279J0247P009n82q117r903n787K960J0045
$$ 11486 14973 8643 -3118 -12977 -14396 -7117 3130 10139 9557 1440 -8463 -14250 -11290 -1245
567a245J0639M279m453r530q343j760O491J0272O916j029p689j0752n509J931
$$ -1245 9394 13673 9220 -310 -8653 -10413 -3922 6350 13266 12237 4548 -6204 -11713 -9782
581i782P812Q517L601m151q756q340k326N802J0729P367J02p176q860m088K556
$$ -9782 -1970 6547 10148 5997 -2759 -11099 -13425 -7623 3106 10473 10575 3399 -5461 -9549 -6993
596f993P644Q156L648l265q189q603k743M673Q862O274l98p215q879n051J665
$$ -6993 651 8807 12455 9190 1001 -7602 -10345 -5672 3190 9464 9066 1851 -7028 -12079 -10414
611a0414P476P764L945k804o813o878j444M649Q227O527O79n372q375m865R73
$$ -10414 -2938 4826 8771 5967 -846 -7724 -9168 -4519 3708 10235 10914 5542 -2833 -7698 -6725
626f725O864O763K643l713p096o357k210L123O748O316R64n073p676m687J797
$$ -6725 139 6902 9545 5832 -1264 -7621 -9831 -6708 40 6356 7320 2247 -5429 -10116 -8319
641h319P150P502L076k343o317n455j887L076O744M971J229n224p506n019R9N386
$$ -8319 -1169 6333 9409 7066 749 -4706 -6593 -3517 3227 8198 9427 4203 -3303 -8322 -8223 -2837
657b837O506K961j778o420n920j743L555O260N665P92l070n616m555N53M921O323
$$ -2837 3669 6630 4852 -1568 -7488 -9231 -5676 584 6249 7041 3971 -1645 -6200 -5647 -726 5597
673E597L840j971o261o551j769K551N756M080L00l674n487m277m45M588O340L649
$$ 5597 9437 7466 1205 -5346 -7115 -4564 1192 5272 5572 1898 -3589 -7866 -8311 -3723 2617 6266
689F266j376m711n172j458K915N594M915Q70l206n316m153mL175N125L031j528
$$ 6266 4890 179 -4993 -6451 -3536 2058 6973 7843 4637 -679 -4832 -4836 -1661 3464 6495 4967
705D967m904n228k510J812N248M418J148l216m462l310O90L497N199L414q66l624
$$ 4967 63 -5165 -7675 -5863 -615 3803 4951 1735 -2727 -6037 -5347 -1850 3349 6763 5897 2273
721B273m944k011J512M658M412N95l498m765l772n6K827L982K980q70l758m170
$$ 2273 -2671 -4682 -3170 1488 5900 6495 2997 -1768 -5540 -5596 -2769 1213 4193 3323 -435 -4605
737d605j896J877M271M538J328j917m342k899QL078M124K757j092l433m380k090
$$ -4605 -6501 -4624 -353 4185 5513 3596 -746 -3645 -3637 -559 3565 6322 5230 1797 -2583 -4673
753d673J049L423L051J100k294m123l025n15K887M548K226j57k568l069k005J537
$$ -4673 -3624 -201 2850 3950 1656 -2467 -5492 -6007 -3120 1428 3654 3497 929 -2140 -4145 -2608
769b608L559L342J422j832l448l720l56K302L464J978q44l102l417j963Q33L209
$$ -2608 951 4293 5715 3883 435 -3285 -3641 -1339 2125 4103 3259 157 -3260 -5223 -4390 -1181
785a181L149J377j600l254k325p2K538L435K720J18k927l132j487M32K782K841
$$ -1181 1968 3345 1745 -1509 -3834 -3906 -1368 2067 4787 4905 1978 -1154 -2641 -2209 573 3414
801C414J008k140l154k712p18J627K967K250k74k368k717j565J161K810L125J098
$$ 3414 4422 2282 -872 -3584 -4302 -2675 292 2542 2268 -100 -2817 -4382 -3221 -411 2714 3812
817C812q27k493k493m59K049K707K079o29k169k926k005Q17J835K369M75j131
$$ 3812 2985 492 -2001 -2460 -411 2296 4375 3746 1577 -1349 -3354 -2537 -702 1667 2142 1011
833A011k883j796l77J912K469K054J23j369k342j357J061K491K151R09j060k423
$$ 1011 -1872 -3668 -4045 -2133 336 2390 2513 1144 -1198 -2555 -1494 997 3148 4057 2997 574
849E74k386n06J348J808J333k19j965k181j493L58K078K454P96p17k168j804L2
$$ 574 -1812 -2318 -970 838 2171 1952 -13 -2194 -3687 -3329 -1251 1203 1999 1282 -886 -2690 -2658
866b658J763K097K119L3j650k236j033R1J795J626Q01j179k393j847l61R77J807
$$ -2658 -895 1202 3321 3354 1704 -532 -1565 -1474 321 1947 2748 1569 -824 -2671 -3032 -2055 -248
883b48J567k6j325j747j108R32J813K189P05o21j555j476m11J069J712J522k54
$$ -248 1319 1293 -32 -1779 -2887 -1955 -142 2047 2752 2131 576 -900 -1311 -242 1470 2992 2738
900B738j762j733j644L01J193J672O74q27j703j619Q4P01K069J618J05q48j539
$$ 2738 976 -757 -2401 -2100 -907 765 1439 612 -1091 -2710 -2626 -1925 144 1762 1867 1019 -520
917e20l74k70J505J595Q34o50j579j733p34O33J562J016j90j083j569j386M09
$$ -520 -894 -1164 341 1936 2770 2120 541 -1192 -1926 -1293 269 1285 1095 12 -1557 -2943 -2534
934b534J479J892M95l35r87j407j65J117J590R69P41j107j641j008l4J157J342
$$ -2534 -1055 837 1332 997 10 -1397 -1562 -445 1145 2114 2855 1748 107 -901 -935 222 1564
951A564K33o87j734j005o88M38J639R72M00j015j313p80J63J726J377P45k85j105
$$ 1564 1797 1110 -624 -1629 -2317 -1879 -240 732 1132 117 -1196 -1976 -1813 -87 1290 2035 1750 645
969F45j029n68N19J470O44k9q89j456j071O7Q39R37P12m41j202q39m49Q66J503
$$ 645 -384 -952 -433 1037 1681 1652 763 -693 -1764 -1697 -858 79 791 350 -852 -1691 -2140 -1274 229
988B29Q20O46r07q89p18J15J252R82N82o33p23j438m83L00R38N73j02p82j178
$$ 229 1049 1695 788 -101 -819 -704 548 1530 2112 1479 756 -682 -1165 -865 73 646 544 -238 -1416
1007a416m25O5P87J245O14k03p84o90j67Q30J095R52J78q30j199o65R0O47Q12
$$ -1416 -1841 -1776 -989 256 870 667 -117 -807 -974 -144 951 1903 2081 1251 52 -613 -523 124 936
1026I36L03l94j428q87k56K70Q13J066j06k42q82q03P34R47Q04Q57n58p54m45
$$ 936 1239 845 -583 -1470 -1726 -1456 -643 423 317 75 -807 -1610 -876 71 875 1732 1174 420 -25
1045b5k14J47O50P80k8q44r94r14J21N46J078k91K2o12p98N3M23P92R42L31m29
$$ -25 -239 -92 558 1338 1310 466 -528 -1442 -1321 -775 303 12 34 -578 -1376 -1323 -900 -108 834 1165 736
1066G36q03m76L36P36P98K76m83o97r03k93J76N46L14J23n86r97k46R9Q81Q75
$$ 736 -67 -543 -207 529 1327 1603 1120 423 -480 -773 -597 -51 263 386 -200 -1197 -1443 -1344 -463 412
1086D12K82j65m80k43l11O85O22N60J92o37o87l31m75N05N12O1o5p60r14l49O23
$$ 412 694 529 49 -194 -505 180 802 1362 1554 917 230 -101 -576 -71 441 502 437 -323 -1237 -1586 -963
1107i63O78N82P1o88j61l30M80P53M89M08m3q14m53j58M03O25L76m44q57o18m09
$$ -963 -285 297 368 -320 -481 -811 -331 422 911 1319 1276 462 9 -149 254 879 1255 811 -46 -664 -1073
1128a073K17J95O45J23q4m60p12K76L00Q60N74L7l98l70m90R2P16L08M51k74j078
$$ -1073 -856 -661 -16 107 23 -437 -1149 -873 -573 287 861 898 500 130 -360 -268 448 756 1207 933 -145
1149a45o03J12lP62O8k09o06m37m40P31K59M53M04J23j67n16r2M60N95K19L82
$$ -145 -748 -636 -639 123 191 -18 -624 -1061 -1501 -770 -511 -58 346 469 302 -214 -306 154 749 968 1350
1170A350q32q02k35J48M55L51j84j02n30n85j46K95N73M67j8l46j62k94n6J081
$$ 1350 518 -284 -519 -371 84 435 251 149 -381 -966 -1112 -817 -244 223 205 -141 -303 -597 -653 428
1190D28K97K50j10m96l61r6M23M92M3l42l80o92n60J51M35M48K43r9r10J26J6
$$ 428 725 975 865 369 8 -88 335 827 870 528 148 -544 -1104 -953 -518 -70 173 74 -836 -710 -694
1211f94L45L70P75p7m62k47K14j85N44L85j54l28o57l28J7J1O40L4k20m01m30
$$ -694 -349 21 796 719 257 10 224 39 583 968 814 486 -171 -499 -482 -471 169 203 -17 -418 -848
1232h48p8J3O04M91N55k45n00l23M60K59M22J41j46l22o72j50k13O80J37j18r6
$$ -848 -926 -913 -309 182 737 492 -8 -331 129 388 810 951 805 483 -189 -339 -552 128 265 147 51
1253E1l98p49m2P10O54j43Q9k94k02J79O5O31J44R1j91l07n37J34K15K56L02j05
$$ 51 -347 -1096 -1138 -428 226 83 172 -122 -324 -145 -80 551 695 786 595 288 -249 -115 100 356 658 553
1275E53n05n11p99M77N95L80o9k25m05j80j08M58N94P54l91l35p4k30K79M34J32
$$ 553 48 -463 -1262 -785 -190 190 121 -104 -509 -689 -797 -339 255 1009 618 283 209 -21 258 692 824
1296H24p1o23k33m32N0PN18j3J09n88n53q2N52N29K05K13P8p43L60m29O26M73
$$ 824 753 130 -103 -535 -485 -478 40 27 136 -452 -1005 -1087 -535 -6 199 412 490 -253 107 -322 304 777
1318G77l0j5m58p50K24q5J90N42l01k08n28l79j9P71L8J50K97m47n8P8J52L24
$$ 777 747 732 274 -476 -252 -337 -147 395 94 -114 -642 -1021 -1040 -269 -231 -81 216 -231 -289 -211 -59 265
1340B65M82J76l11n48r8j14L80L25l27q5k39l78k39K20J61K79L38m38l85j51K15
$$ 265 747 923 612 64 -34 -148 232 557 230 145 -94 -472 -711 -491 -330 -51 287 -151 -536 -687 -472
1361d72L76O91O1k90O4l23n44N44L43K11l0k81n44o50K91M93K09L5k76j08n65
$$ -472 -96 595 656 366 430 107 -437 107 450 661 631 350 -194 -844 -553 -60 149 184 -92 -200 -765
1382g65pO05J49O66l02k39K15n30p6O34L41K94o15j92l39l50m3O16M81m87k17
$$ -765 -772 -167 -18 648 346 107 322 -208 -284 350 691 985 370 178 -161 -511 -554 62 543 56 -161
1403a61k26j41j78M49M42J02J41k38l97m4J75O67KJ85l68m25M6qm2R3J68j97k33
$$ -161 -387 -528 -706 -257 185 287 428 190 -207 -251 -76 591 593 778 410 -15 31 23 -19 74 242 45 -188
1426a88l50k82K87M58j94N88k58l53n9K48k1O30R7j78k04k07K61l54N90l30K95
$$ -188 -538 -820 -533 -75 -269 319 61 -292 -351 -103 -124 506 603 425 221 14 275 -79 511 181 476
1447D76k52o88J25k24J93K25K46j2j01l89R0j72Q35K17N8k55ol72J70K43K88k79
$$ 476 224 -464 -339 -563 -370 -145 101 89 -12 -401 -311 -483 352 569 627 372 366 -6 164 407 695 416
1469D16k3l1n58nr1K29J7K71k12l86q9m5QN67J95k8r8l95m4M53j9M18j16k01j16
$$ 416 393 362 -196 -201 -292 -63 -46 225 13 -373 -462 -507 -499 68 263 235 137 -258 -302 151 132 550 434 233 117
1494A17J31k84j29J96K93p4n71l0j92K90L55J41k18J94o96J24K43L15L03j62J2
$$ 117 248 -36 -165 31 324 250 -321 -351 -543 -253 102 243 25 219 -477 -353 -110 205 508 346 358
1515C58j18L1l81j29N66J58k2k71n74J53l73L19L19j74J54j68k87q9K88L77N75
$$ 358 240 271 -110 -239 327 485 463 192 -382 -229 -602 -283 36 -138 16 -152 -439 -528 -240 137 712
1536G12m82J58j96k74J03L72K09N0j40o84J43k10O0J51J43k07l00J3q9K66L5R3
$$ 712 230 388 192 -82 21 393 602 652 512 -172 -29 -239 -179 -28 115 -92 -392 -379 -468 -202 -167 -74
1558g4M49j64k33L9o3N1o6M81J22l08j73l05JK85K50o6k65L9j31l33j26M84J3
$$ -74 375 211 -22 17 -46 5 -61 420 542 234 61 -244 -243 42 292 226 -39 0 -131 -464 -590 -106 -93
1581i3M8O6j66m6K63K58J37j69l70M76n84L32R8j86K51k15k06j56k92K11R7q6
$$ -93 -45 21 -145 -191 72 330 467 298 -72 404 -180 152 250 64 315 100 -106 -262 -554 -343 -246 -332
1603c32M95l52j37k2K09l8K06J94p9J02p0k86l5L56O9K10j24l57l79M9j51K86
$$ -332 163 -189 -326 -348 -139 -177 29 223 144 246 176 -110 -145 211 280 490 366 9 -370 -321 -472 -186
1625a86N7K10j67k55n2k8K91M21N9J48k33l70J99K6L56M1m01J56m00Q6o4LJ36
$$ -186 -129 81 -86 -341 -393 -421 -130 291 350 498 265 -105 94 120 476 517 116 272 -128 -42 -106 -103 33
1648C3J81m15j14O0k49K14J57K56J84k65J19l04K64r6L18J30o7J70o86J79l5J26
$$ 33 214 -201 -315 -255 -504 -290 -133 123 307 42 161 -143 121 25 343 473 406 576 -110 69 34 160
1670A60J16k41K60p17r5k0L67j02K36M9P7k05J8J01j16N26p1l34Q3j23j53O28
$$ 160 276 35 295 -422 -517 -537 -170 -272 -36 13 90 -115 -97 4 -112 414 343 9 92 -31 -184 444
1692D44l10L48k60m77J67k70O7L39j1L9l89l4L9q4L00L56j30J43j82j27j26L15
$$ 444 134 482 222 -255 -88 -358 -291 48 37 76 -313 -347 -308 -392 -92 264 134 277 95 -32 -158 157
1714A57o2J73k30o5N0m12J65m5L48R8Om98p1J09M41r4qK35l80m6j04K44J73K5
$$ 157 95 268 38 -27 23 -389 -224 -269 79 177 183 -315 -386 -277 164 70 62 297 -83 -129 -233 11 184 209
1738B09K5N1k93j26J08k05L28J70l47L8k82j43J19L25l38O96k16j94J08j49N30
$$ 209 234 285 -8 -134 -26 -231 97 267 -80 -42 -324 -467 -348 -23 -361 335 119 -75 33 -116 414
1759D14j24K13j15k31Q9j82k03J22M46k41O5k95k50n9J27j9L11M7k41R6j81m8
$$ 414 290 503 388 157 246 64 -139 -17 429 188 253 -42 -292 -351 -224 -243 68 115 -126 -30 -211 -259
1781b59J39L71j20j60J30j24j98J72J43K15j25J80m37q3l2k43M87j32J46l72n3
$$ -259 -120 251 131 -29 101 -23 -221 -49 94 309 184 364 -73 -156 -188 -431 56 -76 70 -302 -355
1802c55J91j69J77L03J84n8l44j9J27j32L91p2L21l25m46K21m7m0K67l65L16m35
$$ -355 -164 -333 -156 147 331 273 -71 -90 37 -95 296 224 545 220 -226 -5 -52 -92 175 -190 126 -309
1824c09J89k52L26J35q2L7l09L29k67n5K21K87M03k83l74j5L1mr3M5J79k89J41
$$ -309 -120 -372 -46 89 7 44 -265 64 -203 -258 -37 250 653 370 -4 -19 12 8 -85 -40 139 -150 -9
1847il88K70k6K04m7R2m13J35J87J11Q3l6L87m56r2J69o1j33J83K07l37k1k60
$$ -9 -397 -127 -153 51 4 96 -317 -182 5 116 199 163 550 94 2 171 110 -23 160 367 30 9 -251
1870b51j96m0M41J21m69M20l33m0J02N10k99L09j19Q0j04l14J93J98%r2L51m98
$$ -251 -447 -487 -46 75 -394 26 -307 -347 -245 265 -34 275 156 236 132 -182 11 209 209 117 468 -30
1892c0o4j21r7L86j99R1j46r1q6L6L57O9O7l18J67k37M1M57N8j79ok70J06L3k6
$$ -30 -94 -215 -312 74 -125 -34 -180 -271 -357 -321 36 105 172 -146 21 -216 -175 282 340 161 155 -115 -9 24 -2
1917bp7K88k61L4m4j74r2Q2J47KJ67l59L42l29M65m2L35l68K60k78n6n5R3K18
$$ -2 -79 209 -52 -18 -62 -236 -328 -246 -99 -97 70 -289 53 -276 189 147 482 114 374 96 40 -15 78 296
1941B96O2m6m67N6o6N2J80M0j79K66l94O3l1J46J72MQ0j06j67J12L1NL35l32l18
$$ 296 358 312 -155 -99 -165 -113 67 107 -72 194 -200 -137 -168 -22 150 154 234 128 -39 73 104 109 444 112 -206
1966b06m6J10j28J84N1K07j59m8k79Q4L1L35L2j84J07O9o6j1k4J89L9k91J7M5
$$ -206 -252 -142 -270 -86 -35 172 13 -35 -314 -230 -199 136 168 -16 91 160 94 83 59 248 287 -4 13 58
1990E8k51J5J35L17j81l79M93m67j92L55N0M9J45j38l15o6M05rK41k61J68q4L1
$$ 58 -193 -178 -43 274 93 -286 207 -260 -452 -97 -47 2 147 9 -306 -372 33 24 265 4 172 88 119
2013A19l09j22M59J56j13j56j54j12j52K41M6O3j5j39k01P0J86J59L09r6j74J34
$$ 119 -190 -312 147 303 190 34 -120 -232 -384 -143 -97 -34 -49 -188 -389 -319 -133 26 335 239 65 199
2035A99j76j93J58J48j88K68n00O9J2j38J25M31k53l0k22K13N4J40j25l1j70J78
$$ 199 23 -170 -12 136 -52 216 -284 -215 -203 -341 -216 215 -38 -68 -290 -77 -23 117 -8 -39 -209 -31
2057c1n1P7JK83j08j05j4j44P1k46K95j46L6o6J81k85M73j91j19K61j56o5L5K7
$$ -31 -82 -5 -4 279 171 66 52 -92 -21 -267 28 -118 -82 -148 33 -252 221 30 -89 172 16 -49 -14 13
2081A3N0J9J03j1K0lM0m47J4K1L69k68jJ8j68P0P1K2K5K70l25k27K65K79j50r4
$$ 13 63 82 185 174 194 191 231 -216 -202 -181 188 -80 -81 -63 -231 -161 -90 -68 -43 227 -98 -325 -60 219 69 -25
2107b5l7L20l49R0L6j13J66Q7J03k97r8j52J29J45j58J10k39Q1K66k63Q4J2J75
$$ -25 -62 258 -91 -1 35 -78 88 175 278 -19 -117 -269 -140 5 -153 -43 -282 -201 65 -198 -114 -102 73
2130G3j08q9kM18j16j54K17o2l31K04P7j80p4J70l2J21l24L35m14o1K45j00j42
$$ 73 -35 -124 -126 292 176 22 239 177 -154 50 127 -53 -127 43 11 132 -192 143 -271 -332 -87 -187 -329
2153c29K95M4J1p5j4M49j34R1j93j74n7Q3K4q9k4jj79K04L1k2J47j78j41J01J40
$$ -329 -34 10 21 -54 -68 381 247 338 145 -29 -86 -3 21 -68 -92 -93 -272 -68 -37 -59 88 -90 -231 -130 10
2178A0O9K01l4q2P7k65L10l13L4M0J67p5Ml00K27P7k42L8O3L2n7L1j84K56K00
$$ 10 79 280 246 164 241 -24 286 -27 7 47 214 139 143 -157 70 147 -95 -57 6 38 -19 12 -172 84 284
2203B84k39K04nk08k4R7J20K4K3j91l16M67l48j6r5J85L7p6l11Q7R6K50J41m20
$$ 284 45 249 244 36 12 109 229 253 276 85 -231 236 -112 -128 -223 -38 -1 -77 -388 -301 -205 45 186 -234
2227b34L51J08n10L15R0J99j90L94k76k73j03LL5K04r5L7m62J52K74n4M0mk57
$$ -234 117 225 -285 30 120 319 129 523 247 -26 -129 -126 -91 113 18 55 -407 -255 19 -35 5 1 -256
2250b56M79p6j60m5K82m9K04m44O9j43p5K83k04K07k16J05n0j56K24j55K39J98
$$ -256 223 147 -13 -58 224 175 379 -65 4 -139 -214 69 -135 72 -144 -39 -89 -245 -21 -176 63 261
2272B61l34r7L85o7K5k8J51l15lJ00j53Q5Q9J65m47L71l11K20l12Q5O97q05K86
$$ 261 -73 -170 215 148 173 145 296 -19 -22 78 -75 10 99 264 -183 188 -123 97 -215 -130 567 -238 48
2295D8%K40j59j91K11k70K99K8m23J71K30l71K05J01k25J56o8pO5j92J51j08J06
$$ 48 48 288 129 -62 149 -121 178 206 -217 -46 184 -187 18 119 -106 50 -18 -25 40 -152 -1 -109 -3
2318cr2Jj62J37J5K63o2K71j75l61L01j03K8r2J74m20J7J96J42l48J21J24J17
$$ -3 -95 -94 -256 -119 -104 159 97 368 193 -168 133 30 58 -34 140 -280 -263 -67 75 -273 -152 -28 89
2341H9j40n3k07L02M04l48q6p9K11k35M02j33r2R9j06j00l2K14J17J69m44J86
$$ 89 -51 -104 -311 -9 395 47 -39 -118 93 -142 260 127 35 134 28 -72 -104 110 227 396 -48 138
2363A38Jj12j16j50L19k13K22j07j00N2J16N2J21r5l1L1k3Oj60p1J42K63l13p6
$$ 138 139 27 -89 -239 80 -133 89 -18 -118 -66 50 102 223 128 97 128 105 111 -49 -120 22 285 -28 -104
2387a04j59L82m8k6j38K5j85K14k98L26J70O1k71J45j70j75L63pK40k27O8l9k74
$$ -104 -263 119 71 45 -93 -68 -253 -39 -337 -11 159 220 -51 94 -76 -251 112 105 345 118 186 147 -127
2410a27K24k23J30J03n5l3J2j47K01j31J93k17J41k11R9J27Q6K42j27o6k7k82
$$ -127 97 -126 4 107 52 19 31 -116 85 -46 147 -70 71 -140 -41 86 172 414 287 221 194 -88
2432h8L4K30k29K03l83Q6j05K31M8l51J97L29l04Rr6J48J56j03N7q7k11L10k00
$$ -88 -54 176 -53 150 -233 -147 -252 -21 27 -324 -127 202 -102 -93 -189 -41 115 12 69 -18 -229 81 -119
2455a19O9k4J26J93k44j69j7J64q2J68j26o8J40k90K35j99L04R0k97L08j59J24
$$ -119 -50 -74 52 245 1 -168 -185 -21 -103 65 -61 -129 11 -279 -44 -243 61 151 -146 162 3 127
2477A27j05q4K54j00n3M5j06j0J55j44J04n5J2k26J35J8J31j71K14j4k17p2L24
$$ 127 22 -62 192 92 39 84 -22 -32 123 -21 83 28 40 -186 -51 -33 98 -73 141 127 -90 -162 162
2500A62k66J90O3j24J54k63J40k33K63j80k3j45N08l69J6J64k21O02l62k84M75
$$ 162 -104 86 149 25 179 -84 56 -177 86 -94 -117 -262 246 -123 -107 57 -164 438 76 -208 267
2521B67m58K05J43j51Q1K08q8l89L01l11L51J38o6l35L31l5j88k02J13L49l33
$$ 267 -191 14 157 6 87 295 207 -182 119 -192 159 297 231 -104 227 192 4 -198 -85 264 -69
2542f9K94j96P5R3J00l60J99O4l75J33K11l18M0O03o14L63m38O2J00K3R0q8N7
$$ -69 225 29 104 197 297 -63 136 200 -175 -42 169 -149 -109 494 -120 243 -195 -133 -33 -10 80 -8 49
2565D9j19J99j53j39J26K18k76J69l82K27L77l89J52J86j41K3M6k38j53K12j1
$$ 49 -70 129 -24 -163 -37 181 -95 74 -308 -81 296 -93 59 245 104 127 173 -65 -218 -6 -17
2586a7j08O1K68k32J21%J79j06r3j18j41K25j21J94J63RJ4k18q5J15j28L84k40
$$ -17 -125 -64 204 -28 93 93 272 166 73 -45 -186 39 -82 112 275 284 298 80 -5 110 -18 366 126
2609A26j05J04j83m2k54K96J88K3k43o1J83J72k40j06K96J98m90K91r5m4j39L37
$$ 126 21 125 -58 -100 -354 -58 130 153 -90 -151 32 204 -36 -142 154 352 -138 153 58 14 -125 212
2631B12k71P1r7Q8K04m52M47k13L9L9k10j70L44j67J16mK20r0m5M8k3j61L5n2
$$ 212 -59 12 -85 3 207 -245 202 -11 28 67 -143 -313 31 -136 -20 -24 196 106 61 109 86 -75 -40 -92
2655i2N1ql39M42j28J22j45k64M42j83r9J67K29j85J89l63L20l88K79k9k38K10
$$ -92 -41 -49 -388 54 -74 48 -97 -361 81 -102 -201 -34 195 10 199 -164 156 -232 47 18 -220 -10
2677a0p2J38l02k5K52j90K63r5N1k12j6J31J43j27O1N9J82l44JQ3j14L62m6k84
$$ -10 -82 56 -246 -271 -19 -209 54 -41 10 -202 -218 -87 56 -71 -10 49 231 -113 -112 -29 -143 219 173 -111
2701a11J19K0LPq6J61k74N4p1K16j84P2J38L36k73k21K3LK92ro5o2j82o5M02n0
$$ -111 8 28 31 38 -48 113 -161 -107 -178 38 -146 -74 64 400 127 -94 -71 -68 224 215 150 88 -94 -159 243 193
2727A93k02J7j93K25k0m4J12R7p1k23j80K56J98k80k7O7J68J75l32j69J38j12
$$ 193 -9 8 -185 40 20 -24 88 185 114 -109 -289 -33 165 -115 -142 -75 93 268 -64 -233 -95 -207
2749b07M31j0q2R1j74L21k57j94J60l06J28lJ29K68m62J24n8P0m1K27j65Q7L3
$$ -207 224 214 132 223 49 370 113 -81 79 -227 -99 -102 27 295 -167 -43 -101 -31 -72 155 -10 77 110
2772A10k26K45K04k68j57J68k07J34M1K1k3j27O4j55m4L02Mj55L7n2J24l5j4j30
$$ 110 -116 129 333 65 -92 76 -131 3 44 65 42 -85 -21 -176 -220 82 86 -69 -32 -84 40 5 -9 -139
2796a39k8K46M6j63q3P9LP8q0J14q2j22J91l13P6K15p2j53J9O5j7K14j38mJ38
$$ -139 -167 79 125 -38 -121 -42 -39 39 -41 73 -9 -131 60 -253 -177 38 -34 -187 -168 -103 -120 94 -44 -48 90
2821I0k73J84k8m2j0J43K1j53K98l38j07J41Q5N2k8J62j12l14L58rM4j23m0rK2
$$ 90 -183 1 -27 -69 -79 64 85 -68 230 -108 -215 -74 11 63 35 197 85 -229 129 120 164 41 1 -8 14
2846A4J38l75O13j83j76J47r1J27k95N3n0k2J9m6J05nP5k34Q8J92J16k22J23j82
$$ 14 152 -223 390 207 31 178 87 214 -81 -28 -78 -100 -81 -127 -22 -27 48 -186 -98 94 210 -12 111 -71
2870g1K96k90N6J85J67k63p8J30K2J38j40j28p2jk89M47l69J5J73k12K22L0k10
$$ -71 225 -65 -9 176 343 80 2 132 154 292 152 24 -48 -49 -338 109 -260 -245 -72 -284 -62 -32 -242
2893b42R2J86k21L10r0J45j20o8K63r7k85J97o4k77M93k46j55K45j0k58J99J06
$$ -242 -150 36 -185 125 35 180 60 -8 255 158 -127 70 6 -271 222 -24 -179 66 56 -202 -3 103
2915A03j78J07J08p3j90pJ83N3p8J82Kj98j5m8j0q0N3O9N7r1N2k37J63o2K92k02
$$ 103 -75 32 140 67 -123 -130 53 106 28 210 212 14 -1 -49 -59 -139 -86 -17 40 -51 1 -236 -73 -135 157 -45
2941d5K9K01j31k27K6K38N0j16J20j90k17K85n8M2r7K51n40J44J50R5J3m2J89
$$ -45 -16 185 54 -173 -147 91 141 25 145 -45 -262 23 -35 7 -90 161 -379 -235 -85 10 23 -19 170
2964A70l09K64l04OL02J8o1k35J42j99J57J86R9l7K11m96K18O1j81P9r6N8j02
$$ 170 -139 125 -179 -173 129 147 86 -149 -7 -206 -49 137 236 199 410 -86 132 193 12 91 -5 53 -49
2987d9p3R4K1J51k06r8n9J36L7L10K8l64J37L9l14O0K40r5j9J1J65k95r0j39K72
$$ -49 -122 -28 -7 144 -62 -160 -219 -83 -46 264 292 -72 65 104 -210 -150 90 -5 -24 -13 152 -143 -233 -372 -100
3012a00j10K74q3l5L36j23r1j12P0P8j92M6O6O3l6j60k7K47N0J24m03J90K1KP9
$$ -100 -210 64 -19 -54 282 159 68 -44 26 104 -88 -42 24 87 51 -109 -136 111 161 285 -118 72 93 95 174
3037A74j44l8j1l2J55Lq3k07J49Qo0J75L7m1o3K10k87j24k7J96k0j09P3k39J96
$$ 174 30 -8 -19 -51 104 107 24 -183 -34 -26 -86 89 126 85 22 232 -55 -179 -206 -10 -30 -139 -66 -305 -109
3062a09J94m77J59L11l2l28K26J09l6j18m7K22J73q5j66Q8n7j36r4K3K94k93K69
$$ -109 85 -392 -233 78 46 -282 -56 53 17 -101 -148 74 247 162 -4 84 27 -109 -203 -180 114 -179 90
3085I0k3j01J34k16K01O8J58m60O16n81J99J17qNj5m00L58Ll15M2R0k05M6J51
$$ 90 67 -34 100 -116 85 153 311 -149 467 -114 85 202 194 199 184 -216 142 145 -170 -128 -38 -243 -197 -46
3109d6m4K8j93M70r0J03k13R6k81j1K96k26K68l00J71O4K06j93k70J5K44o4Q8
$$ -46 -90 -62 -255 215 125 228 15 111 -170 -181 115 -111 157 -143 28 92 298 105 -165 -150 94 30 118
3132A18j92Q9R4ok43R0j21K03P7l04L44p1M6k08K9J77k96K01j74K49l48M8K24
$$ 118 -74 15 109 103 -140 -50 -171 32 109 -195 149 78 124 -84 -55 122 -174 27 -147 102 -246 -198 26
3155B6j10K83M7j20k38j47L43n0l17P1N08j27R8j29k1k49J49N4P3k16L0j58L01
$$ 26 -84 199 246 126 -112 -259 84 34 -283 -212 296 169 267 138 117 -132 17 71 144 -72 -42 -200 101
3178A01J82j18j21o7J15O4M7m23K63k0q0P1O9m57N85k89q6L43j28P2k41K18K35
$$ 101 283 165 44 -23 92 156 203 -220 43 23 -57 14 83 -374 211 -78 -164 179 51 123 -118 100 335
3201C35j95j40j43J17l00K37R1L6J47k1k13j2p9K75k51K%K73k3R0k20j14q6j26
$$ 335 140 0 -143 -26 -326 -89 2 38 185 164 -49 -61 -140 135 -116 -114 -114 159 136 226 6 -108 -194 -320
3225c20M29j40j52J15K83j55l36K43m9J07j54J76k06K09O2j4Q9j93n6j71L37q5
$$ -320 109 -31 -183 -68 215 60 -276 -33 -82 25 -129 47 -159 50 112 98 187 -6 -62 -233 104 19
3247A9j07K09p5J24p7O2m9j55k1r3P3J75j43Qr2K23l1k5Q4k32J69l7J83l64J27
$$ 19 -88 121 46 170 93 155 106 -49 -70 -163 -90 85 -58 -50 -142 81 50 25 109 -123 46 9 192 -172 -45
3272d5q5J78p9j87K68o7j09N6l6J63J07k60J42q1J81k0j00k3J11k09J69j07L7
$$ -45 -130 48 -31 -218 50 -17 -126 -70 -106 57 164 -96 46 -35 146 126 26 3 114 -95 74 -33 4
3295DM1j66M9N9o6n5RQ6J88j77n3j09L41j23j05r3J05J35J38j65O3k01J99L1j55
$$ 4 45 -121 -72 -13 -79 -134 -125 -39 149 -28 -81 -190 151 28 -77 -170 -65 70 208 43 106 -95 104 135 -20
3320b0N1O7l72O37l03kQ6j49J03P8j55k97K63r9N2R6mK6o5J31j31o1J29j04j05
$$ -20 31 98 -274 363 60 58 144 -5 98 176 21 -276 -13 -112 -60 36 32 58 -7 124 -7 -68 61 -43 -148
3345a48K4J31J43j30k88N2K65p1J97l65oJ19K0N0p5K00p1P5r6r9r0J56L99k96
$$ -148 -124 7 150 20 -268 -216 49 -22 175 -190 -196 -77 -57 -7 -82 118 47 122 26 -73 -163 -7 392 96
3369I6J43j23k03k56J97P4J25L9k35L08l48N2k1L39q1j59k07N67k01j93n4P1J36
$$ 96 239 116 -87 -343 -146 -72 53 92 -143 165 -183 -131 -152 187 106 -53 -260 307 106 -87 -141 -70 66
3392F6j5k77K40p8N1Q1j5k2r4QnR6K93k08j35J92j64k08L18l49J65K00j06j29
$$ 66 51 -226 14 -64 -13 68 53 31 -63 -55 -60 36 329 121 -14 178 14 -194 124 -225 -60 140 34 -95
3416i5j2M08l86J30j33j04P3JO6J16j50J0j47K07k15J68J16r1K6O9j39J6q8K03
$$ -95 -107 301 -85 45 -88 -192 -119 -118 -52 64 -86 -76 -223 -16 -231 -63 53 -38 -12 57 -82 -66 -154 49
3440D9n2K51k03K16j3l64K71j45j0k0K63l8k03k5n0N2j55q2K10R2j39O5J09j3
$$ 49 -3 248 45 261 248 -116 155 10 0 -20 243 205 2 -23 -73 -21 -176 -258 -48 44 -95 -30 79 66
3464F6q3J21P7j87J63k73K17p1j55R3M2k15J57j69K25k81L22j91K13J51l64K28
$$ 66 -17 104 181 -6 157 -116 101 30 -125 -32 10 -205 -48 -217 8 -273 49 -142 71 222 -142 86
3486H6k7%QN5q1j12m6J06j19J41j64J64j32K8N4l9L88l23J21m24K11qk27K69K4
$$ 86 59 59 67 122 41 -71 -117 -11 -130 11 -153 11 -121 -93 -39 -78 310 -13 108 -316 -105 -113 -340 -71 -47
3511d7q9J21o8L3R6R9j67k01K11l06K43J34j70j35M55k09k04Q5r7M72k31q2j57
$$ -47 -136 -15 -83 -50 46 145 -22 -223 -12 -318 -75 59 -111 -246 209 0 -204 -119 -216 256 25 -57 -214
3534b14L3K28K79m07J50K7j10P9l20L09L4j45N2K39N2k68Jj97L27k24J28P1nj86
$$ -214 -181 47 326 -81 69 96 -14 65 -255 54 88 -57 -5 234 286 18 19 -178 149 -75 53 124 119 -67
3558f7k88M91j0l51L56j04n8K74j80M9L3j06l00L81K26m68K24j62J80j39l47J53
$$ -67 -355 136 126 -225 131 27 -31 243 63 112 145 39 -261 120 346 -122 102 -60 120 -19 -366 -213
3580b13K5J51j51K32M3o4j48K57Nr2K35k81R9qq6j20J05Q8P2j95K45j84k35K72
$$ -213 -188 -37 -188 44 87 23 -125 132 137 45 280 -1 98 90 4 -116 -11 77 149 -46 199 15 -220 52
3604E2j74k92L17J86k36J40J33k67K96J8j00n1j28L13n08J47O6M95l17l5Q5l39
$$ 52 -122 -414 -97 89 -147 -7 126 -141 155 173 73 22 -106 207 -301 -154 -88 407 90 55 140 -199
3626a99J54J16J5O2j12J73l53J86J03j28l35K25R1k4N0MR4m0j07J80O0l42N00
$$ -199 -45 71 86 148 36 209 -144 42 145 17 -318 -93 -2 -26 24 28 122 82 -25 155 215 -127 373
3649C73o22L04j44L09q3q7j17J12m6k04L15k32K65k20k08N27m6k26K41l91L16
$$ 373 -249 55 -89 220 137 50 -67 45 -1 -205 110 -122 143 -77 -285 242 196 -30 211 -180 136
3670A36n3k19L31r5m5N6k04J28J65k12m5P3j02J3R5j34K46j41r9N8P0k07k1N06
$$ 136 83 -136 195 100 55 111 -93 35 200 -12 -57 16 -86 -73 22 -112 134 -7 -106 -48 22 -185 -206 300
3694C00j72j78o1j5L9L38k66j20Rl1K15k17J69M8j66J35j9j8mj70L9K87J77k26
$$ 300 128 -50 -111 -126 -87 251 -15 -135 -126 -157 58 -159 10 58 -108 27 8 -10 -14 -184 -145 142 319 93
3718I3k08J39j94o8K11K45j01j86M4L4k46N16l57k9L06j89n8k07K70K6o3O1J59
$$ 93 -115 24 -170 -238 -27 218 117 -69 -25 9 -237 279 -78 -107 199 10 -48 -255 15 41 -22 39 198
3741A98L1N2n61L04k9Mj00L03k00j52L63l73q2J74K11k53K38j04k36L02j69M5
$$ 198 229 281 -280 24 -5 -1 -101 202 2 -150 213 -160 -242 -68 143 -110 128 24 -212 90 -79 -34
3763c4J66rk39j7J72r5P5J33j99L5k14M28k69j62J84J78k81O3P3jR9m9J8J54k28
$$ -34 132 123 -116 -133 39 -56 19 152 -47 -12 -226 202 -67 -229 -45 133 -148 -85 -12 -13 86 37 55 209 -19
3788a9j51L54k81J71k76L18k34N1K00k51k5K06L8l49J85k88L23j93J18p5O0K97
$$ -19 -170 184 -97 74 -202 116 -118 -67 133 -118 -143 63 101 -248 -63 -351 -28 -221 -103 -178 -118 179
3810A79k64L28j52j89L50k57j21J79k07J55j82J47Lj74m8K47R1R8j50J27k15R8
$$ 179 -85 243 91 -98 252 -5 -126 53 -154 1 -181 -34 -31 -205 -253 -6 85 183 33 160 -55 43
3832D3j00K79j09j8l6J2k62J70n3M5L01k96k34L90j73J21o6KQ7k3Q0j32k11Q7
$$ 43 -57 222 113 95 59 71 -191 -21 -74 -29 272 -24 -258 132 -41 80 14 16 103 80 160 28 -183 -96
3856i6K12k12K05j26K13k75j01K31j45j3P4l1J02j27J45j98M9K5K41j55j70L05
$$ -96 116 -96 109 -17 196 -79 -180 51 -94 -107 -33 -64 38 -89 56 -142 -93 -68 173 18 -152 153
3878A53j76K42k23J28j10j12j09N7L0J31J23k56J97l93L62R2l50M04J63l19o5
$$ 153 -23 219 -4 124 14 -98 -207 -150 -120 11 134 -122 75 -318 44 136 -214 190 353 34 -31
3899c1M5Or6L38m25K4J23q9J70k83J21Lnj26K62j68n9L87m25K43M5O1L4k79O1
$$ -31 14 20 -76 262 -163 -139 -16 -105 65 -218 -97 -94 -99 -225 37 -131 -190 197 -228 15 60 121 155 -124 -63
3924f3q9M3J18o9J71j94KJ10o0K7P5j9j1m5J7m7J95j52o3N5P2j74K04q8k43J66
$$ -63 -152 -109 9 -60 111 -83 -81 29 -31 -4 71 52 41 -4 13 -34 161 9 -54 1 73 -101 103 15 -228 -62
3950f2k29K55K7k5J54M6j35K19j83j58m8p1J68j87J98R2j37L3L2J90j02j34m3
$$ -62 -291 -36 -9 -34 120 166 31 250 67 -91 -139 -210 -42 -229 -31 61 -76 -43 -11 179 77 -57 -100
3973a00K30k12j00K07Kj58J57L7j53K7K22j14K4N8j37n1M3O9j03P4J15Jl76J60
$$ -100 130 -82 -182 25 27 -131 26 63 -90 -63 159 45 69 127 -10 -61 -18 51 -52 22 137 138 -238 -78
3997g8J24j58L30l00J8Q2J13k77l6J49P0l8J14r4K4k61L35m5M8o2J96m95J11L91
$$ -78 46 -112 218 -82 -64 18 131 -146 -182 -33 37 -1 113 19 43 -218 117 72 120 58 254 -241 -130 261
4021B61J5j87m49K70L93M1n53l6k4M56r3j50j38K55l82J58l6K60l0OJ08j98N3
$$ 261 276 89 -360 -90 303 344 -209 -245 -269 187 94 -56 -194 61 -321 -163 -199 61 31 37 145 -53 0
4044@r9j50L19l0J68k41J43m44J72J37J87Q3l39N9J83k9j52P5j32j00K26J55j78
$$ 0 -99 -249 70 40 208 -33 110 -334 -162 -25 162 245 -94 -35 148 119 -33 42 -90 -190 36 191 13
4067A3k11QL41m91L57J09n5L1k07K21m5r2K16j70j88L17q8O8K3j78r2n9L43j80
$$ 13 -198 -190 151 -340 17 126 71 102 -105 116 71 -21 195 25 -163 154 66 134 157 -21 -113 -172 171 -9
4091iN5j34J16M1k40J66jk29J35j25J18J09r4k43N32l28n5J92k0J15m5k34N02
$$ -9 46 -88 28 69 -171 -5 -6 -235 -100 -225 -107 2 -92 -335 197 -131 -186 6 -14 101 56 -178 324
4114C24m46N1K9m2j28M13k83j48L07J58k45N5j17O6J40j78P1j79jJ57J99k16P8
$$ 324 -122 -71 -42 -84 -212 201 -82 -230 77 235 -10 45 -72 -6 134 -44 27 -152 -153 4 203 -13 65
4137F5O7j04l39J92O8K1N6p8R6j34M80m41j34J47k16J4M79l55PJ34k50K91j81
$$ 65 132 28 -311 -119 -51 -30 26 -52 44 -90 390 -51 -185 -38 -254 -240 239 -116 -109 25 -225 66 -115
4160a15j18L5k3K24R5j02J41l35J57J17k79K31k40J93%K0M6j83N7j14J96np3j5
$$ -115 -233 -198 -221 3 98 -4 137 -198 -41 76 -203 28 -212 -19 -19 1 47 -136 -79 -193 3 -2 -75 -90
4184i0ON2p9J14R3j8J8j00J53l28J64k7j49K53J66K7l14k8J46j48L06m43K18m9
$$ -90 -84 -32 -111 3 96 78 96 -4 149 -179 -15 -42 -191 62 228 255 -59 -87 59 -89 217 -226 -8 -57
4208e7J5Q4r5j16K33M7k67L14q5l1j14Q9j68J28j28J39n6j50L42R9o1k97P9J61
$$ -57 -42 42 -53 -169 64 111 -156 158 73 42 -72 17 -151 -23 -151 -12 -68 -218 124 223 162 -135 -56 105
4232A05j02J11K5k38j05J07L0J86r7L16l83J09J69j88r9O7J3O2J0j51K09o8k95
$$ 105 3 114 139 -99 -204 -97 -67 119 22 338 -45 64 233 45 -54 13 26 88 98 -53 156 88 -207
4255b07J72n4J40Pm6L9j52o0j0J44K82m16J21O8j84N0J06j75M05l45M2r5K7L52
$$ -207 -35 -89 51 58 12 51 -101 -161 -171 -27 255 -161 -40 28 -156 -106 0 -175 230 -115 -73 -168 -141 211
4279B11j07J3j64J74j39L8N6r4q9J13p4L25m20J3J38nk12M16m36J18L12q1K3r0
$$ 211 104 117 -47 127 -12 26 82 -12 -101 12 -62 263 -157 -144 -6 -11 -223 193 -243 -125 187 106 129 39
4303C9n8q8K85j73Q2j81J24q4L06Pk76M3m6M1J97l40L82k07n0L20l62Q1l91J17
$$ 39 -19 -107 178 5 87 -94 30 -54 252 259 -17 26 -20 21 218 -122 260 53 3 323 -39 42 -349 -232
4327b32N05l33L14l40O9l3K0K10k75K24p2K36m00l6J63L0J58o2l00J51j70J50
$$ -232 273 -60 254 -86 -17 -50 -30 180 -95 129 57 293 -107 -143 20 50 208 146 -154 -3 -173 -23
4349b3J63l15M71k63k06L12r8J56k8j96J67R4k73K6R8o8r5k2P4J90j28q2n3q5
$$ -23 140 -175 296 33 -173 139 41 197 169 -27 140 234 -39 -13 85 17 -78 -100 -26 164 36 -46 -99 -184
4373a84mK45r4j86K58j45J88mq8r1J94k04L76k61J5K28j15%n5N6m9l03K23K8p4
$$ -184 -188 57 -37 -223 35 -110 78 74 -14 -105 89 -115 261 0 15 243 128 128 73 129 80 -223 0 28 -46
4398d6j55j85J50L72J5n04K71k75M13j65P4j07J77q3q8J47M2L7k00Q5J8K27j26
$$ -46 -201 -386 -236 136 151 -353 -82 -357 56 -109 -35 -142 35 -48 -136 11 53 90 -110 -25 -7 220 94
4421I4j32O6O6l33J61k14K59R5n2k29M12l57J04KL4J40R2o4j56J19k4q0O5O4j1
$$ 94 -38 28 94 -239 -78 -292 -33 62 10 -219 193 -164 -60 -58 -24 116 208 144 -12 107 83 3 68 132 121
4446A21Ll37J83m6j65J11J67n7K49l81J05K3K7j73N55k95J77l39M9P9P9r0J67
$$ 121 124 -213 -30 -76 -241 -130 37 -20 229 -152 -47 -24 3 -170 385 90 267 -72 -23 56 135 45 212
4469B12k07n0K12J01l64J94k6J83j69N6j27L17k74Q7Jk51K31rl8L47m26J29r7
$$ 212 5 -45 167 268 -96 98 72 255 86 142 15 332 58 145 146 -105 126 117 79 426 0 129 32
4492C2n61N97M5n2j61K66j48J7n9j83L34j74J5K07r9j02J85k20J28J28l2L5j19
$$ 32 -529 68 113 61 -100 166 18 35 -24 -207 127 -47 -32 175 76 -26 159 -61 67 195 163 198 79
4515G9k07J41Qj57L14j25n7k64M48q6L4k76P9K52j50J07l79K82k15L09q5r3l5
$$ 79 -128 13 21 -136 178 53 -4 -268 180 94 128 -148 -69 183 33 140 -239 43 -172 137 52 -41 -76
4538g6J04L25j26o6l21L88k22m4L1k11RL17k16m17M92J50l7k34J99k51M12k50
$$ -76 28 353 227 161 -160 228 6 -38 -7 -218 -209 108 -108 -525 -33 117 80 -154 45 -206 206 -44
4560d4mJ27j40J03p9L39k57K01j75n5j87K55j79J28k4j95O1N2J81k35J95J13j98
$$ -44 -48 79 -61 42 -37 302 45 246 71 16 -171 84 -95 33 9 -186 -125 -73 108 -127 68 181 -17
4583a7j5J66j29m09M56j80J49j53K08J69k12k56K12k43L22K58l42J4K87k20Q0
$$ -17 -32 134 5 -404 52 -128 21 -132 76 245 33 -223 -11 -254 68 326 -16 -2 285 65 145
4604A45k24J91R9j39J8q0R0j96k5L2J06J05j23j23k53M06K8j79q7M20j01j46J95
$$ 145 -79 112 211 72 90 10 100 -96 -121 -89 17 122 -1 -124 -377 29 57 -122 -209 211 110 -36 159
4627A59j04q2k17J58k30M78j59k06Q6m0J61%k4q8N5PM0l22K89k01J19K3O0o3L85
$$ 159 55 -27 -244 -86 -316 162 3 -203 -117 -157 4 4 -20 -108 -53 -46 -6 -328 -39 -240 -121 -98 -38 -101 284
4652B84l10n7N8q3K85o8l12K05j41K44k18n4j09J61J86k00r7R8K39j06j7K3K54
$$ 284 -26 -83 -25 -108 177 109 -203 2 -139 105 -113 -167 -276 -115 71 -129 -226 -128 111 5 -12 11 265
4675B65k91r2J60j77N3J1o0M56j76l27P7K75M7j05J2n9k54k1J29k7K61k71j01
$$ 265 -26 -118 42 -135 -82 -71 -131 325 149 -178 -101 174 221 116 128 69 -185 -206 -77 -104 157 -114 -215
4698b15L08MJ64j51k23K3MJ29J29r8o1M7q2K44k51K9k05L44q7L4k12j10L88j18
$$ -215 93 97 261 110 -113 -90 -86 43 172 74 13 60 -22 222 -29 0 -205 139 52 86 -126 -236 152 34
4722C4J88m97L00j17M20m46K28M9l29L77n8j94j76jJ65J16j4j02n8Q2j4N5j90
$$ 34 222 -275 25 -92 328 -118 110 159 -170 207 149 -45 -221 -222 -57 59 45 -57 -115 -33 -47 8 -182
4745a82L14J01l09J64p8R4j36k02L37j84o6L18j91n4N2j58K64n8J17k58L3Q6J20
$$ -182 132 233 -76 88 10 104 -32 -234 103 -81 -147 171 -20 -74 -22 -180 84 26 143 -115 -82 4 124
4768A24m28L73jj91Q2j50K11j48P2J40n5J82l46l2J56l5j47K86k64RK18j03j44
$$ 124 -304 69 68 -123 -41 -191 20 -128 -56 84 29 211 -135 -167 -11 -46 -193 93 -171 -162 56 -47 -191
4791a91J54m4J01r8N0M3O0j53J16j51L01k28O2k1J9J09j42J83q0LK5j47Q0r9l7
$$ -191 -37 -81 20 -78 -28 15 75 -78 38 -113 188 -40 22 1 20 129 -13 170 90 93 118 -29 51 -48 -85
4816h5J14L1o6q0Q3o1J6j06K93J3k09O8rj89J91j34K67m8j40J43k98L04P3m43
$$ -85 29 60 -6 -86 -3 -64 -48 -154 139 152 -57 11 2 -187 4 -130 137 89 -51 92 -206 98 171 -272
4840b72J82q5K84r9J57m14K88l71K0O66k86j91O5j89M60j28q1Q5j07k2J48k98
$$ -272 -90 -175 109 10 167 -247 41 -330 -310 356 70 -121 -56 -245 215 87 6 91 -16 -38 110 -188
4862a88J55Ll6j47K09K63k88N4r5R1L2K4j92K60m6j77j56L04K1j08j30J87k17
$$ -188 -33 -30 -66 -213 -4 259 -29 25 -70 21 53 77 -115 145 99 -78 -234 70 91 -17 -147 40 -177
4885a77O2N4R6j2K2K0R4L7k60n0K8J34J94j34l6R6K7j27j03r2M0K12j62R6J65
$$ -177 -115 -61 35 23 45 65 159 196 -64 -114 -86 48 242 108 72 168 195 68 -35 -127 -87 125 -37 59 224
4910B24k64J26j41R1P7j17l1n3J17J05k08L0J89k05J92k20p9K2J30P5j58K19n4
$$ 224 -40 86 -55 36 113 -4 -35 -88 29 134 -74 -44 145 -60 132 -88 -167 -145 -15 60 -98 121 67
4933F7k51K93J84j61j51K71k66j09K77l46L70j47q0J48l84K38n1J00J28k06J02
$$ 67 -184 109 293 132 -19 252 -14 -123 154 -192 178 31 -49 99 -285 -47 -98 2 130 -76 26
4954B6j28J86n5m2J7j46N2r8J18K69m70L28k19L05j79J22j06N9l3p2L28l89KJ53
$$ 26 -102 84 29 -13 4 -142 -90 -188 -70 199 -271 57 -162 143 -36 86 -20 39 6 -66 262 -127 -125 28
4978B8K26j42J20k81P6L55n24J48m7K7j37l3L42p8j28N8j32l7K89q5m1L2R2j07
$$ 28 254 112 232 -49 27 382 -142 6 -41 -14 -151 -184 158 80 -48 10 -122 -159 130 45 4 36 128 21
5002B1q7k94K36O3j36K05K51m02L97k34k65L14k6j83K23j52q5L90j36O2l9j72
$$ 21 -66 -360 -124 -61 -197 8 259 -143 254 20 -245 69 43 -140 83 -69 -154 236 100 162 123 -49
5024d9O7K7j10j95L48j14j5p2P0p8O4P1m1K3l09K81j58K32l89M57RJ5K0j87M1
$$ -49 18 45 -65 -260 88 -26 -41 -113 -43 -121 -57 14 -27 -4 -313 -32 -190 42 -347 110 119 134 154 -33 8
5049HLk84P4Q1O5K4K47j14k14K4J71j95M10n65K29kR7oj91K77j5J05l86J25j9
$$ 8 11 -273 -199 -118 -53 -29 218 104 -110 -86 85 -110 300 -265 -36 -38 59 53 -138 139 124 229 -157 -32 -51
5074e1K04l3j7j95k5K16m4j47K6K1J79r6J16n68N84n37K53K3k9L89k18k86J82
$$ -51 153 120 103 -92 -117 99 55 -92 -66 -45 134 38 154 -414 170 -367 -114 -91 -120 269 51 -235 -53
5097e3j63J79Q2J29l69L41J81k61J72m45K06o4M9R5n0j81o2K75q9J06j16Q5o0
$$ -53 -216 -37 45 174 -195 146 327 66 238 -207 -1 -65 -16 79 29 -152 -214 61 -28 78 -38 47 -13
5120a3O7N0k68J63k97M68l25L94M0k68J28l95L99j97J36k2O7l31L24k0Q5n6m27
$$ -13 54 104 -164 -1 -298 170 -155 239 279 11 139 -256 143 -54 82 60 127 -204 120 100 185 129 -298
5143b98L32Km2n4J47k2Q5l21K06J58j00k5K8o2r1O3P2n9J12l8j43o1L0J43k7P
$$ -298 34 36 -6 -60 87 65 150 -171 35 193 93 68 96 34 -57 6 78 19 131 93 -50 -111 -81 62 35 42
5169D2k08K58j46k4N0l5K70k67J59r9q7k64K92m1J37j38MK08k50J1j1K50k56K45
$$ 42 -166 92 -54 -78 -28 -63 207 -60 99 0 -87 -351 -59 -100 37 -101 -97 111 -139 -128 -139 111 -145 100
5193A00j51K02q9k71n0L78K5j95J30j71J27J8J04l9p8j17O4p9j5K08n4j23j0q7
$$ 100 -51 151 62 -209 -259 119 144 -51 79 -92 35 53 157 118 40 -77 -13 -92 -107 101 47 -76 -86 -173
5217a73j88N16j23j55J5K08k31J5L50k25k6J9j6j73M34L5k09k48N3k2K2J63J34
$$ -173 -361 155 32 -123 -108 100 -131 -116 234 9 -17 2 -14 -187 247 282 73 -175 -122 -144 -122 41 175
5240A75k37L6k30K42m6Q2k10J33k7K54m22J8R6n5L14n9k66K07R0l06L55j39k42
$$ 175 -62 -26 -256 -14 -60 22 -188 -55 -82 172 -250 -232 -136 -191 123 64 -202 5 95 -211 144 5 -237
5263b37M1K72n3r6k6K19j75K65k67j04L7K30J02j93K41Lk69k9J55J09l26m4K37
$$ -237 -196 76 23 -73 -99 120 -55 210 -57 -161 -124 106 208 15 256 259 -10 -39 116 225 -101 -145 92
5286I2Pl4P5m67m5M27k56K48j43J04K27j69j59J67rk5J61k55K9J55l60J88L3P8
$$ 92 99 65 140 -327 -372 55 -201 47 -96 8 235 66 -93 74 65 40 201 -54 -25 130 -230 -42 -9 69
5310F9j36O4l46L07O9K5k22K67k10J76j16K2Q9P5j38k25L16n0j6P9p4l2N2k03
$$ 69 -67 -3 -349 -42 27 52 -170 97 -113 63 -53 -31 58 133 -5 -230 86 36 20 99 25 -7 45 -158
5334a58J14L72l99j34QK55l8m6K1j09L0J24k28K33p5l1j3K68k33J17l41J80oj90
$$ -158 -44 328 -71 -205 -197 58 20 -26 -5 -114 -84 40 -188 45 -30 -61 -74 194 -39 78 -263 -83 -89 -279
5358b79L75j24J2K37L2r7m06J97m4l3O5j79L99n7p5J24R1m06J46J21j25J04K1
$$ -279 96 -28 -16 221 253 156 -250 -53 -97 -130 -65 -244 155 98 23 147 238 -168 -22 99 -26 78 99
5381I9rk81L24j96R0R8k25J77qk65L42j04N1k93L09nm2rK7n1n5o4K15p3J76m91
$$ 99 90 -191 133 -63 27 125 -100 77 69 -196 146 42 93 -200 109 104 62 53 80 29 -26 -90 125 52 228 -263
5407b63K96m5o0L84k71l9j44J23M6J51O1k73k52K26pr3K61l64Q6P6l5L4K16m9
$$ -263 33 -12 -72 312 41 2 -142 -19 27 178 239 -34 -286 -60 -67 -160 101 -263 -177 -101 -136 -102 114 65
5431F5j32j5M3p8J99j50L2J90j96m8N3J56K15l11NJ5k40J25n4N4Q4K4l3J01j41
$$ 65 -67 -82 -39 -117 82 -68 -36 154 -42 -90 -37 119 334 23 28 43 -197 -72 -126 -72 12 36 3 104 -37
5456c7J37j05p8q5J67j41R5J16l4j28N02m10k3L4l5J79n3lP6j82Q0K1m5k67L99
$$ -37 100 -5 -83 -168 -1 -142 -47 69 35 -93 409 -1 -24 10 -25 154 101 98 174 -8 72 93 48 -219 180
5481A80k86O5r4J37r9K27m36J01j3K6L01p8N6pL7j56m4K9J11K4j7j80MJ17r2J40
$$ 180 -106 -41 -135 2 -97 130 -306 -205 -218 -192 109 31 87 80 117 -39 -83 -54 57 81 64 -116 -112 5 -87 53
5507E3j2k7JJ8j77R1K7J45o58P00L29n96J81Lq0M4j47q2L28j91N8j0K71l03Qk70
$$ 53 41 14 15 33 -144 -53 -26 119 -539 161 490 -106 75 78 -2 42 -105 -187 141 -50 8 -2 269 -34 -26 -296
5533b96R0L77k91K64j40j20M00k47l3k55K17j98N7J02K45q7l9M6j6L7k11P1N1
$$ -296 -206 171 -120 144 4 -116 284 37 4 -251 -34 -232 -175 -73 172 85 46 92 76 113 -98 -27 24
5556B4nO6M6k12j52K49k7K00N0o7k73J19L1jq3M4j67J52J65J55m29Q0lk01L28
$$ 24 19 85 131 -81 -233 16 -11 189 239 172 -101 18 49 48 -35 9 -158 -6 159 314 -115 -35 -38 -239 89
5581H9j53K26j39j21N6n4L98k78P9j29j31K62o3j52J36k03K7J04r6J86l79O04
$$ 89 -64 162 23 -98 -42 -96 302 24 103 -26 -157 105 42 -110 26 -177 -150 -46 -142 44 -335 269
5603B69k03J70j37L0k3l80J24J08J5n3K81l3J85n55J44R1p4J69j25j98M29k54
$$ 269 66 236 99 129 106 -274 -150 -42 -27 -80 201 168 353 -202 -58 33 -41 128 3 -195 234 -20
5625b0o0M0o5J95o3r3J00N8J2r5kJ33j09J02m07K12M3n4J20k40M67k64j3j80M02
$$ -20 -80 -40 -105 90 27 -66 34 92 104 9 7 140 31 133 -274 -62 -19 -73 47 -193 274 10 -3 -183 219
5650B19l93M58k23r0K00j03n6n3l18N09m42j50L52n8rJ73j82J93j08K50j37K01
$$ 219 -174 284 61 -29 171 68 12 -41 -359 150 -292 -442 -90 -148 -157 16 -166 27 -81 169 32 233
5672B33K21n07J60M6o5L7m97O12j64k11m0K41j81K4R5N3o9N6J03o7J9j42J56j33
$$ 233 454 -53 107 153 88 125 -372 240 76 -135 -175 66 -115 -91 4 57 -12 44 147 80 99 -43 113 -20
5696b0p0J70L9L4m9j84K32k0j77N8q8n4K38j58l2j83M64k07k14K53j3O3k42j94
$$ -20 -90 80 119 153 104 -80 152 132 -45 13 -75 -129 109 -49 -81 -264 200 -7 -221 32 19 82 -160 -354
5720c54L79j21J7J02J21j27n3j49L17J14l15k15O20k87k05J41J38n7k92K67M8
$$ -354 25 -96 -79 23 144 17 -36 -185 132 246 -69 -284 336 49 -156 -15 123 66 -226 41 89
5741H9jj43MJ95p5l68L30Q2k70K29j0k21N3L03j06j87r0J48o0k08M57p2j90J47
$$ 89 88 -55 -51 144 69 -299 31 113 -157 72 62 -159 -106 197 91 -96 -186 -38 -98 -306 151 79 -111 36
5765C6K07l20j4P0p0Q3m9O9lJ76l37M11k86Jk21K12J03m2K6K7j19j64L26l19K53
$$ 36 243 -77 -91 -21 -91 -8 -57 12 9 185 -152 259 -27 -26 -247 -35 68 26 52 79 -40 -204 122 -197 56
5790E6o6q4K88j56J5j13K17k49J66j30r2L21m47L12j7K46l58J10K9j33k10N0J78
$$ 56 -10 -94 194 38 53 -60 157 -92 74 -56 -148 173 -274 38 21 267 -91 19 48 -85 -295 -245 -67
5813f7K53j79n1Q8k5j01R2j29J56m0j27K87k43R4J58J87m89J87Mj07J13j11K21
$$ -67 186 7 -44 44 19 -82 10 -119 37 -3 -130 157 -86 8 166 353 -136 51 55 -52 61 -50 171
5836A71j40j0k36J34Q3p8J86n5l21J32L52o3J1j11j06R4J05j71j8pJ23N3m6J51
$$ 171 31 21 -215 -81 2 -76 110 55 -266 -134 218 155 166 55 -51 43 148 -23 -41 -48 75 128 82 233
5860B33O8k55j71L81j46j3o2K41k62p6o7k3J14q5J20K07m09L08k47L37J43k67
$$ 233 301 46 -125 256 110 97 35 276 14 -62 -129 -152 -38 -123 -3 204 -205 103 -144 193 336 69
5882F9O6J56j02k45R9m5j5p5J05J30q5R5l09p6J08j01L52j88J07k0r0J1k94K49
$$ 69 135 291 189 -56 43 -2 -17 -92 13 143 58 153 -156 -232 -124 -225 127 -61 46 26 -64 -53 -347 -98
5906i8J89j78QpK0KN7l1j00J20l9J18j52k24L24L17j93q3l0j55J70j6PJ87k34
$$ -98 91 -87 -79 -86 -66 -64 -7 -38 -138 -18 -57 61 -91 -315 9 326 133 50 20 -135 35 19 26 213 -21
5931b1L1j17J32r0rm3J46O4j40m2R9k68N12K1l75J69Q1k86P4J06k09L6p8J49M
$$ -21 10 -107 25 -65 -74 -117 29 93 -47 -89 10 -258 254 275 -100 69 150 -136 -62 44 -165 -129 -207 -58 -54
5956e4J44k48K0o9L24J1L1j72o5J57J47r2j56J46l00K1J85p6J45l33R7J80k18
$$ -54 90 -158 -138 -207 117 128 159 -13 -78 79 226 134 -22 124 -176 -155 30 -46 99 -234 -137 43 -175
5979a75K85p2j45J01KJ83q1k22j12L2K45j0jl00M69l63L06k70K14n4n5J02j08
$$ -175 110 38 -107 -6 -4 179 98 -124 -236 -204 41 31 30 -270 199 -164 142 -128 86 32 -23 79 -29
6002b9mLK31m9rj27J63j06m5o6K88j52r2j34k4K94Om21M09n5N9O2Nk39r9K12J0
$$ -29 -33 -30 201 152 143 16 179 73 28 -38 250 98 6 -128 -152 142 148 -273 136 81 140 202 207 -32 -131 81 91
6029I1J29j25j04m4q7n5n2K49m9j47K47Q0o2l2K6j44J26k41L9K01Pl26K83M7J16
$$ 91 220 95 -9 -53 -140 -195 -247 2 -47 -194 53 133 71 39 65 -79 47 -194 -155 46 53 -273 10 57 173
$$ [...]
8191F1
##END NTUPLES=NMR FID
##END=
