##TITLE=1H_SR8361Y
 CDCl3, 8 sc, 
 1.9.2021
##JCAMPDX= 6.0         $$ Bruker NMR JCAMP-DX V2.0
##DATA TYPE= NMR FID
##DATA CLASS= NTUPLES
##ORIGIN= UXNMR, Bruker Analytische Messtechnik GmbH
##OWNER= root
$$ XWIN-NMR		Version 3.5
$$ Wed Sep  1 13:54:40 2021 Russian Standard Time (UT+4h)  she@DPX200
##.OBSERVE FREQUENCY= 200.1312
##.OBSERVE NUCLEUS= ^1H
##.DELAY= (6, 6)
##.ACQUISITION MODE= SIMULTANEOUS
##.ACQUISITION SCHEME= undefined
##.AVERAGES= 8
##.DIGITISER RES= 18
##SPECTROMETER/DATA SYSTEM= spect
##.PULSE SEQUENCE= zg30
##.SOLVENT NAME= CD2Cl2
##.SHIFT REFERENCE= (INTERNAL, CD2Cl2, 0, 15.7039)
##AUDIT TRAIL= $$ (NUMBER, WHEN, WHO, WHERE, WHAT)
$$ ##TITLE= Audit trail, XWIN-NMR		Version 3.5
$$ ##JCAMPDX= 5.01
$$ ##ORIGIN= Bruker BioSpin GmbH
$$ ##OWNER= she
$$ F:/spectra/data/she/nmr/H-F/1/audita.txt
$$ ##AUDIT TRAIL=  $$ (NUMBER, WHEN, WHO, WHERE, WHAT)
(   1,<2021-09-01 13:53:09.89 +0400>,<she>,<DPX200>,
      <created by zg, POWCHK disabled, PULCHK disabled
       configuration hash MD5:
       00 E9 B6 7A A2 85 ED C7 34 08 36 98 17 FE 4E 26
       data hash MD5: 16K
       71 1E F4 F9 36 3C 20 0C 0B 9E 70 E1 08 19 AE CE>)
$$ ##END=
$$ 
$$ hash MD5
$$ 11 80 19 B1 BF 4A 82 A7 5F 3E 7D 4A 01 92 FD D9
##$RELAX= 
##$RELAX= 
##$RELAX= 
##$RELAX= 
##$RELAX= 
##$RELAX= 
$$ Bruker specific parameters
$$ --------------------------
##$DU= <F:/spectra>
##$EXPNO= 1
##$NAME= <H-F>
##$PROCNO= 1
##$TYPE= <nmr>
##$USER= <she>
##$AMP= (0..31)
100 100 100 100 100 100 100 100 100 100 100 100 100 100 100 100 100 100 
100 100 100 100 100 100 100 100 100 100 100 100 100 100 
##$AQSEQ= 0
##$AQ_mod= 1
##$AUNM= <au_zg>
##$AUTOPOS= <>
##$BF1= 200.13
##$BF2= 200.13
##$BF3= 200.13
##$BF4= 200.13
##$BF5= 200.13
##$BF6= 200.13
##$BF7= 200.13
##$BF8= 200.13
##$BYTORDA= 1
##$CFDGTYP= 0
##$CFRGTYP= 5
##$CHEMSTR= <none>
##$CNST= (0..31)
1 1 145 1 1 1 1 1 1 1 1 1 1 1 1 1 1 1 1 1 1 1 1 1 1 1 1 1 1 1 1 1 
##$CPDPRG= <>
##$CPDPRG1= <>
##$CPDPRG2= <>
##$CPDPRG3= <>
##$CPDPRG4= <mlev>
##$CPDPRG5= <mlev>
##$CPDPRG6= <mlev>
##$CPDPRG7= <mlev>
##$CPDPRG8= <mlev>
##$CPDPRGB= <>
##$CPDPRGT= <>
##$D= (0..31)
0 1.2 0 0 0 0 0 0 0 0.06 0 0.03 0 0 0 0 0.0002 0 0 0 0 0 0 0 0 0 0 0 0 
0 0 0 
##$DATE= 1630489989
##$DBL= (0..7)
120 120 120 120 120 120 120 120 
##$DBP= (0..7)
150 150 150 150 150 150 150 150 
##$DBP07= 0
##$DBPNAM0= <>
##$DBPNAM1= <>
##$DBPNAM2= <>
##$DBPNAM3= <>
##$DBPNAM4= <>
##$DBPNAM5= <>
##$DBPNAM6= <>
##$DBPNAM7= <>
##$DBPOAL= (0..7)
0.5 0.5 0.5 0.5 0.5 0.5 0.5 0.5 
##$DBPOFFS= (0..7)
0 0 0 0 0 0 0 0 
##$DE= 6
##$DECBNUC= <off>
##$DECIM= 32
##$DECNUC= <off>
##$DECSTAT= 4
##$DIGMOD= 1
##$DIGTYP= 9
##$DL= (0..7)
0 120 120 120 120 120 120 120 
##$DP= (0..7)
150 150 150 150 150 150 150 150 
##$DP07= 0
##$DPNAME0= <>
##$DPNAME1= <>
##$DPNAME2= <>
##$DPNAME3= <>
##$DPNAME4= <>
##$DPNAME5= <>
##$DPNAME6= <>
##$DPNAME7= <>
##$DPOAL= (0..7)
0.5 0.5 0.5 0.5 0.5 0.5 0.5 0.5 
##$DPOFFS= (0..7)
0 0 0 0 0 0 0 0 
##$DQDMODE= 0
##$DR= 18
##$DS= 0
##$DSLIST= <SSSSSSSSSSSSSSS>
$$ [...]
##$SUBNAM2= <"">
##$SUBNAM3= <"">
##$SUBNAM4= <"">
##$SUBNAM5= <"">
##$SUBNAM6= <"">
##$SUBNAM7= <"">
##$SUBNAM8= <"">
##$SUBNAM9= <"">
##$SW= 20.0189188712717
##$SWIBOX= (0..15)
0 0 2 0 0 0 0 0 0 0 0 0 0 0 0 0 
##$SW_h= 4006.41025641026
##$TD= 16384
##$TD0= 1
##$TE= 0
##$TE2= 300
##$TE3= 300
##$TEG= 300
##$TL= (0..7)
0 120 120 120 120 120 120 120 
##$TP= (0..7)
150 150 150 150 150 150 150 150 
##$TP07= 0
##$TPNAME0= <>
##$TPNAME1= <>
##$TPNAME2= <>
##$TPNAME3= <>
##$TPNAME4= <>
##$TPNAME5= <>
##$TPNAME6= <>
##$TPNAME7= <>
##$TPOAL= (0..7)
0.5 0.5 0.5 0.5 0.5 0.5 0.5 0.5 
##$TPOFFS= (0..7)
0 0 0 0 0 0 0 0 
##$TUNHIN= 0
##$TUNHOUT= 0
##$TUNXOUT= 0
##$USERA1= <user>
##$USERA2= <user>
##$USERA3= <user>
##$USERA4= <user>
##$USERA5= <user>
##$V9= 5
##$VALIST= <valist>
##$VCLIST= <CCCCCCCCCCCCCCC>
##$VD= 0
##$VDLIST= <DDDDDDDDDDDDDDD>
##$VPLIST= <PPPPPPPPPPPPPPP>
##$VTLIST= <TTTTTTTTTTTTTTT>
##$WBST= 1024
##$WBSW= 4
##$XGAIN= (0..3)
0 0 0 0 
##$XL= 0
##$YL= 0
##$YMAX_a= 210635
##$YMIN_a= -224245
##$ZGOPTNS= <>
##$ZL1= 120
##$ZL2= 120
##$ZL3= 120
##$ZL4= 120
##$ABSF1= 10
##$ABSF2= 0
##$ABSG= 5
##$ABSL= 3
##$ALPHA= 0
##$AQORDER= 0
##$ASSFAC= 0
##$ASSFACI= 0
##$ASSFACX= 0
##$ASSWID= 0
##$AUNMP= <proc_1d>
##$AZFE= 0.1
##$AZFW= 0.1
##$BCFW= 1
##$BC_mod= 2
##$BYTORDP= 1
##$COROFFS= 0
##$CY= 11.3945322036743
##$DATMOD= 1
##$DC= 2
##$DFILT= <>
##$DTYPP= 0
##$F1P= 2.36226072786647
##$F2P= -0.459571619588291
##$FCOR= 0.5
##$FTSIZE= 0
##$FT_mod= 4
##$GAMMA= 1
##$GB= 0.15
##$INTBC= 1
##$INTSCL= 1
##$ISEN= 128
##$LB= 0.24
##$LEV0= 0
##$LPBIN= 0
##$MAXI= 10000
##$MC2= 0
##$MEAN= 0
##$ME_mod= 0
##$MI= 1.114404
##$NCOEF= 0
##$NC_proc= 0
##$NLEV= 6
##$NOISF1= 3.799351
##$NOISF2= 2.8
##$NSP= 1
##$NTH_PI= 0
##$NZP= 0
##$OFFSET= 15.70392
##$PC= 1
##$PHC0= -13360.23
##$PHC1= 12.40097
##$PH_mod= 1
##$PKNL= yes
##$PPARMOD= 0
##$PSCAL= 0
##$PSIGN= 0
##$REVERSE= no
##$SF= 200.130013532006
##$SI= 16384
##$SIGF1= 3
##$SIGF2= 2
##$SINO= 400
##$SIOLD= 16384
##$SREGLST= <1H.CDCl3>
##$SSB= 0
##$STSI= 0
##$STSR= 0
##$SW_p= 3612.71676300578
##$SYMM= 0
##$S_DEV= 0
##$TDeff= 0
##$TDoff= 0
##$TI= <>
##$TILT= no
##$TM1= 0
##$TM2= 0
##$TOPLEV= 0
##$USERP1= <user>
##$USERP2= <user>
##$USERP3= <user>
##$USERP4= <user>
##$USERP5= <user>
##$WDW= 1
##$XDIM= 8192
##$YMAX_p= 0
##$YMIN_p= 0
$$ End of Bruker specific parameters
$$ ---------------------------------
##NTUPLES= NMR FID
##VAR_NAME=  TIME,          FID/REAL,        FID/IMAG
##SYMBOL=    X,             R,               I
##VAR_TYPE=  INDEPENDENT,   DEPENDENT,       DEPENDENT
##VAR_FORM=  AFFN,          ASDF,            ASDF
##VAR_DIM=   8192,          8192,            8192
##UNITS=     SECONDS,       ARBITRARY UNITS, ARBITRARY UNITS
##FACTOR=    0.0002496,     1,               1
##FIRST=     0,             0,               0
##LAST=      2.0444736,     0,               0
##MIN=       0,             -224245,         0
##MAX=       2.0444736,     210635,          0
$$ Real data points
##PAGE= N=1
##DATA TABLE= (X++(R..R)), XYDATA
0@%%%%%%%%%%%%qJ6j6J6k4L2l3M1n6O5p3Q8j04J21j41J65j92K21k52K87l27L70
$$ 0 0 0 0 0 0 0 0 0 0 0 0 0 -8 8 -8 8 -16 16 -17 24 -32 33 -40 48 -56 65 -76 89 -103 118 -134 153 -174 196
34A96m19M72n30N94o65P44q28R20j021J132j254J385j529J687j857K044k254K486
$$ 196 -223 249 -281 313 -352 392 -436 484 -537 595 -659 726 -803 884 -973 1071 -1183 1303
52A303k739L021l336L690m091M550n081N706o448P350q479R931j1882J4660j8969
$$ 1303 -1436 1585 -1751 1939 -2152 2398 -2683 3023 -3425 3925 -4554 5377 -6505 8155 -10814
67a0814K6623m4381J67016P2191k22220l6012M0453J01974o965q2383r7657n921
$$ -10814 15809 -28572 138444 210635 -11585 -47597 -7144 94830 87865 5482 -92175 -98096
79i8096Q723j3156m0307K0178N3688J4688p2634o5392O900O8710M2172q920j1143
$$ -98096 -89373 -102529 -142836 -122658 -68970 -54282 -126916 -192308 -185408 -116698 -74526 -83446 -94589
92i4589M6177M4085k3722n0008L3187J17627J00227j2098r4879o2450L9528Q0493
$$ -94589 -48412 -4327 -28049 -78057 -44870 72757 172984 160886 66007 3557 43085 123578
104A23578L8868j2861k2609j5207k5299m4942j6348M5643N4352j6953q7166p9999
$$ 123578 162446 149585 126976 111769 86470 41528 25180 70823 125175 108222 21056 -58943
116e8943m998M0066K43m8982k7959J8982J5293l5468o1238r684O5544P0436P372
$$ -58943 -63941 -23875 -23632 -72614 -100573 -81591 -66298 -101766 -163004 -172688 -107144 -36708 -29336
129b9336m0854l2090J0504L5028K7623K5760M2070K9876k1726n0980r098O6116
$$ -29336 -70190 -102280 -91776 -56748 -29125 -3365 38705 68581 46855 -4125 -13223 52893
141E2893Q6584K2054n2297n1523J608L1158R692j8634j4600P256j820m0682m9730
$$ 52893 139477 161531 109234 57711 59319 90477 100169 81535 66935 74191 72371 31689 -18041
154a8041j4872K2130J7840j7599l6805j9070q27j3560k4632p33L5989L5435j3882
$$ -18041 -32913 -10783 7057 -10542 -47347 -66417 -67244 -80804 -105436 -106169 -70180 -34745 -48627
167d8627n4852k8853L7911O6587L6122r386k0458L249J9498J3345J2605K7667
$$ -48627 -103479 -132332 -94421 -27834 8288 -1098 -21556 -18307 1191 14536 27141 54808
179E4808K9964L864k7386k6500J0641L5241J7659j7189k3968m264N895j2403l2156
$$ 54808 84772 88636 61250 34750 45391 80632 98291 81102 57134 52870 58765 46362 14206
192A4206j7224J6504J9372j5920m5565l6418n25J9804P303r675p997l422r552
$$ 14206 -3018 13486 32858 16938 -28627 -65045 -65570 -45766 -38463 -48138 -56135 -59557 -69109
205f9109j4812k02K7207L6136Q479k4118k0902J3378L8219K8399J353o209R647
$$ -69109 -83921 -84123 -56916 -20780 -12301 -36419 -57321 -43943 -5724 22675 24028 17819 27466
218B7466J6362L037o662L368J9840J7803o058k2697j3457L687M289p044j0866
$$ 27466 43828 46865 40203 43571 63411 81214 75156 52459 39002 42689 46978 39934 29068
231B9068l148m62j4936l0514j9642Q455J9842J275k6368k9669n989J4522J1500
$$ 29068 25920 25458 10522 -19992 -39634 -31179 -11337 -10062 -36430 -66099 -72088 -57566 -46066
244d6066l59j662M340M173l422l601J3326K6084J7786k315q930L708J8141J5165
$$ -46066 -46425 -48087 -43747 -39574 -42996 -46597 -33271 -7187 10599 8284 -646 3062 21203 36368
258C6368J703j322Q707J1351n00j4495j1265O679J5594J143j6707j9267q847j297
$$ 36368 38071 36749 45456 56807 56307 41812 30547 37226 52820 53963 37256 17989 9142 7845
272G845l503p696l418R2q957j9840j5935K158J5871Q760j0332j6178k832J0405
$$ 7845 4342 -3354 -6772 -6680 -15637 -35477 -51412 -49254 -33383 -24623 -34955 -51133 -53965 -43560
286d3560J0747L827J840Q592J0588K263l990K834J5308J7842O733m395k660N115
$$ -43560 -32813 -28986 -27146 -18554 -7966 -5703 -9693 -6859 8449 26291 33024 28629 25969 31084
300C1084N711l19j118M736O822k740j5854j5935r59R730M066j0112j7277j1633
$$ 31084 36795 36476 35358 40094 46916 44176 28322 12387 11428 21158 25224 15112 -2165 -13798
314a3798k485k462m423j130J690j217r609j1754j540J1273J2397J606m946k035
$$ -13798 -16283 -18745 -23168 -24298 -22608 -23825 -33434 -45188 -46728 -35455 -23058 -21452 -26398 -28433
328b8433N795P870L540L819J0131J2455M393n541m709N633J3433R890o10m711
$$ -28433 -22638 -14768 -11228 -7409 2722 15177 19570 14029 9320 14953 28386 38276 37666 32955
342C2955l394k190l127k258K118M800r80j3253j6802p212L925N574k512j0413
$$ 32955 29561 27371 24244 21986 24104 28904 27924 14671 -2131 -9343 -5418 156 -2356 -12769
356a2769q043l987l406l284k63N204O226n38p913n130N025J1032Q660L367J792
$$ -12769 -20812 -24799 -28205 -31489 -31752 -26548 -20322 -20860 -28773 -33903 -28878 -17846 -9186 -5819 -4027
371d027L084K537K06J762Q872J2921O750l805r231k918O065P287K434k522m720
$$ -4027 -943 1594 1800 3562 12434 25355 32105 28300 19069 16151 22216 29503 31937 29415 24695
386B4695n370o597o989j884L848K662o189j2396j0855k799L163J278j686j723
$$ 24695 19325 12728 5739 3855 7703 10365 4176 -8220 -19075 -21874 -18711 -17433 -19119 -20842
400b0842j523k843m510j947N615J0690P006j231m268n71N585Q603O969N350M622
$$ -20842 -22365 -25208 -29718 -31665 -26050 -15360 -8354 -9585 -13853 -14424 -8839 -236 6733 12083 16705
415A6705J309k895k898K904Q876Q006l43p545p353k555P31R92j291j816k971o765
$$ 16705 18014 15119 12221 15125 24001 32007 31664 24119 16766 14211 14942 15934 14643 12827 9856 3091
431C091r755o705L00M148J422m994p870m870q77J275K566L893L910J394k716m011
$$ 3091 -6664 -13369 -13069 -8921 -7499 -12493 -20363 -25233 -26110 -24835 -22269 -18376 -14466 -13072 -15788 -19799
447a9799K667R034J0342M894m19k161O69L326L882N177M995L041k871n934m364
$$ -19799 -17132 -8098 2244 7138 6719 4558 5227 8553 12435 17612 22607 25648 22777 16843 12479
462A2479J508M966J968k992o155o212l960l142k384N38J409k597o733p733l730
$$ 12479 13987 18953 20921 17929 11774 5562 1602 -1540 -3924 -3386 -1977 -4574 -11307 -19040 -22770
477b2770K627M797J963j444k030j104m92J468M304O995O023Q39l091j723L716
$$ -22770 -20143 -15346 -13383 -14827 -16857 -17961 -18453 -16985 -12681 -5686 337 1176 -1915 -3638 78
492G8O737O725K653l36q15j602j000O81L056L398K22m879o943m201k87J597K6
$$ 78 6815 13540 16193 15857 15042 13440 12440 13121 16177 19575 19797 14918 7975 3774 3487 5084 5110
509E110k431l740l857m887m338K83K842K562j082m795m256J92K915M355L017J563
$$ 5110 2679 -1061 -4918 -9805 -14143 -13860 -11018 -8456 -9538 -14333 -18589 -18397 -15482 -11127 -8110 -6547
525f547K79J02m23J075M827O634M015l33k534r45K292L512J794J474N91k052l324
$$ -6547 -6268 -6166 -6589 -5514 -687 5947 9962 9629 7095 6150 8442 11954 13748 15222 15813 13761 10437
542A0437l225r62J867K158j535m902m553l434j083L0J23k33j278l174l943k110
$$ 10437 7212 6250 8117 10275 8740 3838 -715 -4149 -5232 -5202 -5079 -5312 -6590 -9764 -13707 -15817
558a5817J403M378K396p65j954n87R89K633L244L151K824J281p17o85J600L677
$$ -15817 -14414 -10036 -7640 -8405 -10359 -10946 -9957 -7324 -4080 -929 1895 3176 2459 1774 3374 7051
574G051M115J902j191j666q39k45L29Q42Q51q94k286m413l436j2N45L70j951l394
$$ 7051 11166 13068 11877 10211 9372 9127 9456 10298 11149 10255 7969 3556 120 108 653 1023 -928 -4322
592d322l209j859r81M2J509O67l51j646k139K28K979L542K151O90J32L78J337
$$ -4322 -7531 -9390 -10371 -10329 -8820 -8153 -8504 -10150 -12289 -12061 -9082 -5540 -3389 -2699 -2567 -2189 -852
609h52J837K253K950K576K24j372o68P52K165J403Kj327k164k216j470p09m7P8
$$ -852 985 3238 6188 8764 8988 7616 6948 7700 9865 11268 11270 9943 7779 5563 4093 3384 3337 3415
627C415j043l316l300j986l91P41L41j389j266r99j215J97J301K089K119N93p92
$$ 3415 2372 -944 -4244 -6230 -6621 -5880 -5539 -6928 -8194 -9193 -10408 -10211 -8910 -6821 -4702 -4109 -4901
644d901k77J602K606K355K018O88O99o7K16R57J572K004M94j329j963j431K89
$$ -4901 -5178 -3576 -970 1385 3403 4091 4790 4723 4939 5896 7468 9472 9966 8637 6674 5243 5532
661E532K63o8p98j535k643j518k378l01Q96k61j171k234j538o47N97J443L89P81
$$ 5532 5795 5727 4929 3394 751 -767 -3145 -3446 -2550 -2811 -3982 -6216 -7754 -8401 -7804 -6361 -5972 -5191
679e191r5k21k79O94K198K664J692R9n65J06J341J721J385J117L70o31j247n39
$$ -5191 -5286 -5507 -5786 -5092 -2894 -230 1462 1561 996 1102 2443 4164 5549 6666 7036 6405 5158 4619
697D619L99Q37M24l86k282j805p83j048J64l07o04q96j736j779q94P24J073M18
$$ 4619 5018 5855 6279 5893 3611 1806 1023 -25 139 -168 -772 -1668 -3404 -5183 -6077 -5353 -4280 -3862
715c862n84j249l90L26P55J385J664O95L28m20L5R53K128J865O23r1o67k89O40
$$ -3862 -4446 -5695 -6085 -5759 -5004 -3619 -1955 -1260 -932 -1352 -1317 -364 1764 3629 4252 4161 3494 3205 3845
734C845O25R16M90l22j267j547q08O3Q45l63r69j537j520r12o29P5M73N1r20j438
$$ 3845 4470 5386 5876 5554 4287 2740 1932 1995 2840 2477 1508 -29 -1549 -2461 -3090 -3015 -2542 -2491 -3411 -4849
754d849p48k31R06J481O52l60j55J5J49J335J495J639P22j07p41L18J124J304
$$ -4849 -5597 -5828 -4922 -3441 -2789 -3149 -3304 -3289 -3140 -1805 -310 1329 2051 1944 1203 1521 2645 3949
772C949J029L89m76n48q61n20N19O13K1o34k026j666p99NM12j66p53j435r75p45
$$ 3949 4978 5367 4891 4343 3482 2962 3481 4094 4115 3481 1455 -211 -1010 -1005 -593 -759 -1512 -2947 -3922 -4667
792d667m06M83R67L09j64j065k63P31J469J254J021L54j11J62J75J215J437J069
$$ -4667 -5073 -4590 -3623 -3314 -3478 -4543 -4806 -4075 -2606 -1352 -331 23 -88 74 249 1464 2901 3970
810C970P43m60p71l74N85O93K48j72q38j166j109r09J11K25k72j033j076j555
$$ 3970 4713 4253 3482 3108 3693 4386 4634 4462 3624 2458 1349 440 551 776 504 -529 -1605 -3160
828c160p42n6R3M96R3n33o65n71N79J221J409P20j77l9L38N67J005J464P22N25
$$ -3160 -3902 -3958 -3865 -3369 -3276 -3809 -4474 -5045 -4466 -3245 -1836 -1116 -1293 -1332 -994 -427 578 2042 2764 3289
848C289k39m6m43P05P73N34K84j338j337k91m13r9J39k14q81j206j317m96K02
$$ 3289 3050 3004 2561 3266 4039 4573 4857 3519 2182 1891 1478 1379 1518 1304 423 -783 -2100 -2596 -2394
867b394o4M21k26q06r18l13N85P35Q30L94J97m80j11O09J476R42Q32J10l51j73
$$ -2394 -2458 -2037 -2263 -3069 -3987 -4300 -3715 -2980 -2150 -1756 -1559 -2039 -2150 -1541 -65 877 1709 1819 1468 1295
887A295q4J509O69N19k03n74m81p06k26N11P8k56n26j394p12n05r3M61M2n61j024
$$ 1295 1211 2720 3389 3908 3705 3131 2650 1944 1718 2229 2307 2051 1525 131 -581 -1086 -1179 -718 -676 -1237 -2261
908b261j009k8Q7Q49M52J6l75j19r8O25N53J019O99l2k48j73O33O77J103M70j41
$$ -2261 -3270 -3298 -3211 -2362 -1910 -1894 -2269 -2388 -2486 -1861 -1308 -289 410 378 130 -43 590 1267 2370 2840 2699
929B699l11l06m30O57K15K66M0p04j137o04j09Q4J87k40r56o25n97j96j4N11O0
$$ 2699 2388 2082 1652 2309 2524 2790 2830 2126 989 385 276 360 547 307 -649 -1274 -1871 -2067 -2081 -1570 -1510
950a510m92m85l75K29J46P37M65L32l6p4K7M50R55J040K58L1k53o1K88N22M60
$$ -1510 -2002 -2487 -2862 -2633 -2487 -1750 -1285 -953 -989 -1063 -1036 -586 369 1409 1667 1698 1445 1384 1672 2194 2654
971B654K28K93n94q30l13k9K90k91j79r11o42q23JM1j12Qn26q04k01k82O66K48
$$ 2654 2882 3175 2581 1751 1438 1409 1699 1408 1229 318 -324 -1147 -1146 -1105 -1217 -1209 -1735 -2539 -2740 -3022 -2356 -2108
993b108M24n4k09Q7K15L31Q30P76L44K09j98M7O88L46P11L47j11l51o55L5L78
$$ -2108 -1684 -1738 -1947 -1860 -1645 -1314 -484 292 636 845 647 694 1382 1728 2439 2786 2675 2324 1669 1704 2082
1014B082K00k89o2r25p74l80j10j01O5m25o55p27q6o8J16L68J87j52l44R9n1N83
$$ 2082 2282 1993 1931 1006 232 -148 -258 -359 -294 -719 -1374 -2101 -2187 -2255 -2139 -1771 -1584 -1736 -2080 -1981 -2032 -1449
1036a449N61M93M94q5q7K10Q92M6R12J22l69J70k03k15M03L87k17l40n33k19o46
$$ -1449 -888 -395 99 14 -73 137 1029 1075 1987 2109 1740 1910 1707 1492 1895 2282 2065 1725 1192 973 327
1057C27M6n8j90l9n74o43k81j38K12m9Q2o59n3j31K89K37M29M45k5o6J67M69K74
$$ 327 373 315 125 86 -488 -1131 -1412 -1550 -1338 -1387 -1305 -1964 -2017 -2148 -1859 -1622 -1193 -748 -773 -839 -672 -203 71
1080G1M48K61L75k8j58L3J7O16j0L60n51j85J27m87K52j34j19j09n94n77k21q6
$$ 71 519 780 1155 1127 969 1002 1019 1635 1625 1985 1434 1249 1376 889 1141 1007 888 779 185 -392 -613 -699
1102f99J38n2P5n02l11r9j0K65J56P6j50j06k81M41N17L28P0J01K4L6L8O21M08
$$ -699 -561 -613 -538 -1040 -1351 -1450 -1460 -1195 -1039 -963 -1113 -1219 -1500 -1059 -542 -214 -144 -43 -19 17 55 676 1084
1125A084K13n9j95J01l14L53Q8m4J76K0o19j08k26K3K23n22l02k88m15q2J10j42
$$ 1084 1297 1238 1043 1144 830 1183 1271 1227 1403 1423 804 696 470 493 716 194 -108 -396 -811 -893 -783 -925
1147i25M3R6m73k78j15L01L4O23j40J47p5J21P0O54K17K77K8Or8K39M63m03O14
$$ -925 -882 -786 -1259 -1537 -1652 -1351 -1317 -694 -834 -687 -762 -641 -571 83 300 577 605 611 513 752 1215 812 1426
1170A426L9j21P1k78k08K11r5j65p3o37k96m12l3l4Q6r0m67n38L48k06K25q1J11
$$ 1426 1465 1344 1415 1137 929 1140 1045 880 807 170 -126 -538 -571 -605 -519 -609 -1076 -1614 -1266 -1472 -1247 -1328 -1217
1193a217K13m20L25J9M61M98L05o2Q0L3K26K13N77K16j17p8j48N5J06m7k42J51
$$ -1217 -1004 -1424 -1099 -1080 -619 -121 184 122 202 235 461 674 1251 1467 1350 1272 1124 1179 1285 1238 996 1147
1215A147l16k23m41l09M98o52p0j8m27r7m99M33j78l0J41r2n1j1J39M88J97K73
$$ 1147 831 608 167 -142 356 -296 -366 -384 -811 -908 -1407 -974 -1152 -1182 -1041 -1133 -1184 -1195 -1056 -568 -371 -98
1237i8r3J17l24O11J10M28J45K2J14j85r8J10L89k94j16K4k16j55Q2q9j15j78
$$ -98 -191 -74 -398 213 323 751 896 918 1032 847 749 859 1248 954 838 862 646 491 573 484 369 191
1259A91k5m65n9j60j31K45l91j71J37k70l4j32L44K59J1L09k73J68J83J43L24
$$ 191 166 -299 -358 -518 -649 -404 -795 -966 -829 -1099 -1133 -1265 -921 -662 -651 -342 -615 -447 -264 -121 203
1280B03NJ47j39J65m5J11K44L24k82K27j97l49J86M4J32l51j36k20J18k42pO8
$$ 203 208 355 216 381 336 447 691 1015 733 960 763 414 600 644 776 425 289 69 187 -55 -62 6
1302Fl18k3Q4m07n1N6j05J62j66J1j78J66K59J56k7K8K80k87K61Q4L41J00K19
$$ 6 -312 -335 -251 -658 -709 -653 -758 -596 -762 -751 -929 -763 -504 -348 -375 -347 -67 -354 -93 -9 332 432 651
1325F51J65l98K80p7L63j09L8m9j07l23j10K71j74j58N5k92k95N3l32r9k0k4j0
$$ 651 816 418 698 621 984 875 913 864 757 434 324 595 421 263 318 26 -269 -216 -548 -647 -667 -691 -701
1348g01p5L4l56M25j59K07J73j96J12K27k21M89J93L95k10L07k93J39J20J29K33
$$ -701 -776 -742 -1098 -673 -832 -625 -452 -648 -536 -309 -530 -41 152 547 337 644 351 490 610 739 972
1369I72N5k61Q1j36l5l87L98l6l09k69k46K1j75J98l38j66o2N6k00O5n5J49L4
$$ 972 1027 766 847 711 676 289 687 651 342 73 -173 -152 -327 -129 -467 -633 -695 -639 -839 -774 -829 -680 -646
1392f46J24r0J7J64M5L53J99j56R6K22J14K05o5k53M22J20j60Kjj08prj72o9K33
$$ -646 -522 -612 -595 -431 -386 -33 166 10 106 328 442 647 582 329 751 871 711 713 712 604 597 588 416 347 580
1417E80n62j0p1j87J23l38K55m24J98m22M05n1l71L50J91k08R7L93j64j27J14
$$ 580 18 8 -63 -250 -127 -465 -210 -634 -436 -858 -453 -504 -875 -525 -334 -542 -445 -52 -216 -343 -229
1438b29J4L34J26J03p4J53q0J32N6j3M9N9k32N6o7n6j39k33M62j66j46j39rk88
$$ -229 -215 119 245 348 274 427 347 479 535 522 571 630 398 454 387 331 192 -41 421 255 109 -30 -39 -327
1462c27QK82k03j4j08m30L97j09J02m7J86k43K25R4KJ5J14M1J08J10J15j00K53
$$ -327 -319 -37 -240 -254 -362 -792 -395 -504 -402 -449 -263 -506 -281 -187 -185 -170 -56 -15 93 203 318 218 471
1485D71j30O6p7K16J43l96J05j10p7Q7N7m5Qj11j99k6r5j16K75k89l2L34l80Q0
$$ 471 341 407 330 546 689 293 398 288 211 298 355 310 318 207 8 -18 -113 -229 46 -243 -275 59 -321 -241
1509b41j47m0k3J27k90K44K51j14m1L39j42J44O3J82j68Q0J64j3p4J69qj06J49
$$ -241 -388 -428 -451 -324 -614 -370 -119 -233 -274 65 -77 67 130 312 144 224 388 375 301 470 462 356 505
1532E05J77l53K11l38K66m15J00q3r7J93j41o0k74J96m24P0J5R7K8j46k65M36
$$ 505 682 329 540 202 468 53 153 70 -27 166 25 -35 -309 -113 -537 -467 -452 -355 -327 -473 -738 -302
1554c02k64L05j15J17K09p5L26P0Mj21P3J29j73L19K05k84q5k3J81j60Q1N4m69
$$ -302 -566 -261 -376 -259 -50 -125 201 271 275 154 227 356 183 502 707 423 338 315 496 336 417 471 2
1577BK99k13j30J32k02L1n0l74J90k79K33j3N4j99j8K88j17K6J41j27J3K60p8
$$ 2 301 88 -42 90 -112 -81 -131 -505 -315 -594 -361 -374 -320 -519 -537 -249 -366 -340 -199 -326 -313 -53 -131
1600a31K33j09J79n9Q1J55k4L08k81j06L01m08K59j46k36Ll3J6J66m65K68mk8
$$ -131 102 -7 172 113 194 349 325 633 352 246 547 139 398 252 16 19 -14 2 168 -297 -29 -33 -61
1623f1k03j86K77K5j17k0K12o7o3j81M33l57Q8R4K25k93O0K07j18K40j33J36k24
$$ -61 -264 -450 -173 -148 -265 -285 -73 -140 -203 -384 49 -308 -220 -126 99 -194 -134 73 -45 195 62 198 -26
1646b6K81J01l68M38k57P7j44K60j27n8R5l09P5L3K04j29k29j02P4J3l55M05j6
$$ -26 255 356 -12 426 169 246 102 362 235 177 272 -37 38 71 275 146 -83 -185 -111 -98 -453 -48 -64
1669f4M8m6k32p4L33j63j60N1J17j72N5K26J71p6J39M3j33j09M15l37L66n74M54
$$ -64 -16 -62 -294 -368 -35 -198 -358 -307 -190 -362 -307 -81 90 14 153 196 63 -46 369 32 398 -176 278
1692B78j6l38K67j33J73J71k66j9j32rP8l7k01M01m39q7M2r9L33n00J75J44P6
$$ 278 262 -76 191 58 231 402 136 117 -15 -24 54 17 -184 217 -222 -309 -267 -366 -33 -533 -358 -214 -138
1715a38k0P9k3j67J98o5K1M40j42l12J89O3K56j85j04OK71R1j74n2J03l8J0m11
$$ -138 -158 -79 -102 -269 -71 -136 -115 325 183 -129 60 123 379 194 90 96 367 458 284 232 335 297 307 -104
1739a04K24k34J02K3l06l4J48l09K72k73K92m71L30M7O4j8kJ94q5j77K59Q0j34
$$ -104 120 -114 -12 11 -295 -329 -181 -490 -218 -491 -199 -670 -340 -293 -229 -247 -249 -55 -140 -317 -58 22 -112
1762a12k4J83L06j84o0K28l60L32J57l48L06P2k99j22K08l83L76m85J25J96k73
$$ -112 -136 47 353 169 109 337 -23 309 466 118 424 496 197 75 283 -100 276 -209 -84 112 -161
1783a61jk43R3L12k19p9r1L12j57O3jJ7Q0j14k40L73J35R6k68N5R8j4J50L05l59
$$ -161 -162 -405 -312 0 -219 -298 -389 -77 -234 -171 -172 -155 -75 -189 -429 -56 79 175 -93 -38 60 46 196 501 142
1808A42j26K30k05K65k68PN9Q7Q8m9l30L02k86K63k02K54l24M3l4j74J18j2J04
$$ 142 16 246 41 306 38 45 104 191 279 230 -100 202 -84 179 -23 231 -93 -50 -84 -258 -140 -152 -48
1831d8o2k09J88Jl6L8M5Mk6r8K85k17J77J75k05J49M3n0q4K91m19N6K05n3L6J0
$$ -48 -110 -319 -131 -130 -166 -128 -83 -79 -105 -203 82 -135 42 217 12 161 204 154 70 361 -58 -2 203 150 186 196
1857A96k33K31N6j80J36j69J01k67L21p3n0k33J34l33J71l3L8K25k18q8j37M62
$$ 196 -37 194 250 70 206 37 138 -129 192 119 69 -164 -30 -363 -192 -225 -187 38 -180 -268 -405 57
1879E7k06K14j5j54j6J22m2m7J37Q7o2J56j50j39K82r6j27l0K61l5j52J54r0k3
$$ 57 -149 65 50 -104 -120 2 -40 -87 50 137 75 231 81 -58 224 128 1 -29 232 197 45 199 109 86
1903H6n5o4lj26j43J51l9N1J78m69M84l88R8j6MJ01J29j00K21j0n1O4J11m2M6
$$ 86 31 -33 -36 -162 -305 -154 -193 -142 36 -433 51 -337 -239 -255 -251 -150 -21 -121 100 90 39 103 214 172 218
1928B18j90J50j35N1L03j65M9k63j66J52R5p9J87n0L2j99j70k8P7L9j04M5j86
$$ 218 28 178 43 94 397 232 281 18 -148 4 99 20 207 157 189 -10 -180 -208 -131 -92 -196 -151 -337
1951c37P9Q8J05O7k87J41K01k32J52K13l76P2l4J2J87K6l10L26o8J95j53L28l80
$$ -337 -258 -170 -65 2 -285 -144 57 -175 -23 190 -186 -114 -148 -136 51 77 -233 93 25 220 67 395 15
1974A5o7K71j47J19kR4m26J95k87m2J54M32l39k0k3Q0j36o9M31p01M11j50J22
$$ 15 -52 219 72 191 189 283 -143 52 -235 -277 -123 309 -30 -50 -73 7 -129 -198 233 -468 -57 -207 -85
1997h5n6K2L29k41k26K70Q5k87K8K63K14k74j34J50M4O7K5k71J91J78l05R3J51
$$ -85 -141 -119 210 -31 -257 13 98 -189 -161 102 316 42 -92 58 102 169 194 -77 114 292 -13 80 231
2020B31q2K1p3r8j0K51n92K21J80j19J19l31N09l06k95K86j68M1p8M91m58K50
$$ 231 149 170 97 -1 -11 240 -352 -131 49 -70 49 -282 227 -79 -374 -88 -256 -215 -293 198 -260 -10
2042a0N7j03L7j73L59k65K48m5P4J93k70o7m7M14l99M09k35k26L59j77l0L8k17
$$ -10 47 -56 -19 -192 167 -98 150 105 179 372 102 35 -12 402 3 412 177 -49 310 133 103 141 -76
2065g6j52J35M8J17j85j97L53j62J9k15P1M3j09O1p8K41N4j77J10J06L42k45j42
$$ -76 -228 -93 -45 72 -113 -310 43 -119 -100 -315 -244 -201 -310 -249 -327 -86 -32 -209 -99 7 349 104 -38
2088c8M26j77J28j36M1J32k35j67O9K64r4m83J10K78pj95K07j10j26j49R3m8K83
$$ -38 388 211 339 203 244 376 141 -26 43 307 213 -270 -160 118 111 -84 123 13 -113 -262 -169 -217 66
2111F6J8n10R5N1J72mL5l7Q3j66J69K69l39K83m5j73K21J22l60M00q9k2j51M8
$$ 66 84 -426 -331 -280 -108 -112 -77 -114 -31 -197 -28 241 -98 185 140 -33 188 310 -50 350 261 239 88 136
2135A36j27M1Pj8l5j65K75k53J8Q8k35M12k92J9M6j06P0j52J34mj63J75K4M64
$$ 136 9 50 57 39 4 -161 114 -139 -121 -33 -268 144 -148 -129 -83 -189 -119 -271 -137 -141 -304 -129 -105 359
2159C59k54j98K90j29j27M22k83O7N8NQj79O2o2K40l75P0J58q2j06r9J03o1O8
$$ 359 105 -93 197 68 -59 363 80 147 205 210 218 39 101 39 279 -96 -26 132 50 -56 -155 -52 -113 -45
2183d5r0O6k04L05J89j50J62j78L1j66J40J34j87J27m08K19L43k35k64L01M2r4
$$ -45 -135 -69 -273 32 221 71 233 55 86 -80 60 194 7 134 -274 -55 288 53 -211 90 132 38
2205C8M9k91J63j32J18J66r8J88j14j4J4k20K62j95l07N72j14m3l6J65j65j52
$$ 38 87 -204 -41 -173 -55 111 13 201 87 73 87 -133 129 -66 -373 199 85 42 6 171 6 -146
2227a46J24j36K73j43k3j08k4L09k44J14Q1p8n2k77K51j96L72P9j70M9K4mk03
$$ -146 -22 -158 115 -28 -51 -159 -183 126 -118 -4 77 -1 -53 -330 -79 -275 97 176 6 55 79 75 -128
2250a28L80j77Q4J05l5j06k23J05k6j45J61n19M04M51j40j72j41J99m13K66J42
$$ -128 252 75 159 264 229 123 -100 5 -21 -166 -5 -524 -120 331 191 19 -122 77 -336 -70 72
2271G2l82K34j78M1R3j16K91J8j48%K76l63L76K06k27j42q3J36j68K29r1MJ01
$$ 72 -310 -76 -254 -213 -120 -236 55 73 -75 -75 201 -162 214 420 193 51 -32 104 -64 165 74 78 179
2294A79q3P1l16J96K24k13l08L93r4RK7j37j68j59J30L0J31r2K22k31J0K4O9l72
$$ 179 96 167 -149 47 271 58 -250 143 49 58 85 -52 -220 -379 -249 -219 -88 -180 42 -189 -179 -155 -86 -458
2318d58M86K41m6q2K3m3j31J6J43J92k79J70j62k04P3K95K1j59k32J92j61K21
$$ -458 28 269 223 141 164 121 -10 6 149 341 62 232 70 -134 -61 234 255 96 -136 56 -105 116
2340A16k08M4k25K27p2o2K2k16L23k43L05j06k02L67q9k4j00L18l07K60p8o1K09
$$ 116 -92 -48 -273 -46 -118 -180 -158 -374 -51 -294 11 -95 -297 70 -19 -43 -143 175 -132 128 50 -11 198
2363A98k18O0oJ39j54l8O2L9Rk54J41K31j05j65lko5j23R7q6J41Q8p2K50J85n77
$$ 198 -20 40 34 173 19 -19 43 82 91 -163 -22 209 104 -61 -64 -66 -131 -254 -157 -243 -102 -14 -86 164 349 -228
2389b28K70n7k84J92l8k5J28K54j73j61O8J16k43N4Q7L0k05J05L5P2O7j10K29
$$ -228 42 -15 -299 -107 -145 -170 -42 212 39 -122 -54 62 -181 -127 -40 -10 -215 -110 -75 -3 64 -46 183
2412A83n7J8q9K24j86R7l18P9j87K38r8M31m12J6kk42J72k13L81j48l4k4Q8j49
$$ 183 126 144 55 279 93 190 -128 -49 -236 2 -96 335 -77 -61 -63 -305 -133 -346 35 -113 -147 -171 -83 -232
2436b32K38l8R0j11M3j50L3K7J70Q6L8l50J85o3K71j43L55k90nL1j77J0NJ06j86
$$ -232 6 -32 58 -53 -10 -160 -127 -100 70 156 194 -156 29 -34 237 94 449 159 154 185 8 18 23 129 -57
2461e7J34j54J45k21Kj88J99K23r8K7l44N2K68k64L00L7j2Q9q3K11k50r3K55j55
$$ -57 77 -77 68 -153 -151 -339 -140 83 -15 12 -332 -280 -12 -276 24 61 49 138 55 266 16 -77 178 23
2485B3K84r7l4N2r4j61M18l04k2P2j58p1P1R1j43j71O2j15J56J36k64P0o8J45
$$ 23 307 210 176 228 134 -27 391 87 65 137 -21 -92 -21 70 -73 -244 -182 -297 -141 -5 -269 -199 -267 -122
2509a22n5R5N0j0r1q0P6K98n2j8j73J88p3K12k67K91k51N0r3K2N7L89n22K55l51
$$ -122 -177 -82 -32 -42 -133 -213 -137 161 109 91 -82 106 33 245 -22 269 18 68 -25 -3 54 443 -79 176 -175
2534a75L84k01n8r1Q7k21K73j96o2L26k79J59K4j61K86l2k12n2K67N1l91Q7j73
$$ -175 209 8 -50 -141 -54 -275 -2 -198 -260 66 -213 -54 -30 -191 95 63 -149 -201 66 117 -274 -187 -360
2557c60L59j69K54j6q7N9l6K07l9j08n4k4r9o5P3L01m52L01K8k23j3J25l8j12
$$ -360 -1 -170 84 68 -19 40 4 211 172 64 10 -14 -113 -178 -105 196 -256 45 73 -150 -163 -38 -76 -188
2581a88J86k27K54k0j12Q4M9k13K02l62K95J10j46J11j70m4K16q8K26M0j42RO
$$ -188 -2 -229 25 5 -107 -23 26 -187 15 -347 -52 58 -88 23 -147 -191 25 -63 163 203 61 70 76
2604G6k7J7J51k10K06j64J59P6m09L2J65J42q5N4j59j28K96j61j80K6J07k27K23
$$ 76 49 66 217 7 213 49 208 284 -125 -93 72 214 129 183 24 -104 192 31 -149 -123 -16 -243 -20
2627b0N7oo5j0J95k62k3O0j93M08l0j66M7J17L6l8r7J61p3k8J82j13j54J09l3
$$ -20 37 31 -34 -44 151 -111 -134 -74 -267 141 111 -55 -8 109 145 107 10 171 98 70 252 139 -15 94 61
2652F1r6J73j17q9J35j1ol75M53j33J5q5j28l6N85l91K1k09P4R0K8j11K21j4J64
$$ 61 -35 138 21 -68 67 56 50 -325 128 -5 10 -75 -203 -239 346 -45 -24 -233 -159 -69 -41 -152 69 55 219
2677B19k26j56M28k55J3K73j84pJ65o4l45K80l1l0p0j52K22Jk35J51O7l97J17
$$ 219 -7 -163 265 10 23 296 112 105 270 206 -139 141 110 80 10 -142 80 81 -154 -3 64 -333 -216
2700b16J53J4j73q6J74n3N7j90N81j35L1k66K47N5l36O37m58M3r7L35l36J91p9
$$ -216 -63 -49 -222 -308 -134 -187 -130 -320 261 126 157 -109 138 193 -143 494 36 79 -18 317 -19 172 93
2723I3K03m5l09m9K68m62M44j19m03K51k1J8J11K9l36K37j73p1M30l38R1m2J59
$$ 93 296 251 -58 -107 161 -301 143 24 -379 -128 -149 -131 -20 9 -327 -90 -263 -334 96 -242 -151 -193 -34
2746c4k37J99J12j50L29o33M40l9J56k00K40j28O4J7q6J38ol94J41q4K78q6q5
$$ -34 -271 -72 40 -110 219 -414 26 -13 143 -57 183 55 119 136 50 188 182 -212 -71 -155 123 37 -48
2769d8K6J05K00k27o3R1j23J18j31K56k31l48L52K6j37O8j06J45l5J05j72K23
$$ -48 -22 83 283 56 -7 84 -39 79 -52 204 -27 -375 -23 3 -134 -66 -172 -27 -62 43 -129 94
2791I4k30O7k3j2J52o1J73l67J31J74q4L05l56L9O4J96r2o9M7k47J79k45J23j53
$$ 94 -136 -69 -92 -104 48 -13 160 -207 -76 98 14 319 -37 2 66 262 170 101 148 -99 80 -165 -42 -195
2815a95J10R9j87J51R6j78J38j22J10l08J36O4j97L8K7KpJ29O3L0J02p5k1r9J02
$$ -195 -85 14 -173 -22 74 -104 34 -88 22 -286 -150 -86 -283 -245 -218 -216 -223 -94 -31 -1 101 26 5 -94 8
2840Hk1L50l51J12O5Kk10R2j5Q8j65L78j15j82qm00M57m18J39J59Np1j14j80Q8
$$ 8 -13 337 -14 98 163 165 -45 47 32 120 -45 333 218 36 28 -372 85 -333 -194 -35 -30 -101 -215 -395 -307
2865c07J28J38j36J00k25L96j08J30o4j98J30m1j34K61J88m75L72N4p8M8M0J42
$$ -307 -179 -41 -177 -77 -302 94 -14 116 52 -146 -16 -57 -191 70 258 -217 155 209 131 179 219 361
2887C61k25q8p2Oj85L2R6j23N5l5J92j19O1j27l03N04j03q5R1k5j14J99j1K1j45
$$ 361 136 48 -24 -18 -203 -171 -75 -198 -143 -178 14 -105 -44 -171 -474 30 -73 -158 -67 -92 -206 -7 -18 3 -142
2912a42k2J95Q9m7K43l39R4R2j59R9J08j59K8J31k85M68k95m0j11J94j76L3J96
$$ -142 -164 31 120 73 316 -23 71 163 4 103 211 52 80 211 -74 394 99 59 -52 142 -34 -1 195
2935A95l94L98j82o3L33l26j07l9l7N55m01O0J94j5j89j55K55k1k8J6J35l59P1
$$ 195 -199 199 17 -46 287 -39 -146 -185 -222 333 -68 -8 186 171 -18 -173 82 61 33 49 184 -175 -104
2958a04R9J72k52J37n0J10k84J14J19Pm52M50o3PR1k30J66l7k21K3J93m7J24j25
$$ -104 -5 167 -85 52 2 112 -172 -58 61 68 -384 66 3 10 101 -129 37 0 -221 -198 -5 -52 72 -53
2982e3j07J72L33o09Q1Q8o5J75l03K89PK33m38K75r6J69j63j3M8j9K80m20J76
$$ -53 -160 12 345 -264 -183 -95 -160 15 -288 1 8 241 -197 78 -18 151 -12 -25 23 4 284 -136 40
3005D0O7k3k7j41J93r7J86J65q2j67n1k13M3lRj10l1N2J93L9j34q2J56q8L40l15
$$ 40 107 84 57 -84 109 12 198 363 281 114 63 -150 -107 -110 -101 -211 -242 -190 3 42 -92 -174 -18 -106 234 -81
3031h1k84L52k11K45M0J47l40K34l09M72j83k87M13J40m55J05M0j32j1J09J77
$$ -81 -365 -13 -224 21 61 208 -132 102 -207 265 82 -205 208 348 -107 -2 38 -94 -105 4 181
3052A81l48K28j08J46r0k16J39k16K44j30j18J18K13J02rJ1m4j49M8J0J03J2J04
$$ 181 -167 61 -47 99 9 -207 -68 -284 -40 -170 -288 -170 43 145 136 147 103 -46 2 12 115 127 231
3075B31j1q7k34K23N5j91n5Q1J76k67M16k28k62ml4L27r5k49K71r8n9N6j88P1
$$ 231 220 133 -101 122 177 -14 -69 12 188 -79 337 109 -153 -157 -191 136 41 -208 63 -35 -94 -38 -226 -155
3099a55n2K39m4K1L11l91j2P4J04o3J36j94j80N3L46j69O8k19J27l0L9r8r7M54
$$ -155 -207 32 -12 9 320 -71 -83 -9 95 32 168 -26 -206 -153 193 24 92 -127 0 -30 9 -89 -186 268
3123B68k04k19JK74q1P6j07k85K32O9L15l85j08K10o9M1J36n4j7m72N06O3j99
$$ 268 64 -155 -154 120 39 115 8 -277 -45 24 339 -46 -154 56 -13 28 164 110 93 -379 127 190 -9
3146ij88R6K2q5K92k8n8m03L99K60j09j51J82k40r7M1L31l77K13jJ5m05N46j05
$$ -9 -197 -101 -79 -164 128 100 42 -361 38 298 189 38 220 -20 -117 -76 255 -122 91 90 105 -300 246 141
3170A41j90L21k3k14k6OQ8j94k47K44J86k11n0J34k33K09R4k07N3J05J36l43J82
$$ 141 -49 272 249 35 9 15 103 -91 -338 -94 92 -119 -169 -35 -268 -59 35 -172 -119 -14 122 -221 -39
3193c9J5J68L8k63L46o9Pk89K40q6m4m2k6J73j30q9P8n2J7j23JL49m62K09j02
$$ -39 -24 144 182 -81 265 196 203 -86 154 68 24 -18 -44 129 -1 -90 -12 -64 -47 -170 -169 180 -282 -73 -175
3218a75l9kK3n9K54j31J94j33l9K4J60R3j95M54k90p5Lj4N0p5k04NL74j80n4J61
$$ -175 -214 -216 -193 -252 2 -129 65 -68 -107 -83 77 170 -25 429 139 64 67 53 103 28 -176 -171 203 23 -31 130
3244A30l44K59j21P2J04k55K38j97J20j44K40r9j81K20k03J46J16j05M0k24K4
$$ 130 -214 45 -76 -4 100 -155 83 -114 6 -138 102 3 -178 42 -161 -15 101 -4 36 -188 -164
3265a64L45m48PL64M7mj53J05r6J97k28n0L7K73o5k19J70j85K3P6l55L69j56J56
$$ -164 181 -267 -260 104 151 147 -6 99 3 200 -28 -78 -41 232 167 -52 118 -67 -44 32 -323 46 -110 46
3289D6J70j07k06K59j69K2j42L51l05J84J15j00J31j17K6J21k33k40J49K48k33
$$ 46 216 109 -97 162 -7 15 -127 224 -81 103 218 118 249 132 158 279 46 -194 -45 203 -30
3310c0L7J51l56K31j36q1K62j5m2J09j18n7J16k06J79j63J68J5K37k22n1p3m0
$$ -30 7 158 -198 33 -103 -184 78 63 21 130 12 -45 71 -135 44 -119 49 64 301 79 28 -45 -85
3333h5r3K29L5j30K39n7k28J01L9j61L22l56K78k24M2J96j9j37j53J74J96n01
$$ -85 -178 51 86 -44 195 138 -90 11 50 -111 211 -145 133 -91 -49 147 128 -9 -162 12 208 -293
3355b93L67j37R1j41J79K62k05j33o9P1n0M8N1M8m9n9K5l1r6O2j06J9o4n6J59
$$ -293 74 -63 28 -113 66 328 123 -10 -79 -8 -58 -10 41 89 40 -19 6 -25 -121 -59 -165 -146 -210 -266 -107
3380a07RP6M6p7L5Q9j63K82k99Q0P5k45m6K34j2J43J57j1j38k60J45J91j61l1
$$ -107 -98 -22 24 -53 -18 71 -92 190 -109 -29 46 -199 -245 -11 -23 120 277 266 128 -132 13 204 43 12
3404A2L00m66J86L9Q9K58m03J00J11j89n6J33Po4j00j05J24J5j2k88J50K35l5
$$ 12 312 -154 32 71 160 418 15 115 226 37 -19 114 121 57 -43 -148 -24 -9 -21 -309 -159 76 41
3427D1J68m07K95j87J44K10j87j5J06j98j04pL52j19j35l4O5m9Q0k06L11n9n3
$$ 41 209 -198 97 -90 54 264 77 62 168 -30 -134 -141 211 92 -43 -77 -12 -61 19 -187 124 65 12
3450A2j00%J33J6k50K48P7j4K9j83k26L17kkn3q0J09j01L94j59j14J49j61J26
$$ 12 -88 -88 45 61 -189 59 136 122 151 -32 -258 59 57 55 2 -78 31 -70 324 165 51 200 39 165
3474A65j38QJ06k49J04l3J4r2K36k71K84r0j28k5N9K36k80q6K91L3k69k0P6J77
$$ 165 27 35 141 -108 -4 -37 -23 -115 121 -150 134 44 -84 -109 -50 186 -94 -180 111 144 -125 -145 -69 108
3498A08J15o2j82J24j44Q7k41L50l23Q1Q0n6K4J75%j91R1K1k32L50J59q1j13m44
$$ 108 223 161 -21 103 -41 46 -195 155 -168 -87 -7 -63 -39 136 136 -55 36 57 -175 175 334 253 140 -304
3522c04K56K83lj95j23J52j11p0L58k45r9K79j53j38J70J7o7j2L84l91j61Kp9
$$ -304 -48 235 232 37 -86 66 -45 -115 243 -2 -101 178 25 -113 57 74 7 -5 379 -12 -173 -171 -250
3545b50J07J55L1k68K01K45m81K86M6j09j23J6M24m91K44j67J68Q7po1k96J33
$$ -250 -143 12 43 -225 -24 221 -260 26 72 -37 -160 -144 280 -211 33 -134 34 121 114 53 -243 -110
3567a10j07L41k22K39k74L49l02L6K19p5k16J44k7j26j8J57K09j60k15L5J13R6
$$ -110 -217 124 -98 141 -133 216 -86 -50 169 94 -122 22 -5 -131 -149 8 217 57 -158 -123 -10 86
3589H6j83j7k9K44k76K71r0l3MR2O4RR6j98J79j33j10N8pk49K54P6l12Q4l2J86
$$ 86 -97 -114 -143 101 -175 96 6 -27 -23 69 133 142 238 40 219 86 -24 34 27 -222 32 108 -204 -120 -152 34
3615C4n2r1K01j45J0J00q0J1k06J35j20L63J34l42K15k84NK50M1p0p6p9nj12K3
$$ 34 -18 -109 92 -53 -43 57 -23 -12 -218 -83 -203 160 294 -48 167 -117 -112 138 179 109 33 -46 -51 -163 -140
3640a40L09k8J66j84k91j0K01J07k8j42l0k9r2K54P8j65j14J57O5m1l5k67M65
$$ -140 169 141 307 123 -168 -178 23 130 102 -40 -70 -99 -191 63 141 -24 -138 19 84 43 8 -259 206
3663B06j72K32l22L27l60K51k54j60M89r1j66Q1r3K07j69k15L81l82J96Q0l8q3
$$ 206 34 266 -56 271 -89 162 -92 -252 237 146 -20 61 -32 175 6 -209 172 -210 -14 66 28 -55
3685e5J70q6J9l46N97n59N22l39L98m06K53p5j57J45j26P5j26L2J89J1j02P7o6
$$ -55 115 29 48 -298 299 -260 262 -77 321 -85 168 93 -64 81 -45 30 -96 -64 125 136 34 111 45
3708D5J65q5j14J48j36o6K44k78K76r7l49J16P3k7L1J83J72k66L1j86L4%N4p6
$$ 45 210 125 11 159 23 -43 201 -77 199 102 -247 -131 -58 -85 -54 129 301 35 66 -120 -86 -86 -32 -108
3732a08K04j84J57p2J27%k14Q0k36L03q0J11k73L34M9j08j52j8J82j13J37j68
$$ -108 96 -88 69 -3 124 124 -90 -10 -246 57 -23 88 -185 149 198 90 -62 -80 102 -11 126 -42
3754d2J69k05J95r5P6k30J01m3K24l81J29K47j31J12n2p1m3J21o0N8J14j28j23
$$ -42 127 -78 117 22 98 -132 -31 -74 150 -231 -102 145 14 126 74 3 -40 81 21 79 193 65 -58
3777e8k01J83J38j66k8O2j42N3L79k69L17j98K56k23k40L26n0j1M0n9k57K04J0
$$ -58 -259 -76 62 -104 -132 -70 -212 -159 220 -49 268 70 326 103 -137 189 139 128 168 109 -148 56 66
3800F6j53j25P9K96j85Q2j98J49p5Qk37J32J47J68l44O9K40M0k33k8k4R5k0M3
$$ 66 -87 -212 -133 163 -22 60 -138 11 -64 -56 -293 -161 -14 154 -190 -121 119 159 -74 -102 -126 -31 -51 -8
3824hJ94j62k0j30O4J48n1O4j5k56K26J4L5j58r3K51l00L07k99J75J71n3o9j48
$$ -8 186 24 4 -126 -62 86 35 99 84 -172 54 68 103 -55 -148 103 -197 110 -189 -14 157 104 35 -113
3848a13J52j91J51j04J96P0j54j73J79K2j07P5J27k29K93K6k56J2R0j27K43k00
$$ -113 39 -152 -1 -105 91 161 7 -166 13 35 -72 3 130 -99 194 220 -36 -24 66 -61 182 -18
3870a8q9n3J37K2J66k42q2l1J21J01k0N8J84k33m6j70L64k59J62Mn9Q3j02L65
$$ -18 -107 -160 -23 -1 165 -77 -159 -190 -69 32 12 70 254 21 -25 -195 169 -90 72 76 17 100 -2 363
3894C63l13k72L24j11q2J35l6PL2J9rJ50m79R8J56J17k27J33M1k58K04m7P9l5
$$ 363 50 -222 102 -9 -91 44 8 15 47 66 57 207 -272 -174 -18 99 -128 5 46 -212 -8 -55 24 -11
3918a1k3J77o3o7O2P7R5k74P1j69Q4J21k17L7P2J76q4M1n1j34o3J8K80j85J66
$$ -11 -34 143 80 13 75 152 247 -27 44 -125 -41 80 -137 -100 -28 148 64 105 54 -80 -143 -125 155 -30 136
3943A36j96J4OK22k24k13L29k4K37k65j50L23o8j68K6m6L3Oq0N4j4J7PJ05j66
$$ 136 -60 -46 -40 182 -42 -255 74 50 287 22 -128 195 127 -41 -15 -61 -28 -22 -102 -48 -62 -45 -38 67 -99
3968i9R0Q8j2l4q8L25k53J97m26KM26n0l88L43k32O0J47l1m69L52L34k78J05Q4
$$ -99 -9 79 67 33 -55 270 17 214 -212 -210 216 166 -222 121 -111 -51 96 65 -404 -52 282 4 109 193
3992A93j28m2m7O0j09K38j99qM3j7r7J35L3j84L3%J85j05J12j04K15j51j76L35
$$ 193 65 23 -24 36 -73 165 -34 -42 1 -16 -113 22 55 -129 -96 -96 89 -16 96 -8 207 56 -120 215
4016B15j3r7J33o2J59l80N4O7N0j28L06n48M84j55q3K24j39j48m9j84K08K31j62
$$ 215 202 105 238 176 335 -45 9 76 126 -2 304 -244 240 85 2 226 87 -61 -110 -294 -86 145 -17
4039a7j29P0j21R7K88k38J30k12Q2N7oK08k80K26O5m16K15L2J18k0J0J3l25J72
$$ -17 -146 -76 -197 -100 188 -50 80 -132 -50 7 1 209 -71 155 220 -196 19 51 169 149 159 172 -153 19
4063A9p5K85j58N8k48R6J28l7n3Q9j67n4L93m71J26P7O7r8J02j40n6J81l7r1j76
$$ 19 -56 229 71 129 -119 -23 105 68 15 104 -63 -117 276 -195 -69 8 75 -23 79 -61 -117 64 27 -64 -240
4088b40K26k2K24j29J5j38N2Q0k02o8J80Q6rl01J56L4j08k6K03P1l31K21po4o
$$ -240 -14 -36 188 59 74 -64 -12 68 -134 -202 -22 64 55 -246 -90 -56 -164 -190 13 84 -247 -26 -33 -97 -103
4113a03L5J18Q2j43j22K3J21J07O9k40K88l22K68n0k29J89l33L66j92Ol5Q6m5
$$ -103 -68 50 132 -11 -133 -110 11 118 187 -53 235 -87 181 131 -98 91 -242 124 -68 -62 -97 -11 -56
4136e6k8l1K74N3j93o9p6L35r6j66Lk8l0J13M7J00o7M2k13n8J10R4j62L9K23j00
$$ -56 -84 -115 159 212 19 -50 -126 209 113 -53 -50 -78 -108 5 52 152 85 127 -86 -144 -34 60 -102 -63 160 60
4162F0j47K77j08k72K64j21j88K59L2j89Q5j4mJ90j26n3K31j15R3L0J23m8r4k12
$$ 60 -87 190 82 -190 74 -47 -235 24 56 -133 -48 -62 -66 124 -2 -55 176 61 154 184 307 259 165 -47
4186d7oKJ50M12l98l3j20Q3k72J11O5J06L0l71K56Q1J58l98J44O3J30l22J8J72
$$ -47 -53 -51 99 511 113 80 -40 43 -229 -118 -53 53 83 -288 -32 49 207 -191 -47 16 146 -176 -158 14
4210A4r8K60j39Mj4J66L4m13K15M4k70N7L35k37j56K27k05L62j60M7J6m2j5L09
$$ 14 -84 176 37 41 27 193 227 -186 29 73 -197 -140 195 -42 -198 29 -176 186 26 73 89 47 32 341
4234C41j04q7l33J06K88k49J10j8J76l9j57O8o7j32J22J63o8M8n4j30q0N3r1Q
$$ 341 237 150 -183 -77 211 -38 72 54 230 191 34 102 35 -97 25 188 120 168 114 -16 -96 -43 -134 -126
4258a26J80M7M6m8r7J87k58L2l7mM6Q9j2k85K35L2J21k70j21L44k47O7J3J45j8
$$ -126 54 101 147 99 2 189 -69 -37 -74 -78 -32 57 45 -240 -5 27 148 -122 -243 101 -146 -79 -66 79 61
4283F1k66J22L3n2mq5L77j54jJ39K04l84L11n32K64j15j17J73k84K98Kk00K23
$$ 61 -205 -83 -50 -102 -106 -191 186 32 31 170 374 -10 301 -231 33 -82 -199 -26 -310 -12 -10 -210 13
4306A3M9j67J28M1J8o8k3r0R3J59m7j18J35M0p0J12K6k38j48M03m3m36O7J19q7
$$ 13 62 -105 23 64 82 14 -9 -99 -6 153 106 -12 123 163 93 205 231 -7 -155 248 205 -231 -164 -45 -132
4331a32L01l9j5k00K30l31J28j4j00q7L26rm0nR6j61J06J5O1j40j91M17R1r9j96
$$ -132 169 130 115 -85 145 -186 -58 -72 -172 -259 67 58 18 13 109 -52 54 69 130 -10 -201 216 307 208 12
4356A2K27l91M08j54k68q0J81l7J33k18Q2J50j05K03r2L3J02j51K9l36K70M9J12
$$ 12 239 -152 256 102 -166 -246 -65 -102 31 -187 -105 45 -60 143 51 84 186 35 64 -272 -2 47 159
4379A59L0J39j9k09q3o3o1K98o7J1%m05M41k54oK67k67K15j51j00J83n6m5j0J27
$$ 159 189 328 309 100 17 -46 -107 191 124 135 135 -270 171 -83 -89 178 -89 126 -25 -125 58 2 -43 -53 74
4404G4P0q6oQ9k57O0K28j40J28m59L68k05J42Q7L4l42L36J25k00j99L38j55j14
$$ 74 144 58 52 141 -116 -56 172 32 160 -299 69 -136 6 93 127 -215 121 246 46 -153 185 30 -84
4427h4J12l59L77k77J43L83m64K33m5j28k1K57nn0L5m93J75J83P0j03j42L39o4
$$ -84 28 -331 46 -231 -88 295 -169 64 19 -109 -130 127 122 72 107 -386 -211 -28 42 -61 -203 136 72
4450G2k52K40j06L1n6%l1K4K18j59k65K45k92O14l83J00J98l10N7r6L47k33R5
$$ 72 -180 60 -46 -15 -71 -71 -102 -78 140 -19 -284 -39 -331 283 -100 0 198 -112 -55 -151 196 -37 58
4473E8k48L7K09R9k28J41j26k9K51k45p8j9L46k47J47j78O4m9k27L10J82k4k02
$$ 58 -190 -153 56 155 -73 68 -58 -87 164 -81 -159 -178 168 -79 68 -110 -46 -95 -322 -12 170 146 -56
4496e6M3J86j92O4J10j83J49J41j25L05l18k42J53j6J67j99J42k49J61J07N8k66
$$ -56 -13 173 -19 45 155 -28 121 262 137 442 124 -118 35 19 186 -13 129 -120 41 148 206 -60
4518f0L7J6j57K87k9j71l7N8k3q7K39Q4l27M18k72Q8J21m78K45J24N8j23P6j38
$$ -60 -23 -7 -164 123 94 -77 -114 -56 -79 -166 73 157 -170 248 -24 64 185 -293 -48 76 134 11 87 -51
4542e1K89L0k21k12K56j38L27k64k08M50l00L21j37o4q5J51j73k5P2l63L76J9
$$ -51 238 268 47 -165 91 -47 280 16 -192 258 -42 279 142 78 -7 144 -29 -54 18 -345 31 50
4564E0j92J65j1k95K42j15K06Q5l57n7K40J07O1J68l50L9J10j00K9k56O9J1l1
$$ 50 -142 23 12 -283 -41 -156 50 135 -222 -279 -39 68 129 297 -53 -14 96 -4 25 -231 -162 -151 -182
4587a82K59J61m04J27K66j46J02l67K50j54k6l1J94Lo4o2N0j26L58q4k7k28L37
$$ -182 77 238 -166 -39 227 81 183 -184 66 -88 -114 -145 49 52 -12 -74 -24 -150 208 124 97 -131 206
4610B06k83J29J3m6K24m41K72k4K31n01J86J30l16K00NJ59k72J00j76K69j6l3
$$ 206 -77 52 65 19 243 -198 74 50 281 -220 -34 96 -220 -20 -15 144 -128 -28 -204 65 49 16
4632A6m3J14j37k3L05k40j3JJ21j98K42j60m1J6J06O3l55K82K4K8j47Rk32J39
$$ 16 -27 87 -50 -73 232 -8 -21 -20 101 -97 145 -15 -56 -40 66 129 -226 56 80 108 -39 -30 -262 -123
4656a23O7N1J1K8J0k37K01k3K1pj65K17j65L6R6n6J20Q2J5Lm67M24r8j76j33K14
$$ -123 -56 -5 6 34 44 -193 8 -15 6 -1 -166 51 -114 -78 18 -38 82 164 179 182 -285 139 41 -135 -268 -54
4682e4n9M9R2r3K34m2m39L81J8q5L7n7L4K12k41L6L04m77J68j65N7P8J41k09J64
$$ -54 -113 -64 28 -65 169 127 -312 69 87 2 39 -18 16 228 -13 23 327 -150 18 -147 -90 -12 129 -80 84
4707H4o0m2J20l2j6Q7m5J3k98J98j45L27j98m0J76p0L1m73N12J32k80j2J86l52
$$ 84 24 -18 102 70 54 141 96 109 -189 9 -136 191 -7 -47 129 59 90 -383 129 261 -19 -31 155 -197
4731a97M6N8jK49P6N7j92O0N2n54M08l6R6L7k14M0M4J64n9j84r7N4r5K83j44J92
$$ -197 -151 -93 -94 155 231 288 96 156 208 -346 62 26 122 159 -55 -15 29 193 134 -50 -147 -93 -188 95 -49 143
4757A43l50J47q1q9J23Q9n9K5K08k34P3j48J9L3R3K71j66N6m47L78j48q5m0L93
$$ 143 -207 -60 -141 -230 -107 -18 -77 -52 156 -78 -5 -153 -134 -101 -8 263 97 153 -294 84 -64 -149 -189 204
4781B04l09J04j59K9L01l15J19k18N12k97%K24l83J80N3j05K29J53o06P9R0J62
$$ 204 -105 -1 -160 -131 170 -145 -26 -244 268 -29 -29 195 -188 -8 45 -60 169 322 -284 -205 -115 47
4803D7Qj2Lm7kJ36j34j26J01J26j34qJ83l61L23J2p9k08J97J50l77K38j64P6R0
$$ 47 55 43 46 -1 -3 133 -1 -127 -26 100 -34 -42 141 -220 103 115 36 -172 25 175 -202 36 -128 -52 38
4828C8k56J95P8j46l6O6J40j13M2J04k12J29O6K2q6j52P2j0J70m90L50L7J09j40
$$ 38 -218 -23 55 -91 -127 -61 79 -34 8 112 -100 29 95 117 31 -121 -49 -59 111 -379 -29 8 117 -23
4852b3r8K38k15K32j25m3QR8k38P8KJ16m5mK50N0o7q4j96K08j97J13j8k34J93
$$ -23 -121 117 -98 134 9 -34 -26 72 -166 -88 -86 30 -15 -19 231 281 214 130 -66 142 -55 58 40 -194 -1
4877ak53M63l20J70J1K0j16N3O6j95J13L5j62L59j98j51M9j80K16l59M57J38j78
$$ -1 -254 209 -111 59 70 90 -26 27 93 -102 11 46 -116 243 45 -106 -57 -237 -21 -380 77 215 37
4900C7K1l37K50K04j11k46k8lo9K54j69J51K88m29L05P4j57KK46j65R4n57M14
$$ 37 58 -279 -29 175 64 -182 -210 -213 -282 -28 -197 -46 242 -187 118 192 35 37 283 118 212 -345 69
4923F9J02k62J9p3K53l67R0l8M6L48j16j80O4K14m21K00N5j97K66n22L77P6p7
$$ 69 171 -91 -72 -145 108 -259 -169 -207 -161 187 71 -109 -45 169 -252 -52 3 -194 72 -450 -73 3 -74
4946g4lK68k29J17J76j30r5k14J16K2L8k53M15j94L46j74K1k16L39l88P0J23j46
$$ -74 -77 191 -38 79 255 125 30 -184 -68 -46 -8 -261 154 -40 306 132 153 -63 276 -112 -42 81 -65
4969f5N7J96j73J39k74M3J08n8K5R1j13k3r9K13j07k06K84m3K8J6j05J56k26J53
$$ -65 -8 188 15 154 -120 -77 31 -27 -2 89 -24 -47 -146 67 -40 -246 38 -5 23 39 -66 90 -136 17
4993A7J66l27J50L41j35j43k40K24nj07Q2jJ02j25L58p31K69K6L2N6j92K15J34
$$ 17 183 -144 6 347 212 69 -171 53 48 -59 23 22 124 -1 357 -374 -105 -79 -47 9 -183 32 166
5016A66k76o0N8J6K00p3k68P4M62l86j57J78P5o7K5J18l41R4L55l13L52k37k03
$$ 166 -110 -170 -112 -96 104 31 -237 -163 299 -87 -244 -66 9 -58 -33 85 -256 -162 193 -120 232 -5 -208
5039b08J96J51k51J25P4k13N4J7J13k97J79L36n28L61j56M1r3k3K56l13J38P6
$$ -208 -12 139 -112 13 87 -126 -72 -55 58 -239 -60 276 -252 109 -47 -6 -99 -122 134 -179 -41 35
5061C5J30j43k23J45K61l24j41J24j87L61j18r4m6l3L00j67O4l4K3J01L5j1r8
$$ 35 165 22 -201 -56 205 -119 -260 -136 -323 38 -80 -174 -220 -253 47 -120 -56 -90 -67 34 69 58 -40
5084d0P3j83R5N8Ol39L30L41n5m20K76k73P9K16J9j59m0J01l5J56j43R6j03M5
$$ -40 33 -150 -55 3 9 -330 0 341 286 -134 142 -131 -52 164 183 24 -16 85 50 206 63 159 56 101
5108A01j16j47K61N7l88K59k66J80K21m69J54J11J22L8j32m0Q4j1L0J52l45k05
$$ 101 -15 -162 99 156 -232 27 -239 -59 162 -307 -153 -42 80 118 -14 -54 30 19 49 201 -144 -349
5130c49J45M79l44p1j41M03j41K00j70j17J09m4M1J00M9p3R2k00n1J51j84J31
$$ -349 -204 275 -69 -140 -281 122 -19 181 11 -106 3 -41 0 100 149 76 168 -32 -83 68 -116 15
5152A5n8N4k7k34K6L83r7j82L68k17K3o0k87oJ59J73k3j60J34k3J07j59O1j42
$$ 15 -43 11 -16 -250 -224 159 62 -120 248 31 54 -6 -293 -299 -140 33 10 -150 -16 -39 68 -91 -30 -172
5176a72L01j7J24j53k2p1j10K41k99K18K3Lj53K7lk6K31k49O3j9J25j22J00J09
$$ -172 129 112 236 83 61 -10 -120 121 -178 40 63 66 -87 -60 -63 -89 142 -107 -44 -63 62 -60 40 149
5200A49k30J18j36J33j42J12%n3O8K10j92Q4k44J65J47j87OK8K18o40O09k52r9
$$ 149 -81 37 -99 34 -108 4 4 -49 19 229 37 121 -123 42 189 2 8 36 254 -386 223 -29 -128
5223a28k1K01R3k91K55M1j08J08k49J22m0j02N3k04L65o5n3K23j03j8j21k4j3
$$ -128 -149 52 145 -146 109 150 42 150 -99 23 -17 -119 -66 -270 95 30 -23 200 97 79 -42 -66 -79
5246g9K12J58l28K53l8j06j56r5J29K79k31p0P2j95J76J43k52R8L01k84L7k64
$$ -79 133 291 -37 216 178 72 -84 -179 -50 229 -2 -72 0 -195 -19 124 -128 -30 271 -13 24 -240
5268b40L44J42k8k65M9J05J0j28m1j25K43j70N9k1L13m27m3K52k78P5J31m3k55
$$ -240 104 246 218 -47 2 107 117 -11 -52 -177 66 -104 -45 -66 247 -180 -223 29 -249 -174 -43 -86 -341
5291c41L50j18K4j6Q5N5o4m9J80m4j34q6K2K78k47M4K69k07r2k3J19k09K44J45
$$ -341 9 -109 -85 -101 -16 39 -25 -74 106 62 -72 -158 -136 142 -105 -61 208 1 -91 -114 5 -204 40 185
5315A85j83j81M1J23j92q7M30q9m7j49lJ86l1K05l52Q4j6J74j19P9O7j54L2j92
$$ 185 2 -179 -138 -15 -207 -294 136 47 0 -149 -152 34 3 208 -144 -60 -76 98 -21 58 125 -29 3 -189
5339a89K63J35l45o1R6L9J04k02P4K31j22k89P6J99q6j01O9J53m1m3p0P1l75M80
$$ -189 74 209 -136 -197 -101 -62 42 -160 -86 145 23 -266 -190 9 -77 -178 -109 44 3 -40 -110 -39 -414 66
5363F6O2j80K30j75J61j85K2J23k19N6J86j62J59J9k13j51K18k67N2K07K36m50
$$ 66 128 -52 178 3 164 -21 1 124 -95 -39 147 -15 144 163 -50 -201 17 -250 -198 9 245 -205
5385b05K9J49r9J69j22N7k47J07L06Nj97l7j9P7R4j71J99j52n5L35k04q3J81k04
$$ -205 -176 -27 -126 43 -79 -22 -269 -162 144 149 -48 -85 -104 -27 67 -104 95 -57 -112 223 19 -64 117 -87
5409h7k84M07J0J3j30J69J8k68K26P1l99J76k73O25m54J17j39J79L7o9l8O1j4
$$ -87 -371 36 46 59 -71 98 116 -152 74 145 -254 -78 -351 274 -180 -63 -202 -23 14 -55 -93 -32 -46
5432d6o2j18J92J42j03k73L57l9j34k9K33L6k12k24J95M5P1k8L5j8k38M1K90K37
$$ -46 -108 -226 -34 108 5 -268 89 50 -84 -113 120 156 -56 -280 -85 -40 31 3 38 20 -218 -177 113 350
5456C50l68K81l55R1L8m5j33K44j43M9N9j59K68j02j66J8L53k09k43L12r5j68
$$ 350 -18 263 -92 -1 37 -8 -141 103 -40 9 68 -91 177 75 -91 -73 280 71 -172 140 45 -123
5478a23L43k8j70j65J24o9J59N5j2n7q1J03r9O2QM8j88K10k41N6j35J37O2k2L50
$$ -123 220 192 22 -143 -19 -88 71 126 114 57 -24 79 -20 42 50 98 -90 120 -121 -65 -200 -63 -1 -23 327
5503C27k94k3K00k95r1L66l6j89j50PN6O2K22j08j48K5R5j70K94k23J75j2j88
$$ 327 33 10 210 -85 -176 190 154 -35 -185 -178 -122 -60 162 54 -94 -69 26 -144 150 -73 102 90 -98
5526i8M9J01j17M1Q1k34J26j86M10r1J1k57L10j52kj0j06K19j78k66K79o1J00
$$ -98 -49 52 -65 -24 57 -177 -51 -237 173 82 93 -164 146 -6 -8 -18 -124 95 -83 -349 -70 -131 -31
5549c1P4n9J79k34K61q1J25r8q9M2j5J8k33J04P3J38j30k16J11q8OQ7m8K00j22
$$ -31 43 -16 163 -71 190 109 234 136 47 89 74 92 -141 -37 36 174 44 -172 -61 -149 -143 -56 -104 96 -26
5574b6K5k78L10L5j98J12K02Mk04R3O6k20J83m8L4j42pM9K96j36j60K0mj6N1J5
$$ -26 -1 -279 31 66 -132 -20 182 186 -18 75 141 -79 104 56 90 -52 -59 -10 286 150 -10 10 6 -10 41 56
5600E6k19O7j05K60j96P8J95j85K5J9K35l45j41L93n9J19q2m2K38k71R0l38J97
$$ 56 -163 -96 -201 59 -137 -59 136 -49 -24 -5 230 -115 -256 137 78 197 115 73 311 40 130 -208 -11
5623a1K27k17N2q9l6J79k71J82km9J03j7r0j39N2m4j23J36K2J47J07l29K02j04
$$ -11 216 -1 51 -38 -74 105 -166 16 14 -35 68 51 -39 -178 -126 -170 -293 -157 -135 12 119 -210 -8 -112
5647a12j24M74j21k2k00k9J4%J37J12k69L43k40J81l67R8J74j72m6J33N0j47K03
$$ -112 -236 238 117 95 -105 -134 -120 -120 17 129 -140 203 -37 144 -223 -125 49 -123 -169 -36 14 -133 70
5670G0r7Q5j37L10L8m24P7L24j15MJ08l18o2L79l36Q0m9r8J70j1J36r7m6k3K06
$$ 70 -27 58 -79 231 269 -155 -78 246 131 135 243 -75 -137 242 -94 -14 -63 -161 9 -2 134 37 -9 -32 174
5695A74J82m61J43j64j07L09r9J24M9k5K00l63J86l71K24J77j00j17K16j0k91
$$ 174 356 -105 38 -126 -233 76 -23 101 150 125 325 -38 148 -223 1 178 78 -39 177 167 -124
5716a24K44l27K64q7MK48k57J63j04j84N5k2R6l08K53O9N1M1j19K70m90L66q3
$$ -124 120 -207 57 -30 -26 222 -35 128 24 -160 -105 -127 -31 -339 -86 -17 34 75 -44 226 -264 102 19
5739A9j25n8K81j02J26j24m3r4R4k29K28j33K75j07l1J49j3j37L32l98N2J06o8
$$ 19 -106 -164 117 15 141 17 -26 -120 -26 -255 -27 -160 115 8 -23 126 113 -24 308 -90 -38 68 0
5762@n3J21j05k14qL58J19j06J10k26r4K86o9j28n6l8K16Lj92J55k46L61J16n89
$$ 0 -53 68 -37 -251 -259 99 218 112 222 -4 -98 188 119 -9 -65 -103 113 116 -76 79 -167 194 310 -279
5786b79L10j23K26J02k13j75P9J14l06K48k02L80j61j64L14Po5k08P7M6j25k45
$$ -279 31 -92 134 236 23 -152 -73 41 -265 -17 -219 161 0 -164 150 157 92 -116 -39 7 -118 -363
5808c63K03l2J17M2L2J8n8J85Nq5J26k93J73j0r3O2r2J83j68q4L36j34R7Nm6k55
$$ -363 -160 -192 -75 -33 -1 17 -41 144 149 64 190 -103 70 60 -33 29 -63 120 -48 -132 204 70 167 172 126 -129
5834a29K08l7k50J60j18J53j7J53n4r1l6J48k57K56L3j18Q3M9k6j71J4m2J43j30
$$ -129 79 42 -208 -48 -166 -13 -30 123 69 -22 -58 90 -167 89 122 4 87 136 110 -61 -47 -89 54 -76
5858g6Q9R9l16J80J34k48k1Q1j30Q3K54m27K1J84M5K15j74K51j76M5l71M87k60
$$ -76 13 112 -204 -24 110 -138 -159 -78 -208 -125 129 -298 -277 -93 -48 167 -7 244 68 113 -258 229 -31
5881c1K90l88K36o7P9j09J58k33q6J88K7j38L8K61o38N68k61KP1j15N2P2m5J2
$$ -31 259 -129 107 40 119 10 168 -65 -151 37 64 -74 -36 225 -413 155 -106 -104 -33 -148 -96 -24 -69 -57
5905e7L8J61n4k1J88n32L33o9J30j45M8j00K42l19K87l27J03J01j20O3M8p6J18
$$ -57 -19 142 88 67 255 -277 56 -13 117 -28 20 -80 162 -157 130 -197 -94 7 -113 -50 -2 -78 40
5928D0p0Q7K19j58j16l49N73nl80K58p5P4Q6l25L38j49O2j43J59j98O8L4j45J62
$$ 40 -30 57 276 118 2 -347 226 221 -159 99 24 98 184 -141 197 48 110 -33 126 -72 -4 30 -115 47
5952D7j93J34j6J53j06p5M9M7Q0O3l98M23j97P2p0j26M5k56L16j57L52k73J08
$$ 47 -146 -12 -28 125 19 -56 -7 40 120 183 -215 208 11 83 13 -113 -68 -324 -8 -165 187 -86 22
5975B2j03M6k93K84P1l3lJ57k0j24m16M41K6j30L7J3Oj82K65O1l41J45K67j66
$$ 22 -81 -35 -328 -44 27 -6 -9 148 128 4 -412 29 55 -75 -38 -25 -19 -201 64 125 -216 -71 196 30
5999C0n5L89m50MJ2J43j47J22j96J84q1l7R4O0m3n4K61k88J50L3k54J18j15K00
$$ 30 -25 364 -86 -82 -70 73 -74 48 -148 36 -45 -82 12 72 29 -25 236 -52 98 131 -123 -5 -120 80
6023H0j76K10O4k07j40J31k38J72K47r9n3l0Q5P1j52j61N15k26j74j9J38j02L0
$$ 80 -96 114 178 -29 -169 -38 -276 -104 143 44 -9 -39 46 117 -35 -196 319 93 -81 -100 38 -64 -34
6046c4J06k58J78j88J70j37R4J61k53L03n6n1R8j45M9R3j14Q1K1j19M1K31k56
$$ -34 72 -186 -8 -196 -26 -163 -69 92 -161 142 86 35 133 -12 37 130 16 97 118 -1 40 271 15
6069A5j53P7P9j25l9P4K04J26l74l3K04o8K12k64Q5n2R5J27k84J61j01j85J07
$$ 15 -138 -61 18 -107 -146 -72 132 258 -116 -149 55 -13 199 -65 20 -32 63 190 -94 67 -34 -219 -112
6092a12Q3K4J38l03J65J39j04K34m94K19N7k02M84n2m42J45OL15l35J20k8O2j99
$$ -112 -29 -5 133 -170 -5 134 30 264 -230 -11 46 -156 328 276 -166 -21 -15 300 -35 85 57 119 -80
6115h0L01r5j69K2r4K8k25N21j38k43J56j41j13M32k90J57m0N3l26K91n1L3K24
$$ -80 221 126 -43 -21 -115 -87 -312 209 71 -172 -16 -157 -270 162 -128 29 -11 42 -284 7 -44 -11 213
6138B13j41j94lN1O4r3K41k40M70k18k96J72m8J24k35j21J25J10l48K08K1L9K68
$$ 213 72 -122 -125 -74 -10 -103 138 -102 368 150 -146 26 -22 102 -133 -254 -129 -19 -367 -159 -138 -99 169
6161A69k60p8J16j32k40M90L8k11Q6Jr4P5Q8O1r3R2j83K4J78J11k74j55L47L5
$$ 169 -91 -169 -53 -185 -425 65 103 -108 -22 -21 -115 -40 48 109 16 108 -75 -51 127 238 -36 -191 156 191
6185A91l73J63Q1p4l7J17OJ87l35k8l49P69k75k86K30j30K03k84L85q0J99j94
$$ 191 -182 -19 62 -12 -49 68 74 261 -74 -102 -451 318 43 -243 -13 -143 60 -224 161 81 280 86
6207H6N9N3j42j08k52L70n3j78L90j76J34l26N15m19J38k72Q7p8j53N02q7k85
$$ 86 145 198 56 -52 -304 66 13 -165 225 49 183 -143 372 -47 91 -181 -94 -172 -325 177 90 -195
6229a95L6K96l62L02m6J09j52L1J69k9j23q7K31p1j78J39Ko1K53k33M25m99Q7
$$ -195 -159 137 -225 77 31 140 -12 19 188 159 36 -51 180 109 -69 70 72 11 264 31 456 -43 44
6252D4J1J38l40J20N4m3J93k54k10K97k76J90j41L18k92L92Q3k86j63N6J52J03
$$ 44 55 193 -147 -27 27 -16 177 -77 -287 10 -266 -76 -217 101 -191 201 284 -2 -165 -109 43 146
6274A46k30P1K00k06J75k70J56j75K25O1jr6O9J5k16j6l6K45j66O7q3J36n0j81
$$ 146 -84 -13 187 -19 156 -114 42 -133 92 153 152 56 125 140 -76 -92 -128 117 -49 18 -65 71 21 -160
6298a60M21j59o2M1j21J3Q7n50L37L40j15O6l23L11l2r8J06K6j29k8R4R7n15J23
$$ -160 261 102 40 81 -40 -27 60 -490 -153 187 72 138 -185 126 94 -4 102 128 -1 -29 65 162 -353 -230
6322b30R9L2K96j40L8l81K32M4L28p3n5l1k67K39j97K42k06o2J76j65j34M25J5
$$ -230 -131 -99 197 57 95 -286 -54 -10 318 245 190 159 -108 131 -66 176 -30 -92 84 -81 -215 210 225
6345B25l30o9J36N6O6k21J14L06m28M4k21M76j64K76P8n48K33p0J46J2r5J42m99
$$ 225 -105 -174 -38 18 84 -137 -23 283 -145 -101 -322 154 -10 266 344 -204 29 -41 105 117 22 164 -335
6368c35N36k14j42P7J03j83J56K33j05J4j95j6J09mj43J34L5p8k07O12m26k0Q4
$$ -335 201 -13 -155 -78 25 -158 -2 231 126 140 -55 -71 38 34 -109 25 60 -18 -225 387 -39 -59 25
6391B5J63k44J80k81M49k24j96J73J04j12k08O8j2j50K13K8J94n4j24J16j20j5
$$ 25 188 -56 124 -157 292 68 -128 45 149 37 -171 -103 -115 -265 -52 -24 170 116 -8 108 -12 -27
6413b7J55k2l29J65O5p7j56M94j03k78L5Q4r3J6Rj3L7n0Q0K76k7m52p2L41Nj51
$$ -27 128 106 -223 -58 7 -70 -226 268 165 -113 -78 6 -87 -71 -62 -75 -38 -88 -8 268 241 -211 -283 58 63 -88
6439h8n8J26K40j24j66j06j01L99m80N54l56K18r4%K1P1J8m2k7pJ89j51M0O1l79
$$ -88 -146 -20 220 96 -70 -176 -277 122 -358 196 -160 58 -36 -36 -15 56 74 32 5 -2 187 36 76 137 -242
6464b42J84R0j06j76L4L48j8j15m7K8j17l2j02K78k71J25J66n2k5p7P7mj08K49
$$ -242 -58 32 -74 -250 -216 132 114 -1 -48 -20 -137 -169 -271 7 -264 -139 27 -25 -50 -127 -50 -54 -162 87
6488H7j3r3J39k43L30k48j17J17j7J56n0J86l13o9J71j59J79qj99L28k88L2J69
$$ 87 74 -19 120 -123 207 -41 -158 -41 -58 98 48 234 -79 -148 23 -136 43 35 -164 164 -124 -92 77
6511G7K07m55K27j23J46k56K31k18J88p6K68r1k73K35j19N9k29L31k44J60m3j08
$$ 77 284 -171 56 -67 79 -177 54 -164 24 -52 216 125 -148 87 -32 27 -202 129 -115 45 2 -106
6533a06J83J27k53J58k00K73j33O8k48J31Np6J33l36K87j78K09q2p0PK17k19K33
$$ -106 77 204 -49 109 -91 182 49 117 -131 0 5 -71 62 -274 13 -165 44 -38 -108 -101 116 -103 130
6556A30l02J02L4jM8Q6j93J98l07P9k7P4J43M0L4j78j3L69j49k19J32j26o9K18
$$ 130 -172 -70 -36 -37 11 97 -96 102 -205 -126 -153 -79 64 104 138 -40 -53 316 167 -52 80 -46 -115 103
6580A03m32J67K57m22K81j96J54J14j6q1RJ0j1P7OK7J71k41l83M11K05j94q5J28
$$ 103 -329 -162 95 -327 -46 -242 -88 26 10 -71 -62 -52 -63 14 20 47 218 -23 -406 5 210 16 -69 59
6604E9k93L05J2Q1k89K02j45N4J13K2l59K76j43K16q9j19J12j92K80j23J08j43
$$ 59 -234 71 83 164 -125 77 -68 -14 99 121 -238 38 -105 111 22 -97 15 -177 103 -20 88 -55
6626e5K93k86o2j10K78k06J61K39m41K31M3N2K7j22j92m5N4J84k23Q2n8J21j52
$$ -55 238 -48 -110 -220 58 -148 13 252 -189 42 85 137 164 42 -150 -195 -141 43 -180 -98 -156 -35 -187
6649a87L45l62J39L67l64M2l6P3N9o3N2j06Q6J69o5j37J25j14R7j8j30j42J21
$$ -187 158 -204 -65 302 -62 -20 -56 17 76 13 65 -41 45 214 149 12 137 23 120 102 -28 -170 -49
6672d9Q0J20jj44J48j64J78k27J30l2J60l19K83j06K03j07l2J4J12l53J34q3k48
$$ -49 31 151 150 6 154 -10 168 -59 71 39 199 -120 163 57 260 153 121 135 247 -106 28 -55 -303
6695c03K27kJ1J69l01K78N4k87M3K23j16j37M03n86L87J58m08Q4j44N22j73p7
$$ -303 -76 -78 -67 102 -199 79 133 -154 -111 112 -4 -141 262 -324 63 221 -187 -103 -247 275 102 25
6717B5r0J57J34o5m07PL47j43J13j14p9K30j26l6L70j76K70m61j56L44j64Q0L8
$$ 25 -65 92 226 161 -246 -239 108 -35 78 -36 -115 115 -11 -47 323 147 417 -44 -200 144 -20 60 98
6740I8j44J05J83k87O2k8j13J55r6R6r4L6j54K86l1q6J37j69q2L06j74l0p4L65
$$ 98 -46 59 242 -45 17 -11 -124 31 -65 31 -63 -27 -181 105 74 -12 125 -44 -126 180 6 -24 -98 267
6764B67q6k98K34k27L88l66J53k31j06N05m29J94J26J59l50K0j39q2L18j37N5
$$ 267 181 -117 117 -110 278 -88 65 -166 -272 233 -196 -2 124 283 -67 -47 -186 -268 50 -87 -32
6785c2J80k53K50k60K21m62L76O3L2o1Q7j37K9K14l64L00R2p6O2k77P8J24j41
$$ -32 148 -105 145 -115 106 -356 20 83 115 54 141 4 33 247 -117 183 275 199 261 -16 62 186 45
6808D5O8k5l6j40K32j8j90J2r2Kk36N74k81K81l28K11q4p1j04O1l1K01J41l53
$$ 45 113 88 52 -88 144 126 -64 -52 -144 -142 -378 196 -85 196 -132 79 -5 -76 -180 -119 -150 51 192 -161
6832a61K64k3P1l07J94j86K22j68o6Q1k0J76j39K4M3O7k36J92l4n1J31Q5k5j87
$$ -161 103 80 151 -156 38 -148 74 -94 -160 -79 -99 77 -62 -38 5 72 -164 28 -6 -57 74 159 134 -53
6856e3k26L52l10K38Q8p1K5j3l0M1M3j28k55N01j9o6p7o6J75j67J05k38R8L6k3
$$ -53 -279 73 -237 1 89 18 43 30 0 41 84 -44 -299 202 183 117 40 -26 149 -18 87 -151 -53 -17 -40
6881d0o8J17j55J24PQ0N2J99j65j08Kk95M35j99J04n7KJ3P3j10n7O3k00J69j00
$$ -40 -108 9 -146 -22 -15 65 117 316 151 43 45 -250 185 -14 90 33 35 48 121 11 -46 17 -183 -14 -114
6906a14J22J88m8J4j83j94K77j46R5K79m55OK45J48k14j04Q0j71N8J66m52M13
$$ -114 8 196 148 162 -21 -215 62 -84 11 290 -165 -159 86 234 20 -84 -4 -175 -117 49 -403 10
6928A0mj19p6M7N7K55j81J09K0p7k6j20P8k4R5J38k21k9M6J20l3k62LL05N2r7
$$ 10 6 -113 -189 -142 -85 170 -11 98 118 41 15 -105 -27 -51 44 182 -39 -68 -22 98 65 -197 -194 111 163 66
6954F6l25J93L22k90K27l23K39ln7r3q7L60j40n8p5J36m0k68K08L04n54K86K7
$$ 66 -259 -66 256 -34 193 -130 109 106 49 -44 -131 229 89 31 -44 92 52 -216 -8 296 -258 28 55
6977E5j08K68k31k74K90o0m1K50n0l22L46j45N0j18J58J74k85j09R5L45l77j3
$$ 55 -53 215 -16 -290 0 -60 -101 149 99 -223 123 -22 28 -90 68 242 -43 -152 -57 288 -89 -102
6999a02P2j42K56M1l9j46j11L2J62J01pl09J39p1j65K41J50j80no1K90j45j1J29
$$ -102 -30 -172 84 125 86 -60 -171 -139 23 124 117 -192 -53 -124 -289 -48 102 -78 -83 -144 146 1 -10 119
7023A19P3j68j13J07J8o6j92J27R0K45p8k50J18J70k88n6P1k13M19j97K4rr3J59
$$ 119 192 24 -89 18 36 -30 -222 -95 -5 240 162 -88 30 200 -88 -144 -73 -286 133 -64 -40 -49 -142 17
7047A7R1N8j57k8O8K9j93J98k02J52L4k84J78L2J3R6k44K43k32j5M2l2J29j8j70
$$ 17 108 166 9 -19 49 78 -115 83 -119 33 67 -217 -39 -7 6 102 -142 101 -131 -146 -104 -136 -7 -25 -195
7072a95j26L86p8R1j73J66o6q3L5J45j48J6l2J02k46J21k7Oj12J11K14j72L21
$$ -195 -321 65 -13 78 -95 71 5 -78 -43 102 -46 -30 -62 40 -206 -85 -112 -106 -218 -107 107 -65 256
7095B56Q2m87J19J04O0j57L8J92n29M45r3j86J49J23j09k02m0K43k4J03k3j60
$$ 256 338 -149 -30 74 134 -23 15 207 -322 123 30 -156 -7 116 7 -195 -235 8 -16 87 64 -96
7117i6L21k38j91N4R9L0J43K7q1k69K68k3m7J72j57l2Kk05M8L49k27j04K45j29
$$ -96 225 -13 -204 -150 -51 -21 122 149 68 -201 67 44 -3 169 12 -20 -18 -223 -175 174 -53 -157 88 -41
7141d1p8q0N1K6J55j87JK09j32L29k99K05q7k29j63j1L80q5J8j3J67q3L6j99q5
$$ -41 -119 -199 -148 -122 33 -154 -153 56 -76 253 -46 159 72 -157 -320 -331 49 -36 -18 -31 136 53 89 -110 -195
7166a95L01K34l89n3L8J15j39j31L34l54J71m8J21k37J60L9j13P7J69M3n9q5l6
$$ -195 106 340 -49 -102 -64 51 -88 -219 115 -239 -68 -116 5 -232 -72 -33 -146 -69 100 143 84 -1 -37
7189c7K04j23K96j72m7j28K47l02K5p8J94j43N1J09j74n7J9J84J7k18K88l23J53
$$ -37 167 44 340 168 121 -7 240 -62 -37 -115 79 -64 -13 96 -78 -135 -116 68 85 -133 155 -168 -15
7212a5L22j71J2l95K66o4n8J62j19R5k34L25K8l60J52J4J2M20n95M36k56Q9j48
$$ -15 307 136 148 -247 19 -45 -103 59 -60 35 -199 126 154 -206 -54 -40 -28 392 -203 233 -23 66 -82
7235h2m9Q2j40J81k45L65kj21J23q1J74j69j18M7k5mq3L01j82M4RJ82k01J08j
$$ -82 -131 -49 -189 -8 -253 112 110 -11 112 31 205 36 -82 -35 -60 -64 -147 154 -28 16 25 207 6 114 113
7260A13k21JJ32J70m24J79l0K49j98O6Q6j93l6M5L81l72R7o7M5O7j82J92j89L68
$$ 113 -108 -107 25 195 -229 -50 -80 169 -29 37 123 -70 -106 -61 320 -52 45 -22 23 90 -92 100 -89 279
7284B79p9j84m3J2M1Q8l9l0O5j6j15P2j04q9L02k66J57J42k68l8J47k35J57k78
$$ 279 200 16 -27 -15 26 114 75 45 110 94 -21 51 -53 -142 160 -106 51 193 -75 -113 34 -201 -44 -322
7308c22L75k62N3K53k1K48j80k76P6r4J44p1K5J19j25K64l2j58m2J47j74r7K63
$$ -322 53 -209 -156 97 76 324 144 -132 -56 -150 -6 -77 -52 67 -58 206 174 16 -26 121 -53 -150 113
7331A13k44J80j73J15j08J42r4Q3O1k12O6p3Q5k9L3Q5k1K00n3J17l71k4P5j90
$$ 113 -131 49 -124 -9 -117 25 -69 14 75 -137 -71 -144 -59 -88 -55 30 9 209 156 273 -98 -122 -47 -237
7355b37L00%lm2j2m4L34n83K41k11P7K41o6p4N8J36M8k22O6j18j5o0K50K37l55
$$ -237 63 63 60 18 6 -38 296 -287 -46 -257 -180 61 -5 -79 -21 115 163 -59 7 -111 -126 -186 64 301 -54
7380e4M23m27R2l2J93k17K02N5l5j83j3k78K83j9n9L84m15J54j70K13J6o6j67
$$ -54 369 -58 34 2 195 -22 180 235 200 17 4 -274 9 -10 -69 315 -100 54 -116 97 113 47 -120
7403a20K1n3J84j65K51l3PJ30k08o5J1rk4J5J26K4m1m8J74k13o0K05j37J11J53
$$ -120 -99 -152 32 -133 118 85 92 222 14 -51 -40 -49 -73 -58 68 92 51 3 177 -36 -96 109 -28 83 236
7428B36l04J09j08p0L75n2k81K78r6J36j57k81K01L5J27l73J41K17j50J36j79
$$ 236 -68 41 -67 -137 238 186 -95 183 87 223 66 -215 -14 21 148 -225 -84 133 -17 119 -60
7449f0j08R4P1J80k92J0Q4k09J06K44j14J70j46K98l88j51J30N1J40k50K75j05
$$ -60 -168 -74 -3 177 -115 -105 -21 -230 -124 120 6 176 30 328 -60 -211 -81 -30 110 -140 135 30
7471C0J39j34j38J65j05J95j32l50K11J80n6K4PJ16J10j89Q6j98j9J42k35j36
$$ 30 169 35 -103 62 -43 152 20 -330 -119 61 5 29 36 152 262 73 159 -39 -58 84 -151 -287
7493b87J82P7J5J2P4k45L8K30j25j88L99J8j30nJ03l58J73R3j73L14n2J21m91
$$ -287 -105 -28 -13 -1 73 -172 -134 96 -29 -217 182 200 70 65 168 -190 -17 76 -97 217 165 286 -205
7516b05O8K16O5l28K16J89j29j49P4O7k56J86j2k48N69k21q9q1N1J19j09jp7Q9
$$ -205 -137 79 144 -184 32 221 92 -57 17 84 -172 14 2 -246 323 102 13 -68 -17 102 -7 -8 -85 4
7540DR3J2j29O5l45K67n7J03J54p0J13M6k42j10L0J6K37k02k9Q1j05J60l51K26
$$ 4 97 109 -20 45 -300 -33 -90 13 167 97 210 256 14 -96 -66 -50 187 -15 -44 37 -68 92 -259 -33
7564c3K12j06l7q1k9J89j54Q4j54k3J47k2j38K88k32R8R8j65L60j59r8o1j10L9
$$ -33 179 73 36 -45 -74 115 -39 45 -109 -132 15 -7 -145 143 -89 9 107 -58 302 143 45 -16 -126 -87
7588h7J96p9N2k13J88k25J73k05L52k42m4j09L32K1l14O4L1R9K0O7j6j13L0K9
$$ -87 109 30 82 -131 57 -168 5 -200 152 -90 -134 -243 89 110 -204 -140 -109 -10 10 77 61 -52 -22 7
7612GK42l20O0r9L58k20j23J98j78P2J7k50J55r4K92k48p5J01J62j89Q7k10PK55
$$ 7 249 -71 -11 -110 248 28 -95 103 -75 -3 14 -236 -81 -175 117 -131 -206 -105 57 -132 -45 -255 -248 7
7636GJ53L7Qj18q2R6j37j66K02J21k1r9q0K4k0K35l48J9L11k5j94J17k03K14m4
$$ 7 160 197 205 87 5 101 -36 -202 0 121 100 1 -79 -55 -75 160 -188 -169 142 117 -77 40 -163 51 7
7661Gj5N2l53N91l19j9K19M2q0j47j18L83k7j48j7k1jj60J55j04r7N66j9j36j18
$$ 7 -8 44 -309 282 -37 -56 163 205 125 -22 -140 243 216 68 51 30 29 -131 24 -80 -177 389 370 234 116
7686A16k20Q4L2J05k13J05j57n8J11Oj37K87p7K32K5j85J11k8K5N9k23K37j57
$$ 116 -104 -20 12 117 -96 9 -148 -206 -95 -89 -226 61 -16 216 241 56 167 139 164 223 0 237 80
7709H0o2J6K76n4r8j83r0OJ75j14R4j94K19m3j64K42J92j70j84j55J90j04O5j7
$$ 80 18 34 310 256 158 -25 -115 -109 66 -48 46 -148 71 28 -136 106 298 128 -56 -211 -21 -125 -60 -77
7733g7j8N9J17l63N67l14j8MK24k46j25L11p9j89J09J02j61K18n2J10j81L5q6
$$ -77 -95 -36 81 -282 285 -29 -47 -43 181 -65 -190 121 42 -147 -38 64 -97 121 69 179 -2 33 -53
7756e3K49j27o5j67j87P5N22l77L38k73J22j73J78j2j1n2K1oj30l0L23j3k00J51
$$ -53 196 69 4 -163 -350 -275 247 -130 208 -65 57 -116 62 50 39 -13 8 2 -128 -158 165 152 -48 103
7780A03l80N74k79O7l20L63j86m5k08K58l6j32J59j34K69j6l39l6N65k36k5M0
$$ 103 -277 297 18 85 -235 128 -58 -103 -311 -53 -89 -221 -62 -196 73 57 -282 -318 247 11 -14 26
7802B6j49P8J33O3k45K31j22K46m20k68N28k65K05K4k6k7n7J54m2j52M7J76k89
$$ 26 -123 -45 88 151 -94 137 15 261 -159 -427 101 -164 41 65 39 12 -45 109 67 -85 -38 138 -151
7825a51J48m0k91J42L06o6k00J07K46j10k07K0n5p7K63j73K01l92L11j31R9k01
$$ -151 -3 -43 -334 -192 114 48 -152 -45 201 91 -116 -96 -151 -228 35 -138 63 -329 -18 -149 -50 -251
7847b51J92K66k35L73m87J48j08J75M0q7j05k60O7M91l53L2J2L36j54K3J10k57
$$ -251 -59 207 -28 345 -142 6 -102 73 113 26 -79 -339 -272 219 -134 -102 -90 246 92 115 225 -32
7869c2J52p5M9k46J88j45Ol5K76J7j80L37m40O1L8l7L6j1K64K1l99K21k61j88
$$ -32 120 45 94 -152 36 -109 -103 -138 138 155 -25 312 -128 -67 -29 -66 -30 -41 223 244 -155 66 -195 -383
7893c83N18j61j92K33k16K98M5m2k17J82J82m5k43O2q5J67l8k00N8J94J41j27
$$ -383 135 -26 -218 15 -201 97 142 100 -117 65 247 202 -41 21 -64 103 65 -135 -77 117 258 131
7915A31j48J90R7m27J11m6Q5J88k77l7J58p0J91l5k10K87j43k33m9K80J40j39
$$ 131 -17 173 270 -157 -46 -92 -7 181 -96 -133 25 -45 146 111 -99 188 45 -188 -237 43 183 44
7937D4K8k45r4M60j39P6k37j6K47k17Q3m4R4j1j10R4J91k75Q7M4n3J96m17K45
$$ 44 72 -173 -267 193 54 130 -107 -123 124 -93 -10 -54 40 29 -81 13 204 -71 16 60 7 203 -214 31
7961C1j36L02o0q6R5m6l08J12J39M3p1M9J6j51J86j2j06l0Q7k95L59j55l2N3k8
$$ 31 -105 197 137 51 146 100 -208 -96 43 86 15 64 80 -71 115 103 -3 -33 54 -241 118 -37 -69 -16 -44
7986d4j62K1J5K16jM3p7l7K60l73n7L60k54n7L41k14O2k61K30J20J9k23k9N6K21
$$ -44 -206 -185 -170 46 45 88 11 -26 234 -139 -196 164 -90 -147 194 -20 42 -219 11 131 150 -73 -102 -46 175
8011A75l04J40J34l01K88Pr3J68k58j89L24k45J37j20K61j82Kj13J65J00k45K36
$$ 175 -129 11 145 -156 132 139 46 214 -44 -233 91 -154 -17 -137 124 -58 -56 -169 -4 96 -149 87
8033H7j44J92K0J09k03K4J34j69jO4l5K31l40j08J75p2k38K20J14J8k16N8L4M0
$$ 87 -57 135 155 264 61 85 219 50 49 113 78 309 -31 -139 36 -36 -274 -54 60 78 -138 -80 -46 -6
8057fP1j17L14m00L16k13n5Q3q1K8O0nP2j60r0K17l0o2mJ69j02J33k47J26q5O9
$$ -6 65 -52 262 -138 178 -35 -90 -7 -88 -60 0 -5 67 -93 -183 34 4 -58 -62 107 5 138 -109 17 -68 1
8083Aj48J74R7j94J37P7l06K7M49l45J24n1m7Q7j50k3r9K77Ok22J18J63j62Q5
$$ 1 -147 27 124 -70 67 144 -162 -135 314 -31 93 42 -5 82 -68 -91 -190 87 93 -129 -11 152 -10 75
8107G5q6J59k07J65n8k61K32J7j74j87K86J51j50%j11L84m70L05k30PK0J51q6
$$ 75 -11 148 -59 106 48 -213 19 36 -138 -325 -39 112 -38 -38 -149 235 -235 70 -160 -153 -133 18 -68
8130f8r2J38O3RJ13k91r3L07k35r7J31K59k58m2M63k39q8J32k31K14r7n1J30q0
$$ -68 -160 -22 41 50 163 -128 -221 86 -149 -246 -115 144 -114 -156 307 68 -20 112 -119 95 -2 -53 77 -3
8154cj45L49m19K06J59j16J92k12j66J73r2N3l4J52l3J59k79j06M01q6j81J59
$$ -3 -148 201 -218 -12 147 31 223 11 -155 18 -74 -21 -55 97 64 223 -56 -162 239 153 -28 131
8176A31j07J79j46j32L45j10q4O9j41l01K27K54j84R8K45
$$ 131 24 203 57 -75 270 160 76 145 4 -297 -70 184 0 98 343
8191C43
$$ Imaginary data points
##PAGE= N=2
##DATA TABLE= (X++(I..I)), XYDATA
0@%%%%%%%%%%%%%%Qj6J6j6K3l1L2l9M7n5O3p2Q7j02J18j35J52j74J97k22K53k85
$$ 0 0 0 0 0 0 0 0 0 0 0 0 0 0 0 8 -8 8 -8 15 -16 16 -23 24 -31 32 -40 47 -55 63 -72 80 -94 103 -119 134 -151
36a51L21l60M01m47N00n58O19o85P59q38R24j021J126j239J366j506J659j829
$$ -151 170 -190 211 -236 264 -294 325 -360 399 -439 485 -536 590 -649 717 -789 870 -959
54i59K019k233K477k759L082l461L915m466N157o049P251q975J1669j6514K7972
$$ -959 1060 -1173 1304 -1455 1627 -1834 2081 -2385 2772 -3277 3974 -5001 6668 -9846 18126
69A8126j06221j13745P2263j9222L578M0793L6844o9928q6457k76J18447J02877
$$ 18126 -88095 -201840 -129577 -148799 -145221 -104428 -67584 -137512 -223969 -224245 -105798 -2921
81b921m28p1668j9468N1942N9090p121k3362M3140R7278L9046n0256o8546K854
$$ -2921 -3349 -75017 -94485 -42543 16547 9426 -13936 29204 126482 165528 115272 46726 49580
94D9580P4375O7739q227m8977k8940j7971m4729m1017J8605O8542K5863q1159
$$ 49580 123955 191694 183467 134490 105550 87579 42850 1833 20438 88980 114843 33684
106C3684j27389m5346O1721P2178m024o4884m8830K451N984k2715j1859L4311
$$ 33684 -93705 -139051 -77330 -5152 -9176 -74060 -122890 -120439 -114455 -137170 -149029 -114718
118a14718N2362J8382l3152l3284K4154O0632L6614O716J4322L5682J8460l4088
$$ -114718 -62356 -43974 -77126 -110410 -86256 -25624 10990 17706 32028 67710 86170 52082
130E2082m5296K4028Q8758O0913k7619q0054m6822K3713M7237J3298j8637k1165
$$ 52082 6786 30814 119572 180485 152866 72812 25990 49703 96940 110238 91601 70436
142G0436j9830l5859m4977j8566K7165L1538j9113o1338m3016Q334K8831K194
$$ 70436 50606 14747 -30230 -48796 -21631 9907 -9206 -70544 -113560 -105226 -76395 -74201
154g4201k1535r05L2101J9099k5170l5231O961N6572N5268P007k4793j0055J5385
$$ -74201 -95736 -96641 -64540 -45441 -70611 -105842 -98881 -42309 12959 19966 -4827 -14882 503
167E03K3581J8502K2361L0838J5475k5641m4743q827M0097M3924k697m8133m2167
$$ 503 24084 42586 64947 95785 111260 85619 40876 32049 72146 116070 113373 65240 23073
180B3073k128J3135n676k0571r136N486m785l3150l5737m821J9797J2784j1108
$$ 23073 20945 34080 28404 7833 -1303 4183 -602 -33752 -69489 -74310 -54513 -41729 -52837
193e2837j7492l948O117m111q627J3049L7632K9539q002l1100r867L4201M8239
$$ -52837 -70329 -74277 -68160 -72271 -80898 -67849 -30217 -678 -8680 -39780 -49647 -15446 32793
206C2793J9338j0371j1306M508J1008M381L266J5039J5981o245k6852k1526L559
$$ 32793 52131 41760 30454 34962 45970 50351 53617 68656 84637 78392 51540 30014 33573
219C3573J6751J702k2187k2054n163j301j4480k3796j0031J3308J2902j2892k9321
$$ 33573 50324 52026 29839 7785 2622 1321 -13159 -36955 -46986 -33678 -20776 -33668 -62989
232f2989j6247R052K0003Q409k794N25N345M26l748Q513K6904K7465N606j5830
$$ -62989 -79236 -70184 -50181 -41772 -44566 -44041 -38696 -38270 -42018 -33505 -6601 20864 26470 10640
246A0640j0027J4926K7394J4531m062p532K285O152m737j0986j620R251L251j3605
$$ 10640 613 15539 42933 57464 53402 45870 48155 54307 49570 38584 36964 46215 49466 35861
260C5861k2530j2302J954l20r224j0531l629j554j0506j8513p991J2539J7126
$$ 35861 13331 1029 2983 2663 -6561 -17092 -20721 -22275 -32781 -51294 -59285 -46746 -29620
273b9620Q75j5747j3303N431J8437J3025L713L192O648M949M79J711J2798K0471
$$ -29620 -28745 -44492 -57795 -52364 -33927 -20902 -17189 -13997 -7349 -2400 -1921 -210 12588 33059
287C3059R953o936r681J804J1601P377l507n551O48J117q489j4921r262M011O988
$$ 33059 43012 36076 26395 28199 39800 47177 43670 38119 38767 39884 31395 16474 7212 11223 18211
302A8211n214j7471j5625m693M92j042l230p45J141n116j1578m914R276J7042
$$ 18211 12997 -4474 -20099 -24792 -24300 -25342 -28572 -29317 -28176 -33292 -44870 -49784 -40508 -23466
316b3466Q866n220q480K202J2928J1002N614M519P477N933p99m712L488J2129
$$ -23466 -14600 -19820 -28300 -26098 -13170 -2168 3446 7965 15442 21375 20576 15864 19352 31481
330C1481J0387oq410o619m12Q35l117l179O80M1q398j5625j2439M36Q964J658
$$ 31481 41868 41862 33452 26833 26421 27256 24139 20960 21640 21681 13283 -2342 -14781 -14345 -5381 -3723
346c723r351j2801p305j96J701Q63L702N265M79n884n230L569J3780J2976L349
$$ -3723 -13074 -25875 -33180 -33376 -31675 -30812 -27110 -21845 -21366 -27250 -32480 -28911 -15131 -2155 1194
361A194k903K65M800N168M105M605Q090P366q33q493n464L218Q220M531m578p884
$$ 1194 -1709 -1444 3356 8524 12629 17234 25324 32690 31857 23364 17900 21118 29338 33869 29291 21407
377B1407o200n631m894l082J418K554l700j2572j3162l935N158N624k34n461m842
$$ 21407 15207 9576 4682 1600 3018 5572 1872 -10700 -23862 -27797 -22639 -17015 -17249 -22710 -27552
392b7552r24k78M46M885R007P280P12m700j849O727J0824P760L813J331Q68J00
$$ -27552 -28476 -28754 -28308 -23423 -14416 -7136 -6424 -11124 -12973 -6246 4578 12338 16151 17482 18350 18450
408A8450j695O01O635P967J095o997j0617m929K146L238o74m844n315o636p426
$$ 18450 16755 17356 23991 31958 33053 26056 15439 10510 12656 15894 15220 10376 5061 -1575 -9001
423i001n914j082M099K794m674r078o235K19M935M443K151J665J909r95j608K024
$$ -9001 -14915 -15997 -11898 -9104 -13778 -22856 -29091 -28872 -23937 -19494 -17343 -15678 -13769 -14764 -16372 -14348
439a4348P935J0887O426o33m057j07M375O208M696K928J263j847n850n265P36
$$ -14348 -6413 4474 10900 10267 6210 6103 10478 16686 21382 24310 25573 23726 17876 12611 13347
454A3347M488L365l108q508q369l592q15r02o09j135k421n381p281l950L026N649
$$ 13347 17835 21200 18092 9584 1215 -2377 -3192 -4094 -4703 -5838 -8259 -13640 -20921 -24871 -21845 -16196
470a6196L213j667l558j754K153L413M426N810N183J527j638k111L026P575P434
$$ -16196 -12983 -14650 -18208 -19962 -17809 -14396 -9970 -4160 1023 2550 912 -1199 1827 9402 16836
485A6836K941j941k798j690P38P81J887K436j64n130p233m997r7K233R68l594
$$ 16836 19777 17836 15038 13348 14086 14867 16754 19190 19026 13896 6663 1666 1569 3802 4770 1176
501A176n412m665l648k015l79K128K287k86m501l770l48M133N725L631N82n17
$$ 1176 -4236 -8901 -12549 -14564 -14943 -12815 -10528 -10814 -15315 -19085 -19433 -15300 -9575 -5944 -5362 -5879
517e879K61P83K169M486N960M471k26l102k064K353M181L079L12j392k701k916
$$ -5879 -5618 -4835 -2666 1820 7780 12251 12025 8923 6859 9212 13393 16472 16784 15392 12691 9775
533I775l068p18J359J281j544m716o337l132K81R45j54q82k187k601k502j658
$$ 9775 6707 5989 7348 8629 7085 2369 -3968 -7100 -6819 -5874 -6028 -6910 -9097 -11698 -14200 -15858
549a5858J401L949L385p3k163j700J449L663M158L115K319M14m89J58Q82L397
$$ -15858 -14457 -10508 -7123 -7196 -9359 -11059 -9610 -5947 -1789 1326 3645 4059 3570 3728 4610 8007
565H007M626K001j710k636j868N45J330L55l31j265k215m368l476q53P67R33j473
$$ 8007 12633 14634 12924 10288 8420 8965 10295 10650 10319 9054 6839 2471 -1005 -1858 -1091 -158 -1631
582a631m075l187k144j26Q26J059M53M9j435j761J23L314L848K657R32p85j99
$$ -1631 -5706 -8893 -11037 -11163 -10337 -9278 -8825 -8776 -10211 -11972 -11849 -8535 -4687 -2030 -1098 -1883 -2082
599b082K096K644K648K674J679J88j129j929R88K737J320m43j905k684k056j033
$$ -2082 14 2658 5306 7980 9659 9847 8718 6789 7777 10514 11834 11391 9486 6802 4746 3713
615C713q03l03k48j360k550l794k800L83J507Q7r72j756j169n68P14J249K443
$$ 3713 2910 2607 2359 999 -1551 -5345 -8145 -7762 -6255 -6168 -7140 -8896 -10065 -10633 -9919 -8670 -6227
632f227J870O36m58l28J371L099L423J381L69J70L4O95R81J264J341Q69j377k901
$$ -6227 -4357 -3721 -4179 -4507 -3136 -37 3386 4767 5136 5306 5340 6035 7016 8280 9621 10490 9113 6212
650F212j306J35N88K36j666k038k408k037j224o66N48l78q71j968k177k64J232
$$ 6212 4906 5041 5629 5865 4199 2161 -247 -2284 -3508 -4174 -3626 -4004 -4875 -6843 -9020 -9284 -8052
667h052J538J310l96j45L06L57Q75K047K625J501J67k18K14J085K021J329O92
$$ -8052 -6514 -5204 -5600 -5745 -5439 -5082 -4207 -2160 465 1966 2133 1915 2129 3214 5235 6564 7256
684G256M8p55j031n64k50J187N82q25k303k317j443k11L76l68j037j126j800j311
$$ 7256 7304 6549 5518 4954 4704 5891 6473 5648 3345 1028 -415 -626 -250 -618 -1655 -2781 -4581 -5892
702e892o00M95J149N64k14j495k87P45J371J668J075O12K19O3K6J232J777J869
$$ -5892 -6492 -5997 -4848 -4284 -4498 -5993 -6280 -5535 -4164 -2496 -1421 -809 -590 -527 -501 731 2508 4377
720D377Q01m48j108L48L27Q59N12J19l89j221j714j159L22N05l7j011k265j676
$$ 4377 5178 4730 3622 3970 4297 5156 5668 5787 5398 4177 2463 1304 1626 2131 2094 1083 -1182 -2858
738b858m83J34R8N4M4p47j352j024K28J342J369O05J41p47J81R18J389J022J514
$$ -2858 -3341 -3207 -3109 -3055 -3011 -3758 -5110 -6134 -5906 -4564 -3195 -2590 -2449 -3196 -3015 -2097 -708 314 1828
757A828O43k14k76q0J077J307R87L55r23r42p51K46L95j29Q4q85j595j517j134
$$ 1828 2471 2257 1981 1901 2978 4285 5272 5627 4704 3762 3011 3257 3652 3523 3607 2722 1127 -390 -1524
776a524K02L18l6j229j288q86o27k2Q25M55N86m65m97m25O75J668J630J013J20
$$ -1524 -1322 -1004 -1040 -2269 -3557 -4443 -5070 -5092 -4267 -3812 -3226 -3691 -4188 -4613 -3938 -2270 -640 373 493
795D93k35o1J055Q59J533Q90N03p06p12m19R06L79J22jj323j205j107n81j88J20
$$ 493 258 197 1252 2111 3644 4534 5037 4331 3619 3200 4106 4485 4607 4606 3283 2078 971 390 202 322
815C22q0j150j572j381k79J87L83J74j14n33p31q1N98J405J366P53o1O1m03J029
$$ 322 242 -908 -2480 -3861 -4140 -3953 -3570 -3396 -3510 -4043 -4774 -4855 -4257 -2852 -1486 -733 -794 -733 -1136 -107
835a07J385J289Q65J22Q6o78J85J81Q17O33j64j424j035o86oQ4n5o37r17j354
$$ -107 1278 2567 3432 3554 3640 2962 3147 3328 4145 4778 4614 3190 2155 1469 1463 1547 1492 855 -62 -1416
855a416j083m09J65M23J86q11q04n87q0P95P86J128K55k31n94K37J133J095J428
$$ -1416 -2499 -2908 -2743 -2320 -2134 -2945 -3749 -4336 -4416 -3621 -2835 -1707 -1452 -1683 -2277 -2040 -907 188 1616
874A616M52Pk46k10N29N34R80O83m67q71m43n93k51M48K67p41j030j000j098J54
$$ 1616 2068 2075 1829 1619 2148 2682 3662 4345 3878 3007 2564 1971 1720 2168 2435 1694 664 -336 -1434 -1280
894a280J32K30l96o54p30q34j61N69Q65M25K0m55l90M21M54J084J089L41j62k49
$$ -1280 -1148 -918 -1314 -1968 -2698 -3532 -3693 -3124 -2259 -1834 -1814 -2269 -2659 -2238 -1784 -700 389 730 568 319
914C19K7O98R34P09M30l80j41n95q8M87M23o2m49j029p19n74MM75j02n09q74o16
$$ 319 346 1044 1978 2687 3117 2737 2596 2001 1913 2400 2823 2761 2312 1283 564 -10 -6 469 367 -142 -1016 -1632
936a632o73j74N7R06l9m91m77m70J31P61N58P77l2%j26K91O54P77P81M99m78L
$$ -1632 -2305 -2479 -2422 -1516 -1555 -2046 -2523 -2993 -2862 -2101 -1543 -766 -798 -798 -924 -633 21 798 1579 2078 1600 1603
958A603k70J80O67O26J91k97m81q58k30k06L45Q6o09m47j223n61M5j16L30j67
$$ 1603 1333 1513 2180 2806 2997 2700 2219 1361 1131 925 1270 1356 747 300 -923 -1484 -1439 -1555 -1225 -1392
978a392n34o89n78O39l9N39M73RNk92L32O72R18Q06J34k20K64J49L86L80O29L05
$$ -1392 -1926 -2615 -3193 -2554 -2593 -2054 -1581 -1572 -1567 -1859 -1527 -855 63 869 1003 783 1047 1196 1582 1962 2591 2896
1000B896j04n84n81n4L87J46k57l12o47j090o7n67M58k43l86n30p19l09J6K09
$$ 2896 2792 2208 1627 1573 1960 2106 1849 1537 890 -200 -267 -834 -376 -619 -1005 -1535 -2254 -2563 -2547 -2338
1020b338M88O4m2j16l97M94O09R64J17K86J32j19M09O55L48P01K42m90k39p9m3
$$ -2338 -1850 -1786 -1828 -1944 -2341 -1847 -1238 -274 -157 129 261 142 551 1206 1554 2255 2497 2007 1768 1689 1646
1041A646K83L63j15n61o56j96n20j7J89k94n52p79m04n79N41J15m1j52j73k11
$$ 1646 1929 2292 2177 1616 960 764 244 227 416 122 -430 -1209 -1613 -2192 -1651 -1536 -1577 -1729 -1902 -2113
1061b113p5N20K67L91P75l59K98k08K67O85M14L60jJ19l26J29J29M06K53J2l00
$$ -2113 -2188 -1668 -1401 -1010 -235 -594 -296 -504 -237 448 862 1222 1221 1340 1014 1143 1272 1678 1931 1943 1643
1082A643o24k24K8m2O3o5m46o35l50j09j5j2J31o4m53n64rK76J98J87LQ9j92K22
$$ 1643 1019 795 823 781 844 779 333 -302 -652 -761 -776 -788 -657 -721 -1174 -1738 -1747 -1471 -1273 -1086 -1083 -994 -1186 -964
1106i64J70K48R14k56J05M2j06J91M88M36J43J14m47j67L1k0K90L21k70k30j38
$$ -964 -794 -546 368 112 217 259 153 344 832 1268 1411 1525 1078 911 942 922 1212 1533 1263 1033 895
1127H95m15l87K51k49j78o9l57n24j96M5L28J76l75j28l26k48J47M50N14J55N9
$$ 895 480 93 344 95 -83 -152 -509 -1033 -1229 -1184 -856 -680 -1055 -1183 -1509 -1757 -1610 -1160 -646 -491 -432
1148d32J45n62N50M19M20K51M0P5N6P6Q8K67M54j69n14m5m06K91j16j6j00l04
$$ -432 -287 -849 -299 120 540 791 831 906 962 1038 1126 1393 1847 1678 1164 1119 713 1004 888 872 772 468
1170D68m89n46Q9j01q1j19j11k28l15n7P4M07n6k15M29j92k34O93J87M07L93k95
$$ 468 -21 -567 -478 -579 -660 -779 -890 -1118 -1433 -1490 -1416 -1009 -1065 -1280 -851 -1043 -1277 -584 -397 10 403 108
1192A08M44k06L99J73M62K19m10K13On50L39K02l95J17l77m34l84q4M5n4m47j63
$$ 108 552 346 745 918 1380 1599 1189 1402 1408 858 1197 1399 1004 1121 744 310 -74 -158 -113 -167 -614 -777
1214g77J0p18J29J30J0K46J10k54k39L04J64L02J91M22J96k85K04K57P6M58j41
$$ -777 -767 -1485 -1356 -1226 -1216 -970 -860 -1114 -1353 -1049 -885 -583 -392 30 226 -59 145 402 478 936 795
1235G95M52l47K27j35k85K97J76k14l81q8k43q0J16j25r5m7o13m14R5k20O05j69
$$ 795 1247 900 1127 992 707 1004 1180 966 585 497 254 174 290 165 70 23 -590 -1004 -909 -1129 -524 -693
1257f93r3k78L7p5P9J35O06l73Q0J61K09p1J88M25J07J22k23RJ68L33K49J6j71
$$ -693 -786 -1064 -1027 -1102 -1023 -888 -282 -655 -575 -414 -205 -276 -88 337 444 566 343 352 520 853 1102 1118 947
1280I47j24k93N2p6L06k02j97k54l06J33k34K36l15J56n32r8j74J11K0M8J79j1
$$ 947 823 530 582 506 812 610 413 159 -147 -14 -248 -12 -327 -171 -703 -801 -975 -864 -844 -796 -617 -628
1302f28J69j09l6l28Q87j06J08M1k6K60k16J51L66J80J2k39k3J12L27j31j1P1
$$ -628 -459 -568 -604 -932 -45 -151 -43 -2 -28 232 16 167 533 713 725 486 463 575 902 771 760 831
1324H31j39k72J71m25K06r3m99J38k79k18m1J9J69R6m16pR2k91K80k27L83K17
$$ 831 692 420 591 166 372 279 -220 -82 -361 -579 -620 -601 -432 -336 -752 -759 -667 -958 -678 -905 -522 -305
1346c05k97M57k31N9K11K66J80R1J43q3J51K23j04K76r2k49ol72J04J15j23j16
$$ -305 -602 -145 -376 -317 -106 160 340 431 574 491 642 865 761 1037 945 696 690 318 422 537 414 298
1368B98k60k92K33k34k10j9ql0l16j4Q6m7k76M62L5r7M08j02J08j05K68O9K69
$$ 298 38 -254 -21 -255 -465 -484 -492 -522 -838 -852 -766 -813 -1089 -627 -592 -689 -281 -383 -275 -380 -112 -43 226
1391B26K60l92L01K62r5J9K20J06j28j80K63l08l5k2ln44O2m1k08m6K2q6k68k23
$$ 226 486 94 395 657 562 581 801 907 779 599 862 554 519 497 494 -50 12 -29 -237 -283 -261 -347 -615 -838
1415h38k3O8Q9J09l5k11Q1J91J53K9L04L2J3N9p8J17Q8J05J52j34J78j13J53M7
$$ -838 -861 -793 -704 -595 -630 -841 -760 -569 -416 -387 -83 -51 -38 21 -57 60 148 253 405 271 449 336 489 536
1439E36R1k16P8K0k48R8k6k17r2j36%j39J6J5j87l9P1qK26k37k81K88n7M83l28
$$ 536 627 411 489 509 261 359 333 116 24 -112 -112 -251 -235 -220 -407 -446 -375 -383 -157 -394 -675 -387 -444 39 -289
1464b89l66L22J6kL85k3Q6L79n00K41j02L16j36K46l29K98j07j22J77m7n3j64
$$ -289 -655 -333 -317 -319 66 43 129 508 8 249 147 463 327 573 244 542 435 313 490 443 390 226
1486B26R2j96J3j82k9R4j35L8o5O5l5l83Q9L1l4r4R5o5q1L56p3M3k0P6J46n6n8
$$ 226 318 122 135 -47 -76 18 -117 -79 -144 -79 -114 -497 -408 -377 -411 -505 -410 -475 -556 -200 -273 -230 -250 -174 -28 -84 -142
1513a42M31L8J69l41R7J43P9r5k0M4Q9M5l06L27n07O9MK9k43n8K15o66K16k17
$$ -142 289 327 496 155 252 395 474 379 359 403 492 537 231 558 51 120 124 153 -90 -148 67 -599 -383 -600
1537f00K14j38j51J27J78n0K96k55K82j25j97L93J0J65J33k73R0K48r2J98L8j65
$$ -600 -386 -524 -675 -548 -370 -420 -124 -379 -97 -222 -419 -26 -16 149 282 9 99 347 255 453 491 326
1559C26o9K55l79K28J49O4j5o99L98k34j15qj5J22j95k06p0j3Q2J15j07k93M72
$$ 326 257 512 133 361 510 574 559 -140 258 24 -91 -99 -114 8 -187 -393 -463 -476 -394 -279 -386 -679 -207
1582b07j00J48j85K1K78JL2j46K92J32k40L42l54k1L98j69J60K1J25n9j70ro9
$$ -207 -307 -159 -344 -323 -45 -44 -12 -158 134 266 26 368 14 -7 391 222 382 403 528 469 299 290 221
1605B21J73l96l9n5Q0k61K95l49J00K73l77j1J53m10J12J72P2k23K78J16k04O3
$$ 221 394 -2 -41 -96 -16 -277 18 -331 -231 42 -335 -346 -193 -603 -491 -319 -247 -470 -192 -76 -280 -217
1627b17L38k13j6J03J4J84k0K9m4j5l1J05p7KO5j10K99j72p8j7n1O1r7M6k62J60
$$ -217 121 -92 -108 -5 9 193 173 202 158 143 112 217 140 142 207 97 396 224 146 129 78 139 42 88 -174 -14
1653a4lk26J57Kj15nm1J45n1M6M9O3pl71K96n0L21m46K10K19k24J03QK25j98N0
$$ -14 -17 -243 -86 -84 -199 -204 -245 -100 -151 -105 -56 7 0 -371 -75 -125 196 -250 -40 179 -45 58 66 291 93 143
1679A43K23j24j58n8R2Q1p2J51k04M5J33j55P4o8k13K49J5m47k8L73j50r7p9K94
$$ 143 366 242 84 26 118 199 127 278 74 119 252 97 171 103 -110 139 154 -293 -321 52 -98 -195 -274 20
1703B0l48J15J29k32J69p0K29j45m3P6K94l36M6J92O5Q0J59j57R6J75l06m4K64
$$ 20 -328 -213 -84 -316 -147 -217 12 -133 -176 -100 194 -142 -96 96 161 241 400 243 339 514 208 164 428
1726D28k52J05o1j09m1j93J13K7k43kK16n03M90m19K04N1j37Q8J21k65N3M20l02
$$ 428 176 281 220 111 70 -123 -10 17 -226 -228 -12 -515 -25 -444 -240 -189 -326 -238 -117 -382 -329 91 -211
1749b11Q6oJ41k8J84l5R5o0O1JM8j95L63j26j03m4%J20k15J4j63Q4Q3j67j32J78
$$ -211 -125 -131 10 -18 166 131 226 166 227 228 276 81 444 318 215 171 171 291 76 90 -73 11 94 -73 -205 -27
1775b7p9kj40O0J7k10L4M10r1q6k19L05p2k8K28J30m71L8j45N77m89L71N2m4M7
$$ -27 -106 -108 -248 -188 -171 -381 -347 63 -28 -114 -333 -28 -100 -128 100 230 -241 -203 -348 229 -260 111 163 119 166
1800A66J02j53O1K84k28j35R4j68L7k45L15k87K5J58p6k25O5J98k67M38n27N89
$$ 166 268 115 176 460 232 97 191 23 60 -185 130 -157 -132 26 -50 -275 -210 -12 -279 159 -368 221
1822B21l35m9n7k55K94L56k15j12K02j14J38j06K02l14K70l34L75q3j20J76J8
$$ 221 -114 -163 -220 -475 -181 175 -40 -152 50 -64 74 -32 170 -144 126 -208 167 84 -36 140 158
1843A58k5j15K52Q6l3k62j15K43q0j79O3J34k25N0J84l09M9k5r3k3N7L70k62N3
$$ 158 133 18 270 356 323 61 -54 189 109 -70 -7 127 -98 -48 136 -173 -124 -149 -242 -265 -208 162 -100 -47
1867d7k71J33K43n0j23r9K31k28K82lj18m4R2q9L20k75K06J99k81j71O48m08M7
$$ -47 -318 -185 58 8 -115 -214 17 -211 71 68 -50 -94 -2 -91 229 -46 160 359 78 -93 555 147 194
1890A94k60k03L04M4l0k1l28n2K50j63J43l6l6J04j24J06k29K70K5j76L95k61
$$ 194 -66 -269 35 79 49 28 -300 -352 -102 -265 -122 -158 -194 -90 -214 -108 -337 -67 -42 -218 177 -84
1912h4R2k45L38j77J70j68K44k4jK3N4K32l98J76o7l8m4O1J3j80mj52R9K27l47
$$ -84 8 -237 101 -76 94 -74 170 146 145 168 222 454 56 232 165 127 83 144 157 -23 -27 -179 -80 147 -200
1937b00J0j33P9j56K81j45J99j20K93k51p0L45j76p6P8j31J08L44l75J99P5j4
$$ -200 -190 -323 -244 -400 -119 -264 -65 -185 108 -143 -213 132 -44 -120 -42 -173 -65 279 -96 103 178 164
1959A64M0Q8k54L18l23Q9k9P9J91rj50j35k28K24j16K2l5P5K9j31q9j26J49L4
$$ 164 204 292 38 356 33 122 93 172 363 354 204 69 -159 65 -51 -29 -64 11 40 -91 -180 -306 -157 -123
1983a23J63P7j85j65J27j28J9L7K4L14j40j82J12J12L2j22O1j7Q2K03L4k71K03
$$ -123 40 117 -68 -233 -106 -234 -215 -178 -154 160 20 -162 -50 62 94 -28 33 16 98 301 335 64 267
2006B67M0r8k85J84j3k85K64J62j55k11L6j05J51j6J16m7k53J74J75k81J55O3
$$ 267 307 209 -76 108 95 -190 74 236 81 -130 -94 -199 -48 -64 52 5 -248 -74 101 -180 -25 38
2028C8R0l56N8j29J60J16n5p5J87j85n2J37K57l6K5k08n1K18K53j94j70J98j17
$$ 38 128 -228 -170 -299 -139 -23 -78 -153 34 -151 -203 -66 191 155 180 -28 -79 139 392 198 28 226 109
2051A09r2k9m9M63k61k52J26M9j41j32l7j91K08J24N9k05J86P7J01k49M5J00Q6
$$ 109 17 -12 -61 402 141 -111 15 64 -77 -209 -246 -437 -229 -105 -46 -251 -65 12 113 -136 -91 9 95
2074I5M1l02L59k83R5K6j16K02j51J67l2LK60k97k13J27o5K75j77l05J49L24m29
$$ 95 136 -166 193 -90 5 31 -85 117 -34 133 101 104 364 67 -146 -19 -84 191 14 -291 -142 182 -247
2097b47q8L51m52K28J66j37j62r4L57J02j70R0R2J54r8k20J73J72j22p5O5m9j17
$$ -247 -335 16 -436 -208 -42 -179 -341 -435 -78 24 -146 -56 36 190 92 -128 45 217 95 20 85 36 -81
2120h1J76K09j78j28J17M5P3j50J03J17j97p8j58j07J05K55k45r9P6j15M8K72
$$ -81 95 304 126 -2 115 160 233 83 186 303 106 28 -130 -237 -132 123 -122 -221 -145 -260 -212 60
2142F0j63Kj35L31k39L24l85L44l12J61L1J52P3k48J27J4q4j54K27N1k35j59L69
$$ 60 -103 -101 -236 95 -144 180 -205 139 -173 -12 19 171 244 -4 123 137 53 -101 126 177 -58 -217 152
2165A52q9R5j56J08J1k36J99k40J43O1o7J04J2l46j79L62j5M72m12j36LJ52Q3
$$ 152 63 158 2 110 121 -115 84 -156 -13 48 -19 85 97 -249 -428 -66 -81 391 -21 -157 -154 -2 81
2188H1j71J21K90j96k34Q6J59m1m9M14l36R8k42P9r7L85k28q0K4J34j86P6k6L
$$ 81 -90 31 321 125 -109 -23 136 95 46 460 124 222 -20 59 -38 347 119 39 63 197 11 87 61 64
2212F4k09J25o0j34L6J22Q1j19K62j83J89k77M8k46M63m66M34l14k0M4L61k58
$$ 64 -145 -20 -80 -214 -178 -56 25 -94 168 -15 174 -103 -55 -301 162 -304 130 -184 -204 -160 201 -57
2234e7l22L91j35L25l49K07k70M08J99j79j3j03o4m2o7L93k71o6M3j37J76L2l01
$$ -57 -379 12 -123 202 -147 60 -210 198 397 218 205 102 38 -4 -71 322 51 -15 28 -109 67 99 -202
2257b02mJ75o7j45m1N1J52m8M3j15J41r8J91n8J24JJ69K31l19l41L39L10k25P2
$$ -202 -206 -31 -98 -243 -284 -233 -81 -129 -86 -201 -60 -158 33 -25 99 100 269 500 181 -160 179 489 264 336
2281C36j98j89K49l3L4j80J13J30k07J41k71L9r3J70o9j79k13K73o7pK35j84K30
$$ 336 138 -51 198 165 199 19 132 262 55 196 -75 -36 -129 41 -28 -207 -420 -147 -214 -221 14 -170 60
2304F0m67L99n4k26p3M48l19M44J22R7k35J59l99K85q1k18J15L2K89k07o5k2P5
$$ 60 -407 -8 -62 -288 -361 87 -232 212 334 431 196 355 -44 241 160 -58 57 89 378 171 106 84 159
2327A59k83J84Mj27J21k63l9j2L85l76j01K45p5J57k02J72K95k20N6j59l6J36
$$ 159 -124 60 64 -63 58 -205 -244 -256 129 -247 -348 -103 -178 -21 -223 -51 244 24 80 -79 -115 21
2349B1J9K24j76K80j80j84K57j38K9j10O5J39j82J5K4K5Nk95J22J6k95M65l20
$$ 21 40 264 88 368 188 4 261 123 152 42 107 246 64 79 103 128 133 -162 -40 -24 -319 146 -174
2372a74K88l27P6J4j7O4J29j46r4J21l0M48n64K7P7J10n8m5J99oK43k49k12J78
$$ -174 114 -213 -137 -123 -140 -76 53 -93 -187 -66 -96 352 -212 -185 -108 2 -56 -101 98 92 335 86 -126 52
2396E2J91Mm11Q4L01l1k00M3N9k91L44j45M3k1k2k15L2L49k81J85k11J36N8J01
$$ 52 243 247 -164 -80 221 190 -10 33 92 -199 145 0 43 22 0 -215 -183 166 -115 70 -141 -5 53 154
2420A54k29k45k1K33M1k07J85J5K3j22J71k30N14j42k49K68j38j42M28k61K19
$$ 154 -75 -320 -341 -108 -67 -274 -89 -74 -51 -173 -2 -232 282 140 -109 159 21 -121 307 46 265
2441B65j65jN4j33K27k58P4j92K39k80j56K77o1j77Q8j58J02J9L24j28q6m2M03
$$ 265 100 99 153 20 247 -11 63 -129 110 -170 -326 -49 -110 -287 -199 -357 -255 -236 88 -40 -126 -168 235
2464B35r7k10jp1K36K6j36L24l3l75M06l14J26j10K11q4m6J28j1r2J50l41P0P
$$ 235 138 -72 -73 -144 92 118 -18 306 273 -102 304 -10 116 6 217 133 87 215 204 112 262 -79 -9 -2
2488bj23j26q2J13N5n0n4j23L17k53L41j90Q7N4m7j76K00j64M49P0j96jN0k07
$$ -2 -125 -251 -333 -220 -165 -215 -269 -392 -75 -328 13 -177 -90 -36 -83 -259 -59 -223 226 296 100 99 149 -58
2512e8j57L54k5n4j3j2N1R5n8K8j36K70m75ON1J63j30N5J61k23j12K78j62j86
$$ -58 -215 139 114 60 47 35 86 181 123 151 15 285 -190 -184 -133 30 -100 -45 116 -107 -219 59 -103 -289
2536b89K07n8j6L92l17J53r2j9K0J13m9L7k2J9j77q9J13J08k7K11j65R9R0Ok51
$$ -289 -82 -140 -156 236 -81 72 -20 -39 -19 94 45 82 60 79 -98 -187 -74 34 7 218 53 152 242 248 -3
2561cj6J13r8j13J38J79j33j95r2K45Lj18N3l5j67L8k6J38K54j12J54n99L73o1
$$ -3 -19 94 -4 -117 21 200 67 -128 -220 25 28 -90 -37 -72 -239 -201 -227 -89 165 53 207 -392 -19 -80
2585h0K10n0j14K1n4M06l20j64PJ57K29k18j35K19L8n4R0k49K60k30k33M00l44
$$ -80 130 80 -34 -13 -67 339 19 -145 -138 19 248 30 -105 114 152 98 188 -61 199 -31 -264 136 -208
2608b08J17L6J20O4j96p6K34l0j26J64R9j54k5j95J53k63K11K0n4j2R3k29K92
$$ -208 -91 -55 65 129 -67 -143 91 61 -65 99 198 44 19 -176 -23 -286 -75 -55 -109 -121 -28 -257 35
2631C5O9l5J3N6j04L08m27L6J47J70P5k91J43r2j47O4k9n3J35J36k46k56J72J64
$$ 35 104 69 82 138 34 342 -85 -49 98 268 343 52 195 103 -44 20 -9 -62 73 209 -37 -293 -121 43
2655D3r3j60L8Q1M1j53J69M6NJ22j9k15J86K06n75K22M24k01M19m21l2N7qo7J41
$$ 43 -50 -210 -172 -91 -50 -203 -34 12 17 139 120 -95 91 297 -278 -56 368 167 586 165 133 190 182 115 256
2680B56k47j4J8KJ29k36L5m1N1k5O7k8l2K7k69L17l37L53j43J12J06l4J8K23l38
$$ 256 9 -5 13 15 144 -92 -57 -98 -47 -72 -5 -33 -65 -38 -307 10 -327 26 -117 -5 101 67 85 308 -30
2705c0R8q2j1K53j17M2Q4j90P3j81J16k40J39p0K25J55j08j93J25n9j12o5Q3N1
$$ -30 68 -14 -25 228 111 153 237 47 120 -61 55 -185 -46 -116 109 264 156 -37 88 29 -83 -148 -65 -14
2729a4k04K47l60L81j69R7n2j84J12J61q3N1QJ21l06N18k97j56J25j11P2K09j50
$$ -14 -218 29 -331 50 -119 -22 -74 -258 -146 15 -68 -17 -9 112 -194 324 27 -129 -4 -115 -43 166 16
2752A6J33k14K57Kl39R1L2P9k71O0J72j2j20K19p0k23Q8L48j95k20Q7J33lk06
$$ 16 149 -65 192 194 -145 -54 -22 57 -214 -154 18 6 -114 105 35 -188 -100 248 53 -167 -80 53 50 -156
2776a56J71j48R8j07o2j3K62J05J9jj52P6j14R1lK12k72J62k59K52M9j55K6j99
$$ -156 15 -133 -35 -142 -204 -217 45 150 169 168 16 92 -22 69 66 278 6 168 -91 161 210 55 81 -118
2800a18J29N8K60j48j11k74L72m66J25K63j45J10k62J00J1J50j15J11l21M5J33
$$ -118 11 69 329 181 70 -204 168 -298 -173 90 -55 55 -207 -107 -96 54 -61 50 -271 -226 -93
2821i3J77j68O6p9K11k90K95m7J71l11M4J04J21j36N5Q8k33P7J81l0j49J60l15
$$ -93 84 -84 -18 -97 114 -176 119 72 243 -68 -24 80 201 65 120 208 -25 52 233 203 54 214 -101
2844a01J40j47K31l34j25J36o8L60m06J59j5p4J82n8k78K71Q0MK07n08M25q8J99
$$ -101 39 -108 123 -211 -336 -200 -268 92 -314 -155 -170 -244 -62 -120 -398 -127 -47 -43 164 -344 81 -7 192
2867A92o3J24j31k15K7K54K36l95J20l07K5l9r3L51P5l3l21K27r1n8J52k26J77
$$ 192 129 253 122 -93 -66 188 424 29 149 -158 -133 -172 -265 86 161 128 -193 34 -57 -115 37 -189 -12
2890a2k08L65m23J80P6J08k20k6J94k32K55R9r2J04J4l6P5k19J4J80j82l4J16
$$ -12 -220 145 -278 -98 -22 86 -134 -160 34 -198 57 156 64 168 182 146 221 2 16 196 14 -20 96
2913I6o3O9n8Nr1q4M1L11k82j56L33p4j41r5k0J83J94k16j62L82l47P5j80J39
$$ 96 33 102 44 49 -42 -126 -85 226 -56 -212 121 47 -94 -189 -209 -26 168 -48 -210 172 -175 -100 -280 -141
2937a41p7J91j97M9J38l8j23J65N7q8J61k1j88J66J83k19j62J30Q9j64J11K35
$$ -141 -218 -27 -224 -175 -37 -75 -198 -33 24 -64 97 76 -112 54 237 18 -144 -14 75 -89 22 257
2959B57j40ON6m9p2j81L14k96L53k66k45L14L0L6nm5j41K97j07k60L03M7n77L
$$ 257 117 123 179 130 58 -123 191 -105 248 -18 -263 51 81 117 112 67 -74 223 116 -144 159 206 -371 -368
2983c68K96j9j35K40J67j50j20j6J16j08J79p9J78j34J1NK10m41K12N4J32k57
$$ -368 -72 -91 -226 14 181 31 -89 -105 11 -97 82 3 181 47 58 63 273 -168 44 98 230 -27
3005b7K53j45r8k21L48k66L54j42p5j16M7J32k36j29M19k08J51j16J36k02N08
$$ -27 226 81 -17 -238 110 -156 198 56 -19 -135 -88 44 -192 -321 98 -110 41 -75 61 -141 367
3026C67n44N73n73j06N83j59j05m5R7q0L3J12J30j94j03J19J7k48L49j56j53Q2
$$ 367 -177 396 -177 -283 300 141 36 -9 88 8 41 153 283 89 -14 105 122 -126 223 67 -86 -4
3048dl28J70kO7N6p8j6n8K4J49J11j15p2j42K50%J72kj84p5J98O1JL6L4J64n23
$$ -4 -332 -162 -164 -97 -41 -119 -135 -193 -169 -20 91 -24 -96 -238 12 12 184 182 -2 -77 121 182 183 219 253 417 -106
3075a06J74P7k67j71J25N00k23P9L3l09k39J7P7J65M2j35K04m8jm6j14J45k03
$$ -106 68 145 -122 -293 -168 332 109 188 221 -88 -327 -310 -233 -68 -26 -161 43 -5 -6 -52 -166 -21 -224
3098b24J80N9N9n0L4M1j52n0K48k73J44J30m7m0K09m0j88K53j84K92p42M19k23
$$ -224 -44 15 74 24 58 99 -53 -103 145 -128 16 146 99 59 268 228 40 293 109 401 -341 78 -145
3121a45J95k09J83J17l77L21q8Ql7Q9j18%K1O5j54O8j28RK63k33K23j02l1P8L8
$$ -145 50 -159 24 141 -236 85 -3 5 -32 57 -61 -61 -40 25 -129 -61 -189 -180 83 -150 73 -29 -60 18 56
3146E6j3p2j29K67j90N3r4K97j54K12k5O8j94j72K52m54K60q7L12m18K16J60l78
$$ 56 43 -29 -158 109 -81 -28 -122 175 21 233 208 276 82 -90 162 -292 -32 -119 193 -225 -9 151 -227
3169b27N9L61k27j10J09j65J55N0r2N9J09l97K26J46j96L43k35J55m6j89K37P5
$$ -227 -168 193 -34 -144 -35 -200 -45 5 -87 -28 81 -316 -90 56 -140 203 -32 123 77 -112 125 200
3191B00P5M9k19J9M9j25K24J00k02r2j40O4M03m11n10N02k1M8j93j00N4R6l9L85
$$ 200 275 324 105 124 173 48 272 372 170 78 -62 2 405 -6 -516 -14 -35 13 -180 -280 -226 -130 -169 216
3215B16j80k10R5R2N8j43j20M32r1j97k6J99j68M7j13K68k0j99L85l94J03q1K8
$$ 216 36 -174 -79 13 71 -72 -192 240 149 -48 -74 125 -43 4 -109 159 139 -60 325 -69 34 -47 -19
3238a9m9J65k23N0K96l78J25J87j38k8k8r7j50K20Q3P1r3N2K0j84K21l98K12M08
$$ -19 -68 97 -126 -76 220 -158 -33 154 16 -12 -40 -137 -287 -67 16 87 -6 46 66 -118 103 -295 -83 325
3262C25k13j34j88L30l10K90O1l30J13j55K85j98K68k40R7O9R6k44o4O4k0j18
$$ 325 112 -22 -210 120 -190 100 161 -169 -56 -211 74 -124 144 -96 1 70 166 -78 -142 -78 -98 -216
3284b16K45k45M45k99N2K5l1J91j70m5R8m5k26L17o0m2j69K26j32p0%J36M2K85
$$ -216 29 -216 229 -70 -18 7 -24 167 -3 -48 50 5 -221 96 36 -6 -175 51 -81 -151 -151 -15 27 312
3308C12m79K20j09R3o8k32K59L9P1O9j05k09Lj4j04K18r3J14K97m21J0J7J3K88
$$ 312 -167 53 -56 37 -31 -263 -4 35 106 175 70 -139 -136 -150 -254 -36 -129 -15 282 -139 -129 -112 -99 189
3332A89M3j66p2j93J87K91l77j7o0K2j43K74j54J83J72p0j05J19k17J09Q5j03
$$ 189 232 66 -6 -199 -12 279 -98 -115 -175 -153 -296 -22 -176 7 179 109 4 123 -94 15 100 -3
3354ck41L79j34J38k52K62K8j9k27l4J04n6N5J05R9l00j0J45k5q8o0R2K04o5m9
$$ -3 -244 135 1 139 -113 149 177 158 -69 -103 1 -55 0 105 204 -96 -106 39 14 -74 -134 -42 162 97 48
3379D8k58K26K96k97n2j40J91M1r5J0R1j42P6J9Q4j57O5k2O7k0j12K06j29n8k45
$$ 48 -210 16 312 15 -37 -177 14 55 -40 -30 61 -81 -5 14 98 -59 6 -16 51 31 -81 125 -4 -62 -307
3404c07K83n7Q7k15j54K30K13j66pJ0J33j52J29j55M2q6J57j00o8K57K8O3J55
$$ -307 -24 -81 6 -209 -363 -133 80 -86 -93 -83 50 -102 27 -128 -86 -172 -15 -115 -183 74 102 165 320
3427C20l78m9N5J72q8J77k74J95J5k9k07N1k72M63l68J95j1q8R7J73j06k12K78
$$ 320 -58 -107 -52 120 32 209 -65 130 145 116 -91 -40 -312 151 -217 -22 -33 -121 -24 149 43 -169 109
3450A09k17O7R6J6j41J05k4m4J50n3k09J50K0P5k80L27k42p9K73m4K5j07J84m19
$$ 109 -108 -41 55 71 -70 35 11 -33 117 64 -145 5 25 100 -180 147 -95 -174 99 55 80 -27 157 -262
3474b62J25r6L57L2m26J68k0J19K7J90K2m08J53J70J13j52j46K83o7k20j38n2
$$ -262 -137 -233 124 156 -270 -102 -122 -3 24 214 236 -172 -19 151 264 112 -34 249 182 -38 -176 -228
3496b28J53L02kl89K61k02K06mKn8n4j09J9K49l05k24L20J07O2j45N0n3j1m1o8
$$ -228 -75 227 225 -164 97 -105 101 97 99 41 -13 -122 -103 146 -159 -383 -63 44 106 -39 11 -42 -53 -94 -162
3521a62j41O4J41K25j92j1j5r8K89j73J44k98J96L0R9l10L51j49J44l12K06L8
$$ -162 -303 -239 -98 127 -65 -76 -91 -189 100 -73 71 -227 -31 -1 98 -212 139 -10 134 -178 28 66
3543F6j52N9j1m9J68n2M1j36K93j8j91K95l23j08R8n4P9q0P4j60J93L4J13J3l64
$$ 66 -86 -27 -38 -87 81 29 70 -66 227 209 18 313 -10 -118 -20 -74 5 -75 -1 -161 32 66 179 192 -172
3568a72K70k10Nl9L37j47K5k35L33o0r1N2n1J12k07J54j83J56M4r8p9J72k49O0
$$ -172 98 -112 -107 -146 191 44 69 -166 167 107 16 68 17 129 -78 76 -107 49 93 -5 -84 88 -161 -101
3592a01Q1J98k6o3M8j40j31J24N9j2J99m31K74j24j02K86k75j71K25o8J87J79
$$ -101 -20 178 152 89 137 -3 -134 -10 49 37 236 -195 79 -45 -147 139 -136 -307 -82 -150 37 216
3614B16j10P8M0n6p9k12J03j33J03K9M4J33R5j89l4J10j09K4k54K93r0r6q5JL8
$$ 216 106 184 224 168 89 -123 -20 -153 -50 -21 23 156 251 62 28 138 29 53 -201 92 2 -94 -179 -178 -140
3639a40K31j5j22j14L85j70k40N38k43k7k67K35J21P1J4m22J82Q9j69J87n9j43
$$ -140 91 76 -46 -160 225 55 -185 353 110 83 -184 51 172 243 257 -165 17 106 -63 124 65 -78
3661g8jK12q9n5n9n9K2J00j53L6P5N7j28K4Q7n0p9K36j55k48K56p0p0K65P4j64
$$ -78 -79 133 44 -11 -70 -129 -107 -7 -160 -124 -49 8 -120 -96 -9 -59 -138 98 -57 -305 -49 -119 -189 76 150 -14
3687a4O9m6k27M85l11J02K7O9k46L0K1r7K28m9k44K57K6K22k33RJ63k36q1J94
$$ -14 55 9 -218 267 -44 58 85 154 -92 -62 -41 -138 90 41 -203 54 80 302 69 78 241 5 -76 118
3711A18j20R6M3j84K7J1j90K73k65o6K66Q3j53n2j81J00j00O9L09p2J68m18K57
$$ 118 -2 94 137 -47 -20 -9 -199 74 -191 -257 9 92 -61 -113 -294 -194 -294 -225 84 12 180 -238 19
$$ [...]
8191F3
##END NTUPLES=NMR FID
##END=
