##TITLE=1H_SR83 Gly'_1
 CDCl3,8 sc, 
 2.9.2021
##JCAMPDX= 6.0         $$ Bruker NMR JCAMP-DX V2.0
##DATA TYPE= NMR FID
##DATA CLASS= NTUPLES
##ORIGIN= UXNMR, Bruker Analytische Messtechnik GmbH
##OWNER= root
$$ XWIN-NMR		Version 3.5
$$ Thu Sep  2 12:13:59 2021 Russian Standard Time (UT+4h)  she@DPX200
##.OBSERVE FREQUENCY= 200.1312
##.OBSERVE NUCLEUS= ^1H
##.DELAY= (6, 6)
##.ACQUISITION MODE= SIMULTANEOUS
##.ACQUISITION SCHEME= undefined
##.AVERAGES= 8
##.DIGITISER RES= 18
##SPECTROMETER/DATA SYSTEM= spect
##.PULSE SEQUENCE= zg30
##.SOLVENT NAME= CD2Cl2
##.SHIFT REFERENCE= (INTERNAL, CD2Cl2, 0, 15.7039)
##AUDIT TRAIL= $$ (NUMBER, WHEN, WHO, WHERE, WHAT)
$$ ##TITLE= Audit trail, XWIN-NMR		Version 3.5
$$ ##JCAMPDX= 5.01
$$ ##ORIGIN= Bruker BioSpin GmbH
$$ ##OWNER= she
$$ F:/spectra/data/she/nmr/H-F/1/audita.txt
$$ ##AUDIT TRAIL=  $$ (NUMBER, WHEN, WHO, WHERE, WHAT)
(   1,<2021-09-02 12:12:53.84 +0400>,<she>,<DPX200>,
      <created by zg, POWCHK disabled, PULCHK disabled
       configuration hash MD5:
       00 E9 B6 7A A2 85 ED C7 34 08 36 98 17 FE 4E 26
       data hash MD5: 16K
       CE A6 9F F8 0E 86 9C 83 96 63 73 7D B0 A1 80 12>)
$$ ##END=
$$ 
$$ hash MD5
$$ CB E5 EE F6 E2 E5 5C BF 91 36 34 76 E9 76 23 C2
##$RELAX= 
##$RELAX= 
##$RELAX= 
##$RELAX= 
##$RELAX= 
##$RELAX= 
$$ Bruker specific parameters
$$ --------------------------
##$DU= <F:/spectra>
##$EXPNO= 1
##$NAME= <H-F>
##$PROCNO= 1
##$TYPE= <nmr>
##$USER= <she>
##$AMP= (0..31)
100 100 100 100 100 100 100 100 100 100 100 100 100 100 100 100 100 100 
100 100 100 100 100 100 100 100 100 100 100 100 100 100 
##$AQSEQ= 0
##$AQ_mod= 1
##$AUNM= <au_zg>
##$AUTOPOS= <>
##$BF1= 200.13
##$BF2= 200.13
##$BF3= 200.13
##$BF4= 200.13
##$BF5= 200.13
##$BF6= 200.13
##$BF7= 200.13
##$BF8= 200.13
##$BYTORDA= 1
##$CFDGTYP= 0
##$CFRGTYP= 5
##$CHEMSTR= <none>
##$CNST= (0..31)
1 1 145 1 1 1 1 1 1 1 1 1 1 1 1 1 1 1 1 1 1 1 1 1 1 1 1 1 1 1 1 1 
##$CPDPRG= <>
##$CPDPRG1= <>
##$CPDPRG2= <>
##$CPDPRG3= <>
##$CPDPRG4= <mlev>
##$CPDPRG5= <mlev>
##$CPDPRG6= <mlev>
##$CPDPRG7= <mlev>
##$CPDPRG8= <mlev>
##$CPDPRGB= <>
##$CPDPRGT= <>
##$D= (0..31)
0 1.2 0 0 0 0 0 0 0 0.06 0 0.03 0 0 0 0 0.0002 0 0 0 0 0 0 0 0 0 0 0 0 
0 0 0 
##$DATE= 1630570373
##$DBL= (0..7)
120 120 120 120 120 120 120 120 
##$DBP= (0..7)
150 150 150 150 150 150 150 150 
##$DBP07= 0
##$DBPNAM0= <>
##$DBPNAM1= <>
##$DBPNAM2= <>
##$DBPNAM3= <>
##$DBPNAM4= <>
##$DBPNAM5= <>
##$DBPNAM6= <>
##$DBPNAM7= <>
##$DBPOAL= (0..7)
0.5 0.5 0.5 0.5 0.5 0.5 0.5 0.5 
##$DBPOFFS= (0..7)
0 0 0 0 0 0 0 0 
##$DE= 6
##$DECBNUC= <off>
##$DECIM= 32
##$DECNUC= <off>
##$DECSTAT= 4
##$DIGMOD= 1
##$DIGTYP= 9
##$DL= (0..7)
0 120 120 120 120 120 120 120 
##$DP= (0..7)
150 150 150 150 150 150 150 150 
##$DP07= 0
##$DPNAME0= <>
##$DPNAME1= <>
##$DPNAME2= <>
##$DPNAME3= <>
##$DPNAME4= <>
##$DPNAME5= <>
##$DPNAME6= <>
##$DPNAME7= <>
##$DPOAL= (0..7)
0.5 0.5 0.5 0.5 0.5 0.5 0.5 0.5 
##$DPOFFS= (0..7)
0 0 0 0 0 0 0 0 
##$DQDMODE= 0
##$DR= 18
##$DS= 0
##$DSLIST= <SSSSSSSSSSSSSSS>
$$ [...]
##$SUBNAM2= <"">
##$SUBNAM3= <"">
##$SUBNAM4= <"">
##$SUBNAM5= <"">
##$SUBNAM6= <"">
##$SUBNAM7= <"">
##$SUBNAM8= <"">
##$SUBNAM9= <"">
##$SW= 20.0189188712717
##$SWIBOX= (0..15)
0 0 2 0 0 0 0 0 0 0 0 0 0 0 0 0 
##$SW_h= 4006.41025641026
##$TD= 16384
##$TD0= 1
##$TE= 0
##$TE2= 300
##$TE3= 300
##$TEG= 300
##$TL= (0..7)
0 120 120 120 120 120 120 120 
##$TP= (0..7)
150 150 150 150 150 150 150 150 
##$TP07= 0
##$TPNAME0= <>
##$TPNAME1= <>
##$TPNAME2= <>
##$TPNAME3= <>
##$TPNAME4= <>
##$TPNAME5= <>
##$TPNAME6= <>
##$TPNAME7= <>
##$TPOAL= (0..7)
0.5 0.5 0.5 0.5 0.5 0.5 0.5 0.5 
##$TPOFFS= (0..7)
0 0 0 0 0 0 0 0 
##$TUNHIN= 0
##$TUNHOUT= 0
##$TUNXOUT= 0
##$USERA1= <user>
##$USERA2= <user>
##$USERA3= <user>
##$USERA4= <user>
##$USERA5= <user>
##$V9= 5
##$VALIST= <valist>
##$VCLIST= <CCCCCCCCCCCCCCC>
##$VD= 0
##$VDLIST= <DDDDDDDDDDDDDDD>
##$VPLIST= <PPPPPPPPPPPPPPP>
##$VTLIST= <TTTTTTTTTTTTTTT>
##$WBST= 1024
##$WBSW= 4
##$XGAIN= (0..3)
0 0 0 0 
##$XL= 0
##$YL= 0
##$YMAX_a= 272861
##$YMIN_a= -253606
##$ZGOPTNS= <>
##$ZL1= 120
##$ZL2= 120
##$ZL3= 120
##$ZL4= 120
##$ABSF1= 10
##$ABSF2= 0
##$ABSG= 5
##$ABSL= 3
##$ALPHA= 0
##$AQORDER= 0
##$ASSFAC= 0
##$ASSFACI= 0
##$ASSFACX= 0
##$ASSWID= 0
##$AUNMP= <proc_1d>
##$AZFE= 0.1
##$AZFW= 0.1
##$BCFW= 1
##$BC_mod= 2
##$BYTORDP= 1
##$COROFFS= 0
##$CY= 11.3945322036743
##$DATMOD= 1
##$DC= 2
##$DFILT= <>
##$DTYPP= 0
##$F1P= 2.36226072786647
##$F2P= -0.459571619588291
##$FCOR= 0.5
##$FTSIZE= 0
##$FT_mod= 4
##$GAMMA= 1
##$GB= 0.15
##$INTBC= 1
##$INTSCL= 1
##$ISEN= 128
##$LB= 0.24
##$LEV0= 0
##$LPBIN= 0
##$MAXI= 10000
##$MC2= 0
##$MEAN= 0
##$ME_mod= 0
##$MI= 1.114404
##$NCOEF= 0
##$NC_proc= 0
##$NLEV= 6
##$NOISF1= 3.799351
##$NOISF2= 2.8
##$NSP= 1
##$NTH_PI= 0
##$NZP= 0
##$OFFSET= 15.70392
##$PC= 1
##$PHC0= -13360.77
##$PHC1= 19.40097
##$PH_mod= 1
##$PKNL= yes
##$PPARMOD= 0
##$PSCAL= 0
##$PSIGN= 0
##$REVERSE= no
##$SF= 200.130013532006
##$SI= 16384
##$SIGF1= 3
##$SIGF2= 2
##$SINO= 400
##$SIOLD= 16384
##$SREGLST= <1H.CDCl3>
##$SSB= 0
##$STSI= 0
##$STSR= 0
##$SW_p= 3612.71676300578
##$SYMM= 0
##$S_DEV= 0
##$TDeff= 0
##$TDoff= 0
##$TI= <>
##$TILT= no
##$TM1= 0
##$TM2= 0
##$TOPLEV= 0
##$USERP1= <user>
##$USERP2= <user>
##$USERP3= <user>
##$USERP4= <user>
##$USERP5= <user>
##$WDW= 1
##$XDIM= 8192
##$YMAX_p= 0
##$YMIN_p= 0
$$ End of Bruker specific parameters
$$ ---------------------------------
##NTUPLES= NMR FID
##VAR_NAME=  TIME,          FID/REAL,        FID/IMAG
##SYMBOL=    X,             R,               I
##VAR_TYPE=  INDEPENDENT,   DEPENDENT,       DEPENDENT
##VAR_FORM=  AFFN,          ASDF,            ASDF
##VAR_DIM=   8192,          8192,            8192
##UNITS=     SECONDS,       ARBITRARY UNITS, ARBITRARY UNITS
##FACTOR=    0.0002496,     1,               1
##FIRST=     0,             0,               0
##LAST=      2.0444736,     0,               0
##MIN=       0,             -253606,         0
##MAX=       2.0444736,     272861,          0
$$ Real data points
##PAGE= N=1
##DATA TABLE= (X++(R..R)), XYDATA
$$ plain form
0 0 0 0 0 0 0 0 0 0 0 0 0 8 -8 8 -8 16 -16 17 -24 32 -32 40 -48 56 -65 80 -89 105 -121 137 -160 181 -205
33 -205 233 -264 295 -332 372 -416 463 -517 573 -636 705 -780 861 -950 1046 -1156 1271 -1402
51 -1402 1544 -1703 1879 -2075 2299 -2551 2842 -3181 3581 -4059 4648 -5392 6365 -7698 9646
66 9646 -12782 18680 -33764 163152 272861 56364 -14117 -83420 -13188 72413 110825 39177
78 39177 -56086 -162814 -191205 -170772 -111901 -62917 -52961 -111408 -168475 -212467 -216197 -161879
90 -161879 -70516 -16595 -4511 -38220 -91427 -105093 -39168 57976 142037 170124 122199 45620
102 45620 20655 54892 125089 195609 210776 154980 80149 30445 33054 76243 109289 108045
114 108045 74063 385 -68939 -87699 -81473 -67074 -39966 -42968 -88632 -136657 -170349 -170617 -121072
$$ packed form
0@%%%%%%%%%%%Qj6J6j6K4l2L3m1N6o4P2q8J04j21J45j69J94k26K58k97L41l86
33b05M38m97N59o27P04p88Q79r80J090j209J341j485J641j811J996k202K427k673
51a402K946l247L582l954M374m850N393o023O762p640Q707j0040J1757j4063J7344
66I646k2428L1462n2444J96916J09709k16497p0481o9303P0232Q5601L8412p1648
78C9177r5263j06728k8391K0433N8871M8984R956n8447n7067m3992l730N4318
90a61879R1363N3921J2084l3709n3207j3666O5925R7144Q4061K8087m7925p6579
102D5620k4965L4237P0197P0520J5167n5796p4831m9704K609M3189L3046j244
114A08045l3982p3678o9324j8760O226J4399K7108l002m5664m8025l3692k68M9545
$$ plain form
127 -121072 -61629 -33698 -42216 -84314 -121976 -107387 -49224 20438 69055 65753 25870 -1581
139 -1581 7578 52237 113139 145504 132405 99134 66825 51507 67104 93183 100749 88599 62885
152 62885 23969 -7262 -19187 -17675 -7432 -3415 -20205 -49794 -82320 -108689 -106191 -78810 -57348
165 -57348 -51722 -63561 -93300 -108026 -88604 -51030 -11217 10642 1570 -15830 -18329 -5513 27223
178 27223 63136 76253 71318 61557 48754 47163 61556 75344 83317 82108 64926 41992 25031
191 25031 13668 15084 25428 24348 6989 -19384 -48292 -63144 -54482 -38702 -31586 -38142 -60379
204 -60379 -82233 -83309 -67442 -45753 -26883 -25105 -36508 -41105 -34595 -18083 6639 24107 28588
217 28588 30324 29221 29433 38933 49557 55971 63519 64029 54036 44210 36267 30882 34674 39834 34181
$$ packed form
127a21072N9443K7931q518m2098l7662J4589N8163O9662M8617l302l9883k7451
139a581R159M4659O0902L2365j3099l3271l2309j5318J5597K6079P566j2150k5714
152F2885l8916l1231j1925J512J0243M017j6790k9589l2526k6369K498K7381K1462
165e7348N626j1839k9739j4726J9422L7574L9813K1859r072j7400k499J2816L2736
178B7223L5913J3117m935r761j2803j591J4393J3788P973j209j7182k2934j6961
191B5031j1363J416J0344j080j7359k6373k8908j4852Q662J5780P116o556k2237
204f0379k1854j076J5867K1689J8870J778j1403m597O510J6512K4722J7468M481
217B8588J736j103K12R500J0624O414P548N10r993r826p943n385L792N160n653
$$ plain form
232 34181 21963 2292 -17015 -22533 -19214 -15650 -15850 -27077 -46467 -57809 -57105 -50325 -38850 -32711
246 -32711 -37656 -43051 -42757 -38295 -26595 -11697 -2868 2533 6438 7588 10457 17981 26555 36347 44442
261 44442 44502 40972 36443 31518 33305 40846 42338 37124 27248 12180 1858 2099 4768 4496 -1082
276 -1082 -14706 -28207 -34334 -34297 -29874 -25915 -28908 -35094 -38437 -40213 -36158 -26868 -20784 -17123 -12363
291 -12363 -11091 -9473 -3510 2932 9933 18938 24282 24679 24193 22554 23098 29154 34458 35801 33066 24958
307 24958 16552 14296 14910 15341 15062 8864 -2613 -9716 -13707 -15620 -13637 -14182 -19082 -23855 -27406 -29976
323 -29976 -28423 -24671 -21597 -18047 -16518 -18167 -17024 -13886 -9735 -1905 6263 8278 9010 8812 8087 12229
339 12229 19966 24622 26099 24008 18253 15168 16864 18945 20909 19922 13068 6279 2328 -676 -803
$$ packed form
232C4181j2218j9671j9307n518L319L564k00j1227j9390j1342P04O780J1475O139
246c2711m945n395K94M462J1700J4898Q829N401L905J150K869P524Q574R792Q095
261D4442O0l530m529m925J787P541J492n214r876j5068j0322K41K669k72n578
276a082j3624j3501o127L7M423L959k993o186l343j776M055R290O084L661M760
291a2363J272J618N963O442P001R005N344L97m86j639N44O056N304J343k735q108
307B4958q406k256O14M31k79o198j1477p103l991j913J983n45m900m773l551k570
323b9976J553L752L074L550J529j649J143L138M151P830Q168K015P32j98p25M142
339A2229P737M656J477k091n755l085J696K081J964r87o854o789l951l004j27
$$ plain form
354 -803 316 -2790 -7090 -11179 -16398 -18950 -18209 -17627 -16252 -15088 -16712 -18685 -18787 -18126 -14755 -8337
370 -8337 -4676 -3621 -2629 -3656 -2267 3433 8822 12888 15537 13675 11079 12304 14583 16731 19427
385 19427 19013 14947 11905 8813 6899 7815 6964 5209 2957 -1635 -6689 -8345 -9487 -10488 -8911 -9835
401 -9835 -13410 -15853 -17345 -17548 -14323 -10473 -8892 -8600 -9620 -10534 -7627 -2787 1212 4773 6209 4776
417 4776 5377 7193 9119 12806 15376 14606 13435 11814 9838 9787 10965 10466 9310 7035 3149 44
433 44 -1965 -3613 -3375 -2869 -5303 -8284 -10916 -13562 -13087 -10882 -9713 -9223 -9122 -11307 -11856 -9246 -6147
450 -6147 -3098 -184 338 -193 642 2037 4724 7837 9283 10114 10365 8554 7762 8558 9218 9422 10060 8765
468 8765 5234 3063 1322 729 1183 726 -1063 -2790 -6239 -8031 -7690 -7086 -6403 -6090 -7180 -9183 -9091
$$ packed form
354h03J119l106m300m089n219k552P41N82J375J164j624j973j02O61L371O418
370h337L661J055R92j027J389N700N389M066K649j862k596J225K279K148K696
385A9427m14m066l042l092j914R16q51j755k252m592n054j656j142j001J577r24
401i835l575k443j492k03L225L850J581K92j020r14K907M840L999L561J436j433
417D776O01J816J926L687K570p70j171j621j976n1J178m99j156k275l886l105
433D4k009j648K38N06k434k981k632k646M75K205J169M90J01k185n49K610L099
450f147L049K914N22n31Q35J395K687L113J446Q31K51j811p92P96O60K04O38j295
468H765l531k171j741n93M54m57j789j727l449j792L41O04O83L13j090k003R2
$$ plain form
485 -9091 -8218 -6633 -4296 -2834 -2754 -2210 -2199 -1805 286 2967 4142 5575 5838 4757 4786 5271 6000 7341
503 7341 7792 6533 5754 4242 2149 2909 3628 2698 1633 605 -1775 -3374 -3145 -3156 -2358 -3034 -4182 -5198
521 -5198 -5886 -6459 -5177 -3639 -3672 -3345 -3053 -3769 -3517 -2178 -1155 -25 1780 1437 1399 1643 1679 2911 4634
540 4634 4978 4970 4883 3509 2893 3238 3621 4021 4174 2576 998 790 -243 -686 -96 -67 -1421 -1968 -2884 -4076
560 -4076 -3400 -3666 -2613 -2633 -3627 -4042 -3825 -4066 -3003 -1512 -977 -858 -453 -264 -698 356 1694 2605 3123
579 3123 3238 2690 2921 2884 3255 3997 3978 3096 3065 1977 1175 1543 1346 518 772 5 -1352 -2122 -2246 -3075
599 -3075 -2864 -1920 -2853 -3283 -3916 -4100 -3370 -2628 -1908 -999 -1328 -1707 -1089 -615 -304 1313 2640 1953 1986 2287
619 2287 1789 2022 3368 3082 3684 3223 2168 1492 1028 1081 1465 1350 446 -217 -1297 -2273 -2193 -1627 -1799 -1568
$$ packed form
485i091Q73J585K337J462Q0N44J1L94K091K681J175J433K63j081K9M85P29J341
503G341M51j259p79j512k093P60P19r30j065j028k380j599K29j1P98o76j148j016
521e198o88n73J282J538l3L27K92p16K52J339J023J130J805l43l8K44L6J232J723
540D634L44qq7j374o16L45L83M00J53j598j578k08j033m43N90K9j354n47r16j192
560d076O76k66J053k0r94m15K17k41J063J491N35J19M05J89m34J054J338R11N18
579C123J15n48K31l7L71P42j9q82l1j088q02L68j97q28K54p67j357p70j24q29
599c075K11R44r33m30o33j84P30P42P20R09l29l79O18M74L11J617J327o87L3L01
619B287m98K33J346k86O02m61j055o76m64N3L84j15r04o63j080r76Q0N66j72K31
$$ plain form
639 -1568 -1316 -2678 -3511 -2377 -2157 -1832 -303 -508 -1234 -1068 -1120 -677 478 1319 1981 1821 1475 833 1591
658 1591 1404 1953 2998 2750 1220 1070 503 -401 952 1443 403 200 -1025 -1955 -1880 -1467 -1225 -634 -583
677 -583 -1624 -1736 -2064 -1928 -639 265 457 -13 -325 -1309 -495 849 1237 1784 1817 602 211 597 375
696 375 1280 2103 1617 1054 124 -923 -426 291 408 515 567 -1061 -2126 -1488 -1056 -350 274 -149 -763 -1502
716 -1502 -1878 -1222 182 643 700 715 -638 -919 -420 243 1400 2067 1615 218 -392 -594 -4 1558 2120
735 2120 1543 704 -435 -700 -550 185 854 1131 306 -942 -1385 -1620 -1033 733 933 -73 -772 -1897
753 -1897 -2075 -956 43 658 564 -60 -914 -1264 -1306 -425 903 1256 829 409 -816 -1096 493 1262 2188
772 2188 1973 1098 -190 -520 10 930 1794 1800 843 -279 -1017 -1031 -90 703 836 497 -834 -2277 -2429 -1695
$$ packed form
639a568K52j362q33J134K20L25J529k05p26J66n2M43J155Q41O62j60l46o42P58
658A591j87N49J045k48j530j50n67r04J353M91j040k03j225r30P5M13K42N91N1
677e83j041j12l28J36J289R04J92m70l12r84Q14J344L88N47L3j215l91L86k22
696C75R05Q23m86n63r30j047M97P17J17J07N2j628j065O38M32P06O24m23o14p39
716a502l76O56J404M61N7J5j353k81M99O63J157O67m52j397o10k02N90J562N62
735B120n77q39j139k65J50P35O69K77q25j248m43k35N87J766K00j006o99j125
753a897j78J119R99O15r4o24q54l50m2Q81J328L53m27m20j225k80J589P69R26
772B188k15q75j288l30N30R20Q64Or57j122p38j4R41P93J33l39j331j443j52P34
$$ plain form
792 -1695 -862 77 142 -1442 -2554 -2201 -1914 -994 582 990 252 -368 -1159 -822 464 1637 2791 2589
810 2589 1056 487 639 932 2157 3100 2682 1378 455 -571 -601 777 1401 1168 19 -1616 -2511 -2699
828 -2699 -2138 -1073 -574 -901 -2095 -2693 -3606 -2777 -824 203 19 -94 -884 -1838 -885 820 2181 2828
846 2828 2513 1404 789 511 1599 3080 3724 3376 2317 1006 -145 221 1182 1320 1514 296 -1530
863 -1530 -2442 -2760 -1894 -1154 -752 -1177 -2627 -3881 -3899 -2874 -1243 -648 -212 -839 -1950 -2083 -1196 39
881 39 1551 2657 2044 1132 536 816 1779 3124 3913 3524 2335 1056 534 938 1480 2396 2034 456 -875
900 -875 -1572 -1955 -1490 -427 -281 -1128 -2296 -3357 -3548 -2602 -1506 -826 -645 -1614 -2141 -2367 -1632 -531 1096
919 1096 1465 921 391 -441 -82 1587 2808 3078 3194 1794 916 587 1332 2387 3020 2876 1143 132
$$ packed form
792a695Q33R39O5j584j112L53K87R20J576M08p38o20p91L37J286J173J154k02
810B589j533n69J52K93J225R43m18j304r23j026l0J378O24k33j149j635q95j88
828b699N61J065M99l27j194n98r13Q29J953J027j84j13p90r54R53J705J361O47
846B828l15j109o15k78J088J481O44l48j059j311j151L66R61J38J94j218j826
863a530r12l18Q66P40M02m25j450j254j8J025J631N95M36o27j111j33Q87J235
881C9J512J106o13r12n96K80R63J345P89l89j189j279n22M04N42R16l62j578j331
900h75o97l83M65J063J46q47j168j061j91R46J096O80J81r69n27k26P35J101J627
919A096L69n44n30q32L59J669J221K70J16j400q78l29P45J055O33j44j733j011
$$ plain form
937 132 -527 -829 119 781 427 -212 -1601 -2746 -2741 -1860 -1180 -299 -946 -2130 -2993 -3083 -2551 -1430 -230 121
957 121 -169 -1536 -1581 -955 492 1550 2279 1913 833 355 730 1402 2809 3593 2830 2108 1130 692 931
976 931 1660 2162 2188 1088 -564 -1360 -1599 -1068 -264 -279 -915 -2179 -2876 -3523 -2822 -1665 -1245 -1396 -1694 -2761
996 -2761 -2878 -1994 -744 389 977 725 540 -54 227 1345 2878 3647 3334 2574 1640 1088 2064 2923 3073
1015 3073 2967 1992 250 -107 -691 -140 462 527 -766 -1939 -2971 -3347 -2835 -1994 -1566 -1605 -2450 -3701 -3483
1034 -3483 -2562 -1436 -339 72 -205 -848 -1109 -360 960 2195 2640 2522 2138 1264 1552 2146 2962 3475
1052 3475 3603 2195 1172 564 356 943 1524 1241 19 -1133 -1972 -2478 -2031 -1303 -788 -1636 -2529 -3176
1070 -3176 -3435 -2931 -1910 -499 -1131 -1227 -1578 -1978 -1247 148 1125 1720 1622 951 736 923 1578 2391 3160
$$ packed form
937A32o59l02R48O62l54o39j389j145NQ81O80Q81o47j184q63r0N32J121J200L51
957A21k90j367m5O26J447J058P29l66j080m78L75O72J407P84p63p22r78m38K39
976I31P29N02K6j100j652p96k39N31Q04j5o36j264o97o47P01J157M20j51k98j067
996b761j17Q84J250J133N88k52j85n94K81J118J533P69l13p60r34n52R76Q59J50
1015C073j06r75j742l57n84N51O02O5j293j173j032l76N12Q41M28l9q45j251K18
1034c483R21J126J097M11k77o43k61P49J320J235M45j18l84q74K88N94Q16N13
1052C475J28j408j023o08k08N87N81k83j222j152q39n06M47P28N15q48q93o47
1070c176k59N04J021J411o32r6l51m00P31J395R77N95r8o71k15J87O55Q13P69
$$ plain form
1089 3160 2936 2122 1446 814 1370 1695 1960 2149 895 32 -993 -770 -526 -72 -27 -618 -1720 -2262 -2861
1108 -2861 -2367 -1491 -1055 -1043 -1491 -2357 -2241 -2150 -1151 -111 472 -40 -254 -716 -296 365 1378 2230 1976 1133
1128 1133 1158 851 1390 2155 2767 2416 1903 600 603 437 595 1429 1397 170 -502 -1273 -1507 -1526 -822 -607 -1124
1149 -1124 -1719 -2414 -2707 -2368 -1877 -1115 -695 -1333 -1626 -1801 -1633 -498 744 980 990 656 527 413 1110
1168 1110 2231 2579 3112 2295 1598 1281 1374 1801 2354 2294 1548 427 -317 -731 -482 -64 -20 -516 -1408 -2325
1188 -2325 -2633 -2487 -1932 -1483 -1521 -1750 -2543 -2734 -2391 -1414 -482 17 254 -41 -307 246 685 1604 2353 2231
1208 2231 1477 1498 1503 1665 2266 2655 2588 1941 1300 645 487 460 594 218 224 -973 -1561 -2040 -1771 -1277 -1412 -1538
1230 -1538 -1881 -2179 -2526 -2413 -2005 -899 -829 -930 -1013 -1190 -643 -242 961 1334 1481 1320 972 979 1240 2104
$$ packed form
1089C160k24q14o76o32N56L25K65J89j254q63j025K23K44M54M5n91j102n42n99
1108b861M94Q76M36J2m48q66J16R1R99J040N83n12k14m62M20O61J013Q52k54q43
1128A133K5l07N39P65O12l51n13j303Lj66J58Q34l2j227o72p71k34j9P04K15n17
1149a124n95o95k93L39M91P62M20o38k93j75J68J135J242K36J0l34j29j14O97
1168A110J121L48N33q17o97l17R3M27N53o0p46j121p44m14K49M18M4m96q92r17
1188b325l08J46N55M49l8k29p93j91L43R77R32M99K37k95k66N53M39R19P49j22
1208B231p54K1NJ62O01L89o7o47o41o55j58k7J34l76Oj197n88m79K69M94j35j26
1230a538l43k98l47J13M08J106P0j01q3j77N47M01J203L73J47j61l48PK61Q64
$$ plain form
1250 2104 2330 2361 2101 1511 855 752 1289 1183 1200 934 -86 -852 -1123 -1023 -807 -475 -794 -1431 -1767 -1806
1270 -1806 -2265 -1565 -1068 -990 -1153 -1779 -1496 -1143 -771 -24 632 560 228 144 240 590 1367 1813 1713 1578 1242
1291 1242 1190 1176 1184 1709 1705 1379 697 181 -200 94 313 83 -121 -572 -1035 -1476 -1385 -1357 -1019 -1055 -1158 -1371 -1870
1314 -1870 -1582 -867 -545 -461 -598 -421 -761 -671 -172 450 947 1144 990 649 674 691 1243 1765 1893 1786 1336
1335 1336 672 661 1008 1163 1079 1186 542 -361 -520 -334 -500 -407 -449 -1069 -1680 -1629 -1787 -1847 -1247 -1009 -939 -1497
1357 -1497 -1431 -1416 -911 -547 439 507 169 412 432 524 1148 1528 1643 1482 1387 1222 929 1431 1174 1700 1248 1147
1379 1147 568 7 90 194 169 -268 -689 -1086 -1443 -1515 -1505 -1046 -1356 -1054 -1523 -1720 -1910 -1384 -824 -471 -144
1400 -144 -96 -124 -391 3 560 916 1668 1404 794 639 899 1116 1613 1627 1302 814 472 619 488 425 412 486
$$ packed form
1250B104K26L1k60n90o56j03N37j06J7k66j020p66k71J00K16L32l19o37l36l9
1270a806m59P00M97P8j63o26K83L53L72P47O56p2l32q4R6L50P77M46j00j35l36
1291A242n2j4QN25ml26o82n16l81K94K19k30k04m51m63m41R1K8L38l6j03k13m99
1314a870K88P15L22Q4j37J77l40R0M99O22M97J97j54l41K5J7N52N22J28j07m50
1335A336o64j1L47J55q4J07o44r03j59J86j66R3m2o20o11N1j58o0O00K38P0n58
1357a497O6J5N05L64R86O8l38K43K0R2O24L80J15j61r5j65k93N02k57N26m52j01
1379A147n79n61Q3J04k5m37m21l97l57p2J0M59l10L02m69j97j90N26N60L53L27
1400a44M8k8k67L94N57L56P52k64o10j55K60K17M97J4l25m88l42J47j31o3j3P4
$$ plain form
1422 486 329 -591 -839 -1028 -717 -366 -829 -899 -1040 -1694 -1418 -1362 -622 -610 -336 -564 -685 -648 -500 -163 171
1443 171 618 723 802 678 201 749 1004 1218 1250 1113 397 455 515 670 897 837 698 106 -310 -368 -384 15
1465 15 -89 -35 -434 -954 -885 -960 -947 -256 -426 -598 -922 -1239 -868 -451 -127 -114 -7 -199 -354 -203 316 583
1487 583 836 939 904 365 447 431 380 1044 1095 637 300 184 96 472 485 572 339 14 -614 -561 -518 -474 -330 -303
1511 -303 -659 -934 -1013 -1122 -760 -797 -378 -514 -465 -739 -768 -316 -39 63 336 333 245 147 345 897 1077 944 848
1534 848 634 468 544 605 971 845 649 337 -99 -63 -199 49 103 -123 -463 -749 -1090 -777 -576 -601 -512 -905
1556 -905 -647 -971 -1150 -617 -298 -54 198 -108 -228 -167 177 378 656 616 798 228 378 575 726 772 891
1577 891 912 469 242 161 -61 380 365 18 -273 -335 -713 -409 -206 -384 -235 -490 -751 -875 -829 -610 -487 -187
$$ packed form
1422D86j57r20k48j89L11L51m63p0j41o54K76N6P40J2K74k28j21L7J48L37L34
1443A71M47J05P9j24m77N48K55K14L2j37p16N8O0J55K27o0j39n92m16n8j6L99
1465A5j04N4l99n20O9p5J3O91j70j72l24l17L71M17L24J3J07j92j55J51N19K67
1487E83K53J03l5n39Q2j6n1O64N1m58l37j16q8L76J3Q7k33l25o28N3M3M4J44K7
1511c03l56k75p9j09L62l7M19j36M9k74k9M52K77J02K73lq8r8J98N52J80j33r6
1534H48k14j66P6O1L66j26j96l12m36L6j36K48N4k26l40k86l41L13K01k5Q9l93
1556i05K58l24j79N33L19K44K52l06j20O1L44K01K78m0J82n70J50J97J51M6J19
1577H91K1m43k27q1k22M41j5l47k91o2l78L04K03j78J49k55k61j24M6K19J23L00
$$ plain form
1599 -187 -137 -424 -370 -474 -212 57 190 530 379 289 149 155 573 717 731 426 609 225 -73 389 502 405
1621 405 622 246 -82 -277 -414 -428 -45 351 -172 -259 -389 -488 -319 -230 -199 -217 -122 -201 -419 -411 -388 -29 154 -214
1645 -214 -338 -317 -195 -141 247 562 189 196 295 183 381 345 496 470 178 406 99 -83 265 522 250 360
1667 360 -153 -372 -251 -214 -37 -237 -209 -354 -411 -583 -537 -340 -65 -26 -431 -428 -264 -539 -229 -15 -59 -66 4 111
1691 111 -141 260 718 634 1018 548 66 26 61 545 560 637 483 145 154 9 288 62 52 104 48 -251 -657
1714 -657 -380 -344 -220 23 -339 -575 -432 -318 -452 -335 76 -253 -64 -338 -128 261 372 724 529 329
1734 329 207 350 107 471 624 517 307 417 -52 3 275 83 461 38 -213 -5 -395 -307 -115 -46 -232
1755 -232 -281 -450 -493 -413 163 105 -192 -232 -139 -297 -74 14 202 88 245 300 -157 94 76 422 539 496 12
$$ packed form
1599a87N0k87N4j04K62K69J33L40j51r0j40OM18J44J4l05J83l84k98M62J13r7
1621D05K17l76l28j95j37j4L83L96n23q7j30r9J69Q9L1j8R5p9k18QK3L59J83l68
1645b14j24K1J22N4L88L15l73PR9j12J98l6J51k6k92K28l07j82L48K57k72J10
1667C60n13k19J21L7J77k00K8j45n7j72M6J97K75L9m05LJ64k75L10K14m4pP0J07
1691A11k52M01M58q4L84m70m82m0L5M84J5P7j54l38Rj45K79k26j0N2n6k99m06
1714f57K77L6J24K43l62k36J43J14j34J17M11l29J89k74K10L89J11L52j95k00
1734C29j22J43k43L64J53j07k10J10m69N5K72j92L78m23k51K08l90Q8J92O9j86
1755b32m9j69m3Q0N76n8k97m0R3j58K23Q8J88j14J57N5m57K51j8L46J17m3m84
$$ plain form
1778 12 296 34 -12 48 402 176 233 44 -185 7 -118 16 273 372 -5 -372 -138 -142 -216 31 385 46 -25
1801 -25 -114 -366 -495 202 251 -30 -125 -198 -145 -69 -105 321 270 94 234 -161 2 12 229 455 -62 134 112 53
1825 53 181 344 156 69 366 -3 -176 -179 24 264 131 184 -268 -229 -556 -58 109 142 -90 -76 -270 -295 -112
1848 -112 -218 57 130 211 229 -37 -144 79 253 217 581 329 -83 394 60 386 250 172 199 -89 -107 -342
1870 -342 567 215 136 44 -306 -391 -558 -230 -93 80 -16 -227 -334 -292 -374 -23 175 51 -132 -202 -118 275 -160
1893 -160 451 118 131 164 217 18 135 316 390 430 243 -80 46 18 7 372 338 71 -57 -3 -139 76 -320
1916 -320 -94 34 -73 -133 -515 -167 5 143 95 -346 -238 -53 6 151 392 210 -12 -33 -71 -83 173 76
1938 76 244 79 9 225 -12 289 336 488 19 387 -97 -25 -99 -137 224 -152 63 -1 -348 -147 -181 235 92
$$ packed form
1778A2K84k62m6O0L54k26N7j89k29J92j25J34K57R9l77l67K34mp4K47L54l39p1
1801b5q9k52j29O97M9k81r5p3N3P6l6M26n1j76J40l95J63J0K17K26n17J96k2n9
1825E3J28J63j88q7K97l69j73lK03K40j33N3m52L9l27M98J67L3k32J4j94k5J83
1848a12j06K75P3Q1J8k66j07K23J74l6L64k52m12M77l34L26j36p8K7k88j8k35
1870c42R09l52p9r2l50q5j67L28J37J73r6k11j07M2q2L51J98j24j83p0Q4L93m35
1893a60O11l33J3L3N3j99J17J81P4M0j87l23J26k8j1L65l4k67j28N4j36K15l96
1916c20K26J28j07o0l82L48J72J38m8m41J08J85N9J45K41j82k22k1l8j2K56r7
1938G6J68j65p0K16k37L01M7J52m69L68m84P2p4l8L61l76K15o4l47K01l4M16j43
$$ plain form
1961 92 25 -306 -109 -233 24 -122 139 292 -60 -120 -28 -162 92 95 265 421 117 148 -126 -202 238 29 355
1984 355 -79 27 25 19 19 134 125 205 -10 -2 -256 4 -200 -247 214 -157 -254 -467 -5 90 -207 121 -229 -261 -248
2009 -248 -171 123 152 191 231 106 -122 -175 -135 45 159 252 103 -227 -365 81 30 358 428 178 166 -34 107
2032 107 57 74 535 347 5 -244 51 69 -188 -8 -155 29 -127 -307 -218 -279 279 319 -298 -156 -48 -22
2054 -22 -20 -126 216 299 -120 154 52 -184 23 218 359 256 -10 -21 105 143 25 70 133 200 21 -241 -335
2077 -335 -136 -259 -154 -121 0 -98 -220 -57 -124 396 64 -63 -306 -57 -268 127 244 89 68 229 -67
2098 -67 -103 -121 125 115 222 189 -60 -113 147 278 -69 -4 -82 -144 -137 -29 -291 98 250 28 -54 -43 99 -113
2122 -113 -84 111 14 -51 19 39 -10 329 193 -44 -73 3 -230 -107 27 -3 110 19 212 14 -46 -246 68 -45
$$ packed form
1961I2o7l31J97j24K57j46K61J53l52o0R2j34K54LJ70J56l04L1k74p6M40k09L26
1984C55m34J06ko%J15rQ0k15Qk54K60k04m7M61l71r7k13M62R5k97L28l50l2J3
2009b48P7K94K9L9M0j25k28n3M0J80J14R3j49l30j38M46n1L28P0k50j2k00J41
2032A07n0J7M61j88l42k49K95J8k57J80j47J84j56j80Q9o1N58M0o17J42J08K6
2054b2Kj06L42Q3m19K74j02k36K07J95J41j03k66j1J26L8j18M5O3O7j79k62r4
2077c35J99j23J05L3J21r8j22J63o7N20l32j27k43K49k11L95J17j55k1J61k96
2098f7l6j8K46j0J07l3k49n3K60J31l47O5p8o2PJ08k62L89J52k22q2J1J42k12
2122a13K9J95r7o5P0K0m9L39j36k37k9P6k33J23J34l0J13r1J93j98o0k00L14j13
$$ plain form
2146 -45 -2 -211 -285 -368 175 63 -15 110 -77 -263 84 -244 -194 -108 80 224 -3 -215 4 70 55 -129 106
2169 106 10 -207 -203 -172 -40 8 -4 19 141 -86 -130 -57 -155 10 174 -74 -37 81 -100 48 141 -141 -50 209
2193 209 -37 112 61 -37 10 69 147 -101 -79 48 118 197 -30 44 221 -59 -158 51 -141 -106 -123 20 -209 -53
2217 -53 22 -139 158 -121 -186 -31 -181 -12 176 110 125 62 61 136 -21 -8 -120 119 28 138 -196 -43 -92 74
2241 74 -107 20 65 -49 -185 -52 -70 313 36 205 240 -145 58 -133 -52 121 201 226 -289 -179 35 33 22
2264 22 465 150 70 -34 -238 261 -117 -139 15 -42 -349 -45 -37 119 217 335 53 -147 44 146 101 196 288
2287 288 129 190 112 -16 264 -161 -11 -139 -36 -401 -58 24 149 12 -87 308 -145 -144 -254 32 -240 -71
2309 -71 39 73 153 -195 24 122 84 -189 -77 -145 124 255 97 202 125 34 9 244 66 -199 -263 6 227
$$ packed form
2146d5M3k09p4q3N43j12p8J25j87j86L47l28N0Q6J88J44k27k12K19O6j5j84K35
2169A06r6k17ML1J32M8j2K3J22k27m4P3r8J65J64k48L7J18j81J48R3k82R1K59
2193B09k46J49n1r8M7N9P8k48K2J27P0P9k27P4J77k80r9K09j92L5j7J43k29J56
2217e3P5j61K97k79o5J55j50J69J88o6J5o3jP5j57J3j12K39r1J10l34J53m9J66
2241G4j81J27M5j14j36J33j8L83k77J69L5l85K03j91Q1J73Q0K5n15J10K14kj1
2264B2M43l15q0j04k04M99l78k2J54n7l07L04QJ56R8J18k82k00J91J02m5R5R2
2287B88j59O1p8j28K80m25J50j28J03l65L43Q2J25j37r9L95m53Jj10K86k72J69
2309g1J10L4Q0l48K19R8l8k73J12o8K69J31j58J05p7r1k5K35j78k65o4K69K21
$$ plain form
2332 227 152 -123 2 37 -75 -187 -185 -235 -64 -356 -132 -183 -15 183 -105 11 -329 -97 -1 -19 174 -181 142
2355 142 207 -163 -148 -141 -95 80 -11 263 2 44 -40 190 23 166 -184 -107 -132 -94 -63 -157 -139 89 99 -392 -495
2380 -495 -222 -248 -265 20 -416 -121 -308 -120 207 -241 0 -315 -136 21 -119 66 111 -28 130 25 -86
2401 -86 -78 7 180 125 180 -131 364 -76 -291 -236 104 117 -115 -26 -219 -341 57 -109 39 -86 -258 -284 -298 28
2425 28 62 -151 35 -170 -142 -60 -191 -53 -132 140 209 -54 -12 -35 93 204 365 137 -41 208 -148 -80 96
2448 96 163 -40 -123 14 15 144 -83 -140 179 188 9 -91 47 -100 97 70 -310 -69 -141 -150 -113 -356 -153 -44
2472 -44 -57 -324 -285 -337 -43 75 16 115 118 63 -60 -52 325 -85 126 360 -20 -54 219 -105 19 -89 92 26
2496 26 -135 -353 -345 -265 -120 -87 -132 -138 -522 -113 -451 -64 83 22 274 -28 -132 88 180 112 119 -103 -5 227 -41
$$ packed form
2332B27p5k75J25L5j12j12Kn0J71k92K24n1J68J98k88J16l40K32R6j8J93l55L23
2355A42O5l70J5PM6J75r1K74k61M2q4K30j67J43l50P7k5L8L1r4J8K28J0m91j03
2380d95K73k6j7K85m36K95j87J88L27m48K41l15J79J57j40J85M5j39J58j05j11
2401h6QQ5J73n5N5l11M95m40k15N5L40J3k32Q9j93j22L98j66J48j25j72k6j4L26
2425B8L4k13J86k05K8Q2j31J38p9K72O9k63M2k3J28J11J61k28j78K49l56O8J76
2448I6O7k03q3J37JJ29k27n7L19Rj79j00J38j47J97k7l80K41p2rL7k43K03J09
2472d4j3k67L9n2K94J18n9R9Ln5j23QL77m10K11K34l80l4K73l24J24j08J81o6
2496B6j61k18QQ0J45L3m5ol84M09l38L87J47o1K52l02j04K20R2o8Pk22R8K32k68
$$ plain form
2521 -41 197 229 244 186 -96 98 143 216 186 415 135 -274 -109 -14 -14 -90 -7 -185 -52 -71 -119 36 55 -2 -140
2546 -140 -82 -179 -137 -108 -199 -203 122 13 -171 143 91 214 231 250 70 -21 12 64 159 -112 344 223 -45 112 -63
2571 -63 -206 -170 -102 -17 54 -367 -127 27 -141 -248 -50 -254 -44 -228 -277 -199 -110 -36 66 228 -10 -7 -130 -102
2595 -102 102 -130 -3 8 179 -18 115 347 206 9 296 -2 -118 126 21 236 96 232 49 72 -32
2616 -32 -465 -76 239 35 -216 -147 -343 112 -31 26 12 50 -100 -321 -261 -114 -96 -67 -6 -33 -104 -174 180 131
2640 131 16 100 230 86 -136 178 -90 142 298 19 -126 161 21 -105 175 316 -12 -149 47 7 -94
2661 -94 -143 -95 -28 -97 97 -415 -264 -325 56 -14 193 -4 -76 -209 224 18 -20 -94 245 -204 20 -44 103 204
2685 204 371 83 64 229 -101 193 157 309 234 -28 -206 87 -175 281 -8 -104 -120 -180 -170 -318 -85 -101 -172
$$ packed form
2521d1K38L2J5n8k82J94M5P3l0K29k80m09J65R5%p6Q3j78J33j9m8J55J9n7j38
2546a40N8r7M2K9r1mL25j09j84L14n2J23J7J9j80r1L3N2R5k71M56j21k68J57j75
2571f3j43L6O8Q5P1m21K40J54j68j07J98k04K10j84m9P8Q9P4J02J62k38Lj23K8
2595a02K04k32J27J1J71j97J33K32j41j97K87k98j16K44j05K15j40J36j83K3j04
2616c2m33L89L15k04k51O9j96M55j43N7j4L8j50k21O0J47J8K9O1k7p1p0L54m9
2640A31j15Q4J30j44k22L14k68K32J56k79j45K87j40j26K80J41l28j37J96m0j01
2661i4m9M8O7o9J94n12J51o1L81p0K07j97p2j33M33k06l8p4L39m49K24o4J47J01
2685B04J67k88j9J65l30K94l6J52p5k62j78K93k62M56k89r6j6o0J0j48K33j6p1
$$ plain form
2708 -172 219 -184 -1 -119 -207 176 -166 28 57 -191 -262 110 381 -133 36 2 251 -30 -138 14 81 400
2730 400 115 18 282 246 -26 -81 -91 -5 237 -199 -165 -75 44 -178 243 -140 89 -109 -348 52 -195 169
2752 169 30 81 109 202 28 31 96 319 235 248 54 0 140 187 179 168 -87 -153 99 151 -9 -17 133 65 209 -33
2778 -33 28 -66 198 0 192 -121 -48 16 -147 -39 103 -177 -88 -40 -184 -494 55 -28 37 -238 -85 -119 96
2801 96 65 38 -159 -66 46 104 327 106 -46 167 -37 -16 221 -208 -115 -34 -157 -43 -95 53 -36 110 -18
2824 -18 -123 -372 192 -9 29 -22 -66 -284 -244 211 -113 32 -303 -156 51 -81 -137 50 209 192 259 98 314
2847 314 83 15 264 -42 -43 123 235 116 128 -38 22 -55 10 -78 -135 143 -120 -114 132 -141 64 -68 207 -156
2871 -156 -230 -233 -97 -27 -3 106 48 217 114 -21 41 139 53 31 160 -169 -86 33 181 -46 346 -148 163 -45
$$ packed form
2708a72L91m03J83j18q8L83l42J94K9k48p1L72K71n14J69l4K49k81j08J52O7L19
2730D00k85r7K64l6k72n5j0Q6K42m36L4R0J19k22M21l83K29j98k39M00k47L64
2752A69j39N1K8R3j74LO5K23q4J3j94n4J40M7qj1k55o6K52N2j60qJ50o8J44k42
2778c3O1r4K64j98J92l13P3O4j63J08J42k80Q9M8j44l10N49q3O5k75J53l4K15
2801I6l1k7j97R3J12N8K23k21j52K13k04K1K37m29R3Q1j23J14n2J48q9J46j28
2824a8j05k49N64k01L8n1m4k18M0M55l24J45l35J47K07j32n6J87J59j7O7j61K16
2847C14k31o8K49l06jJ66J12j19J2j66O0p7O5q8n7K78k63OK46k73K05j32K75l63
2871a56p4lJ36P0K4J09n8J69j03j35O2R8q6k2J29l29Q3J19J48k27L92m94L11k08
$$ plain form
2895 -45 -72 70 -42 292 -143 282 -78 209 -61 -123 -7 -194 -104 -50 -221 -46 -163 -75 -54 176 156 -40 -184
2918 -184 29 43 64 18 -54 381 224 32 140 81 52 -98 -100 145 105 -132 168 62 123 -43 -187 237 78
2941 78 -203 -8 53 -32 -129 15 -50 -104 14 -79 -115 236 112 -175 173 128 94 -11 79 27 25 232 -72 141 -104
2966 -104 -19 128 3 123 108 155 -149 -48 60 -91 155 -87 228 137 158 110 -166 214 85 -100 -85 288
2988 288 24 -232 28 -74 73 -130 56 -123 -134 26 -45 116 -113 -57 -87 78 155 169 127 -16 198 148 -81
3011 -81 162 92 4 -82 -23 221 81 -1 162 -120 148 -134 180 -140 18 -158 -36 13 -145 110 75 -86 -330
3034 -330 168 38 -131 -135 -222 193 95 191 -2 -39 180 -96 146 150 8 76 -32 91 143 -195 26 87 -40 24
3058 24 -192 -179 85 66 -152 119 86 3 -368 -62 -144 -144 -222 35 95 -13 -234 -427 42 -228 9 -74 -97 93
$$ packed form
2895d5k7J42j12L34m35M25l60K87k70o2J16j87R0N4j71J75j17Q8K1K30k0j96j44
2918a84K13J4K1m6p2M35j57j92J08n9k9j50kK45m0k37L00j06O1j66j44M24j59
2941G8k81J95O1q5r7J44o5n4J18r3l6L51j24k87L48m5l4j05R0n2kK07l04K13k45
2966a04Q5J47j25J20j5M7l04J01J08j51K46k42L15r1K1m8k76L80j29j85J5L73
2988B88k64k56K60j02J47k03J86j79j1J60p1J61k29N6l0J65P7J4m2j43K14n0k29
3011h1K43p0q8q6N9K44j40q2J63k82K68k82L14l20J58j76J22M9j58K55l5j61k44
3034c30M98j30j69mq7M15r8R6j93l7K19k76K42Mj42O8j08J23N2l38K21O1j27O4
3058B4k16J3K64j9k18K71l3q3l71L06q2%p8K57O0j08k21j93M69k70K37q3k3J90
$$ plain form
3082 93 23 -2 35 88 99 -86 -49 -150 77 -288 121 -349 57 -25 11 -86 -102 80 81 71 58 51 204 -34 -40 176
3108 176 179 46 118 -184 15 140 109 -42 -151 116 -302 235 -253 186 -212 130 -73 -20 130 -253 238 -6
3130 -6 310 -8 -102 -51 -66 293 -44 10 -213 -244 44 -112 -76 -190 -12 172 -142 -172 -59 54 62 -243 9 6
3154 6 -2 71 191 90 -41 36 -144 19 -158 35 208 62 -230 -162 162 -115 42 -13 -182 80 355 -17 164
3177 164 -195 138 -25 194 -58 0 -42 99 -186 -70 -41 -51 -119 17 -54 -109 -211 100 -262 -51 2 -226 45
3200 45 -48 268 -264 52 -95 36 20 81 -76 253 292 276 -12 -79 -174 8 174 83 -12 -93 -145 -55 -58 188 86
3225 86 -148 -58 -110 76 -37 15 84 24 85 80 173 -92 -261 -157 -184 220 139 -63 159 132 -33 0 345 -240 -154
3250 -154 71 -133 402 82 137 -130 -67 6 -300 82 0 77 -94 -25 -457 -96 58 -143 127 -131 60 460
$$ packed form
3082I3p0k5L7N3J1j85L7j01K27l65M09m70M06q2L6r7j6J82Jj0j3pJ53k38oK16
3108A76Lj33P2l02J99J25l1j51j09K67m18N37m88M39l98L42k03N3J50l83M91k44
3130fL16l18r4N1j5L59l37N4k23l1K88j56L6j14J78J84l14l0J13J13Ql05K52l
3154FqP3J20j01j31P7j80J63j77J93J73j46k92O8L24k77J57n5j69K62K75l72J81
3177A64l59L33j63K19k52N8m2J41k85J16K9j0o8J36p1n5j02L11l62K11N3k28K71
3200D5r3L16n32L16j47J31j6O1j57L29L9j6k88o7r5J82J66r1r5q1n2R0lK46j02
3225H6k34R0n2J86j13N2O9o0O1nR3k65j69J04k7M04q1k02K22k7j65L3L45n85Q6
3250a54K25k04N35l20N5k67O3P3l06L82q2P7j71O9m32L61J54k01K70k58J91M00
$$ plain form
3272 460 -1 82 -241 40 355 -73 313 -32 70 -107 -95 -56 -236 25 24 119 113 4 -317 -178 80 -127 33
3295 33 -164 75 25 322 131 65 -276 -77 106 175 212 -149 -182 10 305 59 -270 96 -47 167 135 -72
3317 -72 -166 -56 -24 282 -20 41 -137 -152 -131 29 -145 138 -20 -244 -27 -3 333 -53 -91 -152 -9 -2 152 11
3341 11 -378 166 181 -64 81 172 -69 40 84 157 128 -7 37 61 -184 -139 -73 -8 47 -309 15 -122 -141 169
3365 169 -125 278 141 98 -107 -153 117 -28 325 17 -16 -94 35 57 -125 -65 -225 148 20 73 12 -96 16
3388 16 -1 -198 -156 113 54 7 87 -24 77 87 -63 38 -47 51 185 2 35 22 -117 167 -122 212 300 8
3412 8 123 109 97 18 -99 65 -106 67 257 20 -177 112 461 95 34 -15 169 -45 -171 106 8 114 -186
3435 -186 -116 158 -68 -239 40 207 47 24 50 -180 78 170 68 -45 -18 -128 -121 121 201 22 -101 -15 -17 140
$$ packed form
3272D60m61Q3l23K81L15m28L86l45J02j77J2L9j80K61jR5oj09l21J39K58k07J60
3295C3j97K39n0K97j91o6l41J99J83O9L7l61l3J92K95k46l29L66j43K14l2k07
3317g2r4J10L2L06l02O1j78j5K1J60j74K83j58k24K17K4L36l86l8o1J43PJ54j41
3341A1l89N44J5k45J45R1k41J09M4P3k9j35M4K4k45M5O6O5N5l56L24j37j9L10
3365A69k94M03j37m3k05m6K70j45L53l08l3p8J29K2j82O0j60L73j28N3o1j08J12
3388A6j7j97M2K69n9m7Q0j11J01J0j50J01q5R8J34j83L3j3j39K84k89L34Q8k92
3412HJ15j4j2p9j17J64j71J73J90k37j97K89L49l66o1m9J84k14j26K77r8J06l00
3435a86P0K74k26j71K79J67j60k3K6k30K58R2j02j13K7j10PK42Q0j79j23Q6kJ57
$$ plain form
3459 140 24 -81 -231 12 27 78 25 506 141 32 182 32 -49 -43 21 57 -135 75 68 -98 -137 -206 -121 70
3483 70 201 2 -47 -106 -115 -209 -2 22 -210 -107 -54 207 -151 29 -135 -146 -139 74 -39 41 190 168 -14 11 67
3508 67 -296 87 39 -68 -270 -71 241 -59 -131 -134 73 -57 -273 214 -117 217 16 -9 258 46 271 68
3530 68 408 -56 -179 -100 46 -5 -224 -76 -1 90 103 324 -13 43 297 -409 4 -190 -23 39 -202 105 8
3553 8 -343 -154 -355 -93 2 -214 -127 157 248 -88 -156 40 167 -37 161 17 69 40 27 34 160 62 19 286
3577 286 45 -36 -129 72 213 -154 12 -7 -45 8 97 52 37 -153 -132 -199 -49 16 242 13 155 -34 -88 -61
3601 -61 -63 72 27 -191 -136 63 -148 66 -147 207 -152 102 -64 -18 72 -61 133 -132 247 -9 -146 -6
3623 -6 260 9 -10 -80 136 109 -116 250 272 193 -93 -133 37 53 300 59 220 -157 -196 -62 122 37 -26 -91
$$ packed form
3459A40j16j05j50K43J5N1n3M81l65j09J50j50q1OO4L6j92K10pj66l9o9Q5J91
3483G0J31j99m9n9rr4K07K4k32J03N3K61l58J80j64j1PK13j13Q0J49k2j82K5N6
3508F7l63L83m8j07k02J99L12l00p2lK07j30k16M87l31L34k01k5K67k12K25k03
3530F8L40m64j23P9J46n1k19J48P5R1J3K21l37N6K54p06M13j94J67O2k41L07r7
3553Hl51J89k01K62R5k16Q7K84R1l36o8J96J27k04J98j44N2k9j3PJ26r8m3K67
3577B86k41q1r3K01J41l67J66j9l8N3Q9m5j5j90K1o7J50O5K26k29J42j89n4K7
3601f1kJ35m5k18N5J99k11K14k13L54l59K54j66M6R0j33J94k65L79k56j37J40
3623fK66k51j9p0K16k7k25L66K2p9k86m0J70J6K47k41J61l77l9J34J84q5o3o5
$$ plain form
3647 -91 109 49 -128 -317 -350 190 95 56 -114 -221 141 -179 132 -171 -70 154 108 -35 147 360 -177 -53
3669 -53 48 -320 -79 197 -191 263 229 -135 63 86 -225 -150 3 25 126 55 -67 -45 -115 -69 188 -17 70
3692 70 -33 -62 -86 -83 -72 83 79 -118 45 57 204 -111 -54 28 175 244 41 -105 -192 -26 -114 225 133 7 105
3717 105 -112 -45 12 -144 -162 166 122 -248 24 106 -64 96 25 -202 141 -115 43 -321 -107 67 59 27 -178
3740 -178 -73 -11 -135 124 -187 -37 -97 95 -124 -15 -73 -192 172 -253 -258 -205 64 -11 -190 -212 -12 -106 -84
3763 -84 -181 103 70 28 43 -53 65 -77 -17 70 -25 -64 279 40 -53 -126 91 -107 -65 -204 -128 -152 -62 -50 157 129
3789 129 -71 68 -266 114 276 202 369 202 36 173 -44 -225 14 -116 -192 79 55 -126 7 89 44 -15
3811 -15 -8 76 277 69 -147 103 -147 60 16 36 -83 -232 -28 102 94 260 -43 89 -112 140 -37 286 159
$$ packed form
3647i1K00o0j77j89l3N40r5l9j70j07L62l20L11l03J01K24m6j43J82K13n37J24
3669e3J01l68K41K76l88M54l4l64J98K3l11P5J53K2J01p1j22K2p0M6K57k05Q7
3692G0j03k9k4LJ1J55mj97J63J2J47l15N7Q2J47O9k03j46q7J66q8L39r2j26R8
3717A05k17O7N7j56j8L28m4l70K72Q2j70J60p1k27L43k56J58l64K14J74ql2k05
3740a78J05O2j24K59l11J50o0J92k19J09n8j19L64m25nN3K69p5j79k2K00r4K2
3763h4r7K84l3m2J5r6J18j42O0Q7r5l9L43k39r3p3K17j98M2j39P6k4R0J2K07k8
3789A29k00J39l34L80J62p4J67j67j66J37k17j81K39j30p6K71k4j81J33Q2m5n9
3811a5PQ4K01k08k16K50k50K07m4K0j19j49K04J30qJ66l03J32k01K52j77L23j27
$$ plain form
3834 159 26 7 -393 62 -89 -39 174 156 -261 -119 -85 -209 95 23 -35 -29 -163 -96 23 -99 -165 52 -203
3857 -203 -39 -24 -123 337 -308 110 15 3 267 -23 -73 -64 43 113 -27 -113 78 87 -290 48 -171 107 101 -6
3881 -6 -1 -249 -17 -139 78 -3 -245 39 120 185 136 501 -337 -67 52 16 -160 63 46 148 -82 -100 -69 80
3905 80 -40 107 -9 -82 63 -88 125 43 -16 -304 -182 -20 -161 145 65 47 14 194 -43 185 -205 149
3927 149 312 -87 -48 -110 -38 -199 -42 354 107 -308 51 -120 -55 16 -205 -36 141 211 -214 11 230 -37
3949 -37 34 17 100 316 131 221 134 96 -45 214 -20 -26 -90 78 -146 3 -166 159 260 -170 -116 105 49 38
3973 38 -168 -28 123 -132 20 -344 -8 -110 52 108 68 -119 240 2 -6 -104 103 -20 94 -110 123 248
3995 248 197 231 227 52 143 238 -76 -42 8 -17 -78 -101 -186 -237 117 112 51 66 -260 63 -36 -15 81 -89 -41 213 149
$$ packed form
3834A59j33j9m00M55j51N0K13j8m17J42L4j24L04p2n8Oj34O7J19j22o6K17k55
3857b03J64J5r9M60o45M18r5j2K64k90n0RJ07P0j40q6J91Rl77L38k19K78oj07
3881fNk48K32j22K17q1k42K84Q1O5m9L65q38K70J19l6j76K23j7J02k30j8L1J49
3905H0j20J47j16p3J45j51K13q2n9k88J22J62j41L06q0j8l3J80k37K28l90L54
3927A49J63l99L9o2P2j61J57L96k47m15L59j71O5P1k21J69J77P0m25K25K19k67
3949c7P1j7Q3K16j85R0q7l8j41K59k34oo4J68k24J49j69L25J01m30N4K21n6j1
3973C8k06J40J51k55J52l64L36j02J62N6m0j87L59k38qr8K07j23J14k04K33J25
3995B48n1L4mj75R1R5l14L4N0k5o1k3q5n1L54no1J5l26L23r9K1R6j70M8K54o4
$$ plain form
4022 149 151 -15 99 6 -51 -317 247 -95 211 40 -119 -69 210 323 210 62 -232 96 -93 19 71 -82
4044 -82 41 -216 51 253 -134 71 -50 88 133 143 145 161 -61 127 -23 -42 -47 -116 169 -55 170 -68 55
4067 55 -67 175 55 -78 84 222 0 -10 59 73 21 368 9 -237 174 280 -66 108 -100 6 21 -38
4089 -38 141 69 47 -217 149 174 -21 -262 -21 -133 -77 -106 -203 34 161 51 -19 262 86 -80 -161 -149 270
4112 270 164 39 85 -115 78 149 -145 96 99 126 253 -91 33 216 -125 239 -22 103 101 -8 -30 -164 93
4135 93 -44 -41 -50 -115 87 -23 64 -21 14 -135 -77 -16 95 236 96 60 -147 0 -193 -324 -5 70 123 -74 -68
4160 -68 -104 277 178 167 -17 6 -33 198 109 207 128 238 143 -86 -242 -104 14 -119 32 58 1 -124 -41 46 44
4185 44 106 164 93 158 -112 -32 44 -92 -39 39 -187 95 185 113 135 184 -90 -155 -55 -139 -66 -97 174 -67 -189 -58
$$ packed form
4022A49Kj66J14r3n7k66N64l42L06j71j59N0K79J13j13j48k94L28j89J12N2j53
4044h2J23k57K67K02l87K05j21J38M5J0KJ6k22J88j50j9no9K85k24K25k38J23
4067E5j22K42j20j33J62J38k22j0O9J4n2L47l59k46M11J06l46J74k08J06J5n9
4089c8J79p2k2k64L66K5j95k41K41j12N6k9r7K37J27j10p0K81j76j66q1J2M19
4112B70j06j25M6k00J93P1k94K41LK7J27l44J24J83l41L64k61J25kj09k2j34K57
4135I3j37Lro5K02j10Q7q5L5j49N8O1J11J41j40l6k07J47j93j31L19P5N3j97O
4160f8l6L81r9j1j84K3l9K31q9R8p9J10r5k29j56J38J18j33J51K6n7j25Q3Q7k
4185D4O2N8p1O5k70Q0P6j36N3P8k26K82R0p2K2M9k74o5J00q4P3l1K71k41j22J31
$$ plain form
4211 -58 -155 121 29 -102 -57 -90 99 -117 93 -170 49 -155 97 19 36 15 -167 -7 118 220 -79 221 -271
4234 -271 -47 -252 -7 -205 2 79 86 -20 -315 -148 -287 15 159 14 44 69 165 18 -2 8 -139 -61 -125
4257 -125 125 -2 92 1 -28 210 -35 -122 86 -84 103 -7 -82 -210 67 -112 -49 145 -139 -150 -233 -20 -44
4280 -44 -57 -89 -14 209 -13 -89 21 180 -221 159 47 99 -49 -121 -45 25 205 -58 -94 -102 31 147 216 -340
4304 -340 190 36 -76 -67 -62 51 -40 -71 -89 173 -206 -148 284 -145 -24 -18 265 74 86 12 115 -5 56 -73
4328 -73 -69 -93 222 99 -115 138 -308 226 0 -251 30 209 -27 -22 181 72 -52 -15 -15 -273 -30 146 -29
4351 -29 262 138 63 7 81 -278 132 -152 37 114 -281 -85 -135 -70 -270 -170 -106 156 -33 -148 99 112 208
4374 208 -177 -173 160 66 104 25 275 204 -154 -52 167 -61 6 87 21 1 463 141 207 -219 -53 88 -49 39
$$ packed form
4211e8r7K76r2j31M5l3J89k16K10k63K19k04K52p8J7k1j82J60J25J02k99L00m92
4234b71K24k05K45j98K07P7Pj06k95J67j39L02J44j45L0K5R6j47k0J0j47P8o4
4257a25K50j27R4r1k9K38k45q7K08j70J87j10p5j28K77j79O3J94k84j1q3K13k4
4280d4j3l2P5K23k22p6J10J59m01L80j12N2j48p2P6P0J80k63l6qJ33J16O9n56
4304c40N30j54j12RNJ13r1l1j8K62l79N8M32m29J21OK83j91J2p4J03j20O1j29
4328g3Mk4L15j23k14K53m46N34k26k51K81J79k36NK03j09j24L7%k58K43J76j75
4351b9K91j24p5n6P4l59M10k84J89P7l95J96n0O5k00J00O4K62j89j15K47J3R6
4374B08l85ML33r4L8p9K50p1l58J02K19k28O7Q1o6k0M62l22O6m26J66J41j37Q8
$$ plain form
4398 39 176 146 -121 42 -86 -278 158 254 -94 -1 260 -99 -283 31 62 330 123 57 159 56 -107 -162
4420 -162 100 50 -17 -5 155 42 -130 -257 51 100 -124 -131 -147 155 -54 59 -1 36 -26 160 17 79 94 20
4444 20 -219 -269 -163 -109 -52 65 -63 -186 -16 115 -5 50 -5 150 -63 106 -26 60 -37 -52 -138 14 -154
4467 -154 159 93 -59 -106 -44 51 64 -16 239 73 -24 68 -198 -90 174 26 -204 185 96 -228 -23 47 85 11
4491 11 189 -32 90 104 -47 94 -170 69 -91 -128 103 0 -160 16 31 116 -15 21 -21 59 167 135 138 -206
4515 -206 55 62 180 143 -133 200 111 -42 57 10 -79 -89 -87 27 145 131 40 -254 -18 61 26 64 -56 80 24
4540 24 137 4 -299 41 -102 -225 -161 160 178 -106 31 115 -26 108 53 -68 -7 -61 -54 -101 126 56 51 51 -185
4565 -185 0 172 116 -53 39 -27 -142 90 148 2 105 106 -54 6 -24 44 -172 3 232 -157 -89 -62 -57 149
$$ packed form
4398C9J37l0k67J63j28j92M36R6l48R3K61l59j84L14L1K68k07o6J02j03j63n5
4420a62K62n0o7J2J60j13j72j27L08M9k24pj6L02k09J13o0L7o2J86j43O2J5p4
4444B0k39n0J06N4N7J17j28j23J70J31j20N5n5J55k13J69j32Q6r7j5q6J52j68
4467a54L13o6j52m7O2R5J3q0K55j66r7R2k66J08K64j48k30L89q9l24K05P0L8p4
4491A1J78k21J22J4j51J41k64K39j60l7K31j03j60J76J5Q5j31L6m2Q0J08l2Ll44
4515b06K61PJ18l7k76L33q9j53R9m7q9j0KJ14J18j4r1k94K36P9l5L8j20J36n6
4540B4J13j33l03L40j43j23O4L21J8k84J37Q4j41J34n5j21O1n4Pm7K27p0n%k36
4565a85J85J72n6j69R2o6j15K32N8j46J03Jj60O0l0O8k16J75K29l89O8K7NK06
$$ plain form
4589 149 18 -51 -158 -160 14 146 139 -247 19 9 25 80 30 -63 -124 -19 43 54 214 -83 74 51 203 44 -113
4614 -113 205 -50 -148 131 -93 314 -27 52 302 -150 -61 -39 133 36 2 -23 -56 276 -9 38 62 79 21 2
4638 2 29 -183 82 -172 167 184 178 -112 126 122 -187 248 85 -149 -1 45 -95 -106 -73 178 -73 268 -144 -104
4662 -104 -156 90 -76 -500 327 -140 156 -1 -70 -31 -155 -148 -22 23 -54 151 78 -26 -28 260 32 28 200 86
4686 86 263 -45 -168 -34 -127 59 160 0 47 124 19 55 207 -6 -40 -243 106 -142 -62 43 -70 -124 48
4709 48 147 -100 -106 136 127 -98 100 25 -49 -161 32 -141 117 196 -41 -168 -50 -60 -62 -146 -132 55 53 19 -81 87
4735 87 -77 -63 34 -329 -159 -280 2 -105 -122 193 204 -5 223 184 105 80 133 -92 -33 80 -44 -117 -86 52
4759 52 12 -320 -60 -72 52 20 -60 116 53 145 84 -44 25 158 -236 -134 -49 -136 -21 -83 318 38 -111 -141
$$ packed form
4589A49j31o9j07kJ74J32pl86K66j0J6N5n0r3o1J05O2J1J60k97J57k3J52j59j57
4614a13L18k55r8K79k24M07l41P9K50m52Q9K2J72r7l4k5l3L32k85M7K4J7n8j9
4638BK7k12K65k54L39J7ok90K38ml09M35j63k34J48M6j40j1L3K51k51L41m12M0
4662a04n2K46j66m24Q27m67K96j57o9L9j24PJ26M5p7K05p3j04kK88k28mJ72j14
4686H6J77l08j23J34r3J86J01j60M7P7j05L6J52k13l4k03L49k48Q0J05j13n4J72
4709D8R9k47oK42rk25J98p5p4j12J93j73K58P9k37j27J18j0kq4J4J87kl4j00J68
4735H7j64J4R7l63J70j21K82j07j7L15J1k09K28l9p9k5N3k25N9J13j24p3L1J38
4759E2m0l32K60j2J24l2q0J76o3R2o1j28O9J33l94J02Q5q7J15o2M01k80j49l0
$$ plain form
4783 -141 -42 -128 67 245 -138 159 -142 -32 15 54 20 -77 27 -99 40 47 20 143 -67 -12 121 115 137 -29
4807 -29 -117 137 -17 -7 80 -9 -106 85 -22 -289 43 -37 -13 50 -241 -192 168 -92 52 -135 -23 22 -138 -163
4831 -163 72 -271 -48 -23 -79 123 -203 -345 -268 270 8 -145 -37 -100 -189 -1 48 -246 233 -186 225 -253
4853 -253 -25 -37 -100 -142 201 -61 52 1 178 53 82 -210 7 161 -5 144 -128 48 -137 -246 130 -56
4875 -56 65 31 -214 -372 -57 -40 20 -115 22 17 -54 173 8 -220 6 -63 -127 36 -260 -66 44 -220 -276
4898 -276 22 -165 299 77 209 122 -370 129 -81 -115 -110 -21 -88 119 -231 -95 86 8 69 0 -18 382 -61
4921 -61 -184 112 -58 -15 -62 -123 51 84 -173 25 -378 -85 148 -71 243 -73 38 359 114 189 -112 -193
4943 -193 16 -20 15 115 315 -334 261 -83 57 -65 -228 1 -135 5 -10 200 -15 -280 -15 171 -126
$$ packed form
4783a41R9q6J95J78l83K97l01J10M7L9l4r7J04j26J39Pk7J23k10N5J33oK2j66
4807b9q8K54j54J0Q7q9r7J91j07k67L32q0K4O3k91M9L60k60J44j87J12M5j60k5
4831a63K35l43K23K5n6K02l26j42P7N38k62j53J08o3q9J88M9k94M79m19M11m78
4853b53K28j2o3m2L43k62J13n1J77j25K9k92K17J54j66J49k72J76j85j09L76j86
4875e6J21l4k45j58L15J7O0j35J37np1K27j65k28K26o9o4J63k96J94J10k64n6
4898b76K98j87M64k22J32q7m92M99k10l4NQ9o7K07l50J36J81p8O1o9j8M00m43
4921f1j23K96j70M3m7o1J74L3k57J98m03K93K33k19L14l16J11L21k45P5l01q1
4943a93K09l6L5J00K00o49N95l44J40j22j63K29j36J40j5K10k15k65K65J86k97
$$ plain form
4964 -126 26 -6 89 -5 -143 4 -47 40 50 -86 -152 251 -2 262 138 -45 -238 -6 9 -116 159 63 34
4987 34 -98 -2 -76 35 -124 -219 -33 -123 -92 -17 -49 20 -67 -150 -33 179 -278 49 16 -145 181 300 392 244
5011 244 113 69 -144 -50 -125 -103 248 57 16 -102 112 -7 136 64 50 -312 -93 -147 -60 209 -115 18 107
5034 107 -161 -76 121 40 -5 -168 257 104 27 -129 -53 -17 -21 153 35 -24 -83 -154 -103 -323 87 92 123 46 76 -77
5060 -77 7 160 13 114 -196 67 273 21 -81 34 -33 62 -93 4 43 -130 -73 -1 41 0 156 46 -139
5083 -139 19 134 3 -37 111 -269 48 11 156 -254 40 2 83 65 -108 162 -86 181 -201 -198 -5 325
5105 325 143 -150 -140 143 495 85 -14 -90 -85 -165 -83 12 -115 85 -135 59 -73 175 140 41 96 -72 -188 14
5129 14 159 -50 -65 -234 101 80 14 -191 -242 134 22 10 18 162 -42 -88 -80 41 -80 -162 -181 -4 -4 -119 -34
$$ packed form
4964a26J52l2R5r4j38J47n1Q7J0j36o6M03k53K64j24j83j93K32J5j25K75r6k9
4987C4j32R6p4J11j59r5J86r0L1P5l2O9q7q3J17K12m57L27l3j61L26J19R2j48
5011B44j31m4k13R4p5K2L51j91m1j18K14j19J43p2j4l62K19n4Q7K69l24J33Q9
5034A07k68Q5J97q1m5j63M25j53p7j56P6L6mJ74j18n9n9p1N1k20M10NL1p7L0j53
5060g7Q4J53j47J01l10K63K06k52j02J15o7R5j55R7L9j73N7P2M2m1J56j10j85
5083a39J58J15j31m0J48l80L17l7J45m10K94l8Q1j8j73K70k48K67l82LJ93L30
5105C25j82k93J0K83L52m10r9p6Nq0Q2R5j27K00k20J94j32K48l5r9N5j68j16K02
5129A4J45k09j5j69L35k1o6k05n1L76j12j2QJ44k04m6QJ21j21q2j9J77%j15Q5
$$ plain form
5154 -34 -20 -23 -86 121 -49 53 -1 35 -10 -112 -7 136 124 72 -109 -41 32 -199 -60 207 -205 85 -88 -180
5178 -180 -35 -15 -16 20 -129 -200 -150 316 183 -78 37 -66 315 113 166 -365 210 115 -48 -27 -227 96 43
5201 43 112 341 9 396 308 -193 -98 -68 -8 -157 245 -6 94 -30 -20 123 -111 -94 -165 -19 193 24 202
5224 202 -192 199 91 -3 142 33 208 214 9 130 -40 -25 -169 -11 -179 -96 -129 125 7 97 -26 -24 86
5247 86 11 338 -35 -21 31 -74 -225 5 250 -165 -102 -141 85 120 39 134 -3 -119 183 -118 23 33 -40 312
5271 312 69 195 -24 84 -83 -38 306 110 -69 -200 79 -82 0 83 337 89 60 -191 -73 -137 54 306
5293 306 96 -155 -205 -73 -231 -158 33 -140 -207 146 -91 -84 122 -285 -66 126 -77 -143 -65 -122 -124 -190 181 6
5317 6 -28 118 183 2 97 7 -123 310 128 100 -88 90 -73 -13 -132 12 -60 -181 82 102 -98 11 -227
$$ packed form
5154c4J4lo3K07j70J02n4L6m5j02J05J43j2n2j81O8P3k31J39K67m12K90j73r2
5178a80J45K0jL6j49p1N0M66j33k61J15j03L81k02N3n31N75r5j63K1k00L23n3
5201D3O9K29l32L87q8n01R5L0O0j49M02k51J00j24J0J43k34J7p1J46K12j69J78
5224B02l94L91j08r4J45j09J75Ok05J21j70J5j44J58j68Q3l3K54j18R0j23KJ10
5247H6p5L27l73J4N2j05j51K30K45m15O3l9K26L5q1R5j37j16L02l01J41J0p3L52
5271C12k43J26k19J08j67M5L44j96j79j31K79j61Q2Q3K54k48k9k51J18o4J91K52
5293C06k10k51n0J32j58P3J91j73o7L53k37PK06m07K19J92k03o6P8n7ko6L71j75
5317Fl4J46O5j81R5r0j30M33j82k8j88J78j63O0j19J44p2j21K63K0k00J09k38
$$ plain form
5340 -227 -169 -233 7 -151 -19 -313 46 212 -166 -109 20 208 -64 -271 14 188 152 -13 174 157 -15 127
5362 127 15 142 26 29 18 152 -28 -3 -302 8 297 -189 141 249 -257 178 -168 37 96 -48 -83 158
5384 158 -54 -35 -30 -88 233 -53 -80 133 206 -145 335 75 -141 142 134 -22 -4 88 162 31 99 41 -78 -218
5408 -218 -23 142 146 -17 20 -118 -72 -2 58 -17 -264 110 -242 -118 -1 271 -8 41 -289 -58 233 133 -133
5431 -133 238 139 101 -20 -11 98 9 -237 -62 -60 174 -129 -64 190 -57 193 -43 144 -243 43 29 -211 42
5454 42 126 -120 69 145 282 31 -54 -85 -24 197 45 131 152 -83 17 203 -139 86 188 -87 -250 -107 -130
5477 -130 -125 -30 -222 -55 -263 127 114 -50 85 -57 -76 -51 163 140 22 36 125 -36 -34 55 -30 -26 84 141 324
5502 324 41 44 66 141 64 85 57 251 -3 237 -129 93 -97 -82 75 302 251 145 -103 1 -52 -112 -22 76
$$ packed form
5340b27N8o4K40j58J32k94L59J66l78N7J29J88k72k07K85J74l6j65J87j7j72J42
5362A27j12J27j16Lj1J34j80K5k99L10K89m86L30J08n06M35l46K05N9j44l5K41
5384A58k12J9Nn8L21k86k7K13P3l51M80k60k16K83qj56J8R2P4j31O8n8j19j40
5408b18J95J65Mj63L7j38M6P0O0p5k47L74l52J24J17K72k79M9l30K31K91j00k66
5431a33L71r9l8j21RJ09q9k46J75KK34l03O5K54k47K50k36J87l87K86j4k40K53
5454D2Q4k46J89P6J37k51q5l1O1K21j52Q6K1k35J00J86l42K25J02k75j63J43k3
5477a30NR5j92J67k08L90j3j64J35j42j9K5K14k3j18J4Q9j61KQ9q5MJ10N7J83
5502C24k83LK2P5p7K1k8J94k54K40l66K22j90J5J57K27n1j06k48J04n3o0R0R8
$$ plain form
5526 76 24 70 59 -142 249 182 -82 89 310 -43 -101 158 -23 -224 233 161 -72 245 -180 150 -120 -46 49
5549 49 -218 204 -70 20 95 108 66 -14 101 -8 -128 -24 -41 -66 11 75 80 63 -131 3 -22 199 308 59 -44
5574 -44 -79 -49 -90 -187 52 144 148 12 34 -76 -2 57 -290 135 -113 54 -5 -274 191 -53 48 166 81 182
5598 182 203 24 205 -203 90 245 -8 166 -92 -214 125 -48 -21 -112 -128 1 -36 -143 -284 50 -82 184
5620 184 94 -51 91 -312 235 -194 -129 -5 60 293 -42 75 1 -189 -26 80 85 22 18 -5 -59 -197 -358 148
5644 148 41 -18 -66 79 130 89 -97 1 -91 -271 225 -131 -37 204 -88 -175 -93 -47 80 112 136 152 -142 348
5668 348 27 66 -20 -24 160 -229 8 95 -87 174 172 98 -102 -19 -4 109 -126 -230 -94 -257 200 245 -189 45
5692 45 98 -208 397 47 72 -29 3 84 76 101 50 -168 15 15 84 -35 56 -309 50 -159 -6 -43 -63 -181 176
$$ packed form
5526G6n2M6j1k01L91o7k64J71K21l53n8K59j81k01M57p2k33L17m25L30k70P4R5
5549D9k67M22k74R0P5J3m2q0J15j09j20J04j7k5P7O4Nj7j94J34k5K21J09k49j03
5574d4l5L0m1r7K39R2Mj36K2j10P4N9l47M25k48J67n9k69M65k44J01J18q5J01
5598A82K1j79J81m08K93J55k53J74k58j22L39j73K7r1j6J29l7j07j41L34j32K66
5620A84r0j45J42m03N47m29O5J24O5K33l35J17p4j90J63J06No3mk3n4j38j61N06
5644A48j07n9m8J45N1m1j86R8r2j80M96l56R4K41k92q7Q2M6J27L2K4J6k94M90
5668C48l21L9q6mJ84l89K37Q7j82K61kp4k00Q3J5J13k35j04J36j63M57M5m34K34
5692D5N3l06O05l50K5j01L2Q1qK5n1k18J83%O9j19R1l65L59k09J53l7k0j18L57
$$ plain form
5717 176 -37 52 85 -28 228 -231 13 -54 -195 -179 -228 45 -138 -112 328 108 113 6 247 32 -65 5 -31 -200
5741 -200 -404 51 -30 -121 145 206 81 -79 -188 214 102 3 -141 123 -209 -162 -68 173 175 197 190 130 119 -67
5765 -67 -99 17 -258 86 -14 -155 -2 -33 -48 203 133 41 167 -87 -5 -27 -213 4 227 -69 -25 -68 -28 -105
5789 -105 -200 -262 -37 -46 115 25 -42 -60 338 -29 -45 184 79 244 -113 158 208 243 38 -85 -63 125 64 121
5813 121 209 12 150 23 173 73 -41 -23 138 -232 130 58 6 -22 -6 69 10 -143 -98 -77 91 216 80
5836 80 160 -54 62 97 197 70 13 -5 -137 -205 -24 156 -154 41 124 79 -177 156 -70 -33 -21 57 -32 -134
5860 -134 32 -143 -29 76 -330 -151 -107 -78 226 299 186 -45 -185 100 23 276 89 -241 37 -202 -165 1
5882 1 -124 81 -73 68 182 -218 129 101 204 -41 -35 170 -247 -13 -320 24 23 75 75 -88 82 -24 -103 -68
$$ packed form
5717A76k13Q9L3j13K56m59K44o7j41J6m9K73j83K6M40k20Nj07K41k15r7P0l6j69
5741b00k04M55q1r1K66O1j25j60j09M02j12r9j44K64l32M7R4K41KK2po0j1j86
5765f7l2J16k75L44j00j41J53l1j5K51p0r2J26k54Q2k2j86K17K23k96M4m3M0p7
5789a05r5o2K25rJ61r0o7j8L98l67j6K29j05J65l57K71N0L5k05j23K2J88o1N7
5813A21Q8j97J38j27J50j00j14J8J61l70L62p2n2k8J6P5n9j53M5K1J68J25j36
5836H0Q0k14J16L5J00j27n7j8j32o8J81J80l10J95Q3m5k56L33k26L7J2P8q9j02
5860a34J66j75J14J05m06J79M4K9L04P3j13k31j40K85p7K53j87l30K78k39L7J66
5882Aj25K05j54J41J14m00L47k8J03k45OK05m17K34l07L44jN2%j63J70j06p9L5
$$ plain form
5906 -68 101 -28 132 93 -159 -59 9 9 -1 101 186 -8 108 -81 25 114 157 84 9 106 47 -35 147 218 -40
5931 -40 151 -39 -24 8 72 -40 53 63 63 -156 -31 -48 145 128 6 -251 -31 -130 32 29 -317 90 52 -67 22
5956 22 102 -93 -37 41 198 -44 -132 -97 110 188 -119 30 -40 64 113 139 35 -68 63 -25 238 -137 120 -76
5980 -76 225 228 75 65 -109 -297 60 -148 218 356 95 52 164 -49 -32 214 186 -50 -206 -11 -382 -207
6002 -207 286 99 -92 85 247 246 84 197 37 -2 -5 -249 -210 0 40 251 366 -18 51 -10 -4 262 -47 -100
6026 -100 -210 -82 -51 12 83 -72 249 56 -130 273 96 185 -18 -15 -249 -51 -137 -101 -74 -7 6 -6 58 -27 -197
6051 -197 -46 157 -5 -181 214 -98 95 155 -39 -31 -39 -176 95 115 98 9 -351 -143 -73 5 -31 1 -304 66
6075 66 -38 -152 46 -36 -178 57 -148 36 -60 -7 77 164 244 7 271 -32 -353 -137 154 -18 11 288 -26
$$ packed form
5906f8J69j29J60l9k52J00O8%j0J02Q5j94J16j89J06Q9M3p3p5R7n9q2J82P1k58
5931d0J91j90J5L2O4j12R3J0%k19J25j7J93j7j22k57K20r9J62ll46M07l8j19Q9
5956B2Q0j95N6P8J57k42q8L5K07P8l07J49p0J04M9K6j04j03J31q8K63l75K57j96
5980g6L01Lj53j0j74j88L57k08L66J38k61m3J12k13J7K46k8k36j56J95l71J75
6002b07M93j87j91J77J62jj62J13j60l9lk44L9K10M0K11J15l84O9o1OK66l09n3
6026a00j10J28L1O3P1j55L21j93j86M03j77Q9k03Lk34J98q6L6K7O7J3j2O4q5j70
6051a97J51K03j62j76L95l12J93O0j94Qqj37K71K0j7q9l60K08P0P8l6L2l05L70
6075F6j04j14J98q2j42K35k05J84r6N3Q4Q7Q0k37K64l03l21K16K91j72K9K77l14
$$ plain form
6098 -26 140 128 49 401 -55 -97 1 -261 4 -186 51 -121 -23 41 143 -93 -203 -229 36 146 -128 -29 -168
6121 -168 -88 -235 5 -37 -61 55 44 32 -223 50 -43 -76 -42 87 -73 -178 24 81 -43 148 -198 113 85
6144 85 50 38 142 33 -277 48 63 -47 -190 25 -86 127 -213 30 127 -155 -21 204 -166 43 108 158
6166 158 -66 178 63 -96 -184 -21 -147 211 198 99 54 -172 42 158 -70 27 162 53 -12 123 197 66
6188 66 61 52 -121 -47 -173 -51 -208 65 32 -121 -75 -260 65 -67 -202 -204 85 41 -50 59 -99 74 -99 -94 -89
6213 -89 6 -59 34 20 306 160 -34 98 105 135 -46 -232 60 -66 131 25 -60 186 -148 64 75 -165 -162 -119
6237 -119 53 -347 -21 -132 -39 144 -46 -4 32 208 93 137 -289 -70 -152 58 92 15 -84 216 136 -81 274
6260 274 27 -56 13 -330 106 177 -147 -90 121 26 -369 82 -65 -80 52 -88 -16 0 101 -170 118 -98 268
$$ packed form
6098b6J66j2p9L52m56m2R8k62K65j90K37j72R8O4J02k36j10k6K65J10k74R9j39
6121a68Q0j47K40m2k4J16j1j2k55K73r3l3L4J29j60j05K02N7j24J91l46L11k8
6144H5l5j2J04j09l10L25J5j10j43K15j11K13l40K43R7k82J34K25l70K09O5N0
6166A58k24K44j15j59q8J63j26L58j3r9m5k26K14J16k28R7J35j09o5J35P4j31
6188F6nrj73P4j26J22j57K73l3j53M6j85L25j32j35kK89m4r1J09j58J73j73NN
6213h9R5o5R3j4K86j46j94J32PL0j81j86K92j26J97j06q5K46l34K12J1k40LM3
6237a19J72m00L26j11R3J83j90M2L6J76j15M4m26K19q2K10L4p7r9L00q0k17L55
6260B74k47q3O9l43M36P1l24N7K11r5l95M51j47j5J32j40P2J6J01k71K88k16L66
$$ plain form
6283 268 -63 245 80 -65 156 22 70 -164 308 70 138 129 177 -104 33 124 62 56 105 -229 46 11 212 -33
6307 -33 95 -137 -87 303 -118 -91 96 132 -39 206 -165 12 -78 -89 -41 -298 -41 -53 -179 -243 315 103 -102
6330 -102 -52 -8 50 -82 50 -42 -57 136 77 51 52 200 217 211 101 27 -86 13 169 65 -70 84 -15 40 -22 -20
6356 -20 -3 174 -20 6 -157 -122 203 -116 108 -104 -121 -150 -158 107 -240 30 126 -163 44 -93 113 -32 -11
6379 -11 350 56 -225 153 13 301 -18 -16 406 37 27 -22 92 47 3 -106 347 64 -171 42 298 130
6401 130 -248 4 133 131 197 -234 40 318 -37 -137 175 -71 -92 233 167 -18 121 -232 218 -135 -83 -3
6423 -3 -154 -126 -14 111 44 -191 -23 99 95 11 -10 1 222 -98 -100 105 -154 -88 17 -116 156 139 -98 255
6447 255 -3 65 106 215 -1 22 3 174 -295 113 100 -173 152 129 50 -32 -136 -118 37 36 -94 -129 -44 -14 127
$$ packed form
6283B68l31L08j65j45K21j34M8k34M72k38O8rM8k81J37R1o2oM9l34K75l5K01k45
6307c3J28k32N0L90m21K7J87L6j71K45l71J77r0j1M8k57K57j2j26o4N58k12k05
6330a02N0M4N8j32J32r2j5J93n9k6JJ48J7oj10p4j13R9J56j04j35J54r9N5o2K
6356b0J7J77j94K6j63L5L25l19K24k12j7k9qK65l47K70R6k89K07j37K06j45K1
6379a1L61k94k81L78j40K88l19KM22l69j0m9J14m5m4j09M53k83k35K13K56j68
6401A30l78K52J29kO6m31K74K78l55j00L12k46k1L25o6j85J39l53M50l53N2Q0
6423cj51K8J12J25o7k35J68J22mq4k1J1K21l20kK05k59O6J05j33K72j7k37L53
6447B55k58O8M1J09k16K3j9J71m69M08j3k73L25k3p9q2j04J8J55jj30l5Q5L0J41
$$ plain form
6472 127 72 184 147 -18 246 -220 57 -73 63 -154 -240 100 -221 -34 19 -104 38 69 23 111 34 107 220
6495 220 -200 119 -72 -34 -195 199 243 -153 216 -113 31 -27 -9 -34 74 23 -97 67 -19 -163 41 -80
6517 -80 339 1 -48 -138 -112 189 21 -54 -193 243 220 65 18 58 -255 -9 -83 -15 -25 53 -107 114 112 25 435
6542 435 25 104 -142 -212 -406 -18 184 -33 56 85 20 139 150 139 -145 344 -87 98 93 91 183 -236 48 -313
6566 -313 -18 -194 -168 257 51 -218 -87 138 23 80 126 77 -173 -16 89 193 325 -47 -36 88 148 -71
6588 -71 -136 -263 -49 130 -114 14 -89 66 -169 6 -45 -170 -73 -164 -270 -142 -264 -30 50 -125 171 279
6610 279 -132 -79 -46 19 142 29 -189 -68 -78 -84 134 -118 25 150 -294 -137 -43 -167 -100 -3 9 -189 -257 223
6634 223 -10 -176 59 -187 232 65 274 -200 180 -105 200 157 -6 78 150 127 -254 -150 239 262 -205 169
$$ packed form
6472A27n5J12l7j65K64m66K77j30J36k17q6L40l21J87N3j23J42L1m6Q8p7P3J13
6495B20m20L19j91L8j61L94M4l96L69l29J44n8J8k5J08n1j20J64q6j44K04j21
6517h0M19l38m9r0K6L01j68p5j39M36k3j55m7M0l13K46p4O8j0P8j60K21kq7M10
6542D35m10P9k46p0j94L88K02k17Q9K9o5J19J1j1k84M89m31J85nkR2m19K84l61
6566c13K95j76K6M25k06k69J31K25j15N7M6m9k50J57J05J04J32l72J1J24O0k19
6588g1o5j27K14J79k44J28j03J55k35J75n1j25R7r1j06J28j22K34Q0j75K96J08
6610B79m11N3L3O5J23j13k18J21j0oK18k52J43J25m44J57R4j24O7R7J2j98o8M80
6634B23k33j66K35k46M19j67K09m74L80k85L05m3j63Q4P2k3l81J04L89K3m67L74
$$ plain form
6656 169 -36 -79 -32 -74 122 -18 -59 -10 1 -18 -58 170 -228 -31 62 -68 197 -57 -54 211 41 -127 60 -44
6680 -44 170 -48 263 183 -114 -172 149 107 44 -191 12 88 22 -408 79 -25 -47 111 21 -105 -239 25 -93
6703 -93 -163 -145 10 205 -94 238 154 124 170 -139 71 -39 -35 -198 148 -45 140 -1 -6 77 -174 -84 -210 138
6727 138 42 153 357 113 87 58 206 76 38 -69 -106 118 165 86 163 173 -107 194 82 260 16 -60 63
6750 63 -144 -60 -312 93 297 -80 -72 -30 135 -27 -248 55 -95 67 142 365 -416 -82 -63 41 16 152 429
6773 429 33 -53 56 -38 -88 -58 -79 7 -207 17 47 154 -110 37 -123 7 4 -17 56 -65 -59 -173 -334 42
6797 42 -81 -18 97 216 -48 -18 -171 -70 198 -61 2 -32 -135 40 235 140 173 25 -44 -198 -76 -205 150
6820 150 33 -29 180 197 86 157 20 -99 -97 28 -143 196 -51 -12 -129 -27 134 60 124 -19 -34 126 -48
$$ packed form
6656A69k05m3M7m2J96j40m1M9J1j9m0K28l98J97R3j30K65k54LK65j70j68J87j04
6680d4K14k18L11q0k97n8L21m2o3k35K03P6o6m30M87j04k2J58r0j26j34K64j18
6703i3p0J8J55J95k99L32q4l0M6l09K10j10Mj63L46j93J85j41nQ3k51R0j26L48
6727A38r6J11K04k44k6k9J48j30l8j07l7K24M7p9P7J0k80L01j12J78k44p6J23
6750F3k07Q4k52M05K04l77QM2J65j62k21L03j50J62P5K23p81L34J9J04k5J36K77
6773D29l96q6J09r4n0L0k1Q6k14K24L0J07k64J47j60J30lk1P3j21Oj14j61L76
6797D2j23O3J15J19k64L0j53J01K68k59O3l4j03J75J95r5L3j48o9j54J22j29L55
6820A50j17o2K09J7j11P1j37j19KJ25j71L39k47L9j17J02J61p4O4j43j5J60j74
$$ plain form
6843 -48 46 -198 180 -46 80 -32 -89 54 68 126 -78 -238 -123 -39 -115 -75 96 -35 -334 292 -131 -227 -128
6866 -128 182 -89 350 42 -5 271 -124 -205 57 250 -24 -83 -62 113 130 171 142 295 124 101 222 -148 96
6889 96 172 -151 171 -136 -30 -137 -66 284 -150 53 147 -235 96 -43 -344 -170 -29 42 68 -173 67 -132
6911 -132 0 58 252 -23 -166 -184 89 -112 79 -41 12 15 -97 79 -62 98 1 -317 86 173 -8 90 -34
6934 -34 -209 -40 -42 -27 274 274 75 61 151 -226 -44 153 109 -126 29 218 77 -35 -197 4 -119 -134 -97 23
6958 23 42 228 13 -120 126 -2 -315 38 175 2 -189 348 -99 -20 63 38 220 -131 -39 185 -11 -336
6980 -336 181 -90 -63 65 -165 -26 -151 103 -8 -120 132 -28 -181 231 126 -37 36 240 20 -95 -118
7001 -118 55 24 -11 -92 197 -51 -101 149 3 -41 -358 -146 185 -202 -254 51 90 -164 -15 83 -129 121 35
$$ packed form
6843d8R4k44L78k26J26j12n7J43J4N8k04j60J15Q4p6M0J71j31k99O26m23r6R9
6866a28L10k71M39l08m7K76l95q1K62J93k74n9K1J75J7M1k9J53j71k3J21l70K44
6889I6P6l23L22l07J06j07P1L50m34K03R4l82L31j39l01J74J41P1K6k41K40j99
6911a32J32N8J94k75j43j8K73k01J91j20N3Lj12J76j41J60r7l18M03Q7j81R8j24
6934c4j75J69kJ5L01%j99j4R0l77J82J97m4k35J55J89j41j12j62K01j23j5L7J20
6958B3J9J86k15j33K46j28l13L53J37j73j91N37m47P9Q3k5J82l51R2K24j96l25
6980c36N17k71K7J28k30J39j25K54j11j12K52j60j53M12j05j63P3K04k20j15k3
7001a18J73l1l5q1K89k48n0K50j46m4l17K12L31l87n2L05L9k54J49R8k12K50q6
$$ plain form
7024 35 -1 -59 -112 122 -264 0 157 93 97 -96 -61 -79 -160 53 -14 -52 -40 -12 77 -42 -35 89 -289 -62 80 3
7050 3 -213 -99 38 134 195 112 -218 25 -95 114 123 178 62 12 -62 64 60 25 -6 143 87 -43 193 -260 -113
7075 -113 -91 66 -174 -71 -74 228 110 45 -30 48 -177 -32 -43 149 -67 -44 -137 67 169 -143 196 -19 -67
7098 -67 46 114 11 -154 -62 -109 164 -79 69 -133 -126 55 -111 -228 34 170 58 48 113 -160 50 266 -97
7121 -97 308 -53 -163 64 210 8 10 -254 248 16 -135 -36 -63 297 -379 -11 165 55 169 146 -296 69
7143 69 -23 -292 30 95 23 77 -48 -15 -108 2 -42 -252 -50 11 117 73 135 38 -50 -116 292 -34 -108 80 -21
7168 -21 225 18 -171 -133 79 -79 -170 218 141 -50 -49 -52 0 80 -34 202 -284 -83 39 47 -196 146 -69 270
7192 270 -43 -47 112 -155 54 69 182 -69 -8 33 -17 289 163 -4 -104 -68 121 0 -125 194 -297 -147
$$ packed form
7024C5l6n8n3K34l86K64J57o4Mj93L5j8q1K13o7l8J2K8Q9j19PJ24l78K27J42p7
7050Ck16J14J37R6O1q3l30K43j20K09RN5j16n0p4J26ml5l1J49n6j30K36m53J47
7075a13K2J57k40J03lL02j18o5p5P8k25J45j1J92k16K3r3K04J02l12L39k15m8
7098f7J13O8j03j65R2m7K73k43J48k02PJ81j66j17K62J36j12j0O5k73K10K16l63
7121i7M05l61j10K27J46k02Kk64N02k32j51R9k7L60o76L68J76j10J14k3m42L65
7143F9r2k69L22O5p2N4j25L3r3J10m4k10K02O1J06m4O2r7q8o6M08l26p4J88j01
7168b1K46k07j89L8K12j58r1L88p7j91JlN2Q0j14K36m86K01J22Qk43L42k15L39
7192B70l13mJ59k67K09J5J13k51O1M1n0L06j26j67j00L6J89j21j25L19m91J50
$$ plain form
7214 -147 -214 -204 71 -102 -107 -59 10 96 150 -176 70 6 -21 -119 184 42 -52 -118 254 -312 140 -112 32 40 -161
7239 -161 -70 -105 21 -34 384 247 25 154 -167 34 33 40 -76 142 52 83 92 246 198 -170 14 -208 -20 -126
7263 -126 -96 97 -180 -83 -148 -167 115 66 -255 -147 -41 62 -125 57 49 122 -99 -7 -146 -6 -126 -23 -220
7286 -220 -17 59 61 -148 233 128 144 -67 -77 79 100 39 -11 -18 -179 39 -163 -84 -165 -23 -2 -116 112 -151
7310 -151 -83 -249 119 106 124 -31 67 130 -111 -64 115 75 -141 348 129 -117 180 35 -36 -42 -63 133 -274 -169
7334 -169 -22 92 -205 62 -24 117 92 -90 -133 -62 -55 -58 29 -136 110 124 -121 -417 -22 177 48 71 -182 -212
7358 -212 28 264 68 -136 74 40 106 299 -127 232 -135 117 -69 -94 -19 357 -128 36 -75 -47 563 -13
7380 -13 54 330 -212 3 77 48 -116 36 51 -258 33 52 105 95 16 -112 30 -60 93 117 84 -105 206 -116
$$ packed form
7214a47o7J0K75j73nM8O9Q6N4l26K46o4k7r8L03j42r4o6L72n66M52k52J44Qk01
7239a61R1l5J26n5M18j37k22J29l21K01jPj16K18r0L1RJ54m8l68J84k22J88j06
7263a26L0J93k77R7o5j9K82m9l21J08J06J03j87J82qP3k21R2j39J40j20J03j97
7286b20K03P6Kk09L81j05J6k11j0J56K1o1n0pj61K18k02P9q1J42K1j14K28k63
7310a51O8j66L68j3J8j55R8O3k41M7J79m0k16M89k19k46K97j45p1ok1J96m07J05
7334a69J47J14k97K67q6J41k5j82m3P1PlQ7j65K46J4k45k96L95J99j29K3k53l0
7358b12K40K36j96k04K10l4O6J93m26L59l67K52j86k5P5L76m85J64j11K8O10n76
7380a3O7K76n42K15P4k9j64J52J5l09K91J9N3j0p9j28J42r0J53K4l3j89L11l22
$$ plain form
7404 -116 -221 89 87 118 -205 -14 225 5 -226 50 -64 169 -130 124 -30 40 100 10 121 144 198 88 -67
7427 -67 73 -372 212 -1 -58 206 112 225 6 100 -212 92 119 78 -184 -261 -145 80 30 -149 27 121 -140
7450 -140 267 74 108 -197 -199 -27 99 303 110 16 -8 58 48 -286 -23 -47 389 137 -50 -53 -110 298 -14 -25
7474 -25 -265 -5 83 -5 -6 -38 158 53 -8 -15 -250 48 113 -194 104 132 -49 157 34 111 163 -18 -173 -134 33
7499 33 -97 -219 -4 -2 -59 123 -322 92 82 263 209 -312 70 221 -162 210 -50 -60 -112 152 248 -46 71
7522 71 269 -81 -140 -178 -148 162 13 57 246 33 82 -67 -194 -40 -187 -36 101 -10 155 42 -101 48
7544 48 -135 7 -221 -55 75 26 -4 -121 -173 74 -56 -32 62 -119 48 180 85 -42 -85 42 -183 -128 -142
7567 -142 113 -84 270 49 -49 -170 97 143 56 -50 -43 -109 -20 -92 70 9 -250 131 -100 273 -1 27 -268
$$ packed form
7404a16j05L10kL1l23J91K39k20k31K76j14K33k99K54j54P0O0r0J11K3N4j10j55
7427f7J40m45N84k13n7K64r4J13k19R4l12L04K7m1k62p7J16K25n0j79J76R4k61
7450a40M07j93L4l05kJ72J26K04j93r4k4O6j0l34K63k4M36k52j87ln7M08l12j1
7474b5k40K60Q8q8jl2J96j05o1pk35K98O5l07K98K8j81K06j23P7N2j81j55L9J67
7499C3j30j22K15Kn7J82m45M14j0J81n4n21L82J51l83L72k60j0n2K64R6k94J17
7522G1J98l50n9l8L0L10j49M4J89k13M9j49j27J54j47J51J37j11J65j13j43J49
7544D8j83J42k28J66J30m9l0j17n2K47j30K4R4j81J67J32r5j27m3J27k25N5j4
7567a42K55j97L54k21r8j21K67M6q7j06Po6Q9p2J62o1k59L81k31L73k74K8k95
$$ plain form
7590 -268 -37 105 50 -49 52 96 -144 82 31 -212 32 109 73 -76 218 144 236 -16 23 -33 -17 -123 116 67
7614 67 -208 -9 -32 -211 -78 -235 79 -40 18 -153 126 76 66 24 -119 120 45 -24 202 12 -54 73 39
7637 39 79 -26 58 274 -146 -266 -47 18 -136 218 -117 94 81 -177 54 -54 35 -67 -191 -287 188 57
7659 57 -40 261 137 144 -109 148 166 44 -220 65 48 271 -219 65 46 -22 350 171 -52 -20 121 82 0 162
7683 162 -98 -43 159 -172 -30 -23 61 -23 123 0 37 -136 50 60 195 24 34 25 55 248 -270 -96 -73 -187
7707 -187 -98 -39 -173 -229 32 -124 -80 -187 -217 68 -27 111 57 -14 44 -41 71 -36 167 -165 -101 81 -99 56
7731 56 228 46 -151 -54 207 -26 -29 28 -131 -153 -243 -86 107 -39 -3 65 228 278 -75 64 -176 213 -100
7754 -100 83 18 163 -62 33 98 53 -30 -157 126 247 -226 19 162 17 -24 77 183 165 -352 -112 -79 -7
$$ packed form
7590b68K31J42n5r9J01M4k40K26n1k43K44P7l6j49K94p4R2k52L9n6J6j06K39m9
7614F7k75J99k3j79J33j57L14j19N8j71K79n0j0m2j43K39p5o9K26j90o6J27l4
7637C9M0j05Q4K16m20j20K19O5j54L54l35K11j3k58K31j08Q9j02j24r6M75j31
7659E7r7L01j24Pk53K57J8j22k64K85j7K23m90K84j9o8L72j79k23L2J41l9q2J62
7683A62k60N5K02l31J42PQ4q4J46j23L7j73J86J0J35j71J0rL0J93n18J74K3j14
7707a87Q9N9j34n6K61j56M4j07l0K85r5J38n4p1N8q5J12j07K03l32O4J82j80J55
7731E6J72j82j97R7K61k33lN7j59k2r0J57J93j46L6O8J63N0l53J39k40L89l13
7754a00J83o5J45k25R5O5m5q3j27K83J21m73K45J43j45m1J01J06j8n17K40L3P2
$$ plain form
7777 -7 -65 -48 -208 -45 50 108 -115 -89 -261 93 -235 5 158 -1 36 19 -256 -210 137 -92 188 13 259
7800 259 -159 -38 147 117 163 -53 -75 -27 96 -76 -132 -53 -20 241 -175 -281 83 -21 216 -119 102 -91
7822 -91 45 100 -23 231 376 -61 128 -7 -153 -119 94 -119 -230 -236 158 -148 -20 226 56 -250 -172 144
7844 144 -19 188 -48 174 55 -117 -64 43 69 -156 73 -66 -105 -40 -133 12 -300 97 -158 -107 -15 -175
7866 -175 -183 111 -208 -139 -191 -32 -240 96 205 42 42 -181 -175 -53 42 -97 240 -20 -142 140 189 -61 43
7889 43 -36 -191 27 338 -131 -134 87 65 65 272 -108 128 -84 109 -244 179 -293 -235 -27 -84 7 -92 109 -121
7913 -121 -18 -67 27 134 -102 43 -187 -64 76 -46 61 59 -32 -248 72 -93 164 -94 144 166 -82 109
7935 109 -29 -12 -196 9 -142 -194 9 65 121 -19 -145 -62 93 34 44 -210 85 111 86 158 -115 -176 -149 88
$$ packed form
7777gn8J7j60J63R5N8k23K6j72L54l28K40J53j59L7j7k75M6L47k29K80j75K46
7800B59m18J21J85l0M6k16k2M8J23j72n6P9L3K61m16j06L64j04K37l35K21j93
7822i1J36N5j23K54J45m37J89j35j46L4K13k13j11oL94l06J28K46j70l06P8L16
7844A44j63K07k36K22j19j72N3J07K6k25K29j39l9O5r3J45l12L97k55N1R2j60
7866a75qK94l19O9n2J59k08L36J09j63%k23OJ22R5j39L37k60j22K82M9k50J04
7889D3p9j55K18L11m69lK21k2%K07l80K36k12J93l53M23m72N8K08n7R1r9K01k30
7913a21J03m9R4J07k36J45k30J23J40j22J07kr1k16L20j65K57k58K38K2k48J91
7935A09j38J7j84K05j51n2K03N6N6j40j26Q3J55n9J0k54K95K6k5P2k73o1K7K37
$$ plain form
7959 88 -71 2 -60 -7 -88 -26 155 29 -13 151 -150 2 33 321 115 -53 -17 294 -36 35 12 -104 35 -98
7983 -98 39 -84 219 -47 -30 -99 222 121 85 196 -106 -139 -26 -210 -139 124 0 156 -7 -150 236 -124
8005 -124 -42 -114 -92 -76 -60 -154 14 89 -190 36 -91 -34 -26 -95 87 -7 151 53 86 65 148 -223 54 -21 -33 -176
8031 -176 -98 -18 -15 -84 39 -35 181 64 -124 -65 180 123 -21 297 212 109 98 153 -26 115 119 -37 105 90 -41
8056 -41 -44 -197 -147 78 -99 67 197 -9 66 -200 130 -172 -42 202 54 31 -124 -15 -68 -206 67 -265
8078 -265 119 -188 -45 -57 403 -127 -297 146 191 201 175 116 -305 92 0 220 -265 46 145 73 112 -175 -24
8101 -24 46 73 221 57 87 -9 70 16 117 96 4 100 -85 6 54 212 190 55 -77 -45 -30 -174 -54 61 -146
8126 -146 154 61 38 -173 147 111 -176 -130 104 -190 -30 16 -183 161 -30 1 63 62 -64 -132 -136 242 37 -12
$$ packed form
7959H8j59P3o2N3q1O2J81j26m2J64l01J52L1K88k06j68L6L11l30P1k3j16J39j33
7983i8J37j23L03k66J7o9L21j01l6J11l02l3J13j84P1K63j24J56j63j43L86l60
8005a24Q2p2K2J6J6r4J68P5k79K26j27N7Qo9J82r4J58r8L3k1Q3l71K77p5j2j43
8031a76P8Q0Lo9J23p4K16j17j88N9K45n7j44L18q5j03j1N5j79J41Mj56J42j5j31
8056d1lj53N0K25j77J66J30k06P5k66L30l02J30K44j48k3j55J09n3j38K73l32
8078b65L84l07J43j2M60n30j70M43M5J0k6n9m21L97r2K20m85L11R9p2L9k87J51
8101b4P0K7J48j64L0r6P9n4J01k1r2R6j85R1M8J58k2j35j32L2J5j44J20J15k07
8126a46L00r3k3k11L20l6k87M6K34k94J60M6j99L44j91L1O2jj26o8mL78k05m9
$$ plain form
8150 -12 -248 113 -124 21 -24 -58 -242 135 18 -49 1 28 5 317 70 -48 -97 -73 -136 76 113 243 -180 -40
8174 -40 103 -137 26 130 -44 90 -38 68 -138 -321 -130 89 -124 -92 134 -8 37
$$ packed form
8150a2k36L61k37J45m5l4j84L77j17o7N0K7k3L12k47j18m9K4o3K12L7J30m23J40
8174d0J43k40J63J04j74J34j28J06k06j83J91K19k13L2K26j42M5
8191C7
$$ Imaginary data points
##PAGE= N=2
##DATA TABLE= (X++(I..I)), XYDATA
$$ plain form
0 0 0 0 0 0 0 0 0 0 0 0 0 0 8 0 8 -8 8 -8 16 -16 17 -24 24 -32 37 -43 48 -57 65 -77 87 -100 112 -128 142 -162
36 -162 181 -204 228 -254 282 -313 348 -384 426 -468 517 -569 629 -692 765 -841 928 -1023
54 -1023 1132 -1253 1393 -1552 1739 -1959 2226 -2554 2969 -3517 4274 -5394 7217 -10725 19951
69 19951 -99714 -236659 -125653 -89699 -78391 -116944 -186088 -253606 -223817 -149471 -64718 -32546
81 -32546 -58945 -105300 -118129 -99831 -29613 45795 79327 79618 77065 62670 68795 102143 134735
94 134735 158308 180506 172027 135260 97921 68233 56643 82069 105940 89284 45290 -11477
106 -11477 -65068 -77018 -51957 -27222 -28545 -70245 -128554 -157709 -160075 -141203 -99712 -78046
118 -78046 -94725 -104214 -102427 -99309 -71339 -29921 1214 30948 46729 37608 30058 34403 53332
$$ packed form
0@%%%%%%%%%%%%QqQj6J6j6K4l2L3m1M8n6O9q0R1j05J22j42J64j87K12k40K70l04
36a62L43l85M32m82N36n95O61p32Q10q94R85j086J198j321J457j606J769j951
54a023K155k385K646k945L291l698M185m780N523o486P791r668J2611j7942L0676
69A9951j19665j36945J11006L5954J1308l8553o9144o7518K9789P4346Q4753L2172
81c2546k6399m6355j2829J8298P0218P5408L3532K91k553j4395O125L3348L2592
94A34735K3573K2198q479l6767l7339k9688j1590K5426K3871j6656m3994n6767
106a1477n3591j1950K5061K4735j323m1700n8309k9155k366J8872M1491K1666
118g8046j6679r489J787L118K7970M1418L1135K9734J5781r121p550M345J8929
$$ plain form
131 53332 95270 133508 138285 117843 83708 56628 65378 97787 117944 112368 72908 16181 -17208
144 -17208 -16566 -3772 6793 -1728 -38707 -78833 -97002 -98111 -87973 -72490 -68330 -75784 -84527
157 -84527 -93185 -91671 -76266 -58752 -36371 -11974 -4467 -8883 -6927 -1026 18493 55110 81492
170 81492 86232 76068 56246 48142 64026 83689 94452 91488 66939 36904 24887 23327 25935
183 25935 29552 19087 -3075 -23397 -41055 -51611 -51001 -49835 -50273 -50293 -58586 -73044 -79073 -75490
197 -75490 -62760 -40133 -24167 -25095 -32253 -36884 -30644 -6216 22453 37580 39839 32230 23229 30338
211 30338 49844 66236 74552 69690 53277 42199 40574 41107 44684 42794 29797 16790 4994
224 4994 -9331 -17862 -19969 -24052 -25828 -29049 -40298 -52727 -59136 -60328 -51673 -39145 -35150 -37152
$$ packed form
131E3332M1938L8238M777k0442l4135k7080Q750L2409K0157n576l9460n6727l3389
144a7208O42J2794J0565q521l6979m0126j8169j109J0138J5483M160p454q743
157h4527q658J514J5405J7514K2381K4397P507m416J956N901J9519L6617K6382
170H1492M740j0164j9822q104J5884J9663J0763k964k4549l0035j2017j560K608
183B5935L617j0465k2162k0322j7658j0556O10J166m38k0q293j4458o029L583
197g5490J2730K2627J5966r28p158m631O240K4428K8669J5127K259p609r001P109
211C0338J9506J6392Q316m862j6413j1078j625N33L577j890j2997j3007j1796
224D994j4325q531k107m083j776l221j1249j2429o409j192Q655J2528L995k002
$$ plain form
238 -37152 -42020 -45815 -37506 -18302 -2289 7325 9801 5124 5745 16719 29471 40482 47863 46029
252 46029 40683 38511 38111 38871 41830 41231 36957 30736 20117 9337 3660 -938 -3013 -2496 -9787
267 -9787 -22578 -32638 -39989 -41125 -33472 -28241 -30643 -36312 -42929 -44365 -35761 -23288 -14331 -9482
281 -9482 -10669 -12962 -7739 1284 10941 21432 25674 24477 25063 26377 27349 32164 35463 35037 34385 30774
297 30774 23305 17515 14556 12457 13092 11027 3175 -5928 -14705 -21003 -19885 -16751 -17970 -21258 -27016
312 -27016 -34347 -33999 -28741 -23605 -18892 -16669 -18737 -19165 -15016 -9854 -2416 4608 7879 10126 11445
327 11445 11290 14135 19153 22658 26655 28497 24456 19646 17880 16164 17706 20872 18213 11534 4303
342 4303 -2471 -5037 -3393 -2489 -5099 -9802 -17430 -22244 -21713 -20104 -17453 -15408 -17213 -20385 -19989 -18676
$$ packed form
238c7152m868l795Q309J9204J6013R614K476m677O21J0974J2752J1011P381j834
252D6029n346k172m00P60K959n99m274o221j0619j0780n677m598k075N17p291
267i787j2791j0060p351j136P653N231k402n669o617j436Q604J2473Q957M849
281i482j187k293N223R023R657J0491M242j197N86J314R72M815L299m26o52l611
297C0774p469n790k959k099O35k065p852r103q777o298J118L134j219l288n758
312b7016p331L48N258N136M713K223k068m28M149N162P438P024L271K247J319
327A1445j55K845N018L505L997J842m041m810j766j716J542L166k659o679p231
342D303o774k566J644R04k610m703p628m814N31J609K651K045j805l172L96J313
$$ plain form
358 -18676 -15905 -10283 -5689 -3763 -1259 -768 -430 2859 6933 11488 16317 17236 15250 14573 13683 14503
374 14503 18654 20819 18552 15094 10127 5588 5516 6889 6022 4473 -124 -6433 -9796 -11177 -11563 -10503
390 -10503 -10752 -13320 -15279 -17013 -18249 -16528 -12905 -11054 -8598 -7193 -8895 -7945 -4819 -1467 3294
405 3294 7628 7962 7164 7350 7806 11115 15073 16377 16444 13985 10252 9206 10544 10654 10107 9104 4705
422 4705 685 -1463 -3668 -4067 -3880 -5355 -7951 -10169 -12889 -14262 -13299 -11982 -10297 -8742 -10033 -11461
438 -11461 -10373 -8851 -5662 -604 1103 1075 2025 1557 2767 6983 9764 11411 11908 10415 8684 8609 9384
455 9384 10107 11140 9531 6675 4849 1941 -102 563 242 -1149 -2375 -4786 -7847 -9092 -8745 -8474
471 -8474 -7290 -7118 -8409 -8961 -9593 -8981 -5974 -3220 -2276 -1611 -1616 -2120 -348 2344 4260 6398 6880 5777
$$ packed form
358a8676K771N622M594J926K504M91L38L289M074M555M829R19j986o77q90Q20
374A4503M151K165k267l458m967m539p2J373q67j549m597o309l363j381l86J060
390a0503k49k568j959j734j236J721L623J851K456J405j702R50L126L352M761
405C294M334L34p98J86M56L309L958J304O7k459l733j046J338J10n47j003m399
422D705m020k148k205l99J87j475k596k218k720j373R63J317J685J555j291j428
438a1461J088J522L189N058J707k8R50m68J210M216K781J647M97j493j731p5P75
455I384P23J033j609k856j826k908k043O65l21j391j226k411l061j245L47K71
471h474J184J72j291n52o32O12L007K754R44O65nn04J772K692J916K138M82j103
$$ plain form
489 5777 5565 5822 5977 7412 8591 7812 6572 5610 3119 2472 2903 2224 2417 1149 -1416 -3158 -4177
506 -4177 -4992 -4124 -3015 -4270 -5426 -5903 -7411 -7060 -4981 -3867 -3387 -2673 -3604 -3564 -2294 -1886 277 2348
524 2348 2075 1931 2676 2390 2618 4621 5172 5215 5405 4494 3186 3120 3236 3579 3954 3417 1773 869 -669
543 -669 -1480 -620 -439 -1080 -1400 -3005 -4444 -4276 -3910 -4305 -3039 -2957 -4105 -4014 -3950 -3355 -2423 -1414 -379
562 -379 128 -598 -438 279 1329 1844 3541 3555 3055 3039 2935 2892 3311 4455 3847 3266 2629 1455 1008 1163
582 1163 906 973 223 -1041 -1646 -2339 -3119 -2679 -2526 -2892 -3265 -3382 -4155 -3613 -2842 -2795 -1942 -1023 -1224 -1602
602 -1602 -918 -389 704 1916 2119 2617 1938 1651 2726 3279 2839 3852 3863 2549 1785 1875 1277 960 1874
621 1874 1095 253 -516 -1606 -2478 -1864 -1849 -1664 -1470 -2576 -3199 -3284 -3299 -2303 -1420 -1266 -1221 -599 -1132 -1369 168
$$ packed form
489E777k12K57J55J435J179p79j240r62k491o47M31o79J93j268k565j742j019
506d177q15Q68J109j255j156m77j508L51K079J114M80P14r31M0J270M08K163K071
524B348k73j44P45k86K28K003N51M3J90r11j308o6J16L43L75n37j644r04j538
543f69q11Q60J81o41l20j605j439J68L66l95J266Q2j148R1O4N95R32J009J035
562c79N07p26J60P17J050N15J697J4n00j6j04m3M19J144o08n81o37j174m47J55
582A163k57O7p50j264o05o93p80M40J53l66l73j17p73N42P71M7Q53R19k01l78
602a602O84N29J093J212K03M98o79k87J075N53m40J013J1j314p64R0n98l17R14
621A874p79q42p69j090q72O14J5J85J94j106o23q5j5R96Q83J54M5O22n33k37J537
$$ plain form
642 168 1562 1510 2191 2169 1171 1203 1803 1922 2862 2471 2321 1580 979 192 582 776 644 1346 330 -1580
662 -1580 -1777 -1828 -1824 -909 -353 -1389 -1697 -2367 -2551 -1413 -445 -518 -102 -264 -1307 -829 -274 706 1762 1960
682 1960 1378 997 192 417 893 2101 1863 1689 1231 -123 -685 104 504 727 659 -152 -1493 -1736 -1980
701 -1980 -1094 194 44 -742 -1098 -1626 -2235 -873 321 692 529 -226 -839 -814 -333 489 1673 1611 1040
720 1040 673 -453 -465 671 1410 1967 1651 234 -787 -760 -516 450 1149 1022 -234 -966 -1898 -1405 -634
739 -634 631 568 357 -1034 -2030 -1802 -1010 53 861 1091 -449 -1018 -1023 -695 311 1584 1630 1221 -40
758 -40 -991 -563 594 1543 2415 1827 356 -318 -298 93 1015 1921 1425 518 -675 -1255 -1196 -41 590 684
778 684 204 -1374 -2229 -2098 -1245 -259 504 50 -1188 -1828 -2194 -1772 19 1109 927 518 -396 -1555 -460
$$ packed form
642A68J394n2O81k2r98L2O00J19R40l91j50p41o01p87L90J94j32P02j016j910
662a580j97n1MR15N56j036l08o70j84J138R68p3M16j62j043M78N55R80J056J98
682A960n82l81q05K25M76J208k38j74m58j354n62P89M00K23o8q11j341k43k44
701a980Q86J288j50p86l56n28o09J362J194L71j63p55o13K5M81Q22J184o2n71
720A040l67j126j2J136P39N57l16j417j021K7K44R66O99j27j256p32r32M93P71
739f34J265o3k11j391r96K28P92J063Q08K30j540n69nL28J006J273M6m09j261
758d0r51M28J157R49Q72n88j471o74K0L91R22R06m96r07j193n80N9J155O31R4
778F84m80j578q55J31Q53R86P63m54j238o40l66M22J791J090j82m09r14j159J095
$$ plain form
797 -460 776 1752 2457 2251 1123 294 75 1035 2333 2602 2376 1349 -266 -1170 -430 543 1075 1232 -85
816 -85 -1974 -2586 -2535 -1897 -783 -390 -1029 -1988 -3289 -3307 -2059 -586 192 572 -363 -1481 -1492 -401 986
835 986 2471 2818 2265 1276 844 787 1737 3195 3485 3125 1860 477 -180 308 908 1681 1152 -564 -1427
854 -1427 -2573 -2853 -1774 -818 -867 -1501 -2506 -3644 -3580 -2672 -1421 -89 -23 -1034 -1849 -1886 -704 860
872 860 2491 2740 2283 1406 757 1201 2078 3232 3830 3206 1885 677 423 721 1398 2288 1671 328 -1225
891 -1225 -2004 -1929 -1185 -451 -492 -1174 -2733 -3805 -3228 -2470 -1452 -538 -838 -1750 -2281 -2094 -1429 117 1208
910 1208 1587 1071 341 13 544 1877 2709 3595 2966 1481 1094 710 1352 2310 3013 2357 948 -496 -1010
929 -1010 -670 233 578 164 -528 -2006 -3217 -2903 -2003 -660 -601 -1410 -2118 -2974 -2944 -1816 -514 222 329
$$ packed form
797d60J236R76P05k06j128q29k19R60J298K69k26j027j615r04P40R73N32J57j317
816h5j889o12N1O38J114L93o39r59j301j8J248J473P78L80r35j118j1J091J387
835I86J485L47n53r89m32n7R50J458K90l60j265j383o57M88O00P73n29j716q63
854a427j146k80J079R56m9o34j005j138O4R08J251J332O6j011q15l7J182J564
872H60J631K49m57q77o49M44Q77J154N98o24j321j208k54K98O77Q90o17j343j553
891a225p79P5P44P34m1o82j559j072N77P58J018R14l00r12n31J87O65J546J091
910A208L79n16p30l28N31J333Q32Q86o29j485l87l84O42R58P03o56j409j444n14
929a010L40R03L45m14o92j478j211L14R00J343N9q09p08q56L0J128J302P36J07
$$ plain form
948 329 -215 -1075 -1069 -414 733 2080 2663 1958 920 806 825 1800 2681 3054 2956 1850 352 152 864 1518
968 1518 2030 1584 264 -694 -1819 -1667 -898 -208 -292 -1186 -2468 -3500 -3294 -2543 -1527 -541 -608 -1719 -2470
987 -2470 -2524 -1728 -310 1062 1632 1038 380 427 486 1674 3267 3779 3308 2314 1287 1211 2098 2694 2928 2351
1007 2351 975 208 -867 -731 -105 487 18 -1058 -2443 -3200 -3220 -2739 -2084 -1414 -1603 -2717 -3349 -3226
1025 -3226 -2381 -1307 -262 -208 -121 -766 -784 48 1430 2702 3036 2807 1764 1359 1651 2192 3300 3550 2944
1044 2944 2193 1047 27 666 1167 1249 779 -168 -1703 -2695 -2386 -2036 -1613 -1080 -2036 -2886 -3187 -3261 -2554
1063 -2554 -1420 -821 -650 -764 -1545 -1587 -537 645 1684 2261 1674 1066 977 1400 1989 3261 3517 2979 2079
1082 2079 1028 829 1200 1917 2284 1850 625 -725 -1212 -1334 -629 -373 -166 -1301 -1910 -2695 -2603 -2331 -1477
$$ packed form
948C29n44q60OO55J147J347N83p05j038j14J9R75Q81L73r8j106j498k00P12O54
968A518N12m46j320r58j125J52P69O90q4q94j282j032K06P51J016R86o7j111p51
987b470n4P96J418J372N70n94o58M7N9J188J593N12m71r94j027p6Q87N96K34n77
1007B351j376p67j075J36O26N92m69j076j385p57k0M81O55O70j89j114o32J23
1025c226Q45J074J045N4Q7o45j8Q32J382J272L34k29j043m05K92N41J108K50o06
1044B944p51j146j020O39N01Q2m70r47j535r92L09L50M23N33r56q50l01p4P07
1063b554J134N99J71j14p81m2J050J182J039N77n87o08q9M23N89J272K56n38r00
1082B079j051j99L71P17L67m34j225j350m87j22P05K56K07j135o09p85R2K72Q54
$$ plain form
1101 -1477 -1178 -1361 -1552 -2383 -2370 -1562 -334 562 729 402 -23 -320 -100 1048 2253 2649 2110 1455 815
1120 815 766 1431 2160 2648 2293 1358 396 85 163 548 1379 926 -91 -978 -1634 -2160 -1521 -1216 -829 -819 -2079
1141 -2079 -2750 -2622 -2272 -1302 -554 -667 -1183 -1360 -1414 -1244 55 1119 1156 1055 680 436 974 1460 2072 2690
1161 2690 2728 2095 1339 1126 1397 1728 2092 2026 1215 253 -706 -957 -160 -276 -230 -1052 -1910 -2500 -2748 -2443 -1876
1182 -1876 -1387 -1448 -1988 -2567 -2425 -2008 -942 -50 121 287 -73 -134 228 1092 2139 2469 2307 1869 1623 1585
1202 1585 1886 2410 2580 2585 1699 673 240 225 305 472 380 -390 -1329 -2206 -2226 -1980 -1820 -1325 -1779 -2016 -2700
1223 -2700 -2689 -2339 -1382 -747 -357 -797 -906 -607 -323 231 1391 1509 1682 1524 1346 1153 1801 2295 2791 2331
1243 2331 1813 1243 758 863 940 1175 1115 248 -461 -1224 -1573 -1082 -1232 -885 -1063 -1459 -2154 -2553 -2113 -1343
$$ packed form
1101a477K99j83j91q31J3Q08J228Q96J67l27m25k97K20J148J205L96n39o55o40
1120H15m9O65P29M88l55r35r62l11P8L85Q31m53j017q87o56n26O39L05L87J0j260
1141b079o71J28L50R70P48j13n16j77n4J70J299J064L7j01l75k44N38M86O12O18
1161B690L8o33p56k13K71L31L64o6q11r62r59k51P97j16M6q22q58n90k48L05N67
1182a876M89o1n40n79J42M17J066Q92J71J66l60o1L62Q64J047L30j62m38k46l8
1202A585L01N24J70Nq86j026m33j5Q0J67r2p70r39q77k0K46J60M95m54k37o84
1223b700J1L50R57O35L90m40j09K99K84N54J160J18J73j58j78j93O48M94M96m60
1243B331n18n70m85J05P7K35o0q67p09p63l49M91j50L47j78l96o95l99M40P70
$$ plain form
1263 -1343 -967 -785 -1171 -1246 -1626 -1142 -248 434 674 920 594 209 415 1297 1629 1903 1882 1391 1188 1014
1283 1014 1076 1462 1823 1562 979 224 -347 -637 25 2 -120 -332 -1138 -1561 -1743 -1755 -1262 -896 -1099 -1251 -1759
1304 -1759 -1772 -1638 -1091 -563 -19 -402 -636 -699 -292 228 794 1034 1283 1155 981 850 1157 1479 1805 1817 1524
1325 1524 1337 380 466 765 987 899 384 -179 -484 -787 -620 -464 -659 -808 -735 -1427 -2051 -1724 -1549 -618 -1221
1346 -1221 -982 -945 -1228 -1198 -580 48 473 841 707 271 329 631 1091 1637 2098 1536 1162 1057 1114 1263 1438
1367 1438 1699 1145 662 174 -204 -243 61 -73 -257 -912 -1540 -1376 -1760 -1466 -1026 -1005 -1510 -1932 -1693 -1297
1387 -1297 -1005 -453 -251 -138 -101 -41 -93 132 722 1273 1520 1583 1202 1243 1044 1231 1339 1694 1262 953 533
1408 533 89 150 606 505 112 -106 -668 -1177 -1250 -893 -935 -819 -1019 -1357 -1528 -1537 -1217 -871 -434 -262 -482 -941
$$ packed form
1263a343L76J82l86p5l80M84Q94O82K40K46l26l85K06Q82L32K74k1m91k03j74
1283A014O2L86L61k61n83p55n71k90O62k3j22k12q06m23j82j2M93L66k03j52n08
1304a759j3J34N47N28N44l83k34o3M07N20N66K40K49j28j74j31L07L22L26J2k93
1325A524j87r57Q6K99K22q8n15n63l05l03J67J56j95j49P3o92o24L27J75R31o03
1346a221K39L7k83L0O18O28M25L68j34m36N8L02M60N46M61n62l74j05N7J49J75
1367A438K61n54m83m88l78l9L04j34j84o55o28J64l84K94M40K1n05m22K39L96
1387a297K92N52K02J13L7O0n2K25N90N51K47O3l81M1j99J87J08L55m32l09m20
1408E33m44O1M56j01l93k18n62n09p3L57m2J16k00l38j71rL20L46M37J72k20m59
$$ plain form
1430 -941 -457 -248 50 517 1031 638 632 340 592 1088 1245 1621 1165 917 585 301 633 882 796 485 327
1451 327 -200 -519 -493 -467 -232 -101 -624 -564 -1184 -1711 -1008 -672 -279 -514 -889 -958 -942 -575 -119 127 -59 109
1473 109 50 21 -169 201 550 715 925 579 378 388 681 916 1112 898 504 558 191 111 357 446 406 141
1495 141 -89 -712 -481 -630 -100 -170 -290 -739 -1261 -1184 -770 -793 -494 -228 -491 -747 -755 -437 -389 6 468 619
1517 619 263 190 369 447 771 1213 1223 1044 728 484 464 739 702 909 333 238 -173 -344 63 -28 50 -199 -410
1540 -410 -896 -1025 -1167 -626 -569 -473 -596 -1140 -786 -907 -628 -133 -21 72 123 -43 -61 412 633 812 959 651
1562 651 492 224 624 1037 909 870 794 414 30 50 -64 253 417 323 -246 -665 -706 -543 -359 -373 -459 -653
1584 -653 -779 -936 -797 -538 -250 -109 -127 -199 -361 -196 -122 241 677 501 512 352 421 363 653 757 547 567
$$ packed form
1430i41M84K09K98M67N14l93ok92K52M96J57L76m56k48l32k84L32K49q6l11j58
1451C27n27l19K6K6K35J31n23O0o20n27P03L36L93k35l75o9J6L67M56K46j86J68
1473A09n9k9j90L70L49J65K10l46k01J0K93K35J96k14l94N4l67q0K46Q9m0k65
1495A41k30o23K31j49N30p0j20m49n22P7M14k3K99K66k63k56qL18M8L95M62J51
1517F19l56p3J79P8L24M42J0j79l16k44k0K75l7K07n76r5m11j71M07r1P8k49k11
1540d10m86j29j42N41N7R6j23n44L54j21K79M95J12R3N1j66j8M73K21J79J47l08
1562F51j59k68M00M13j28l9p6l80l84K0j14L17J64r4n69m19m1J63J84j4q6j94
1584f53j26j57J39K59K88J41j8p2j62J65P4L63M36j76J1j60O9n8K90J04k10K0
$$ plain form
1606 567 290 109 221 268 140 567 371 170 69 -399 -137 -29 -99 -276 -277 -627 -636 -670 -488 -158 -220 0 -436
1629 -436 -501 -394 -340 -108 -41 -191 77 -251 -320 -153 277 499 521 255 -128 -32 179 530 323 822 477 148
1651 148 207 15 122 150 286 254 250 66 -243 -444 -218 -48 244 -67 -513 -468 -606 -529 -357 -370 -157 -325 -503
1674 -503 -782 -214 -22 126 211 -90 -36 -131 -171 241 538 592 394 445 124 51 290 377 655 465 436 -37 -176
1697 -176 -64 46 283 123 -119 -242 -363 -406 -414 -316 -258 -234 -306 -773 -585 -450 -154 -193 107 118 -64 -191 -283
1720 -283 43 493 484 520 444 350 171 328 468 630 601 495 62 -114 280 -113 82 485 121 -255 -387 -420
1742 -420 -554 -124 -143 -282 -493 -565 -685 -539 -233 -93 -16 296 -109 -74 -382 51 257 474 354 58 199
1763 199 -71 4 299 569 474 189 -149 -33 -82 454 -83 202 -114 -166 -111 -449 -96 -77 -92 -64 -326 -346 -665
$$ packed form
1606E67k77j81J12M7j28M27j96k01j01m68K62J08p0j77jl50rl4J82L30o2K20m36
1629d36o5J07N4K32O7j50K68l28o9J67M30K22K2k66l83R6K11L51k07M99l45l29
1651A48N9j92J07K8J36l2mj84l09k01K26J70K92l11m46M5j38P7J72j3K13j68j78
1674e03k79N68J92J48Q5l01N4r5m0M12K97N4j98N1l21p3K39Q7K78j90k9m73j39
1697a76J12J10K37j60k42j23j21m3qR8N8K4p2m67J88J35K96l9L00J1j82j27r2
1720b83L26M50rL6p6r4j79J57J40J62k9j06m33j76L94l93J95M03l64l76j32l3
1742d20j34M30j9j39k11p2j20J46L06J40P7L12m05L5l08M33K06K17j20k96J41
1763A99k70P5K95K70r5k85l38J16m9N36n37K85l16n2N5l38L53J9j5K8k62k0l19
$$ plain form
1786 -665 -225 -70 266 286 -495 -366 -409 -356 -61 253 70 120 -72 -237 -32 -262 165 295 278 22 -68 -29
1808 -29 -108 123 375 374 136 -130 -201 -195 43 334 78 138 -125 -308 -234 -274 68 179 -86 -240 -430 -627 -153
1831 -153 -34 76 26 -70 -276 -162 96 -283 69 182 152 -52 -225 -100 -79 102 421 129 395 366 4 155
1853 155 94 522 397 201 322 61 -8 -60 127 -87 -36 -165 -272 -457 -282 -177 -271 -58 -29 -261 -239 -272 -157
1876 -157 -33 -164 137 -151 -121 -9 -210 -20 364 456 198 215 7 271 396 128 637 312 45 154 18
1897 18 -98 310 268 -12 -11 -345 -114 -328 -127 27 -15 -155 -264 -639 -366 -135 2 -41 -131 -265 -178 -148 -231
1920 -231 45 355 292 357 83 161 82 34 373 360 245 277 73 203 193 12 140 225 209 -271 -148 -189 -357 -26
1944 -26 -5 -246 -291 -188 -141 -154 178 200 180 -196 -270 -244 -82 41 145 85 -161 47 -191 -238 98 10 42 296
$$ packed form
1786f65M40J55L36K0p81J29m3N3K95L14j83N0j92j65K05k30M27J30j7k56r0L9
1808b9p9K31K52jk38k66p1OK38K91k56O0k63j83P4m0L42J11k65j54j90j97M74
1831a53J19J10n0r6k06J14K58l79L52J13l0k04j73J25K1J81L19k92K66k9l62J51
1853A55o1M28j25j96J21k61o9n2J87k14N1j29j07j85J75J05r4K13K9k32K2l3J15
1876a57J24j31L01k88L0J12k01J90L84R2k58J7k08K64J25k68N09l25k67J09j36
1897A8j16M08m2k80Jl34K31k14K01J54m2j40j09l75K73K31J37m3r0j34Q7L0q3
1920b31K76L10o3O5k74P8p9m8L39j3j15L2k04J30j0j81J28Q5j6m80J23m1j68L31
1944b6K1k41m5J03M7j3L32K2k0l76p4K6J62J23J04o0k46K08k38m7L36q8L2K54
$$ plain form
1968 296 139 -51 -127 175 49 333 49 -143 80 -252 44 -46 10 119 74 190 -8 -319 -94 -14 307 102
1990 102 59 -138 -239 -158 123 247 71 -224 -261 -127 -227 158 260 194 -140 119 -146 -83 120 144 99 299
2012 299 349 -335 -189 165 61 146 112 535 -3 -297 -94 17 147 133 269 -109 -257 -233 -257 -91 -108 -103 -103 -382
2036 -382 -117 -360 -146 230 306 -91 95 -24 -265 -162 -171 63 185 91 -149 -200 41 353 205 433 -5 102
2058 102 99 -63 44 237 49 263 59 21 -138 -35 -265 47 12 94 -1 -242 -368 -161 -66 60 -105 -365
2080 -365 -73 -71 -254 312 288 200 75 252 -43 -105 69 205 137 -110 -305 154 125 69 -349 177 -2 -106 -192
2103 -192 -231 50 -21 205 -30 -117 84 -366 -407 -31 40 197 145 -171 -161 -133 -164 378 215 63 283 162 5
2126 5 -62 -272 353 -34 -306 -171 -160 -189 8 -103 29 48 53 80 -108 -17 140 107 -15 -230 56 -187 -32 63
$$ packed form
1968B96j57j90p6L02j26K84k84j92K23l32K96r0N6J09m5J16j98l11K25Q0L21k05
1990A02m3j97j01Q1K81J24j76k95l7J34j00L85J02o6l34K59k65O3K03K4m5K00
2012B99N0o84J46L54j04Q5l4M23n38k94K03J11J30j4J36l78j48K4k4J66j7N%k79
2036c82K65k43K14L76P6l97J86j19k41J03rK34J22r4k40n1K41L12j48K28m38J07
2058A02lj62J07J93j88K14k04l8j59J03k30L12l5Q2r5k41j26K07R5J26j65k60
2080c65K92Kj83N66k4q8j25J77k95o2J74J36o8k47j95M59k9n6m18N26j79j04q6
2103a92l9K81p1K26k35q7K01m50m1L76P1J57n2l16J0K8l1N42j63j52K20j21j57
2126Eo7k10O25l87k72J35J1k9J97j11J32J9NK7j88R1J57l3j22k15K86k43J55R5
$$ plain form
2150 63 120 232 -118 -126 123 -116 -23 203 13 107 100 -146 -37 -181 -84 213 -214 19 20 -172 -309 42 178 211
2174 211 -125 -80 -110 -78 211 -73 293 398 51 -211 -51 108 202 227 81 424 315 -52 -60 106 -125 116
2196 116 240 -224 -54 -84 -119 -272 105 -201 -91 -26 -95 -80 -107 210 159 58 -279 -163 53 -258 -95 36
2218 36 28 -317 -95 -59 214 113 187 174 78 -222 -34 -36 -167 145 6 72 65 -127 -123 -14 352 -195 -21 10 35
2243 35 -47 -39 -178 222 150 -135 -202 -32 -8 -34 168 87 2 185 -191 -82 8 65 -125 200 64 -130 25 123
2267 123 -146 -169 83 118 -173 252 -74 47 -19 -196 -35 56 -68 -3 -234 -150 128 220 -58 -166 -111 -183 -32
2290 -32 -92 -19 14 30 71 -128 17 -81 -84 158 -87 -286 15 -218 133 -20 65 32 -67 173 -41 -21 -63 256 196
2315 196 305 60 -55 49 4 183 122 70 183 -66 -267 -78 -25 -154 -123 33 -166 -90 -276 -387 22 -76
$$ packed form
2150F3N7J12l50qK49k39R3K26j90R4pk46J09j44R7K97m27K33Jj92j37L51J36L3
2174B11l36M5l0L2K89k84L66J05l47k62J60J59R4K5j46L43j09l67qJ66k31K41
2196A16J24m64J70l0l5j53L77l06J10O5o9J5k7L17n1j01l37J16K16l11J63J31
2218C6ql45K22L6K73j01P4j3r6l00J88kj31L12j39O6pj92MJ09L66n47J74L1K5
2243C5q2Qj39M00p2k85o7J70K4k6K02q1q5J83l76J09R0N7j90L25j36j94J55R8
2267A23k69k3K52L5k91M25l26J21o6j77J61R1j24O5k31Q4K78R2k78j08N5p2J51
2290c2o0P3L3J6M1j99J45r8lK42k45j99L01k33L51j53Q5l3r9K40k14K0m2L19o0
2315A96J09k45j15J04m5J79o1n2J13k49k01J89N3j29L1J56j99P6j86j11M09r8
$$ plain form
2337 -76 -153 47 134 -149 -86 25 -107 298 -142 102 60 367 -21 388 160 184 227 111 -4 178 116 -52 -199
2360 -199 -69 -180 -63 -136 -36 -196 -38 18 -258 -50 -196 -179 -310 77 -134 -156 -180 -162 34 -245 24 -128
2382 -128 -202 27 -189 345 163 402 -173 249 -63 118 26 115 76 256 -274 -115 -253 -76 -207 -219 76 41
2404 41 -63 -21 -267 -140 -45 9 8 -149 -6 -130 169 -236 -38 -85 10 77 -63 -231 -104 38 -40 6 -21 26
2428 26 139 61 -29 -45 291 231 51 215 123 242 225 67 129 -46 -6 -184 -4 3 258 139 65 -133 -248 -351
2452 -351 -75 -78 131 -93 208 -85 -177 -98 94 -64 47 -362 -8 -116 -128 140 122 21 1 -66 264 131 240
2475 240 159 -58 511 103 146 -71 -51 -94 99 52 -6 -212 -282 87 -136 49 -166 143 -380 -46 -357 -462
2497 -462 -222 99 -3 -191 -199 -50 -211 -8 104 -21 307 76 90 152 227 494 67 164 21 182 249 159 404
$$ packed form
2337g6p7K00Q7k83O3J11j32M05m40K44m2L07l88M09k28K4M3j16j15J82o2j68j47
2360a99J30j11J17p3J00j60J58N6k76K08j46J7j31L87k11k2k4J8J96k79K69j52
2382a28p4K29k16N34j82K39n75M22l12J81r2Q9l9J80n30J59j38J77j31j2K95l5
2404D1j04M2k46J27R5N4jj57J43j24K99m05J98m7R5O7j40j68J27J42p8M6k7M7
2428B6J13p8r0j6L36o0j80J64r2J19j7j58O2j75M0j78J80PK55j19p4j98j15j03
2452c51K76lK09k24L01k93r2P9J92j58J11m09L54j08j2K68j8j01k0o7L30j33J09
2475B40q1k17N69m08M3k17K0m3J93m7n8k06p0L69k23J85k15L09n23L34l11j05
2497d62K40L21j02j88qJ49j61K03J12j25L28k31J4O2P5K67m27R7j43J61O7r0K45
$$ plain form
2520 404 -110 29 159 -123 191 121 -378 -25 4 -124 34 -57 -295 -235 -272 -188 -267 -211 -61 3 -518 180 525
2543 525 -220 7 -1 -117 -219 0 -54 238 85 323 120 -113 -43 -5 2 -103 -172 -110 -68 401 9 -140 83
2566 83 -166 -166 -345 15 -52 205 -268 -112 -40 72 16 -157 -316 -162 -4 -35 210 -38 74 -35 113 188 149
2589 149 153 -35 -45 176 388 128 21 -1 -261 206 169 43 -6 216 149 -217 -71 -39 -317 150 -257 -46 307
2612 307 60 194 -207 -157 123 -44 -251 -207 -387 69 -47 -115 -1 352 -14 54 88 -99 40 -32 325 134
2634 134 -212 20 37 147 222 101 185 252 175 148 86 -209 -97 41 -373 -145 -19 -39 -202 -230 -28 128 -201
2657 -201 -85 -73 -164 41 56 227 14 -248 -188 128 -23 34 147 349 13 163 167 4 240 118 23 114 130
2680 130 -11 333 -74 227 106 -148 -211 -145 -157 115 31 68 -83 -194 -184 6 -339 -82 74 -123 -252 -22
$$ packed form
2520D04n14J39J30k82L14p0m99L53K9j28J58r1k38O0l7Q4p9N6J50O4n21O98L45
2543E25p45K27qj16j02K19n4K92j53K38k03k33P0L8Pj05o9O2M2M69l92j49K23
2566H3k49%j79L60o7K57m73J56P2J12n6j73j59J54J58l1K45k48J12j09J48P5l9
2589A49Mj88j0K21K12k60j07k2k60M67l7j26m9K22o7l66J46L2k78M67m07K11L53
2612C07k47J34m01N0K80j67k07M4j80M56j16o8J14L53l66O8L4j87J39p2L57j91
2634A34l46K32J7J10P5j21Q4O7p7k7o2k95J12J38m14K28J26k0j63k8K02J56l29
2657b01J16J2r1K05J5J71k13k62O0L16j51N7J13K02l36J50Mj63K36j22r5R1J6
2680A30j41L44m07L01j21k54o3O6j2K72q4L7j51j11J0J90l45K57J56j97j29K30
$$ plain form
2702 -22 4 -27 100 28 -42 -10 -164 -277 71 -47 -106 103 230 434 202 -17 -77 65 -150 -105 53 -192 -116
2725 -116 18 -103 87 296 76 -258 -199 -181 -104 -157 71 195 -51 -63 -161 -103 65 -213 -34 -252 -151 -201 -276
2748 -276 120 104 -61 160 49 264 38 155 -54 -249 229 221 -78 -252 39 15 362 -132 79 -12 -75 -71 -112
2771 -112 250 33 -9 132 -145 51 -70 -82 -155 -247 -19 32 -272 -35 -68 -63 284 -88 -6 -119 -71 -93 -10 75
2795 75 43 39 216 -133 86 65 58 83 46 146 -47 -39 99 -112 155 151 -80 267 -24 -53 106 195 132 -91 -4 -53
2821 -53 -145 15 -88 -85 29 97 -28 -38 7 -80 102 299 30 -90 143 123 227 20 181 58 -106 84 21
2844 21 -75 192 41 54 -53 -200 139 -44 96 -15 93 63 -192 -254 -280 49 -142 198 -163 -191 -8 -32 -27
2867 -27 354 76 -40 83 137 -261 -109 24 228 339 83 385 -287 -159 37 59 43 261 -51 50 157
$$ packed form
2702b2K6l1J27p2p0L2j54j13L48j18n9K09J27K04k32k19o0J42k15M5J58k45P6
2725a16J34j21J90K09k20l34N9J8P7n3K28J24k46j2r8N8J68k78J79k18J01n0p5
2748b76L96j6j65K21j11K15k26J17k09j95M78qk99j74K91k4L47m94K11r1o3Mm1
2771a12L62k17m2J41k77J96j21j2p3r2K28N1l04K37l3NL47l72Q2j13M8k2Q3Q5
2795G5l2mJ77l49K19k1pK5l7J00j93QJ38k11K67mk31L47k91k9J59Q9o3k23Q7m9
2821e3r2J60j03LJ14O8j25j0M5q7J82J97k69j20K33k0J04k07J61j23j64J90o3
2844B1r6K67j51J3j07j47L39j83J40j11J08l0k55o2k6L29j91L40l61k8J83k4N
2867b7L81k78j16J23N4l98J52J33K04J11k56L02o72J28J96K2j6K18l12J01J07
$$ plain form
2888 157 -312 29 -137 -22 -114 -108 31 -19 -287 -159 -56 -3 -214 145 -108 -120 104 -151 -96 -119 -101 27 113
2911 113 148 56 -38 83 -11 -93 -72 182 164 108 142 182 37 117 -274 -116 -241 -262 213 -132 -56 -160 -28 -26 -18 24
2937 24 -113 -162 -198 1 -35 100 8 69 90 -332 -48 69 153 -30 26 -200 -143 72 76 211 284 -124 -115 -134 -109 -134
2963 -134 -53 -65 -66 217 33 -140 -177 8 51 -16 158 -12 -51 -283 -57 0 -34 -43 101 0 -69 -52 -93 120 114 -66
2989 -66 -24 -204 -125 69 0 50 -65 -38 183 210 -161 2 108 282 170 179 139 -68 230 -16 -79 -32 -343 -114
3013 -114 -265 -276 126 -71 180 -106 -107 137 -384 -57 -138 228 125 -116 -261 3 -119 -257 240 -170 1
3034 1 -179 204 -64 47 36 -5 -323 168 156 226 -19 -51 335 96 0 25 -135 84 -85 -321 -25 137 17
3057 17 -126 59 -23 56 -59 83 -133 60 16 266 64 115 269 -186 10 106 45 44 94 -63 141 -140 -166 197
$$ packed form
2888A57m69L41j66J15r2OJ39n0k68J28J03N3k11L59k53j2K24k55N5k3J8J28Q6
2911A13L5r2r4J21r4q2K1K54j8n6L4M0j45Q0l91J58j25k1M75l45P6j04J32KQM2
2937B4j37m9l6J99l6J35r2O1K1m22K84J17Q4j83N6k26N7K15MJ35P3m08Rj9K5k5
2963a34Q1j2jK83j84j73l7J85M3o7J74j70l9k32K26N7l4rJ44j01o9J7m1K13oj80
2989f6M2j80P9J94o9N0j15K7K21K7l71J63J06J74j12Rm0k07K98k46o3M7l11K29
3013a14j51j1M02j97K51k86jK44n21L27q1L66j03k41j45K64j22j38M97m10J71
3034Aj80L83k68J11j1m1l18M91j2P0k45l2L86k39r6K5j60K19j69k36K96J62j20
3057A7j43J85q2P9j15J42k16J93m4K50k02N1J54m55J96R6o1jN0j57K04k81k6L63
$$ plain form
3081 197 19 -57 196 111 -91 -39 -132 -106 104 -171 -48 -50 66 -135 -173 11 51 37 -5 87 -21 64 105 -185 -216
3106 -216 -25 -92 137 72 -25 -169 -26 125 -199 86 -154 -167 -13 9 -32 29 27 -207 -19 119 28 -65 -138 -173
3130 -173 -46 156 -60 52 126 -46 111 -27 -153 2 132 252 145 6 -78 170 288 73 -25 23 -231
3151 -231 -41 -45 267 -44 -229 119 41 141 -209 142 52 -14 74 90 199 431 89 194 -144 -8 -80 87 208
3174 208 5 -152 36 -89 -348 305 -284 283 -32 -40 -72 -106 -143 49 19 -57 110 20 104 -125 415 28 193
3197 193 99 -52 43 25 226 -69 96 74 -19 51 217 -70 105 141 233 6 -32 53 -151 3 -96 -263 -122 -166
3221 -166 6 -244 -285 6 -265 188 -27 50 -12 103 -197 102 -79 25 30 -77 77 -98 -87 -11 -9 -149 64
3244 64 52 298 105 50 118 -8 12 19 -28 -64 -144 397 134 -46 222 -116 113 6 31 -8 104 -4 15 -113
$$ packed form
3081A97j78p6K53q5k02N2r3K6K10k75J23kJ16k01l8J84M0j4m2R2j08Q5M1k90l1
3106b16J91o7K29o5r7j44J43J51l24K85k40j3J54K2m1O1kk34J88J38r1r3p3l5
3130a73J27K02k16J12P4j72J57j38j26J55J30J20j07j39q4K48J18k15r8M8k54
3151b31J90mL12l11j85L48p8J00l50L51r0o6Q8J6J09K32l42J05l38J36p2J67J21
3174B08k03j57J88j25k59O53n89N67l15ql2l4l7J92l0p6J67r0Q4k29N40l87J65
3197A93r4j51R5j8K01k95J65k2r3P0J66k87J75L6R2k27l8Q5k04J54r9j67J41m4
3221a66J72k50m1K91k71M53k15P7o2J15l00K99j81J04Nj07J54j75J1P6Kj40K13
3244F4j2K46j93n5O8j26K0Pm7l6q0N41k63j80K68l38K29j07K5l9J12j08J9j28
$$ plain form
3268 -113 108 95 3 -134 171 182 187 -189 -22 49 -333 126 28 -210 24 233 -101 24 14 -354 -71 -118 407
3291 407 157 -117 -22 136 218 146 36 63 -17 237 -134 -199 115 364 -223 90 14 -226 -159 28 173 88 34
3314 34 50 208 -206 -315 -20 157 140 223 -22 49 239 54 69 76 -11 -1 29 45 139 129 -192 -62 59 -2 -70
3339 -70 -84 131 270 253 58 -115 92 217 -50 -251 118 145 46 160 -117 -230 68 141 44 154 189 72 90
3362 90 -12 -31 57 117 -61 180 221 154 34 105 -163 -87 -219 -143 194 -90 -94 -400 -30 -96 -157 120 -19 -70 242
3387 242 -184 -66 -53 -136 163 97 165 -164 -84 -62 308 34 14 162 -68 71 0 -56 -178 20 -177 -40 62
3410 62 273 38 -161 27 -58 173 69 -153 -299 49 -176 70 237 135 60 -7 -36 -24 -27 -80 -90 135 172 -295
3434 -295 62 -164 138 286 -129 106 213 132 -261 -338 -103 76 -147 139 -218 -43 -183 -35 43 -111 4
$$ packed form
3268a13K21j3r2j37L05J1Nl76J67P1l82M59r8k38K34K09l34J25j0l68K83m7N25
3291D07k50k74R5J58Q2p2j10K7q0K54l71o5L14K49n87L13p6k40O7J87J45q5n4
3314C4J6J58m14j09K95J77j7Q3k45P1J90j85J5Pq7J0L0J6R4j0l21J30J21o1o8
3339g0j4K15J39j7j95j73K07J25k67k01L69K7r9J14k77j13K98P3r7J10L5j17J8
3362I0j02j9Q8O0j78K41M1o7j20P1k68P6j32P6L37k84ml06L70o6o1K77j39n1L12
3387B42m26J18J3q3K99o6O8l29Q0K2L70k74k0J48k30J39p1n6j22J98j97J37J02
3410F2K11k35j99J88q5K31j04k22j46L48k25K46J67j02p5o7k9J2ln3j0K25L7m67
3434b95L57k26L02J48m15K35J07q1l93p7K35J79k23K86l57J75j40J48P8j54J15
$$ plain form
3455 4 -120 86 152 130 -5 75 -34 122 34 129 56 -158 67 82 -103 -187 -322 -232 154 -81 -365 205 28 -93
3479 -93 -89 -88 126 -232 -137 -65 38 30 155 52 91 60 -101 244 83 158 112 106 62 312 -42 -70 44 54 -109 31
3505 31 249 -4 -161 -126 -48 -356 240 35 108 202 -205 39 -82 326 130 -318 -107 102 9 166 28 -140
3527 -140 396 97 137 98 41 130 -56 87 181 160 -225 -175 66 -62 -117 -209 -115 -14 73 26 30 47 214 146 -34
3552 -34 29 -158 95 -215 20 61 -110 33 205 -12 82 97 -52 -98 -28 -70 298 205 -34 88 -22 -150 -169
3575 -169 -49 136 164 74 192 -47 -169 73 -86 231 -99 -124 187 83 153 -232 -19 36 35 -70 -22 -35 118
3598 118 -245 -20 -13 273 173 -90 56 96 180 -69 259 -64 142 -178 -125 -173 -16 33 -136 154 130 262 247
3621 247 162 150 11 68 -180 -78 -44 244 60 -176 -132 121 17 -48 56 -67 88 14 78 -88 -297 -106 97
$$ packed form
3455Dj24K06O6k2j35Q0j09J56q8R5p3k14K25J5j85q4j35R0L86k35k84N70j77j21
3479i3MJK14l58R5P2J03qJ25j03L9l1j61L45j61P5m6om4K50l54k8J14J0j63J40
3505C1K18k53j57L5P8l08N96k05P3R4m07K44j21M08j96m48K11K09r3J57j38j68
3527a40N36k99M0l9n7Q9j86J43R4k1l85N0K41j28n5r2R4J01Q7m7MJ7J67o8j80
3552c4O3j87K53l10K35M1j71J43J72k17R4J5j49m6P0m2L68r3k39J22j10j28j9
3575a69J20J85K8r0J18k39j22K42j59L17l30k5L11j04P0l85K13N5jj05M8j3J53
3598A18l63K25PK86j00k63J46M0Q4k49L28l23K06l20N3m8J57M9j69K90k4J32j5
3621B47q5j2j39N7k48J02L4K88j84k36M4K53j04o5J04j23J55p4O4j66k09J91K03
$$ plain form
3644 97 59 -193 -10 -210 20 154 65 -258 -59 147 -70 -73 37 -99 -47 121 144 131 -227 -246 -60 251 -59
3667 -59 185 91 -75 -28 79 -87 307 -16 -34 -150 122 -49 -178 -45 286 68 -420 354 7 -119 26
3688 26 165 -52 122 288 65 -91 -190 39 54 -122 128 -166 83 74 152 22 -98 -104 -128 -133 133 35 -223 99
3712 99 -105 -3 -73 100 -131 293 -74 -80 -15 -39 89 203 260 112 106 118 60 293 -80 105 -55 -46 166 -209
$$ packed form
3644I7l8k52J83k00K30J34q9l23J99K06k17lJ10j36N2J68K3j3l58j9J86L11l10
3667e9K44r4j66M7J07j66L94l23j8j16K72j71j29J33L31k18m88P74l47j26J45
3688B6J39k17J74J66k23j56r9K29J5j76K50k94K49rP8j30j20ok4nK66r8k58L22
3712I9k04J02p0J73k31M24l67oO5k4J28J14N7j48oJ2n8K33l73J85j60RK12l75
$$ [...]
8191a58
##END NTUPLES=NMR FID
##END=
