##TITLE=1H_SR83 Gly'
 CDCl3, 8 sc, 
 1.9.2021
##JCAMPDX= 6.0         $$ Bruker NMR JCAMP-DX V2.0
##DATA TYPE= NMR FID
##DATA CLASS= NTUPLES
##ORIGIN= UXNMR, Bruker Analytische Messtechnik GmbH
##OWNER= root
$$ XWIN-NMR		Version 3.5
$$ Wed Sep  1 15:54:56 2021 Russian Standard Time (UT+4h)  she@DPX200
##.OBSERVE FREQUENCY= 200.1312
##.OBSERVE NUCLEUS= ^1H
##.DELAY= (6, 6)
##.ACQUISITION MODE= SIMULTANEOUS
##.ACQUISITION SCHEME= undefined
##.AVERAGES= 8
##.DIGITISER RES= 18
##SPECTROMETER/DATA SYSTEM= spect
##.PULSE SEQUENCE= zg30
##.SOLVENT NAME= CD2Cl2
##.SHIFT REFERENCE= (INTERNAL, CD2Cl2, 0, 15.7039)
##AUDIT TRAIL= $$ (NUMBER, WHEN, WHO, WHERE, WHAT)
$$ ##TITLE= Audit trail, XWIN-NMR		Version 3.5
$$ ##JCAMPDX= 5.01
$$ ##ORIGIN= Bruker BioSpin GmbH
$$ ##OWNER= she
$$ F:/spectra/data/she/nmr/H-F/1/audita.txt
$$ ##AUDIT TRAIL=  $$ (NUMBER, WHEN, WHO, WHERE, WHAT)
(   1,<2021-09-01 15:53:07.90 +0400>,<she>,<DPX200>,
      <created by zg, POWCHK disabled, PULCHK disabled
       configuration hash MD5:
       00 E9 B6 7A A2 85 ED C7 34 08 36 98 17 FE 4E 26
       data hash MD5: 16K
       68 3B BF 0E EC B1 69 C8 5C 72 76 C6 E6 C1 C1 B6>)
$$ ##END=
$$ 
$$ hash MD5
$$ 05 77 D1 DB EF AC 34 EC 4E F2 5E 49 3F FC D4 DC
##$RELAX= 
##$RELAX= 
##$RELAX= 
##$RELAX= 
##$RELAX= 
##$RELAX= 
$$ Bruker specific parameters
$$ --------------------------
##$DU= <F:/spectra>
##$EXPNO= 1
##$NAME= <H-F>
##$PROCNO= 1
##$TYPE= <nmr>
##$USER= <she>
##$AMP= (0..31)
100 100 100 100 100 100 100 100 100 100 100 100 100 100 100 100 100 100 
100 100 100 100 100 100 100 100 100 100 100 100 100 100 
##$AQSEQ= 0
##$AQ_mod= 1
##$AUNM= <au_zg>
##$AUTOPOS= <>
##$BF1= 200.13
##$BF2= 200.13
##$BF3= 200.13
##$BF4= 200.13
##$BF5= 200.13
##$BF6= 200.13
##$BF7= 200.13
##$BF8= 200.13
##$BYTORDA= 1
##$CFDGTYP= 0
##$CFRGTYP= 5
##$CHEMSTR= <none>
##$CNST= (0..31)
1 1 145 1 1 1 1 1 1 1 1 1 1 1 1 1 1 1 1 1 1 1 1 1 1 1 1 1 1 1 1 1 
##$CPDPRG= <>
##$CPDPRG1= <>
##$CPDPRG2= <>
##$CPDPRG3= <>
##$CPDPRG4= <mlev>
##$CPDPRG5= <mlev>
##$CPDPRG6= <mlev>
##$CPDPRG7= <mlev>
##$CPDPRG8= <mlev>
##$CPDPRGB= <>
##$CPDPRGT= <>
##$D= (0..31)
0 1.2 0 0 0 0 0 0 0 0.06 0 0.03 0 0 0 0 0.0002 0 0 0 0 0 0 0 0 0 0 0 0 
0 0 0 
##$DATE= 1630497187
##$DBL= (0..7)
120 120 120 120 120 120 120 120 
##$DBP= (0..7)
150 150 150 150 150 150 150 150 
##$DBP07= 0
##$DBPNAM0= <>
##$DBPNAM1= <>
##$DBPNAM2= <>
##$DBPNAM3= <>
##$DBPNAM4= <>
##$DBPNAM5= <>
##$DBPNAM6= <>
##$DBPNAM7= <>
##$DBPOAL= (0..7)
0.5 0.5 0.5 0.5 0.5 0.5 0.5 0.5 
##$DBPOFFS= (0..7)
0 0 0 0 0 0 0 0 
##$DE= 6
##$DECBNUC= <off>
##$DECIM= 32
##$DECNUC= <off>
##$DECSTAT= 4
##$DIGMOD= 1
##$DIGTYP= 9
##$DL= (0..7)
0 120 120 120 120 120 120 120 
##$DP= (0..7)
150 150 150 150 150 150 150 150 
##$DP07= 0
##$DPNAME0= <>
##$DPNAME1= <>
##$DPNAME2= <>
##$DPNAME3= <>
##$DPNAME4= <>
##$DPNAME5= <>
##$DPNAME6= <>
##$DPNAME7= <>
##$DPOAL= (0..7)
0.5 0.5 0.5 0.5 0.5 0.5 0.5 0.5 
##$DPOFFS= (0..7)
0 0 0 0 0 0 0 0 
##$DQDMODE= 0
##$DR= 18
##$DS= 0
##$DSLIST= <SSSSSSSSSSSSSSS>
$$ [...]
##$SUBNAM2= <"">
##$SUBNAM3= <"">
##$SUBNAM4= <"">
##$SUBNAM5= <"">
##$SUBNAM6= <"">
##$SUBNAM7= <"">
##$SUBNAM8= <"">
##$SUBNAM9= <"">
##$SW= 20.0189188712717
##$SWIBOX= (0..15)
0 0 2 0 0 0 0 0 0 0 0 0 0 0 0 0 
##$SW_h= 4006.41025641026
##$TD= 16384
##$TD0= 1
##$TE= 0
##$TE2= 300
##$TE3= 300
##$TEG= 300
##$TL= (0..7)
0 120 120 120 120 120 120 120 
##$TP= (0..7)
150 150 150 150 150 150 150 150 
##$TP07= 0
##$TPNAME0= <>
##$TPNAME1= <>
##$TPNAME2= <>
##$TPNAME3= <>
##$TPNAME4= <>
##$TPNAME5= <>
##$TPNAME6= <>
##$TPNAME7= <>
##$TPOAL= (0..7)
0.5 0.5 0.5 0.5 0.5 0.5 0.5 0.5 
##$TPOFFS= (0..7)
0 0 0 0 0 0 0 0 
##$TUNHIN= 0
##$TUNHOUT= 0
##$TUNXOUT= 0
##$USERA1= <user>
##$USERA2= <user>
##$USERA3= <user>
##$USERA4= <user>
##$USERA5= <user>
##$V9= 5
##$VALIST= <valist>
##$VCLIST= <CCCCCCCCCCCCCCC>
##$VD= 0
##$VDLIST= <DDDDDDDDDDDDDDD>
##$VPLIST= <PPPPPPPPPPPPPPP>
##$VTLIST= <TTTTTTTTTTTTTTT>
##$WBST= 1024
##$WBSW= 4
##$XGAIN= (0..3)
0 0 0 0 
##$XL= 0
##$YL= 0
##$YMAX_a= 213508
##$YMIN_a= -226721
##$ZGOPTNS= <>
##$ZL1= 120
##$ZL2= 120
##$ZL3= 120
##$ZL4= 120
##$ABSF1= 10
##$ABSF2= 0
##$ABSG= 5
##$ABSL= 3
##$ALPHA= 0
##$AQORDER= 0
##$ASSFAC= 0
##$ASSFACI= 0
##$ASSFACX= 0
##$ASSWID= 0
##$AUNMP= <proc_1d>
##$AZFE= 0.1
##$AZFW= 0.1
##$BCFW= 1
##$BC_mod= 2
##$BYTORDP= 1
##$COROFFS= 0
##$CY= 11.3945322036743
##$DATMOD= 1
##$DC= 2
##$DFILT= <>
##$DTYPP= 0
##$F1P= 2.36226072786647
##$F2P= -0.459571619588291
##$FCOR= 0.5
##$FTSIZE= 0
##$FT_mod= 4
##$GAMMA= 1
##$GB= 0.15
##$INTBC= 1
##$INTSCL= 1
##$ISEN= 128
##$LB= 0.24
##$LEV0= 0
##$LPBIN= 0
##$MAXI= 10000
##$MC2= 0
##$MEAN= 0
##$ME_mod= 0
##$MI= 1.114404
##$NCOEF= 0
##$NC_proc= 0
##$NLEV= 6
##$NOISF1= 3.799351
##$NOISF2= 2.8
##$NSP= 1
##$NTH_PI= 0
##$NZP= 0
##$OFFSET= 15.70392
##$PC= 1
##$PHC0= -13358.72
##$PHC1= 6.80097
##$PH_mod= 1
##$PKNL= yes
##$PPARMOD= 0
##$PSCAL= 0
##$PSIGN= 0
##$REVERSE= no
##$SF= 200.130013532006
##$SI= 16384
##$SIGF1= 3
##$SIGF2= 2
##$SINO= 400
##$SIOLD= 16384
##$SREGLST= <1H.CDCl3>
##$SSB= 0
##$STSI= 0
##$STSR= 0
##$SW_p= 3612.71676300578
##$SYMM= 0
##$S_DEV= 0
##$TDeff= 0
##$TDoff= 0
##$TI= <>
##$TILT= no
##$TM1= 0
##$TM2= 0
##$TOPLEV= 0
##$USERP1= <user>
##$USERP2= <user>
##$USERP3= <user>
##$USERP4= <user>
##$USERP5= <user>
##$WDW= 1
##$XDIM= 8192
##$YMAX_p= 0
##$YMIN_p= 0
$$ End of Bruker specific parameters
$$ ---------------------------------
##NTUPLES= NMR FID
##VAR_NAME=  TIME,          FID/REAL,        FID/IMAG
##SYMBOL=    X,             R,               I
##VAR_TYPE=  INDEPENDENT,   DEPENDENT,       DEPENDENT
##VAR_FORM=  AFFN,          ASDF,            ASDF
##VAR_DIM=   8192,          8192,            8192
##UNITS=     SECONDS,       ARBITRARY UNITS, ARBITRARY UNITS
##FACTOR=    0.0002496,     1,               1
##FIRST=     0,             0,               0
##LAST=      2.0444736,     0,               0
##MIN=       0,             -226721,         0
##MAX=       2.0444736,     213508,          0
$$ Real data points
##PAGE= N=1
##DATA TABLE= (X++(R..R)), XYDATA
0@%%%%%%%%%%%%qJ6j6J6k4L2l3M1n6O4p2Q8j04J21j43J67j93K24k56K89l28L73
$$ 0 0 0 0 0 0 0 0 0 0 0 0 0 -8 8 -8 8 -16 16 -17 24 -32 32 -40 48 -56 65 -78 89 -104 120 -136 153 -175 198
34A98m23M76n34O00o71P50q36R28j030J141j262J396j541J700j875K066k276K508
$$ 198 -225 251 -283 317 -354 396 -440 488 -542 599 -663 733 -808 892 -983 1083 -1193 1315
52A315k763L046l364L721m128M594n128N755o506P418q552J0015j1983J4785j9129
$$ 1315 -1448 1598 -1766 1955 -2173 2421 -2707 3048 -3458 3960 -4592 5423 -6560 8225 -10904
67a0904K6846m4751J68520P3797k24753l8446M1304J04174o422q2382r7998p105
$$ -10904 15942 -28809 139711 213508 -11245 -49691 -8387 95787 89365 6983 -91015 -98120
79i8120Q800j4282l9675J9997N3461J5085p3253o6206O810P0428M4871p413j3938
$$ -98120 -89320 -103602 -143277 -123280 -69819 -54734 -127987 -194193 -187383 -116955 -72084 -79497 -93435
92i3435M2813M3467j9529m6186L1268J11615R7830q322r1123o1861L7573P9364
$$ -93435 -50622 -7155 -26684 -72870 -41602 70013 167843 159521 68398 6537 44110 123474
104A23474L9302j1861k4037j6405k4176m2683j6872M1858N1490j4805q3301p9156
$$ 123474 162776 150915 126878 110473 86297 43614 26742 68600 120090 105285 21984 -57172
116e7172r979L6468M729m2339k7388J2381J1767l1761n5965r776O2352O8348R695
$$ -57172 -67151 -30683 -25954 -68293 -95681 -83300 -71533 -103294 -159259 -169035 -106683 -38335 -28640
129b8640l9215l3332Q448L6443L2670K6817L7167K4871k0121m3936p085N9960
$$ -28640 -67855 -101187 -92739 -56296 -23626 3191 40358 65229 45108 1172 -5913 54047
141E4047P9990K3564m6066n1685l804K7618J4200j3937j5945J550m393l5778m5553
$$ 54047 134037 157601 111535 59850 56046 83664 97864 83927 67982 69532 65139 29361 -16192
154a6192j5905J7982J7178j3451l5176k2096m606j0248j7473J262K9999K9305
$$ -16192 -32097 -14115 3063 -10388 -45564 -67660 -72266 -82514 -99987 -98725 -68726 -39421
166c9421j1139m6601k5753L1826O1680L7946m667k1339j457J8194J7740J5479
$$ -39421 -50560 -97161 -122914 -91088 -29408 8538 3871 -17468 -18925 -731 17009 32488
178C2488K4380K3932L122k2170k3043O052L0333J8064j1657k1926r320P29j0229
$$ 32488 56868 80800 83922 61752 38709 44761 75094 93158 81501 59575 50255 50984 40755
191D0755k5198j5497J1276J5336j3020l9791l6207m501J8150J1409n798j0420
$$ 40755 15557 60 11336 26672 13652 -26139 -62346 -66847 -48697 -37288 -43086 -53506
203e3506q047r745r164L096K3824L0473R139j8667j8430R667L3055K9219O002
$$ -53506 -61553 -71298 -80462 -77366 -53542 -23069 -13930 -32597 -51027 -41360 -8305 20914 26916
216B6916n116M975J2031N484k067L055J4721J4856k609j8521j4405o54L046k536
$$ 26916 21800 26775 38806 44290 42223 45278 59999 74855 72246 53725 39320 38666 41712 39176
230C9176q021n682m396j4418k5568j6290M800J5425K613k0674k7495r276J0240
$$ 39176 31155 25473 21077 6659 -18909 -35199 -30399 -14974 -12361 -33035 -60530 -69806 -59566
243e9566J3124M020p18m6K405q26Q2J1089K1523J6268J589n515J696J3415J3575
$$ -59566 -46442 -42422 -43140 -43186 -40781 -41607 -41525 -30436 -8913 7355 8944 3429 5125 18540 32115
258C2115N198J244N843Q393o3j0674j0418L501J1975L374j2080j8025j2161l703
$$ 32115 37313 38557 44400 52793 52730 42056 31638 35139 47114 50488 38408 20383 8222 4519
272D519j705l830l456l569r194j6239j2799j57J1945Q203o143j3063m810O192
$$ 4519 2814 -1016 -4472 -8041 -17235 -33474 -46273 -46430 -34485 -26282 -32425 -45488 -50298 -44106
286d4106J0048O897L464N962P676L326p22L016J1229J4683Q687n04k783K138L586
$$ -44106 -34058 -27161 -23697 -17735 -10059 -6733 -7455 -4439 6790 21473 30160 29656 26873 29011 32597
301C2597J673J050L628M117k179j2420j3427l320O155L884n987j4285j2418n462
$$ 32597 34270 35320 38948 43065 40886 28466 15039 11719 17874 21758 15771 1486 -10932 -16394
315a6394j933k164q71Lk859p004q571k442P395R257M007j794j630K410O384M624
$$ -16394 -18327 -20491 -21362 -21359 -24218 -31222 -39793 -42235 -34840 -25583 -21576 -23370 -25000 -22590 -16206 -11582
331a1582M577Q614R734N117k300l542K588J0109R871K921l400m191l628k833n32
$$ -11582 -7005 1609 11343 16460 14160 10618 13206 23315 33186 36107 32707 28516 24888 22055 21523
346B1523J957L089j356j0077j3215p593Q49L566k72p354q062n813l671j965K85
$$ 21523 23480 26569 25213 15136 1921 -5672 -4823 -1257 -1529 -8883 -16945 -22758 -26429 -28394 -28109
361b8109L321L696M69m582m284K265P700Q287N019K237K240J214Q69K832P278
$$ -28109 -24788 -21092 -20623 -25205 -29489 -27224 -19524 -11237 -6218 -3981 -1741 -527 342 3174 10452
376A0452R995O266r48n931l933L123O210L860m90m315n887n881m966j607J714
$$ 10452 20447 26713 25765 19834 15901 19024 25234 29094 28604 24289 18402 12521 7555 5948 7662
391G662J105m282r054q948m663O30J435l01j387k404l002l183j293L426P800O082
$$ 7662 8767 4485 -4569 -13517 -18180 -17550 -16115 -16416 -17803 -20207 -23209 -26392 -27685 -24259 -16459 -10377
407a0377J043k618j572L510O631P446N623L846J053j991j296K332O214O464J375
$$ -10377 -9334 -11952 -13524 -10014 -3383 4063 9686 13532 14585 12594 11298 13630 19844 26308 27683
422B7683m057o002l675m74J070L23j859k907n494p652n520j414J842R93k654n717
$$ 27683 23626 17624 13949 13475 14545 14868 13009 10102 4608 -3044 -8564 -9978 -8136 -7143 -9797 -15514
438a5514n045k566L55K580L285L217R15j915k559Q87O596Q054N410J508j546n55
$$ -15514 -20559 -23125 -22770 -20190 -16905 -13688 -12773 -14688 -17247 -16360 -9764 -1710 3700 5208 3662 3107
454C107K486M032M831M463K113j418l631l227M2L241J820o85m361n408m283k996
$$ 3107 5593 9625 14456 18919 21032 19614 15983 12756 12798 16039 17859 17174 12813 7405 3122 126
470A26j766P2L00k050m633n672l938L5L199K196J18j785k218j228J478L748N234
$$ 126 -1640 -1568 -1268 -3318 -7951 -13623 -17561 -17526 -14327 -12131 -12013 -13798 -16016 -17244 -15766 -12018 -6784
487f784M308J145r47q34J472M840N609L446J161q06j457q83R20K031K470P91k514
$$ -6784 -2476 -1331 -2278 -3112 -1640 3200 8809 12255 13416 12610 11153 10270 11190 13221 15691 16482 13968
504A3968m589l971j299N15M83p71l024l895l966l156p00J469J432n6l296l463
$$ 13968 9379 5408 4109 4624 5107 4336 1312 -2583 -6549 -9705 -10405 -8936 -7504 -7560 -10856 -14319
520a4319j089J787K832K977J463K77l73m45J205L678M717L163J174j363q63J149
$$ -14319 -15408 -13621 -10789 -7812 -6349 -6072 -6445 -6890 -5685 -2007 2710 5873 7047 5684 4821 5970
536E970J943K703J720M57j150k086k074j150R47J490q52k411l538l594k041L01
$$ 5970 7913 10616 12336 12793 11643 9557 7483 6333 7280 8770 7918 5507 1969 -1625 -3666 -3365
552c365M34l11j233k660k723j823N7K256K247K53j377r64Q2J472K537K886K233
$$ -3365 -2931 -3242 -4475 -7135 -9858 -11681 -11624 -9368 -7121 -6868 -8245 -9209 -9127 -7655 -5118 -2232 1
569AR91p2j90R59K579K846K198L96j232o50p25O91J101M43k68j457k996k627p83
$$ 1 992 920 730 1689 4268 7114 9312 9708 8476 7826 7101 7792 8893 9336 9068 7611 4615 1988 1205
588A205J33J09q07k122l081k162p69l17P61Q62r55q31j493n98J744K237J735J151
$$ 1205 1338 1447 640 -1482 -4563 -6725 -7494 -7811 -7050 -6188 -7143 -7974 -9467 -10065 -8321 -6084 -4349 -3198
606c198L04m28J251J532J738K403J940O42k58m48L10J315J465M22k46j692j801
$$ -3198 -2894 -3322 -2071 -539 1199 3602 5542 6184 5926 5478 5788 7103 8568 8990 8744 7052 5251
623E251o45p39j85k98o85k140k257j792q82K96k2m77j527r52r96j20R54J012J266
$$ 5251 4606 3867 3682 3384 2699 559 -1698 -3490 -4372 -4076 -4098 -4575 -6102 -7054 -8050 -8170 -7216 -6204 -4938
642d938P57j60o16J427J224K001J883J069J12K90N02M46J490J025P99Mj655j058
$$ -4938 -4181 -4341 -4957 -3530 -2306 -305 1578 2647 2759 3049 3551 3997 5487 6512 7311 7315 5660 4602
660D602j96L75L49m87j265j351j789j348o68L64k35r39q10k008o84n3R66L23K27
$$ 4602 4406 4781 5130 4643 3378 2027 238 -1110 -1778 -1414 -1649 -2588 -3398 -5406 -6090 -6143 -5177 -4854 -4627
679d627Oj95K79M01J063J657J219L24K10K95P9J605J499Q12N46l64o76o81N99
$$ -4627 -4621 -4816 -4537 -4136 -3073 -1416 -197 127 337 632 711 2316 3815 4627 5173 4809 4133 3452 4051
698D051M89L68k16j026j517r20m35oPr87n84j125j247m37J7N71K1j93j008k75
$$ 4051 4540 4908 4692 3666 2149 1229 794 788 795 -192 -776 -1901 -3148 -3585 -3568 -2997 -2976 -3169 -4177 -4452
718d452J33M44P97J149L19J42j1q5P63J556J134N75o2P2m21P89K10Q79O22n22
$$ -4452 -4319 -3875 -3078 -1929 -1610 -1468 -1479 -1564 -801 755 1889 2464 2402 2474 2053 2842 3052 3931 4553 4031
738D031m44j250k40k84O91k21l94j169j034j146j80P9k8K01r78q85o34k14L30
$$ 4031 3587 2337 2097 1813 2504 2283 1889 720 -314 -1460 -1640 -1561 -1589 -1388 -2366 -3251 -3885 -4099 -3769
757c769Q33M59M26m41n29L45O46J262O95J200j29l90j07R29R23J014N13j52n35
$$ -3769 -2936 -2477 -2051 -2492 -3021 -2676 -2030 -768 -73 1127 998 608 501 1430 2353 3367 3880 3728 3193
776C193o66R0J94J37K76k16j036j271n59k05P4rm09j010j027o16k63p6O95L01
$$ 3193 2527 2617 2811 2948 3224 3008 1972 701 142 -63 11 2 -407 -1417 -2444 -3060 -3323 -3399 -2704 -2403
796b403l79l48r19O90N11J411M31L64Q1j68M33P02J461Q39J26m7l77j32M24O20
$$ -2403 -2782 -3130 -4049 -3359 -2848 -1437 -1006 -642 -561 -729 -296 406 1867 2706 2832 2785 2408 2276 2700 3320
816C320M72j52m90r04q55n26J41k12K07p29p50j392o22k5M60O5N2o52o47n42N02
$$ 3320 3792 3640 3150 2246 1391 865 1006 794 1001 272 -478 -1870 -2492 -2517 -2057 -1992 -1940 -2592 -3239 -3781 -3279
837c279N30Q00Q15j97k1N0K08Q21J190J059O6k27%n94P60Q73M48N0m42p64o59
$$ -3279 -2749 -1949 -1134 -1331 -1352 -1302 -1094 -273 917 1976 2042 1815 1815 1221 1981 2854 3302 3352 2910 2146 1487
858A487P1j73L21j53p17o93r30p08j25L23J67m69m13q93j61K31M32P53J63m9k30
$$ 1487 1558 1385 1706 1553 836 143 -787 -1495 -1620 -1297 -1130 -1599 -2012 -2905 -3066 -2835 -2403 -1650 -1487 -1536 -1766
879a766j22L49P18R11N51M46l12k92K22N81R87K15R5k01o22j61k27K11M79j74
$$ -1766 -1888 -1539 -821 90 641 1087 775 483 705 1286 2273 2488 2583 2382 1760 1599 1372 1583 2062 1888
899A888q85m50p88jj86K41M0m33n25q76l15L41K12L26N7k49j87r2L28N00O33K90
$$ 1888 1003 553 -235 -236 -422 -181 -141 -574 -1099 -1975 -2290 -1949 -1737 -1411 -1354 -1603 -1790 -1882 -1554 -1054 -421 -131
921a31L1k79J95K29K21J006K98J21j63j69k59L46J2O58Pm00q79k55r9j89K71J06
$$ -131 -100 -379 -184 45 266 1272 1570 1691 1528 1359 1100 1446 1458 2116 2123 1723 844 589 490 301 572 678
943F78m08o00m75o28K51J34K43m17r7o17L2j63Q28K48K18l27r5J62K38L67M50
$$ 678 270 -330 -805 -1433 -1182 -1048 -805 -1222 -1319 -1936 -1904 -2067 -1239 -991 -773 -1100 -1195 -1033 -795 -428 22
964B2P02K44k21k4n2R1Q52K49M47n94j84n90L2K44L52j85p08l47n57k41J10m25
$$ 22 724 968 747 723 671 762 1614 1863 2310 1716 1532 942 974 1218 1570 1385 677 330 -227 -468 -358 -783
986g83L63k85n66l38p05M25L92J98O6j84k18J52Q9M93N73K27K79rM6j02P71L25
$$ -783 -420 -705 -1271 -1609 -2314 -1889 -1497 -1299 -1233 -1417 -1635 -1483 -1394 -901 -328 -101 178 169 215 113 884 1209
1008A209L18K09k09j56L5j8K29L4m0k91o21l61k32J23J99o65j24l82m76Q3k93
$$ 1209 1527 1736 1527 1371 1406 1388 1617 1651 1611 1320 699 338 106 229 428 -237 -361 -743 -1219 -1136 -1429
1029a429J19O1J70m00J23l43L83K92M90J68R2j43o2N11M78L12L41K3l48k03J90
$$ -1429 -1310 -1249 -1079 -1479 -1356 -1699 -1316 -1024 -534 -366 -274 -417 -479 32 510 822 1163 1186 838 635 825
1050H25L65M23k3q2l56j55n47K87l24K28o8m76n88j57j71q4K62j17j39m79R6J14
$$ 825 1190 1613 1590 1508 1152 997 450 737 413 641 573 97 -491 -648 -819 -903 -641 -758 -897 -1376 -1280 -1166
1072a166J5L43N5n1L7J0MM00J67L16L96o1K91l40r3M88K42r2J13J32l75k87K66
$$ -1166 -1151 -808 -753 -804 -767 -757 -753 -353 -186 130 526 465 756 416 323 811 1053 961 1074 1206 831 544 810
1095H10J58O6j80k00m53j81l34M12l4j94j86l12j57L8J60j37K41j40m48m1J82
$$ 810 968 1034 854 654 201 20 -314 98 64 -130 -316 -628 -785 -747 -587 -724 -483 -623 -1071 -1112 -930
1116i30L02k33M71M36l42J99j88K14K26K08K93r1L03q2l96L49QJ53o1k50j10P9
$$ -930 -628 -861 -390 46 -296 -97 -285 -71 155 363 656 565 868 786 390 739 747 900 839 589 479 558
1138E58j56j26L01k28o9j47k61j55j06j90K62k68J3l29L7j63M58q0l6q7J7J31
$$ 558 402 276 577 349 280 133 -128 -283 -389 -579 -317 -585 -572 -901 -864 -1027 -569 -649 -685 -772 -755 -624
1160f24m3L30J51J54M40n9r5J17j06N31N8j66K60j75l42L19K5M1R6k69m55j3j73
$$ -624 -667 -337 -186 -32 408 349 254 371 265 796 854 688 948 773 431 750 775 816 912 643 188 175 2
1183Bj11J65j35l15j54l15j45K87k10K60M8R3l13m9O2L34R7J44K93k06K89l82
$$ 2 -109 56 -79 -394 -548 -863 -1008 -721 -931 -671 -623 -530 -843 -892 -830 -496 -399 -255 38 -168 121 -261
1205b61L11M13L44m2m2O4Q2j94J48J11l77K50k93q8k63K70l76p3L5j46m41k14
$$ -261 50 463 807 765 723 787 869 675 823 934 557 807 514 426 163 433 57 -16 19 -127 -568 -782
1227g82K23J16k09K47k52j30O4j67M75R1j9j09K35pl4L36L14n7L92k65m09K64
$$ -782 -559 -443 -652 -405 -657 -787 -723 -890 -415 -324 -343 -452 -217 -224 -258 78 392 335 727 462 53 317
1249C17%J95M02o13O1J19k9k61L19j9j06l06j85L42k63j94k3j28K98l38k10J59
$$ 317 317 512 914 301 362 481 452 191 510 491 385 79 -106 236 -27 -221 -244 -372 -74 -412 -622 -463
1271d63l06L72K3n1r7K6J7J58O1J57L8K78m20K09N4K10M6K35M8j24n7KJ04j14
$$ -463 -769 -397 -374 -425 -522 -496 -479 -321 -260 -103 -65 213 -207 2 56 266 312 547 595 471 414 416 520 406
1295D06M6k98J97j94K25p9j48q8j26q8o8k54J1Q8J25l00Q6K29l77M08k56j58M27
$$ 406 452 154 351 157 382 303 155 67 -59 -147 -215 -469 -458 -370 -245 -545 -459 -230 -607 -199 -455 -613 -186
1318a86j26Or1M02j37Qj99N79P0j16j2J41O9J59l4j75RJ15Q9j46j03j69J84j5
$$ -186 -312 -306 -397 5 -132 -124 -323 256 326 210 198 339 408 567 533 358 367 482 571 425 322 153 337 322
1342C22k75j21k46L79Q3k77j83j0j02j03R5q4nQ6K08l54J37o8L95j02J46J16K02
$$ 322 47 -74 -320 59 142 -135 -318 -328 -430 -533 -438 -522 -527 -441 -233 -587 -450 -518 -123 -225 -79 37 239
1365B39j64J6Q0O2J08L70j53mJ24l11l7J7n1j64L32j15q2k74q1J94m51m2K09k04
$$ 239 75 91 171 233 341 711 558 554 678 367 330 347 296 132 464 349 267 -7 -88 106 -345 -387 -178 -382
1389c82l4K80k48m9j21K02J02l93L24J56k0m3J95K52k34J5l5L13Q4j58k0J45q
$$ -382 -416 -136 -384 -433 -554 -352 -250 -643 -319 -163 -183 -226 -31 221 -13 2 -33 280 364 206 186 331 323
1412C23O0L93l73j4j31N0k88J60rp3l12L51o1k96L78k83J4j28p9K6k37J4K43j44
$$ 323 383 776 403 389 258 308 20 180 171 98 -214 137 76 -220 158 -125 -111 -239 -318 -292 -529 -515 -272 -416
1436d16J34K2j09K56k29K36kj78L64k16K21J95k52J88K43j09j16k27K21K8n1J39
$$ -416 -282 -260 -369 -113 -342 -106 -108 -286 78 -138 83 278 26 214 457 348 232 5 226 254 203 342
1458C42p3J00r9l5k13j7k2J44p0n0j34j54L16l62p7L17k65j81K75O6k68N85l48
$$ 342 269 369 270 235 22 5 -17 127 57 7 -127 -281 35 -327 -404 -87 -352 -533 -258 -192 -460 125 -223
1481b23j27L51J2k25K0J55N2r6j19L90j69R0p4O9K13k00O5P1Q6j98Q7kk13K68
$$ -223 -350 1 13 -212 -192 -37 15 -81 -200 190 21 111 37 106 319 119 184 255 341 143 230 228 15 283
1505B83l26j98K57k7n5Q8j84j94J81j85p0J21k68K86J78k20J91m8n1KJ89j3j38
$$ 283 -43 -241 16 -11 -66 22 -162 -356 -175 -360 -430 -309 -577 -291 -113 -333 -142 -190 -241 -239 -50 -63 -201
1528b01K65P2J50K04k58k3L24m30J16m5L4k6n9K48j82q1Q8r4l29K47l19L44l62
$$ -201 64 136 286 490 232 209 533 103 219 174 208 182 123 371 189 108 196 102 -227 20 -299 45 -317
1551c17Q6j31J28k6l1j50K61n0l4J45j57R0K72k38J37R8Q0k11L40K6j22K54J7
$$ -317 -231 -362 -234 -260 -291 -441 -180 -230 -264 -119 -276 -186 86 -152 -15 83 163 -48 292 318 196 450 467
1574D67j05l49J69J16m9K65k75M4J1N2j66j31M8j47o3n7N3l64L46j81P4J16J67
$$ 467 362 13 182 298 249 514 239 283 294 346 180 49 97 -50 -113 -170 -117 -481 -135 -316 -242 -126 41
1597D1j57j47NK23K36k42j73J92K1O7RM2o5J05K62j73k11J0J36j04k8L1J0L3M3
$$ 41 -116 -263 -258 -35 201 -41 -214 -22 -1 66 75 117 52 157 419 246 35 45 181 77 49 80 90 123 166
1622A66k24J78j38M5q2K43j54l07J80J0r5n8J64n4J01j09N9m37M27J8j59K99j15
$$ 166 -58 120 -18 27 -55 188 34 -273 -93 -83 -178 -236 -72 -126 -25 -134 -75 -512 -85 -67 -226 73 -42
1645d2ON7o7N7J01L7k78J01J15L5k70J08N70m56J25o2m7J94l58K73j33o0J42J0
$$ -42 -36 21 -46 11 112 149 -129 -28 87 122 -148 -40 530 74 199 137 90 284 -74 199 66 6 148 158
1669A58p2k36p2K3J75J9k79J3J91k14J20k01J84K0K97k9l16L35k95K46Q5l16K36
$$ 158 86 -150 -222 -199 -24 -5 -284 -271 -80 -294 -174 -375 -191 -171 126 97 -219 116 -179 67 152 -164 72
1692G2J0J4q9K47kl00J29K4k7J10J93n8j73l4m9J80j66k8k45j50K55j44PK30O0
$$ 72 82 96 7 254 252 -48 81 105 78 188 381 323 150 116 67 247 81 53 -192 -342 -87 -231 -224 6 66
1717F6l97j05L54O9j56M7jr2P3k3J19K03j52q6Q2J51N3j17J90r0J21j60J13J3
$$ 66 -331 -436 -82 -13 -169 -122 -123 -215 -142 -165 -46 157 5 -81 1 152 205 88 278 188 309 149 262 275
1741B75Lj44K40k26o0q5j51J82j51j22J25k9j41J3K70M0l12r4K09p0r1K45L60
$$ 275 278 134 374 148 88 3 -148 34 -117 -239 -114 -143 -284 -271 -1 39 -273 -367 -158 -228 -319 -74 286
1764B86m34n6K30N6J14l2JJ74k21K58k69r1J58J66j85j32%o9K30j41n3J08q8k2
$$ 286 -148 -204 26 82 196 164 165 339 118 376 107 16 174 340 155 23 23 -46 184 43 -10 98 10 -12
1788a2j59R1j62K68r3P9l8n6J13l06J33P6N3j05j5p9J17K17k22J46L8q7M0J34
$$ -12 -171 -80 -242 26 -67 12 -26 -82 31 -275 -142 -66 -13 -118 -133 -212 -95 122 -100 46 84 -3 37 171
1812A71J5l49K49K88l97M15l84L27l78L5J87j41k0j05K7Q0j25J51j99L83l3k11
$$ 171 186 -163 86 374 -23 392 8 335 -43 -8 179 38 18 -87 -60 20 -105 46 -153 230 197 -14
1834a4k11k4J88J36k47o5K85j10M6J72K02m19j9J02L7l39K42Q3Q1k59M13l63J24
$$ -14 -225 -249 -61 75 -172 -237 48 -62 -16 156 358 -61 -80 22 59 -280 -38 45 126 -133 280 -83 41
1857D1K46N0N2l44q5K13J11r5j40L08l28j2j09J73k02J07J0q9j31q7k9j05L42
$$ 41 287 337 389 45 -40 173 284 189 49 357 29 17 -92 81 -121 -14 -4 -93 -224 -311 -340 -445 -103
1880a03K74l74K5J10j19j27L96j69OO2J38J43j80m5k7M69j68M9K1j93J76p1j80
$$ -103 171 -203 -178 -68 -187 -314 82 -87 -81 -19 119 262 82 37 10 479 311 360 381 188 364 293 113
1903A13p7k0K48k80M1n6n5o5q2j34K48L2pj38j15J48j85K14J0j41K08q5L86j13
$$ 113 36 16 264 -16 25 -31 -86 -151 -233 -367 -119 -87 -94 -232 -347 -199 -384 -170 -160 -301 -93 -178 208 95
1927I5Q4m4q0K7q3O7K13j4K34j88j22J33k23J40k33J45N7k8k42k19L38k64J46
$$ 95 179 135 55 82 -1 66 279 265 499 311 189 322 99 239 6 151 208 180 -62 -281 57 -207 -61
1950f1n9l0P8j26J13j47J22k09R8J02J56j25L0J01Pk0k8p8J57J41k84M26j19l26
$$ -61 -120 -150 -72 -198 -85 -232 -110 -319 -221 -119 37 -88 -58 43 50 30 2 -76 81 222 -62 364 245 -81
1974h1P2j5J63N4J23l45K34j69K31j93L1q1r7m8L9j07J70p1L67k94r2J37k59P3
$$ -81 -9 -24 139 193 316 -29 205 36 267 74 105 24 -73 -121 -82 -189 -19 -90 277 -17 -109 28 -231 -158
1998a58M4k2r9J37K96n50L64j11J79Jj63j6O1N9J70oo0J08L5N9k15K9K3j91j66
$$ -158 -114 -136 -235 -98 198 -352 12 -99 80 81 -82 -98 -37 22 192 186 126 234 269 328 113 142 165 -26 -192
2023a92L85l4j5j16J32k17O2J1nP4j23J33l25K41k27K86q6k23K10j14j69L29j41
$$ -192 193 159 144 28 160 -57 5 16 11 85 -38 95 -230 11 -216 70 -16 -239 -29 -143 -312 17 -124
2046a24M8M3j3J37n1n8Q7K6P4j54J75k94J41K30k25M41k09j76k72j08M4j43L39
$$ -124 -76 -33 -46 91 40 -18 69 95 169 15 190 -104 37 267 42 483 274 98 -174 -282 -238 -381 -42
2069d2p5j25r2K48j02l2m4L39k60M4m4K53q5J21rk28L8MK38j08J23k96J95k0K28
$$ -42 -117 -242 -334 -86 -188 -220 -264 75 -185 -141 -185 68 -17 104 95 -133 -95 -91 147 39 162 -134 61 41 269
2094B69k03J3J87j69L86m95K12k04JK20j85K16n01L56j81k07L85j95m4m0j8m1
$$ 269 66 79 266 97 483 -12 200 -4 -3 217 32 248 -253 103 -78 -285 100 -95 -139 -179 -197 -238
2116b38jJ01K10k71K07k31K32l8J40k35J6K99k01J39j71N6J01M8K3j14k63K27
$$ -238 -239 -138 72 -199 8 -223 9 -29 111 -124 -108 191 -10 129 -42 14 115 163 186 72 -191 36
2138C6k03J70l4M4j64K60o6P6k49j73OK79J85o47K05J79M6j9j9r4j2K91k50N34
$$ 36 -167 3 -31 13 -151 109 43 119 -130 -303 -297 -18 167 -480 -275 -96 -50 -69 -88 -182 -194 97 -153 381
2162C81l15j7J77k91l5JM1o9K23J95P8j83K44l34j59K69l17J45j64L9K10j87K08
$$ 381 66 49 226 -65 -100 -99 -58 -127 96 291 369 186 430 96 -63 206 -111 34 -130 -91 119 -68 140
2185A40j28k06p8N9K05k43L52k10J85r1K27k99O4L83m70J01J53n7j22L1k40J57
$$ 140 12 -194 -272 -213 -8 -251 101 -109 76 -15 212 -87 -23 360 -110 -9 144 87 -35 -4 -244 -87
2207h7J21J83j95K62l32k46L75m6j40R4r9J86k86L37o5j57K52j10Pp7R3j61J97
$$ -87 34 217 22 284 -48 -294 81 35 -105 -11 -110 76 -210 127 62 -95 157 47 54 -23 70 -91 106
2230A06M8Q0m82J11o5J31M7M5K6R7k99L03q7j19J81O8j51j58J06j87J94R1j07
$$ 106 154 234 -248 -137 -202 -71 -24 21 47 144 -155 148 61 -58 123 191 40 -118 -12 -199 -5 86 -21
2253b1M2j14K63m14K12k47M32k00J92m63K68L6j14J53m4J5o0j03L3j60K96j76
$$ -21 21 -93 170 -244 -32 -279 153 -47 145 -318 -50 -14 -128 25 -19 -4 -64 -167 -134 -294 2 -174
2275a74LL3R6j02J88j72R3K98k75J4J35r2L46l68J30P8n14K71J6J65M5j21j08
$$ -174 -171 -138 -42 -144 44 -128 -35 263 -12 2 137 45 391 23 153 231 -283 -12 4 169 214 93 -15
2298a5p2L11j17l85L65m5j40J68k62N0m2K15q0o8M5k90K16J13J49o9l13Q0J58
$$ -15 -87 224 107 -278 87 42 -98 70 -192 -142 -184 31 -49 -117 -72 -362 -146 -33 116 47 -266 -186 -28
2321b8K15nkK98l06J7k73J88j40J15k6j58L72m20J21J33L6j4l81K68j57n1l3K48
$$ -28 187 182 180 478 172 189 -84 104 -36 79 53 -105 267 -153 -32 101 137 123 -258 10 -147 -198 -231 17
2345A7j61J87k81L95l18J9J7M2J24k02K7K93j9k4K3J26P0k04l94L41O9J0j20n0
$$ 17 -144 43 -238 157 -161 -142 -125 -83 41 -161 -134 159 140 116 139 265 335 131 -263 78 147 157 37 -13
2369a3K50j33j42J92j54j40J02J54k54n5J33OqJ17j50n4o1J26l3J86l87K17l3
$$ -13 237 104 -38 154 0 -140 -38 116 -138 -193 -60 -54 -62 55 -95 -149 -210 -84 -117 69 -318 -101 -134
2392a34L1K9o3P6k9K07m7L9j05q5K39l22K84j38j80P9L32qn4N2n15N19m02J31
$$ -134 -103 -74 -137 -61 -90 117 70 109 4 -81 158 -164 120 -18 -198 -119 213 205 151 203 -312 207 -195 -64
2416f4J32m5P9j20K7J46k61j60P4jP4k54N57j80J15k27p9p3J30J57j53J37r4J15
$$ -64 68 23 102 -18 9 155 -106 -266 -192 -193 -119 -373 184 4 119 -108 -187 -260 -130 27 -126 11 -83 32
2440C2J01r8j66Q4L11j43j86pM1K98k25j12K44j78K39M2l72K14k63M8j96L46l56
$$ 32 133 35 -131 -47 264 121 -65 -72 -31 267 42 -70 174 -4 235 277 -95 119 -144 -96 -292 54 -302
2463c02L59k61J26J2j38K47j09j97J21M4L4K05k46Q5N1q2J80O0l25L0L36M6k33
$$ -302 57 -204 -78 -66 -204 43 -66 -263 -142 -98 -64 141 -105 -20 31 -51 129 189 -136 -106 230 276 43
2486D3K75m41J94L28j90k60R8j78J90M2k17l7K67k74k95L53L2lk0p3j62n5J47
$$ 43 318 -123 71 399 209 -51 47 -131 59 101 -116 -153 114 -160 -455 -102 -70 -73 -93 -166 -328 -383 -236
2509b36L81J6l70J36O2K8L9j16K28j41M11j94l64J99K8J23j97m6J01j49K16n3
$$ -236 145 161 -209 -73 -11 17 56 -60 168 27 438 244 -120 79 107 230 33 -13 88 -61 155 102
2531A02J62l54j12J7L6M0j49L12O7j55n2j77N0K27j57K5K87J11l55M0P4po1J01
$$ 102 264 -90 -202 -185 -149 -109 -258 54 121 -34 -86 -263 -213 14 -143 -118 169 280 -75 -35 39 32 -29 72
2555G2j70J85J37j55Rn6J34q5P3j37J16n6r5J76r7O2o8o9Q9m6m0J7K41l86P9l0
$$ 72 -98 87 224 69 78 22 156 71 144 7 123 67 -28 148 51 113 45 -24 65 19 -21 -4 237 -149 -70 -100
2581a00n1N2r6J78l0J91J1k41L24m32L88L1j95M2Jk63o1L61j89J35J10p3j74Q7
$$ -100 -151 -99 -195 -17 -47 144 155 -86 238 -194 194 225 30 72 73 -190 -251 110 -79 56 166 93 -81 6
2605Fj30K63l51J75oJ50K53k85j20k9J40m8j94P4R2j24K03L4m18O5R7J82j24J79
$$ 6 -124 139 -212 -37 -43 107 360 75 -45 -74 66 18 -176 -102 -10 -134 69 103 -315 -250 -153 29 -95 84
2629H4k58r5J55J31r5M3J86J33m30K82p8L9J65j69K94m20j51L21K05m29j15N82
$$ 84 -174 -269 -114 17 -78 -35 151 284 -146 136 58 97 262 93 387 -33 -184 137 342 -87 -202 380
2651C80n01J59l3K38m73L27p7q1j50M6n2j80J96J46LJ80j24j22J94j28J35Q2J17
$$ 380 -121 38 5 243 -230 97 20 -61 -211 -165 -217 -397 -201 -55 -52 128 4 -118 76 -52 83 165 282
2674B82j97K4q6K00Q1k39L22j82j21J27p9l5P1j10n9M3R8n9l38J17N5J33k77j99
$$ 282 85 109 23 223 304 65 387 205 84 211 132 97 168 58 -1 42 140 81 -257 -140 -85 48 -229 -428
2698d28K41j9K22k03k7J20K2j18K50j01o7R8J11J58l26J34r5k0J27j45J21J8J01
$$ -428 -187 -206 16 -187 -214 -94 -72 -190 60 -41 -108 -10 101 259 -67 67 -28 -48 79 -66 55 73 174
2721A74O7j59J26j74k5O1K24l48Q2K97n75J30K43k13M3j97L91M3j56j59L17m6
$$ 174 241 82 208 34 9 70 294 -54 28 325 -250 -120 123 -90 -47 -244 147 190 34 -125 192 146
2743A46l49K29j59Q4l4R5J7pj2j33L03k24J63j42K89m04J27j62K73N2j61k5j8
$$ 146 -203 26 -133 -49 -83 12 29 22 10 -123 180 -44 119 -23 266 -138 -11 -173 100 152 -9 -34 -52
2766e2j43L02j1o0r3j53K99l7k02J98o4o9L57n19J36J86J35l24j63K40j19R0N
$$ -52 -195 107 96 36 -57 -210 89 52 -150 48 -16 -85 272 -247 -111 75 210 -114 -277 -37 -156 -66 -61
2789f1j96L37k30J53J79k21n3L5M1j79M18q4R9kn14K79o8J14j20K09j17m4m1J91
$$ -61 -257 80 -150 3 182 -39 -92 -57 -16 -195 223 139 238 236 -278 1 -67 47 -73 136 19 -25 -66 125
2813A25j48j45N7J52J0k09J30j43J35j04j41J23n8P1J15m1L2JJ45l60J70K42j58
$$ 125 -23 -168 -111 41 51 -158 -28 -171 -36 -140 -281 -158 -216 -145 -30 -71 -39 -38 107 -253 -83 159 1
2836AmL46k87O5j23k2L18j31R2j38J32k66R3j20j03J60l9K00j18r4Q4j21L4M5
$$ 1 -3 343 56 121 -2 -24 294 163 255 117 249 -17 76 -44 -147 13 -26 174 56 -38 46 -75 -41 4
2860Dj02L7J06k07K44O8J16m62K67K4m18L61l3p9K53q3p7J08O4oj3J01m22J82
$$ 4 -98 -61 45 -162 82 150 266 -196 71 95 -323 38 5 -74 179 96 19 127 191 185 172 273 -149 33
2884C3J30r8k7j91p4K6j24R7J86K86q5j50j63N6q8n4L22r1L1p2Qj63L13P3j18
$$ 33 163 65 38 -153 -227 -201 -325 -228 -42 244 159 9 -154 -98 -186 -240 82 -9 22 -50 -42 -205 108 181 63
2909F3n0m0L06j79j13N0j36K42k94L44k30K47q1k10M0R2J35l08j14K93N8J00j32
$$ 63 13 -27 279 100 -13 37 -99 143 -151 193 -37 210 129 -81 -41 51 186 -122 -236 57 115 215 83
2932H3j0j35J11j86l4L03J66m70J85j93K38o9k00N13l66l3Q7N5j32k61N05o5o4
$$ 83 73 -62 49 -137 -171 132 298 -172 13 -180 58 -11 -211 302 -64 -97 -10 45 -87 -348 157 92 28
2955B8l38N50k74K29k82J59k39O0K13N7l4K9q%Q0o9n2j92L00m30O8J82J43k08
$$ 28 -310 240 -34 195 -87 72 -167 -107 106 163 129 158 150 150 230 161 109 -83 217 -213 -145 37 180 -28
2979b8p7j42K90j63o7Q8J54j33k19O21m99R9J48J02k71p4O6R2k08m7L42K40j64
$$ -28 -105 -247 43 -120 -187 -99 55 -78 -297 324 -175 -76 72 174 -97 -171 -105 -13 -221 -268 74 314 150
3002A50k9N3q1L0o4j74Q6K34j54M3j14K0K36j75n3KJ59k86P9j4j38n1M96j97J14
$$ 150 121 174 93 123 59 -115 -29 205 51 94 -20 0 236 61 8 10 169 -117 -38 -52 -190 -241 255 58 172
3027A72Q4p1k31K7J38l46k1L06j43K90j52Q2j69j25L91R7r0l72k5K30P0k76Q5
$$ 172 256 185 -46 -19 119 -227 -248 58 -85 205 53 135 -34 -159 232 329 239 -133 -158 72 142 -134 -49
3050d9j45J96o6l9m8k32N24P6k51j06K12k19J17M43n87R3K54k06j86M3L50j61
$$ -49 -194 2 -64 -103 -151 -383 141 217 -34 -140 72 -147 -30 413 -174 -81 173 -33 -219 -176 174 13
3072A3Q4j89L35j53j34m0Q0K90q6k0l4k36L9q4k0M09n36J37N8M0R2j7j69J87J27
$$ 13 97 -92 243 90 -44 -84 -4 286 200 180 146 -90 -51 -135 -155 254 -282 -145 -87 -47 45 28 -141 46 173
3097A73k08M8J74q1o5Q1l09J44N4J13p5J47l76J56O1k6Q2k56j9l3J34N4L7k01
$$ 173 -35 13 187 106 41 122 -187 -43 11 124 49 196 -180 -24 37 11 93 -163 -182 -215 -81 -27 10 -191
3121a91J35j56J18J16L60n95L04k6J7N9Q0k30p3J91j78K18m4j35J25m52K11l08
$$ -191 -56 -212 -94 22 382 -213 91 65 82 141 221 -9 -82 109 -69 149 105 -30 95 -357 -146 -454
3143d54N58k76QK22k79K00l0r0kJ87o5K88j58j59K96m5m87N5K61L1K07n03L07
$$ -454 104 -172 -164 58 -221 -21 -51 -141 -143 44 -21 267 109 -50 246 201 -286 -231 30 61 268 -235 72
3166G2j21L12l40j17K4L01l20K24l34L10j85Q9J27j24L56l18p6L91m04L05q7N8
$$ 72 -49 263 -77 -194 -170 131 -189 35 -299 11 -174 -85 42 -82 274 -44 -120 271 -133 172 85 143
3188A43l00J33Q6j1N3m5p5n3j0J99K5j08m8J98k28j9M4J39qj13j3p7J78m3j84
$$ 143 -157 -24 62 51 104 59 -16 -69 -79 120 145 37 -11 187 -41 -60 -16 123 115 2 -11 -88 90 47 -137
3213a37J39j0l41J08K05j52M95l89k0K1J08K2j16L05j32J23j35j74K68j42J45
$$ -137 2 -8 -349 -241 -36 -188 307 -82 -102 -81 27 49 -67 238 106 229 94 -80 188 46 191
3234A91r8j8r2p2M15l22K37k07K1j41J99p9P8l43J20Q6n4j11J11K80k11k91J30
$$ 191 93 75 -17 -89 326 4 241 34 55 -86 113 34 112 -231 -111 -25 -79 -190 -79 201 -10 -301 -171
3257a71L40k72R9q0mP7K4jj4k19K37L19k64K18k35lK58j10l77J44q1J47J91l24
$$ -171 169 -103 -4 -84 -88 -11 13 12 -2 -221 16 335 71 289 54 51 309 199 -178 -34 -115 32 223 -101
3281a01J7Q5L9q0j16L96k18j46J92k18J30j01J52m0J83j06k14J54J20r5R3k84
$$ -101 -84 1 40 -40 -156 240 22 -124 68 -150 -20 -121 31 -9 174 68 -146 8 128 33 126 -158
3303a58K23j01Q0k35N29k39l48K60j02m7j98K08R6J76m3j00P3j87J02L7m9nj84
$$ -158 65 -36 44 -191 338 99 -249 11 -91 -138 -336 -128 -32 144 101 1 74 -113 -11 26 -23 -28 -212
3326b12M7K62j07lP6l44K44J49J7j58l7mK89j05n4l37l8K93k7j5n9K03Kj06J11
$$ -212 -165 97 -10 -13 63 -281 -37 112 129 -29 -66 -70 219 114 60 -277 -315 -22 -49 -64 -123 80 82 -24 87
3351H7K3k7j33J84j30O2k52Q5k35P7L30J0p0J28mj50Qk42L26J63l14l11N77k75
$$ 87 110 83 -50 134 4 66 -186 -101 -336 -259 71 81 11 139 135 -15 -7 -249 77 240 -74 -385 192 -83
3375h3m2K76r5n2J99k26J27j26j65K09R4o3j83N5J08r4q3L65l21M9L49k25J3o7
$$ -83 -125 151 56 4 203 -23 104 -22 -187 22 116 53 -130 -75 33 -61 -144 221 -100 -51 298 73 86 19
3399A9K13l38K07j85O7j98K96l69n5L67j74j53K82J15j60J73K2j25K5J93j23j74
$$ 19 232 -106 101 -84 -17 -215 81 -288 -343 24 -150 -303 -21 94 -66 107 129 4 29 222 99 -75
3421g5K2j80J75l5N4K4j19K73R4l64J43J39k42O8N8J50k33P2l6J33J1n8j12p3
$$ -75 -53 -233 -58 -93 -39 -15 -134 139 233 -131 12 151 -91 -23 35 185 -48 24 -12 121 132 74 -38 -111
3445a11L87k78M8k27J20J08k36m0K01N5k0j13K06n6j49J04J43j23j69J65K70j1
$$ -111 276 -2 46 -181 -61 47 -189 -229 -28 27 7 -106 100 44 -105 -1 142 19 -150 15 285 274
3467B74k13m64L27K16k42K74k17j46K95l50L24m71L56oJ02J78l80R4j49QJ93j41
$$ 274 61 -403 -76 140 -102 172 -45 -191 104 -246 78 -393 -37 -43 59 237 -143 -49 -198 -190 3 -138
3489a38L83l5k61Q1J19j76L42l10k51M13k1r8O9k68n1M06m68L15k46r6J30K92
$$ -138 245 210 -51 30 149 -27 315 5 -246 167 146 48 117 -151 -202 204 -264 51 -195 -291 -161 131
3511A31K6r8j1j22L2M7P2q3q9J38O4m73N08j49K07j31l69K75J34K04k94J6p8N9
$$ 131 157 59 48 -74 -42 5 77 -6 -95 43 107 -366 142 -7 200 69 -300 -25 109 313 19 35 -43 16
3535A6k07K84j10J08j65N8J99j37j59J71j61J74K21j71J09j91p1m1JK06j49J09
$$ 16 -191 93 -17 91 -74 -16 183 46 -113 58 -103 71 292 121 230 39 -32 -73 -72 134 -15 94
3557I4l2o4ol4K18q6P6j25j00K04k35N4j63J71j20M27l38k89L69l6r1L50l85L37
$$ 94 62 -2 -8 -42 176 90 166 41 -59 145 -90 -36 -199 -28 -148 279 -59 -348 21 -15 -106 244 -141 196
3581A96j70m9J08j80K07J33k23k2j07L0J01jj81L27k59P3K8j10J78o6k11J69J81
$$ 196 26 -23 85 -95 112 245 22 0 -107 -77 24 23 -158 169 -90 -17 11 -99 79 13 -198 -29 152
3604A52k38J86k74Q3O4L6k1j35k2R7L77l85K31L5m0k76N03l63K61l1j47j96L7
$$ 152 -86 100 -174 -91 -27 9 -12 -147 -169 -72 305 -80 151 186 146 -130 373 10 271 240 93 -103 -66
3627f6L21j78l7J00j1k34J22J76N7k93K11m21J23L65q8j28j5j04K67l83L59k66
$$ -66 255 77 40 140 129 -105 17 193 250 -43 168 -253 -130 235 147 19 4 -100 167 -216 143 -123
3649a23J15K6o1L13j64O7j27K3J2j62J92n08K18K63j06l8J91K0M0n29L04L45m00
$$ -123 -8 18 -43 270 106 173 46 69 81 -81 111 -397 -179 84 -22 -60 131 151 191 -338 -34 311 -89
3672h9J4L03j95k2N3k53J40l6J30j72J85M6k56J45P7m9j59K58kk51n7k0JM04n5
$$ -89 -75 228 33 11 64 -189 -49 -85 45 -127 58 104 -152 -7 70 21 -138 120 118 -133 -190 -210 -209 195 140
3697A40j19J6l9J17q0j44q0L38J34l06K4j82J25M13l35N0r2J52j05j27K0J48Q1
$$ 140 21 37 -2 115 35 -109 -189 149 283 -23 1 -181 -56 357 22 72 -20 132 27 -100 -80 68 149
3720A49j73j15L76l31m3K86j57l13N70j25j17k24M01j5k19p2M3J54j57Q8r6L09
$$ 149 -24 -139 237 -94 -137 149 -8 -321 249 124 7 -217 184 169 -50 -122 -79 75 -82 6 -90 219
3742B19l95K53K24k2n27K62O9j0N1j70K5P7l85M25Q9j42l2RJ56jr9R8k44n8o1
$$ 219 -176 77 301 279 -248 14 83 73 124 -46 -21 56 -329 96 185 43 11 20 176 175 76 174 -70 -128 -189
3767a89j1L17j2L0r9m00M33j89Q0L1J71j97m8N5l1N9l2oL8J72k68O7J02j14OJ07
$$ -189 -200 117 105 135 36 -364 69 -120 -40 -9 162 -35 -83 -28 -59 0 -32 -38 0 172 -96 -29 73 -41 -35 72
3793G2R9k24J82k03K20j41J4M3m5K47l88Q2q2J9J85J38k29l4n4J28Q9l24K11k10
$$ 72 171 -53 129 -74 146 5 19 62 17 264 -124 -42 -124 -105 80 218 -11 -45 -99 29 118 -206 5 -205
3817b05Q2J54K1o3k95M26k47o9R6k98K43J02qN4j96K82p1P4Oj36J96k90K09k01
$$ -205 -123 31 52 -11 -306 120 -127 -196 -100 -398 -155 -53 -61 -7 -203 79 8 82 88 -48 148 -142 67 -134
3841a34L8L1O8j47K35k35K09j5K34k82K43k99k43K35No4J01o9k8N9K64k40j64
$$ -134 -96 -65 3 -144 91 -144 65 50 284 2 245 -54 -297 -62 -57 -121 -20 -89 -117 -58 206 -34 -198
3864a98J17J30q8P5k1J25r6rj66K70m48K52J38p6J34j64J89k18K16j74k6k08K9
$$ -198 -81 49 -39 36 15 140 44 35 -131 139 -309 -57 81 5 139 -25 164 -54 162 -12 -38 -246 -217
3887b17J50Q7K60l67j7J66k94M00qj48J89j03r1Q3k93K35k09J92J27k36J51k59
$$ -217 -67 20 280 -87 -104 62 -232 168 160 12 201 98 7 90 -203 32 -177 15 142 -94 57 -202
3909b02O6J66P7l36K81Q9qo2J59l49J53J41r6j34K25m7l18J68p8P0j6J26P4m68
$$ -202 -136 30 107 -229 52 141 133 71 230 -119 34 175 79 -55 170 123 -195 -27 -105 -35 -51 75 149 -319
3933c19L80l2R5O5j0k06L25k94r9L6P2oj06M5j31M12l08J15Ok70M50p9l25K44
$$ -319 61 29 124 189 179 -27 298 4 -95 -59 13 7 -99 -54 -185 227 -81 34 40 -230 220 141 -184 60
3957F0K1K9Oj96J49L3k0q5j43R0J62m49M59k69Q4K65j48k08k8R7J82M0q3r3J36
$$ 60 81 110 116 -80 69 102 82 -3 -146 -56 106 -343 116 -153 -69 196 48 -160 -188 -91 91 131 48 -45 91
3982I1k50L9J48K32l97R5K86k36N1j97L51l6j3l55M40k99J27j45L19j01k89l0
$$ 91 -159 -120 28 260 -137 -42 244 8 59 -138 213 177 164 -191 249 -50 77 -68 251 150 -139 -169
4004a69n9J09k75M90l30P0J09J83p5p0L8K68l84K27j87O5K98k69L05m74L38M5
$$ -169 -228 -119 -394 96 -234 -164 -55 128 53 -17 21 289 -95 132 -55 10 308 39 344 -130 208 253
4026B53k77j3m4L00m60K03r1L7k9K18m8J77k89k53Q0K17k19J39K46m43L59J39
$$ 253 -24 -37 -81 219 -241 -38 -129 -92 -121 97 49 226 -63 -316 -236 -19 -238 -99 147 -296 63 202
4048B02r0k63J11M6R3nQ9r3r6P8l4M5M7k43J98n8k33J11R9M3Q2m0k0j92n8P2K87
$$ 202 112 -151 -40 6 99 94 183 90 -6 72 38 83 130 -113 85 27 -206 -95 4 47 129 89 69 -123 -181 -109 178
4075A78j45k08m3M71m66K67l6r2j5nj3m8J48M2r5O1q6K41n0j48R3J41j22l4j75
$$ 178 33 -175 -218 253 -213 54 18 -74 -89 -94 -107 -155 -7 35 -60 1 -85 156 106 -42 51 192 70 36 -139
4100a39N4J18J28n2k26J50k22J8q9K91k04Q5o8K87nj94J87j61m2J09q6j21O08
$$ -139 -85 33 161 109 -117 33 -189 -171 -260 31 -173 -88 -156 131 126 -68 119 -42 -84 25 -61 -182 426
4123D26n00K18Q9j00j9Q2j22k29M1k4J39j02J65j8K01k46j98K85j59l18L36k9
$$ 426 -74 144 233 133 114 196 74 -155 -114 -138 1 -101 64 46 247 1 -197 88 -71 -389 -53 -82
4145h2m5j31N32k50J54k88J5J89k2j13P0l39J08J81J96l86J35J82r1J88n9l14
$$ -82 -127 -258 274 24 178 -110 -95 94 72 -41 29 -310 -202 -21 175 -211 -76 106 15 203 144 -170
4167a70J17L68m0j42j95N9P5j61J47J6j6l2K71l20L18k65L1K43k00k39J03J22
$$ -170 -53 315 275 133 -62 -3 72 -89 58 74 58 26 297 -23 295 30 61 304 104 -135 -32 90
4189I0o9L00m98K50l0j5J32j16M0j72J74p1J41J7k08p9j58N24k60L3P5K02l17
$$ 90 21 321 -177 73 43 28 160 44 84 -88 86 15 156 173 -35 -114 -272 252 -8 25 100 302 -15
4212a5L9l2R2k47J90J33q9j52O3J06P8m34M63j33l05J12Q9K57l66K29j72K71j82
$$ -15 24 -8 84 -163 27 160 71 -81 -18 88 166 -268 195 62 -243 -131 -42 215 -151 78 -94 177 -5
4235eK14j72O8j6M20p28K24r8l19N43k32J2LJ46j74j13L94m64L46K5k19K69j82
$$ -5 209 37 105 89 509 -219 5 -93 -412 131 -101 -89 -86 60 -114 -227 167 -297 49 74 -145 124 -58
4258e8J14j28m2J04K02k54Q8J82o4r1l6M7l8k32M17J69k11R6j79k37M58n64L83
$$ -58 56 -72 -114 -10 192 -62 26 208 144 53 17 64 26 -206 211 380 169 265 86 -151 307 -257 126
4281A26R6k62r4J68J59Rj06j51o7P6k00K02o1K13k76m0o9J33m8K47R7j92L7R6
$$ 126 222 -40 -134 34 193 202 96 -55 -122 -46 -246 -44 -105 108 -168 -208 -277 -144 -192 55 152 -40 -3 93
4305I3j88N9K9p6L7j38o3q4K45j70K07r8J20J55l15O62m38j47R4J25q7l7m9q5
$$ 93 -95 -36 -7 -83 -46 -184 -247 -331 -86 -256 -49 -147 -27 128 -187 475 37 -110 -16 109 22 -15 -64 -149
4329a49Q1J77j66l4j28L24n4k3r7j58J90J89j6m5j84J36k5j4L6p5j8L5R0q7p1
$$ -149 -68 109 -57 -91 -219 105 51 28 -69 -227 -37 152 136 91 -93 43 18 4 40 -35 -53 -18 72 -15 -86
4354h6M5Q9n3qR2R4q1p5J65l87J86k47K90j58L4K06k74n5K66j8O9j60j9K43j68
$$ -86 -41 48 -5 -13 79 173 92 17 182 -205 -19 -266 24 -134 -100 106 -168 -223 43 25 94 -66 -85 158 -10
4379a0R9n4q4K01r8N1k61L18l15K95l12K16p9J57j54R1j40K43j47J43j87j04N5
$$ -10 89 35 -49 152 54 105 -156 162 -153 142 -170 46 -33 124 -30 61 -79 164 17 160 -27 -131 -76
4402g6K38j27J2p8J19j35m2O9k12K17Q5r0O4K41n24L66j71P6N1l79M42m9l09j10
$$ -76 162 35 47 -31 88 -47 -89 -20 -232 -15 70 -20 44 285 -239 127 -44 32 83 -296 146 97 -212 -322
4426c22M90r9K42k89j59M7J66k31l4K42k32O9j61K25j81K41p0J30j05J10j33l9
$$ -322 168 69 311 22 -137 -90 76 -155 -189 53 -179 -110 -271 -46 -227 14 -56 74 -31 79 -54 -93
4448i3J50K1j1k22M24k61K11k28L2J63j65j69J40l1J3k99K30j40M62j42r5%Q4
$$ -93 57 78 67 -155 269 8 219 -9 23 186 21 -148 -8 -39 -26 -325 -95 -235 227 85 -10 -10 74
4471G4j2J15j97l1j33L05l40K27M3J33l58K5J28J19m7Q7k96q0Q4J50j36K66k14
$$ 74 62 177 -20 -51 -184 121 -219 8 51 184 -174 -149 -21 98 51 138 -158 -238 -154 -4 -140 126 -88
4494h8J35l2k1rj00R4k2pj38K63j67L75n07N3K98J3l41J97J71k4J4l90L70r7j18
$$ -88 47 15 -6 -15 -115 -21 -43 -50 -188 75 -92 283 -224 -171 127 140 -201 -4 167 143 157 -233 137 40 -78
4519g8O7j28J84n1K46j47J5j04l4k9n3K38K3m6l42J65J65N2o9m3Qk3Q0R4k6j55
$$ -78 -11 -139 45 -6 240 93 108 4 -30 -59 -112 126 149 103 -239 -74 91 143 74 31 39 16 96 190 164 9
4545IL50k68q5p4N6r3J59j1j71J78k22L93k25j13K85l32Q2j78K71L5k75J58k02
$$ 9 359 91 6 -68 -12 -105 54 43 -128 50 -172 221 -4 -117 168 -164 -82 -260 11 46 -229 -71 -273
4568b73M09j6N6n19L71M8k70%J53J18p2j18J59o2j62J82J20l56K18J28k00r4N38
$$ -273 136 120 176 -343 28 76 -194 -194 -41 77 5 -113 46 -16 -178 4 124 -232 -14 114 -86 -180 358
4591C58l36%K95k45j82K77oo4l38K67J54j77l73K96J04QJ56j48j0l9k9J11k15
$$ 358 22 22 317 72 -110 167 161 97 -241 26 180 3 -370 -74 30 38 194 46 36 -3 -32 79 -136
4614a36J17q4m1Q6j83K61j09K19k18lJ97l35K34l8j28N26o42N23r6n1p1O0R4k08
$$ -136 -19 -103 -144 -58 -241 20 -89 130 -88 -91 106 -229 5 -33 -161 365 -277 246 150 99 28 88 182 -26
4638b6Q5M57l16k64L8J19k12l2L42r1k93J19O0p4L4m0J92N1j19j74J55J3j90p3
$$ -26 59 516 200 -64 -26 93 -119 -151 191 100 -193 -74 -14 -88 -54 -94 98 149 30 -144 11 24 -166 -239
4662b39J85J24K6j12O4o8L1J44J9l31J48L0L9p3K61p5j15k1K31j34j52N9k02M21
$$ -239 -54 70 96 -16 48 -20 11 155 174 -157 -9 21 60 -13 248 173 58 37 268 134 -18 41 -161 260
4686B60k80K37m3n2k78Q1l5Q2J43l66K80j91J17Jm3K43k29K19j42J47L3Rj95o6
$$ 260 -20 217 174 122 -156 -75 -110 -28 115 -251 29 -162 -45 -44 -87 156 -73 146 4 151 184 193 -2 -68
4710f8M2j72rn9K36j50J18J99m1j97K02j74J11j44N2k2J19o5kJ8K31l05J32ql4
$$ -68 -26 -198 -207 -266 -30 -180 -62 137 96 -101 101 -73 38 -106 -54 -76 43 -22 -24 -6 225 -80 52 44 10
4735A0K24m44K84m6pk3j36K83k7k43L36k01j16m9R6J82Nmj47J36J33k73j80R7
$$ 10 234 -210 74 28 21 -2 -138 145 118 -125 211 10 -106 -155 -59 123 128 124 -23 113 246 -27 -207 -110
4759a10P6K9O8k01J40K0J62J16k57k57K52J20J4k4l88N88m62L2M6k70J13L70j51
$$ -110 -34 -5 63 -138 2 22 184 300 43 -214 38 158 172 148 -240 348 -114 -82 -36 -306 -193 177 26
4782B6j35K08J57j90J06k80q9J09N7k75K77k06J20rK62j54J83k44K27j04k92M24
$$ 26 -109 99 256 66 172 -108 -197 -88 -31 -306 -29 -235 -115 -124 138 -16 167 -77 150 46 -246 178
4804A78k90n0J82j08j6K89m10K25Q3k54K50J40P6k72k8k25K62n7j37K16K6j60
$$ 178 -112 -162 20 -88 -104 185 -225 0 83 -171 79 219 295 23 -5 -230 32 -25 -162 54 80 -80
4826h0j74K83j31R7o6%N3K0M9q5O9k66nJ11K64r8P4j20n8J63j46K11k22K61j15
$$ -80 -254 29 -102 -5 -71 -71 -18 2 51 -34 35 -231 -236 -125 139 41 115 -5 -63 100 -46 165 -57 204 89
4851H9k11J21l0j0r5j0K81K51q5k16Q0j84r6j4J21K6P3k52J88K38j85j50K67K5
$$ 89 -122 -1 -31 -41 -136 -146 135 386 301 85 165 -19 -115 -129 -8 18 91 -161 27 265 80 -70 197 222
4875B22q0p2j30L7j51L24Q3j76j17j30K53k47L08k85J54o7NM8Q1J6J20j82k7k00
$$ 222 142 70 -60 -23 -174 150 233 57 -60 -190 63 -184 124 -161 -7 -74 -69 -21 60 76 196 14 -13 -213
4899b13J91K16l9p1j71J24m5L5j0J06J44l25R4l8k1J06o0J37l69L30k66J8J22
$$ -213 -22 194 155 84 -87 37 -8 27 17 123 267 -58 36 -2 -23 83 23 160 -209 121 -145 -127 -5
4922eP0l21M5J13Q7rK10k09m8J90k88J15o5O8P6n4K55q8l50M1K30M1r8M9j61R7
$$ -5 65 -256 -211 -98 -11 -20 190 -19 -67 123 -165 -50 -115 -47 29 -25 230 142 -208 -167 63 104 6 55 -106 -9
4948ij11j5j22J53k8J46L05m82q4J85J42j95QL06j25j72o1M9L00k72K84j66k06
$$ -9 -120 -135 -257 -104 -132 14 319 -163 -247 -62 80 -115 -107 199 74 -98 -159 -110 190 -82 202 36 -170
4971a70L8K58k56K95j92L2m6k11L26j73m8M28n08J29P5J11r7j22O7n1j9K24J08
$$ -170 -132 126 -130 165 -27 5 -41 -252 74 -99 -147 281 -227 -98 -23 88 -9 -131 -64 -115 -134 90 198
4994A98J62k82j03J31l58L37Q2j71R3k21KJ01N7k69K44N8k84K60K11l34K89j11
$$ 198 360 78 -25 106 -252 85 167 -4 89 -132 -130 -29 28 -241 3 61 -223 37 248 -86 203 92
5016I2j64j00J23o6n4K6j69M53q3j92O1j55J88l45L55J99j49J27k13p6K32j84
$$ 92 -72 -172 -49 -115 -169 -143 -312 141 58 -134 -73 -228 -40 -385 -30 169 20 147 -66 -142 90 -94
5038i4K89k59K30k68J74Oj7K3J05k66J92R1j74r2j48L40k87J35J14o1om06L57
$$ -94 195 -64 166 -102 72 78 61 84 189 -77 115 206 32 -60 -208 132 -155 -20 94 33 27 -379 -22
5061b2j57k03M60j09K73o3j85j41J24q2O9L69l90J91j89J41j4k9K2j93K20l28
$$ -22 -179 -382 78 -31 242 179 -6 -147 -23 -105 -36 333 -57 134 -55 86 72 43 65 -128 92 -236
5083b36q6J93L4J70k38K38p%k43K73k25m4K59q4m3L37k55qn7O2O5j91K79k6j99
$$ -236 -322 -129 -95 75 -163 75 68 68 -175 98 -127 -171 88 4 -39 298 43 35 -22 40 105 -86 193 167 -32
5108c2j3j40J03R3J33j24j10N2n6L1j09K40j68J20j7J16k25J2J75J47k65J53k02
$$ -32 -45 -185 -82 11 144 20 -90 -38 -94 -63 -172 68 -100 20 3 119 -106 -94 81 228 -37 116 -86
5131h6J81J09j22q6J84k46K5J44k97K85l24O27m18OJ26j99j62J92m1J97J4n27
$$ -86 95 204 82 -4 180 -66 -41 103 -194 91 -233 394 -24 -18 108 -91 -253 -61 -102 95 109 -418
5153d18O56j12k37l6N9K89l64P4L5k04K20M8k6J44k69R6j05j9K26Lm0j39J54n0
$$ -418 238 126 -111 -147 -88 201 -163 -89 -54 -258 -38 10 -16 128 -141 -45 -150 -169 57 60 20 -119 35 -15
5177a5J01j39k6j89N67l41qj15kJ89N2M7l35K45j15K13j8m1k37R6M3k01L41k37
$$ -15 86 -53 -79 -268 299 -42 -50 -165 -167 22 74 121 -214 31 -84 129 111 70 -167 -71 -28 -229 112 -125
5201a25L07k17k47K96p5k17k8M18p1J70k20J11q2k16L43k32j27J06K0K0N5J22
$$ -125 182 -35 -282 14 -61 -278 -306 112 41 211 -9 102 20 -196 147 -85 -212 -106 -86 -66 -11 111
5223A11l89K95r9q1p9O9J81r7L15q1j45l8p2L28j69o4J60k10J55j53j08L31j91
$$ 111 -278 17 -82 -163 -242 -173 8 -89 226 145 0 -38 -110 218 49 -15 145 -65 90 -63 -171 160 -31
5246c1L3r5Q7J64q9J0q6k5l0M0K87l53K94q0j68r0K4N89o52L40l9l17J32J34r1
$$ -31 2 -93 -6 158 69 79 -7 -32 -62 -22 265 -88 206 126 -42 -132 -108 481 -171 169 130 -187 -55 79 -12
5271a2J73J6J20J06m08k46K25N2J49N3k58k82J83L27l92L65j52J14k00q1J06K04
$$ -12 161 177 297 403 -5 -251 -26 26 175 228 -30 -312 -129 198 -194 171 19 133 -67 -148 -42 162
5293A62m22K74j26J94Q4m29J78j3j54L30j27K36K2m09K63j35J71j79Q7R6j41J05
$$ 162 -260 14 -112 82 166 -263 -85 -98 -252 78 -49 187 209 -200 63 -72 99 -80 7 103 -38 67
5315F7j31q7j6k82N58j10j73J75n8J06q9m3J94j44J1l3K27k18R5k39K08J46n7
$$ 67 -64 -151 -167 -449 109 -1 -174 1 -57 49 -40 -83 111 -33 -22 -55 172 -46 49 -190 18 164 107
5338A07k01R2j43R3L6n0K72j61k90J44M0K9K21k78J68k8JQ7n6j55L28j8k86pJ0
$$ 107 -94 -2 -145 -52 -16 -66 206 45 -245 -101 -61 -32 189 -89 79 51 52 139 83 -72 256 238 -48 -55 -45
5363d5J7n6L81j75k33N03k52k13j41M93l00L35o34J98J00Q8L4l11K83k17K1J5
$$ -45 -28 -84 297 122 -111 392 140 -73 -214 279 -21 314 -320 -122 -22 66 100 -211 72 -145 -124 -109
5385a09J79p5k8M8j10j72M80m31K90M1q7J14o5k81K72l83L34j8j1n5P2M9J88l70
$$ -109 70 -5 -33 15 -95 -267 213 -218 72 113 26 140 75 -206 66 -317 17 -1 -12 -67 5 54 242 -128
5409a28m0K93j95j33J36J09J80n45L40O8m3n1q0L9l0K21k83K38j69M0o7J11r5
$$ -128 -168 125 -70 -203 -67 42 222 -323 17 85 42 -9 -89 -50 -80 141 -142 96 -73 -33 -100 11 -84
5432h4M2K21kk86M05l75l70J79M22l3j78K19l08K24k72mJ21o0k23K00j02J02J49
$$ -84 -42 179 177 -109 296 -79 -449 -270 152 119 -59 160 -148 76 -196 -200 -79 -139 -362 -162 -264 -162 -13
5455a3j82p9L91n9l79K60k2l7P6J45l14K45p1k4OL12k87k86M40j85R4K68l16j01
$$ -13 -195 -274 117 58 -321 -61 -83 -120 -44 101 -213 32 -39 -63 -57 255 -32 -318 122 -63 31 299 -17 -118
5479a18K45l04N3pK15k61M25l08J60J68k03j31m5L81l79n4M31l53j36K49j39O9
$$ -118 127 -177 -124 -131 84 -177 248 -60 100 268 65 -66 -111 270 -109 -163 268 -85 -221 28 -111 -42
5501d2J60l21K21n6j6J42q0J14o9n8J5j1J64l41K98K4l61K38K09l35J11Q7j62
$$ -42 118 -203 18 -38 -54 88 8 122 53 -5 10 -1 163 -178 120 144 -217 21 230 -105 6 93 -69
5524f9J73j75J2N8K4L54l24m25L25o0K54k80L29j12n4j88K83j95K00m28L03K7
$$ -69 104 -71 -59 -1 23 377 53 -372 -47 -107 147 -133 196 84 30 -158 125 -70 130 -298 5 32
5546C2j86J88j91J28j4o3o9K39m30M21Q6p3j41kmRJ94j96R0%R2k71J46o4m1K85
$$ 32 -154 34 -157 -29 -43 -106 -175 64 -366 55 141 68 -73 -75 -79 -70 124 -72 18 18 110 -161 -15 -79 -120 165
5572A65k30j03K56k37M5K23N8k05L4M0J1O9l27K44l18L15j07J14r3j79N18k86
$$ 165 -65 -168 88 -149 -104 119 177 -28 6 46 57 126 -201 43 -275 40 -67 47 -46 -225 293 7
5594Gm9J71j12k37P5Q7k06L22j53L04k69j4l3J98j04k5J47j33K2J03m9J8k19J60
$$ 7 -42 129 17 -220 -145 -58 -264 58 -95 209 -60 -74 -107 91 -13 -38 109 -24 -2 101 52 70 -149 11
5618A1j11Q9m3m9J47M8k84P6J19K61k11r6p6k8J38M8m3J71p3j27o3R2m3M9K47
$$ 11 -100 -11 -54 -103 44 92 -192 -116 3 264 53 -43 -119 -147 -9 39 -4 167 94 -33 -96 -4 -47 2 249
5643B49j91j34J05j73L10n09M25l49K65q4o3J79O5J71m72J14LJ95K0J6k02P9m
$$ 249 58 -76 29 -144 166 -343 82 -267 -2 -86 -149 30 95 266 -206 -92 -89 106 126 142 -60 19 15
5666A5j27K56k64K35k66j3J80o1Q5rJ48j96q4j12L04M5k90p6L05k87L4Q0J49l8
$$ 15 -112 144 -120 115 -151 -164 16 -45 40 31 179 -17 -101 -213 91 136 -154 -230 75 -212 -178 -98 51 13
5690A3m6O0j33K55m0oj09K16j42N0j39J66Ol6l53M04n0k00o3M53j13j91k88K48
$$ 13 -33 27 -106 149 109 103 -6 210 68 118 -21 145 151 115 -238 166 116 -84 -147 306 193 2 -286 -38
5714c8O9j47J09j52J89M1j7l68k6K63Q2j62K80j25K0J58k35l06J43M90k72k71
$$ -38 31 -116 -7 -159 30 71 54 -314 -340 -77 5 -157 123 -2 18 176 -59 -365 -222 268 -4 -275
5736b75K42q2K41m68O09m74P3K08q3J52j15j03K1j54K65p0K49l83oM6M0K2j27
$$ -275 -33 -115 126 -342 267 -207 -134 74 -9 143 28 -75 -54 -208 57 -13 236 -147 -153 -107 -67 -45 -172
5759a72J02m00M00K16k57r2K21j83J33j02j19M71k55J9p1K67k19nO4J3O2L39l82
$$ -172 -70 -470 -70 146 -111 -203 18 -165 -32 -134 -253 218 -37 -18 -89 178 -41 -46 18 31 93 432 50
5782E0M6J06O5l19J50n7l3J98j63m2j1N7l8j9N5oj01L29l67L54k40K16k88LK32
$$ 50 96 202 267 -52 98 41 8 206 43 1 -10 47 9 -10 45 39 -62 267 -100 254 14 230 -58 -55 177
5807A77j77l08L23k24K20K59k09%k15R8l0J31l20L04q4Q9J60k98K75j82O8l6K02
$$ 177 0 -308 15 -209 11 270 61 61 -154 -56 -86 45 -275 29 -55 34 194 -104 171 -11 57 21 223
5830B23j21k92J72L07j37k62K41k88J78m86M72J6r0j7k7r8J92j19J80j04q1M58
$$ 223 102 -190 -18 289 152 -110 131 -157 21 -465 7 23 -67 -84 -111 -209 -17 -136 44 -60 -141 317
5852C17k22j90J40k44J04K19n9j06o2j26K86l22K04m6QJ31K5m5j02J55r6K60l48
$$ 317 95 -95 45 -199 -95 124 65 -41 -103 -229 57 -265 -61 -107 -99 32 57 12 -90 65 -31 229 -119
5875a19K1m5L7K89k30Q2J66k10k0PJ15k74K71K3r7o1k85M65N8j24p7p0J92J5l15
$$ -119 -98 -143 -106 183 -47 35 201 -9 -29 -22 93 -181 90 113 16 -45 -330 135 193 69 -8 -78 114 129 -186
5900a86QK82M3j33m9J16o2N2J13l33M56l43K74p7m39L45k14M53n40K5J89j12L07
$$ -186 -178 104 147 14 -35 81 19 71 184 -149 307 -36 238 161 -278 67 -147 306 -234 -209 -20 -132 175
5923A75J59j99m4K10k54PK67l05p0L9K46n8j68J06k34K47J01k13J67k57P5j91
$$ 175 334 135 91 301 47 54 321 16 -54 -15 231 173 5 111 -123 124 225 12 179 -78 -3 -194
5945a94L84j30k39j10L02L8n6jk70L46o1n0J84k10J63l04N82k89j20P7K04j48
$$ -194 190 60 -179 -289 13 51 -5 -6 -276 70 9 -41 143 -67 96 -208 374 85 -35 42 246 98
5967I8J2j15O8j44j8L4m3j30K18p9O3m8J65j7o8j25P3K44j57M4RM13p77N03r3
$$ 98 110 -5 63 -81 -99 -65 -108 -238 -20 -99 -36 -84 81 64 -4 -129 -56 188 31 75 84 497 -280 223 130
5992A30j23J73j07p4o6oj31K63j16J51j28K0J14k74N6J32J18J55n4k77j09K77
$$ 130 7 180 73 -1 -67 -73 -204 59 -57 94 -34 -14 100 -174 -118 14 132 287 233 -44 -153 124
6014A24j49j43K29M2K8K3o2n9O4k84L7J73j76N1n5k2q4K77J33k45K78j31j94K32
$$ 124 -25 -168 61 103 131 154 92 33 97 -187 -150 23 -153 -102 -157 -179 -263 14 147 -98 180 49 -145 87
6038H7j7l53J57O3J1J06Mj42N7K7M27l44j16K86j43k89J91N0J80k18q8J13J0Q7
$$ 87 70 -283 -126 -63 -52 54 58 -84 -27 0 427 83 -33 253 110 -179 12 62 242 24 -64 49 59 146
6062A46m0l6k19L43j00Nj83rN1J54k40j55J38o5K55m0j0j32j81K45K33l0J84k51
$$ 146 106 70 -149 194 94 99 -84 -93 -42 112 -128 -283 -145 -210 45 5 -5 -137 -318 -73 160 130 314 63
6086F3m8R2k60J48qj27qK21j11J0j32O7Q6L2J89l19J40l0o9J88k7j09P3j34J64
$$ 63 15 107 -153 -5 -13 -140 -148 73 -38 -28 -160 -93 -7 25 214 -105 35 5 -64 124 97 -12 61 -73 91
6111I1P1l64L23M2j06J82l50k4K19qJ49k83L22j67k7k16J15J79p5j14j64N0M9
$$ 91 162 -202 121 163 57 239 -111 -135 84 76 225 -58 264 97 70 -146 -31 148 73 -41 -205 -155 -106
6134a06r2K08M9k4k69K33J23r3J8J54j64JP3Jj37O9N2Q2n3k53J46J35j88J49j92
$$ -106 -198 10 59 35 -234 -1 122 29 47 201 37 38 111 112 -25 44 96 178 125 -128 18 153 -35 114 -78
6159g8K16k98P4K9k41L08j01R4k84M91k15k1Q7j42k24L50O9j70R2L14k11l13J16
$$ -78 138 -160 -86 -57 -298 10 -91 3 -281 210 -5 -26 61 -81 -305 45 114 -56 36 350 139 -174 -58
6182e8N1j51j5K86j26J25n9j51J11j59J59K14j37k9k28J09J79k06M2n9J14L2L6
$$ -58 -7 -158 -173 113 -13 112 53 -98 13 -146 13 227 90 61 -167 -58 121 -85 -43 -102 12 44 80
6205H0j31K57l95J37J4n7K25O5k52jlO1p2LJ38Q3P8j50j74K7J93j84K44k32K15
$$ 80 -51 206 -189 -52 -38 -95 130 195 -57 -58 -61 0 -72 -69 69 152 230 80 -94 -67 126 -58 186 -46 169
6230A69k18oJ55o3r3O5R1j47J0K00j72jQ6l5J58L8k57J89Q6l71M54m35J30n0J33
$$ 169 -49 -55 100 37 -56 9 100 -47 -37 163 -9 -10 76 41 199 237 -20 169 255 -116 338 -97 33 -17 116
6255A16P0q1np0J6J41oj66N9n4L1j01J46j68J52O2j7j42M4J7N8p4Q7j34j68K47
$$ 116 186 105 100 30 46 187 181 15 74 20 51 -50 96 -72 80 142 125 -17 27 44 102 28 115 -19 -187 60
6281F0r0Q6M4j12k16L39k29Q7j53L0N7J90j07k42K02p5j2O2q3J27k6J30l39K88
$$ 60 -30 56 100 -12 -228 111 -118 -31 -184 -154 -97 93 -14 -256 -54 -129 -141 -79 -162 -35 -61 69 -270 18
6305A8M6j42J71k52K06j92J49j01J57P1r4j82j30K03R0l2p4j8J85q4J49k95J18
$$ 18 64 -78 93 -159 47 -145 4 -97 60 131 37 -145 -275 -72 18 -14 -88 -106 79 -5 144 -151 -33
6328c3j18J22P1J26j82M5J77k20Q2q3L44m32J69q6k18j50M67m20N60l7k17J03
$$ -33 -151 -29 42 168 -14 31 208 -12 70 -13 331 -101 68 -18 -236 -386 81 -339 221 184 -33 70
6350G0j08K70l94l8K29j96L12j80J10m2P2j55q1R7l26J42N6K41l26K79K56l19
$$ 70 -38 232 -162 -200 29 -167 145 -35 75 33 105 -50 -131 -34 -360 -218 -162 79 -247 32 288 -31
6372c1L7k58L73qjlj77OP7j23K00lq5j4Rq7p0J38j3L3m4J87k03j32L75J68l22
$$ -31 6 -252 121 113 112 109 -68 -62 15 -108 92 89 4 -10 -1 -88 -158 -20 -33 0 -44 143 -60 -192 183 351 29
6399B9j78N2N9K56k79J27Q0j56j07N5j0p5K63J66k19J79j89j07M8j14J12K7j05
$$ 29 -149 -97 -38 218 -61 66 146 -10 -117 -62 -72 -147 116 282 63 242 53 -54 -6 -120 -8 19 -86
6422h6P6N1j9O0j45M8k3K8J09M4p3k23L3M07j96J7q8M3k95%K82m15L20K05l86
$$ -86 -10 41 22 82 -63 -15 -38 -10 99 143 70 -153 -120 287 91 108 20 63 -232 -232 50 -365 -45 160 -226
6447b26L7N85j25j90k12K82j00l1j64J08L5K30j44j90K13j57M6q4K9K10j35r1
$$ -226 -189 396 271 81 -131 151 51 20 -144 -36 -1 229 85 -105 108 -49 -3 -87 -58 152 17 -74
6469g4m0K37J18k80j75J79qN8j02J20k61R4K52k14P9j32k6K58j81K04m12K64q7
$$ -74 -114 123 241 -39 -214 -35 -43 15 -87 33 -228 -134 118 -96 -17 -149 -175 83 -98 106 -306 -42 -129
6492a29J31oJ01p4k86M15k04L65m90K7k00K02K73m9j21J51j51K75O3k31k42J59
$$ -129 2 -4 97 23 -263 152 -52 313 -177 -150 -350 -148 125 76 -45 106 -45 230 293 62 -180 -21
6514b1j71Q5k5J10N6j63Q1J1l1q4m5L61k29k24J68K32j29Pj7P3j4J33j42k82M39
$$ -21 -192 -107 -132 -22 34 -129 -48 -37 -68 -152 -197 164 -65 -289 -121 111 -18 -11 -28 45 31 164 22 -260 179
6539A79j92k36J56o1q2K28j19J91j67O0Q4j71J44j34M24k94J04Kn4m0oK14j65
$$ 179 -13 -249 -93 -154 -236 -8 -127 64 -103 -43 41 -130 14 -120 304 10 114 116 62 22 16 230 65
6562F5k40N6M4Q7l43KL72P0k72L21l00Q1J06k74J80J75k06J35o0j84J53J58Jk35
$$ 65 -175 -119 -75 12 -331 -329 43 113 -159 162 -138 -57 49 -225 -45 130 -76 59 -1 -185 -32 126 127 -108
6586a08j08J70j1RJ91k78k0K39j59J94Ro0J71l6j84J20k01J93l53L58J48m42K52
$$ -108 -216 -46 -57 -48 143 -135 -155 84 -75 119 128 68 239 203 19 139 -62 131 -222 136 284 -158 94
6609I4j94O6k03N2J10J17R8j88nO7n8J02j1O0o6J16k5k91j8L67m1j66J66j61o8
$$ 94 -100 -34 -237 -185 -75 42 140 -48 -53 14 -44 58 47 107 41 157 132 -159 -177 190 149 -17 149 -12 -80
6634h0N9J7k0o1K16k56l9L52l4r2K15l19O4J9j45l1j04K56oj27L25l52j67J76
$$ -80 -21 -4 -24 -85 131 -125 -164 188 154 62 277 -42 22 41 -104 -135 -239 17 11 -116 209 -143 -310 -134
6658a34M76k35j74j1J99k67K81K5L2j61k31K98K08k43j16q3M1p1R0J40j51k63
$$ -134 342 107 -67 -78 121 -146 135 160 192 31 -200 98 306 63 -53 -136 -95 -166 -76 64 -87 -350
6680c50J12Q8K53q0J33k78J16q7J50P2l42M20l5l73J69K7Q0l35J63J98n6m3m9
$$ -350 -238 -150 103 23 156 -122 -6 -93 57 129 -213 207 172 -201 -32 -5 75 -260 -97 101 45 2 -47
6703d7K37k79J63j94L4K9K38j98J10j89J60o6Rj02j50K16K1M1l79J24K45K65k45
$$ -47 190 -89 74 -120 -86 -57 181 -17 93 -96 64 -2 7 -95 -245 -29 -8 33 -346 -222 23 288 43
6726D3j52j28J31J10o0k77K41K14j78k5k19L48j16Q5J76j08l7j7j02J38L53p8
$$ 43 -109 -237 -106 4 -56 -333 -92 122 -56 -81 -300 48 -68 17 193 85 48 31 -71 67 420 342
6748C42m89J89j01N4k8J82k14J69J9j2Qj28q4J03j12jL5j18M16j09J34M5j60m4
$$ 342 -147 42 -59 -5 -33 149 -65 104 123 111 119 -9 -93 10 -102 -103 -68 -186 230 121 255 300 140 96
6772I6j81N8J85N8j69J2j53R2L4k19K02J08k83J88l20J26L93l06mR9j69J57J29
$$ 96 -85 -27 158 216 47 59 -94 -2 32 -187 15 123 -160 28 -292 -166 227 -79 -83 16 -153 4 133
6795A33k39m6M19k11j77J40M5l50K10J93l46J95J64k85K04k01K65k66l9M58j87
$$ 133 -106 -152 267 56 -121 19 64 -286 -76 117 -229 -34 130 -155 49 -152 113 -153 -192 266 79
6816G9l90K33J9O2k99K26J79j66r5Q1N25n32N04l34m47L90l99L03l6J5J14r6J86
$$ 79 -311 -78 -59 3 -296 -70 109 -57 -152 -71 454 -78 426 92 -355 35 -364 -61 -97 -82 32 -64 122
6839A22j48m7l3J37p2J53l1j39J50l91M41j64n6n9j34K52J18O4k01L1l9p7K02
$$ 122 -26 -73 -106 31 -41 112 81 -58 92 -299 142 -22 -78 -137 -271 -19 99 163 -38 -7 -46 -123 79
6862G9m4k56J59Qm0jJ21M0j24K06M6k81j09O9J08K22l43J19r7O9QO5M19n80R5
$$ 79 35 -221 -62 -54 -94 -95 26 66 -58 148 194 -87 -196 -127 -19 203 -140 -21 -118 -49 -41 24 443 -137 -42
6887d2J60j95J37j58Q9J69j90j07K52l12R1J68l47K96j03M6R6j54M4l7J09L8m8
$$ -42 118 -77 60 -98 -9 160 -30 -137 115 -197 -106 62 -285 11 -92 -46 50 -104 -60 -97 12 50 2
6910Boj53K63k28K44j61q0j7J84j33K53k63J52j65Q5J16j20n7J84k42P8J02j42
$$ 2 -4 -157 106 -122 122 -39 -119 -136 48 -85 168 -95 57 -108 -23 93 -27 -84 100 -142 -64 38 -104
6933a04J57l13L72j8l66J25J00J57o1j74J4L31j68k40K32o2oj37R4J50k28Q4J27
$$ -104 53 -260 112 94 -272 -147 -47 110 49 -125 -111 220 52 -188 44 -18 -24 -161 -67 83 -145 -61 66
6956F6j22K92k80K68k98P3J87k02j27K43k07O2J81r5J79j58j48L24l3K9l12n0
$$ 66 -56 236 -44 224 -74 -1 186 -16 -143 100 -107 -45 136 41 220 62 -86 238 205 234 -78 -128
6978a28K48j35q1l3J64p5p8K6L6J29l3o5j41K50j77K76J13l01J48l83K55j38J78
$$ -128 120 -15 -96 -129 35 -40 -118 -92 -56 73 40 -25 -166 84 -93 183 296 -5 143 -240 15 -123 55
7001E5kl1Nj10N3Q3l10K07K5j05J10o2j01j8L14j55or3N0L72l08J19k7j40P5M4
$$ 55 53 22 27 -83 -30 53 -257 -50 -25 -130 -20 -82 -183 -201 113 -42 -48 -141 -91 281 -27 92 65 -75 0 44
7027D4k5K09m82K87Q2j2m1j1J81j86P5j21M8Q1p0L6k10J74j61J02k4J57k42K6
$$ 44 19 228 -254 33 115 103 62 51 232 46 121 0 48 129 59 95 -115 59 -102 0 -24 133 -109 -83
7051h3N0J33R1m31K10k24K73P5j06L0k28J77K34k82J51O4j68k8j21L19k77K12
$$ -83 -33 100 191 -240 -30 -254 19 94 -12 18 -210 -33 201 -81 70 134 -34 -62 -183 136 -141 71
7073G1l5j79J44J6k55K15j05K86j29K7k75M04m28J72J73j22j09n2J64k56K68P8
$$ 71 36 -143 1 17 -238 -23 -128 158 29 56 -219 185 -243 -71 102 -20 -129 -181 -17 -273 -5 73
7095G3p3l37K91Q4k9j26j07K34J49q1k0J7N1j17m6O8k50K04J1j1m9P9j7J45L41
$$ 73 0 -337 -46 38 9 -117 -224 10 159 78 58 75 126 9 -37 31 -219 -15 -4 -15 -64 15 -2 143 484
7120D84n58K31R2j77Q3j80j13K21K9j68j51L15o4r0K01k08J08J36j52j99J38k7
$$ 484 -74 157 249 72 155 -25 -138 83 112 -56 -207 108 44 -46 155 -53 55 191 39 -160 -22 -49
7142d9j35P4K64n3j94q5N04n07p0K67k16L12j45O8k62N5J38K19k52j98K54K1k7
$$ -49 -184 -110 154 101 -93 -178 326 -181 -251 16 -200 112 -33 35 -227 -172 -34 185 -67 -265 -11 10 -17
7165a7K28k32r3J18R4j82o8L24k73J01L0q7J19r0Q0Q3j7m07P8K47k24L37j00M
$$ -17 211 -21 -114 4 98 -84 -152 172 -101 0 30 -57 62 -28 52 135 118 -289 -211 36 -188 149 49 53
7189E3J92m06L24k18n2K75l91J60J45j91k3K22o8k9P2k06L5M2J7Pk9K61k15j83
$$ 53 245 -161 163 -55 -107 168 -223 -63 82 -109 -132 90 22 -7 65 -141 -106 -64 -47 -40 -69 192 -23 -206
7213b06L52n5j75K15j46j9K69k78j23O0O5J18q0O9J44j25k8k76O4J68o2K90k75
$$ -206 146 91 -84 131 -15 -34 235 -43 -166 -106 -41 77 -3 66 210 85 57 -219 -155 13 -49 241 -34
7236c4R0j89J30J69M8k40j6J85l08J92j50P4j73J30J14r4J72j97K63k80j98J69
$$ -34 56 -133 -3 166 214 -26 -42 143 -165 27 -123 -49 -222 -92 22 -72 100 -97 166 -114 -312 -143
7258a43J01k40J60J37r1J38n0j43K68k04P1l0J4r2j00K59k11p6P3J43j1m0J67
$$ -143 -42 -282 -122 15 -76 62 12 -131 137 -67 4 -26 -12 -104 -204 55 -156 -232 -159 -16 -27 -67 100
7281A00j38Lj1j25j32N11l61K32k33l9K60NJ1k86L37j16N5r5q1J98K8k29J59o
$$ 100 -38 -35 -46 -171 -303 208 -153 79 -154 -193 67 72 83 -203 134 18 73 -22 -103 95 123 -106 53 47
7305D7m6o0K7k25L25j3j50P9lo5mQ8j93R4J72r0L8J39l28K07q3J51k24K75n6J96
$$ 47 1 -59 -32 -257 68 55 -95 -16 -19 -84 -88 0 -193 -99 73 -17 21 160 -168 39 -44 107 -117 158 102 298
7331B98m28K44J08l25k2o3N23k47n6J10m4j23k59l0L73J00j95K59J10n48M34R9
$$ 298 -130 114 222 -103 -125 -188 335 88 32 142 98 -25 -284 -314 59 159 -36 223 333 -215 219 318
7353C18l24K56k93J26j4k84L57j29P3j00J21j07Kj10P2K06m48J76J00j32K20P4
$$ 318 -6 250 -43 83 69 -215 142 13 86 -14 107 0 2 -108 -36 170 -278 -102 -2 -134 86 160
7375A60Rj57n0k3p7L26k82M23k12l8L7o4o0J99n7l71K06J63j17l3M0k06J89J07
$$ 160 169 12 -38 -61 -138 188 -94 329 117 79 116 52 -8 191 134 -237 -31 132 15 -18 22 -184 5 112
7399A12m49M29j10J45k50L36Mj09R5m50K86Q8j75j26K63o2l2J89j56j25L9J83
$$ 112 -337 92 -18 127 -123 213 217 108 203 -247 39 127 -48 -174 89 27 -5 184 28 -97 -58 125
7421A25k54Kl1J52J30j77M9L44j26l61K70j07nk21Q2J26k69J93P1K28k73p1L66
$$ 125 -129 -127 -158 -6 124 -53 -4 340 214 -147 123 16 11 -210 -128 -2 -271 -78 -7 221 -52 -123 243
7444B43l68L65j10r6k78K66N4M9Jl00L87j74K03j13j69L26l78j59K73r5J03J35
$$ 243 -125 240 130 34 -244 22 76 125 126 -174 213 39 242 129 -40 286 -92 -251 22 -73 30 165
7466A65m1k02m7L09k39J27j79K29j46k14K84R9l32J04j5R2j04M18l65k21L18J44
$$ 165 124 -78 -125 184 -55 72 -107 122 -24 -238 46 145 -187 -83 -98 -6 -110 308 -57 -278 40 184
7488A84M0n5j54J10m6kk9J29j61k0L52l15J17l26L11l76J48m0J39R1M4M1J7k01
$$ 184 224 169 15 125 79 77 48 177 16 -4 348 33 150 -176 135 -241 -93 -133 6 97 141 182 199 -2
7512bm2J8K7j25q8J87J57j28o0J55k73K60q2R6k70K54J33l10O8K01k18N5o6L06
$$ -2 -44 -26 1 -124 -212 -25 132 4 -56 99 -174 86 4 100 -170 84 217 -93 -25 176 -42 13 -53 253
7536B53j27l42L92l75K59j42l50L25Q0O9J37l77M13q4j67J92j59j5Qj35J66j96
$$ 253 126 -216 176 -199 60 -82 -432 -107 -27 42 179 -198 215 131 -36 156 -3 -18 -10 -145 21 -175
7558a75J35J07j03M03m65R8N1q0J09o6m2J91j26rp1j34K12j6o9M8j62J14j58K98
$$ -175 -40 67 -36 367 -98 0 51 -29 80 14 -28 163 37 28 -43 -177 35 19 -50 -2 -164 -50 -208 90
7582I0j48L4Oj55P6L1M5j3R7J95p5j37J52o6k43O2j95Q3M17j40j48K22o3l49K02
$$ 90 -58 -24 -18 -173 -97 -66 -21 -34 63 258 183 46 198 132 -111 -49 -244 -161 256 116 -32 190 127 -222 -20
7607b0m3m2k4O0Q5K36k75J5K72j86K7m8k29R9%L60k60p6J2j17L8l8K14m5p3qJ67
$$ -20 -63 -105 -129 -69 16 252 -23 -8 264 78 105 57 -172 -73 -73 287 27 -49 -37 -154 -116 -154 60 15 -58 -66 101
7634A01j34j3R5r4K0Rj58o6K79j25L04l97K64L5l02L52l09K69j53j09L67l60r
$$ 101 -33 -46 49 -45 -25 -16 -174 -240 39 -86 218 -179 85 120 -182 170 -139 130 -23 -132 235 -125 -134
7657a34K06P3P8j08o2o0J15l5o0J90l74J87O1l65J79Lj6M6n8J82j89N2r1K8J81
$$ -134 72 145 223 115 53 -7 108 73 13 203 -171 16 77 -288 -109 -106 -122 -76 -134 48 -141 -89 -180 -152 29
7682B9K50j27k2k32K43l11n8J29L10l7j93K54m50K74J17j92k0kL19m23J35j36
$$ 29 279 152 130 -102 141 -170 -228 -99 211 174 -19 235 -215 59 176 -16 -36 -38 281 -142 -7 -143
7704a43n4L94j27j31J85K57n17K15M4q7q7J1OJ77n0l6j84J26m2K5J49J44l59J9
$$ -143 -197 197 70 -61 124 381 -136 79 123 36 -51 -40 -34 143 93 57 -127 -1 -43 -18 131 275 -84 -65
7728f5K5K35l31R2N9J51R1n98L34j26J74o9J29j67O9j62M8K85l34L20p3r8J36
$$ -65 -40 195 -136 -44 15 166 257 -341 -7 -133 41 -28 101 -66 3 -159 -111 174 -160 160 87 -11 125
7751A25J25l52P9J26N3j31j75L5M0J0l9J09k04L04k33j01K77j71J12n6J70K21
$$ 125 250 -102 -23 103 156 25 -150 -115 -75 -65 -104 5 -199 105 -128 -229 48 -123 -11 -67 103 324
7773C24l52k41K95j2r9k7J29j33J2Q6J36q1J55j30k2p2K80k00K30m52J57m06K74
$$ 324 -28 -269 26 14 -85 -112 17 -116 -104 -18 118 37 192 62 40 -32 248 48 278 -174 -17 -423 -149
7796a49L49m36M11J00j80l7q0j96L61p1m0l3J75k89K94j38j71J86J21j07K15j49
$$ -149 200 -236 175 275 95 58 -22 -218 143 72 32 -1 174 -115 179 41 -130 56 177 70 285 136
7818A36j99l35K22n8K36J20k25J10n0j12j4J06j05K0j91R5O5K84k09k8L55l86
$$ 136 -63 -398 -176 -234 2 122 -103 7 -43 -155 -169 -63 -168 -148 -339 -244 -179 105 -104 -132 223 -163
7840a63K32m1M0Q2J17k15j75K41k67L7Q3Qm4jJ21j79J2K05P5j45K9l67L07J71
$$ -163 69 28 68 150 267 52 -123 118 -149 -112 -29 -21 -65 -66 55 -124 -112 93 168 23 52 -315 -8 163
7864A63p2j86Q4j47J52J7j48O7J09j13P1n0N8j2k13n0J39K21K5k08K22j50J12
$$ 163 91 -95 -11 -158 -6 11 -137 -70 39 -74 -3 -53 5 -7 -220 -270 -131 90 115 -93 129 -21 91
7887I1P7m5j29j77L98j00J14j46p6k86J32k4L40k49Q5k12J93j52n9Q5N3Q8j11
$$ 91 168 123 -6 -183 215 115 229 83 7 -279 -147 -171 169 -80 5 -207 -14 -166 -225 -140 -87 1 -110
7910a10L49l62L01l34L22j72l0K19o6n0O3k51j00K05J88m06M46o2l20K87j5n9
$$ -110 239 -123 178 -156 166 -6 -36 183 117 67 130 -121 -221 -16 172 -234 212 150 -170 117 102 43
7932D3Q0l31j1J15o1r6L31k34K11K0R2k0l85K9M37j93l1L7%j7j40O3J96o2J04
$$ 43 123 -208 -219 -104 -165 -261 70 -164 47 67 159 139 -246 -217 220 27 -4 33 33 16 -124 -61 135 73 177
7957A77l78J62R6L3K13m32N1J98M8k05K05k74J55j92M0R8j86J78R2l9K99m19K80
$$ 177 -201 -39 57 90 303 -129 -78 120 168 -37 168 -106 49 -143 -103 -5 -191 -13 79 40 339 -80 200
7980B00j42j42P9Q8j60j14J64J15j31O9Q1k8J27m36J56L08l17K23o4k55L41M7
$$ 200 58 -84 -5 83 -77 -191 -27 88 -43 26 107 79 206 -230 -74 234 -83 140 76 -179 162 209
8002B09l1Pl45N9L07k03J57m1J50k33l01L13rK59k95j51M21j69j04J06p9M8oj4
$$ 209 178 185 -160 -101 206 3 160 119 269 36 -265 48 39 298 3 -148 273 104 0 106 27 75 69 55
8026E5N9j84J24J2j24oK65l11p3J1m9J66O8M0L47l00j60J36j37K48J1k49K57j82
$$ 55 114 -70 54 66 -58 -64 201 -110 -183 -172 -221 -55 13 53 400 100 -60 76 -61 187 198 -51 206 24
8050B4L4O3l57K79m9j82L76j85j1q1M70l51j36k37M01k67J04R2k16K68l0j4j06
$$ 24 58 121 -236 43 -6 -188 188 3 -8 -89 381 30 -106 -343 58 -209 -105 -13 -229 39 9 -5 -111
8073a11R9k67J34J19j41L00l07j2J7m9L40l82L93k43K32k28J88j75k45L38K21
$$ -111 -12 -279 -145 -26 -167 133 -174 -186 -169 -218 122 -260 133 -110 122 -106 82 -93 -338 0 221
8094B21l51J53Q2K2j33j15J39j27M13k26J4m6m7k36j09M56J58l18l41M94m99K46
$$ 221 -130 23 105 127 -6 -121 18 -109 304 78 92 46 -1 -237 -346 110 268 -50 -391 103 -396 -150
8116a50J86L14l94N2J4l25K23K73p3l11K28j8M6p5J69k06J76J3l18L60k02n9P4
$$ -150 36 350 -44 8 22 -303 -80 193 120 -191 37 19 65 -10 159 -47 129 142 -176 184 -18 -77 -3
8139cm9k1J88J44l95j4l2J56R2O5r1l7O6j23Q2P6j32m1J83O6j19k73L68Kl14k
$$ -3 -52 -73 115 259 -136 -150 -182 -26 66 131 40 3 69 -54 28 104 -28 -69 114 180 61 -212 156 158 -156 -158
8165a58K72k65J55q4J4K72j55k29Q0K08j88Q1jn3nj58J74K36n1j77K60l67J87
$$ -158 114 -151 4 -80 -66 206 51 -178 -98 110 -78 3 2 -51 -56 -214 -40 196 145 -32 228 -139 48
8188D8J15k74K99
$$ 48 163 -111 188
8191A88
$$ Imaginary data points
##PAGE= N=2
##DATA TABLE= (X++(I..I)), XYDATA
0@%%%%%%%%%%%%%%Qj6J6j6K2l0L2m0M8n6O4p2Q8j04J19j35J52j73J98k24K52k84
$$ 0 0 0 0 0 0 0 0 0 0 0 0 0 0 0 8 -8 8 -8 14 -16 16 -24 24 -32 32 -40 48 -56 63 -72 80 -93 105 -119 133 -151
36a51L21l60M02m49M99n54O16o82P54q33R22j018J121j235J360j498J653j824
$$ -151 170 -190 212 -237 262 -292 324 -358 396 -437 485 -533 588 -647 713 -785 868 -956
54i56K014k228K472k750L072l452L903m453N140o030P232q953J1640j6468K7895
$$ -956 1058 -1170 1302 -1448 1624 -1828 2075 -2378 2762 -3268 3964 -4989 6651 -9817 18078
69A8078j06406j12118P1150k0509L748M1993L7977p0265q7753k616J17848J04955
$$ 18078 -88328 -200446 -129296 -149805 -146057 -104064 -66087 -136352 -224105 -226721 -108873 -3918
81c918J520p1588k0999N0307N9838m083k0816M1931R4224L7535m9535o6832L296
$$ -3918 -2398 -73986 -94985 -44678 15160 11077 -9739 32192 126416 163951 114416 47584 50880
94E0880P3409O6836q423m9320k9700j7028m2003l8742J6386O2436K4648p6338
$$ 50880 124289 191125 182702 133382 103682 86654 44651 5909 22295 84731 109379 33041
106C3041j22641m6862N6008O9825l46o0707n0396r07O074j8788r538L2249N0823
$$ 33041 -89600 -136462 -80454 -10629 -10975 -71682 -122078 -122985 -116911 -135699 -145237 -112988 -62165
119f2165J9027l0893l3085K0756N8685M0214J1369J2938K8205J5384k8604l7979
$$ -62165 -43138 -74031 -107116 -86360 -27675 12539 23908 36846 65051 80435 51831 13852
131A3852K2770Q0878N7689k3729p5870m8676J9148M6643J6689j7488k4706k3692
$$ 13852 36622 117500 175189 151460 75590 26914 46062 92705 109394 91906 67200 43508
143D3508l3131l9412j6915K3034K7856j6784n6077m2138L399K6303P365j6023
$$ 43508 10377 -29035 -45950 -22916 4940 -11844 -67921 -110059 -106660 -80357 -72992 -89015
155h9015k561K5040J6405j8851k8607N989N0305N3048J0561k1900j3472J2352
$$ -89015 -91576 -66536 -50131 -68982 -97589 -91600 -41295 11753 22314 414 -13058 -706
167g06K4797K2877K1459K4315J1277k2592l7907p888L3496L9388P01m2670m1796
$$ -706 24091 46968 68427 92742 104019 81427 43520 35632 69128 108516 109217 66547 24751
180B4751p906J0239j175j5232j1346K63n897k7127l2117p512J6053J3705n258
$$ 24751 16845 27084 25909 10677 -669 -406 -6303 -33430 -65547 -73059 -57006 -43301 -48559
193d8559j6405p961J845p42k850J3764L1985K4798n014k5672r358K8595M4299
$$ -48559 -64964 -72925 -71080 -71822 -74672 -60908 -28923 -4125 -9139 -34811 -44169 -15574 28725
206B8725K2583n834j2781o00R741Q259N897J1832J0532n254k1707j9343m46J3241
$$ 28725 51308 45474 32693 32093 41834 50093 55990 67822 78354 73100 51393 32050 31604 44845
220D4845K785j6829k0369r287m196j1744j8392r639Q736R980r168k4623j6778
$$ 44845 47630 30801 10432 1145 -3051 -14795 -33187 -42826 -34090 -24110 -33278 -57901 -74679
233g4679M618J7914J2492P12j698R66M56O57J0094K2590K3358O993j1737q410
$$ -74679 -70061 -52147 -39655 -38943 -40641 -39675 -39219 -38562 -28468 -5878 17480 24473 12736 4326
247D326J0552K3031J5950J99o758j136L410k397p682k418N033K586r541j8846
$$ 4326 14878 37909 53859 54058 47300 46164 49574 47177 39495 37077 42110 44696 35155 16309
261A6309j3733k827m06n224p506n277m742j0024j4419o642Q858J4160K692j1149
$$ 16309 2576 -251 -657 -5881 -13387 -18664 -23406 -33430 -47849 -54491 -45633 -31473 -28781 -39930
275c9930j2503J475J4838J4660P257K507L614L512K619L954J1039J5856R633k879
$$ -39930 -52433 -50958 -36120 -21460 -14203 -11696 -8082 -4570 -1951 2003 13042 28898 38531 35652
289C5652p026l40P353P189n00l724j173r03p059j1496q470L15M871k660j3157
$$ 35652 28626 28286 35639 42828 42328 38604 37431 36528 29469 17973 9503 9818 14689 12029 -1128
304a128j4558q064j291M90q78j193j197m938q598l896P118J2609Q893j346o330
$$ -1128 -15686 -23750 -25041 -24551 -25429 -26622 -27819 -32757 -41355 -45251 -38133 -25524 -16631 -17977 -24307
319b4307LR199J0622P250N135M946N288N21j792K450Q246Q504K461m692o321k613
$$ -24307 -24304 -15105 -4483 2767 7902 12848 18136 18657 16865 19315 27561 36065 38526 33834 27513 24900
335B4900o32j478j292J30j387p167j2269j1288j643N501K232n878j0262q548k858
$$ 24900 24268 22790 21498 21628 20241 13074 805 -10483 -12126 -6625 -4393 -10271 -20533 -29081 -31939
350c1939J427K620L038L565l78l941l315K570R589J0748N063M0k46K402M222N039
$$ -31939 -30512 -27892 -24854 -21289 -21667 -25608 -28923 -26353 -16764 -6016 -953 -913 -1159 1243 5465 10504
366A0504N008O451O038L32m928m836Q09N471M842j086n836p340n672m581j703
$$ 10504 15512 21963 28001 28333 23405 18569 19378 24849 29691 28605 22769 15429 9757 5176 3473
381C473O76P63l252r086j0709n077K005M075J329l490m643k112j140J057M316
$$ 3473 4149 4912 1660 -7426 -18135 -23212 -21207 -17132 -15803 -19293 -23936 -26048 -27188 -26131 -21815
396b1815O516N652J903j833j659L791Q136P458N492J942J36l36n51J191N180N789
$$ -21815 -15299 -9647 -7744 -9577 -11236 -7445 691 8149 13641 15583 15719 15383 14832 16023 21203 26992
412B6992J712m193p482n489N1K221J063k766n637o646o165m650j480K191J480
$$ 26992 28704 24511 17029 11540 11591 13812 14875 12109 6472 -174 -6339 -10989 -12469 -10278 -8798
427h798l138o048n681j928K777M031K748J880L99o59p79J824N634Q008O274J247
$$ -8798 -11936 -17984 -23665 -25593 -22816 -18785 -16037 -14157 -13758 -14417 -15196 -13372 -7738 270 6544 7791
443G791j889p59K237M872N740L144R93j747l986l417r9K824K510j166n876o912
$$ 7791 5902 5143 7380 12252 17992 21136 22129 20382 16396 12979 12880 15704 18214 17048 11172 4260
459D260m251k172K1k59j231k749m423n463k925J33L666K925l34k133k258K72K421
$$ 4260 9 -2163 -2142 -2401 -3632 -6381 -10804 -16267 -19192 -19059 -15393 -12468 -12802 -14935 -17193 -16921 -14500
476a4500M323N067L794J866o56j386J820N192O004L631J34k121j905L6J435K071
$$ -14500 -10177 -5110 -1316 550 -106 -1492 328 5520 11524 15155 15289 13168 11263 11299 12734 14805
492A4805J951n4l555n173m293j136J244Q50j985l499m683l656j901n17J131J676
$$ 14805 16756 16702 13147 7974 3681 2545 3789 4639 2654 -845 -5528 -9184 -11085 -11602 -10471 -8795
508h795o33k386l065j389K040L994L904R46L5k81K89J667L559M339L753P68j536
$$ -8795 -9428 -11814 -14879 -16268 -14228 -10234 -6330 -5384 -5349 -5630 -5341 -3674 -115 4224 7977 8745 7209
525G209j228Q89K681K960J508o91j843k400k171q48J075O15j042k926m221l251
$$ 7209 5981 6870 9551 12511 14019 13328 11485 9085 6914 6066 7141 7756 6714 3788 -433 -3684
541c684j245N56K65m45j656k852j738j598M80K522K096O49j015j314N4K343L001
$$ -3684 -4929 -4373 -4108 -4553 -6209 -9061 -10799 -12397 -11917 -9395 -7299 -6650 -7665 -8979 -8925 -6582 -3581
558c581L174K132L78l64J33J169K188L396J980n18j297r55l51P37R15k24j63k207
$$ -3581 -407 1725 2103 1739 1872 3041 5229 8625 10605 10087 8790 7835 7484 8221 9136 8912 8749 6542
576F542k736k717j013L50L18j392k077k986k125r77P06O28L02r8j004j336QJ537
$$ 6542 3806 1089 76 426 744 -648 -2725 -5711 -7836 -8813 -8107 -7479 -7177 -7275 -8279 -9615 -9607 -8070
594h070K515K484J172k45j42Q04J793K608K302J286L60l1j030Q82J123J191r7
$$ -8070 -5555 -3071 -1899 -2144 -2286 -1482 311 2919 5221 6507 6867 6836 5806 6688 7811 9002 8905
611H905j59k123j684q48q64L4l16j077j955k311k382q25O54K29m83j187j504p88
$$ 8905 8746 6623 4939 4091 3227 3261 2945 1868 -87 -2398 -4780 -5605 -4951 -4722 -5205 -6392 -7896 -8684
629h684M66J184J097J634O9Ml2P73J813K627J544P69M53j49M26J083J265Q96P83
$$ -8684 -8218 -7034 -5937 -4303 -4234 -4230 -4262 -3489 -1676 951 2495 3264 3717 3568 3994 5077 6342 7238 8021
648H021o93j532n78o22O6M57n78j650j655j925j206n81J67j05q22j230j925j72
$$ 8021 7328 5796 5218 4596 4662 5119 4541 2891 1236 -689 -1895 -2476 -2309 -2414 -3236 -4466 -6391 -6563
666f563J03P34Q11L48k46q8K93M09J749J732J133P71j84n0J040J080J322O26N37
$$ -6563 -6460 -5726 -4915 -4567 -4813 -4901 -4608 -4199 -2450 -718 415 1186 1002 952 1992 3072 4394 5020 5557
685E557m34o06k80k64M32M86k93j279j369j301m37K4K20j011p70j379j371J00
$$ 5557 5123 4517 4237 3973 4405 4891 4598 3319 1950 649 212 236 456 -555 -1325 -2704 -4075 -3975
703c975k01N10L39l19p75l22R8R08J271P54N34J11j08M11Q96R71J252Q35K99p94
$$ -3975 -4176 -3666 -3327 -3646 -4421 -4743 -4645 -3737 -2466 -1712 -1178 -1067 -1175 -764 132 1103 2355 3190 3489 2695
723B695K9L3O99Q02P6j06r05r18n00j45K51k31m98j127j235o52l49J26P8k85p37
$$ 2695 2724 2757 3456 4258 4334 4228 3323 2405 1905 1760 2011 1780 1282 155 -1080 -1732 -2081 -1955 -1877 -2162 -2899
744b899q11m13k88R73O97O27k69j80m3M19O55J309J102N67l67k32L95M49P67J452
$$ -2899 -3710 -4123 -4411 -3438 -2741 -2114 -2383 -2563 -2606 -2187 -1532 -223 879 1446 1079 847 1242 1691 2458 3910
764C910J49n52n56n24J21K37L74k31m73j231q36n70k29J36q8p24j016o88p17M9
$$ 3910 4059 3507 2951 2427 2548 2785 3159 2928 2455 1224 388 -182 -411 -275 -363 -1087 -2103 -2791 -3508 -3459
784c459M21L65J36j47p27k69N06J021J216P87L1k05PP81M14J073R59J85m1k57
$$ -3459 -3038 -2673 -2537 -2684 -3411 -3680 -3174 -2153 -937 -150 -119 -324 -317 464 878 1951 2910 3095 3054 2797
804B797k31K34Q34q3J16r62q59q07l41l1L8k69o36j056r11j52l41Q9N99o44j49
$$ 2797 2566 2800 3634 3551 3667 2705 1846 1039 698 667 705 436 -200 -1256 -2167 -2319 -2660 -2571 -1972 -2616 -2765
825b765p51J11K24Q74P77K16j6k0J62O08R71R25P63Q8ml90L68K80N61M06j21m76
$$ -2765 -3516 -3405 -3181 -2307 -1530 -1314 -1330 -1350 -1188 -580 391 1316 2079 2167 2163 1773 2141 2421 2982 3388 3267 2791
847B791q45n61k76O30k06j37o94j275p05m96%J65K46o12m87n26n93K79Q95Q07
$$ 2791 1946 1385 1109 1739 1533 1396 702 -573 -1278 -1774 -1774 -1609 -1363 -1975 -2462 -2988 -3581 -3302 -2407 -1600
867a600M0j87K66k54O99N67J003M45J07Ql81J46P40P27P16l75k68o17o23N72K9
$$ -1600 -1560 -1747 -1481 -1735 -1036 -469 534 979 1086 1094 713 859 1599 2326 3042 2667 2399 1782 1159 1731 1760
888A760J30r0p42p95n77k99k48L50k20j16o39p74j57L14K78K72L54n71J30n65
$$ 1760 1890 1800 1058 263 -314 -613 -861 -511 -731 -847 -1486 -2260 -2417 -2103 -1825 -1553 -1199 -1770 -1640 -2205
908b205N82M45P86L87L17k66M0K97K72Q47J36M25j36r41K08J52K63N56K0n87o18
$$ -2205 -1623 -1178 -392 -5 312 46 86 383 655 1502 1638 2063 1927 986 1194 1346 1609 2165 2185 1598 980
929I80o80k59L72K39j52o92m27o87k36J10L39q5j12p34j62K48P4N32N24N19n71
$$ 980 300 41 413 652 500 -192 -619 -1306 -1542 -1432 -1093 -1178 -1290 -2024 -2186 -1938 -1864 -1332 -808 -289 -860
950h60n8k54N73P30O07K74J94k84pL1K21P51j44J65m34n91R0r8L91j0Op28o87
$$ -860 -918 -1172 -599 131 738 1012 1206 922 915 946 1167 1918 1774 1939 1505 914 1004 906 1297 1287 1293 565 -122
973a22o37k52L93J17r3m22m73l58k72M76J58K71L3l93J73j9L00O60N46J9K42K6
$$ -122 -759 -1011 -618 -501 -594 -1016 -1489 -1847 -2119 -1643 -1485 -1214 -1181 -1574 -1401 -1420 -1120 -460 86 105 347 373
995C73l00K95P48L60K11J18l41J40m10j38M62J2K3p13k55n29l78J45M97k34o38
$$ 373 73 368 1116 1476 1687 1805 1464 1604 1194 1056 1518 1530 1553 840 585 56 -322 -177 320 86 -552
1016e52n39n02l0K30J57K16l81k1m30J88K45M88L40L97k64Q7L15J55N26O61P9
$$ -552 -1091 -1593 -1623 -1393 -1236 -1020 -1401 -1422 -1852 -1664 -1419 -931 -591 -194 -458 -371 -56 99 625 1286 1365
1037A365K18o24L04r8n8N84j31j19k30l60n46J6J99k28k96K6p27l76j83N82k74
$$ 1365 1583 959 1263 1165 1107 1691 1560 1441 1211 851 305 321 520 292 -4 22 -705 -1081 -1264 -682 -956
1058i56Q7k42j8l35J9O7L94L40K60j95L2N1J33O15K01lK79j01j92K28L38J59J02
$$ -956 -869 -1111 -1129 -1464 -1445 -1378 -984 -644 -384 -579 -547 -496 -363 252 453 450 729 628 436 664 1002 1161 1263
1081A263k83j21J2j57j09K63O6j85l94l96j41j07LK56l15k8l36k96J11N1o8L96
$$ 1263 980 859 871 714 605 868 934 749 355 -41 -182 -289 -286 -30 -345 -373 -709 -1005 -894 -843 -911 -515
1103e15l74O6m9n6K56K21J74K11J43k04K13k3N38J06n2L7j94j27N85j36R8j88
$$ -515 -889 -823 -872 -928 -672 -451 -277 -66 77 -127 86 63 601 707 655 692 498 371 956 820 918 730
1125G30J92r6k73j98j74K40m9m0k25k24m27M6m5j7J30r9l73p1p8P7J39K42K92
$$ 730 922 826 553 355 181 421 372 332 107 -117 -544 -498 -543 -560 -430 -529 -902 -973 -1051 -974 -835 -593 -301
1148c01J4m55J61J04L49L25J14r1K67k22L15L47Qm0P0j51N9k40N5o2P8j50k05
$$ -301 -287 -742 -581 -477 -128 197 311 220 487 265 580 927 935 895 965 814 873 633 688 626 704 554 349
1171C49m4o67M73j24k31L03o23O3n39j17K09k0M22k50K32l60K10J64rL33K16Q0
$$ 349 305 -362 111 -13 -244 59 -564 -501 -1040 -1157 -948 -968 -546 -796 -564 -924 -714 -550 -559 -226 -10 70
1193G0q4j19K49K86M9K81K39m38J63n8J01J17k15K06l07o3j49k38J88K2k06l12
$$ 70 -14 -133 116 402 451 732 971 533 696 638 739 856 641 847 540 477 328 90 278 300 94 -218
1215b18l58L81l31j14J28m59K58J52j27J29l52L46K51J35j07p1m2Q7M45K5J34
$$ -218 -576 -195 -526 -640 -512 -971 -713 -561 -688 -559 -911 -565 -314 -179 -286 -357 -399 -312 133 158 292
1236B92M85m66N3K10o7K41k7J72j28k25R1q1jl27J90r0l43k53o4O0n5j04Q2l25
$$ 292 777 311 364 574 507 748 721 893 765 540 631 550 549 222 412 322 -21 -274 -338 -278 -333 -437 -355 -680
1260f80J80k87K78L90k28p0J36L7j53Q8J84K10k18L13j43r0M62q1K01J92n09K68
$$ -680 -500 -787 -509 -119 -347 -417 -281 -244 -397 -309 -125 85 -133 180 37 -53 409 328 529 721 212 480
1282D80J7l14K89k62K41j55k1n1l22J44O6m8m2j2r5l85k0J44K4J58Qk30j68%j72
$$ 480 497 183 472 210 451 296 275 224 -98 46 112 64 22 10 -85 -470 -490 -346 -322 -164 -156 -386 -554 -554 -726
1307g26M78q7M0J30j27K12j14pK58M3P7M1J75O0pJ39j62K16j48l42K61o8O4k46
$$ -726 -248 -335 -295 -165 -292 -80 -194 -201 57 100 177 218 393 453 446 585 423 639 491 149 410 342 406 160
1331A60L8K09k35l01o4l22M42j57K4l17l0j87M74j49J5L02k67M1K66j28K1N0p0
$$ 160 198 407 172 -129 -193 -515 -73 -230 -206 -523 -553 -740 -266 -415 -400 -98 -365 -324 -58 -186 -165 -115 -185
1354a85L63k1j0j20K26JJ2MP6k71O66l78J77k52J1K01j20j26k58M8r8M1m1l03
$$ -185 178 157 147 27 253 254 266 270 346 75 741 363 540 288 299 500 380 254 -4 44 -54 -13 -54 -357
1378c57p4o6j1O0P5Qj0R4j20OJ24M34o16J20L23J00k3J3l2J77k15O48j05o6k94
$$ -357 -431 -497 -508 -448 -373 -365 -375 -281 -401 -395 -271 163 -453 -333 -10 90 67 80 48 225 10 658 553 487 193
1403A93O9l2K27P2l12R7p2k62j7n1L4J78l34J1L6j29R1m43L48K2j12J62j53L39
$$ 193 262 230 457 529 217 314 242 -20 -37 -88 -54 124 -210 -199 -163 -292 -201 -644 -296 -274 -386 -224 -377 -38
1427c8k05O6L2K70l26J82L6K05l7L0o9j14K83K4r0J39j13o0n3Q8r8J38j48J74
$$ -38 -243 -177 -145 125 -201 -19 17 222 185 215 146 32 315 339 249 388 275 215 162 250 152 290 142 316
1451C16j52l08J14K08k09k69R2O6J02l63J88o6K10j51o4l7p0J97J1l3O2J58L5
$$ 316 164 -144 -30 178 -31 -300 -208 -142 -40 -403 -215 -281 -71 -222 -286 -323 -393 -196 -185 -218 -156 2 37
1474C7k6L8J74j11k9K14l3k2r4J24M6J44j36j01P9j35j42J42m0j30K46k76j06
$$ 37 11 49 223 112 83 297 264 242 148 272 318 462 326 225 304 169 27 169 129 -1 245 -31 -137
1497a37ok3J42l43K12j29R9P4k31K81p1p9n8J01j93K37N7o3M4K3M9m0K17J75q4
$$ -137 -143 -166 -24 -367 -155 -284 -185 -111 -342 -61 -132 -211 -269 -168 -361 -124 -67 -130 -86 -63 -14 -54 163 338 254
1522B54J36j55K41l87J92P8Ql1j5j50K3j67J78j28n2J56k30K4j74J65j72MO6o2
$$ 254 390 235 476 89 281 359 367 336 321 171 194 27 205 77 25 181 -49 -25 -199 -34 -206 -202 -136 -198
1546a98q6l7K47m83k21M87K12k52K86o2J52m5j2Q5K04j16K67m5j6l96K71J39k97
$$ -198 -284 -321 -74 -557 -778 -291 -79 -331 -45 -107 45 0 -12 73 277 161 428 383 367 -29 242 381 84
1569H4K29R1o9m37J96N5q9N1l03L15l21J53k55K33k4k06p0l4R4k33J47K07J5K59
$$ 84 313 404 335 -102 94 149 60 111 -192 123 -198 -45 -300 -67 -91 -297 -367 -401 -307 -540 -393 -186 -171 88
1593H8p8k29L54k44L46j54m9k67P43k02l07K32L5j6k17pp2L09l48L33j37r6j36
$$ 88 10 -219 135 -109 237 83 34 -233 510 308 1 233 268 252 35 28 -44 265 -83 250 113 17 -119
1616a19J68k21m7r8J29K01m10K86K0n15M76O6K3M4j87J95k09K31p6m3M0J88l61
$$ -119 49 -172 -219 -317 -188 13 -397 -111 -91 -606 -130 -64 -41 3 -184 11 -198 33 -43 -86 -46 142 -219
1639b19J74Q8J4M0j27q3L54k09k09M84n4l05K26r1j13j92K28k83J11M02r5k04
$$ -219 -45 43 57 97 -30 -113 241 32 -177 307 253 -52 174 83 -30 -222 6 -277 -166 236 141 -63
1661f3J57l67J70Qk1J18l68k32L25N47m37l26N67j40KJ72k39K03M3k15J90k9N8
$$ -63 94 -273 -103 -95 -116 2 -366 -598 -273 274 -163 -489 78 -62 -60 112 -127 76 119 -96 94 65 123
1684A23q3K52k80L34l02J39K6P6l8k31J12o3O5j02j67N6J57mj15J44j26k85l0
$$ 123 40 292 12 346 44 183 209 285 247 16 128 65 130 28 -139 -83 74 70 -45 99 -27 -312 -342
1707c42j01J90j81K34j89L8K88j40J12l2j61K09K21j31J44j06J60o2R8J46k29
$$ -342 -443 -253 -434 -200 -389 -351 -63 -203 -91 -123 -284 -75 146 15 159 53 213 151 249 395 166
1728A66j17J94o6o0J0M3r1k09L51j34j78M7J0p0J86j26k85K60j33M4j68K52l1
$$ 166 49 243 177 117 127 170 79 -130 221 87 -91 -44 -34 -104 82 -44 -329 -69 -202 -158 -326 -74 -105
1751a05l23L20pp0L1J89M4K57k46pK14L6J6l78K07k38K22M1L9oj34M5k46J65J39
$$ -105 -428 -108 -115 -185 -154 35 79 336 90 83 297 333 349 -29 178 -60 162 203 242 236 102 147 -99 66 205
1776B05N4j28k36P0j45J54m81L21L41j86j10k64J74K00k25Nj19L46K50k76Q3o3
$$ 205 259 131 -105 -35 -180 -26 -507 -186 155 -31 -141 -405 -231 -31 -256 -251 -370 -24 226 -50 33 -30
1798c0j09K97Q1k93K51J48k02K09k71K3j4m20M07Nj89L69m7j10j93r9K77k45O2
$$ -30 -139 158 239 -54 197 345 143 352 81 104 90 -330 77 82 -107 262 215 105 -88 -187 90 -155 -93
1821i3K37k29o7r4K17l6Q1o6j80N3M0R7j72K17J35k20J50j60r2K12l7J00R0j15
$$ -93 144 -85 -152 -246 -29 -65 16 -50 -230 -177 -137 -40 -212 5 140 -80 70 -90 -182 30 -7 93 183 68
1845F8K18J17k86J35j05J1j2N1o0k72j14K40L6N8n8L5l89L42j16k07L90j48l98
$$ 68 286 403 117 252 147 158 146 197 137 -135 -249 -9 27 85 27 62 -327 15 -101 -308 82 -66 -464
1868d64M43l57J78J54r9m1j20M5J9N2K73J24k2rM9n1J2p9O7J21p8n4j12J74o3
$$ -464 -21 -378 -200 -46 -145 -186 -306 -261 -242 -190 83 207 185 176 225 174 186 107 174 295 217 163 51 225 162
1893A62l17J44Q9k04L31N9k66j91k6j15J19j08k35L91j71R6J76k9N2K62m33L4
$$ 162 -155 -11 78 -126 205 264 -2 -193 -219 -334 -215 -323 -558 -167 -338 -242 -66 -95 -43 219 -214 -180
1915a80M03k51K06k50M07l01M2R2O7J29k17R3J02n16L56R7L6j02k03j20J14j57
$$ -180 223 -28 178 -72 335 34 76 168 235 364 147 240 342 -174 182 279 315 213 10 -110 4 -153
1937a53Q5J07j29J80j07O2p65O34k37K26J52n3j24L9j90J02K92j18qJ44j5k8j90
$$ -153 -68 39 -90 90 -17 45 -720 -86 -323 -97 55 2 -122 -83 -273 -171 121 3 -5 139 124 96 -94
1960i4M26j30j64k20L83m4j40J75j4L8k0Kq1j68L7J46q4j58j3k01L87R0l10K54
$$ -94 332 202 38 -182 201 157 17 192 178 216 196 198 117 -51 -14 132 48 -110 -123 -324 63 153 -157 97
1984I7k29N8k84K55j59J40K34n3j08J50o7j80K12J46J06o6j46Q1k05n4J24L0k55
$$ 97 -132 -74 -358 -103 -262 -122 112 59 -49 101 34 -146 66 212 318 252 106 187 -18 -72 52 82 -173
2007a73J48L92j40l00J68K14k22j49p2Q7nj40q5M07Qj41j34K82l28Kr5L4N8J42
$$ -173 -25 367 227 -73 95 309 87 -62 -134 -47 -52 -192 -277 130 138 -3 -137 145 -183 -181 -276 -242 -184 -42
2031d2j26L0K21j20L2O8K00l10J64K4k31n6L90k79R5K01n9j2m8n2j41J61j9l2
$$ -42 -168 -138 83 -37 -5 63 263 -47 117 141 -90 -146 244 -35 60 261 202 190 142 90 -51 110 91 59
2055E9N6R0j07j68k16L72k42M6j49M1RL5K8j23J85j74J67M6q0K01j5q7J94p8J45
$$ 59 115 205 98 -70 -286 86 -156 -110 -259 -218 -209 -174 -146 -269 -84 -258 -91 -45 -125 76 61 -26 168 90 235
2080B35k15J02J04j86L59k98K70q7P7j63j01L0N5O2j32j42j91K17r5m6j6Q8k57
$$ 235 20 122 226 40 399 101 371 284 361 198 97 127 182 244 112 -30 -221 -4 -99 -145 -161 -73 -330
2103c30J77K31l63M0j8j53L44J06Q4l76J32K49n9K47j68j84nJ74k7j51K36k9K7
$$ -330 -153 78 -285 -245 -263 -416 -72 34 118 -258 -126 123 64 311 143 -41 -46 128 101 -50 186 157 184
2126A84j26r7R4J13k11K27k63N2j13J53l20J05K37k2l28J01r3J86M1q0J76j24
$$ 184 58 -39 55 168 -43 184 -79 -27 -140 13 -307 -202 35 13 -315 -214 -307 -121 -80 -160 16 -108
2148a08n6j73K13K36q9M2L85l70J51J9K7m02L02J59k71l2J22k62Q0J47k40O9j8
$$ -108 -164 -337 -124 112 23 65 450 80 231 250 277 -125 177 336 65 33 155 -107 -27 120 -120 -51 -69
2171f9J40k32j36L11r6L4L7j39N3k51K91R5o8o3L12j62j50K83n8p8l34M50j23
$$ -69 71 -161 -297 14 -82 -48 -11 -150 -97 -348 -57 38 -30 -93 219 57 -93 190 132 54 -280 170 47
2194D7k24J04J0K50k68J3K50k76n6J74k26K38J42J25l32J85m07M30k05J84k6m33
$$ 47 -177 -73 -63 187 -81 -68 182 -94 -150 24 -202 36 178 303 -29 156 -251 179 -26 158 132 -301
2216c01K67L8J8p0l5k3j79K51o7q0K28k48J26%Q9j46J58P0J31n7j64J9q8N7K56
$$ -301 -34 4 22 -48 -83 -106 -285 -34 -101 -181 47 -201 -75 -75 14 -132 26 96 227 170 6 25 -63 -6 250
2241B50j68N5P0M9j80j29J45j6j46J35j50R3K07l70j3K30Jk49j58qR5L61l68J80
$$ 250 82 137 207 256 76 -53 92 76 -70 65 -85 8 215 -155 -168 62 63 -186 -344 -352 -257 104 -264 -84
2265h4J04k42K87k91J27K53j82P5M5Oj33J81J6K18r4o6p2o6J07j09J61k68NJ86
$$ -84 20 -222 65 -226 -99 154 -28 47 92 98 -35 146 162 380 286 220 148 82 189 80 241 -27 -22 164
2289A64L1m66P5l6J86Q8l32j91N07k46RR1k02K27q5O3o5L17j67K3J36nOk52r2
$$ 164 195 -271 -196 -232 -46 42 -290 -481 26 -220 -211 -120 -322 -95 -180 -117 -182 135 -32 -9 127 122 128 -124 -216
2314b16N30q7j52J49j58j07Q4K12l17NK25l56J28k8o4o5q4K60R0l39J3N3L49k25
$$ -216 314 227 75 224 66 -41 43 255 -62 -57 168 -188 -60 -88 -152 -217 -301 -41 49 -290 -277 -224 125 -100
2338a00M6K24l01k3J86l2Q1J46l13K05J06j11k31L16K49l20j08K01q2p3N1n0J7
$$ -100 -54 170 -131 -154 32 0 81 227 -86 119 225 114 -117 199 448 128 20 221 139 66 117 67 84
2361H4M07l12j16r1J70k42K3N5j88K02O1j66P0K40l02J80j69j06M28m51J22M6
$$ 84 491 179 63 -28 142 -100 -77 -22 -210 -8 53 -113 -43 197 -105 75 -94 -200 228 -223 -101 -55
2383e5O6k41L46l1k41L98p3J48r0J41l05Q8k10J49L8O7j02j64J50k63L36rk1k69
$$ -55 11 -230 116 85 -156 242 169 317 227 368 63 151 -59 90 128 195 93 -71 79 -184 152 143 122 -147
2407a47M57m65M01j64k6o1K17j55l4L2j58k16L88j19k6j92K06J16l57K50l0pJ60
$$ -147 310 -155 246 82 56 -5 212 57 23 55 -103 -319 69 -50 -76 -268 -62 54 -303 -53 -83 -90 70
2430G0n2j08K81M2l15J15L25l43m3K63k80K25k36R7J21l54J57k30J90J82j12r9
$$ 70 18 -90 191 233 -82 33 358 15 -28 235 -45 180 -56 41 162 -192 -35 -265 -75 107 -5 -104
2452a04m1O8j39Q2j26J79lj57j09K11K78k13J35j82j6P4K16j2J2j81K51k66J13
$$ -104 -145 -77 -216 -134 -260 -81 -84 -241 -350 -139 139 -74 61 -121 -137 -63 153 141 153 -28 223 -43 70
2475G0J50k06J62r5P1Q5l15J02j8K62j74j48K85m07jJ74r2p4j3R3l2R0j77K17
$$ 70 220 14 176 81 152 237 -78 24 6 268 94 -54 231 -176 -177 -3 -95 -169 -182 -89 -121 -31 -208 9
2499Ij85K12J01p3k16J73K56k61J5%J72N6m33L66l9j92L23OR0j54k94J31J95j02
$$ 9 -176 36 137 64 -152 21 277 16 31 31 203 259 -174 192 153 -39 284 290 380 226 -68 63 258 156
2523A56Pq6J12m48j4M19n14K51p7J87r0N1l6K6Q9l01L41p8j12J02r6K78j45J98
$$ 156 163 77 189 -259 -273 146 -368 -117 -194 -7 -97 -46 -82 -56 33 -268 73 -5 -117 -15 -111 167 22 220
2547B20j48J42k36k17M04j47K17k48L48k99n3MJ96k73Q4k4K63m59K52R0k53K64
$$ 220 72 214 -22 -239 165 18 235 -13 335 36 -17 -13 183 -90 -6 -30 233 -226 26 116 -137 127
2569A27j09J56m14J17J70L22l32J05r7K9k25J21K78k09J10l58m4R6M74m11J21
$$ 127 18 174 -240 -123 47 369 37 142 45 74 -151 -30 248 39 149 -209 -253 -157 317 -94 27
2590B7n9J18Q0j88J60k48j32L49k44K98j12k29K94k7J52r0j25j42J34j84K00j45
$$ 27 -32 86 166 -22 138 -110 -242 107 -137 161 49 -180 114 87 239 149 24 -118 16 -168 32 -113
2612a13K4j2p1K13l86L85j35J85l19K55k35J81N0J39l3j16QJ44J64j72l80N9O93
$$ -113 -89 -101 -172 41 -345 40 -95 90 -229 26 -209 -28 22 161 128 12 20 164 328 156 -224 -165 528
2635E28l72r6k09K06j0J03k7J8j98L27k26m54L77O6k74J52l1Q2j99j32M50j91
$$ 528 156 60 -149 57 47 150 123 141 -57 270 44 -410 -33 33 -241 -89 -120 -38 -237 -369 81 -110
2657a10K56k71J34j23J39p5J51j8j01L91j53r4r6J12J4j03n0K91j06j73J88R6
$$ -110 146 -125 9 -114 25 -50 101 83 -18 373 220 126 30 142 156 53 3 294 188 15 203 299
2679B99l01P3j44K51j90J03k18l0J35k72%j85J09J39O3P9j14M88n41L13J84l43
$$ 299 -2 71 -73 178 -12 91 -127 -157 -22 -294 -294 -479 -370 -231 -168 -89 -203 285 -256 57 241 -102
2701a02M73n37L07m7j03K30l48Q0J56K5Q4j79K98q4m7p4J64k20k20j40K31K38
$$ -102 371 -166 141 94 -9 221 -127 -47 109 134 218 39 337 253 206 132 296 76 -144 -284 -53 185
2723A85l03J4p2q4J55K91l10J85k63J33k39L17J38j85O3P3J94m16LK61l78m3L58
$$ 185 -118 -104 -176 -260 -105 186 -124 61 -202 -69 -308 9 147 -38 25 98 292 -124 -121 140 -238 -281 77
2746G7k06M92k76j30j72L93Q2l5j6l7j19q6J66O1j78K72j46o8l2o7M1P5j47l35
$$ 77 -129 363 87 -43 -215 178 260 225 209 172 53 -33 133 194 16 288 142 74 42 -25 16 91 -56 -391
2770c91K11%L01j17j70K35n8P1j53L5K25l28J87K0p1k16J82K0M8j72L37n4q1j36
$$ -391 -180 -180 121 4 -166 69 11 82 -71 -36 189 -139 48 68 -3 -219 -37 -17 31 -141 196 142 61 -75
2794g5J44J34l39M21m05K34l06P6J66%n1L4j16L6J4k00J51k48j26N10k11M7J90
$$ -75 69 203 -136 285 -120 114 -192 -116 50 50 -1 33 -83 -47 -33 -233 -82 -330 -456 54 -157 -110 80
2817H0k87J46lK20l3k22J34j09J80LJ17j38J30k47m1K92l34J55P7k28J20oj38
$$ 80 -207 -61 -64 156 123 -99 35 -74 106 109 226 88 218 -29 -70 222 -112 43 120 -108 12 6 -132
2840a32j8K26k32K11Q5Pj82k54J85j33L5N2J37k6j03P0Q9p9j7J63J16k90O6J01
$$ -132 -150 76 -156 55 140 147 -35 -289 -104 -237 -202 -150 -13 -39 -142 -72 17 -62 -79 84 200 -90 -24 77
2864G7k94Q2M02j90K00o3r1n1K49n9j69q2q6K75k82J03J87m78K94K21j76K3j51
$$ 77 -217 -135 267 77 277 214 123 72 321 262 93 11 -75 200 -82 21 208 -270 24 245 69 92 -59
2887e9O5j10O5k28K30L0l6J40P5j44k91K10j09K97K0P4n9p6j04P6P0j30oj72M27
$$ -59 6 -104 -39 -267 -37 -7 -43 97 172 28 -263 -53 -162 135 155 229 170 94 -10 66 136 6 0 -172 255
2912B55k40j7K52j59j41K56n09N26k41J66j93R9J2k44L25j47j24N69n26LO0K11
$$ 255 15 -2 250 91 -50 206 -303 223 -18 148 -45 54 66 -178 147 0 -124 445 -81 -78 -18 193
2934A93k51O3M4K7m8k6K24k66K25k47j4N0K41l01K91k57J87j6k37K3n9O5J37j84
$$ 193 -58 5 49 76 28 2 226 -40 185 -62 -76 -26 215 -86 205 -52 135 119 -118 -95 -154 -89 48 -136
2958a36J58r3r4ML39K3k12J74KK3k26K87k58Lj82K25j52P2M4j22J42q5L6J03R6
$$ -136 22 -71 -165 -161 178 201 -11 163 165 188 -38 249 -9 -6 -188 37 -115 -43 1 -121 21 -64 -28 75 171
2983A71k45P6Rk4M18l56K42n51K92n3K24j61r9N0R5Q7m5k39J89k24K0o0J11p2
$$ 171 -74 2 11 -13 405 49 291 -260 32 -21 203 42 -57 -7 88 175 130 -109 80 -144 -124 -184 -73 -145
3007a45J4K51K38m17m4P3LL7k06K4K6NM6K63n4q2k57M04j52l10J84r6J66K30k28
$$ -145 -131 120 358 -59 -103 -30 -27 10 -196 -172 -146 -141 -95 168 114 32 -225 179 27 -283 -99 -195 -29 201 -27
3032b7K40K0J21k17l14J97j68J28r2K36l87N20j44k49j76J7M10j54K73l14K74
$$ -27 213 233 354 137 -177 20 -148 -20 -112 124 -263 257 113 -136 -312 -295 115 -39 234 -80 194
3053A94k94Q5n3J75j43j10N7k00L89J23l66J51J1N3j7p2N3R4k0o7j66K02N8L5
$$ 194 -100 -15 -68 107 -36 -146 -89 -289 100 223 -143 8 19 72 55 -17 36 130 110 43 -123 79 137 172
3077A72j97J68m8j99o4k45L67j11J46j27J83R2j36J44j54J57k86j03L36j88J60
$$ 172 -25 143 95 -104 -168 -413 -46 -157 -11 -138 45 137 1 145 -9 148 -138 -241 95 -93 67
3098F7k65O4L31q3o7o4J74k12N4L05j16n31K50K27k42J60qo6J92J34j63k46K93
$$ 67 -198 -134 197 114 47 -17 157 -55 -1 304 188 -343 -93 134 -108 52 44 -22 170 304 141 -105 188
3121A88l66N8j4q0K62j02J26j46J19k37J54l9j18N1J24J15j00j6ok64M40l5k14
$$ 188 -178 -120 -134 -214 48 -54 72 -74 45 -192 -38 -77 -195 -144 -20 95 -5 -21 -27 -291 149 114 -100
3144a00k83M12M2j97K34p6R2j2j06k08J13j33K44J90m44O8K14r0o2K63k07l2j53
$$ -100 -383 29 71 -126 108 32 124 112 6 -202 -89 -222 22 212 -232 -164 50 -40 -102 161 -46 -78 -231
3167b31K50k35J30J20l2m1J27k7k3j20n5q6L39p5Nn0J53J6k68K29j54j57M5L19
$$ -231 19 -216 -86 34 2 -39 88 61 38 -82 -137 -223 116 41 46 -4 149 165 -103 126 -28 -185 -140 179
3191A79k06J87n3J13J10n24L57l64Q8M23m73L29J2j18n9m8J48l22K73j55K8K2
$$ 179 -27 160 107 220 330 -194 163 -201 -113 310 -163 166 178 60 1 -47 101 -221 52 -103 -75 -53
3213e3J22l9k33K70J29l2j68k9k0pK47J6j55j78J93K49Kk52k1k43K90q3R4k03
$$ -53 69 30 -203 67 196 164 -4 -33 -53 -60 187 203 48 -130 63 312 314 62 41 -202 88 5 99 -104
3237a04K09j63M2r4J22j92L31M6l04J5K26j81r7K28K0K8m4L04m41j00J07P6k36
$$ -104 105 -58 -16 -110 12 -180 151 197 -107 -92 134 -47 -144 84 104 132 88 392 -49 -149 -42 34 -202
3260b02J54J93j01m2l41K43L30k13Q2j17j05J77o7l6K48j60r9j65P4M2J4J33m9
$$ -202 -48 145 44 2 -339 -96 234 21 103 -14 -119 58 -9 -45 203 43 -56 -221 -147 -105 -91 42 -7
3283gJ7K2j21j38N6J65J01k36K1JP9Q4p6j54L38j44k6nO1j03R3p1J22k60K32j63
$$ -7 10 32 -89 -227 -171 -6 95 -141 -120 -119 -40 44 -32 -186 152 8 -18 -23 38 -65 28 -43 79 -181 51 -112
3309a12L56k34j87N83l12k51K21Rk08K3j3k03J21J73k1K04k47R8o5L31k32j17
$$ -112 244 10 -177 406 94 -157 64 73 -135 -112 -125 -328 -207 -34 -55 149 -98 0 -65 266 34 -83
3331h3J38j20J33J57j72O2r6Kk0qok5J79P4k39n5N8J39K37l52J49k17K16p6M9
$$ -83 55 -65 68 225 53 115 19 21 1 -7 -13 -38 141 215 -24 -79 -21 118 355 3 152 -65 151 75 124
3356A24J8j58q5J49j07J2p5O3j38K06jL8J30j78j44J42j41Q7j26L24j28j40K7
$$ 124 142 -16 -101 48 -59 -47 -122 -59 -197 9 8 46 176 -2 -146 -4 -145 -58 -184 140 12 -128 -101
3379a01q0q1K16p3q7K39k11K92j36k46K69M8J56m02L1L07m2k27J70k81J12r1P9
$$ -101 -181 -262 -46 -119 -206 33 -178 114 -22 -268 1 49 205 -197 -166 141 99 -128 42 -239 -127 -218 -139
3402a39J43j46K52j86n8L7J5J11KN0l49N09n17L30R6j81pn0J27k10Q7K9L77k31
$$ -139 4 -142 110 -76 -134 -97 -82 29 31 81 -268 241 -276 54 150 -31 -38 -88 39 -171 -84 -55 322 91
3426I1rj54L9j5L08l95L84l47J07k43J70J27j63NM8K1M0p7k53N74l09K03k43M9
$$ 91 82 -72 -33 -48 260 -135 249 -98 9 -234 -64 63 -100 -95 -47 -26 14 -63 -316 258 -51 152 -91 -42
3450d2J61p6J26k86m0QL96j65k09K35j95J51M9k50L5L6J72j57k51L25j15K32j05
$$ -42 119 43 169 -117 -157 -149 247 82 -127 108 -87 64 113 -137 -102 -66 106 -51 -302 23 -92 140 35
3473C5l88L44j70J86J79q0M2p6o6O7p8J67l11j24K79j3R2m3pj12R7O1j67M39m06
$$ 35 -353 -9 -179 7 186 106 148 72 6 73 -5 162 -149 -273 6 -7 85 42 35 -77 20 81 -86 353 -53
3498e3k14L98Q2j31j82J32L2J3j00K63j70O7j6Lk73k77N50k14n6J87J17l2k61
$$ -53 -267 131 213 82 -100 32 64 77 -23 240 70 137 121 124 -149 -426 124 -90 -146 41 158 126 -135
3521a35J55JJ10p9J21j1k47K09m2K90m41k35K97K19k75K59j7Nm2j7m02O29n14
$$ -135 20 21 131 52 173 162 -85 124 82 372 -69 -304 -7 212 -63 196 179 184 142 125 -277 352 -162
3544a62M32k87np1n3J43k3jL32j53O7k66j06j63J92R1q5L22j65l98N13l5j00j10
$$ -162 270 -17 -22 -93 -146 -3 -26 -27 305 152 219 -47 -153 -316 -124 -33 -118 204 39 -359 154 119 19 -91
3568i1J84l13J72%kK08j91j51L14K19k42P4l74L42r6j7K6k34L75o0j92J70j81
$$ -91 93 -220 -48 -48 -50 158 -33 -184 130 349 107 181 -193 149 53 36 62 -172 203 143 -49 121 -60
3591f0l7M7P5pO5k71J11j07J37j2R4r5O9J1l59R3K72j38r6L60j95k0k0P8JP4j47
$$ -60 -97 -50 25 18 83 -188 -77 -184 -47 -59 35 -60 9 20 -339 -246 26 -112 -208 152 -43 -63 -83 -5 -4 70 -77
3618g7J40J57qp3l04K30K14p1k37Q3j98J37k9J60r8P0P0j30K3QL1K37l69K30k17
$$ -77 63 220 212 139 -165 65 279 208 -29 54 -144 -7 -36 124 26 96 166 36 59 67 98 335 -34 196 -21
3643b1M6k16J11J70j75l3L67m25K96k50K8K35j80R2k37K56O3J02l97J81J49m17
$$ -21 25 -191 -80 90 -85 -118 249 -176 120 -130 -102 133 -47 45 -192 64 127 229 -168 13 162 -255
3665b55J85J91j02p8M8j07j18K83o8J92j59j61O8j2j95L40k66K40Q0m07M53k56
$$ -255 -70 121 19 -59 -11 -118 -236 47 -21 171 12 -149 -81 -93 -288 52 -214 26 106 -301 152 -104
3687a04J19j86L1J11J44k02M0j12J67k53l1M53k8lM3k55P5j18Q6K11l03J57j49
$$ -104 15 -171 -140 -29 115 -87 -47 -159 8 -245 -276 177 149 146 189 -66 9 -109 -23 188 -115 42 -107
3710a07J08k61K98m9R3j99J32k97L69J9q7J53L2k18j82L62n03L21R1r2j52J11
$$ -107 1 -260 38 -11 82 -117 15 -282 87 106 19 172 204 -14 -196 166 -337 -16 75 -17 -169 -58
3732e8J16P8j8p2j63j19L11N5j10R4m02J79J68j63K32N6k8l35K75l7qj71P4l6
$$ -58 58 136 118 46 -117 -236 75 130 20 114 -288 -109 59 -104 128 184 156 -179 96 59 51 -120 -46 -82
3756h2k1k4n4L10k3n3o7M5M4J2k12K77j01j21K6J18J07j16k06J9L47j8k26l6P9
$$ -82 -103 -127 -181 129 106 53 -14 31 75 87 -125 152 51 -70 -44 74 181 65 -141 -122 225 207 -19 -55 24
3781B4r6lM2J3J95o3o8j46J4R3L7n5K8j5o7Q8Q1r1j55K02O3L5k13l1j21M6N7J34
$$ 24 -72 -75 -33 -20 175 112 44 -102 -88 5 42 -13 15 0 -67 21 102 11 -144 58 121 156 -57 -88 -209 -163 -106 28
3809B8l8P9O8n44L89J99l65J83j38Q5K84k19N3j48o4L72o5q8j04J5J55j41j19
$$ 28 -10 69 137 -407 -18 181 -184 -1 -139 -54 230 11 64 -84 -148 224 159 71 -33 -18 137 -4 -123
$$ [...]
8191A36
##END NTUPLES=NMR FID
##END=
