##TITLE=1H_SR82 Leu
 CDCl3, 8 sc, 
 1.9.2021
##JCAMPDX= 6.0         $$ Bruker NMR JCAMP-DX V2.0
##DATA TYPE= NMR FID
##DATA CLASS= NTUPLES
##ORIGIN= UXNMR, Bruker Analytische Messtechnik GmbH
##OWNER= root
$$ XWIN-NMR		Version 3.5
$$ Wed Sep  1 14:08:55 2021 Russian Standard Time (UT+4h)  she@DPX200
##.OBSERVE FREQUENCY= 200.1312
##.OBSERVE NUCLEUS= ^1H
##.DELAY= (6, 6)
##.ACQUISITION MODE= SIMULTANEOUS
##.ACQUISITION SCHEME= undefined
##.AVERAGES= 8
##.DIGITISER RES= 18
##SPECTROMETER/DATA SYSTEM= spect
##.PULSE SEQUENCE= zg30
##.SOLVENT NAME= CD2Cl2
##.SHIFT REFERENCE= (INTERNAL, CD2Cl2, 0, 15.7039)
##AUDIT TRAIL= $$ (NUMBER, WHEN, WHO, WHERE, WHAT)
$$ ##TITLE= Audit trail, XWIN-NMR		Version 3.5
$$ ##JCAMPDX= 5.01
$$ ##ORIGIN= Bruker BioSpin GmbH
$$ ##OWNER= she
$$ F:/spectra/data/she/nmr/H-F/1/audita.txt
$$ ##AUDIT TRAIL=  $$ (NUMBER, WHEN, WHO, WHERE, WHAT)
(   1,<2021-09-01 14:07:04.76 +0400>,<she>,<DPX200>,
      <created by zg, POWCHK disabled, PULCHK disabled
       configuration hash MD5:
       00 E9 B6 7A A2 85 ED C7 34 08 36 98 17 FE 4E 26
       data hash MD5: 16K
       0D B9 F2 21 43 7E D6 C5 9E 5F 2D 3F C4 85 ED 43>)
$$ ##END=
$$ 
$$ hash MD5
$$ 67 D0 9C 72 65 30 17 10 11 5F 1E 75 1B 37 5B FA
##$RELAX= 
##$RELAX= 
##$RELAX= 
##$RELAX= 
##$RELAX= 
##$RELAX= 
$$ Bruker specific parameters
$$ --------------------------
##$DU= <F:/spectra>
##$EXPNO= 1
##$NAME= <H-F>
##$PROCNO= 1
##$TYPE= <nmr>
##$USER= <she>
##$AMP= (0..31)
100 100 100 100 100 100 100 100 100 100 100 100 100 100 100 100 100 100 
100 100 100 100 100 100 100 100 100 100 100 100 100 100 
##$AQSEQ= 0
##$AQ_mod= 1
##$AUNM= <au_zg>
##$AUTOPOS= <>
##$BF1= 200.13
##$BF2= 200.13
##$BF3= 200.13
##$BF4= 200.13
##$BF5= 200.13
##$BF6= 200.13
##$BF7= 200.13
##$BF8= 200.13
##$BYTORDA= 1
##$CFDGTYP= 0
##$CFRGTYP= 5
##$CHEMSTR= <none>
##$CNST= (0..31)
1 1 145 1 1 1 1 1 1 1 1 1 1 1 1 1 1 1 1 1 1 1 1 1 1 1 1 1 1 1 1 1 
##$CPDPRG= <>
##$CPDPRG1= <>
##$CPDPRG2= <>
##$CPDPRG3= <>
##$CPDPRG4= <mlev>
##$CPDPRG5= <mlev>
##$CPDPRG6= <mlev>
##$CPDPRG7= <mlev>
##$CPDPRG8= <mlev>
##$CPDPRGB= <>
##$CPDPRGT= <>
##$D= (0..31)
0 1.2 0 0 0 0 0 0 0 0.06 0 0.03 0 0 0 0 0.0002 0 0 0 0 0 0 0 0 0 0 0 0 
0 0 0 
##$DATE= 1630490824
##$DBL= (0..7)
120 120 120 120 120 120 120 120 
##$DBP= (0..7)
150 150 150 150 150 150 150 150 
##$DBP07= 0
##$DBPNAM0= <>
##$DBPNAM1= <>
##$DBPNAM2= <>
##$DBPNAM3= <>
##$DBPNAM4= <>
##$DBPNAM5= <>
##$DBPNAM6= <>
##$DBPNAM7= <>
##$DBPOAL= (0..7)
0.5 0.5 0.5 0.5 0.5 0.5 0.5 0.5 
##$DBPOFFS= (0..7)
0 0 0 0 0 0 0 0 
##$DE= 6
##$DECBNUC= <off>
##$DECIM= 32
##$DECNUC= <off>
##$DECSTAT= 4
##$DIGMOD= 1
##$DIGTYP= 9
##$DL= (0..7)
0 120 120 120 120 120 120 120 
##$DP= (0..7)
150 150 150 150 150 150 150 150 
##$DP07= 0
##$DPNAME0= <>
##$DPNAME1= <>
##$DPNAME2= <>
##$DPNAME3= <>
##$DPNAME4= <>
##$DPNAME5= <>
##$DPNAME6= <>
##$DPNAME7= <>
##$DPOAL= (0..7)
0.5 0.5 0.5 0.5 0.5 0.5 0.5 0.5 
##$DPOFFS= (0..7)
0 0 0 0 0 0 0 0 
##$DQDMODE= 0
##$DR= 18
##$DS= 0
##$DSLIST= <SSSSSSSSSSSSSSS>
$$ [...]
##$SUBNAM2= <"">
##$SUBNAM3= <"">
##$SUBNAM4= <"">
##$SUBNAM5= <"">
##$SUBNAM6= <"">
##$SUBNAM7= <"">
##$SUBNAM8= <"">
##$SUBNAM9= <"">
##$SW= 20.0189188712717
##$SWIBOX= (0..15)
0 0 2 0 0 0 0 0 0 0 0 0 0 0 0 0 
##$SW_h= 4006.41025641026
##$TD= 16384
##$TD0= 1
##$TE= 0
##$TE2= 300
##$TE3= 300
##$TEG= 300
##$TL= (0..7)
0 120 120 120 120 120 120 120 
##$TP= (0..7)
150 150 150 150 150 150 150 150 
##$TP07= 0
##$TPNAME0= <>
##$TPNAME1= <>
##$TPNAME2= <>
##$TPNAME3= <>
##$TPNAME4= <>
##$TPNAME5= <>
##$TPNAME6= <>
##$TPNAME7= <>
##$TPOAL= (0..7)
0.5 0.5 0.5 0.5 0.5 0.5 0.5 0.5 
##$TPOFFS= (0..7)
0 0 0 0 0 0 0 0 
##$TUNHIN= 0
##$TUNHOUT= 0
##$TUNXOUT= 0
##$USERA1= <user>
##$USERA2= <user>
##$USERA3= <user>
##$USERA4= <user>
##$USERA5= <user>
##$V9= 5
##$VALIST= <valist>
##$VCLIST= <CCCCCCCCCCCCCCC>
##$VD= 0
##$VDLIST= <DDDDDDDDDDDDDDD>
##$VPLIST= <PPPPPPPPPPPPPPP>
##$VTLIST= <TTTTTTTTTTTTTTT>
##$WBST= 1024
##$WBSW= 4
##$XGAIN= (0..3)
0 0 0 0 
##$XL= 0
##$YL= 0
##$YMAX_a= 211784
##$YMIN_a= -275350
##$ZGOPTNS= <>
##$ZL1= 120
##$ZL2= 120
##$ZL3= 120
##$ZL4= 120
##$ABSF1= 10
##$ABSF2= 0
##$ABSG= 5
##$ABSL= 3
##$ALPHA= 0
##$AQORDER= 0
##$ASSFAC= 0
##$ASSFACI= 0
##$ASSFACX= 0
##$ASSWID= 0
##$AUNMP= <proc_1d>
##$AZFE= 0.1
##$AZFW= 0.1
##$BCFW= 1
##$BC_mod= 2
##$BYTORDP= 1
##$COROFFS= 0
##$CY= 11.3945322036743
##$DATMOD= 1
##$DC= 2
##$DFILT= <>
##$DTYPP= 0
##$F1P= 2.36226072786647
##$F2P= -0.459571619588291
##$FCOR= 0.5
##$FTSIZE= 0
##$FT_mod= 4
##$GAMMA= 1
##$GB= 0.15
##$INTBC= 1
##$INTSCL= 1
##$ISEN= 128
##$LB= 0.24
##$LEV0= 0
##$LPBIN= 0
##$MAXI= 10000
##$MC2= 0
##$MEAN= 0
##$ME_mod= 0
##$MI= 1.114404
##$NCOEF= 0
##$NC_proc= 0
##$NLEV= 6
##$NOISF1= 3.799351
##$NOISF2= 2.8
##$NSP= 1
##$NTH_PI= 0
##$NZP= 0
##$OFFSET= 15.70392
##$PC= 1
##$PHC0= -13361.06
##$PHC1= 11.00097
##$PH_mod= 1
##$PKNL= yes
##$PPARMOD= 0
##$PSCAL= 0
##$PSIGN= 0
##$REVERSE= no
##$SF= 200.130013532006
##$SI= 16384
##$SIGF1= 3
##$SIGF2= 2
##$SINO= 400
##$SIOLD= 16384
##$SREGLST= <1H.CDCl3>
##$SSB= 0
##$STSI= 0
##$STSR= 0
##$SW_p= 3612.71676300578
##$SYMM= 0
##$S_DEV= 0
##$TDeff= 0
##$TDoff= 0
##$TI= <>
##$TILT= no
##$TM1= 0
##$TM2= 0
##$TOPLEV= 0
##$USERP1= <user>
##$USERP2= <user>
##$USERP3= <user>
##$USERP4= <user>
##$USERP5= <user>
##$WDW= 1
##$XDIM= 8192
##$YMAX_p= 0
##$YMIN_p= 0
$$ End of Bruker specific parameters
$$ ---------------------------------
##NTUPLES= NMR FID
##VAR_NAME=  TIME,          FID/REAL,        FID/IMAG
##SYMBOL=    X,             R,               I
##VAR_TYPE=  INDEPENDENT,   DEPENDENT,       DEPENDENT
##VAR_FORM=  AFFN,          ASDF,            ASDF
##VAR_DIM=   8192,          8192,            8192
##UNITS=     SECONDS,       ARBITRARY UNITS, ARBITRARY UNITS
##FACTOR=    0.0002496,     1,               1
##FIRST=     0,             0,               0
##LAST=      2.0444736,     0,               0
##MIN=       0,             -275350,         0
##MAX=       2.0444736,     211784,          0
$$ Real data points
##PAGE= N=1
##DATA TABLE= (X++(R..R)), XYDATA
$$ [...]
1936e04k04k98P91M2p40P52k23n64Q61k95K49N87m31j02O83n40J44R81q76M07
1956G20q8n75P07J78o05L67J52j093L92k41l11N73m34JN8n29k81Q08o87J48O44
1977i6n95l09O65o21P94K71p13P82J40l30L19N9r3N65Qp59N94j04m36Q29k73n96
1999A01N66l02m08M28k92j94N34o71j70K56q22J11P67n85M28j32m65K19L33n21
2019h19P39j20j40N70m42J14N15j0p4M08l64m11O19l36q3M14k67pJ81m78QK75
2041B92k39Q5N6l41K0l34J9L69K5l43Ml7k88O55K94o04M48j96p0K47m42R7N39
2064B56k55M8K85m43k9N02l17L24J36l73K01K45n16J43M40k75lk41r4J48N3l17
2086h2K73l19j07P0m36J41l3M78k01Oj21k96K87j36J47L10m80L34L2m38O56K23
$$ plain form
1936 -504 -708 -1006 -215 -173 -913 -161 -384 -948 -87 -382 -133 454 23 -79 604 64 208 1189 313 720
1956 720 632 57 764 942 337 704 856 -237 155 -86 -397 176 -258 -257 -199 -728 -1009 -201 -888 -740 -96
1977 -96 -691 -1000 -335 -956 -162 109 -604 178 318 -12 307 366 273 838 846 87 681 577 141 970 697 101
1999 101 667 365 -43 385 93 -101 433 -238 -408 -152 -974 -863 -96 -681 -253 -385 -850 -631 -298 -819
2019 -819 -80 -200 -340 230 -212 -98 417 407 333 741 377 -34 585 249 166 580 313 306 487 9 17 292
2041 292 53 138 194 -147 -127 -461 -442 -73 -48 -391 -387 -424 -712 -57 237 -367 81 -115 -185 62 -380 -283 256
2064 256 1 49 334 -109 -138 364 47 371 507 134 335 580 64 207 647 372 369 128 34 182 235 -82
2086 -82 191 -128 -235 -165 -601 -460 -493 -15 -216 -210 -331 -627 -340 -476 -329 -19 -499 -165 -133 -571 85 308
2108C08r8J63j46J30L9j78J40J15o5j40J66l43J39J23k16j5Ol73l46K19k40L51
2130b61k14R0K38l21jk4K9J62l0m0O2jK61K8K74J11j10L79k07j42K83l13K91K91
2154H35m31m6j95L9J06M7l78J48m79j37J96l13L25J18l85J08k13k15K48k4L94
2175b52J84k39J1J83p6J92R7K25K47k31m9N7L18r4O2Q7k91j90q5J39p7p2K3j26
2199D3k52k16P5M6k18L10k26O8j81Q0P3J7K16k02n7Q1K89k74K53K52J08m2k7J58
2223C74N3l36L13q6J75J97l93j53P5l98N42j04l69j0O3k1m5j01j10K14Q6m35N8
2246d11K7R7qJ25k26K14k51Q6L73j57K23Q2j08l1L11m11K61j12L25j51j56P3J77
2269C52k7O2q4J12m08k5J59R5q8j30j93J52j45J23rl53J52j18K31k40j74K4j12
$$ plain form
2108 308 210 373 227 357 396 218 358 473 408 268 434 91 230 353 137 122 128 -245 -591 -372 -612 -261
2130 -261 -475 -385 -147 -468 -469 -493 -464 -302 -332 -372 -310 -311 -50 -22 252 363 253 632 425 283 566 253 544 835
2154 835 404 358 163 202 308 355 -23 125 -354 -491 -295 -608 -283 -165 -550 -442 -655 -870 -622 -646 -252
2175 -252 -68 -307 -296 -113 -189 3 100 325 572 341 292 349 667 573 635 722 431 241 156 295 218 146 169 43
2199 43 -209 -425 -350 -304 -522 -212 -438 -370 -551 -471 -398 -381 -165 -367 -424 -343 -54 -328 -75 177 285 243 216 374
2223 374 427 91 404 318 493 690 297 144 219 -179 363 259 -110 -120 -57 -78 -123 -224 -334 -120 -34 -469 -411
2246 -411 -384 -287 -295 -170 -396 -182 -433 -347 26 -131 92 174 66 35 346 -65 196 84 409 258 102 175 352
2269 352 325 387 303 415 7 -18 141 236 148 18 -175 -23 -168 -45 -54 -407 -255 -373 -142 -382 -556 -532 -644
2292f44L17J91j14j0o3M4K69K63m33M80p2J00N1l54K98L18k88J94j26r5N28p26
2314A28J78J70j73l80N5K2m61O09m26m1J50n34j5K90p2j90M90j97k41L17j96J98
2336c19L65j3N00j19k27p1M06k52K63J73m35L63q4o13P08k60k5j35M3l16k61K58
2358e1j55J95l76J31q2k60j26M84k07j81L70m27K44J41m5K88J53k13M37j61k05
2379d6O73j04l68L91L5j48K11m78L23K04m49l0K78o66j35N73p21L78J92n08K09
2400a86k03k53J43M43p25M33J65m68L42m4J26M43j79l21L92P5k00K99j21j1K17
2421C67j63j25O32o32J53L43k90p1r6k23N8J16k82L04k17k58K85k64k7L34k03
2442b59q6N8o7l32L71N0Q0L31o41J58J87j74L01M23k80o4K82l54J86K54l26K09
$$ plain form
2292 -644 -327 -136 -250 -260 -323 -279 -10 253 -180 300 228 328 379 25 323 641 353 547 421 326 854 128
2314 128 306 476 303 -77 -22 0 -461 148 -278 -319 -169 -703 -718 -428 -500 -690 -200 -397 -638 -321 -517 -319
2336 -319 46 33 533 414 187 116 522 270 533 706 271 634 550 -63 645 385 360 225 268 -48 -309 -51
2358 -51 -206 -11 -387 -256 -338 -598 -724 -240 -447 -628 -258 -685 -441 -300 -345 -57 96 -117 320 159 -46
2379 -46 627 523 155 546 581 433 644 166 489 693 244 214 492 -174 -309 264 -457 -79 113 -395 -186
2400 -186 -389 -642 -499 -56 -781 -348 -183 -651 -309 -353 -227 216 37 -284 108 183 -17 282 161 150 367
2421 367 204 79 711 79 232 575 285 214 118 -105 -47 69 -213 91 -126 -384 -99 -363 -390 -56 -259
2442 -259 -345 -287 -354 -686 -315 -265 -185 146 -495 -337 -150 -324 -23 400 120 56 338 -16 170 424 98 307
2464C07k33J36J55L1k83J14N1K7On0j43j99j71J71J29l08l0o3O7r2R3j13%L1l01
2489f68K41L12j49K07N6l66M88M8k75K96J68j62K92l6m24K39p2K65J34m46j0N6
2511A94k07JJ90k88r6L32l70p6Q6l02J81l1Mj34Pj08L69J40j55K55j70P2K59o1
2535I2K6J1J66j00L88j76j03J16k11M23m7m29K52K2k11N9j0l88R9j59l09J83M
2558c02k01k9K3o1J48KJ62k31l9K05J84j83K96Q3j8K83j41l1j47J57K49J09JM1
2582E60j11j91n4q3J48j0l53L16m13k04K68j44J46kl45K88k3m53M88j50j88K97
2604b13Q6m0L8%m4K60j10oJ36m8K83Lm7Q8j88r7R5L07l06l8J37k19K62J64o51
2629a48L8K91l08j68J54o3j03J51k12p4K53K7J26k01n28M30R2k57P47l07k30J95
$$ plain form
2464 307 74 210 365 396 113 227 278 305 311 261 118 -81 -252 -81 48 -260 -290 -353 -286 -378 -285 -398 -398 -367 -668
2489 -668 -427 -115 -264 -57 -1 -367 121 169 -106 190 358 196 488 452 28 267 195 460 594 148 138 194
2511 194 -13 -12 178 -110 -206 126 -244 -320 -234 -536 -355 -386 -382 -516 -509 -617 -248 -108 -263 -8 -178 -106 153 92
2535 92 118 129 295 195 583 407 304 420 209 632 585 156 408 430 219 278 268 -120 -21 -180 -489 -306 -302
2558 -302 -503 -532 -509 -570 -422 -420 -258 -489 -528 -323 -139 -322 -26 57 39 322 181 150 3 160 409 518 519 560
2582 560 449 258 204 121 269 259 -94 222 -191 -395 -127 -271 -125 -127 -472 -184 -207 -660 -172 -322 -510 -213
2604 -213 -127 -167 -129 -129 -173 87 -23 -29 107 59 342 345 298 386 198 101 196 503 197 159 296 77 339 503 -148
2629 -148 -110 181 -127 -295 -141 -204 -307 -156 -368 -442 -189 -162 -36 -237 -765 -335 -243 -500 247 -60 -290 -95
2651i5r2K06M4MK3L05k09k01J93K19k69K00J20r0L9n16K56L86k99j76J64k27K50
2674B35m44RK05m38N1O1K79m08K09Mn9L31k30m1k00L28j11L77L5m16J38k1K53
2697A47Q2L9J82L6l5k7J78j40j13j2M9N9m32j79N8J42m3O3k45n5j80j32J78k0
2721d00l8j34L09r3K4Nn5M31M9l51J34K60l0M22k81Q4M2r1P2k5j32n8K07j08p2
2746A71QRk07lk03J15n4j11J39K9j41o7j70K13O4J00k79L2M25q5j2j9r4L30n9
2771A31j77M20m9j8J35K78m59J08k29L2K96k76Q1l54L43m21J51j87J23M9k50J42
2793a31j49K36l45L28j95j68J34l1K3K87j80O3n3K38M8N8K49l48J4Q5k27k7M24
2816C33j64m1K11j74j57J84Jj37j57j85M10o6j30m6K00q6m9P3j54k17J52J24j69
$$ plain form
2651 -95 -187 19 63 67 90 395 186 -15 178 397 128 328 448 358 397 -119 137 523 224 48 212 -15 235
2674 235 -209 -200 5 -433 -382 -321 -42 -450 -241 -237 -296 35 -195 -236 -436 -108 -219 158 193 -223 -85 -106 147
2697 147 229 268 450 486 451 424 602 462 349 337 386 445 13 -166 -108 34 -9 54 -191 -246 -426 -558 -380 -400
2721 -400 -438 -572 -263 -356 -332 -327 -382 49 98 -253 -119 141 111 533 252 336 378 287 359 334 202 144 351 243 171
2746 171 179 188 -19 -22 -225 -110 -164 -275 -136 -107 -248 -315 -485 -272 -208 -108 -387 -355 70 -15 -27 -46 -140 190 131
2771 131 -46 374 325 307 442 720 261 369 140 172 468 192 273 -81 262 -159 -8 -195 -72 -23 -273 -131
2793 -131 -280 -44 -389 -61 -256 -424 -290 -321 -298 -11 -191 -128 -181 57 105 163 412 64 78 163 -64 -91 333
2816 333 169 128 339 165 8 192 193 56 -101 -286 124 58 -72 -118 82 -4 -53 20 -134 -351 -199 -75 -244
2839b44K38p9j90K56Pn44M45K79j35j60J41n6J27j66O3J38J89P6m19L91K3j82
2861A98L3J20j29K01j63M3m58O15n07J46k64n2J98j74K7K12k82J32p0j77J28j19
2883c42L05k17P9j06K04J51o8q0K03K73k73N0m9J9J2p0K19j58ql1J58j32Lj09
2907C3J00l6l37Q3p7j40L3J49rJ82m84K75j01q5K20m0L07qj80J17K7K36k31K81
2931C15j30j1K2L15j62l1j51N7j24L1Ko1N4k47j54Q1J42q6N7K9j19j69O9K1m9
2956b99O5L90m74K06L1o4j8J93J9M4M20l51N8J73k98N35m58P2l15L49l18K03j5
2979A48k79J36j4j69M30l43m5Q6K31k48j9j37k10L57p5J33j97J60L0K05l05k83
3001d08N41L9N1m33PL07q1K41l75J78J01kK2J3k5N6L1k24J68j90N1L4j97K90l13
$$ plain form
2839 -244 -6 -85 -275 -19 -12 -556 -111 168 33 -127 14 -42 85 -81 -18 120 309 385 -34 357 380 198
2861 198 231 351 222 423 260 303 -155 460 -47 99 -165 -217 -19 -193 -166 46 -236 -104 -174 -351 -223 -342
2883 -342 -37 -254 -175 -281 -77 74 6 -74 129 402 129 179 130 149 161 91 310 152 144 113 271 139 142 33
2907 33 133 97 -240 -157 -234 -374 -341 -192 -201 -19 -503 -228 -329 -414 -194 -234 73 65 -115 2 29 265 34 315
2931 315 185 174 196 511 349 318 167 224 100 131 133 72 126 -121 -275 -194 -52 -138 -81 -52 -171 -340 -271 -250 -299
2956 -299 -234 156 -318 -112 -81 -145 -163 30 49 93 513 162 220 393 95 630 172 244 -71 278 -40 163 148
2979 148 -131 5 -9 -178 252 -91 -136 -50 181 -67 -86 -223 -433 -76 -151 -18 -215 -55 -25 180 -125 -408
3001 -408 133 172 223 -210 -203 104 23 264 -111 67 168 166 188 201 176 232 263 39 207 17 68 102 -95 195 -118
3026a18L40j60k00j83L02j02O7L92m79l73K47L2m0L76m66M47j12j90J02L5K35
3047A52J20j98j22P4j19O0P6J32o2Q0p8Q2L0o9N7J30l65L30k46k82L89l0k59O5
3071e3P9l95O21k09o4P9r9k0K28m38j23M02j35p4J3j0J70N0Qk5K04k68K63K0k8
3096A96n5k2l09K64J47l53j48m9L72L4k6p8l6j00j66K00K5k39L34l32J62J14l6
3119a01q6K08p4P1J72j57p3J28J78K8k19j5J04L4j37KL0J88r1jj46J01N0l74J31
3144d9j54J78k04J91K11k41r8k60L01k28L28k73P0J52n8J53J29J1m6j03K0N1j5
3167F6J92k85M8n7L25J98l22j68J27j98K7M4n5k7J99o8k85p6M23J44k44j94K56
3190G0l20R0K43j2k55L52q1k76JK71N2j98K25l30j27M48j37k02L31j05j2O3j16
$$ plain form
3026 -118 222 62 -138 -321 -19 -121 -54 338 -141 -514 -267 -235 -275 101 -365 82 -30 -220 -118 -83 152
3047 152 272 74 -48 26 -93 -33 43 175 113 193 115 197 227 158 215 345 -20 310 64 -218 171 141 -118 -53
3071 -53 26 -369 252 43 -21 58 -41 -61 167 -271 -394 8 -127 -201 -188 -198 -28 22 30 5 209 -59 204 224 196
3096 196 141 119 -190 74 221 -132 -280 -329 43 77 51 -27 -63 -163 -329 -129 -104 -343 -9 -341 -179 -65 -101
3119 -101 -187 21 -53 18 190 33 -40 88 266 294 75 60 164 198 61 63 93 281 190 189 43 144 194 -180 -49
3144 -49 -203 -25 -229 -38 173 -68 -166 -426 -125 -353 -25 -298 -228 -76 -134 19 148 159 113 10 30 81 66
3167 66 258 -27 21 -36 289 487 165 -3 124 -74 -47 -3 -58 -85 114 46 -239 -315 108 252 8 -186 70
3190 70 -250 -160 83 71 -184 168 87 -189 -188 83 135 -63 162 -168 -295 153 16 -186 145 40 28 91 -25
3213b5j47L17P5j31p1K6o7J22j24L1M2l2j33J03L7Ko3N3M0l9k6J18l88K35p4J88
3239F9j61q3N7l7J71P8j99L0j79K62J9n9J59k31K22r5O4Ol18J86J29j20J12l1
3263E1P1L5l45J40j08L72m15M6m7O6J70p9J27p3k33q1J06j21L92l3J15K54m16
3286fj27K19L9n2J76k90L53j57j18J8J49n0k60q7j8L54l33j55L85j9r2Q9j45r3
3310b20L95k85l3K48j19K45k99J60O9rk82k0J18J57J78m2j05qK83o82L55j49K4
3333b1K13j55l38L39k03JJ61j94k30M53J18m58K91J25l4k37P5L19j48p2j0K3M1
3356E9k7j81k3N6K18M6j52K34m11K27j63n4j86K66K42k56L6K41j23k09k13L41
3378c2j28o5M63k34m3M0k65L90m4k28L21k89j11M0L65k91K87k34j11J7N2j05K25
$$ plain form
3213 -25 -172 145 220 89 18 44 -23 99 -25 6 48 16 -117 -14 23 25 -38 15 55 16 -10 108 -280 -45 -119 69
3239 69 -92 -175 -118 -155 16 94 -105 -75 -254 8 27 -32 127 -104 118 23 87 93 -225 -39 90 -30 82 51
3263 51 122 157 -188 -48 -156 216 -199 -153 -200 -134 36 -43 84 11 -222 -303 -197 -318 74 41 156 410 -6
3286 -6 -133 86 125 73 249 -41 312 155 37 55 204 154 -106 -193 -211 143 -190 -345 40 21 -71 18 -127 -220
3310 -220 175 -110 -143 105 -14 231 -68 92 161 152 -130 -150 -32 125 303 261 156 148 431 -251 104 -45 -21
3333 -21 192 37 -301 38 -165 -164 -3 -197 -427 26 144 -314 -23 102 68 -169 -94 225 77 5 -5 18 59
3356 59 32 -149 -172 -116 102 148 -4 230 -181 46 -117 -171 -357 -91 151 -105 -69 172 49 -160 -373 -32
3378 -32 -160 -225 238 4 -39 1 -264 126 82 -146 175 -114 -225 -185 180 -111 176 -58 -169 -152 -100 -205 20
3401B0k36L41m16L29q3J40k83j18N23l85J28NN3K0J79j60j72J98m4q9J23J19j13
3424G9m5J1j19J0L3Km6p5J70K48j95j54n2J88q2j9J58J8j88j27J73P1L06l25N8
3449I8j07K0J21qr3Q7k94J69j4m0O5O4j65k77L81l12L03q1r4J81K31j85l66m3
3473c59K83rK24j26j45r6K43n1R7j28p5L94j30o3L4l8l1o6J68j27J07m3l28L88
3497A23l52j2L72q2k54J56o9k91L52k13J79L7L8Nj13O4Q1N0j89K51j06O3r7J41
3521A34O0j18Nj17j73K04m1lP2N7O0k22P3j8j71n4j4L61J12k81r3K59k17J27J4
3546A6Nm3j86L47o4K35m41k4M88j64k42J16n6J22j07M7p1J38k13J34M4o4o3L19
3570B73o19O09m18J65k7J1l1p8J95k90K73J52j81j26j82J93J24j58Q0L04m42j51
$$ plain form
3401 20 -216 125 -291 38 -45 95 -188 -306 217 -168 -40 -35 18 38 217 57 -115 83 39 -50 73 192 79
3424 79 34 45 -74 -64 -31 -29 -75 -150 20 268 73 -81 -133 55 -27 -46 112 130 -58 -185 -12 59 365 40 98
3449 98 -9 11 132 124 31 118 -176 -7 -21 -61 4 68 -97 -374 7 -305 -2 -83 -177 4 235 50 -316 -359
3473 -359 -76 -85 139 13 -132 -228 15 -36 61 -67 -142 252 122 59 93 55 24 -42 126 -1 106 63 -265 123
3497 123 -229 -241 131 49 -205 -49 -118 -409 -57 -270 -91 -54 -16 -11 -124 -60 21 71 -118 133 27 90 -7 134
3521 134 194 76 81 -36 -209 -5 -46 -49 23 80 140 -82 -9 -27 -198 -252 -266 95 207 -74 -167 92 -125 2 16
3546 16 21 -22 -208 139 75 310 -131 -155 333 169 -73 43 -13 109 2 49 -22 116 -97 37 81 17 -46 273
3570 273 -346 263 -155 10 -17 -6 -37 -115 80 -210 63 215 34 -92 -274 -81 43 -115 -35 269 -173 -324
3592c24K31Q1J63k51J76m20L47p4j77L49k71R0J74j91q5K96P9k12m3m8K76k64
3614i8P5P2Q5j13j02k9N8O9j35L51j08NmK1k17%L0j49K02J92j54lN3l96L21m9
3640b3N8k00o9L05l3J84j83j57O5j42L09k60N4J60p8Q7J19j58J26k02l6j27R1
3663a10n0j19K97k43J56j61K65q6P8j14l47N72j0mo4p4J58r3o1N9j75K5j08K04
3687eJ23k52J08R3l07M00m22P9O3j54N8M75k48j23J96r6mRj39M20k77P5J76k46
3711Bk7n9K24j9m3j69J90L6J10Kmj26j45J6J27l13J64n1k99L76K30j61N7j69%
3736e1N2l7m7N4K0J85j45j38J17Oj60M20k76N3j49J97k35J62j2K9OJ24l74M9M9
3761a01L2O6m2N3p1j33K5K78ml38J62K30k87J11K55k97J2J03J36j53N4k23J74
$$ plain form
3592 -324 -93 -12 151 -100 76 -344 3 -71 -248 101 -170 -80 94 -97 -182 114 193 -19 -62 -110 166 -98
3614 -98 -23 49 134 21 -81 -110 -52 17 -118 233 125 130 126 147 -70 -70 -40 -189 13 205 51 48 101 -295 26 -23
3640 -23 35 -165 -234 71 38 222 39 -118 -53 -195 114 -146 -92 68 -10 77 196 38 164 -38 -74 -201 -110
3663 -110 -160 -279 18 -225 -69 -230 35 -51 27 -87 -434 138 128 124 60 -14 144 51 -10 49 -126 -101 -209 -5
3687 -5 118 -134 -26 67 -240 160 -262 -183 -120 -274 -216 259 11 -112 84 -12 -16 -7 -146 274 -3 72 248 2
3711 2 -25 -84 140 121 78 -91 99 135 245 247 243 117 -28 -12 115 -198 -34 -85 -384 -8 222 61 118 -51 -51
3736 -51 1 -36 -83 -29 -9 176 31 -107 10 16 -144 276 0 53 -96 101 -134 28 16 45 51 175 -199 -150 -101
3761 -101 -69 -3 -45 8 -63 -196 -171 107 103 -235 -73 157 -130 -19 236 -61 -49 54 190 37 91 -132 42
3784D2J02k10K6O6Rn2q4K21j31J86j44j23K5l9o5N6K40q4K4K3J59n74K76J08l7
3809B0J52l30L3J45K75j72J5j03k35J60J68k49j23K97J25K0k69J54j64J68R3l58
3831a78L85r8K7j53r9J14j98K86L7r3j47K37J8j47K43m00M12l26N1j03rN3K10
3854A22p4k76K07k74L47j3j73P7j85K20r3P7J59J7j25m3l69K22L47k04K28j42
3876E2j4j60L15m88L84J52j37Q0j1K2j14j81R3J32l5j04q0k06J87k5L2M1R0j91
3900a66j7K88J07l47K59Q3j13p8J37O1j24k7J59k61l3R9n3l2K03j50L61l68k17
3923b29J35P3Q9k30L80m29J14L5L07k32m3k05K78J04j68l3K2j30J60J2L52m43
3945h1m7J91j83K03J23k12j5r1J30k69J52J44j15N3j97J34l9P4j01j44L14M2n7
$$ plain form
3784 42 144 -66 -40 26 35 -17 -101 120 -11 175 31 -92 -67 -106 -171 -115 125 41 65 88 247 -327 -51 57 20
3809 20 172 -158 -125 20 295 123 138 35 -200 -40 128 -121 -244 53 178 198 -71 83 -81 87 180 -178
3831 -178 207 109 136 -17 -116 -2 -200 86 123 30 -117 120 138 -9 234 -166 246 -80 -29 -132 -141 -88 122
3854 122 48 -228 -21 -295 52 39 -134 -57 -242 -22 -115 -38 121 138 13 -30 -399 -177 170 -34 194 52
3876 52 38 -122 193 -295 89 241 104 184 173 195 81 -100 -7 125 90 -14 -94 -300 -113 -138 -106 -65 25 -166
3900 -166 -183 105 212 -135 124 207 94 16 153 214 90 63 222 -39 -72 27 -26 -58 145 -5 356 -12 -229
3923 -229 -94 -21 68 -162 218 -211 -97 -62 245 13 -30 -235 43 147 -21 -54 -32 -162 -2 10 362 -81
3945 -81 -128 63 -120 83 206 -6 -21 -112 18 -251 -99 45 -70 -17 -214 -80 -119 -45 -146 -290 24 66 9
3968Ik7K6r1J25k64K18M3r9k58L50j23J22l51M37j20n2j0%JJ17M8j49J38l70K70
3993a0p0L67l17K29l38J94p4j08J60r6K92k32k0J00j13K86k48J03k49J47J68j21
4015E0J51k80J17j58L30l95J96j6j83j6J59o2M17k19j43M9M8L09k80l4jj15L07
4038B31k23j34K38k20J01L27j97k1j34j08k8J93j5L84j99m65K47N6L0l65K75K2
4060eO0m6j46J53O6Q6j91L56l92qR2P4l9q1M15k02o2q3n1J15l0k14Q9J76l44P5
4086a37K30l36J99k2q3K02o4K26l48L80k18k28L45l32K04j47K16R8j91R7m9J25
4108A67j34J52j95JN3J74k40K29j52J7l34L47L3l34L40l64K23J39m1J77l43J38
4130E3j63k61J31L14j22j71K80qQ3oj64K48m3k40O2J3J50j0k75N3r1k15K39J44
$$ plain form
3968 9 -18 8 -83 42 -222 -4 39 -60 -318 32 -91 31 -320 117 -3 -55 -65 -65 -64 53 101 -48 90 -280 -10
3993 -10 -80 287 -30 199 -139 55 -19 -127 33 -63 229 -3 -23 77 -36 250 2 105 -144 3 171 50
4015 50 201 -79 38 -120 210 -185 11 -5 -188 -204 -45 -107 310 91 -52 -3 45 354 74 40 39 -76 231
4038 231 8 -126 112 -108 -7 320 123 102 -32 -140 -168 25 10 394 195 -270 -23 33 63 -302 -27 -5
4060 -5 55 9 -137 16 82 168 -23 333 -59 -67 25 99 60 -21 394 192 130 47 -4 111 81 -133 -44 132 -212 -137
4086 -137 93 -243 -44 -66 -149 53 -11 215 -133 247 29 -199 146 -186 18 -129 87 185 -6 91 42 167
4108 167 33 185 -10 -9 44 218 -22 207 55 72 -262 85 118 -216 124 -240 -17 122 81 258 -85 53
4130 53 -110 -371 -240 74 -48 -219 61 53 136 130 -34 214 171 -69 -7 6 156 146 -129 -76 -167 -382 -143 1
4154Al7q5J20j26L08k07j59L73j17n0j16K74j65L0j85R8K06k01j5p5K15j44o7
4177a24lJ07O7k69J05K19l3j32J86l14j5K7J34j28L06k47K30j76K1J3J03j38J49
4200H8j38K42k05l3P0l8K8Q1j19j00K81k3m19K64M1j68K18k43J95k26K29j58O0
4223g3j25L88k00p8Q7J38l60J06M47k76P8N6k22K0Qk13N19p8o1j7m01K52J3o3
4247e5o0K64l29K21O1j62K06j20j5j03L51l4j63l99N22j67N1K4L8m24K89l9J22
4270G9o7n1K24o7m7J20k38k3j1J75J9j02K03j53O2M4r2j41J35K31k76nJ40k20
4294f1K69k15k5o1j21L40l30J20nM11n01K86k20J71m6O4R8k28L85o19K39j1k35
4317b95J53L13N4n0p9nk56J49K29j65n5j48J28J77p2j50j9NK0Q7O6m1j10k33L40
$$ plain form
4154 1 -36 -121 -1 -127 181 -26 -185 188 71 21 -95 179 14 44 -141 -43 163 -38 -53 -128 87 -57 -124
4177 -124 -127 -20 47 -222 -117 102 69 -63 123 -191 -206 -179 -45 -173 133 -114 116 -60 -39 -26 77 -61 88
4200 88 -50 192 -13 -46 24 -14 14 95 -24 -124 157 134 -285 -21 20 -148 70 -173 22 -204 25 -133 -73
4223 -73 -198 190 -10 -88 -1 137 -223 -117 330 54 132 188 -34 -14 -6 -219 300 222 161 144 -257 -5 8 -55
4247 -55 -115 149 -180 41 102 -60 146 26 11 -92 259 225 62 -337 185 18 69 93 131 -293 -4 -43 79
4270 79 12 -39 185 118 71 191 -47 -70 -81 94 113 11 214 61 123 167 75 -66 69 300 24 19 159 -61
4294 -61 208 -7 -32 -93 -214 126 -204 -84 -89 322 -179 107 -113 58 12 76 174 -54 331 -288 -49 -60 -295
4317 -295 -142 171 225 175 96 91 -165 -16 213 48 -7 -155 -27 150 78 -72 -91 -86 -66 21 87 46 -64 -297 43
4342D3J3M4mj5J50k88R3R7R9k75O5j22L71l67k14M33P3l17K26m79M97j31J16L7
4366A45k01N1J62l24J10J15K8j71J44K50j83P7k56j37M00l02r3K83k22J39j61
4387a46L02l64J44rK9ml7N6J44k0j56K17m3m43L28o6j6M9J47k00J77J9k25Q1L8
4412Bj66J17J57j38o5L92o48J96k0L46J15k77l6K06k12K73l70N3J48j41P4k99
4434b93N75m08K15o9k65K52J8k51K09N6n5j69R7J14l7L4j28nOK50j36j73K67j00
4458Dk03J68J6j06L10r3j4P9l22J03LN8j62K9j11J64P3K80j36k44o3K74j46kn8
4483i9K00l08K30K4j63K58k86K02n8l4K53n8M6k27o2K56P6Lp9k4O5m99K23L20
4507B59m93K23j35K60n2j68J60j3q4Q5j05k36O98m56N6k7o4J9L16k75J45j01J36
$$ plain form
4342 43 56 100 96 81 231 -57 36 133 232 -43 22 -100 271 -96 -310 123 196 -121 105 -374 123 -8 108 145
4366 145 -56 -5 157 -167 -57 58 86 -85 59 309 126 203 -53 -190 210 -92 -185 98 -124 15 -146
4387 -146 156 -208 -64 -73 -44 -48 -85 -29 115 95 -61 156 113 -330 -2 -68 -84 -35 112 -88 89 108 -117 -36 2
4412 2 -164 -47 110 -28 -93 299 -349 -153 -173 173 288 11 -25 181 -31 242 -128 -75 73 -68 6 -293
4434 -293 282 -126 89 20 -245 7 25 -226 -17 39 -16 -185 -88 26 -11 23 -105 -110 -104 146 10 -163 104 4
4458 4 -199 -31 -15 -121 189 96 82 161 -161 -58 -55 3 -159 -130 -241 -77 -4 276 140 -104 -167 107 -39 -41 -99
4483 -99 101 -207 23 47 -116 142 -144 58 0 -34 219 161 207 -20 -82 174 250 253 174 150 215 -284 -61 259
4507 259 -234 -11 -146 114 62 -106 54 41 -43 42 -63 -299 399 -57 -1 -28 -92 -73 243 -32 113 12 148
4530A48j18j74K75K06m52P5k15K05m3L30k73p8Q9L9J8J31j43k46N2L51k27j10
4552a60M8J74M4k24K26k33Q1l3P0j57L0N46n02O9K55k56J54k83J64l33M88l40
4574a72K5N8K03n8j21L27k84j05L9J02J24j59R5k6q4O4r0l5o6M94m25Q3Q9r0K9
4599A7j86J75L0l0J59l03J79o2o6J66j48J35k99L32m2j73K89k83J86j40J36r8
4621b6J0o1j1n1K33J30j28K76m70L1J56k18J91j46J90j29L9j95K6K52k3m32M66
4644A10k9k03J76Lj6k61J78K12j11o6J60j25R3J75n6m54K24j55O9J13l36L23j94
4667a70Q3m3o5K37k10L59l22K87p9O9j61n6J50n1k1J25J4j53J12k25O5J9J78O4
4691B06l18j40J81n9J87n4j97R4K01j1J8k53o6K2K71Q1j24qq4J4j59K50j07K17
$$ plain form
4530 148 30 -144 131 337 -115 -40 -255 -50 -93 237 -36 -114 -25 14 32 163 20 -226 -174 177 -50 -160
4552 -160 -112 62 106 -118 108 -125 -44 -77 -7 -164 -134 412 -90 -21 234 -22 132 -151 13 -320 168 -172
4574 -172 -147 -89 114 56 -65 262 -22 -127 -88 14 138 -21 74 48 -36 28 -62 -97 -163 331 -94 -11 78 -12 17
4599 17 -169 6 36 6 165 -138 41 -21 -87 79 -69 66 -233 99 57 -116 173 -110 76 -64 72 -26
4621 -26 -16 -77 -88 -139 94 224 96 372 -98 -67 89 -129 62 -84 106 -23 16 -179 -153 99 76 -356 110
4644 110 81 -122 54 57 41 -220 -42 170 59 -7 153 28 121 296 240 -214 10 -145 -76 37 -299 24 -170
4667 -170 -87 -130 -195 42 -168 191 -131 156 77 146 -15 -71 79 28 7 132 146 -7 105 -120 -55 -36 142 206
4691 206 -112 -252 -71 -130 57 3 -194 -100 101 90 108 -145 -211 -189 82 163 39 31 -53 -39 -198 52 -55 162
4715A62j05mM6j8k07R7l2P6k44J60K00N5j25l16K13J82j85J42N0j76k2J43l90
4738b98K74Q2n3pk23K88L9j38q5j54L27j96L10Nj83j14l8L08j2r9l9N2j29J27
4762D4l94N87k16J28k71r5L2Q4J68J18l03l7r8N18m06n5L11j91J26j11L5r7J32
4785Ik53N21l74P3j30P1Q1O2j49J6J12q7l88K32K16o4j12O8L3q5J5J61L3k55K55
4810F1o1L4O1j15J14K17m76M30l11Q3K9k53K98Rl34J58P2q3J12R4j9J1k56J07
4834a8JJ56L8j34l73N54m2k50K97k23Q2k40n2J52R4k41L34J04k21l6r7K19K4J4
4858A42Q9l55K61j24j03j19L43j88L07l62J72j9L3J10k48K4J82j63J51j6o6K68
4880C19l05j67J54J41p9J19n3Q3j15J1j17M3j17N8j3J68N4m49K21P6l59M54j20
$$ plain form
4715 162 57 53 99 81 -126 -29 -61 15 -229 -69 131 186 61 -255 -42 140 -45 97 147 -29 -51 92 -298
4738 -298 -24 58 5 -2 -225 63 102 -36 -121 -275 52 -144 166 171 -12 -126 -164 144 132 33 -6 46 -83 44
4762 44 -350 237 21 149 -122 -217 -185 -101 67 185 -118 -155 -253 265 -141 -196 115 -76 50 -61 -26 -123 9
4785 9 -244 277 -97 -24 -154 -83 -2 60 -89 -73 39 -48 -436 -204 12 -52 -164 -96 -63 -148 -133 28 61 -194 61
4810 61 0 34 95 -20 94 311 -165 265 -46 37 66 -187 111 120 -214 -56 16 -67 45 139 120 131 -125 -18
4834 -18 -17 139 177 43 -330 224 182 -68 229 6 88 -152 -204 -52 42 -199 135 239 18 -18 -115 104 128 142
4858 142 231 -124 137 13 -90 -209 134 -54 253 -109 63 44 77 187 -61 -37 145 -18 133 117 51 319
4880 319 14 -153 1 142 63 182 129 212 97 108 -9 34 -83 -25 -38 130 184 -265 -44 32 -327 127 7
4903Gk47K35J49K6l77J11Q3k7l6O4Q6L2j56o1J13o9L71k65J26m56P3L16q8P9k19
4928a30J31k6%P2J56j17Q4j27j23R3J48k19J38J2q5j3n6K34l19K42J89j21k14
4951e1jR0m3j13J96J06m94K85r5L3k93N04j19k22L30m17M15NR5j33k20J5j3J60
4975B0O8k2J80l60j0J27l7J2L4j10R9o8J42j57J47J24j15K29m20l3J64n1o8n2
4999a57J76j09k27P1J81k36L42p5r0J35J90N1k83J14O4j19M5j59K27o3j23L1L
5022a1n4J51q2q8J79J5l36M73j37j73J97j26l17Q9P6M8j10P5o8K4K85j36j30J73
5046A7j37L21j60N4k59J72J60%l53L5M3M75l01R3j70j06K66j77K6N7Q4mP4m30
5070b20O3l2K02Q7j7k39J45K06K83r0r35N24k9k7Jk17K41O8K15n37M60r4Ok70
$$ plain form
4903 7 -240 -5 144 170 -207 -96 -13 -40 -76 -12 74 106 -50 -111 2 -67 304 39 165 -291 -218 98 10 89 -130
4928 -130 1 -25 -25 47 203 86 170 43 -80 13 161 -58 80 92 7 -6 -62 172 -147 95 284 163 -51
4951 -51 -52 38 -5 -118 78 184 -310 -25 -120 -87 -380 124 5 -217 113 -304 111 116 211 78 -142 -127 -140 20
4975 20 88 66 246 -114 -124 3 -34 -22 12 -98 1 -67 75 -82 65 189 74 303 -117 -150 14 -37 -105 -157
4999 -157 19 -90 -317 -246 -65 -301 41 -34 -124 11 201 252 -31 83 147 28 73 -86 141 78 -45 -14 -11
5022 -11 -65 86 4 -84 95 110 -226 247 110 -63 134 8 -309 -220 -144 -96 -206 -131 -199 -175 110 -26 -156 17
5046 17 -120 201 41 95 -164 8 168 168 -185 -150 -107 368 67 160 -10 -116 150 -27 -1 56 140 136 210 -220
5070 -220 -157 -189 13 100 83 -156 -11 195 478 388 -547 -23 -52 -79 -78 -295 -54 14 229 -308 152 58 64 -206
5094b06L62k30l1L4l6J18j19L50m16K52k05K2o5j7K12r9J7K3R3k0rK43n51K61
5118a7j15Q7K8j20o7J87k33J80K99k41L1J75k27J52Pk24J23pQ0R0k58Q0J49l63
5142b04L99n20L08mj15r0L29k88K52k04J89l1q0j7j68J85l4k9M3j73K08J59j57
5165d2p5o1O8P8K36k04P7j39M9P4n4n4J40j39k12N40l97L13k43j67O0L07l70L54
5189A39K04k03p4k06M02j04k63j66R4J80m4j22n8K60j97J88p8K68k49n3K05Rj50
5212a8J39k01J30j91J55k11O7r9J25J54j37j76K22M74p23J15L57r0J47m13J61
5233a3P3l1J7l77M50K2J2j74j4J27K32k18j92J35J70k80p1j02j9K93j47J28N9
5256H0j1l9lr2N10n81j71L15J58p9l7J47k31q8k6K58n0K14o7p9j93K10k85R4L07
$$ plain form
5094 -206 156 -74 -105 -71 -107 11 -108 242 -174 78 -127 -105 -170 -187 25 -74 -57 -34 59 39 30 273 -278 -17
5118 -17 -132 -45 -17 -137 -204 -17 -250 -70 229 -12 19 194 -33 119 126 -98 25 18 98 188 -70 10 159 -204
5142 -204 195 -325 -17 -21 -136 -226 103 -185 67 -137 52 21 -59 -76 -244 -59 -93 -122 -79 -252 -44 115 -42
5165 -42 -117 -178 -110 -32 204 0 77 -62 -13 61 7 -47 93 -46 -258 282 -115 198 -45 -212 -152 155 -215 139
5189 139 343 140 66 -140 262 158 -105 -271 -177 3 -41 -163 -221 39 -158 30 -48 220 -29 -82 123 132 -18
5212 -18 121 -80 50 -141 14 -197 -130 -229 -104 50 -87 -263 -41 433 -290 -175 182 92 239 -174 -13
5233 -13 60 29 46 -331 119 141 153 -21 -35 92 324 106 -86 49 219 -61 -132 -234 -253 40 -107 21 80
5256 80 69 30 27 -65 445 -136 -307 8 166 87 50 197 -34 -122 -148 110 60 274 207 128 -65 145 -140 -46 261
5281B61m05J55q2K68j86k04R2R5Kj80r9M86j28k84L31M6k28K55L6l28L22l42J2
5304a05j0P8L17l28J11J6j35J23j08M2J70k6j13n3j27J90P2j66N2J7R0j06M2j30
5328h7K12J7K5k55K80l03M0K05j32m5q4J24J37j28l9J06Pj42J55j9k78K67J41
5351B04k62m4k8j9J66k78J36PJ79p2j6o9P1J23k08J11k7J01O6m31L54j35J04j47
5375a14K2J47m3j2q4J14m0K08l53j0J46l2k52L27J74k54k1J60M1l35J42JJ91r2
5399C1J22k10N1J33r7J19j71j3K4J42k21J95J73l15J43J64m31l0O5J94N4k08j1
5422i7J09J38j97K0N4P6Q9k97J61n0j46L36j58j42KL32k27Q4Q5l57N8k99L56o9
5446a39J12L06k67L9J27k52p0L04n2j05N1o5p0j48Q9K52k21J41j52M04j71N2j14
$$ plain form
5281 261 -144 11 -71 197 11 -193 -101 -6 -4 -184 -283 203 75 -209 122 168 -60 195 231 -97 225 -117 -105
5304 -105 -115 -37 280 -48 63 79 -56 67 -41 1 171 145 32 -21 -148 42 114 -52 0 17 107 1 43 -87
5328 -87 125 142 167 -88 192 -111 -71 134 2 -43 -127 -3 134 6 -33 73 80 -62 93 74 -204 63 204
5351 204 -58 -102 -130 -149 17 -261 -125 -118 61 -11 -27 -96 -25 98 -110 1 -26 75 141 -290 64 -71 33 -114
5375 -114 -92 55 12 0 -84 30 -10 198 -155 -165 -19 -51 -303 24 198 -56 -77 83 124 -211 -69 -68 123 31
5399 31 153 -57 -6 127 30 149 -22 -35 -11 131 -90 105 278 -37 106 270 -161 -191 -126 68 122 -86 -97
5422 -97 12 150 -47 -27 27 103 192 -105 56 6 -140 196 38 -104 -102 230 3 87 172 -185 -127 -426 -70 -139
5446 -139 -27 279 12 51 178 -74 -144 160 108 3 54 -11 -81 -229 -140 112 -109 32 -120 284 113 165 51
5469E1K0J96k59j12K69k30pm9Q4L4J8j08J29R1k1l98K66M1l51K68j9L3K80l98
5493a72R3J98j49M1M7K8j84N3LJ62j21J19l1QK1k9k16M10k25l3k66L61J18k00
5517C6l2J59k95J15m7j28K90j93K02P5l57J22K2k91L13K9j30J44J07k2j1p3K66
5540C01n69L32k42K29j31j48j06K90K4J73k82K38k06k2J69P3O2m05L75j83O6%
5562C8m4l0j66K13p4P4j19K56m20K77J07j83J21j0j07J53J0Q6k81J44q8Jj38K22
5586D2j53L70k07j86N94o00k15J74J11m2j71J88J06k89J29K52j90J17oj17J17
5607B4J86n6j64J93O5m34K58k26M5L94R1l04k02j93K51K4J29j15NP9l52J59P7
5630f6k42L89j8k14J46j45K62j43p2J66O9k62l1J25J48k98J38L3k33K77j93j06
$$ plain form
5469 51 71 267 8 -104 165 -65 -72 -121 -37 -3 15 -93 36 127 106 -292 -26 15 -336 -68 -87 -54 226 -172
5493 -172 -79 119 -30 11 58 86 -98 -45 -42 120 -1 118 87 95 116 87 -129 281 56 23 -243 118 236 36
5517 36 4 163 -132 -17 -64 -192 98 -95 107 182 -175 -53 -31 -322 -9 20 -110 34 141 119 108 35 301
5540 301 -268 64 -178 51 -80 -228 -334 -44 -20 153 -129 109 -97 -119 50 123 185 -220 155 -28 38 38
5562 38 -6 -36 -202 11 -63 11 -108 148 -272 5 112 -71 50 40 -67 86 96 182 -99 45 -43 -42 -180 42
5586 42 -111 259 52 -134 460 -140 -355 -181 -70 -112 -283 -95 11 -278 -149 103 -87 30 24 -93 24
5607 24 210 154 -10 183 248 -186 72 -154 -109 285 376 72 -130 -323 -72 -48 81 -34 -29 50 -302 -143 -66
5630 -66 -308 81 63 -151 -5 -150 112 -31 -103 63 132 -130 -161 -36 112 -186 -48 -15 -248 29 -164 -270
5652b70N55k76L13j72Rk61J13l1qq8O8Q5o7j64P6J30J30k23r0J59M9j31K82k17
5676b9j65L82k16l1m4K28j40Oj51J18O2J39j05r5j38K94j98N9K7K52M1j41j96
5699d1Q0n4l7j0Q1j0k63J44J48M0j50k24K40p9J67k1j22R8J54r7j30L44n68K49
5723f1J59j6j60P8O4J43j95K0L10n34K64j21J87p4j0k21RJ11JR1j28J5n2QJK26
5749A15j77j19L02o9k95J26o4K24K3rj01K70k06J87p6k53J53J17pl5l8%k8R0l5
5774I5j78J96N0l11J51J23j10j08p4K96l79K18O8j07R2k0m7J50l82J03L16J01
5796B43r1K53l95J36k89K40j30K92m23J92J75m31K92j07o0j53K74j51L45m8m86
5817c22M96k60pK12p9n2J11O1r7J27k32o0q7K40J3q2K24o1n7l08N19j56l05K68
$$ plain form
5652 -270 285 9 322 150 159 -102 11 -20 -28 -116 -48 37 -30 -194 -118 12 142 -81 -171 -12 37 -94 188 -29
5676 -29 -194 188 -28 -59 -103 125 -15 -9 -160 -42 20 159 54 -41 -179 115 -83 -24 3 255 296 155 -41
5699 -41 39 -15 -52 -62 19 9 -254 -110 38 78 -72 -296 -56 -135 32 11 -111 -13 141 44 -86 258 -310 -61
5723 -61 98 82 -78 0 64 207 12 32 342 -192 72 -49 138 64 54 -167 -158 -47 -46 45 -83 -68 -120 -112 -111 115
5749 115 -62 -181 121 52 -243 -117 -181 43 66 57 -44 226 20 207 131 -122 31 148 141 106 68 68 40 130 95
5774 95 -83 113 163 -148 3 126 16 -92 -166 130 -249 -31 37 -70 22 2 -45 105 -277 -174 142 243
5796 243 152 405 10 146 -143 97 -33 259 -164 28 203 -228 64 -43 -103 -256 18 -133 212 164 -322
5817 -322 174 -86 -93 119 40 -12 99 160 63 190 -42 -102 -189 51 64 -18 206 145 88 -220 299 143 -162 106
5841A06j00m0J0R2n06L36r7K07j3Q7O9j58P4k46m0L37n1J78k42o2L1K06k64J42
5865E6j08L00k81J62k39J28j56k07K36K70k39r0K39p4L75k55k6j86j33K50j75
5886a53P2K54m49J52J27j68N23j80J97n13J96k39K16j01m0J44j60l3K11R8j27
5907B7L2J92j02l7l8k36J02K23j23mj22K39l49J68j07K71j24n7J81j34M4r6k8
5930g8J35M7j99K37p8k21K03lj09Rj55J87p6R6j05J69k01K20J25r0j45j66j09
5953c07L99j06P3j89LL69k27N5k6K18n07N4J82J43r0k10K07m0k76K96L23m48K07
5976A03o5M9l02J88q4O7R2K10j45j64L30l07L78l08J3J6k23L59J6l29N5R0p3J04
6000G0p0R5n4L0l09J66J9j37J08J31M6k14LJ23J08P4Ll89L30l83J55K9n7L63l04
$$ plain form
5841 106 6 -34 -24 68 -438 -102 -199 8 -5 82 151 -7 67 -179 -219 118 67 245 3 -59 -28 178 -86 56
5865 56 -52 248 -33 129 -110 18 -138 -345 -109 161 -78 -168 71 -3 372 117 91 -95 -228 22 -153
5886 -153 -81 173 -276 -124 3 -165 358 178 375 -138 58 -181 35 -66 -106 38 -122 -155 56 154 27
5907 27 59 251 149 112 74 -162 -60 163 40 36 -86 153 -196 -28 -135 136 12 -45 136 2 46 -50 -78
5930 -78 57 104 -95 142 64 -157 46 43 -66 -57 -212 -25 -101 -5 -110 59 -142 78 203 113 -32 -198 -307
5953 -307 92 -14 59 -130 -127 242 15 70 44 262 -245 -191 -9 134 44 -166 41 1 -275 21 344 -104 103
5976 103 38 87 -215 -27 -111 -44 48 258 113 -51 279 -28 350 42 55 71 -152 207 223 -106 -51 39 -34 70
6000 70 0 95 41 71 -238 -72 -53 -190 -82 49 95 -119 -116 7 115 189 192 -197 133 -250 -95 -66 -123 240 -64
6025f4O2lk9M4K61k77J10r4l9P7O9k4M9p5Op4O7Q5k12j09M9L21k82JP6l9M6K16
6053B18j75l30k3N66r4j21l6j2j66J71j66J38N7Q9k43J81k41N8J78k33L30m2j79
6076g5J03p0j07K1M8N0K96m58K65k49J92j29J80L3k02N9q6J75k33J08K44j48L26
6099C43l46m1r9n4J30k20L71o3o9J25j00J01k28M65l34J41k07K4L36l37R7m2R8
6122I1j1j51k2J74j75K46k21K91K8j78P0j91n6o4L9R3j15L44j69j30l1q4K06k78
6146b94K40j8Q7k10J13K21p4r6j62K41P0j32j28Q0KJ80o1Q9l8q6j76j16M37j00
6170F9m7N9j25m4L24k93J8K28j64r9k95M61k40M17l00J87p8K11l34k3J97k56L0
6193i7J77l85K12J81j78K55M0k04j33O4q3J39mK8J13K26n02J08q8K14O6n9k00
$$ plain form
6025 -64 -2 -5 -34 10 271 -6 104 10 -29 48 117 93 142 67 73 -1 66 151 -61 -170 -121 200 -82 -81 -5 -44 2 218
6053 218 43 -287 -310 256 162 41 5 -7 -173 -2 -168 -30 27 116 -127 54 -187 -129 49 -184 146 104 -75
6076 -75 28 -42 -149 -128 -80 -30 266 -192 73 -176 16 -113 67 100 -102 -43 -129 46 -187 -79 165 17 343
6099 343 -3 -44 -143 -197 -67 -287 84 21 -48 77 -23 78 -150 315 -19 122 -85 -61 275 -62 35 -7 91
6122 91 80 -71 -93 81 -94 152 -69 222 250 72 142 -49 -105 -169 -130 -37 -152 192 23 -107 -138 -222 -16 -294
6146 -294 -54 -72 15 -195 -82 139 65 -31 -193 48 118 -14 -142 -62 -60 120 59 148 110 24 -152 -268 169 69
6170 69 22 81 -44 -88 236 -57 -39 189 25 -74 -369 92 -148 269 -31 156 78 289 -45 -68 129 -127 -97
6193 -97 80 -305 -93 88 -90 165 205 1 -132 -68 -151 -12 -16 12 125 351 -151 -43 -131 83 149 90 -110
6216a10L29j83j74oO2k6J75j37QJ95k67J09m7K4o0N1J05o8J7Jm6J32j23M9J56
6241A66m58K92N7p3j36J03r5q1Q5pj19N37k95j9K02l58n6J83N3N2r5J93j09j11
6265h9n9L26l43Q2M8l3J04j68L19k99K70J03j32k79L03j97K8k11L92j78n2K6J16
6288G7r2L8l4Q3L0j59J68k87M22m03K10m5r9K08o5k66L98l62M28k70L01k37O6
6311A10j42L44j23l16L17q5J25k70N2l1j17J79j68K06j34K04j94q1k04J56K99
6332A27j65j37N0N4K40j20k14p2K63j14J2J19J42m0j57k57K90r2N7M9r4J10k73
6355b22N49k12m0k2k9j90K78l1j42o1O7J03kl3J29l68P2L99m25LK24n9J25O7k84
6380a04J95k37N3J34J39j1j13K7k20J1M4pj1J1J40o7M2j08N1J49k90L80k76M08
$$ plain form
6216 -110 219 36 -138 -144 -82 -108 67 -70 -62 133 -134 -25 -72 -48 -108 -57 48 -20 -3 -2 -48 84 -39 10 166
6241 166 -292 0 57 -16 -152 -49 -144 -225 -140 -147 -266 271 -24 -43 159 -199 -255 -72 -19 33 -62 131 22 -89
6265 -89 -148 178 -165 -83 -35 -68 36 -132 187 -112 158 261 129 -150 153 -44 -16 -227 165 -13 -65 -39 77
6288 77 -15 23 -11 72 102 -57 111 -176 246 -157 53 8 -91 117 52 -214 184 -178 250 -20 281 44 110
6311 110 -32 312 189 -127 190 105 230 -40 12 -19 -136 43 -125 81 -53 151 -43 -124 -328 -172 127
6332 127 -38 -175 -125 -71 169 49 -165 -237 26 -88 -76 43 185 145 -12 -269 21 -71 -14 35 -59 51 -222
6355 -222 327 115 75 53 24 -166 112 81 -61 -122 -55 48 46 13 142 -226 -154 245 -180 -177 47 -12 113 180 -104
6380 -104 91 -146 -93 41 180 169 56 83 -137 -126 -82 -89 -100 -89 51 -16 26 -82 -31 118 -172 208 -68 340
6404C40j40n8k45N7j22j7K02k00K88j41m9K20L1j64L2M7k77N18m94L19m7J73k32
6427D1j24J30l31K54M23n22MK61j91J31J8L9k22K52k36N21l46k67L1L01k73M45
6449C39m55J09Q8k6p0M2J07k09L68l74J21Rk63M01k11j42J31p6q5K20K02r9M3
6472A70k50J73J6j74o4Q2O1K3K12k38M2%n4q6L51j98l19L41K4j81P9j40n7K46
6496E9K4j4R7j44j8k52N65l36k4l69M54j48L93l93o7K53L1R5l4j41k16L06l46
6519b25L13j61J43J08R2l54K22p0r8J56k74l0R7k3Q4j7n3n7J28N0M6o1L1k11n1
6544b15L72K0L6j88J05L0k80Q9J00j53K43j45MN9l7j47J66j40j9j27Q8J85k00
6567a54j9K40j90j00J24L4J23j52K23M1j13q4j21K13m2j4j81k3j05J50J37jj9
$$ plain form
6404 340 200 142 -103 -46 -168 -185 17 -183 105 -36 -85 135 166 2 34 81 -196 322 -172 147 100 273 41
6427 41 -83 47 -284 -30 393 -129 -125 136 -55 76 94 133 -89 163 -73 448 102 -165 -134 167 -106 339
6449 339 -116 -7 81 55 -15 27 134 -75 293 -81 40 49 -214 187 -24 -166 -35 -111 -196 24 226 127 170
6472 170 -80 93 109 -65 -129 -47 14 37 249 11 53 53 -1 -87 264 66 -253 88 112 -69 10 -130 -187 59
6496 59 83 69 166 22 4 -248 317 -19 -43 -412 42 -106 287 -106 -173 80 111 206 172 31 -185 121 -225
6519 -225 88 -73 70 178 270 -84 138 68 -30 126 -148 -178 -81 -104 -20 -37 -90 -147 -19 31 77 16 47 -164 -215
6544 -215 157 177 213 25 130 160 -120 -31 69 -84 159 14 18 77 40 -107 59 -81 -100 -227 -139 46 -154
6567 -154 -173 67 -123 -223 -99 -65 58 -94 129 170 57 -27 -148 65 23 9 -172 -195 -300 -150 -13 -14 -33
6590c3J8J96k57j51J34K39K64n19R3p1J02j2M6J23Nj29q2j61K61j03O0qN2l22
6614b55J05K19j90K36k62j18M62l96L38j04n3J6L6j47J84j56J42M5k7m7j91L66
6636B03M4m22J44r3N5K64k86J61j44J35l3L3j99J42j65j11K15J3j47N7Q2Q2l1
6659ak2K51k57P2k1r1%K34J29r0k41J34J93k12j74J54J9j05n6L68k46J8r6j46
6683a86L82l01K12L2l41L33k45K48j8j15p3rJ65k71J81J84k8J13l63J40p3J87
6705A54j7j39o5K9L7m5k4O5M5q5j3L1pk2K17k34R3J05j39K62q6l99J31J58j34
6730h2J01p9J76J26l61O2k11J55L02L5j22O3p7m1l69k7N96j83k01L05K8O8k42
6753B2Lj39K10j58MJ18k35n3J04J31K70j23J4o83L70M7j31R3J82p6J37Q7k17K23
$$ plain form
6590 -33 -15 181 -76 -227 -93 146 410 -109 -16 -87 15 3 49 172 177 48 -34 -195 66 -37 23 15 67 -255
6614 -255 -150 69 -121 115 -147 -265 197 -199 139 35 -18 -2 34 -113 71 -85 57 102 75 28 -163 203
6636 203 247 -175 -31 -124 -69 195 -91 70 -74 61 28 61 -138 4 -161 -272 -57 -44 -191 -134 -52 30 -1
6659 -1 -23 228 -29 43 22 -69 -69 165 294 204 -37 97 290 78 -96 58 77 -28 -84 284 38 56 -40 -186
6683 -186 196 -105 107 139 -202 131 -114 134 116 1 -72 -81 84 -187 -6 178 150 263 -100 40 -33 154
6705 154 137 -2 -67 -38 -1 -46 -70 -5 40 -45 -58 -27 -34 -56 161 -73 20 125 -14 248 162 -237 -106 52 -82
6730 -82 19 -60 116 242 -119 -57 -268 -113 189 224 102 165 88 47 -322 -349 247 64 -137 168 196 264 22
6753 22 25 -114 96 -62 -58 60 -175 -228 -124 7 277 154 168 -515 -145 -98 -229 -136 46 -30 107 194 -23 200
6777B00n54J92L36n5k40M01j61k73Q3L2k60J60j1J70O5j31K1J62l43N7J89k22
6799a82J38Nj25K76j93Q9r6J73P6j91K26k83J10j17J45k47L94m28K72j98J54M2
6821D0L5j99J05J23k25J52p9J08N4l36K82p7p1K9R5K71l87K84j18j79J37J94j36
6844A02l14N02l87K96k98J65k01J49k01L3j10J86j31J65j68L35m8j02q6J87j45
6865g1O5K1k13K36lj64K58o2j78K38r1nj4J63k94K22J4k78J57%n3J73j95R1p5
6890e8J04j77K48m7k71rj99N01L2p5r0JJ81m24L43j45K12j92M8J54k16l4M55l22
6914B0l15K84N3j00J5j68K81r6qr0K06k00J30o7k2J62j53j04K37k46K51j29k6
6937h5r4J27J49j62o4K6O2J57k14J76p7j52J36J65r4k40L90l52J03K67j13m47
$$ plain form
6777 200 -354 -162 174 119 -121 280 119 -154 -71 -39 -299 -139 -150 20 85 -46 -25 137 -206 -149 40 -182
6799 -182 -44 -39 -164 112 -81 8 -88 85 161 -30 196 -87 23 -94 51 -196 198 -230 42 -156 -2 40
6821 40 75 -124 -19 104 -121 31 -48 60 114 -222 60 -17 -88 -59 36 307 -80 204 86 -93 44 238 102
6844 102 -212 290 -97 199 -99 66 -135 14 -187 -154 -264 -78 -209 -44 -212 123 75 -27 -113 74 -71
6865 -71 -6 15 -198 38 35 -129 129 67 -111 127 36 31 17 180 -114 108 122 -156 1 1 -52 121 -74 17 -58
6890 -58 46 -131 117 70 -201 -210 -409 92 124 49 -41 -40 141 -283 60 -85 127 -65 -17 137 -79 -113 342 20
6914 20 -295 -11 42 -58 -43 -211 70 -26 -34 -124 82 -118 12 -55 -77 85 -68 -172 65 -181 70 -59 -85
6937 -85 -179 -52 97 -65 -129 -103 -41 116 -98 78 1 -151 -15 150 56 -184 206 -146 -43 224 111 -336
6959c36K80J33k95K57j84L94n40N66n7k91k5J61k3j10R6j41L05j89L7j12J56k60
6981a78J07n2K08Jl30L5J83O1J45j54j3K12p7K0n9j27O5l6j83M19m9k96L07j06
7005A03r4L9k01K22j7p3J68k04K5m4N3R0j5j67K62k94K44l49K12K00m1R5l03J20
7029C1J06j07J15j1m54L08L7R8j27k5j37K22k27K27J95q0k72j66K07J3J24jj16
7052d0k26R8L65l1l13N0K16q2m10O02n1j49p9k64J85K37j56J73O0k2k41j6J89
7075I5o2M1o7n2j7J70k41J56K01j01j12k23K92nk6l0j40J17N6l3j48K79j60j55
7099a65L34p2k48J16Q2J24j88N7k27K74L9O0j15k52p3L7O5J96J05k10K89k58J18
7122H8M0j30j44J53K30m12r9K77J29j06L8l21M17jj5J47j74J5m7Pj49K33k93O6
$$ plain form
6959 -336 -56 77 -218 39 -145 249 -291 275 218 -73 -98 63 40 -70 26 -115 190 1 38 -74 82 -178
6981 -178 -71 -123 85 86 -244 -209 -26 35 180 26 13 225 148 168 109 -18 47 11 -172 247 198 -98 209 103
7005 103 9 48 -153 69 52 -21 147 -57 -32 -76 -23 67 52 -115 147 -147 97 -252 -40 160 119 214 -89 31
7029 31 137 30 145 134 -320 -12 25 123 -4 -29 -166 56 -171 56 251 171 -101 -267 -60 -47 77 76 -40
7052 -40 -266 -168 197 166 -147 -97 119 37 -373 229 178 29 -50 -314 -129 108 -48 125 185 163 -78 -94 95
7075 95 33 74 7 -45 -62 108 -133 23 224 123 11 -212 80 75 49 19 -121 -4 52 19 -129 150 -10 -165
7099 -165 169 97 -151 -35 47 171 -17 40 -187 87 126 186 71 -181 -254 -217 -152 44 149 -61 228 -30 88
7122 88 128 -2 -146 7 237 -175 -274 3 132 26 64 -257 160 159 144 291 117 132 85 92 -57 176 -117 -51
7146e1O0j83J8P9J68m1m9J2m6R7J5k96J11l0K37m04M85j94K23j71n9r8J01O4L2
7171H0K09k74m9j73L72m15J77J18r3k3oM3K61k21J75r5K7K7l57J60R4j34j2K34
7195A25n8R7j15r8K27j90M3K95l02j24p8M38l41J94R7l55J69j25J72l36N77l1
7217B81j77p5j90Q5J15n9J6O6j04k0k17M66P7l16r7L18l50P9J10K46k70k55M26
7240A55j31J76k79j56K26j2J34J52j9l35L28j74m2j39l8KJ47K7J78r4j84J37l5
7263B4n5j80J55J65j30K79j20k36p0K51k02K52J19j17n3N8j56j57J74l6k37J67
7285a05K06k9O8q7O2J7k10J62r9J5K2j36J84j17m6Q0jj2l9n3K35m8%r3k2P1j59
7312a34K94k91J54r4L10j63j11l05K48L46k18Qj48L7J63K5J75l00J50j58J63j27
$$ plain form
7146 -51 9 -174 -156 -77 91 50 1 13 -33 64 79 -217 -106 -136 101 -303 182 -12 211 40 -19 -117 -16 48 80
7171 80 289 15 -34 -207 165 -250 -73 45 -48 -71 -77 -34 227 6 181 86 113 140 -217 -57 37 -97 -109 125
7195 125 67 164 49 -49 178 -12 31 326 24 -100 -178 260 -81 113 210 -145 24 -101 71 -265 312 281
7217 281 104 29 -161 -76 39 -20 -4 62 -42 -62 -279 187 264 -52 -149 169 -181 -102 8 254 -16 -271 155
7240 155 24 200 -79 -235 -9 -21 113 265 246 -89 239 65 23 -116 -154 -152 -5 22 200 106 -78 59 24
7263 24 -31 -211 -56 109 -21 258 138 -98 -168 83 -119 133 252 135 82 140 -16 -173 1 -35 -272 -105
7285 -105 101 72 140 53 115 132 -78 84 -15 0 22 -114 70 -47 -93 -13 -14 -26 -65 -118 117 69 69 -24 -46 25 -134
7312 -134 160 -131 23 -71 239 76 -35 -340 -92 254 36 44 -104 -67 96 121 296 -4 146 -12 151 24
7334B4l3n8J39Q0k07j5j05J94J73k22k1K4j47J65O2k98K32k24K50Q9j01R1O6k72
7358a14J65j87J18kJ75N4k44lJ02j32K15k41J53q9n9L2nk32J2L07m8J40k08R5
7382Dk79M43j09J7j19j05M32l86J69J62j77j19j12L09j11j24J46k8M7J42j80J5
7404C7J48n8o3k92M24l79Q6J6k29M42N5l12J33l5n0J21Oj56M28m11L21k21L7j71
7428a23O2M61m84K81j58J57n72L73j11L49p6k6k5o5P9j40j7P3j19O5J07k9p7l7
7452e2Mm2p1M28j36j59j99m4L98l16J14K91q6q6j98J22K31l11K29k23R2K30k81
7475f5nn3K06m8l02P6K47l6k50J22K39J15k81k2J80l21J6K5K86j51j23L19j37
7498C7K16m18K49m05J93K32o4k43L60M8k2k02l7J89l2j56N3K2j12J46j27K80j93
$$ plain form
7334 24 -9 -67 72 152 -55 -70 -175 19 192 -30 -51 -27 -174 -9 53 -245 -13 -237 13 102 1 92 158 -114
7358 -114 51 -136 -18 -20 155 209 -35 -38 64 -68 147 -94 59 -30 -89 -57 -62 -294 -282 25 -23 117 -91 4
7382 4 -275 168 59 76 -43 -148 284 -102 67 229 52 -67 -179 130 19 -105 41 13 60 202 22 37
7404 37 185 127 64 -228 196 -183 -97 -81 -310 132 187 -125 8 -27 -77 44 50 -106 322 -89 232 11 48 -123
7428 -123 -61 400 -84 197 39 196 -376 -3 -114 235 159 133 108 43 122 -18 -35 38 -81 -16 91 62 -15 -52
7452 -52 -48 -90 -161 267 131 -28 -227 -271 127 -189 -75 216 130 44 -154 -32 199 -112 117 -106 -14 216 -65
7475 -65 -70 -123 83 35 -267 -191 56 20 -230 -108 131 246 -35 -57 123 -198 -182 -157 129 -22 -145 174 37
7498 37 253 -165 84 -321 -128 104 40 -203 157 205 183 -19 -56 133 101 -55 -2 20 -92 54 -73 207 14
7521A4K10l05K10l37K21J52p5RJ25l92N1L44j49j14L9J62j23l1j3J41k16J46j19
7544e0J14k59K73n0j77r0J47n9K11M6J34qk18N9M6J69k43J32l64K54K4k99N10
7567C02m0m71K56k73N28m17J77o0K1o1J02P9M2j19O6n6K46l66q9L55k61m1k4J32
7591B8J34j02k04k25K55j32K36L9j11q3K89r6j39j66M22k02%L1j06L6K53k26K08
7614A39k06J4K7J10k66K88j5l14M61l36J91qj08O2J89k30p5J7K53j4M0j42J35
7637B12l76J21p1O2K96k02j14j52J95K28m25K60k8J19j87o3Q4N6%o9QJ4oL55o7
7662B50j4k36Q3o1o9P8Q7j44l8P5j24j18K79Q7J3l4k7L8j71K68j38oo7j4p7L0
7688e0L0O0n8K30k65K7J50j1rk63N0p8K97k21J54l54L10j39O0M6K36k00K21k11
$$ plain form
7521 14 224 -81 129 -208 13 165 90 99 224 -168 -117 227 78 -36 3 165 42 11 -2 139 -77 69 -50
7544 -50 64 -195 78 28 -149 -239 -92 -151 60 106 240 232 14 73 119 288 45 177 -187 67 91 -208 302
7567 302 262 -209 47 -226 302 -115 62 2 23 -38 64 143 185 66 132 76 322 -44 -133 222 -39 -80 -104 28
7591 28 162 60 -144 -369 -114 -246 -10 29 -82 -165 124 28 -111 -277 145 -57 -57 -26 -132 -96 157 -69 139
7614 139 -67 -53 -26 84 -182 106 91 -223 238 -98 93 85 -23 39 228 -2 -77 -60 193 179 219 77 212
7637 212 -164 -43 -114 -52 244 42 -72 -224 -29 199 -226 34 6 125 -62 -125 -41 15 15 -54 -46 -32 -38 317 250
7662 250 236 0 83 22 -47 31 118 -26 -64 11 -113 -231 48 135 148 114 87 125 -46 222 84 78 11 -3 -80 -50
7688 -50 -20 40 -18 212 -53 -26 124 113 104 -159 -109 -187 110 -111 43 -311 -1 -140 -80 -34 202 2 223 12
7712A2J46k81Q1q5O4N0j2J17o6K2N9J13k68L7o2J2k6K32k84O9L2o3L38k06O0N9
7738A50j20j29K1K49j16M4K12l10l4P6j15Q0M1Q0k80K36J13j16k89J43k56L36
7760A6j13J27m6J2Nn0N4j50J98j85L12j41k50L55j33PL23n97K25j1J07L0J93r0
7784A98k29K11l16J82k06K72L9l20K10%k16L33k49K27J57m83K13J71k66M0pL17
7806B78l13J73l39L73k52j9J81j00J2J85j34j45R8m1NJ27l48K04P1j11K94l08
7828a09R2k64P4K60j48J38m0l9q7J07J0N3j38O7%n6Q1J69j22q4J26j98J90J65
7852B47k83j29K83j41L4J17O1j61o3r6K21j14l2L89j77n06K82L16l37M5J59N3
7874A68J05k75J23Jr0m2k66M7N05m11M21m54K24R2J7j95l9K20K1j10j86L27l65
$$ plain form
7712 12 158 -123 -42 -127 -63 -13 -25 92 26 48 107 220 -48 -11 -73 -61 -87 145 -139 -70 -38 -101 237 31 91 150
7738 150 30 -99 -78 171 55 99 311 1 -33 43 -72 8 49 129 -151 85 198 82 -207 -64 -320 16
7760 16 -97 30 -16 -4 1 -49 5 -145 53 -132 180 39 -211 144 11 18 341 -256 -31 -42 65 95 288 198
7784 198 -31 180 -136 46 -160 112 151 -169 41 41 -175 158 -91 136 293 -190 23 194 -72 -32 -39 278
7806 278 -35 138 -201 172 -80 -99 82 -18 -6 179 45 -100 -2 -43 -38 89 -259 -55 16 -95 199 -109
7828 -109 -17 -281 -207 53 -95 43 3 -36 -123 -16 -6 47 -91 -24 -24 -80 1 170 48 -36 90 -108 82 247
7852 247 -36 -165 118 -23 11 128 189 28 -35 -131 90 -24 -56 333 156 -350 -68 248 -89 -44 115 168
7874 168 273 -2 121 122 32 -10 -276 -229 276 -135 286 -168 56 148 165 -30 -69 151 172 62 -124 203 -162
7897a62L02j71j17K45m5OL4j91J75nk35J76J77l0l2j46M0L4k05J31J34k25O9n7
7921i8o9r9J65J99J49l98L67n37L17J89k74k9J26n8P8k45J50%oK93k66J15M7l42
7945b26J96L22k90Oj69O6l6K58k66K81k77K23q9j04K00o5k7K5n6j23o6K24k15
7968b08j6L16J7k0m33JM38M6Mk14K25j49L3O3p7mm90M30l8J74k09KL5j0J71j89
7994a02K33j66p9j03J45kK25m17O6K93K13n14J60r0J91J7k2J19j05l4J11ll01
8017a65J40l7M9R9l46J74J19N8j58j56K31o1P2J64l0l60K87j38J05P2J90l40J78
8040A47j54j22M9J10j76J71k74L1M6J97K66l80M3M3O5j30Q0rj19K43k96j10J99
8063h0L18j90Jr0j8J35r1J74j88R7j09P8o0j02L52j28J18M3ln14L93k65L07j09
$$ plain form
7897 -162 140 -31 -148 97 52 58 92 -99 76 71 -164 12 189 159 127 -19 21 55 -150 -19 115 -110 -41 -98
7921 -98 -167 -266 -101 98 247 -151 216 -321 -4 185 -89 -118 8 -50 28 -217 -67 -67 -73 220 -46 69 116 -226
7945 -226 -30 292 2 8 -161 -95 -131 127 -139 142 -135 88 -1 -105 95 30 3 28 -28 -151 -217 7 -208
7968 -208 -224 92 109 89 -344 -343 95 141 145 -69 156 7 40 103 26 22 -468 -38 -76 98 -111 -109 -74 -84 87 -102
7994 -102 131 -35 -114 -217 -72 -74 151 -266 -200 93 306 -208 -48 -138 53 70 48 167 62 28 139 136 -165
8017 -165 -25 -62 -13 86 -260 -86 33 91 -67 -223 8 -53 19 183 153 -207 80 -58 47 119 309 -31 147
8040 147 -7 -129 -80 30 -146 25 -249 -218 -172 25 291 -89 -46 -3 62 -68 12 3 -116 127 -169 -279 -80
8063 -80 238 48 49 -41 -59 76 -15 159 -29 68 -41 37 -23 -125 227 99 217 260 257 -257 136 -129 178 69
8087F9m01K54rO0j96L25r8J01J74m1k68M3K84j74j5l5j42K05n3m9J69l24L69k27
8111B1k1Jj56K40j16k17L87j26l57J87K92j06K77n44J86J77j41J83k94j53K17
8132f3j5J20nJ01j96J44M4J72m52L37j78k32K61q0k25M41k61J33j53R2q5%k34
8155c34J16Q9K25k87L91l14J95j28J91j25k03Q2LQ9K2l7J6n6R5j89J69j7p8oL15
8180B24j99j37K96l10J70o9K95k21J56o1N
$$ plain form
8087 69 -332 -78 -87 -27 -223 102 4 105 279 238 -30 13 297 123 108 73 -69 136 83 34 203 -121 248 21
8111 21 0 1 -155 85 -31 -248 139 13 -344 -157 135 29 306 -238 -52 125 -16 167 -127 -280 -63
8132 -63 -78 42 37 138 -58 86 130 302 -150 187 9 -223 38 -42 -267 174 -87 46 -107 -15 -100 -100 -334
8155 -334 -218 -129 96 -191 200 -114 81 -47 144 19 -184 -102 -99 -10 12 -25 -9 -65 30 -159 10 -7 -85 -91 224
8180 224 25 -112 184 -126 44 -25 270 49 205 144 149
8191A49
$$ Imaginary data points
##PAGE= N=2
##DATA TABLE= (X++(I..I)), XYDATA
0@%%%%%%%%%%%nJ3j6J6j6K4l2M0m8N6o6P4q8J04j23J44j67J92k19K50k87L27l70
34a97M18m70N28n92O61p36Q20r11J011j119J237j367J509j666J836k022K227k452
52a285K704k983L296l650M051m512N047n679O435p363Q533j0051J2119j5107J9809
67A1364k8309M8304j78369j17572K98141k00736n8817J97233m6754n8128P95j42502
79b75350J46343J85037q3955l1343j7665k7137J62882j1917r7955J17631L7391
90A03962O163P8563j62295n6240J97333j796k6446M9976j37664j4198P8644j22271
102f269J0789J08745o6706j1239n6233j52359P9291R1766m2953L2877q3678j00157
114a96126J20158n193q1465R0113m981j1823Q8469r0333m3200J31624o28K3633
$$ plain form
0 0 0 0 0 0 0 0 0 0 0 0 0 -5 8 -8 8 -8 16 -16 24 -24 32 -34 40 -48 56 -67 77 -90 102 -117 133 -154 173 -197
34 -197 221 -249 279 -313 348 -388 432 -479 532 -587 650 -717 792 -874 962 -1060 1167 -1285
52 -1285 1419 -1564 1732 -1918 2133 -2379 2668 -3011 3424 -3939 4594 -5457 6662 -8445 11364
67 11364 -16945 31359 -147010 -264582 33559 -167177 -225994 -28761 -75515 -133643 -132848 -275350
79 -275350 -129007 56030 -27925 -59268 -76933 -104070 58812 46895 -51060 66571 103962
90 103962 110125 188688 26393 -29847 167486 165690 139244 189220 51556 37358 116002 -6269
102 -6269 4520 113265 46559 35320 -20913 -173272 -93981 -2215 -45168 -12291 -95969 -196126
114 -196126 -75968 -81161 -162626 -72513 -77494 -89317 -848 -91181 -134381 -2757 -3385 20248
126B0248Q1559p8568Q888O8200q8408K3299R1723k6781M9128j1405j46360L1171
138B2694P6767k0629M2062m0794j00065L3400k2127n2256O1844k0468l5674M4173
150a1073p2585n1269O8581j6734j53N0889n6032k544N7798m9245j365N7860L806
163b2066N0842K2373o9689O125L3767Q963O5664M920m7486K2323j8366k9538N1139
176G8971M918r267K5512o1195m9544L1907j2625n44K2357n1172j6860K0067m0517
189e7992o239J5692k3365K8831J6408m9493j266O225j2576N0219K3079k1098K4794
202f781n826k7397L7297K2101J1864M1158k0762l4402J9576L558J4538L4587k1609
215F7902j9391R709k2593p395J1893j7424K159M548l2860j4136m964j9860Q649
$$ plain form
126 20248 101807 23239 32127 100327 11919 35218 126941 100160 149288 137883 -8477 22694
138 22694 99461 78832 120894 80100 -19965 13435 -8692 -60948 896 -19572 -55246 -11073
150 -11073 -83658 -134927 -66346 -83080 -83233 -32344 -88376 -90920 -33122 -82367 -83732 -25872 -22066
163 -22066 28776 51149 -18540 -12415 21352 30315 95979 100899 53413 75736 57370 27832 78971
176 78971 83889 74622 100134 38939 -10605 21302 8677 8133 30490 -20682 -37542 -17475 -57992
189 -57992 -64231 -48539 -71904 -43073 -26665 -76158 -77424 -71199 -83775 -33556 -10477 -31575 -6781
202 -6781 -12607 -40004 -2707 19394 31258 72416 51654 17252 36828 40386 54924 89511 67902
215 67902 48511 58220 35627 28232 40125 22701 24860 29408 -3452 -17588 -22552 -42412 -33763
228c3763P048j4532M208p134k4582J115O211J1606K8473j797j7701k8M62J7560
242b2854L3020Q469P87L673q493N925J4484N394J5537O105j5886l976j506o747
256C3932Q040J76j1363n58r073j8106q205j1124n052J1003l324j4076j0098j4943
270e2771k593J4444O407Q10J249j0059n716Q671J1375J5982J4669r49l990M501
284B030O479J1029J3371L744r87J826j013k651J680J720J136K939m286j2147r142
299A5728p692n848Q18r21o908p475j3254j1155K498M689K421K334p653j1705J440
314d2683O162Q145R918K160J23M391J544O243J1625O484N312M942j842J039L547
329B7110m30M546N696j425j907l404r120n390NJ044n62q118j1741q340n647J21
$$ plain form
228 -33763 -26715 -41247 -37039 -44173 -68755 -67640 -61429 -49823 -21350 -23147 -40848 -40876 -40414 -22854
242 -22854 10166 18635 19422 23095 14602 20527 35011 40405 55942 62047 46161 42185 40679 33932
256 33932 41972 42148 30785 30227 21154 3048 -5157 -16281 -21333 -10330 -13654 -27730 -37828 -52771
270 -52771 -55364 -40920 -34513 -33703 -32454 -42513 -48229 -39558 -28183 -12201 2468 1519 -2471 2030
284 2030 8509 19538 32909 36653 35666 37492 36479 33828 35508 37228 38364 41303 37017 24870 15728
299 15728 8036 2188 3006 2085 -4823 -12298 -25552 -36707 -34209 -29520 -27099 -24765 -32418 -44123 -42683
314 -42683 -36521 -28376 -18458 -16298 -16175 -11784 -10240 -3997 7628 14112 19424 24366 22524 23563 27110
329 27110 26680 31226 36922 35497 33590 30186 21066 15676 15681 16725 16163 8045 -3696 -12036 -17683 -17562
345a7562L467j653m828o789p343N16L790K608N811J041m322K680M255L306J0309
360d714N557J543P199K398j544N535L890K162P866P33l591j023m418j434N636
375B5795q30m287k893j0335q527k31j464j462m08q783q634j763j485M16M067n08
391b1332l267k94m95R37M978M533M504N172K168J059M033M305M379O468M363L65
407B1876K20k420j495M270L782Q2q83n484p268k182j262j290j159n778p669m388
423a1048n456j569K831j256k587o03l908j875K271J087L221M177O85K321K552
438i157J566N400O448M975N622o52r61J887j2L902N952j654j303p27o558J51L247
455A8126n235j050k053j1581l061l88o747K602P20p538J174j831p116M682J321
$$ plain form
345 -17562 -14095 -15748 -20576 -27365 -34708 -34192 -30402 -27794 -21983 -20942 -25264 -22584 -18329 -15023 -4714
360 -4714 843 2386 9585 11983 10439 15974 19864 22026 29892 30625 27034 26011 21593 20159 25795
375 25795 24965 20678 17785 7450 -1077 -1308 -2772 -4234 -4642 -13425 -22059 -23822 -25307 -24891 -20824 -21332
391 -21332 -24599 -24893 -25388 -24451 -19473 -14940 -10436 -5264 -3096 -2037 1996 6301 10680 17148 21511 21876
407 21876 22096 19676 18181 22451 26233 26315 25432 19948 12680 10498 9236 7946 6787 1009 -6660 -11048
423 -11048 -16504 -18073 -15242 -16498 -19085 -19688 -23596 -25471 -23200 -22113 -18892 -14715 -14030 -11709 -9157
438 -9157 -7591 -2191 4257 9232 14854 14202 13241 15128 15116 19018 24970 23316 22013 21286 14728 14879 18126
455 18126 12891 11841 9788 -1793 -4854 -5242 -11989 -9387 -8667 -16205 -15031 -16862 -23978 -19296 -17975
470a7975l552O982K72m643O406P68J486J1793J211L98P773m826j268J0487j073
485A4239J464P357o627k176M379n096K331M519q781j410p25j0860Q26R38o932
500f554K722k170q029K608k849n436P162j353l680N329m312j816P538j403M535
515g708R436n306J393P367n561N317Q924n106M441K726p951N585L440o288P076
530A7785q78r573M277l950p479P890m768p942P333p207q156P334n387l362P974
545f109p001k242O219q940K471J0529p008L020Q446q564L152P548m453P543N468
560A0079p667O912K057p459R430K111o948O848k764p078P019l647n073P645o201
575E264n684M575p924k860N260p587J032M215j0644J471N500q170N285N064p999
$$ plain form
470 -17975 -21527 -14545 -14273 -18916 -12510 -11742 -10256 1537 2748 3146 10919 6093 4825 15312 14239
485 14239 15703 23060 16433 14257 18636 13540 15871 20390 11609 10199 9474 -1386 -560 378 -6554
500 -6554 -3832 -6002 -14031 -11423 -14272 -19708 -12546 -13899 -17579 -12250 -16562 -18378 -10840 -12243 -7708
515 -7708 1728 -3578 -2185 5182 -379 4938 13862 8756 13197 15923 7972 13557 16997 10709 17785
530 17785 16907 7334 11611 7661 182 8072 3304 -4638 2695 -4512 -12668 -5334 -10721 -14083 -6109
545 -6109 -13110 -15352 -9133 -18073 -15602 -5073 -12081 -9061 -615 -9179 -6027 1521 -2932 4611 10079
560 10079 2412 9324 11381 3922 13352 15463 8515 15363 12599 5521 12540 8893 3820 11465 5264
575 5264 -420 4155 -3769 -6629 -1369 -8956 -7924 -3709 -14353 -12882 -7382 -15552 -10267 -5203 -13202
590a3202M545K221o179Q851K301m006R797o24n371J0379k012l361J1230l997m447
605F125Q549o452l000R594o432j945O878r416j839M424r933J369M379r955K097
620e557J344j0365O115K878q495P325J027r698P591J022o093R999J60m603R674
635B324k241k499J0423k409j696Q474n552j383O740o143J643O152p558J770L788
650A1833j0198K581L057r418L326O88r097K940j41o484O493j768n092O260l686
665h706m103Q245l671j575R035m896o25Q505m714J244Q989n694J580O328o826
680C116K958M980o833M094L210p887M007P22p811O155q09p775N095k669p901O700
696f48k310n324O431l611n002O094l373j809O653l987o11N885m839J509O030m274
$$ plain form
590 -13202 -8657 -6436 -12615 -3764 -1463 -5469 4328 3704 -1667 8712 6700 3339 14569 10572 6125
605 6125 14674 8222 5222 14816 8384 6439 13317 3901 2062 6486 -3447 -2078 2301 -7654 -5557
620 -5557 -4213 -14578 -8463 -5585 -14080 -6755 -5728 -15426 -7835 -6813 -12906 -2907 -2747 -7350 2324
635 2324 83 -2416 8007 5598 3902 12376 6824 5441 12181 6038 7681 13833 6275 8045 11833
650 11833 1635 4216 7273 -2145 1181 1869 -7228 -4288 -4429 -10913 -4420 -6188 -11280 -5020 -8706
665 -8706 -12809 -4564 -8235 -9810 -775 -5671 -6296 2209 -2505 -1261 7728 2034 3614 9942 3116
680 3116 6074 11054 4221 8315 11525 3638 7645 8367 556 6711 5902 -1873 3222 553 -7348 -648
696 -648 -2958 -8282 -1851 -5462 -10464 -4370 -7743 -9552 -2899 -6886 -7497 -1612 -6451 -4942 1088 -3186
712c186L181M917n149L153L297m837M967K221m930M371n67m945M655j243l696
727B209M738l161m112L961m415k110M874n168j354L526o141k33M979m808J036
742f179L889n182J573L112l841L551K856m295M346J435m152N569J031k514N234
757F433j209l047M958k128k432N630k546l051M413l793k311L836l498p65K824
772C314n406r80K166m635O95K192l292J401N94l822L218N54k729M078N70l641
788e723L196J629j755L842Q40l24K900j093r50L089q17J85J688j993K33N63k771
805B739J474J369l472P24k48m185L79q0k797J708r42k783J517j195k002L921k88
822d161k142K723q05j631K755K17R26L463m18k68K382n76J009K394r76R93J148
$$ plain form
712 -3186 -5 4912 -237 2916 6213 1376 6343 8564 3634 8005 7438 2493 7148 5905 2209
727 2209 6947 3786 -326 3635 -780 -2890 1984 -3184 -4538 -1012 -7153 -7386 -2407 -7215 -6179
742 -6179 -2290 -7472 -5899 -2787 -6628 -3077 -221 -4516 -170 1265 -2887 2682 3713 1199 6433
757 6433 5224 2177 7135 5007 2575 8205 5659 2608 7021 3228 917 4753 1255 490 3314
772 3314 -2092 -3072 -906 -5541 -4846 -2654 -5946 -4545 -3951 -7773 -4555 -4001 -6730 -2652 -2082 -5723
788 -5723 -2527 -898 -2653 1189 2029 1705 4605 3512 2562 5651 4834 5019 6707 4714 4947 5510 2739
805 2739 4213 5582 2110 2834 2586 -1599 -1220 -1300 -4097 -2389 -3331 -6114 -4597 -5792 -7794 -3873 -4161
822 -4161 -6303 -3580 -4385 -6016 -3261 -3044 -2118 1345 927 659 3041 2465 3474 5868 4892 5885 7033
839G033l128N39K020j685J6J018k459r67r29k062j6l74j269j8j372k157K26M90
857e094r44Q82O91q14j56k25M45K105J199O59Q86N37O48K48R21K306J197q33J37
876D795L94l6j54J93K73N55j864j862J01p72j436P56m72k537m02p82j550l8P47
895d091k9k84o75p49L96Q99N20J089J369K65k11m2J243K138j07R46J544k08r07
914C106N51J017M03O81q00j292J00j233p26Q22q05k54n77k300n50k65j151O46
932b627K3j784j1K55k011P81K632o89J57J392j063p2J482r3J881J730l55k89J053
951B392M06P78Q70N02K77q87j074M6l37O56K26r17p97o94j170q99l71K4P2j568
971b465j526K02l99m86J088J1o6O14q80q17J795P39Q4J588N59r11J377N42Q97
$$ plain form
839 7033 3905 4444 6464 4779 4795 5813 3354 2387 1458 -604 -620 -994 -2263 -2281 -3653 -5810 -5584 -5094
857 -5094 -6038 -5156 -4465 -5279 -5435 -5660 -5215 -3110 -1911 -1252 -366 171 819 1067 1988 4294 5491 4658 4795
876 4795 5189 5153 4999 5192 5465 6020 4156 2294 2395 1623 187 943 471 -2066 -2468 -3250 -4800 -4838 -4091
895 -4091 -4120 -4404 -5079 -5828 -5432 -4533 -4013 -2924 -1555 -1290 -1501 -1543 -300 1838 1731 2677 4221 4013 3106
914 3106 3657 4674 5077 5758 4958 3666 3766 2533 1807 2629 1824 1570 993 -1307 -1857 -2122 -3273 -2627
932 -2627 -2604 -4388 -4399 -4144 -6155 -5374 -2742 -3431 -3274 -1882 -2945 -3017 -1535 -1628 253 1983 1628 1339 2392
951 2392 2798 3576 4446 4948 5225 4338 3264 3310 2973 3629 3855 2938 2141 1447 277 -622 -993 -969 -897 -2465
971 -2465 -3991 -3789 -4188 -4674 -3586 -3575 -3641 -3027 -3907 -4724 -2929 -2190 -2106 -518 41 -870 507 1049 1946
990A946J272R86L1l43o31M14O18j46M65m2j183q67r01p10M71j51j717n48m16j922
1010c374r39R56M2l78k35o83k51P2N8J117J107K46M96K82k43J342J538N12J451
1029C116R3j78J63L66q5J406R84j339l60l97j187j28K23p87l32p28k189l35m75
1048b169o35J14k59o05j57j296m52J384K97K55J119m72l2Q21L58J718Q78L21Q27
1067B015K59l98J046P51rJ404r7j349N22j094o87J202o90j237M64j852j452J250
1085D8j188l61Q33k042r70N73j756O27J715j541Q51J162k287J387J620j129J873
1102e85J240j501J004N93q47K814P06j146K066r86j439J628l88n24J481j522r83
1119A611J038k325r0J490j380k61O03k791m63P90j908J060R02j738O15L6j505
$$ plain form
990 1946 3218 4204 4235 3892 3261 3675 4293 4147 4612 4570 3387 2520 1619 909 1380 1229 -488 -1036 -1452 -3374
1010 -3374 -4313 -3357 -3315 -3693 -3928 -4611 -4862 -4790 -4732 -3615 -2508 -2262 -1766 -1484 -1727 -385 1153 1665 3116
1029 3116 3209 3031 3194 3560 3475 4881 5865 4526 4166 3769 2582 2454 2677 1890 1558 830 -1359 -1694 -2169
1048 -2169 -2804 -2690 -2949 -3554 -3711 -5007 -5459 -4075 -3778 -3523 -2404 -2876 -2908 -2087 -1729 -11 867 1188 2015
1067 2015 2274 1876 2922 3673 3664 5068 4971 3622 4144 3050 2363 3565 2875 1638 2102 250 -1202 48
1085 48 -1140 -1501 -668 -2710 -3680 -3107 -4863 -4236 -2521 -4062 -3211 -2049 -4336 -2949 -1329 -2458 -585
1102 -585 655 -846 158 751 -96 2718 3424 2278 4344 3358 1919 3547 3159 2635 4116 2594 1611
1119 1611 2649 324 234 1724 344 83 686 -2105 -2568 -1778 -3686 -2626 -1724 -3462 -2847 -2811 -4316
1136d316K031K40q69K213r68j079K489p26O96K639j038j54J760j512M4K213j418
1153B245Q12J517k699L82J023k481J657J008k748J040o66l407K144m58j994K038
1169e87p59k488J543j099j163K881j051q02J888j931l7K571r78P76K798k007O04
1186A59J978j833J605J792j667J370L33k163K006M11j828K126j100k019J352j863
1202F59j445J988j115j475J554k352j133J664k232L29J999k723O45J020j972J720
1218b869J501j789K370Q94k245K145Q68j539L432O8j614K616r41j406L159j316
1234C334n99J975k418q85J541k589j0K330k842k61M09k715N45J020k276J092N53
1251a796k601J318jj317K624L01j104J603n50n86K157k17M16K577j767J25K148
$$ plain form
1136 -4316 -2285 -2045 -2914 -701 -1669 -2748 -259 -985 -289 2350 1312 1158 2918 1406 1450 3663 2245
1153 2245 3057 4574 1875 2257 3280 799 2456 3464 716 1756 1090 -2317 -173 -631 -2625 -587
1169 -587 -1346 -3834 -2291 -3390 -4553 -1672 -2723 -3525 -1637 -3568 -3605 -1034 -2012 -1236 1562 -445 159
1186 159 2137 304 1909 3701 2034 3404 3737 1574 3580 3991 2163 4289 3189 1170 2522 659
1202 659 -786 1202 87 -1388 166 -2186 -3319 -1655 -3887 -3558 -1559 -4282 -3637 -2617 -4589 -2869
1218 -2869 -1368 -3157 -787 107 -2138 7 875 -664 2768 2836 1222 3838 2897 1491 4650 3334
1234 3334 2735 4710 2292 1407 2948 359 349 2679 -163 -424 -15 -2730 -2185 -1165 -3441 -2349 -1796
1251 -1796 -4397 -3079 -3080 -4397 -1773 -1472 -2576 -973 -1523 -2109 48 -169 247 2824 1057 1182 3330
1268C330j817M35K358j662L92M67k313P38N48j384P94m46j656J238j300j921J875
1285c24p21j358J319j264j346J322q58O09J658j355J84J430j835P22J859j016
1301i74J081J175j539J163O77j208K000N56j163O64k82r39J544n38o03J072j363
1318A323q66Q27j103n68Q07q29m67j32j254J83M66r65J054L1j083K90M05o34J102
1337a413J88k64J077J45r60J237M01L49J295q03K78M30q70R06J084j044M45J47
1355B628j056K8l3m87O21p64j010M01q73j359R81j10p16J32j46p88J56m10M15
1374b390R11l88O5J94l6N01O61k29J156J83k85M91P66k78O45P46J15l27o76K80
1394B105J58o69K92L74j054o13k52l03l20m10l49K04p05j075L05n2j05Q92m48
$$ plain form
1268 3330 1513 1948 4306 2644 3036 3503 1190 1928 2476 1092 1886 1440 -216 1022 -278 -2199 -324
1285 -324 -1045 -2403 -1084 -2348 -3694 -2372 -3230 -2621 -963 -2318 -2134 -704 -2539 -1817 42 -974
1301 -974 107 1282 -257 906 1583 375 2375 2931 1768 2432 2150 1211 2755 2217 1614 2686 1323
1318 1323 457 1284 181 -387 420 -409 -876 -1008 -2262 -2079 -1613 -2578 -1524 -1493 -2576 -2286 -1881 -2515 -1413
1337 -1413 -1225 -1489 -412 -267 -1227 10 411 760 2055 1252 1530 1960 1090 1996 3080 2036 2481 2628
1355 2628 1572 1600 1567 1080 1701 937 -73 328 -545 -1904 -923 -1033 -1749 -1617 -1763 -2551 -2395 -2805 -2390
1374 -2390 -1479 -1867 -1802 -1608 -1644 -1143 -482 -711 445 628 343 834 1600 1322 1967 2713 2828 2501 1825 2105
1394 2105 2263 1594 1886 2260 1206 593 341 38 -282 -692 -1041 -837 -1542 -2617 -2312 -2364 -2469 -1577 -2025
1413b025m22N38k81K3J289k04M39J139m00J95O53l3P25J017p36P23r8j183M20
1432A779O82l28K8j38q35l19n25j50K96m29o79l97p61j44L58m62L35K00o12O5
1452b036K02l24O36P22k21N55k6QL74L16K37J453o13n5N13p38L29R05j80k66M0
1473A831j041L25K56q23J14J91p79j06m39r03M40J68l20L30j57j145P11l21j20
1492a788P35J10k65L22m30k5J211K03J19O23o00M29N7Q7N47kN3K26j64l85O1K8
1514A152k53M80j79n89j35l75j40K77m84j72J03p07p1R4l93J31R2k43K45q8n26
1535a781O03M86l27P15l2m64M63N69k5O71N22m51M49k60J28J34j10M30m4n68k15
1556H93m0k94M67o3p16k61J70r66k81J87j77j74j41k01J62j56P7J49M25J80l9
$$ plain form
1413 -2025 -2447 -1909 -2190 -2167 -878 -1082 -643 496 96 291 944 911 1636 2653 1917 2640 2542 1359 1779
1432 1779 2461 2133 2161 2023 1188 869 344 194 490 61 -618 -1015 -1776 -1920 -1562 -2024 -1689 -1489 -2101 -2036
1452 -2036 -1834 -2158 -1522 -800 -1021 -466 -492 -484 -110 206 443 1896 1283 1228 1741 1003 1332 2237 2057 1791 1831
1473 1831 790 1115 1371 548 662 853 74 -32 -471 -1374 -934 -766 -1086 -756 -913 -2058 -1347 -1668 -1788
1492 -1788 -1053 -943 -1208 -886 -1316 -1341 -130 73 192 815 215 644 701 788 1335 1333 1386 1612 1448 1063 1124 1152
1514 1152 899 1379 1200 611 476 101 -39 238 -246 -418 -315 -1022 -1093 -999 -1392 -1261 -1169 -1412 -1167 -1255 -1781
1535 -1781 -1178 -692 -1019 -304 -336 -800 -337 232 207 878 1400 949 1398 1138 1266 1400 1290 1720 1676 1108 893
1556 893 853 559 1026 963 247 -14 156 -810 -1091 -904 -1081 -1255 -1396 -1597 -1435 -1591 -1514 -1365 -940 -760 -799
1577g99j69J38J90L72Q34K98J8J52j67M70j95L97j3K69k81m16j60j6J87m4k17
1598H48m33l62o62K3L9l11Nj70l54j91k69O05j18L58p2q8m6K66J31N72M26K8J23
1621C48L02J46j84M50L42J86m20l5k73j3J3K27L64n39J01p09l97l00M16m92nK28
1643b44o33j59J09n4j95L76j01J63n03K45J75J49M37O54l66j92N54k53K47M04
1663H13j38J79J26l50k05O88j68k23M39l36n39O4j45m5J2Q3K45o94m02N6j59L93
1685c06J08m30N0Ll19P0N88k68K63P5m65n6L44K5N92J28l71K13L5k21K76L67k80
1708D21Q34m95k22J39l38J94K22l36n8J56r00J66J89j58K89J10j152L42N4l52
1728h95J99M19n65L57l69k83L02M24k78N46M6k62L20k84N56L53O5J46M28m15j33
$$ plain form
1577 -799 -968 -830 -640 -268 566 864 882 1034 867 1337 1142 1539 1526 1795 1514 1098 938 922 1109 1065 848
1598 848 415 53 -609 -586 -547 -858 -853 -1023 -1377 -1568 -1837 -1232 -1350 -992 -1064 -1152 -1198 -932 -801 -229 197 225 348
1621 348 650 796 612 1062 1404 1590 1170 1135 862 849 862 1089 1453 914 1015 306 -91 -391 25 -467 -472 -244
1643 -244 -877 -1036 -927 -981 -1176 -800 -901 -738 -1241 -996 -821 -672 -235 419 53 -139 415 162 409 813
1663 813 675 854 980 630 425 1113 945 722 1161 825 286 350 205 160 172 255 500 -194 -596 -540 -699 -306
1685 -306 -198 -628 -578 -575 -894 -824 -236 -504 -241 -166 -631 -687 -343 -318 274 402 31 244 279 58 334 701 421
1708 421 1255 760 538 677 339 533 755 419 361 517 -383 -217 -28 -186 103 213 -939 -597 -543 -895
1728 -895 -696 -277 -842 -485 -854 -1137 -835 -411 -689 -143 -97 -359 -39 -323 233 586 651 797 1225 810 677
1749F77J40p0K96K91o23j33K22p33qJ76l76m8L00j142M02l80qO98m72j79K34n86
1771a322J86O50m9k86Q92p19K69P18m20L33O59q1k53J97o10M25K69j72J74J05
1791I65n89K72K7p82N01k6p66K10k79q68Q46j58n43P71n2l41J29k17LN21j62K4
1813e14N94n59l73J174j42N20j19k83M03j3p54J136k54n61O13r9n43n7l4M7M86
1834F68o30m03N11p14k45R92n58jL54o44O4M71r45Q54N17r47L63L18o69N43K90
1855A89m91R58m30p02Q95l1m42P24p4o20M28m80N9R78r56J60P49r10k23M61m82
1876b40K00M07n48K27no63K39J73m46P60l95q16R91m45k73J188o87k27P98n07
1896b69k82Q23n83M63M72o86L84M28j000P67K70o91O89M5o18N00m4n61N56J53
$$ plain form
1749 677 817 747 1043 1334 711 578 800 67 59 235 -141 -189 111 -1031 -629 -1009 -1017 -319 -791 -970 -736 -1322
1771 -1322 -1136 -486 -535 -821 71 -648 -379 339 -81 252 911 830 577 774 164 589 858 686 860 965
1791 965 376 648 675 -107 394 368 -398 -188 -467 -1335 -489 -647 -1190 -419 -471 -812 -683 -900 -897 -376 -538 -514
1813 -514 80 -479 -852 322 180 700 581 298 701 688 -66 1070 816 255 868 769 226 169 135 182 668
1834 668 38 -365 146 -568 -813 179 -379 -380 -26 -670 -606 -135 -1080 -226 291 -656 -293 25 -644 -101 189
1855 189 -302 656 226 -476 419 388 -54 670 596 -24 404 -76 -17 961 5 165 914 4 -219 242 -240
1876 -240 -40 367 -181 46 41 -622 -383 -210 -656 104 -291 -1107 -116 -561 -834 354 -333 -560 238 -269
1896 -269 -551 272 -311 152 624 -62 322 750 -250 517 787 96 785 830 212 712 668 107 663 816
1916H16r89N21n52o06J042j68q00O98n17k06O79p83K88N42n54n79J086q59L63
1935e78Q30o97N33K86q13O56L87p17J115k84m76P78m06n13O84k08L3K62q56o0
1955d4M60p68m7N75m67m2J09o78L51J56l56M32P2q15M44J47l98R04K10p43R29
1976D31n50m8P80j70j42O24k07l24N81r48M25Q10p43j03L20o42n1pn46P31J23
1997C44j002K20R5o27M98j18o9M47j66o88O94k95L23O44m20l7R5P3N7K62j52J25
2019C03N89q14K41m1pL31Q7n87K80k77k47J27J97m14M40q4p30N30o24L36K88j25
2041b01oK57m26K11Jk2O0J67n73L39M4l14M72M97o51L95l8n60O71k01K58J59j75
2064C64j05J99n58K8L55R9r6kj90j63O7j10j1M37n83J85j53j82j22J86K56J40
$$ plain form
1916 816 -173 348 -204 -810 232 64 -736 -38 -555 -761 -82 -865 -577 -35 -589 -1168 -82 -941 -578
1935 -578 252 -445 88 374 -439 217 604 -113 1002 718 242 1020 614 101 785 577 610 872 16 -44
1955 -44 416 -352 -399 176 -291 -333 -224 -902 -551 -395 -751 -319 -247 -1062 -618 -471 -869 35 245 -498 431
1976 431 -119 -167 613 443 301 925 718 394 975 27 452 1262 519 416 736 94 43 36 -510 221 344
1997 344 -658 -438 -343 -970 -472 -590 -659 -212 -378 -1066 -372 -667 -344 300 -120 -157 -62 11 68 330 178 303
2019 303 892 78 319 278 271 602 689 102 382 105 -142 -15 182 -232 208 124 -606 -76 -700 -364 -76 -201
2041 -201 -207 50 -376 -165 -164 -186 -126 41 -532 -193 -149 -463 9 506 -145 250 212 -348 323 122 380 539 364
2064 364 259 458 -100 -72 283 382 286 284 94 -69 -2 -112 -123 314 -269 -84 -237 -419 -541 -355 -99 41
2086D1k53n14K50Q1J04J43O8J18j24K8j29M35j85K36J8m8k12R4J12Q3O8j85K88
2109E17J33p22K44R0n22M21l92k15M58l33Q8J31J32k37k09l93K03j31N59m75P16
2130F3m05K12j01K78M2J10K17J58p0j87L8M9N7L72k77k60L12k75k55j9K80k44
2152I5j17j84l41Q5Q9l5K8q2j0j43O3j74M77o0L50m14K22P4mK37K15r0K3J82m3
2177D43n5M51l42j50L64j13k09m2n30O50n40o8M5Kk77k18nL35K14k80J18l98m
2200f09P3J05K55R3Jl4lj09J34M59j07j41J86Pp5j81K80M9J68j34l79K74Qj46
2224A74J92m15r1J70j24l42L35L60o22n4Q0k47K75Q5Oj79J47J75j49L2K3J89k08
2247a88J70j09J63n8j45K29K64j27K35k1l85R5K83l6k56M37k87k00j3j4R9J73
$$ plain form
2086 41 -212 -726 -476 -395 -291 -148 -80 38 -86 -58 -187 248 63 299 317 269 57 151 263 346 414 229 517
2109 517 650 -72 172 262 -260 161 -231 -446 12 -321 -233 -102 30 -207 -416 -809 -606 -737 -178 -653 63
2130 63 -342 -130 -231 47 89 199 416 574 504 317 355 404 461 833 556 296 608 333 78 59 339 95
2152 95 -22 -206 -547 -462 -373 -408 -380 -462 -472 -615 -552 -726 -249 -309 41 -373 -151 -77 -81 156 371 281 304 486 443
2177 443 388 839 497 347 711 598 389 347 -183 467 -73 -141 -96 -94 -371 -589 -594 -259 -45 -325 -207 -605 -609
2200 -609 -536 -431 -176 -83 -82 -116 -119 -228 -94 365 258 117 303 310 235 54 334 383 551 417 38 312 320 174
2224 174 366 -49 -140 30 -94 -436 -101 259 -363 -417 -337 -584 -309 -224 -218 -397 -250 -75 -224 -192 -169 20 -188
2247 -188 -18 -127 36 -22 -167 62 326 199 434 413 28 123 406 370 114 551 264 64 51 37 136 309
2269C09Jm83j38M6N8J49j96m0J1j84J63k78J55K58N1j96n9J94J12K6J84j84N35
2292D94k00j44m9J75K4J30J22j83J98k20k6L8o6k9J10k88j72P2p4j63k1k27K00
2315b99J23m31K32M5m05L78j01N0P4k1j23M64L65k27L89j53l00J36L45n52Q20
2336H09j93k79M03k97n9O8k09o0L18m57l8jk27K9J3j35k82Nl07M46J48k57K90
2359b72J51l90N1R4P8N96k44J64P9n7J59L7K4l17M72l71J30J97m58K65N27o99
2381B16J95j61m20K21k5n20M74j89k77K98l74KK06rk82L73K5n21N07j3p6O33k82
2404AO5K9R2p2M15o9J6J4o02O69l12KK85N2m22L38m83j2J22j00n7M00o92l81N18
2429a84j58K21L8j49k41K55m91Q5M35k76K84J81l28L49m0j73L31l4K24j0l09O
$$ plain form
2269 309 310 -173 -311 -265 -207 -58 -254 -294 -283 -467 -304 -582 -427 -169 -118 -314 -373 -179 -67 -41 143 -41 494
2292 494 294 150 101 276 300 430 552 369 567 347 321 359 293 264 374 86 -86 -14 -88 -251 -272 -499 -299
2315 -299 -176 -607 -375 -330 -735 -357 -458 -408 -334 -355 -478 -14 351 124 513 360 60 196 541 -11 809
2336 809 616 337 740 443 384 452 243 183 501 44 6 5 -222 -193 -180 -315 -597 -592 -899 -453 -305 -562 -272
2359 -272 -121 -511 -460 -366 -288 308 64 228 307 250 409 446 470 153 625 254 384 581 123 388 915 216
2381 216 411 250 -170 51 26 -494 -20 -209 -486 -188 -562 -560 -354 -363 -645 -272 -247 -768 -261 -274 -350 283 1
2404 1 66 95 187 115 530 461 477 491 -111 558 246 248 533 585 163 501 18 6 128 28 -29 371 -321 -702 -184
2429 -184 -342 -121 -83 -232 -473 -218 -709 -624 -189 -465 -181 0 -328 21 -19 -192 139 105 329 319 10 16
2451A6N24j50o8n0P8K55l57j35J35K37n31p1L88m21K04j29M6j58K83l87p4K24
2473a41n26L89P4J99p8k57k0J82j33j05M73jn9K76o01J55P43l38j82K48l09K22
2495B11J49k02L28M4j65l45K29l24J91j80L1j17k2k11J92J13m71L21M7m12K16
2516c77J4k56N12q3l73K86J64J01n4J03m7M08P4n0M4k19N4p0K78K46k01j97J26
2539D83l32j20J0L13k65j30J13o02n5K42j0Q6%j39n8r7j1K59J68m5J13r2K03j21
2563h7L68j54N33l77P1m1p3L69k34J09r0k9k93J38m4M4n7k67K23l63q7J01j41
2586c81j40J32N1j75N8R2Ro7J23o5K54j20r4j4M50P5k41N25m95M25o5q9j07J78
2610C19l2k45K40J47k41n2mO0q6k84O9J94q3R8j36k51O0J3m7K88n99N04j03j36
$$ plain form
2451 16 540 390 322 272 350 605 248 113 248 485 -46 -117 271 -150 54 -75 -29 -187 96 -291 -365 -141
2473 -141 -667 -278 -204 -5 -83 -340 -360 -178 -311 -416 57 56 -3 273 -328 -173 570 232 50 298 -11 211
2495 211 360 158 486 530 365 20 249 -75 116 -64 -33 -150 -172 -383 -191 -78 -549 -228 -181 -593 -377
2516 -377 -363 -619 -107 -190 -563 -277 -113 -12 -66 37 -10 398 472 422 466 247 301 231 509 755 554 357 483
2539 483 151 31 41 354 89 -41 72 -530 -585 -343 -353 -267 -267 -406 -464 -561 -572 -313 -145 -190 -77 -169 34 -87
2563 -87 281 127 660 283 354 313 240 609 375 484 394 365 72 210 166 210 153 -114 109 -254 -341 -240 -381
2586 -381 -521 -389 -338 -513 -455 -363 -354 -421 -298 -363 -109 -229 -323 -337 113 188 -53 472 -23 402 337 248 141 319
2610 319 287 42 282 429 188 136 132 192 106 -178 -109 85 2 100 -36 -287 -227 -214 -261 27 -572 -68 -171 -307
2634c07J43m4N6p5J39R1p9K04q1P1J25k50L92k28Q4J20j29k72M41P4k29P2k86
2657C2JM8J04j01K11k57j34k54L00o1J75l20M1R5j58j83K2L16k14k4m6M13k39
2680b33p1M30j45N8J81L77m57M74l77K04k3j7m0N5Q7l29j55K59j82L40k72k33
2702f9k29L66j48J7j99j72J36j51J62l6k00kM83l52J35K74l51M24K75p40K61K70
2724A54j84N79k52J8m7J50j1J22j4j09J02l60Q1p2l2L4k05j9j61j2q4K7j44R2
2748c47J9J97j69L35k31k85L09j76M67r4l0J53J18k93J47M57m1j78K96l08q1J12
2770C77k20J54R8k70OJ05m33L15l61k58K59J36j52M8M2k66M59l68J95l16M4K08
2792a98K81k52J57J46J06l65P3J12L51k17J65k86j99Q6j6J84J25P8k8l48K76l33
$$ plain form
2634 -307 -164 -208 -152 -227 -88 3 -76 128 47 118 243 -7 385 157 241 361 232 -40 401 475 246 318 32
2657 32 33 81 185 84 295 38 -96 -350 -50 -111 64 -256 -215 -120 -278 -461 -439 -123 -337 -361 -407 6 -233
2680 -233 -304 126 -19 39 220 597 140 614 237 441 418 401 361 416 503 174 19 278 96 436 164 -69
2702 -69 -298 68 -80 -63 -262 -434 -298 -449 -287 -323 -523 -525 -42 -394 -259 15 -336 88 363 -377 -116 154
2724 154 -30 549 297 315 268 418 407 529 515 406 508 148 229 157 125 159 -46 -65 -226 -238 -322 -295 -439 -347
2748 -347 -328 -131 -300 35 -196 -481 -172 -348 119 25 -5 148 266 -27 120 577 536 358 654 346 265 377
2770 377 157 311 409 139 145 250 -183 132 -229 -487 -228 -92 -244 -196 -154 -420 39 -329 -134 -450 -406 -198
2792 -198 83 -169 -12 134 240 -125 -52 60 411 194 359 73 -126 -40 -56 128 253 331 303 -45 231 -102
2814a02K34p1M1P9k44Q7m5J96k5j04p2k31j10K56N6k05L14j87p2M02j67j25R7
2837Bj87L17oj8o8k9j31j9M27k72K94j22O7k0k00J35N0j23J07j97j4O3m8L8j83
2862a37J3J76j53M8k64Q8K95k96p3J74m3p3K8J25L06k76q9J40pQK15J36j91O9
2886B19J00J5J80n6q3R0k05mr4j50J51j62nj95J02j1m4p9k1j13J42L0m0k64P7
2911d20J97l7K21j57j8L55j58R4J03Jj23K15k55J44j9J3qj2qk26L12j82P0R3q5
2936A10k53k07j57M67j50j15n9J57P5j18lL61m48M77r7J27l1k12K19j36J63N7
2958B27o3L4j8j30K94l6k78L91n11J9J3R5K67l30J87j77L7J64n90K51j58J74J89
2981E1l44R6K94k93OQ9l16M63J00m21J93J0J91r4j01k09M52lk87K59J6P7j13m2
$$ plain form
2814 -102 132 61 102 181 -63 24 -21 175 150 46 -26 -257 -367 -111 -55 -260 54 -133 -205 197 30 -95 2
2837 2 -185 132 126 108 40 11 -120 -139 288 16 310 188 255 235 35 170 220 97 204 7 -7 56 8 46 -137
2862 -137 -124 52 -101 -53 -317 -229 66 -230 -303 -129 -172 -245 -217 -92 214 -62 -151 -11 -18 -10 205 341 150 219
2886 219 319 334 514 458 375 465 260 256 162 12 163 1 -4 -199 -97 -108 -152 -231 -252 -365 -223 -193 -233 -497 -420
2911 -420 -223 -260 -39 -196 -214 141 -17 77 180 181 58 273 18 162 143 156 148 136 128 -98 214 32 102 195 110
2936 110 -143 -350 -507 -40 -190 -305 -364 -207 -132 -250 -253 108 -340 137 40 167 136 -76 143 7 170 227
2958 227 164 198 180 50 344 308 30 421 -90 -71 -58 37 304 -26 161 -16 21 185 -405 -154 -312 -138 51
2981 51 -293 -197 97 -196 -190 -101 -417 46 146 -275 -82 -72 119 25 -76 -285 167 164 -123 136 152 229 116 74
3005G4k0Q5j52K92j07J49l91J99k45K96k91J49q6N8k63L55k00J73j85J63k92J71
3027f8n8j29K59j66N2J89j33J65j27j78J81K21k44P7K88j96m6J65j68M22l10l69
3049a73J38R0k98M43j7o0k56K03J53P0l8m19L59l47J33Q9j95q4J59q2J37k64R7
3072a62j69M78mR5k32K13o9L5m34N03Lj8j48pm2K01k3J0J59j92m22L30L8j72J95
3097A66k38j44J88k48K27K1k07j4j6P1L5J20k48L69m8k48K56k60K49J44m04L26
3119I7o1r3r6L19J33O4j29j88M7j23M4m1j24j03L44L2j88P2q3j08J97L0j38L2
3143f4j99J97J1K58n28L58Q5k45J63j80J41L3L47k01M2k58Q0K55j54N9O7k99K05
3166A73nk17J07P1l64L05j07j89K87k08P9J49j07K0k6P6o1j77K21J16k58K95k20
$$ plain form
3005 74 54 139 -13 279 172 321 -70 129 -116 180 -111 38 -48 10 -253 102 -98 75 -110 53 -239 -68
3027 -68 -126 -255 4 -162 -110 79 -54 111 -16 -194 -13 208 -36 41 329 133 87 252 84 506 196 -173
3049 -173 -35 55 -243 200 183 123 -133 70 223 293 255 -164 195 -152 -19 70 -125 -209 -50 -132 5 -259 -162
3072 -162 -331 147 143 238 6 219 150 185 -249 254 257 239 91 84 42 243 220 230 389 197 -225 105 143 -29 166
3097 166 -72 -216 -28 -276 -49 -28 -235 -249 -265 -194 -159 -39 -287 82 34 -214 42 -218 31 175 -229 97
3119 97 36 -57 -153 166 299 363 234 46 93 -30 14 -27 -151 -254 90 122 -66 6 -77 -185 12 42 -96 -64
3143 -64 -263 -66 -55 203 -325 33 118 -127 36 -144 -3 30 377 176 218 -40 40 295 141 200 267 -32 173
3166 173 168 -49 58 129 -235 70 -37 -226 61 -147 -68 81 -26 -6 -32 44 -17 -194 27 143 -115 180 -40
3189d0q0K15j69N8K03o1j41K2o4O6N1J23L1m3j60J20K34m45r7J72%j69J33Q8K15
3214B62j19L1n1J78k35l4j55j05M00k76J4P0Mr0q5R6J5K42k74M2q9J26p0L0J39
3239F6k12M70m91j7L28j87L12j76k0N5J6l36J29P8q8j41M34k37k3J26J52k77n6
3262i5J4j25K89j58n8L02j47lj16Q9L07l25Q6j13J32J60m01KK60J9M9j03J57k69
3286d7J19k00K0J96l23K02m2J16k19L48l68J26j75P0J5L1m2R4m5Q9L19j77l42
3309b35L67k29J50L39k44q2J4j02J63J5Or8J73j64k47J59q3J08K49l31j1J6k00
3332b67J90N7k9Q9j7k91J04L97l82L27j81R9M6l14M48m44L71Q6l09K30k56R0J87
3355B31j58J04j6J0k73M7J9j55J48K25p6k00J53j68j27J69Q6j64K42k89K06j66
$$ plain form
3189 -40 -120 95 -74 -16 187 126 -15 7 -57 9 60 183 214 171 11 131 365 -80 -177 -5 -5 -174 -41 47 262
3214 262 143 174 123 301 66 32 -123 -228 172 -104 -90 -20 -16 -106 -191 -95 -80 162 -112 -70 -159 -33 -103 -73 66
3239 66 -146 324 -167 -184 144 -43 269 93 73 128 144 -192 -63 15 -73 -214 220 -17 -40 86 238 -39 -95
3262 -95 -81 -206 83 -75 -133 169 22 19 -97 -8 299 -26 60 -53 79 239 -162 -160 100 119 168 65 222 -47
3286 -47 72 -128 -108 88 -235 -33 -75 41 -178 170 -198 -72 -247 -177 -162 -131 -173 -79 -124 -35 284 107 -235
3309 -235 132 -97 53 392 148 66 80 -22 141 156 162 64 237 73 -174 -15 -98 10 259 -72 -83 -67 -267
3332 -267 -77 -20 -49 40 23 -268 -164 233 -149 178 -3 96 142 -172 276 -168 203 289 -20 210 -46 44 231
3355 231 73 177 161 171 -102 -55 -36 -191 -43 182 106 -94 59 -109 -236 -67 19 -145 97 -192 14 -152
3377a52J47j90Q7k6J32L0j06jJ60P9j13m4q4L0j12K68O1j97p0Q4k02O4M1M38m63
3402a39L9L6n2J95R4l73K64j12J9n7O6m8L0r7J08j49J49k11N6l5K85R4k23K13
3426A52l12K08J10l41K53J38j87m4q4K07P0R4k01j13K06k50K29o4K42l35K23j04
3448I7j19qQ9L01m66J13j22j29j47M88k20K29k14j11Q8r7L45j61K25n02L97l70
3470b94K95K0p3J19j51J48j77J03KK52j51J33l62M6R0j17M60j69j77J08j91K2
3492f4K34M5n93K88K63k15n4k4L45k47J77j7O0p2j93M12j90j70L76j85j12j41
3514g7J61j89K26l46M41l92o4M24l97J22k6O9k57L7J0P0j3K0K37l12L53J2k18
3537a09Onj8j1J08K68l07K04J12q8p9J50j90M6k73j5K99j87j1Q4K1K0j28J78k33
$$ plain form
3377 -152 -5 -195 -108 -134 -2 28 -78 -79 81 160 47 3 -81 -51 -163 105 166 -31 -101 -17 -219 -155 -114 324 -139
3402 -139 -100 -64 -116 79 173 -200 64 -48 -29 -86 -20 -68 -38 -135 -27 -176 -27 -238 -182 -217 68 162 -61 152
3426 152 -160 48 158 -183 70 208 21 -23 -107 100 170 264 63 -50 156 -94 135 71 313 -22 201 97
3448 97 -22 -30 59 360 -106 7 -115 -244 -391 97 -123 106 -108 -219 -131 -228 117 -44 181 -321 76 -294
3470 -294 1 21 -52 67 -84 64 -113 -10 -8 244 93 226 -136 -90 0 -117 343 174 -3 105 -86 -64
3492 -64 170 215 -378 -90 173 -42 -96 -120 225 -22 155 138 198 126 -67 345 155 -15 361 176 64 -77
3514 -77 84 -105 121 -225 216 -176 -240 184 -213 -91 -117 -48 -305 -268 -258 -188 -201 -181 56 -256 97 109 -109
3537 -109 -103 -108 -126 -137 -29 239 -68 136 248 160 81 231 41 87 -186 -201 98 -89 -100 -16 5 25 -103 75 -158
3562a58R1k14L47k09l4J61j81L64q3k91J23j15L14l4J03n4l6m4j95K02j31K98
3584B24j54J21L5l48P3K49l22l8J41J4j6OJ0K79m02NL20j26k40K71k44J93mK4
3608G1k20O2K73k02K34j30j92M8L42k86J8K42l03l3K14j01k24K47J58m07K89p3
3630B7PR6j8m2K7j54J93m6O4J37l71K9K97j37K2k25o8P9n2J24j13Rj68J23j65
3655c25K67J13k26J48p0J56o9Q1J8J46j68J03K54m37k6J97k82K11J21p6m9k87
3677b00L46j77O7K9k7J71m41P1L36n0m29L67j03N5K1j81L24l23J65j41J83J57
3699B20k75M0J83k75M1N0o9K83l06J49J18j24k8k00J61j65J8O6RJ55R4qn1j43
3723e7j90K05O5k20M3j74L54j06K9O0L3j04K7K09l24J27J44j54J92j11j22L72
$$ plain form
3562 -158 -67 -281 66 -143 -177 -16 -197 167 84 -207 -84 -199 115 81 184 130 94 50 -145 57 -74 224
3584 224 70 191 226 -122 -49 200 -122 -160 -19 -5 -21 -15 -5 274 -128 -123 197 71 -169 102 -142 51 47 71
3608 71 -149 -87 186 -16 218 88 -104 -56 286 0 18 260 -43 -76 138 37 -187 60 218 -189 100 27
3630 27 34 130 112 70 97 -57 136 90 154 291 -80 -51 246 109 131 -94 -162 -83 -135 -11 -124 -115 -283 -160 -325
3655 -325 -58 55 -171 -23 -93 63 -6 75 93 239 71 174 428 -9 -35 162 -120 91 212 136 87 -200
3677 -200 146 -31 36 65 38 209 -232 -161 175 125 -304 63 -40 15 36 -145 179 -144 21 -120 63 220
3699 220 -55 -15 168 -107 -66 -16 -85 198 -108 41 159 35 7 -193 -32 -197 -179 -113 -104 51 145 137 86 -57
3723 -57 -247 -42 23 -197 -154 -328 26 -80 -51 9 42 -62 -35 174 -150 -23 121 -33 159 48 -74 298
3745B98l55K69j69k20K82P5o6k58N1j2n6K28k04L1K40j43kM3p2L8j3%J80k12M1
3770fk7qJ05r1J12j41j02J35J36L1j75j82J22K04j26j4J41k10J14Rm4k7k77K92
3794b9O6j95K6J79J14l71J84m8K54j32p9J07L4j23N7o6j3k81K89L3j0j85j74K91
3818g2K4M6J4k76J40K13j64j72K82K14p4J31k88pJ78r9j65L06j76J38p6J1j06
3841B2J16j08j05J66k12L47l14J92k34n9K62J56l33k41J91R7M8N3J92o1j60j05
3863i0P8K88j08Q0L9Ll60P8j8Q0R4j7j07l69L30p4K5q4K52k41k23M15O0m03K42
3888c0J7L6l05J38J44p2J61j08J01L9K2j26n0J71J29j8j18k23J14j22m7m0M33
3911B46j73k08J8Q6M2n0L08n08K88n6l66K72M4Oj6K62k08J39j43j49J32K33j1
$$ plain form
3745 298 -57 212 43 -177 105 180 114 -144 -93 -105 -161 67 -137 -106 134 -9 -11 32 -40 -2 -15 -15 165 -47 -6
3770 -6 -33 -41 64 -27 85 -56 -158 -23 113 144 -31 -213 -91 113 -13 -27 114 -96 18 27 -17 -44 -321 -29
3794 -29 37 -158 -132 47 161 -210 -26 -74 180 48 -31 76 110 -13 44 -22 -35 -316 -27 6 -4 -189 -363 -72
3818 -72 -48 -2 12 -264 -124 89 -75 -247 35 249 175 306 18 11 189 90 -75 231 55 193 117 128 22
3841 22 138 30 -75 91 -121 226 -88 104 -130 -189 73 229 -104 -345 -154 -57 -9 44 236 175 15 -90
3863 -90 -12 276 168 248 287 290 -70 8 -10 70 164 147 40 -329 1 -73 -48 -132 120 -121 -344 71 131 -272 -30
3888 -30 -13 23 -282 -144 0 -72 89 -19 82 121 143 17 -33 138 267 249 131 -92 22 -100 -147 -187 246
3911 246 73 -135 -117 -31 11 -39 269 -239 49 -7 -373 -101 -57 -51 -67 195 -13 126 -17 -166 -34 199 188
3934A88k33nOJ15k01j76J82k09N26j37k57K73J6j59J91k69K4K11j79P0J0k24K41
3957Dp9J48p8k04K17j82l9M78j73k8j2j11K63k47j62N41k57k56K60j21Rj60J90
3980AJ72k99qJ42j46M0J31J66k14K49l00R1j30K37J7k52N6J04L9q0j41m5K06p9
4004d3K10p4k5j59n2oKQ5q0M7K90qk32J10J10j67k39K58j58J83K24k60J99l51
4028a36lJ96J09p2N2k4m6n2j13J11k46K62l20J47J14n7O2j65O7J21l80L42j17
4051a48m0K67J20j67J5Q3j34j80K76p2J69m6q4J83k26J15k82K36j61J00K76l53
4073e3M5j78o5K81L1r5J07j80P6k71N2J77j29K78o3j0p3Q7K0j01N0R6q4k21J63
4098f0K07l76J06J34j82L79k12L8r2l0M5%K18k75K33Q4j48k94O7l4J03l5R6j97
$$ plain form
3934 188 -45 -50 -44 71 -130 -306 -124 -333 193 56 -201 72 88 -71 120 -149 -125 86 -93 -23 -13 -237 4
3957 4 -75 73 -5 -209 8 -174 -213 265 92 64 52 -59 204 -43 -205 336 79 -177 83 -38 -29 -189 1
3980 1 173 -126 -134 8 -138 -98 33 199 -15 234 -66 25 -105 132 149 -103 -47 57 96 16 -125 -170 36 -43
4004 -43 167 93 68 -91 -143 -149 -147 -62 -142 -95 195 187 -45 65 175 8 -231 27 -131 52 276 16 215 -136
4028 -136 -139 57 166 94 146 122 76 24 -89 22 -224 38 -282 -135 -21 -78 -16 -181 -114 7 -373 -31 -148
4051 -148 -188 79 199 32 47 130 -4 -184 92 20 189 143 59 242 16 131 -151 85 -76 24 300 -53
4073 -53 -8 -186 -251 30 61 -34 73 -107 -31 -302 -250 -73 -202 76 13 3 -70 17 37 -64 -14 82 -2 -223 -60
4098 -60 147 -229 -123 11 -171 208 -4 34 -58 -88 -43 -43 175 -100 133 217 69 -225 -158 -192 -89 -124 -28 -225
4122b25J96J95J4p1r2o2j35K62M6k29N1K42n54K42o3K41p9l3l8j56J65Q9j95M6
4146a43J64n2o4M4O7K04Q2k58M7J4n8N7l21P6J04k0J59k5K7l87K71R4k13J46K45
4171B60l81n5K87j10j52k8R7NJ4J5j47M40m01M1J85Ml33L36r2J67Pk29j9j2j22
4196b23M21j91O9L0m6j72N8j1O4M4j7k84L27M8j84L5j7J18j23n6K76k74J89j8
4220F3Q8p0Q5j34k8J23l70L46j70J68k86J37J22N5L7n3j24K2j39K00k56J06n1
4243a29K45l78MJ78j9L30k04oR1O9k40n1P2K94j93K70m64J74N4j00M46n99J15
4266d1J6N1q9l31K36j23K15m8J23k6k9j18L38j40Q9j3j45K15J0k37k4L52j77j70
4290f6Q6J79k88K39k2j94J27j76l0J12L9J36k3J44o70K49J39l1J27k74L6O6N7
$$ plain form
4122 -225 -29 166 180 109 17 -45 -180 82 128 -101 -50 192 -362 -120 -183 58 -21 -54 -92 -248 -83 6 -189 -143
4146 -143 21 -31 -95 -51 16 220 302 44 91 105 47 104 -217 -141 -37 -57 102 77 104 -283 -12 82 -131 15 260
4171 260 -121 -176 111 1 -151 -179 -82 -77 -63 -48 -195 245 -156 -115 70 74 -259 77 -15 152 159 -70 -89 -101 -223
4196 -223 198 7 76 106 60 -112 -54 -65 -1 43 26 -258 69 117 -67 -32 -49 69 -54 -110 166 -108 81 63
4220 63 151 81 166 32 4 127 -243 103 -67 101 -185 -48 74 129 166 113 -11 11 -128 72 -184 -78 -129
4243 -129 116 -262 -258 -80 -99 231 27 21 112 181 -59 -110 -38 256 63 333 -131 43 97 -3 443 -156 -41
4266 -41 -25 26 -63 -394 -158 -281 -66 -114 9 -17 -46 -164 174 34 123 110 -35 180 190 -47 -71 281 104 -66
4290 -66 20 199 -89 150 128 -66 61 -115 -145 -33 6 142 119 263 -407 -158 -19 -50 77 -197 -161 -95 -38
4313c8J61k99P8M5j84L17kr0n0mK91p3k98J19J45j12J91k69J39j0R6k16J4K83
4337B34m79J90K19m54L43O9j25n9R8Q4m21L47K8m26L67j75J10R1l6J33j57K10
4359A91k36L2J53P8k03R0j80l1J89k8j47K21k30K98k89L01l94lJ97P1J02l53O3
4382a08L42j39n2J54j11j52n%L72k13QR4lm83O3L27l35J1N2M31j37j03j3j99J19
4407h0p0o1L2K30J75k11J72k04J41N0p2P4q3j29J62l57K01P1j01J07P2j85J10
4430D4j34P9j39j8L42k27Q9K93m78K29j19L2QJ98l06K36L5j79R9j77M59l92r6
4453a22R7K25j93J13k79L28k63K6L30k42J38j22k50m4J55O1K04j02k91R7K71k66
4475a29K81j59p7K23K1j21j69P2J07j03Q0J95k70R6r3J61P2l33M55l62J34k61
$$ plain form
4313 -38 123 -176 -98 -53 -237 80 78 -12 -62 -66 225 152 -146 -27 118 6 197 -72 67 57 153 -63 -49 234
4337 234 -245 -55 164 -290 53 122 -3 -62 36 120 -301 46 74 -352 15 -160 -50 41 5 138 -19 191
4359 191 -45 -13 140 218 15 105 -75 -106 83 55 -92 129 -101 197 -92 209 -185 -188 9 80 182 -171 -108
4382 -108 234 95 43 197 86 -66 -71 -71 301 88 96 190 187 -296 -233 94 -241 -230 -178 253 116 13 0 -199 -80
4407 -80 -150 -211 -179 51 226 15 187 -17 124 174 102 176 93 -36 126 -231 -30 41 -60 47 119 -66 44
4430 44 -90 -11 -150 -168 174 -53 36 329 -149 80 -39 -7 1 199 -107 129 164 -15 84 -93 366 -26 -122
4453 -122 -25 200 7 120 -159 169 -94 -68 262 20 158 36 -214 -258 -103 -42 162 60 -231 -134 137 -129
4475 -129 152 -7 -84 139 160 39 -130 -58 49 -54 26 221 -49 47 -46 115 187 -146 309 -53 81 -180
4497a80J9J04j26J69j88J55M1O9j6k00L3J32r2L48k12o0j54KJ65j30L6M23l17
4520B1j68J81K4l6JM9KJ61j41n9j06L4J26j84K21l09K32r8q8j09Q3K57k79J56
4544b9j34J13J37k38K6J80l3O9r5j04J55K19l60L2j10k7L65J1L6l18J40o5OK01
4568A77j81O2j46K45k48O8m7j09K69o8L5O6j14J50k65K14PJ3l20R1K7J27j30P6
4592al9j02R5k02Q9J5J30J44j38L3mk10P4O9J20k08J72p0nJ37j74j6J59j2J85
4617B41l52J78o4J40j13q0j14K30j9m2O8q6Q4Q4j38j20J5j61J78R1P1k21M9j46
4641b27J61M32l77R2j51K9K02k1j5l33J63L22k71j96k3K37J22K33l81N0j97K18
4663F9j63m9m2L80p2n8k04M1k5K66k76m7K85l12K33r1o8K81j47J20q8q7%L39k61
$$ plain form
4497 -180 -161 -57 -183 -14 -202 -47 -6 63 47 -153 -120 12 -80 268 56 -4 -158 -156 9 -121 -85 338 21
4520 21 -147 34 58 22 23 72 74 235 94 35 -71 -37 89 -95 126 -183 49 -49 -137 -246 -163 94 -185 -29
4544 -29 -163 -50 87 -151 -125 55 22 91 -4 -108 47 266 -94 -62 -172 -199 166 177 213 -105 35 -30 -24 177
4568 177 -4 58 -88 157 -91 -23 -70 -179 90 22 57 123 9 159 -106 108 115 128 -192 -101 -74 53 -77 -1
4592 -1 -40 -142 -47 -249 -160 -145 -15 129 -9 24 20 -190 -116 -47 73 -135 37 -33 -38 99 -75 -91 68 56 241
4617 241 -111 67 3 143 30 -50 -164 66 47 5 73 -13 71 155 17 -103 -88 -249 -71 20 91 -130 -81 -227
4641 -227 -66 366 -11 81 -70 -41 161 140 125 -208 -45 277 6 -190 -213 24 146 379 -2 48 -149 69
4663 69 -94 -143 -185 195 123 65 -139 -98 -123 143 -133 -180 105 -207 26 -65 -133 148 1 121 33 -54 -54 285 24
4688B4N0N7j67jJ76p7Q7k13K7J6j53K75J22j85j91L6J99k18K41O7q5J69l11%p1
4713a26K52l18J47K80l89J83K7j69L21j38p8K4j02kK18N8l55N8j82M07q3J39k07
4736c5K72m22j6J54L04k64J44p6k19K06pq7R7n6J81j46n7j8L3j26K19p2k8J73
4760A54r1M3j5q3j91M05k96l4J48j38r8K71k38L10l54M8M42n06K43Q8j4l84K48
4783d2k34J57K55j18J07j19j15J66J4o9J29j12J04n1j38mJ1O0M0k56N06l57j24
4806a90M01k13J04M3p2rpJ58j26l71M21k72K13K5j25k28K16J19QN8j69p1k78J52
4830b13m7K52J82J22l79q7qJ34j39J84j85J70r2O7j98L43q8J06Q2k26j69J97J83
4853A91oJ25j93M9k27O3nJ20k89J12j52R4O1J18L5k53M18n40L74L9j41O9k20J83
$$ plain form
4688 24 74 131 -36 -37 139 62 149 -64 -37 -21 -174 101 223 38 -153 -117 82 -136 105 172 87 256 -55 -55 -126
4713 -126 126 -192 -45 235 -154 29 56 -113 208 70 -8 16 -86 -88 130 188 -167 -109 -291 116 33 172 -35
4736 -35 237 -185 -201 -47 257 -7 137 61 -158 48 41 -46 51 -5 176 30 -27 -45 -12 -138 81 9 -19 154
4760 154 63 106 91 8 -183 222 -74 -108 40 -98 -196 75 -163 147 -207 -159 283 -223 20 108 94 -290 -42
4783 -42 -276 -119 136 18 125 6 -109 57 71 2 131 19 123 72 -66 -70 -59 1 41 -215 291 -66 -190
4806 -190 211 -2 102 145 73 64 57 215 89 -282 139 -133 80 105 -20 -248 -32 87 95 153 -16 -87 -365 -213
4830 -213 -260 -8 174 296 -83 -170 -178 -44 -183 1 -184 -14 -106 -39 -237 106 18 124 206 -20 -189 8 191
4853 191 185 310 117 166 -61 2 -3 117 -172 -60 -212 -118 -57 61 96 -157 261 -279 95 134 -7 62 -158 25
4877B5K49j32n9M5j83K32l10j2J33j52j79J95L33K3Q7m33R3J57k48J45L4J55j28
4900G0n9P4l55L63M5k04K65j54k14J53J10j61K40k40O6R3O7j42j73K07J55j74
4922C2k25J68k5L4L6j53J35K5O4o7N4O1J38j31o4Lk79M31k66J47j82j52N72l77
4946b1Q6k68J54R4m8oR1q1j41K65k97K72p6j84P4L25j90j02jK8r2K73k98K53q9
4971B1j79L03k54OO0J91k47P0O4J00n6k73J7J31r4R3r6K28j49l17N65k48J64O
4995A06L5l12J20L43l45L1P6l10K79k4j32L09j64K76j80M6l10J31K20m09J46o0
5017a28J45J14k59K2lL72m39k1L5J93m8k29N3k5P8N4R8Q9o6k11K46m5k20M09k38
5042b4n9K16mm02n6K96q1J10o2j1J37k40L07j71j9J26j30K5k04J45J53j47J86
$$ plain form
4877 25 274 142 83 128 -55 177 -133 -145 -12 -164 -343 -148 185 208 295 -138 -45 112 -136 9 43 198 70
4900 70 11 85 -270 93 138 -66 199 45 -169 -16 94 -67 173 -67 -1 92 159 17 -156 51 206 32
4922 32 -193 -25 -50 -16 20 -133 2 27 91 24 78 139 277 146 82 85 -194 237 -29 118 -64 -216 356 -21
4946 -21 65 -203 -49 45 -3 -9 82 1 -140 125 -172 100 24 -160 -86 239 49 -53 -54 -26 -118 155 -143 110 21
4971 21 -158 145 -109 -103 -43 148 -99 -29 35 135 79 -194 -177 -46 -140 -47 -143 85 -64 -381 184 -64 100 106
4995 106 141 -171 -51 292 -53 -22 54 -256 23 -1 -133 176 12 288 108 154 -156 -25 195 -214 -68 -128
5017 -128 17 131 -128 -106 -109 263 -176 -197 -162 31 -17 -246 -193 -218 -140 -86 12 101 35 -176 70 25 -195 214 -24
5042 -24 -83 133 129 -273 -329 -33 -114 -4 -66 -77 60 -180 127 -44 -63 63 -67 -42 -246 -101 52 -95 91
5065I1L9m78K82K6n3n1L52l38J06J58j31O0n6p3K87p7l17K05n3N6o8R9k45K16
5089C7l0j1j61L75j75L9J65l15m8o0K71j36J03l27L51k09k5K5K22L9m3k00k10
5112c23K65r4J29Q7k51P7P2L9k82K35M5o1K6Q9k2o6L60l81M49n04J67M0K28l30
5136fJ51k45J5K57k49k9J6j00k16J85Q2N0n7jJ0J46k76J10J51j85k7K05J08j13
5160a8J20p4L0o1m0J0J28j01Lj5J7o1R3j94O5L5J48k37J74N6j40L02l12J2k8j31
5186b19K4L83K2r0l03N4j75K17N0l08K71j3K50j84k10L03Q4j37k16K64o4L05k85
5209B3P1j85l3J98j7L4k53L09k05K78l29K35j62J41l98J87R6j6%M6Oq4J15J20
5233A77j85j75L67p2l24K02m2L2J36j31J96p5l0l1k1k55O2q5M67l74J39J1o1K53
$$ plain form
5065 91 130 -348 -66 -40 -93 -144 208 -130 -24 134 3 63 7 -66 221 144 -173 32 -21 35 -33 66 -179 37
5089 37 7 -4 -165 210 35 74 239 -76 -124 -184 87 -49 54 -273 78 -131 -156 -131 91 130 87 -113 -323
5112 -323 -58 -152 -23 64 -187 -110 -38 1 -281 -46 -1 -62 -36 53 31 -35 325 -56 393 -111 56 96 324 -6
5136 -6 145 -100 -85 172 -77 -106 -90 -190 -406 -221 -139 -89 -146 -147 -137 9 -267 -157 -6 -191 -218 -13 95 -18
5160 -18 102 28 58 -3 -43 -33 95 -6 -3 -18 -1 -62 31 -163 -98 -63 85 -152 22 78 -62 240 -72 -60 -88 -219
5186 -219 -195 188 210 120 -183 -129 -304 -87 -37 -345 -74 -87 163 -21 -231 72 156 19 -197 67 3 308 23
5209 23 94 -91 -124 74 57 91 -162 147 -58 220 -109 126 -36 105 -293 -106 -10 -26 -26 20 26 -58 57 177
5233 177 -8 -183 184 112 -212 -10 -52 -20 116 -15 181 106 76 45 24 -231 -169 -254 213 -161 -22 -11 -72 181
5257A81k07k3Q3M4k95R9K22k41K7Q7K18p6k78j64J46j6L77M0k34pj47M07o4k00
5281b1J36K11l04j52j82J74J54N0k23J73J96k16M6N4j09l32M47l03M14Q2m96N6
5303a45J41J57j26j42J81k93L65j33j18N0J08M9K00l26P6L18l36L2j1k21m5K15
5325dR0R8k66L1J04Pj09Kn8M03k26j69K99l77m4L51j86R1k41J57r7N0K00j52p6
5350a22M8K10k42J70k53K45K27k93L7J05j76k54K60J75m01K29O7P9N5k4j20P9
5372A01j89lj62Q1K16q0N5j13L1K9J5K08j82n5K05l72K29k40L50l17L74k64J41
5395E8r6r6K13k75L64k96O9o8J14J72j75L2k01K81N3j28l79M46m0P6k1k59J35
5418b1R2L5K6l6k16J94M7j7l23J05L91n16K45k0O3Qk41N3l4Q3J5k00N69k17j41
$$ plain form
5257 181 -26 -49 34 78 -217 -118 104 -137 -110 -23 195 119 -159 -323 -177 -193 184 224 -10 -17 -164 243 179 -21
5281 -21 115 326 22 -130 -312 -138 16 66 -157 16 212 -4 42 96 -13 -345 102 -201 213 295 -201 -145
5303 -145 -4 153 27 -115 66 -227 138 5 -113 -63 45 94 294 -32 44 362 26 58 47 -174 -219 -4
5325 -4 86 184 -82 -51 53 60 -49 -47 -105 298 72 -97 202 -175 -219 132 -54 37 -204 -47 -144 -94 106 -46 -122
5350 -122 -74 136 -106 64 -189 56 283 -10 27 132 -44 -298 -38 137 -264 -35 32 111 166 142 22 101
5372 101 -88 -91 -253 -172 44 -36 19 -94 -63 -34 -19 189 7 -48 157 -215 14 -226 124 -193 181 -83 58
5395 58 -38 -134 79 -196 168 -128 -59 -127 -13 159 -16 16 -185 96 149 21 -358 88 48 124 103 -156 -21
5418 -21 71 106 132 96 -120 74 121 104 -219 -114 277 -239 6 -14 49 57 -184 -131 -165 -82 -67 -267 302 85 -56
5443e6J76j96n3O9J0j2K6K20j11k24j72K97L73l96k2J09J47j68p9j54K86J83r2
5466A61j03R9j55j44J15j88l1J83L3j75K11k57K17p3J25r9m9n5J47M7K80j37j91
5489c9L9j64K07n2k38K71n8mL0J7l3J59j03J95l78J39P0l45L59k50K5J74M8K29
5513B98k88J38k25P3NL3m7j98R7k8M20l17k02P6M1J57l8q5L64l86q1J20k24M42
5537A45l00M6j38J34K30k9j1L5P5j51k5O9K78l62Q8j80K19j45k9J90r8J9M4j91
5561h7K8J76Oj07l3j35J04k3O2j39O7Q2K49l11P5p1L15l62P8j8k41L10J14m89
5585c50N61o0r1k48K02P3m7pK1j58K06j07p6L9K9n9L2o2L21n3j92k89N91J7m83
5610a90K56j47N05k59L8m67L30J10o7j56k0K2Q9J26j94J10k94J76K3K04k61J58
$$ plain form
5443 -56 120 -76 -129 -60 -50 -62 -36 184 73 -151 -323 -26 347 -49 -71 38 185 17 -62 -216 70 253 161
5466 161 58 157 2 -142 -27 -215 -246 -63 -30 -205 6 -251 -34 -107 18 -81 -130 -185 -38 9 289 152 -39
5489 -39 0 -164 43 -9 -247 24 -34 -38 -8 9 -24 135 32 227 -151 -12 58 -287 72 -178 -153 21 69 298
5513 298 10 148 -77 -4 1 34 -13 -211 -114 -142 278 -39 -241 -165 -124 33 -5 -90 274 -112 -193 -73 -297 145
5537 145 -155 -109 -247 -113 117 88 77 112 187 36 11 80 358 -4 84 -96 123 -22 -51 139 41 60 104 -87
5561 -87 -59 117 123 16 -17 -152 -48 -71 -9 -148 -81 1 250 -61 14 -57 258 -104 -26 -44 -285 25 139 -350
5585 -350 211 151 60 -188 14 87 40 33 54 -104 102 -5 -81 -42 -13 -72 -40 -102 219 166 -26 -315 276 293 -190
5610 -190 66 -81 424 165 203 -264 66 176 109 -47 -67 -45 44 170 -24 86 -208 -32 -9 195 -66 92
5632I2R0k4k5k38K97l56J29R8q8N2r8k0K9P4k47J66n0J82P9rl74K77j32K21n7
5657F8r9p0J25M5k1J21k15J58j21L20k41j91l4J14J37J69k87qJ9q1p7M40k73k75
5681b77K61m8R2l3R3J4k30O5K58j55j30j67J30L98k79n9P5k32K77P9j41nR3j24
5705d5r1J11k27O4%J65M4N9j26j9J38k2j37L06l01k9L41j65J50j22r0J86l26r
5729a45J86j41K93j71K45j53k6Q8j57J46L7l93L18j2k21J42j63q1M03Rk22K75
5751B57l00q3NJ70l2K68l74L19o3j82K67m33J30R8r2k33K30J56j85J44l3l30M43
5774A47k40P5jj81J45J07n4m8R7K04l04J61K34l67J21L1N0k2j43k63M51p5Om7
5798H4l32M46j17j16L0j28J54J21j21j4Q0m0r0l6K10j00l10K19j9Q5KQ9J80k44
$$ plain form
5632 92 182 158 133 -105 192 -164 -35 63 -25 27 -71 -91 -62 12 -235 -69 -119 63 142 133 -241 36 -96 125 68
5657 68 -31 -101 24 69 48 169 -46 112 -9 311 70 -121 -155 -41 96 265 -22 -30 -11 -92 -169 271 -2 -277
5681 -277 -16 -64 28 -5 88 102 -128 -63 195 40 -90 -257 -127 271 -8 -67 8 -224 53 132 -9 -14 79 -45
5705 -45 -136 -25 -252 -188 -188 -23 21 80 -46 -65 73 51 -86 220 -81 -110 231 66 216 94 4 190 -136 -145
5729 -145 41 -100 193 22 267 114 88 176 19 165 202 -191 127 115 -106 36 -127 -208 195 204 -18 257
5751 257 -43 -126 -121 49 17 285 -89 230 167 -15 252 -181 -51 47 -45 -278 -48 108 -77 67 34 -296 147
5774 147 -93 -18 -19 -200 -55 52 -2 -50 47 251 -53 108 342 -25 96 127 177 155 12 -251 200 125 131 84
5798 84 -248 198 81 -35 -5 -133 21 142 21 7 87 47 -43 -79 131 31 -279 -60 -79 6 8 97 277 33
5822C3j20j40OR8J65k86K38P7j91P3J45q7n1L3J57q7p9K1r7j61L97j34R0l17L18
5847A01j15j56Q9j69L53j88K20k43J35o2k01K66O8j15k90K40o8K15J01l06J02
5868b3M0L1O7k2J17j89J51j40o0K8j9K58j28o0K50r9j15k64K52J6k00j6K14p0
$$ plain form
5822 33 -87 -227 -221 -123 42 -244 -6 71 -120 -47 98 11 -40 -7 150 63 -16 5 -92 -253 144 10 100 -217 101
5847 101 -14 -170 -81 -250 103 -85 135 -108 27 -35 -236 30 98 -17 -307 -67 -135 80 181 -125 -23
5868 -23 17 48 115 93 210 21 172 32 -28 0 -19 239 111 51 301 202 87 -177 75 91 -109 -125 89 19
$$ [...]
8191C9
##END NTUPLES=NMR FID
##END=
