##TITLE=1H_SR82 Leu'_1
 CDCl3,8 sc, 
 2.9.2021
##JCAMPDX= 6.0         $$ Bruker NMR JCAMP-DX V2.0
##DATA TYPE= NMR FID
##DATA CLASS= NTUPLES
##ORIGIN= UXNMR, Bruker Analytische Messtechnik GmbH
##OWNER= root
$$ XWIN-NMR		Version 3.5
$$ Thu Sep  2 11:58:56 2021 Russian Standard Time (UT+4h)  she@DPX200
##.OBSERVE FREQUENCY= 200.1312
##.OBSERVE NUCLEUS= ^1H
##.DELAY= (6, 6)
##.ACQUISITION MODE= SIMULTANEOUS
##.ACQUISITION SCHEME= undefined
##.AVERAGES= 16
##.DIGITISER RES= 18
##SPECTROMETER/DATA SYSTEM= spect
##.PULSE SEQUENCE= zg30
##.SOLVENT NAME= CD2Cl2
##.SHIFT REFERENCE= (INTERNAL, CD2Cl2, 0, 15.7039)
##AUDIT TRAIL= $$ (NUMBER, WHEN, WHO, WHERE, WHAT)
$$ ##TITLE= Audit trail, XWIN-NMR		Version 3.5
$$ ##JCAMPDX= 5.01
$$ ##ORIGIN= Bruker BioSpin GmbH
$$ ##OWNER= she
$$ F:/spectra/data/she/nmr/H-F/1/audita.txt
$$ ##AUDIT TRAIL=  $$ (NUMBER, WHEN, WHO, WHERE, WHAT)
(   1,<2021-09-02 11:54:55.25 +0400>,<she>,<DPX200>,
      <created by zg, POWCHK disabled, PULCHK disabled
       terminated by command 'halt'
       configuration hash MD5:
       00 E9 B6 7A A2 85 ED C7 34 08 36 98 17 FE 4E 26
       data hash MD5: 16K
       26 BB 81 80 DF 99 45 2E BC BE C2 C4 E3 3E E7 BB>)
$$ ##END=
$$ 
$$ hash MD5
$$ 9B 91 4F 9A 38 2D D7 8E 27 A2 10 BF AE 75 D7 8C
##$RELAX= 
##$RELAX= 
##$RELAX= 
##$RELAX= 
##$RELAX= 
##$RELAX= 
$$ Bruker specific parameters
$$ --------------------------
##$DU= <F:/spectra>
##$EXPNO= 1
##$NAME= <H-F>
##$PROCNO= 1
##$TYPE= <nmr>
##$USER= <she>
##$AMP= (0..31)
100 100 100 100 100 100 100 100 100 100 100 100 100 100 100 100 100 100 
100 100 100 100 100 100 100 100 100 100 100 100 100 100 
##$AQSEQ= 0
##$AQ_mod= 1
##$AUNM= <au_zg>
##$AUTOPOS= <>
##$BF1= 200.13
##$BF2= 200.13
##$BF3= 200.13
##$BF4= 200.13
##$BF5= 200.13
##$BF6= 200.13
##$BF7= 200.13
##$BF8= 200.13
##$BYTORDA= 1
##$CFDGTYP= 0
##$CFRGTYP= 5
##$CHEMSTR= <none>
##$CNST= (0..31)
1 1 145 1 1 1 1 1 1 1 1 1 1 1 1 1 1 1 1 1 1 1 1 1 1 1 1 1 1 1 1 1 
##$CPDPRG= <>
##$CPDPRG1= <>
##$CPDPRG2= <>
##$CPDPRG3= <>
##$CPDPRG4= <mlev>
##$CPDPRG5= <mlev>
##$CPDPRG6= <mlev>
##$CPDPRG7= <mlev>
##$CPDPRG8= <mlev>
##$CPDPRGB= <>
##$CPDPRGT= <>
##$D= (0..31)
0 1.2 0 0 0 0 0 0 0 0.06 0 0.03 0 0 0 0 0.0002 0 0 0 0 0 0 0 0 0 0 0 0 
0 0 0 
##$DATE= 1630569294
##$DBL= (0..7)
120 120 120 120 120 120 120 120 
##$DBP= (0..7)
150 150 150 150 150 150 150 150 
##$DBP07= 0
##$DBPNAM0= <>
##$DBPNAM1= <>
##$DBPNAM2= <>
##$DBPNAM3= <>
##$DBPNAM4= <>
##$DBPNAM5= <>
##$DBPNAM6= <>
##$DBPNAM7= <>
##$DBPOAL= (0..7)
0.5 0.5 0.5 0.5 0.5 0.5 0.5 0.5 
##$DBPOFFS= (0..7)
0 0 0 0 0 0 0 0 
##$DE= 6
##$DECBNUC= <off>
##$DECIM= 32
##$DECNUC= <off>
##$DECSTAT= 4
##$DIGMOD= 1
##$DIGTYP= 9
##$DL= (0..7)
0 120 120 120 120 120 120 120 
##$DP= (0..7)
150 150 150 150 150 150 150 150 
##$DP07= 0
##$DPNAME0= <>
##$DPNAME1= <>
##$DPNAME2= <>
##$DPNAME3= <>
##$DPNAME4= <>
##$DPNAME5= <>
##$DPNAME6= <>
##$DPNAME7= <>
##$DPOAL= (0..7)
0.5 0.5 0.5 0.5 0.5 0.5 0.5 0.5 
##$DPOFFS= (0..7)
0 0 0 0 0 0 0 0 
##$DQDMODE= 0
##$DR= 18
$$ [...]
##$SUBNAM2= <"">
##$SUBNAM3= <"">
##$SUBNAM4= <"">
##$SUBNAM5= <"">
##$SUBNAM6= <"">
##$SUBNAM7= <"">
##$SUBNAM8= <"">
##$SUBNAM9= <"">
##$SW= 20.0189188712717
##$SWIBOX= (0..15)
0 0 2 0 0 0 0 0 0 0 0 0 0 0 0 0 
##$SW_h= 4006.41025641026
##$TD= 16384
##$TD0= 1
##$TE= 0
##$TE2= 300
##$TE3= 300
##$TEG= 300
##$TL= (0..7)
0 120 120 120 120 120 120 120 
##$TP= (0..7)
150 150 150 150 150 150 150 150 
##$TP07= 0
##$TPNAME0= <>
##$TPNAME1= <>
##$TPNAME2= <>
##$TPNAME3= <>
##$TPNAME4= <>
##$TPNAME5= <>
##$TPNAME6= <>
##$TPNAME7= <>
##$TPOAL= (0..7)
0.5 0.5 0.5 0.5 0.5 0.5 0.5 0.5 
##$TPOFFS= (0..7)
0 0 0 0 0 0 0 0 
##$TUNHIN= 0
##$TUNHOUT= 0
##$TUNXOUT= 0
##$USERA1= <user>
##$USERA2= <user>
##$USERA3= <user>
##$USERA4= <user>
##$USERA5= <user>
##$V9= 5
##$VALIST= <valist>
##$VCLIST= <CCCCCCCCCCCCCCC>
##$VD= 0
##$VDLIST= <DDDDDDDDDDDDDDD>
##$VPLIST= <PPPPPPPPPPPPPPP>
##$VTLIST= <TTTTTTTTTTTTTTT>
##$WBST= 1024
##$WBSW= 4
##$XGAIN= (0..3)
0 0 0 0 
##$XL= 0
##$YL= 0
##$YMAX_a= 448494
##$YMIN_a= -579381
##$ZGOPTNS= <>
##$ZL1= 120
##$ZL2= 120
##$ZL3= 120
##$ZL4= 120
##$ABSF1= 10
##$ABSF2= 0
##$ABSG= 5
##$ABSL= 3
##$ALPHA= 0
##$AQORDER= 0
##$ASSFAC= 0
##$ASSFACI= 0
##$ASSFACX= 0
##$ASSWID= 0
##$AUNMP= <proc_1d>
##$AZFE= 0.1
##$AZFW= 0.1
##$BCFW= 1
##$BC_mod= 2
##$BYTORDP= 1
##$COROFFS= 0
##$CY= 11.3945322036743
##$DATMOD= 1
##$DC= 2
##$DFILT= <>
##$DTYPP= 0
##$F1P= 2.36226072786647
##$F2P= -0.459571619588291
##$FCOR= 0.5
##$FTSIZE= 0
##$FT_mod= 4
##$GAMMA= 1
##$GB= 0.15
##$INTBC= 1
##$INTSCL= 1
##$ISEN= 128
##$LB= 0.24
##$LEV0= 0
##$LPBIN= 0
##$MAXI= 10000
##$MC2= 0
##$MEAN= 0
##$ME_mod= 0
##$MI= 1.114404
##$NCOEF= 0
##$NC_proc= 0
##$NLEV= 6
##$NOISF1= 3.799351
##$NOISF2= 2.8
##$NSP= 1
##$NTH_PI= 0
##$NZP= 0
##$OFFSET= 15.70392
##$PC= 1
##$PHC0= -13351.95
##$PHC1= 5.60097
##$PH_mod= 1
##$PKNL= yes
##$PPARMOD= 0
##$PSCAL= 0
##$PSIGN= 0
##$REVERSE= no
##$SF= 200.130013532006
##$SI= 16384
##$SIGF1= 3
##$SIGF2= 2
##$SINO= 400
##$SIOLD= 16384
##$SREGLST= <1H.CDCl3>
##$SSB= 0
##$STSI= 0
##$STSR= 0
##$SW_p= 3612.71676300578
##$SYMM= 0
##$S_DEV= 0
##$TDeff= 0
##$TDoff= 0
##$TI= <>
##$TILT= no
##$TM1= 0
##$TM2= 0
##$TOPLEV= 0
##$USERP1= <user>
##$USERP2= <user>
##$USERP3= <user>
##$USERP4= <user>
##$USERP5= <user>
##$WDW= 1
##$XDIM= 8192
##$YMAX_p= 0
##$YMIN_p= 0
$$ End of Bruker specific parameters
$$ ---------------------------------
##NTUPLES= NMR FID
##VAR_NAME=  TIME,          FID/REAL,        FID/IMAG
##SYMBOL=    X,             R,               I
##VAR_TYPE=  INDEPENDENT,   DEPENDENT,       DEPENDENT
##VAR_FORM=  AFFN,          ASDF,            ASDF
##VAR_DIM=   8192,          8192,            8192
##UNITS=     SECONDS,       ARBITRARY UNITS, ARBITRARY UNITS
##FACTOR=    0.0002496,     1,               1
##FIRST=     0,             0,               0
##LAST=      2.0444736,     0,               0
##MIN=       0,             -579381,         0
##MAX=       2.0444736,     448494,          0
$$ Real data points
##PAGE= N=1
##DATA TABLE= (X++(R..R)), XYDATA
$$ [...]
$$ plain form
2155 405 -398 -283 -82 -85 250 378 373 -268 -1153 -786 -668 44 329 376 -244 -770 -1053 -421 -134 164 497 174
2177 174 -1045 -607 -91 139 274 616 776 -298 -22 -10 -449 570 831 761 684 -73 -158 -522 94 167 315
2198 315 145 -661 -686 -513 -698 -171 -437 -80 -357 -649 -995 -575 -344 232 238 30 -534 -620 -646 -87 304 887
2220 887 785 154 25 58 384 972 876 561 661 121 -107 -398 -92 580 653 144 -86 -349 -394 -215 224
2241 224 19 70 -121 -909 -1082 -840 -186 -78 157 -160 -574 -367 -110 -70 201 650 92 -158 -285 277 -86
2262 -86 453 828 857 617 -90 -251 -436 -47 555 904 -39 308 123 -1109 147 373 134 -240 -433 -223
2282 -223 -410 -585 -126 653 273 -126 -532 -282 -286 -441 200 584 128 -22 -138 -503 18 -11 299 163 397
2303 397 -224 -213 48 494 654 659 439 202 -324 -98 222 571 801 418 205 -371 -314 -326 319 111 528 128
$$ packed form
2155D05q03J15K01lL35J28no41q85L67J18P12K85M7o20n26k83O32K87K98L33l23
2177A74j219M38N16K30J35L42J60j074K76J2m39J019K61p0p7p57q5l64O16P3J48
2198C15j70q06k5J73j85N27k66L57k77k92l46M20K31N76Ok08n64q6k6N59L91N83
2220H87j02o31j29L3L26N88r6l15J00n40k28k91L06O72P3n09k30k63m5J79M39
2241B24k05N1j91p88j73K42O54J08K35l17m14K07K57M0K71M49n58k50j27N62l63
2262h6N39L75K9k40p07j61j85L89O02L49r43L47j85j232J256K26k39l74j93K10
2282b23j87j75M59P79l80l99m06K50mj55O41L84m56j50j16l65N21k9L10j36K34
2303C97o21J1K61M46J60Nk20k37n26K26L20L49K30l83k13n76N7j2O45k08M17m00
$$ plain form
2325 128 -447 -578 -565 -465 -86 16 -397 -650 -880 -1083 -119 -234 -101 -9 -290 -224 -520 -1 58 440 765
2346 765 650 355 505 502 542 521 829 609 98 -123 -146 214 211 559 105 351 -763 -1087 -547 -851 -315 -218
2368 -218 -478 -273 -792 -1364 -654 122 -314 -297 -210 -433 -213 207 168 565 341 465 460 50 -26 528 497 1053
2390 1053 787 265 -151 216 518 549 636 363 121 -86 -427 -581 -275 69 -51 -114 -606 -1098 -483 -495 -270
2411 -270 -67 -239 -423 3 -503 -94 -13 270 235 213 426 222 -266 609 551 666 902 537 -251 222 26
2432 26 225 595 262 443 81 2 -651 -184 191 67 -5 58 -847 -967 -310 -273 1 -149 -591 -559 -534 -475 46
2455 46 -46 -71 344 -388 -285 -13 -190 283 153 198 84 41 -108 312 496 753 763 266 118 201 430 158
2477 158 59 350 618 51 -159 -325 -477 -149 51 192 -702 -414 -717 -542 -322 -11 -245 -474 -567 -47 -362
$$ packed form
2325A28n75j31J3J00L79J02m13k53k30k03R64j15J33R2k81O6k96N19N9L82L25
2346G65j15k95J50lM0k1L08k20n11k21k3L60lL48m54K46j114l24N40l04N36R7
2368b18k60K05n19n72P10P76m36J7Q7k23K20M20l9L97k24J24nm10p6N54l1N56
2390A053k66n22m16L67L02L1Q7k73k42k07l41j54L06L44j20o3m92m92O15j2K25
2411b70K03j72j84M26n06M09Q1K83l5k2K13k04m88Q75n8J15K36l65p88M73j96
2432B6J99L70l33J81l62p9o53M67L75j24p2O3r05j20O57L7K74j50m42L2K5N9N21
2455D6r2k5M15p32J03K72j77M73j30M5j14m3j49M20J84K57J0m97j48Q3K29k72
2477A58r9K91K68n67k10j66j52L28K00J41q94K88l03J75K20L11k34k29r3N20l15
$$ plain form
2498 -362 -199 -143 362 182 -187 53 -136 102 -84 621 411 271 174 603 213 395 686 957 639 629 63
2519 63 3 304 78 16 -220 -64 -357 -744 -814 -409 -199 -514 -278 -474 -840 -811 -433 -58 75 -91 -9 -83
2541 -83 -397 -128 820 446 648 880 467 652 474 621 701 882 498 414 183 163 361 162 -183 405 24
2562 24 -454 -302 -586 -393 -410 -87 -594 -579 -816 -605 -705 -78 -189 -369 -53 -334 -582 -106 34 764 296
2583 296 369 157 -94 241 472 565 481 702 288 -150 -224 300 534 283 205 -41 -367 -391 -434 -220 198 -186
2605 -186 -286 -432 -554 -690 -168 -235 -115 -178 -556 -252 -765 -383 150 87 252 -135 -159 -123 -14 689 285 757
2627 757 321 256 214 -36 305 657 693 626 186 251 108 -6 235 24 495 -167 -227 -352 -826 -524 -36 111
2649 111 161 -261 -425 -387 -666 -290 -253 -284 -214 43 -206 -507 -151 218 299 620 586 -214 31 414 768 987
$$ packed form
2498c62J63N6N05j80l69K40j89K38j86P05k10j40r7M29l90J82K91K71l18j0n66
2519F3o0L01k26o2k36J56k93l87p0M05K10l15K36j96l66K9L78L75J33j66Q2p4
2541h3l14K69R48l74K02K32m13J85j78J47Q0J81l84q4k31k0J98j99l45N88l81
2562B4m78J52k84J93j7L23n07J5k37K11j00O27j11j80L16k81k48M76J40P30m68
2583B96P3k12k51L35K31R3q4K21m14m38p4N24K34k51p8k46l26k4m3K14M18l84
2605a86j00j46j22j36N22o7J20o3l78L04n13L82N33o3J65l87k4L6J09P03m04M72
2627G57m36o5m2k50L41L52L6o7m40O5j43j14K41k11M71o62o0j25m74L02M88J47
2649A11N0m22j64L8k79L76L7l1P0K57k49l01L56L69Q1L21l4q00K45L83L54K19
$$ plain form
2671 987 733 406 -29 -136 -359 685 602 591 185 -172 -56 70 -18 46 75 -90 -173 -1015 -831 -672 -316 -582
2693 -582 -376 -415 -648 -377 -773 96 -347 82 -88 -13 -340 250 119 756 543 831 412 270 28 582 512
2714 512 864 484 539 7 -155 -39 203 215 -50 -41 -457 -473 -670 -579 -377 -551 -456 -548 -770 -680 -434 -430 -133 73
2738 73 -253 -40 -354 -268 37 521 496 427 146 137 241 429 462 652 445 563 640 -446 -141 232 -157 633
2760 633 123 -227 -886 -481 -625 -277 -615 -392 -280 -362 -763 -142 -90 -674 321 -173 -274 83 -129 -77 452
2781 452 275 315 118 246 18 115 -18 1053 439 -178 405 -44 -302 353 350 567 301 -124 59 -326 211
2802 211 222 303 144 -403 10 -378 -463 -244 -392 -497 47 -257 13 -308 -171 394 268 -9 71 -394 -340 -8
2824 -8 371 263 -47 364 -96 -80 338 331 502 333 659 32 -104 38 -53 123 478 274 -223 -156 -297 -97
$$ packed form
2671I87k54l27m35j07k23J044q3j1m06l57J16J26q8O4K9j65q3q42J84J59L56k66
2693e82K06l9k33K71l96Q69m43M29j70P5l27N90j31O37k13K88m19j42k42N54p0
2714E12L52l80N5n32j62J16K42J2k65Rm16j6j97R1K02j74R5r2k22R0K46MK97K06
2738G3l26K13l14Q6L05M84k5o9k81rJ04J88L3J90k07J18P7j086L05L73l89P90
2760F33n10l50o59M05j44L48l38K23J12q2m01O21N2n84R95m94j01L57k12N2N29
2781D52j77M0j97J28k28R7j33J071o14o17N83m49k58O55lK17k66m25J83l85N37
2802B11J1Q1j59n47M13l88q5K19j48j05N44l04K70l21J37N65j26k77Q0m65N4L32
2824hL79j08l10M11m60J6M18pJ71j69L26o27j36J42r1J76L55k04m97O7j41K00
$$ plain form
2846 -97 -19 39 -10 -237 -345 -467 -649 -479 -462 -400 -135 -193 -399 -566 -366 -273 278 46 -41 -74 194 -35 458
2869 458 514 479 343 175 185 299 395 636 412 194 193 -54 54 -306 54 -55 -2 235 -485 -243 -653 -500
2891 -500 -125 154 -415 -365 -533 -251 -406 -233 -229 255 80 -284 -188 -133 -31 202 382 13 148 -17 74 1107
2913 1107 692 564 567 307 188 -311 0 278 -169 23 -159 69 21 -623 -759 -264 210 -246 -474 135 259
2934 259 -253 -317 -978 453 -157 193 270 -22 -884 -31 256 53 -526 -97 -31 331 148 291 609 341 1329
2955 1329 -810 -309 40 -584 438 -393 -326 -599 -66 113 -318 13 -152 556 -936 -568 -333 306 177
2974 177 -58 237 -478 -276 364 509 97 146 253 89 -384 -92 110 121 -78 588 70 49 153 -102 248
2995 248 -180 501 212 -183 -84 128 -43 -9 -105 -209 90 -386 -198 -253 47 71 247 -58 337 -162 -90 -45
$$ packed form
2846i7P8N8m9k27j08j22j82J70J7O2K65n8k06j67K00R3N51k32q7l3K68k29M93
2869D58N6l5j36j68J0J14R6K41k24k18jk47J08l60L60j09N3K37p20K42m10J53
2891e00L75K79n69N0j68K82j55J73MM84j75l64R6N5J02K33J80l69J35j65R1J033
2913A107m15j28Lk60j19m99L11K78m47J92j82K28m8o44j36M95M74m56k28O09J24
2934B59n12o4o61J431o10L50P7k92q62Q53K87k03n79M29O6L62j83J43L18k68R88
2955A329k139N01L49o24J022q31O7k73N33J79m31L31j65P08j492L68K35O39j29
2974A77k35K95p15K02O40J45m12M9J07j64m73K92K02J1j99O66n18k1J04k55L50
2995B48m28O81k89l95R9K12j71L4r6j04K99m76J88n5L00K4J76l05L95m99P2M5
$$ plain form
3017 -45 71 17 -392 220 -110 -69 337 343 -144 288 460 431 174 389 645 324 359 124 -17 79 276 457 320
3040 320 686 332 25 -81 -233 -162 -309 142 -104 175 -280 -316 -507 38 -226 -284 24 -529 -191 -213 286
3061 286 -7 283 257 278 -135 -161 483 -197 58 295 499 45 89 -65 148 247 474 332 -223 -68 -149 210
3083 210 244 -64 264 -352 -235 -249 -196 -321 -171 -191 -153 -180 25 -261 -100 106 -132 -10 110 41 240 -11
3105 -11 213 182 327 -415 335 60 -560 28 379 636 -63 108 18 121 120 -96 454 74 -470 -320 -327 -51
3127 -51 -216 -121 -251 -132 -306 93 -197 -99 629 78 85 -318 -227 -199 320 -26 34 7 -3 -189 -39 -20 -229 -49
3151 -49 -334 -44 -46 -253 -24 191 16 -281 108 25 -402 358 -282 -145 157 -87 42 142 -248 -248 375 -302
3173 -302 117 235 53 218 -571 -215 164 154 26 -29 -44 -343 -179 -177 -43 43 -345 -63 -182 -276 -8 52 -55
$$ packed form
3017d5J16n4m09O12l30M1M06Om87M32J72k9k57K15K56l21L5k35j41R6J97J81j37
3040C20L66l54l07j06j52P1j47M51k46K79m55l6j91N45k64n8L08n53L38k2M99
3061B86k93K90k6K1m13k6O44o80K55K37K04m54M4j54K13R9K27j42n55J55q1L59
3083B10L4l08L28o16J17j4N3j25J50k0L8k7K05k86J61K06k38J22J20o9J99k51
3105a1K24l1J45p42P50k75o20N88L51K57o99J71r0J03jk16N50l80n44J50pK76
3127e1j65R5j30J19j74L99k90R8P28n51Pm03R1K8N19l46O0k7j0j86J50J9k09J80
3151d9k85K90kk07K29K15j75k97L89q3m27P60o40J37L02k44J29J00l90%O23o77
3173c02M19J18j82J65p89L56L79j0j28n5j5k99J64KJ34Q6l88K82j19r4K68O0j07
$$ plain form
3196 -55 47 322 352 -325 39 252 31 44 119 -71 -242 -39 -174 132 404 -14 -484 -367 -377 -164 270 -97
3218 -97 -33 109 -160 -514 -264 239 89 -175 172 -463 18 103 75 322 99 148 -151 -183 74 88 28 483 244
3241 244 -195 -78 -112 -437 -193 183 377 -369 -21 -69 -159 104 345 -122 -362 -387 -72 -383 30 96 359 32
3263 32 336 75 -81 -260 272 154 153 191 -244 395 -169 -87 12 200 214 -258 289 -231 -287 42 340 -151 134
3286 134 -115 -199 -225 -193 -174 55 -98 -370 -86 -225 -185 81 664 -24 353 188 7 147 210 343 -169 330
3308 330 -217 0 -229 15 -135 234 100 -270 -106 -304 296 -52 157 323 -184 -332 -215 42 62 151 247
3329 247 -170 -294 346 95 240 416 218 90 -342 -11 -195 -172 -135 110 287 243 133 -53 -216 -160 52
3350 52 -20 -7 63 -498 139 -161 619 -297 53 83 -174 207 140 155 -193 207 302 386 88 -64 -142 -42 144
$$ packed form
3196e5J02K75L0o77L64K13k21J3P5j90j71K03j35L06K72m18m70J17j0K13M34l67
3218i7O4J42k69l54K50N03j50k64L47o35M81Q5k8K47k23M9k99l2K57J4o0M55k39
3241B44m39J17l4l25K44L76J94p46L48m8r0K63K41m67k40k5L15l11M13O6K63l27
3263C2L04k61j56j79N32j18jL8m35O39n64Q2R9J88J4m72N47n20n6L29K98m91K85
3286A34k49q4k6L2J9K29j53k72K84j39M0K66N83o88L77j65j81J40O3J33n12M99
3308C30n47K17k29K44j50L69j34l70J64j98O00l48K09J66n07j48J17K57K0Q9R6
3329B47m17j24O40k51J45J76j98j28m32L31j84K3L7K45J77m4j10j86j63N6K12
3350E2p2J3P0n61O37l00P80r16L50L0k57L81o7J5l48M00R5Q4k98j52p8J00J86
$$ plain form
3373 144 306 96 14 -71 134 60 75 166 -79 -370 74 271 -139 107 126 144 -344 -188 68 -89 136 240
3395 240 406 14 220 54 -143 -123 -8 268 430 -27 51 -321 98 162 15 57 44 -353 130 -95 -113 331
3417 331 98 -4 -158 93 -186 62 67 336 -220 66 -208 -146 -175 146 20 102 324 -338 -186 -210 273 250
3439 250 -79 46 -125 -297 279 224 301 111 196 20 -53 25 97 -250 58 -11 -56 -122 -172 -209 -15 -63 11 100 121
3464 121 -46 -274 11 19 747 400 -92 -186 231 -80 400 -45 312 83 -250 -127 -214 -30 -12 -90 -218 -380
3486 -380 220 -136 84 -155 247 310 598 22 -7 -60 326 -92 -30 -107 195 179 -430 209 52 -292 213 15
3508 15 183 -365 -377 -48 -67 -56 -392 217 -416 -133 -134 -169 -1 -55 452 -92 111 403 31 440 434 386 -209 -80
3532 -80 161 43 374 305 -118 436 -335 -199 -51 -147 32 -30 -75 48 -185 -44 -168 -209 24 32 32 60 35 -259
$$ packed form
3373A44J62k10q2q5K05p4J5R1k45k91M44J97m10K46J9J8m88J56K56j57K25J04
3395B40J66l92K06j66j97K0J15K76J62m57P8l72M19O4j47M2j3l97M83k25j8M44
3417C31k33j02j54K51k79K48NK69n56K86k74O2k9L21j26Q2K22o62J52k4M83k3
3439B50l29J25j71j72N76n5P7j90Q5j76p3P8P2l47L08o9m5o6n0l7J94m8P4Q9K1
3464A21j67k28K85QP28l47m92r4M17l11M80m45L57k29l33J23q7J84J8p8j28j62
3486c80O00l56K20k39M02O3K88n76k9n3L86m18O2p7L02j6o09O39j57l44N05j98
3508A5J68n48j2L29j9J1l36O09o33K83jl5J68n4N07n44K03K92l72M09om8n95J29
3532h0K41j18L31o9m23N54p71J36J48r6J79o2m5J23k33J41j24m1K33Q%K8k5k94
$$ plain form
3556 -259 220 95 84 328 128 -51 184 -330 278 -47 -164 213 394 -235 -57 45 -148 -160 -420 -448 -300
3577 -300 -333 106 -28 -626 -194 -254 54 -381 98 -166 288 -67 -202 13 -395 -26 107 -199 431 146 -183
3598 -183 -37 -13 123 586 260 73 -16 94 -54 255 -41 337 189 -205 -100 -41 340 -50 173 192 3
3619 3 -350 272 -209 -48 104 164 28 -181 -66 -201 -73 138 111 -85 231 125 162 -151 353 85 -255 -350
3641 -350 -42 -307 -217 18 121 250 -69 -263 157 -30 291 -101 95 -185 33 -392 -110 233 508 331
3661 331 -380 -265 122 -347 -479 131 302 -85 28 356 -257 -282 60 65 -55 -257 -189 -168 -102 167 -124 -295
3683 -295 539 120 -409 -126 384 -10 -21 607 427 13 27 -126 101 171 -234 152 -59 132 -2 337 -218
3704 -218 -543 -221 304 -410 -247 -295 -215 70 -421 176 -237 -590 -175 165 -232 -48 420 -161 -5 548 351
$$ packed form
3556b59M79j25j1K44k00j79K35n14O08l25j17L77J81o29J78J02j93j2k60k8J48
3577c00l3M39j34n98M32o0L08m35M79k64M54l55j35K15m08L69J33l06O30k85l29
3598a83J46K4J36M63l26j87q9J10j48L09k96L78j48l94J05N9L81l90K23J9j89
3619Cl53O22m81J61J52O0j36k09J15j35J28K11k7j96L16j06L7l13N04k68l40r5
3641c50L08k65R0K35J03J29l19j94M20j87L21l92J96k80K18m25K82L43K75j77
3661C31p11J15L87m69j32O10J71l87J13L28o13k5L42Nj20k02O8K1O6K69k91j71
3683b95Q34m19n29K83N10l94j1O28j80m14J4j53K27P0m05L86k11J91j34L39n55
3704b18l25L22N25p14J63m8Q0K85m91N97m13l53M15L40l97J84M68n81J56N53j97
$$ plain form
3725 351 314 206 263 -208 19 -350 204 378 364 265 -353 95 27 60 -139 -52 -166 22 113 10 151 -134 -249
3748 -249 -329 89 19 -174 358 107 65 -133 79 294 11 174 -366 -201 45 61 40 318 -1 -286 109 147
3770 147 288 -126 -29 -201 -164 138 -243 -60 174 229 -258 -182 -7 56 -8 103 -73 91 -234 -231 28 101 -140
3793 -140 530 81 -236 -430 -65 -19 -362 117 -116 -386 -318 -66 -104 -213 262 282 145 66 93 -155 -188 268
3815 268 407 27 532 -59 -66 -9 -73 88 182 67 -140 331 57 -416 -46 219 107 7 52 -67 -65 241 -85
3838 -85 -453 288 -286 -30 -199 -190 -127 -218 94 141 -132 75 194 -101 565 268 154 75 71 179 -108 160 54
3861 54 -181 224 -440 -28 -146 48 -77 170 8 94 -227 -365 320 -167 -305 -160 -108 -285 232 -185 -15
3882 -15 81 155 -250 9 -97 -26 236 74 168 2 -154 59 34 147 186 -118 274 -94 131 -291 9 -253
$$ packed form
3725C51l7j08N7m71K27l69N54J74j4r9o18M48o8L3j99Q7j14J88R1j03J41k85j15
3748b49q0M18p0j93N32k51m2j98K12K15k83J63n40J65K46J6k1K78l19k85L95L8
3770A47J41m14R7j72L7L02l81J83K34N5m87P6J75O3o4J11j76J64l25LK59P3k41
3793a40O70m49l17j94L65M6l43M79k33k70O8K52l8j09M75K0j37p9K7k48l3M56
3815B68J39l80N05n91pN7o4J61R4j15k07M71k74m73L70K65j12j00M5j19KL06l26
3838h5l68P41n74K56j69RO3r1L12M7k73K07J19k95O66k97j14p9mJ08k87K68j06
3861E4k35M05o64M12j18J94j25K47j62Q6l21j38O85m87j38J45N2j77N17m17J70
3882a5R6P4m05K59j06P1K62j62R4j66j56K13k5J13L9l04L92l68K25m22L00k62
$$ plain form
3904 -253 -355 -7 -16 -61 -142 219 -168 -64 -46 -142 -21 -238 292 280 278 124 40 472 -12 64 -237 82 10 291
3928 291 -9 274 -17 -316 -177 135 -371 241 15 -386 93 -181 214 -283 170 -274 46 -251 17 309
3948 309 50 231 14 361 91 93 -12 245 88 22 18 178 132 199 -243 0 218 183 84 -479 -149 50 328
3971 328 -339 95 -159 -297 -567 -111 -191 -238 130 -306 -78 -96 -144 -35 17 -259 51 -140 -219 118 -232 -98
3993 -98 -33 -195 247 160 18 336 141 207 -20 203 34 -177 -51 223 -101 21 57 152 -246 -104 2 -125
4015 -125 188 89 476 -172 -21 -14 46 -230 290 -17 -59 26 -131 -42 -362 50 41 -223 -293 -45 -256 260 -672
4038 -672 -414 36 526 149 -84 5 117 -57 11 -121 -459 -20 55 -91 231 87 -359 -155 175 120 -5
4059 -5 87 100 -352 -54 45 -317 -453 -270 69 -202 -1 -55 -81 -153 -291 -146 107 103 -167 114 -81 -137 -1 282
$$ packed form
3904b53j02L48rm5q1L61l87J04J8r6J21k17N30j2kj54q4M32m84P6l01L19p2K81
3928B91l00K83k91k99J39L12n06O12k26m01M79k74L95m97M53m44L20k97K68K92
3948C09k59J81k17L47k70Kj05K57j57o6mJ60m6O7m42K43K18l5r9n63L30J99K78
3971C28o67M34k54j38k70M56q0m7L68m36K28j8m8J09N2k76L10j91p9L37l50J34
3993i8O5j62M42q7j42L18j95O6k27K23j69k11J26K74l24J22L6R5l98J42J06j27
4015a25L13r9L87o48J51PO0k76N20l07m2Q5j57Q9l20M12rk64p0K48k11N16r32
4038f72K58M50M90l77k33Q9J12j74O8j32l38M39P5j46L22j44m46K04L30n5j25
4059eR2J3m52K98R9l62j36J83L39k71K01n4k6p2j38J45K53mk70K81j95n6J36K83
$$ plain form
4083 282 199 72 31 -8 220 -31 217 -1 -199 -85 -189 -133 16 54 23 218 -47 -220 -139 -165 8 72 -200
4106 -200 -660 -144 -149 -488 135 91 72 473 165 31 50 486 285 7 -4 171 -224 111 -37 49 304 -210
4128 -210 -319 17 113 -423 150 -120 -321 419 62 168 -104 -59 23 120 -87 -113 115 -307 126 -116 -84 181
4150 181 -72 -278 146 -20 238 401 217 -176 144 102 -256 122 -307 238 -41 -93 441 -102 -18 -76 -178
4171 -178 -291 -103 144 129 -122 212 235 -155 23 76 144 184 206 289 207 -346 -75 27 -171 -46 12 441 98
4194 98 319 -517 -189 -190 -99 -100 -254 220 -194 -150 226 203 -77 -3 241 -31 -115 -260 -390 -91 288 68 112 -10
4218 -10 133 342 -25 -18 69 156 367 -122 -6 -5 -153 104 100 -16 -2 81 12 151 85 -154 166 135 -51 16 -48
4243 -48 218 76 130 486 135 493 75 150 -514 177 393 -70 -15 -250 -41 -226 -7 -189 -694 -486 78
$$ packed form
4083B82q3j27m1l9K28k51K48k18j98J14j04N6J49L8l1J95k65j73Q1k6J73O4k72
4106b00m60N16nl39O23m4j9M01l08j34J9M36k01k78j1J75l95L35j48Q6K55n14
4128b10j09L36R6n36N73k70k01P40l57J06k72M5Q2R7k07k6K28m22M33k42L2K65
4150A81k53k06M24j66K58J63j84l93L20m2l58L78m29N45k79n2N34n43Q4n8j02
4171a78j13J88K47j5k51L34K3l90J78N3O8M0K2Q3q2n53K71J02j98J25N8M29l43
4194I8K21q36L28jR1jj54M74m14M4L76k3k80P4K44k72q4j45j30K99L79k20M4j22
4218a0J43K09l67PQ7Q7K11m89J16Jj48K57mj16J4Q3o9J39o6k39L20l1j86O7o4
4243d8K66j42N4L56l51L58m18P5o64O91K16m63N5k35K09j85K19j82n05K08N64
$$ plain form
4264 78 -65 147 119 40 87 -74 147 -64 -60 -171 21 182 -30 21 245 0 -241 23 243 167 94 144 248
4287 248 -37 -147 178 88 -244 -121 185 -68 -8 -17 81 -66 -114 -5 186 -341 286 -27 154 193 240 -197 525
4310 525 38 423 -107 297 -150 300 -315 142 159 -128 167 -102 30 -201 197 -235 247 -293 -22 -249
4330 -249 -252 -128 -222 377 -220 -123 -228 131 -219 -104 352 79 -28 159 -10 75 147 -261 114 242 -25 81
4352 81 70 141 -73 -42 239 -199 -208 -208 -27 -247 139 116 -210 -68 98 -32 163 -365 -56 -225 -13 39 496
4375 496 -254 322 98 11 -64 -503 65 90 39 297 262 -205 299 -31 -300 -69 101 -111 -12 7 -4 -538 -378
4398 -378 -310 191 191 93 -121 -109 52 -228 132 -64 189 -154 350 131 -186 36 111 -69 -41 -303 -163 -375
4420 -375 -269 -90 154 -140 -161 -107 -169 -104 3 262 -198 -122 -89 114 -218 -48 -155 362 343 1 279 -37
$$ packed form
4264G8j43K12k8p9M7j61K21k11Mj11J92J61k12N1K24k45k41K64K20p6p3N0J04
4287B48k85j10L25r0l32J23L06k53O0rR8j47m8J09J91n27O27l13J81L9M7m37P22
4310E25m87L85n30M04m47M50o15M57J7k87K95k69J32k31L98m32M82n40K71k27
4330b49lJ24r4N99n97R7j05L59l50J15M56k73j07J87j69Q5P2m08L75J28k67J06
4352H1j1P1k14L1K81m38r%J81k20L86k3l26J42J66j30J95n28L09j69K12N2M57
4375D96p50N76k24q7p5m39N68K5n1K58l5m67N04l30k69K31J70k12R9J9j1n34J60
4398c78O8N01%r8k14J2J61k80L60j96K53l43N04k19l17K22P5j80K8k62J40k12
4420c75J06J79K44k94k1N4o2O5J07K59m60P6L3K03l32J70j07N17j9l42K78l16
$$ plain form
4442 -37 4 -144 -225 152 -431 94 -101 -285 -130 -246 132 -295 324 41 -451 -271 -100 409 168 -82 187
4463 187 -104 -135 -122 94 63 80 -9 -281 105 248 76 419 -10 265 -299 113 1 149 149 -299 68 -252
4485 -252 -267 198 22 -315 281 -197 -190 -85 -381 172 193 62 40 -101 -148 -55 -190 163 -88 -167 -371 49 176
4508 176 -63 176 8 -37 -104 -271 -1 -30 -126 99 -140 230 -31 -212 149 -297 78 162 190 -302 -38 -43 54
4531 54 184 108 202 -321 -94 -211 -82 181 -28 -11 -237 115 86 -139 351 79 -84 -99 -26 -118 -533 -86 171
4554 171 2 198 -311 195 -76 -269 242 139 646 84 104 -39 14 -3 407 -346 22 -179 -68 129 88
4575 88 150 -17 -20 23 -48 -35 161 -31 123 116 62 -23 -46 14 337 -91 -299 -1 -295 -26 132 -169 -216 114 -104
4600 -104 161 215 -176 -143 -178 239 79 222 -291 -150 153 -70 459 -176 265 -10 -675 175 2 96 241
$$ packed form
4442c7M1j48q1L77n83N25j95j84J55j16L78m27O19k83m92J80J71N09k41k50K69
4463A87k91l1J3K16l1J7q9k72L86J43j72L43m29K75n64M12j12J48%m48L67l20
4485b52j5M65j76l37N96m78PJ05k96N53K1j31k2j41m7R3j35L53k51p9k04M20J27
4508A76k39K39j68m5o7j67K70k9r6K25k39L70k61j81L61m46L75Q4K8m92K64nR7
4531E4J30p6R4n23K27j17J29K63k09J7k26L52k9k25M90k72j63j5P3r2m15M47K57
4554A71j69J96n09N06k71j93N11j03N07n62K0j43N3j7M10p53L68k01J11J97m1
4575H8O2j67lM3p1J3J96j92J54pn4q5k3O0L23m28k08K98k94K69J58l01m7L30k18
4600a04K65N4l91L3l5M17j60J43n13J41L03k23N29o35M41k75o65Q50j73R4J45
$$ plain form
4621 241 -42 -385 -64 75 -360 383 -32 69 -60 128 -312 -29 180 -52 299 57 314 184 -102 -202
4641 -202 -194 184 -160 155 293 -128 -200 196 212 336 147 -282 -142 -331 26 -65 58 10 -199 81 -371 27
4663 27 44 88 58 314 -204 -270 57 313 15 84 14 84 -21 -412 244 -12 -168 137 268 113 504 -312 -127
4686 -127 45 -124 -594 220 -21 1 -158 -436 -422 -335 -59 104 20 119 -242 -337 229 159 -67 88 -34 -80 -14
4709 -14 411 215 -77 349 100 -107 -13 706 -507 81 -88 162 -152 57 324 -60 73 -85 156 8
4729 8 -123 -201 74 21 47 304 6 130 -167 -423 57 58 144 -35 -33 -3 -34 41 196 334 132 -84 -37 435 -67
4754 -67 -235 681 -266 62 327 31 197 402 -36 -4 60 10 -92 -96 623 -26 97 122 -82 -87 98 450 -6
4777 -6 -98 -388 168 -253 -203 -341 274 117 -143 -174 -467 -48 -13 100 -96 181 53 98 12 51 -502 -81 246
$$ packed form
4621B41k83l43L21J39m35P43m15J01j29J88m40K83K09k32L51k42K57j30k86j00
4641b02QL78l44L15J38m21p2L96J6J24j89m29J40j89L57r1J23m8k09K80m52L98
4663B7J7M4l0K56n18o6L27K56k98O9p0P0j05l91O56k56j56L05J31j55L91q16J85
4686a27J72j69m70Q14k41K2j59k78J4Q7K76J63q4R9l61r5N66p0k26J55j22m6O6
4709a4M25j96k92M26k49k07R4P19j213N88j69K50l14K09K67l84J33j58K41j48
4729Hj31p8K75n3K6K57k98J24k97k56M80JQ6j79KL0l1P5J55J38k02k16M7M72n02
4754f7j68R16r47L28K65k96J66K05m38L2O4n0j02mP19o49J23K5k04nJ85L52m56
4777fr2k90N56m21N0j38O15j57k60l1k93M19L5J13j96K77j28M5q6L9n53M21L27
$$ plain form
4800 246 248 464 -5 -25 -261 427 140 223 -65 -29 79 73 -378 -170 -28 -353 292 -316 115 -87 -145 32 -417
4823 -417 -97 -228 -527 -560 99 -340 202 -2 -21 -112 -50 57 380 313 71 166 -125 116 -110 15 291 107
4845 107 257 241 -88 350 -59 33 -87 63 -121 68 -162 121 305 207 77 -89 -232 82 -80 -97 179
4866 179 30 -172 130 21 -29 39 305 -76 -314 280 174 201 27 170 360 128 -153 -160 -114 -238 -57 -103
4888 -103 -332 -209 -283 -291 -43 126 -65 225 38 22 -152 44 -124 62 168 194 -76 -66 -264 -125 281 256
4910 256 -292 24 -9 43 80 -18 187 103 98 -482 -470 -90 182 88 -193 -44 389 -31 -144 -97 268 315 212 115
4934 115 149 61 -50 -32 122 -50 -146 214 35 -169 -456 -250 -422 -335 -91 -143 -175 -239 35 -124 -90 -133 246
4957 246 215 480 -164 -157 1 7 166 -116 -38 380 80 -330 -362 13 -339 -304 -98 113 -75 -68 86 114 69 -120
$$ packed form
4800B46KK16m69k0k36O88k87Q3k88L6J08om51K08J42l25O45o08M31k02n8J77m49
4823d17L20j31k99l3O59m39N42k04j9r1O2J07L23o7k42R5k91K41k26J25K76j84
4845A07J50j6l29M38m09R2j20J50j84J89k30K83J84r8j30j66j43L14j62j7K76
4866A79j49k02L02j09n0O8K66l81k38N94j06K7j74J43J90k32k81pM6j24J81m6
4888a03k29J23p4qK48J69j91K90j87j6j74J96j68J86J06K6k70J0j98J39M06k5
4910B56n48L16l3N2L7r8K05q4nn80J2L80K72r4k81J49M33m20j13M7L65M7j03r7
4934A15L4q8j11J8J54j72r6L60j79k04k87K06j72Q7K44n2l2o4K74j59L4m3L79
4957B46l1K65o44PJ58OJ59k82P8M18l00m10l2L75l52L5K06K11j88PJ54K8m5j89
$$ plain form
4981 -120 -111 -75 -477 -322 -67 -206 -59 317 188 -172 45 -45 -190 -237 310 -295 176 549 -81 -158 162 190
5003 190 215 -14 286 42 28 360 -96 -224 -246 -184 -149 -420 180 -267 -201 -414 -297 -157 269 31 -279 -215
5025 -215 149 128 -174 332 -141 -373 69 -27 220 181 -15 206 -21 175 191 74 -143 284 105 -76 -30 209
5047 209 -131 152 -251 218 177 -232 311 208 -209 135 129 180 150 -125 57 99 -18 -152 210 95 158 430
5069 430 -28 -130 127 -15 -75 -33 240 107 -451 -186 48 203 -364 -76 68 -144 -24 -15 -136 -254 -194 -22
5091 -22 285 -225 310 -1 -161 -225 -45 295 24 -67 -479 -95 16 147 -360 -45 -77 21 -432 281 -177 12
5113 12 30 2 249 55 156 -193 208 244 -137 -43 211 311 91 -111 83 -108 -69 5 123 231 -556 -187
5135 -187 70 -150 18 -19 133 -232 85 73 -229 -22 -79 -184 -94 213 71 368 -164 -27 223 -180 155
$$ packed form
4981a20RL6m02J55K55j39J47L76j29l60K17r0j45m7N47o05M71L73o30p7L20K8
5003A90K5k29L00k44j4L32m56j28k2O2L5k71O00m47O6k13J17J40M26k38l10O4
5025b15L64k1l02N06m73k32M42r6K47l9j96K21k27J96J6j17k17M27j79j81M6K39
5047B09l40K83m03M69m1m09N43j03m17L44oN1l0k75J82M2j17j34L62j15O3K72
5069D30m58j02K57j42o0M2K73j33n58K65K34J55n67K88J44k12J20Rj21j18O0J72
5091b2L07n10N35l11j60o4J80L40k71r1m12L84J11J31n07L15l2R8m53P13m58J89
5113A2J8k8K47j94J01l49M01L6l81R4K54J00k20k02J94j91L9P4J18J08p87L69
5135a87K57k20J68l7J52l65L17j2l02K07n7j05R0L07j42K97n32J37K50m03L35
$$ plain form
5156 155 174 -61 407 235 230 91 297 -458 72 275 -92 -54 -84 -229 324 -276 -18 -2 -93 114 -236 -212 163
5179 163 -15 72 -150 -435 258 13 52 55 40 -62 -83 256 688 229 323 -224 132 -139 125 254 -153 157
5201 157 452 540 -35 279 -31 55 -24 193 220 90 -256 -3 -235 -121 308 29 -261 -294 5 -245 113 125
5223 125 -303 42 -92 75 270 529 -114 -76 117 -361 -20 186 447 -151 469 164 -49 -108 266 140 -314
5244 -314 175 -552 153 12 30 -272 -39 -21 -223 -146 101 -96 -44 57 235 443 131 120 -340 -141 417 -52
5266 -52 -69 48 124 95 94 -163 123 -84 -268 233 -23 -287 -33 -36 107 237 -168 71 54 74 -243 -252 -57 148
5290 148 -381 -207 -154 -218 134 481 168 -402 -191 99 -282 97 -186 -30 -170 139 128 -247 -117 -405 -114
5311 -114 -165 -90 169 -201 347 325 -12 55 -107 48 -161 -100 -367 23 93 160 -91 -57 -336 -65 -253 181 -316
$$ packed form
5156A55J9k35M68j72nj39K06p55N30K03l67L8l0j45N53o00K58J6r1K07l50K4L75
5179A63j78Q7k22k85O93k45L9Lj5j02k1L39M32m59R4n47L56k71K64J29m07L10
5201A57K95Q8n75L14l10Q6p9K17K7j30l46K53k32J14M29k79k90l3K99k50L58J2
5223A25m28L45j34J67J95K59o43L8J93m78L41K06K61n98O20l05k13n9L74j26m54
5244c14M89p27P05j41J8l02K33J8k02P7K47j97N2J01J78K08l12j1m60J99N58m69
5266e2j7J17P6k9jk57K86k07j84N01k56k64K54lJ43J30m05K39j7K0l17rJ95K05
5290A48n29J74N3o4L52L47l13n70K11K90l81L79k83J56j40L09j1l75J30k88K91
5311a14n1P5K59l70N48k2l37O7j62J55k09O1k67L90P0O7k51L4k79K71j88M34m97
$$ plain form
5334 -316 -457 41 -178 -231 116 439 -16 139 82 -439 1 -295 -231 -3 111 -149 -132 -47 -19 -180 -2 156
5356 156 -199 92 110 116 68 163 129 -75 182 -315 -65 17 43 -167 168 -102 -196 71 -236 -125 -139 -338 21
5379 21 -102 -385 -214 -61 164 294 403 97 260 362 9 -38 214 187 35 366 255 -176 4 -91 79
5400 79 -155 -148 260 179 115 126 110 104 -92 317 -234 -177 -112 -106 234 -91 -47 -234 175 111 -222 115 170 -158 121
5425 121 -220 61 287 -350 -21 -139 -196 31 -26 18 -391 -90 139 -326 -2 -272 -156 4 -249 138 -15
5446 -15 -42 -66 99 55 146 301 -290 -156 -236 -377 53 310 -161 304 102 -252 259 -339 269 111 -336 -300
5468 -300 412 -45 -359 50 157 21 126 -93 -12 -66 -306 -104 323 -86 -179 -170 109 -179 16 -198 -403 13
5490 13 424 187 -26 -6 -123 137 -308 -205 -65 -476 146 -115 162 -444 20 -210 -446 -106 -1 403 -370
$$ packed form
5334c16j41M98k19n3L47L23m55J55n7n21M40k96O4K28J14k60J7Q5K8j61J78J58
5356A56l55K91J8Om8R5l4k04K57m97K50Q2K6k10L35k70r4K67l07J11j4j99L59
5379B1j23k83J71J53K25J30J09l06J63J02l53m7K52k7j52L31j11m31J80r5J70
5400G9k34PM08q1o4J1j6oj96M09n51N7O5OL40l25M4j87M09o4l33L37N5l28K79
5425A21l41K81K26o37L29j18n7K27n7M4m09L01K29m65L24k70J16J60k53L87j53
5446a5k7k4J65m4R1J55n91J34q0j41M30K57m71M65k02l54N11n98O08j58m47L6
5468c00P12m57l14M09J07j36J05k19Q1n4k40K02M27m09r3RK79k88J95k14k05M16
5490A3M11k37k13K0j17K60m45J03J40m11O22k61K77o06M64k30k36L40J05M04p73
$$ plain form
5511 -370 20 -78 -184 -133 62 66 137 75 117 538 -24 414 -159 -27 125 17 167 20 217 124 96 -245 -144
5534 -144 -269 -132 220 -123 -143 -208 36 1 88 103 4 427 -271 -40 -97 103 -146 356 -220 275 -99 -27 258
5557 258 -301 72 -26 187 113 -33 -11 -199 156 -336 126 38 -30 -153 83 196 -86 191 -187 -482 36 48
5579 48 141 307 52 2 162 -42 207 186 -203 -60 -22 -60 135 250 98 -339 -94 -506 315 -16 9 411
5601 411 228 -95 -83 108 237 -168 12 22 119 -27 79 127 -119 -240 124 271 -49 -80 57 166 -163 -53
5623 -53 27 -111 279 -119 -65 -83 -140 322 213 385 -161 -162 -125 -151 -180 359 -339 0 -210 166 77 -208 -168 -108
5647 -108 202 -80 -89 88 97 -63 -253 148 168 -24 323 169 223 114 118 72 69 36 -41 138 131 80 136 -151 347 30
5673 30 -227 188 -343 -59 -214 257 -121 112 87 -67 -50 277 130 -94 -184 239 -61 59 -120 161 372
$$ packed form
5511c70L90r8j06N1J95MP1o2M2M21n62M38n73J32J52j08J50j47J97r3k8l41J01
5534a44j25J37L52l43k0o5K44l5Q7J5r9M23o98K31n7K00k49N02n76M95l74P2K85
5557B58n59L73r8K13p4j46K2j88L55m92M62q8o8j23K36J13k82K77l78k95N18J2
5579D8R3J66k55n0J60k04K49k1l89J43L8l8J95J15j52m37K45m12Q21l31K5M02
5601D11j83l23J2J91J29m05J80J0R7j46J06M8k46j21L64J47l20l1J37J09l29J10
5623e3Q0j38L90l98N4j8n7M62j09J72n46jL7k6k9N39o98L39k10L76q9k85M0O0
5647a08L10k82rJ77Rj60j90M01K0j92L47j54N4j09Mm6ll3p7J79pn1N6k87M98l17
5673C0k57M15n31K84j55M71l78K33k5j54J7L27j47k24r0M23l00J20j79K81K11
$$ plain form
5694 372 -32 -21 -20 -72 321 -21 -199 -48 -320 -339 338 326 -221 -72 359 -15 -127 -159 -38 181 41 195
5716 195 -3 234 267 224 10 -108 -164 150 214 -33 -107 43 -382 -235 -97 -39 315 260 28 106 -488 85 68
5739 68 46 31 -147 324 -301 -67 367 148 646 162 39 153 219 62 -55 551 49 155 118 187 -99 -105 -211
5762 -211 39 -29 241 156 56 -76 216 208 93 -92 376 31 192 -80 416 -241 310 351 54 -206 -174 -135
5784 -135 -40 142 -434 151 -53 228 -3 127 -236 -2 14 191 -87 -148 -203 -288 98 -424 -183 173 -190 252
5806 252 -326 52 266 196 -310 -319 412 84 60 -176 118 -295 -82 -87 49 173 148 -13 94 -92 -145 -317 31
5829 31 80 -261 -101 -4 -70 297 -57 203 251 -142 -82 274 187 -227 68 124 426 -246 259 -103 -137 -5 227
5852 227 -179 -258 451 7 54 -116 300 88 -209 -236 -7 102 -180 236 -240 -204 -45 25 -274 -285 -65 108
$$ packed form
5694C72m04J1Jn2L93l42j78J51k72j9O77j2n47J49M31l74j12l2J21K19j40J54
5716A95j98K37L3m3k14j18n6L14O4k47p4J50m25J47J38N8L54n5k32P8n94N73j7
5739F8k2j5j78M71o25K34M34k19M98m84j23J14O6j57j17O06n02J06l7O9k86oj06
5762b11K50o8K70q5j00j32K92qj15j85M68l45J61k72M96o57N51M1k97k60L2L9
5784a35R5J82n76N85k04K81k31J30l63K34J6J77k78o1n5q5L86n22K41L56l63M42
5806B52n78L78K14p0n06rP31l28k4k36K94m13K13nJ36J24k5j61J07j86n3j72L48
5829C1M9l41J60R7o6L67l54K60M8l93O0L56q7m14K95N6L02o72N05l62l4J32K32
5852B27m06p9P09m44M7j70M16k12k97k7K29J09k82M16m76L6J59P0k99j1K20J73
$$ plain form
5874 108 -164 247 -154 238 22 50 -204 -147 77 -241 151 -313 98 -1 14 110 -1 -47 201 135 369 -194
5896 -194 -4 -90 302 206 -2 58 -192 347 -66 -519 -1 -89 122 17 87 -76 -94 -197 9 178 17 -49
5918 -49 249 -196 336 41 49 117 62 -151 -213 184 -60 147 17 252 -223 318 46 61 -221 322 37 289
5940 289 -376 315 -32 316 -127 -40 41 3 168 315 6 344 314 152 -195 -205 337 123 76 272 -127 -320
5962 -320 -552 89 -34 -154 -44 -265 -196 132 12 -7 37 -250 126 10 210 567 204 -134 -110 100 238
5983 238 40 186 -163 -150 124 36 -460 48 -284 -192 -105 -235 -305 -396 50 76 201 225 -45 205 -107 -221 -205
6006 -205 -142 -222 -137 323 128 355 334 118 11 86 457 120 146 -370 399 -392 656 159 -95 -116 -171 72
6028 72 -127 -168 178 135 -282 -329 -240 -1 13 -83 294 220 -20 -82 -13 -80 80 -248 -304 215 51 -282 -35 44
$$ packed form
5874A08k72M11m01L92k16K8k54N7K24l18L92m64M11r9J5R6j11m6K48o6K34n63
5896a94J90q6L92r6k08O0k50N39m13m53N18q8K11j05P0j63j8j03K06J69j61o6
5918d9K98m45N32k95QO8n5k13o2L97k44K07j30K35m75N41k72J5k82N43k85K52
5940B89o65O91l47L48m43Q7Q1l8J65J47l09L38l0j62l47j0N42k14m7J96l99j93
5962c20k32O41j23j20J10k21O9L28j20j9M4k87L76j16K00L57l63l38K4K10J38
5983B38j98J46l49J3K74q8m96N08l32R2Q7j30p0r1M46K6J25K4k70K50l12j14J6
6006b05O3q0Q5M60j95K27k1k16j07P5L71l37K6n16P69p91J048m97k54k1n5K43
6028G2j99m1L46m3m17m7Q9K39J4r6L77p4k40o2O9o7J60l28n6N19j64l33K47P9
$$ plain form
6052 44 -335 170 82 -246 71 220 -10 -6 104 -29 -108 463 -28 325 27 -141 250 3 417 -278 -138 -1
6074 -1 259 182 -54 -335 30 43 58 -232 -58 171 253 -216 385 50 -147 -121 294 -54 77 116 -66 -48 -363
6097 -363 60 27 60 -31 -25 61 -96 -119 -27 79 191 61 321 -34 -57 -28 317 217 112 -25 48 -50 -124 136
6121 136 -217 -417 -457 273 104 325 -473 154 -29 197 -444 216 94 -29 278 354 49 44 227 -18 -86 0
6143 0 -43 226 32 -96 -53 -196 55 9 23 7 -117 109 149 160 -188 -70 34 322 199 121 -182 247 -29
6166 -29 -13 242 107 -48 -113 15 37 370 215 497 321 164 -515 -201 -110 284 90 101 -236 275 45 159
6188 159 -173 41 -85 -38 -295 173 -52 117 -122 -186 32 17 -109 -543 152 -167 147 -29 71 -436 -211
6209 -211 -27 9 281 -117 -77 -4 -28 20 -3 152 119 43 -198 -68 -305 -163 19 -169 -40 148 -21 -44 250
$$ packed form
6052D4l79N05q8l28L17J49k30MJ10j33p9N71m91L53k98j68L91k47M14o95J40J37
6074aK60p7k36k81L65J3J5k90J74K29Q2m69O01l35j97K6M15l48J31L9j82J8l15
6097c63M23l3L3r1OQ6j57k3R2J06J12j30K60l55k3K9L45j00j05j37P3r8p4K60
6121A36l53k00m0P30j69K21p98O27j83K26o41O60j22j23L07P6l05nJ83k45o8Q6
6143@m3K69j94j28M3j43K51m6J4j6j24K26M0J1l48J18J04K88j23p8l03M29k76
6166b9J6K55j35j55o5J28K2L33j55K82j76j57o79L14R1L94j94J1l37N11k30J14
6188A59l32K14j26M7k57M68k25J69k39o4K18j5j26m34O95l19L14j76J00n07K25
6209b11J84L6K72l98M0P3k4M8k3J55l3p6k41J30k37J42J82j88J29J88j69k3K94
$$ plain form
6232 250 -423 -100 134 -144 148 102 52 95 -21 47 -366 276 99 -359 26 -308 13 98 187 223 -234 -53
6254 -53 -290 -107 -56 -3 232 193 -135 230 -73 -127 39 -358 -11 486 227 314 285 419 -115 -512 -155 121
6276 121 -180 -189 -9 -199 -11 -365 -610 53 -395 -169 -200 -97 90 -260 109 -140 57 -244 287 87 113
6297 113 451 93 40 -173 275 -3 49 -120 -63 -96 263 101 117 277 577 123 394 167 143 -224 -93 -111
6319 -111 -163 5 -368 4 -56 -177 274 -452 -59 -233 -155 -201 -137 -119 -107 29 318 325 -64 171 44 -156 -279
6342 -279 109 64 -238 200 75 69 58 -320 -118 1 287 -97 -181 -67 165 -251 -385 194 -56 -241 -147 20
6364 20 8 -248 316 84 21 -126 -36 -22 273 -168 652 29 45 -168 221 -160 507 -81 -261 221 38 -532
6386 -532 302 -406 -174 10 -134 62 -14 69 -175 42 270 231 -28 203 243 40 -25 446 201 -419 -400 -15
$$ packed form
6232B50o73L23K34k78K92m6n0M3j16O8m13O42j77m58L85l34L21Q5Q9L6m57J81
6254e3k37J83N1N3K35l9l28L65l03n4J66l97L47M97k59Q7k9J34n34l97L57K76
6276A21l01rJ80j90J88l54k45O63m48K26l1J03J87l50L69k49J97l01N31k00K6
6297A13L38l58n3k13M48k78N2j69N7l3L59j62J6J60L00m54K71k27k4l67J31j8
6319a11n2J68l73L72o0j21M51p26L93j74P8m6O4J8J2J36K89Pl89K35j27k00j23
6342b79L88m5l02M38j25oj1l78K02J19K86l84q4J14K32m16j34N79k50j85R4J67
6364B0j2k56N64k32o3j47R0J4K95m41Q20o23J6k13L89l81O67n88j80M82j83n70
6386e32Q34p08K32J84j44J96p6Q3k44K17K28l9k59K31M0k03o5M71k45o20J9L85
$$ plain form
6408 -15 -135 215 -27 -134 16 -139 89 52 155 -7 192 0 -195 173 -97 -295 64 384 50 -254 116
6429 116 394 -67 17 58 -98 72 -111 -150 -365 26 2 27 154 -130 342 56 313 182 -187 180 -14 159
6451 159 -100 -105 225 43 62 -377 82 266 -199 -88 87 115 204 -111 -20 262 431 67 36 1 40 45 174 198
6475 198 48 -191 137 -183 93 341 500 -324 -114 -271 -3 98 90 416 -413 -213 121 -105 -187 169 16
6496 16 -95 -227 157 -51 -369 260 76 364 385 300 50 -231 -45 168 296 -226 -140 330 94 -40 -45 165
6518 165 -364 319 184 -113 -195 -10 -159 -88 -204 -217 -145 95 41 294 47 -155 82 -86 164 -440 -188 -25
6540 -25 211 21 63 137 -70 0 290 62 70 156 315 -230 261 282 243 10 -183 99 1 60 -168 135 -229 -283
6564 -283 113 -57 -180 -240 115 80 81 -47 -359 -198 148 345 -366 345 247 159 -81 -126 -248 -51 -127 -319 -100
$$ packed form
6408a5j20L50k42j07J50j55K28l7J03j62J99j92j95L68k70j98L59L20l34l04L70
6429A16K78m61Q4M1j56J70j83l9k15L91k4K5J27k84M72k86K57j31l69L67j94J73
6451A59k59nL30j82J9m39M59J84m65J11J75K8Q9l15R1K82J69l64l1l5L9NJ29K4
6475A98j50k39L28l20K76K48J59q24K10j57K68J01qL26q29K00L34k26q2L56j53
6496A6j11j32L84k08l18O29j84K88K1q5k50k81J86K13J28n22Q6M70k36j34nK10
6518A65n29O83j35k97q2J85j49P1j16j3P2K40n4K53k47k02K37j68K50o04K52J63
6540b5K36j90M2P4k07P0K90k28QQ6J59n45M91K1l9k33j93K82r8N9k28L03l64n4
6564b83L96j70j23o0L55l5Jj28l12J61L46J97p11P11r8q8k40m5j22J97p6j92K19
$$ plain form
6587 -100 -153 0 96 193 -352 336 -68 -146 121 67 -252 -7 251 53 -286 -224 250 -116 353 -156 -89 -144 -225
6610 -225 -313 -116 46 158 -131 110 -301 159 68 -131 -203 122 29 -382 -35 -193 125 20 -285 269 46
6631 46 266 -121 -74 331 60 -84 -27 -121 505 305 561 -291 -51 26 -73 210 78 -54 -150 -264 305 -82
6653 -82 -5 -88 159 -256 -335 290 190 221 -53 105 31 10 -50 138 -1 232 355 -156 -456 147 -146 32 104
6676 104 -151 218 -81 155 -116 88 494 145 239 -210 -293 94 1 147 -197 127 -182 216 196 -54 54
6697 54 -33 -101 120 -144 16 -131 191 2 -1 182 -86 465 308 -184 -51 -103 -90 56 133 -105 -108 -19 -45 34
6721 34 -15 -399 -4 198 280 -132 -214 -193 -129 -244 67 8 -116 63 25 187 42 336 -153 195 411 -54 -132
6744 -132 -175 -82 -191 -48 60 43 278 151 -295 128 127 34 -289 67 -165 261 -130 97 68 112 76 -105 -24
$$ packed form
6587a00n3J53R6R7n45O88m04p8K67n4l19K45K58j98l39O2M74l66M69n09O7n5q1
6610b25q8J97J62J12k89K41m11M60r1j99p2L25r3m11L47j58L18j05l05N54k23
6631D6K20l87M7M05k71j44N7r4O26k00K56q52K40P7r9K83j32j32r6j14N69l87
6653h2P7q3K47m15p9O25j00L1k74J58p4k1o0J88j39K33J23n11l00O03k93J78P2
6676A04k55L69k99K36k71K04M06l49R4m49q3L87r3J46l44L24l09L98k0k50J08
6697E4q7o8K21k64J60j47L22j89lJ83k68N51j57m92J33n2J3J46P7k38lQ9k6P9
6721C4m9l84L95K02Q2m12q2K1O4j15L11n9j24J79l8J62j45K94m89L48K16m65p8
6744a32m3R3j09J43J08j7K35j27m46M23jr3l23L56k32M26l91K27k9M4l6j81Q1
$$ plain form
6767 -24 -110 363 -294 -193 167 -235 10 -80 59 203 100 218 56 205 20 -343 -3 -63 -212 -183 393 17
6789 17 -240 -378 78 -281 -264 -202 145 86 -443 311 -137 -90 -58 -210 38 118 128 -3 45 60 86 -87 -146 297
6813 297 -43 -107 -47 -57 -277 191 -331 -409 -8 85 -140 -59 -101 4 -88 35 412 222 89 -15 161 52 54
6836 54 -96 107 250 245 -403 368 -207 186 103 -111 -327 139 -157 14 158 -102 154 64 82 33 152 89 389
6859 389 177 7 2 67 353 -112 155 52 -53 -186 133 -27 114 119 -239 211 387 -49 -202 52 -271 -73
6881 -73 91 -104 24 -150 121 366 -160 131 40 125 19 -225 50 -50 78 -201 117 -335 361 28 92
6902 92 94 -138 509 -210 -103 -50 -18 109 27 18 124 -350 -39 -133 63 449 -34 361 -207 108 -196 -383 20
6925 20 46 236 -224 398 -416 36 -294 -104 -6 -127 -168 50 -259 -228 -281 -90 -82 101 -72 -694 254 106 -2
$$ packed form
6767b4q6M73o57J01L60m02K45r0J39J44j03J18j62J49j85l63L40o0j49K9N76l76
6789A7k57j38M56l59J7O2L47n9n29P54m48M7L2j52K48Q0J0j31M8J5K6j73n9M43
6813B97l40o4O0j0k20M68n22p8M01R3k25Q1m2J05r2J23L77j90j33j04J76j09K
6836E4j50K03J43no48P71n75L93q3k14k16M66k96J71J44k60K56r0J8m9J19o3L00
6859C89k12j70nO5K86m65K67j03j05j33L19j60J41Nl58M50J76m36j53K54l23J98
6881g3J64j95J28j74K71K45n26K91r1Q5j06k44K75j00J28k79L18m52O96l33O4
6902I2Kk32O47p19J07N3L2J27q2rJ06m74L11r4J96L86m83L95n68L15l04j87M03
6925B0K6J90m60O22q14M52l30J90R8j21m1K18l09L1n3J91QJ83j73o22R48j48j08
$$ plain form
6948 -2 -65 -228 -103 476 -17 364 150 -112 -132 -174 36 168 389 105 -139 -258 194 -204 -333 -122 -132 -370
6970 -370 -69 -141 -251 -18 190 -48 -133 -78 -195 292 195 68 -290 -5 -61 -153 -249 270 42 -67 103 -43
6992 -43 271 106 -157 -23 100 38 279 128 -237 69 -441 -122 -101 -215 -138 -106 248 138 495 -141 -1 -94
7014 -94 9 280 -161 72 26 196 -297 37 -27 -154 -281 156 19 -289 -36 79 -18 179 -232 -273 213 -338
7036 -338 156 -259 -211 -20 -323 237 -201 97 -445 -315 112 -54 -212 -102 -23 -567 -89 -120 -141 152 -308
7057 -308 -61 374 -79 0 44 -259 95 -35 -117 459 -249 -91 408 -315 -184 -423 429 -309 -258 -11 78 31
7079 31 301 -179 239 53 -190 -163 -133 242 51 216 191 335 -51 193 -197 -254 -18 -35 194 18 55 -40 333
7102 333 -82 229 -337 -44 240 114 -54 65 -288 -61 253 85 212 -157 250 -202 445 -230 32 260
$$ packed form
6948bo3j63J25N79m93L81k14k62k0m2K10J32K21k84k44j19M52l98j29K11j0k38
6970c70L01p2j10K33K08k38q5N5j17M87r7j27l58K85n6r2r6N19k28j09J70j46
6992d3L14j65k63J34J23o2K41j51l65L06n10L19K1j14P7L2L54j10L57o36J40r3
7014i4J03K71m41K33m6J70m93L34o4j27j27M37j37l08K53J15r7J97m11m1M86n51
7036c38M94m15M8J91l03N60m38K98n42J30M27j66j58J10P9n44M78l1k1K93m60
7057c08K47M35m53P9M4l03L54j30q2N76p08J58M99p23J31k39Q52p38N1K47Q9m7
7079C1K70m80M18j86k43K7L0L75j91J65k5J44l86K44l90n7K36j7K29j76L7r5L73
7102C33m15L11n66K93K84j26j68J19l53K27L14j68J27l69M07m52O47o75K62K28
$$ plain form
7122 260 150 -38 -174 387 160 100 -37 -194 -124 329 -64 -65 -293 212 -301 -51 101 -68 181 127 -145 -174
7144 -174 -169 112 -118 226 -142 -183 -24 203 -97 223 400 73 -109 475 22 277 -52 6 140 53 337 -215
7166 -215 -65 -77 298 -300 199 -185 -38 -144 -20 155 -228 -308 -8 -64 191 22 -210 -85 -252 307 268
7187 268 104 89 -87 -84 -75 106 101 -185 -13 106 86 -38 20 -385 6 -8 274 -293 -36 161 -410 23 -201
7210 -201 264 -217 113 215 -49 39 227 273 -117 -4 -222 116 -179 261 151 199 -92 -169 248 59 66 -108
7232 -108 364 27 49 -11 -43 92 45 315 179 49 -157 -56 11 272 211 -12 210 31 -11 -30 94 -136 158
7255 158 -156 327 233 -292 -102 -162 141 119 -244 200 -75 -337 -275 -306 -341 9 -237 -590 -223 -93 214 40
7277 40 71 245 -270 -171 134 293 -161 204 -113 395 254 -96 81 149 14 -37 -260 357 342 342 265 -281 167
$$ packed form
7122B60j10j88j36N61k27o0j37j57P0M53l93jk28N05n13K50J52j69K49n4k72k9
7144a74NK81k30L44l68m1J59K27l00L20J77l27j82N84m53K55l29N8J34q7K84n52
7166b15J50j2L75n98M99l84J47j06J24J75l83q0L00n6K55j69k32J25j67N59l9
7187B68j64j5j76LRJ81nk86J72J19k0j24N8m05L91j4K82n67K57J97n71M33k24
7210b01M65m81L30J02k64Q8J88M6l90J13k18L38k95M40j10M8k91p7M17j89Pj74
7232a08M72l37K2o0l2J35m7K70j36j30k06J01O7K61o1k23K22j79m2j9J24k30K94
7255A58l14M83r4n25J90o0L03k2l63M44k75k62O2l1l5L50k46l53L67J30L07j74
7277D0L1J74n15R9L05J59m54L65l17N08j41l50J77O8j35n1k23O17j5%p7n46M48
$$ plain form
7300 167 -363 -107 214 -126 178 27 -369 34 135 -31 -371 175 -48 -339 -187 6 -153 -48 124 437
7320 437 132 16 117 76 -170 -268 116 -176 -214 302 -431 -74 140 138 312 308 337 303 -10 345 99 -109 -180
7343 -180 211 47 396 262 -109 -179 -513 409 107 -418 -224 157 -242 415 -20 -218 -85 272 -112 -126 177
7364 177 -351 59 -315 19 145 -70 -101 55 52 -128 88 52 53 130 80 -52 12 44 -131 217 174 -159 56 95
7388 95 85 353 554 39 -58 -24 74 59 -110 -12 -5 -205 185 55 401 230 81 -303 -375 -57 176 33 60 -45
7412 -45 163 305 -303 141 -157 -331 -324 -79 391 16 270 -85 -194 -433 -172 291 -110 490 54 17 318
7433 318 -130 12 -478 11 244 -163 -62 -206 -121 73 -174 223 159 76 94 101 -307 -336 158 -78 126 139 27
7456 27 25 66 -325 -251 -201 -272 137 -34 281 -133 147 -1 111 52 119 4 -193 -197 -166 -72 -101 -262 -178 -53 -20
$$ packed form
7300A67n30K56L21l40L04j51l96M03J01j66l40N46k23k91J52J93j59J05J72L13
7320D37l05j16J01m1k46r8L84k92l8N16p33L57K14kJ74mK9l4l13L55k46k08p1
7343a80L91j64L49j34l71p0l34R22l02n25J94L81l99O57m35j98J33L57l84j4L03
7364A77n28M10l74L34J26k15l1J56lj80K16l6JP7n0j32O4L2j75L48m3l33K15L9
7388I5j0K68K01n15r7L4R8j5j69R8Pk00L90j30L46j71j49l84p2L18K33j43K7j05
7412d5K08J42o08M44k98j74PK45M70l75K54l55j09k39K61M63m01O00m36l7L01
7433C18m48J42m90M89K33m07J01j44Q5J94k47L97o4q3J8Pm08k9M94k36K04J3j12
7456B7kM1l91P4N0p1M09j71L15m14K80j48J12n9O7j15j97mL1R4k9j61Q4J25L3
$$ plain form
7481 -20 123 -125 -291 190 -197 -6 -131 -171 -114 -43 123 198 -115 27 161 -18 27 -128 72 -132 -12 43
7503 43 159 178 -46 -23 -248 7 143 -251 7 -57 136 -230 -28 36 156 9 389 -23 67 -77 -86 0 181
7526 181 -146 -99 -178 168 108 415 -323 92 94 120 -50 7 -139 290 0 292 153 -3 209 -128 -340 -408 -44
7549 -44 -101 16 -108 52 -12 442 189 -105 -145 -115 -19 -131 -444 34 -303 153 45 27 33 3 111 -109 402
7572 402 57 171 29 91 162 -132 -136 -80 -144 -69 -20 270 10 139 73 113 -172 30 70 -81 -165 -132 27 -262
7596 -262 98 -343 -144 -88 -13 112 -5 345 57 -89 66 -36 -153 184 -515 160 -74 -303 130 -333 181
7617 181 192 -231 -405 30 -167 -77 -76 83 102 388 103 84 104 -36 292 -552 63 -46 -135 318 -65 12 336
7640 336 157 124 -208 248 303 114 -22 -48 -180 161 -239 190 -225 297 224 131 77 123 -299 -31 198 -44
$$ packed form
7481b0J43k48j66M81l87J91j25m0N7P1J66P5l13J42J34j79M5j55K00k04J20N5
7503D3J16J9k24K3k25K55J36l94K58o4J93l66K02O4J20j47L80m12R0j44rQ6J81
7526A81l27M7p9L46o0L07p38M15KK6j70N7j46M29k90K92j39j56K12l37k12o8L64
7549d4n7J17j24J60o4M54k53k94m0L0R6j12l13M78l37M56j08j8Ol0J08k20N11
7572D02l45J14j42O2P1k94mN6o4P5M9K90k60J29o6M0k85K02M0j51q4L3J59k89
7596b62L60m41J99N6P5J25j17L50k88j46J55j02j17L37o99O75k34k29M33m63N14
7617A81J1m23j74M35j97R0JJ59J9K86k85j9K0j40L28q44O15j09q9M53l83P7L24
7640C36j79l3l32M56N5j89j36k6j32L41m00M29m15N22p3r3n4M6m22K68K29k42
$$ plain form
7662 -44 231 169 9 -156 123 250 218 -59 147 64 -46 102 -392 76 137 386 170 -134 181 207 -70 -59
7684 -59 -206 29 264 -78 312 -338 3 -81 166 177 -40 75 602 156 80 125 -284 206 103 144 208 302 -238
7707 -238 204 64 -121 -205 37 -113 98 -30 -53 63 -214 129 -144 134 -160 39 -230 -85 363 173 275
7728 275 -197 31 25 155 126 -370 137 -283 87 1 280 -56 223 70 -250 383 -54 -105 208 -78 188 193
7750 193 -359 -28 211 -11 -194 -130 -82 -142 -94 120 215 -172 -15 9 -97 -257 241 -12 21 218 176 95 -379
7773 -379 314 31 58 -59 437 -130 -95 -60 -152 14 152 -14 -282 -22 -319 -377 -136 52 -38 -38 132 349 -126
7796 -126 221 -36 377 112 315 -201 132 -112 44 89 -111 133 478 120 74 -126 616 -23 -195 28 47
7817 47 28 -96 278 -159 75 -104 -1 -276 24 -214 163 -40 -28 -42 -141 -253 42 -214 -269 -59 -204 118
$$ packed form
7662d4K75o2j60j65K79J27l2k77K06q3j10J48m94M68O1K49k16l04L15K6k77J1
7684e9j47K35K35l42L90o50L41q4K47J1k17J15N27m46p6M5m09M90j03M1O4R4n40
7707b38M42j40j85q4K42j50K11j28k3J16k77L43k73K78k94J99k69J45M48j90J02
7728B75m72K28oJ30k9m96N07m20L70q6K79l36K79j53l20O33m37n1L13k86K66N
7750A93n52L31K39k22j83O4M8o0M8K14R5l87J57K4j06j60M98k53L3J97m2q1m74
7773c79O93k83K7j17M96n67L5L5r2J66J38j66k68K60k97n8K41J88r0%J70K17m75
7796a26L47k57M13k65K03n16L33k44J56M5k00K44L45l58m6k00P42o39j72K23J9
7817D7j9j24L74m37K34j79J03k75L00k38L77k03J2j4r9j12K95k56n5K10j45L22
$$ plain form
7839 118 -17 -250 19 -35 200 117 175 -160 302 70 45 -189 75 45 -12 84 -153 118 -45 235 -95 3 356
7862 356 334 -245 100 107 -27 -35 243 117 -52 16 -114 200 176 198 -110 110 86 -247 178 -205 41 -75 -206
7885 -206 247 -118 -275 -256 -64 -240 138 -48 175 85 -229 -29 -33 -305 67 -110 -41 -224 -51 393 96 345
7907 345 -67 -230 -64 271 151 37 -169 -200 -18 79 14 -51 276 247 420 222 -11 72 417 160 1 180
7929 180 -30 -362 -424 224 289 195 163 -42 158 88 159 139 204 -28 115 -74 -129 -32 439 -339 149 -246 279
7952 279 -232 102 117 -190 140 -17 -302 249 -381 -74 125 77 -27 43 263 155 -264 -49 -77 429 213
7973 213 206 38 145 87 -144 108 -133 -15 -253 96 -200 -264 52 -145 39 119 166 170 -106 -209 -222 347 150
7996 150 -2 -444 36 -224 10 76 -264 -104 210 -184 200 -108 295 -35 -231 -34 80 187 85 94 -151
$$ packed form
7839A18j35k33K69n4K35q3N8l35M62k32k5k34K64l0n7R6k37K71j63K80l30R8L53
7862C56k2n79L45Pj34qK78j26j69O8j30L14k4K2l08K20k4l33M25l83K46j16j31
7885b06M53l65j57J9J92j76L78j86K23r0l14K00mk72L72j77O9j83J73M44k97K49
7907C45m12j63J66L35j20j14k06l1J82R7o5o5L27k9J73j98k33Q3L45k57j59J79
7929A80k10l32o2O48O5r4l2k05K00p0P1k0O5k32J43j89n5R7M71p78M88l95N25
7952B79n11L34J5l07L30j57k85N51o30L07J99m8j04P0K20j08m19K15k8N06k16
7973B13pj68J07n8k31K52k41J18k38L49k96o4L16j97J84Q0M7Mk76j03j3N69j97
7996A50j52m42M80k60K34O6l40J60L14l94L84l08M03l30j96J97J14J07j02Rk45
$$ plain form
8017 -151 338 -242 -223 205 98 -205 288 38 -285 -97 -28 -2 -224 106 -30 -356 135 -281 -3 65 -36
8038 -36 241 95 -239 -348 -125 -171 -31 -228 -370 310 -116 -31 139 -215 -134 252 -149 -293 -39 -272 207
8059 207 206 275 133 298 50 -81 162 -314 -70 -126 -90 -223 14 -68 -117 95 -124 -267 111 -89 106 -173
8081 -173 -70 -5 42 -80 267 -384 -218 119 -281 -199 -77 161 -732 290 52 50 65 128 -38 -269 178 -345
8103 -345 314 -194 42 -17 116 -73 243 -138 84 -125 -300 125 -193 -31 263 -189 233 -182 -46 169
8123 169 219 -72 38 21 -152 -31 98 223 113 -170 -147 -96 -215 103 -124 40 66 98 -302 131 -93 -71
8145 -71 267 262 100 108 -111 36 105 247 -71 -15 6 -94 84 -80 45 32 215 269 -58 -341 316 -40 -537
8168 -537 -171 -177 -4 -104 174 -138 508 66 222 136 -67 27 179 71 47 -97 21 -236 -445 103 -90 62
$$ packed form
8017a51M89n80J9M28j07l03M93k50l23J88O9K6k22L30j36l26M91m16K78O8j01
8038c6K77j46l34j09K23m6J40j97j42O80m26Q5J70l54Q1L86m01j44K54k33M79
8059B07jO9j42J65k48j31K43m76K44n6L6j33K37q2m9K12k19j43L78k00J95k79
8081a73J03O5M7j22L47o51J66L37m00Q2J22K38q93J022k38kJ5O3j66k31M47n23
8103c45O59n08K36n9J33j89L16l81K22k09j75M25l18J62K94m52M22m15J36K15
8123A69N0k91J10j7j73J21J29J25j10k83K3N1j19L18k27J64K6L2m00M33k24K2
8145g1L38nj62Qk19J47O9J42l18N6K1j00J78j64J25j3J83N4l27k83O57l56m97
8168e37L66oJ73j00K78l12O46m42J56q6k03R4J52j08k4j44J18k57k09N48j93J52
$$ plain form
8190 62 -167
$$ packed form
8190F2k29
8191a67
$$ Imaginary data points
##PAGE= N=2
##DATA TABLE= (X++(I..I)), XYDATA
$$ plain form
0 0 0 0 0 0 0 0 0 0 0 0 0 -16 16 -16 16 -16 32 -32 48 -48 64 -72 80 -96 112 -137 160 -182 208 -240 273 -313
32 -313 350 -397 444 -506 566 -633 707 -788 875 -972 1077 -1191 1317 -1450 1606 -1766 1946
49 1946 -2143 2361 -2600 2869 -3168 3503 -3881 4316 -4817 5406 -6102 6947 -7994 9332
63 9332 -11104 13572 -17244 23280 -34868 64936 -303321 -579381 74623 -354557 -481997
74 -481997 -14641 -164049 -338831 -283653 -562841 -299881 50919 -136297 -130524 -105477 -233430
85 -233430 17413 10931 -108004 204350 242976 142602 282803 67537 38384 364352 256196
96 256196 249991 448494 180557 111885 223902 -14842 77530 296799 94668 58872 -3691
107 -3691 -250957 -117974 -48462 -160163 -17963 -130413 -329270 -181462 -273333 -342618 -80667
$$ packed form
0@%%%%%%%%%%%j6L2l2L2l2M8o4Q0r6J12j36J52j76K08k49K97l42L90m48N13n86
32c13O63p47Q41r50J072j199J340j495J663j847K049k268K508k767L056l372L712
49A946m089M504m961N469o037O671p384Q197r133J0223j1508J3049j4941J7326
63I332k0436K4676l0816M0524n8148R9804l68257k76060O54004m29180j27440
74d81997M67356j49408j74782N5178k79188K62960L50800j87216N773K5047j27953
85b33430K50843o482j18935L12354L8626j00374J40201k15266k9153L25968j08156
96B56196o205J98503k67937o8672J12017k38744R2372K19269k02131l5796o2563
107c691k47266J32983O9512j11701J42200j12450j98857J47808r1871o9285K61951
$$ plain form
118 -80667 -148011 -208414 -37539 -210972 -250741 -28738 -98537 -3914 194784 29665 51352
129 51352 139676 -36417 101724 288208 176997 259343 248338 25398 121641 187761 108169
140 108169 240856 199555 24228 54603 -35450 -92582 58773 -3328 -75259 -14857 -156971
151 -156971 -209426 -110995 -190348 -165713 -59628 -152636 -154121 -113411 -205061 -145249 -53433 -69531
163 -69531 16139 28731 -57365 -8708 8925 21633 152007 156566 116642 150059 71243 55969
175 55969 160508 142683 155551 193445 73036 40880 77301 4468 36622 85923 -4842 -10521
187 -10521 -17679 -118235 -94712 -71664 -115377 -57427 -62068 -143021 -121490 -144161 -169374 -65719
199 -65719 -41286 -66549 -23412 -67949 -101713 -20973 6428 35901 100097 61990 32252 62669
$$ packed form
118h0667o7344o0403J70875j73433l9769K22003o9799R4623J98698j65119K1687
129E1352Q8324j76093J38141J86484j11211Q2346j1005k22940R6243O6120p9592
140A08169J32687m1301j75327L0375r0053n7132J51355o2101p1931O0402j42114
151a56971n2455R8431p9353K4635J06085r3008j485M0710r1650N9812R1816j6098
163f9531Q5670J2592q6096M8657J7633J2708J30374M559l9924L3417p8816j5274
175E5969J04539j7825J2868L7894j20409l2156L6421p2833L2154M9301r0765n679
187a0521p158j00556K3523K3048m3713N7950m641q0953K1531k2671k5213J03655
199f5719K4433k5263M3137m4537l3764Q0740K7401K9473O4196l8107k9738L0417
$$ plain form
211 62669 48347 83439 144574 120794 111466 109733 59932 62230 82014 63535 74357 69112 25919
224 25919 7501 -23237 -54792 -38154 -34685 -37890 -35038 -78846 -114215 -110842 -113332 -84228 -46313
237 -46313 -58950 -70859 -80437 -97534 -63207 -20338 -2910 26402 21171 -5226 15445 30551
249 30551 40461 84662 92705 76635 85046 67548 49785 70535 71231 72492 87774 58266 24839
262 24839 15272 -11349 -12487 13797 2959 -16728 -32681 -73868 -88073 -66556 -55113 -45036
274 -45036 -42776 -69169 -85361 -79954 -68926 -41950 -17166 -14687 -16571 -15365 -17526 -6302 19179
287 19179 37926 46754 55179 53955 41555 40516 48447 54949 69169 75975 59413 40319 23394
300 23394 9909 18349 30558 24856 13747 -10275 -39873 -41775 -34765 -33794 -23388 -27675 -51959
$$ packed form
211F2669j4322L5092O1135k3780r328j733m9801K298J9784j8479J0822n245m3193
224B5919j8418l0738l1555J6638L469l205K852m3808l5369L373k490K9104L7915
237d6313j2637j1909r578j7097L4327M2869J7428K9312n231k6397K0671J5106
249C0551R910M4201Q043j6070Q411j7498j7763K0750O96J261J5282k9508l3427
262B4839r567k6621j138K6284j0838j9687j5953m1187j4205K1517J1443J0077
274d5036K260k6393j6192N407J1028K6976K4784K479j884J206k161J1224K5481
287A9179J8747Q828Q425j224j2400j039P931O502J4220O806j6562j9094j6925
300B3394j3485Q440J2209n702j1109k4022k9598j902P010R71J0406m287k4284
$$ plain form
313 -51959 -60558 -60890 -60807 -43194 -27520 -27244 -25132 -28668 -32711 -21192 -9192 3654 22962 29544
327 29544 23134 20526 19000 20867 38329 56506 57713 47741 35664 22273 18986 31126 39566 36241
341 36241 26294 7350 -10635 -12750 -11553 -8326 -3023 -14510 -30779 -34330 -43349 -46206 -31167 -27228
355 -27228 -31352 -24040 -30048 -41298 -31589 -22683 -15641 2847 7858 1398 1025 -1957 4164 24445
369 24445 33620 35384 38087 25515 14730 24999 32627 36143 41199 31949 16003 9500 5461 4905
383 4905 10664 7849 -287 -6869 -18383 -28092 -25702 -23947 -23227 -17011 -21125 -33274 -36134 -35066 -33090
398 -33090 -17767 -6777 -9706 -11535 -13041 -15996 -6069 9560 18238 23253 19383 11107 13483 18953
412 18953 24278 35032 36359 26930 21749 17694 11526 14409 19399 15772 11682 4353 -5513 -13335 -15048
$$ packed form
313e1959q599l32Q3J7613J5674K76K112l536m043J1519J2000J2846J9308O582
327B9544o410k608j526J867J7462J8177J207r972j2077j3391l287J2140Q440l325
341C6241r947j8944j7985k115J197L227N303j1487j6269l551r019k857J5039L939
355b7228m124P312o008j1250R709Q906P042J8488N011o460l73k982O121K0281
369B4445R175J764K703j2572j0785J0269P628L516N056r250j5946o503m039n56
383D905N759k815q136o582j1514r709K390J755P20O216m114j2149k860J068J976
398c3090J5323J0990k929j829j506k955R927J5629Q678N015l870q276K376N470
412A8953N325J0754J327r429n181m055o168K883M990l627m090p329r866p822j713
$$ plain form
427 -15048 -12858 -9596 -9901 -16044 -24763 -31234 -32354 -27388 -16972 -11786 -14494 -16406 -21644 -23600 -10136
442 -10136 1805 4493 11352 9251 89 5119 12785 14796 26807 29038 20617 21503 15949 9077 19224
457 19224 19848 15524 21991 11179 -4160 -258 -4693 -9173 4246 535 -11906 -12497 -22853 -27568
471 -27568 -15048 -13159 -11268 -7805 -19879 -23475 -15904 -16214 -7584 5026 -327 -2292 377 -4729
485 -4729 579 10711 12953 17837 17027 10519 10452 8452 9140 18831 19772 15236 13393 3858 -1865 1315
501 1315 3026 7652 7847 -2246 -6608 -12404 -17897 -7127 -2587 -8237 -4095 -11051 -21948 -13860 -10733
516 -10733 -10943 1047 -1818 -9266 -3725 -8730 -8775 5507 3842 5127 13759 1700 -2197 7426 2559
531 2559 7898 21046 11566 6542 8903 -1072 1306 11573 8370 10175 7901 -5852 -4315 -1327
$$ packed form
427a5048K190L262l05o143q719o471j120M966J0416N186k708j912n238j956J3464
442a0136J1941K688O859k101r162N030P666K011J2011K231q421Q86n554o872J0147
457A9224O24m324O467j0812j5339L902m435m480J3419l711j2441n91j0356m715
471b7568J2520J889J891L463j2074l596P571l10Q630J2610n353j965K669n106
485d729N308J0132K242M884q10o508o7k000O88R691R41m536j843r535n723L180
501A315J711M626J95j0093m362n796n493J0770M540n650M142o956j0897Q088L127
516a0733k10J1990k865p448N541n005m5J4282j665J285Q632j2059l897R623m867
531B559N339J3148r480n024K361r975K378J0267l203J805k274j3753J537K988
$$ plain form
545 -1327 -7095 804 6068 -5033 -7295 -8523 -13649 -9064 -4772 -3787 -666 -5821 -12181 -9159 -8682
560 -8682 -5827 2400 3325 1616 -515 -4975 -3450 1924 5049 10564 10859 5367 2659 -203 2326 11127
576 11127 10458 8267 10224 1463 -3796 2606 2362 2478 6699 924 -2931 -2835 -9377 -7485 544 -3140
592 -3140 -2796 144 -10278 -12494 -5918 -6815 -2046 4124 -2502 -4572 -3102 -8007 -2131 6358 4064
607 4064 6273 6229 -2874 -1539 5242 3439 8227 12399 3430 803 2219 -2216 1149 6954 3936 2876
623 2876 742 -5816 -4475 -2665 -3147 2370 2351 -4586 -4612 -6275 -9016 -2526 2295 305 875 -1617 -6280
640 -6280 -4477 -1908 3080 6211 3860 1216 -336 -3375 -361 4387 4254 5725 3781 -1290 -1261 -2404
656 -2404 -2014 5126 3458 101 2367 -4304 -8028 -187 -117 168 5490 -729 -5214 -1993 -4556 -1092
$$ packed form
545a327n768P899N264j1101k262j228n126M585M292R85L121n155o360L022M77
560h682K855Q227R25j709k131m460J525N374L125N515K95n492k708k862K529Q801
576A1127o69k191J957q761n259O402k44J16M221n775l855R6o542J892Q029l684
592c140L44K940j0422k216O576q97M769O170o626k070J470m905N876Q489k294
607D064K209m4r103J335O781j803M788M172q969k627J416m435L365N805l018j060
623B876k134o558J341J810m82N517j9o937k6j663k741O490M821j990N70k492m663
640f280J803K569M988L131k351k644j552l039L014M748j33J471j944n071K9j143
656b404L90P140j668l357K266o671l724P841P0K85N322o219m485L221k563L464
$$ plain form
672 -1092 6202 2108 2248 3457 -6295 -2797 4658 -114 5080 8620 -2454 -2088 1287 -4716 1469
687 1469 6449 -674 1932 -145 -8178 -2654 -1132 -4017 4521 1997 -6314 -2104 -4748 -6915 2645
702 2645 3068 471 2860 -2520 -4538 562 188 3842 8475 1171 1332 1917 -3535 2085 6934 3157
718 3157 5065 2983 -3399 -616 -972 -1786 4648 1940 -2205 498 -6483 -7709 334 -1852 -1298 3112
734 3112 -5393 -6910 -2744 -6743 -748 4707 -1883 238 986 -7938 -1186 4726 -439 6235 7456
749 7456 -2785 766 2059 -1274 6635 7368 2282 5461 40 -4138 3201 1468 664 7254 811
764 811 -4981 -109 -4886 -4603 3520 -79 -1306 132 -7501 -7120 -1398 -3549 593 2591 -4363 -3895
780 -3895 -3441 -6023 91 3310 895 2841 66 -3113 -160 139 3269 7614 3204 2094 3874 -1988
$$ packed form
672a092P294m094J40J209r752L498P455m772N194L540j1074L66L375o003O185
687A469M980p123K606k077q033N524J522k885Q538k524q311M210k644k167R560
702B645M23k597K389n380k018N100l74L654M633p304J61N85n452N620M849l777
718C157J908k082o382K783l56q14O434k708m145K703o981j226Q043k186N54M410
734C112q505j517M166l999N995N455o590K121P48q924O752N912n165O674J221
749G456j0241L551J293l333P909P33n086L179n421m178P339j733q04O590o443
764H11n792M872m777K83Q123l599j227J438p633L81N722k151M142J998o954M68
780c895M54k582O114L219k415J946k775l179K953K99L130M345m410j110J780n862
$$ plain form
796 -1988 208 6946 3825 4766 6429 -1505 -1770 1122 -1739 3261 4503 -1447 -345 -2978 -8190 -1866
812 -1866 -626 -3272 849 -2643 -9307 -6006 -5537 -5744 1294 -496 -3489 -770 -5916 -5022 2178 228
828 228 2655 7615 1184 -1461 3386 1252 4420 10342 6538 5149 4862 25 2113 4892 3517 6306
844 6306 5003 -2040 -1745 -2318 -4411 -192 842 -2646 -3645 -7269 -8882 -6643 -5789 -3377 -1655 -5137
860 -5137 -6208 -5386 -7276 -3076 1664 1333 2578 2046 -1818 765 2678 4403 9010 8681 5156 6194
876 6194 3145 1896 7862 7479 5301 7142 2270 -2278 -147 -1464 -411 2153 -1434 -4368 -5167 -9177
892 -9177 -8214 -3845 -5343 -4227 -3394 -8185 -8752 -5689 -5653 -2034 1136 -269 -542 -1615 -2530 1869 4783
909 4783 5614 7667 6102 2986 3820 4590 5289 8578 8784 5765 3640 1166 196 1714 2116 2860 1969
$$ packed form
796a988K196O738l121R41J663p934k65K892k861N000J242n950J102k633n212O324
812a866J240k646M121l492o664L301M69k07P038j790k993K719n146Q94P200j950
828B28K427M960o431k645M847k134L168N922l804j389k87m837K088K779j375K789
844F306j303p043K95n73k093M219J034l488r99l624j613K239Q54K412J722l482
860e137j071Q22j890M200M740l31J245n32l864K583J913J725M607l29l525J038
876F194l049j249N966l83k178J841m872m548K131j317J053K564l587k934p99m010
892i177R63M369j498J116Q33m791n67L063L6L619L170j405k73j073r15M399K914
909D783Q31K053j565l116Q34P70O99L289K06l019k125k474r70J518M02P44q91
$$ plain form
926 1969 -2092 -5022 -5388 -5862 -3900 -2340 -3339 -5141 -7168 -8495 -7911 -5787 -2884 -1191 -2629 -3550
942 -3550 -3524 -4569 -1571 3203 3293 3880 4040 1534 938 3526 5097 7474 8343 6419 4808 3326 1308
959 1308 3995 5937 4222 4280 2079 -2355 -3116 -1455 -1673 -284 -568 -3400 -5979 -7470 -7321 -5194 -3112
976 -3112 -3820 -3266 -4974 -7695 -5734 -3584 -1432 1321 2083 -350 -867 33 758 4046 6436 6962 5719
993 5719 4339 3267 4000 5867 6857 7777 6367 3260 982 904 498 2216 3235 1108 -1594 -3547 -5532
1010 -5532 -6571 -4562 -2834 -3700 -4833 -6789 -8273 -7879 -5989 -3576 -1450 -1941 -3193 -3362 -3114 -1981
1026 -1981 1939 4085 4503 4894 3299 2108 4126 6154 7932 8601 7583 5224 3358 2462 3730 4825
1042 4825 4719 3368 959 -2126 -3913 -3366 -2345 -2474 -2293 -3829 -7035 -8842 -7742 -6896 -5159 -2933
$$ packed form
926A969m061k930l66m74J962J560r99j802k027j327N84K124K903J693j438r21
942c550K6j045K998M774R0N87J60k506n96K588J571K377Q69j924j611j482k018
959A308K687J942j715N8k201m434p61J661k18J389k84k832k579j491J49K127K082
976c112p08N54j708k721J961K150K152K753P62k433n17R00P25L288K390N26j243
993E719j380j072P33J867R90R20j410l107k278p8m06J718J019k127k702j953j985
1010e532j039K009J728q66j133j956j484L94J890K413K126m91j252j69K48J133
1026a981L920K146M18L91j595j191K018K028J778O69j018k359j866q96J268J095
1042D825j06j351k409l085j787N47J021j29J81j536l206j807J100Q46J737K226
$$ plain form
1058 -2933 -3572 -5359 -5785 -5635 -3055 -187 1609 3220 2658 397 1454 3747 4278 6944 8855 6638
1074 6638 5143 4855 3496 4646 6678 6264 4961 3214 -272 -1397 -963 -1619 269 -466 -3479 -4766
1090 -4766 -6203 -7880 -5972 -3448 -3916 -4228 -5328 -7239 -6535 -4551 -2223 -10 -148 -709 -1097 -1322 217
1107 217 3595 4685 5945 5433 4065 2946 3319 4783 6637 6796 5968 5010 1349 655 2093 2123 2167 2444
1125 2444 -377 -3330 -3453 -4736 -3522 -1685 -2749 -3423 -4907 -7573 -6246 -4290 -4564 -1771 -850 -4636
1141 -4636 -3946 -2942 -3036 -10 2588 2360 2886 1624 112 2689 3987 5205 7410 6000 3408 3609
1157 3609 2653 2357 5099 5562 3974 3078 61 -1383 -943 -958 537 211 -2477 -3615 -5008 -6706 -4614
1174 -4614 -2660 -3294 -3650 -4616 -5934 -5619 -5050 -2575 -279 -406 -705 -604 -1946 -620 2788 3377 4979
$$ packed form
1058b933o39j787m26J50K580K868J796J611n62k261J057K293N31K666J911k217
1074F638j495k88j359J150K032m14j303j747l486j125M34o56J888p35l013j287
1090d766j437j677J908K524m68l12j100j911P04J984K328K213j38n61l88k25J539
1107B17L378J090J260n12j368j119L73J464J854J59q28r58l661o94J438L0M4K77
1125B444k821k953j23j283J214J837j064o74j484k666J327J956k74K793R21l786
1141d636O90J004r4L026K598k28N26j262j512K577J298J218K205j410k592K01
1157C609r56k96K742M63j588q96l017j444M40j5J495l26k688j138j393j698K092
1174d614J954o34l56r66j318L15N69K475K296j27k99J01j342J326L408N89J602
$$ plain form
1191 4979 5792 3283 2990 3755 4011 5896 7090 5186 4622 3124 196 1612 2729 960 2545 850
1207 850 -3301 -3237 -3931 -4272 -2335 -2328 -4373 -4795 -6616 -7331 -4885 -4447 -3023 -970 -2722 -3830 -2453 -2218
1225 -2218 -688 2646 3383 2810 2926 1916 2645 4559 5488 7045 6921 4172 3654 2923 2548 3478 4392 3081
1243 3081 1947 -531 -2149 -2280 -2323 -1520 -1309 -3049 -4768 -5440 -6632 -5802 -3349 -3348 -2890 -2867 -4963 -4969 -3132
1262 -3132 -2033 447 1496 909 1034 672 544 3030 4678 4728 5821 4283 2344 2880 3506 4281 5421
1279 5421 4479 3054 1766 -328 -1171 883 504 -146 189 -3193 -4497 -3521 -4376 -3374 -1677 -2776 -3546
1296 -3546 -4528 -4918 -4332 -2508 -1087 -419 -761 -2222 -1542 -465 -4 2492 3484 3058 2288 2045 1387 2469
1314 2469 3852 4851 4900 3496 2201 1826 978 1893 3237 2234 849 -26 -2188 -2611 -1734 -1044 -854 -1495
$$ packed form
1191D979Q13k509k93P65K56J885J194j904n64j498k928J416J117j769J585j695
1207H50m151O4o94l41J937Pk045m22j821p15K446M38J424K053j752j108J377K35
1225b218J530L334P37n73J16j010P29J914R29J557j24k749n18p31l75R30R14j311
1243C081j134k478j618j31m3Q03K11j740j719o72j192Q30K453JM58K3k096oJ837
1262c132J099K480J049n87J25l62j28K486J648N0J093j538j939N36O26P75J140
1279E421r42j425j288k094q43K054l79o50L35l382j304R76q55J002J697j099p70
1296c546r82l90N86J824J421O68l42j461O80J077M61K496R92m26p70k43o58J082
1314B469J383R99M9j404j295l75q48R15J344j003j385q75k162m23Q77O90J90o41
$$ plain form
1332 -1495 -3173 -3746 -4813 -4626 -2440 -1452 -2368 -1866 -3065 -3976 -2918 -1235 -67 1085 1358 452 258
1349 258 312 1301 3441 4166 4084 4100 2115 1358 2701 3182 4055 4701 2932 698 208 -220 -170 883 195
1368 195 -120 -1142 -3758 -3482 -3277 -3765 -2135 -1606 -3717 -4145 -4343 -4290 -3224 -1140 -565 -352 -1336 -1701
1386 -1701 -825 162 1740 3394 3297 2235 2674 2077 1725 3926 4797 4534 4145 2098 1886 938 1313 2509
1404 2509 2607 616 -113 -1542 -3290 -2324 -1429 -2172 -1541 -2761 -4119 -4409 -4636 -3400 -1666 -1499 -1685 -1390
1422 -1390 -2925 -2905 -152 276 1716 2694 1231 534 1870 1516 2738 4536 3522 3771 3195 952 1658
1439 1658 2525 2068 3247 2495 -91 -652 -524 -1356 -177 -34 -850 -882 -2817 -3892 -3059 -2960 -1978 -611
1457 -611 -1996 -2835 -2886 -2762 -2065 91 145 376 296 -396 -485 529 1295 2970 3515 1835 1748 1241 372 2181
$$ packed form
1332a495j678n73j067J87K186R88r16N02j199r11J058J683J168J152K73r06j94
1349B58N4R89K140P25q2J6j985p57J343M81Q73O46j769k234m90m28N0J053o88
1368A95l15j022k616K76K05m88J630N29k111m28j98N3J066K084N75K13r84l65
1386a701Q76R87J578J654r7j062M39n97l52K201Q71k63l89k047k12r48L75J196
1404B509R8j991p29j429j748R66Q95p43O31j220j358k90k27J236J734J67j86K95
1422a390j535K0K753M28J440R78j463o97J336l54J222J798j014K49n76k243P06
1439A658Q67m57J179p52k586n61J28q32J179J43q16l2j935j075Q33R9R82J367
1457f11j385q39n1J24O97K156N4K31q0o92q9J014P66J675N45j680q7n07q69J809
$$ plain form
1477 2181 2847 3023 3150 1121 460 -6 63 827 2122 572 -219 -827 -2858 -2353 -856 -1218 -610 -667 -2244
1496 -2244 -3027 -2577 -2607 -790 -636 -1098 -846 -1482 -2612 -448 392 548 2021 1224 -621 534 -42 737
1514 737 2938 2911 2787 2115 355 291 1850 1694 2621 2901 621 -9 -628 -822 216 665 175 -467 -1479
1533 -1479 -2667 -2573 -2070 -1503 -959 -1359 -2068 -2396 -2745 -2442 -741 187 -50 -135 -159 -1167 -898 858 2081
1552 2081 2615 1931 2100 1264 512 1398 2350 3114 2940 1933 630 436 347 584 1775 1002 142 -564 -2077
1571 -2077 -2287 -1015 -1177 -1166 -673 -2129 -3168 -2744 -2155 -1218 -456 -579 -842 -1426 -1936 -1010 353 915 2089
1590 2089 1718 483 106 682 1308 2143 2788 2826 1404 1041 589 593 1013 1636 1960 466 -278 -972 -1280 -1340
1610 -1340 -417 -202 -717 -1837 -2425 -2343 -2264 -1290 -477 -430 -946 -1669 -2161 -1551 -405 436 833 608 -139 -141 -15
$$ packed form
1477B181O66J76J27k029o61m66O9P64J295j550p91o08k031N05J497l62O08n7j577
1496b244p83M50l0J817J54m62K52o36j130K164Q40J56J473p97j845J155n76P79
1514G37K201k7j24o72j760o4J559j56R27K80k280o30o19j94J038M49m90o42j012
1533a479j188R4N03N67N44m00p09l28l49L03J701R28k37q5k4j008K69J756J223
1552B081N34o84J69q36p52Q86R52P64j74j007j303j94q9K37J191p73q60p06j513
1571b077k10J272j62J1M93j456j039M24N89R37P62j23k63n84n10R26J363N62J174
1590B089l71j235l77N76O26Q35O45L8j422l63m52MM20O23L24j494p44o94l08o0
1610a340R23K15n15j120n88Q2P9R74Q13M7n16p23m92O10J146Q41L97k25p47kJ26
$$ plain form
1631 -15 514 1798 2346 1581 1121 508 -358 1024 1457 1718 1682 1432 285 -685 -80 -6 927 918 -30 -748 -1270
1652 -1270 -1619 -1113 -271 140 60 -561 -1515 -2169 -1021 -945 -138 218 161 -1162 -1251 -871 -461 699 773 1195
1672 1195 180 -427 -285 326 1067 1742 2031 925 33 329 -105 432 1608 1620 880 377 -11 -520 -206
1691 -206 345 1077 365 -528 -1370 -1594 -1127 -1089 1 -534 -638 -1106 -1533 -1758 -1072 91 648 90 -418 -763
1711 -763 -928 -273 635 1205 1274 999 521 296 474 950 1817 2159 1456 930 22 -150 524 877 971 603 -208
1732 -208 -1399 -1292 -1145 -129 -7 -243 -519 -1421 -2112 -1915 -1123 -456 -379 9 -999 -1440 -1046 -378 285
1751 285 1145 1081 552 179 -102 187 1157 1693 1779 1580 389 344 -136 347 1321 1404 1091 47 -389 -830 -746
1772 -746 -220 421 175 -66 -1165 -1459 -1850 -1448 -78 371 -411 -747 -1110 -1001 -848 336 527 712 337
$$ packed form
1631a5N29J284N48p65m60o13q66J382M33K61l6k50j147r70O05P4R33rr48p18n22
1652a270l49N06Q42M11q0o21r54o54J148P6Q07L56n7j323q9L80M10J160P4M22
1672A195j015o07J42O11P41O75K89j106q92K96m34N37J176J2p40n03l88n09L14
1691b06N51P32p12q93q42k24M67L8J090n35j04m68m27k25O86J163N57n58n08l45
1711g63j65O55R08N70O9k75m78k25J78M76Q67L42p03n26r08j72O74L53R4l68q11
1732b08j191J07J47J016J22k36k76r02o91J97P92O67P7L88j008m41L94O68O63
1751B85Q60o4n29l73k81K89R70N36Q6j99j191m5m80M83R74Q3l13j044m36m41Q4
1772g46N26O41k46k41j099k94l91M02J370M49p82l36l63J09J53J184J91J85l75
$$ plain form
1791 337 -169 -453 -118 690 1370 1219 1284 540 -476 -681 579 956 980 806 257 -527 -944 -451 52 651
1811 651 638 307 -1028 -955 -625 -334 92 496 185 -876 -1090 -1238 -981 13 270 -87 -324 -655 -1036 -805
1831 -805 -108 434 953 275 -662 -61 -292 -532 1349 964 1038 567 -215 -910 -40 635 1055 1238 0 259
1851 259 -537 -724 335 838 612 132 -158 -1207 -914 -1107 -222 175 -343 -547 -883 -1702 -1352 24 180
1870 180 344 439 -843 -596 -440 -208 861 641 1005 638 151 33 522 941 911 1531 932 362 -385 -247
1890 -247 293 1153 713 599 383 -883 -1015 -150 -397 342 307 -733 -1494 -858 -1236 -337 176 -303 -455 -704
1910 -704 -1126 -812 124 300 964 878 183 84 32 68 1391 1064 1147 1183 -515 -231 31 -114 798 957 234
1931 234 -88 -579 -1046 -175 57 2 17 -379 -1112 -1276 -1069 -470 441 -163 -280 18 -1085 -1133 284 148
$$ packed form
1791C37n06k84L35Q08O80j51O5p44j016k05J260L77K4j74n49p84m17M93N03N99
1811F51j3l31j335P3L30K91M26M04l11j061k14j48K57R94K57l57k37l31l81K31
1831h05O97N42N19o78r37O01k31k40J881l85P4m71p82o95Q70O75M20J83j238K59
1851B59p96j87J059N03k26m80k90j049K93j93Q85L97n18k04l36q19L50J376J56
1870A80J64R5j282K47J56K32J069k20L64l67m87j18M89M19l0O20n99n70p47J38
1890b47N40Q60m40j14k16j266j32Q65k47P39l5j040p61O36l78Q99N13m79j52k49
1910g04m22L14R36J76O64q6o95r9n2L6J323l27Q3L6j698K84K62j45R12J59p23
1931B34l22m91m67Q71K32n5J5l96p33j64K07N99R11o04j17K98j103m8J417j36
$$ plain form
1951 148 604 1330 131 -472 -147 336 615 1112 564 617 137 -623 65 668 172 980 707 -421 -571 -771
1971 -771 -911 742 541 216 -99 -1049 -569 -530 -152 494 834 -445 -631 -514 -588 -482 687 314 261 214
1991 214 -522 -87 -371 -233 879 440 -544 -330 -531 -745 164 1191 458 446 96 -717 -151 -261 286 1196
2011 1196 160 557 126 -932 -341 229 313 588 356 -439 -1056 -291 -180 1043 234 263 165 -577 -608 -199
2031 -199 -218 -98 403 -84 -405 -651 -781 -15 424 446 522 279 -394 275 385 635 1190 793 -309 -157 94
2052 94 -37 608 564 809 66 -90 -1046 -147 -332 -206 503 105 -653 -412 -965 -755 44 304 58 32 -636
2073 -636 -737 -684 331 565 597 190 44 -361 0 338 490 654 804 59 -86 54 -257 254 391 612
2093 612 -104 -303 -935 -798 382 275 323 -58 -382 -634 -783 -564 89 471 417 -272 -615 -812 -249 122
$$ packed form
1951A48M56P26j199o03L25M83K79M97n48N3m80p60O88O03m96Q08k73j128j50k00
1971g71j40J653k01l25l15r50M80L9L78O46L40j279j86J17p4J06J169l73n3m7
1991B14p36M35k84J38J112m39r84K14k01k14R09J027p33j2l50q13N66j10N47R10
2011A196j036L97m31j058N91N70Q4K75k32p95o17P65J11J223q09K9r8p42l1M09
2031a99j9J20N01m87l21k46j30P66M39K2P6k43o73O69J10K50N55l97j102J52K51
2052I4j31O45m4K45p43j56r56Q99j85J26P09l98p58K41n53K10P99K60k46k6o68
2073f36j01N3J015K34L2m07j46m05L61L38J52J64J50p45j45J40l11N11J37K21
2093F12p16j99o32J37J180j07M8l81l24k52j49K19O53L82n4o89l43j97N63L71
$$ plain form
2113 122 462 387 266 -336 -151 -719 101 297 572 755 -258 -451 -707 241 -85 688 401 -98 -12 -726
2133 -726 -271 263 82 823 144 -233 -250 -387 -414 501 571 403 106 -442 -514 -341 150 570 471 13 -617 -708
2155 -708 -404 -577 37 224 122 80 -754 -1047 -287 -274 411 321 -18 -108 -491 -320 25 521 301 749 6
2176 6 -590 83 -131 754 454 576 631 309 -383 -13 276 265 772 5 -162 -735 -623 -406 -361 -190 -388 -665
2198 -665 -928 -926 -539 -694 254 398 -404 -795 -102 -316 -32 597 839 556 156 -94 -144 204 775 630 686
2219 686 212 100 -164 -422 27 152 541 390 -179 -442 -884 -568 -31 69 -143 -257 -837 -659 -714 -250
2239 -250 -27 -182 -504 -456 -522 -584 244 471 235 395 77 -580 27 216 761 504 275 520 -255 -235 63
2260 63 562 488 821 397 -400 -527 -217 -89 -21 166 -8 -430 -764 -613 124 95 236 245 -340 -559 -573 -340
$$ packed form
2113A22L40p5j21o02J85n68Q20J96K75J83j013j93k56R48l26P73k87m99Q6p14
2133g26M55N34j81P41o79l77j7j37k7R15P0j68k97n48p2J73M91M20r9m58o30r1
2155g08L04j73O14J87j02m2q34k93P60J3O85r0l39r0l83J71L45M96k20M48p43
2176Fn96O73k14Q85l00J22N5l22o92L70K89j1N07p67j67n73J12K17M5J71j98k77
2198f65k63KL87j55R48J44q02l91O93k14K84O29K42k83m00k50n0L48N71j45N6
2219F86m74j12k64k58M49J25L89j51n69k63m42L16N37J00k12j14n80J78n5M64
2239b50K23j55l22M8o6o2Q28K27k36J60l18o57O07J89N45k57k29K45p75K0K98
2260F3M99p4L33m24p97j27L10J28O8J87j74m22l34J51P37k9J41Rn85k19j4K33
$$ plain form
2282 -340 -76 -77 419 -227 -523 -260 -262 -237 246 553 394 162 -389 -206 225 589 962 796 172 -129 -35 234
2304 234 28 571 712 459 30 -658 -594 -286 398 203 323 39 -398 -239 -736 -363 65 -527 -308 -504
2324 -504 -881 -784 -488 216 195 166 118 -606 -477 -246 671 385 928 817 316 -293 551 873 973 1293 513
2345 513 7 167 39 -121 504 294 204 157 -533 -667 -667 -456 -156 -407 -683 -971 -1030 -904 -448 0 -208 -102
2367 -102 -274 -303 -281 59 -68 338 950 183 156 244 589 863 835 1007 611 476 -16 -109 211 544 412 87
2389 87 150 -621 -1211 -520 -468 -187 -12 -315 -746 -1303 -805 -1014 -652 -39 -30 -210 -203 -344 -227 -131 447 540 319
2412 319 247 108 349 399 520 994 928 158 267 558 406 634 362 589 230 -279 -254 -560 -115 -79 70 -416
2434 -416 -801 -1015 -677 -678 -49 -161 -93 -232 -601 -471 -578 -348 471 280 38 -233 -249 -268 -80 711 837 170
$$ packed form
2282c40K64jM96o46k96K63kK5M83L07j59k32n51J83M31L64L73j66o24l01R4K69
2304B34k06N43J41k53m29o88O4L08O84j95J20k84m37J59m97L73M28n92K19j96
2324e04l77R7K96P04k1k9m8p24J29K31R17k86N43j11n01o09Q44L22J00L20p80
2345E13n06J60j28j60O25k10r0m7o90j34%K11L00k51k76k88n9J26M56M48k08J06
2367a02j72k9K2L40j27M06O12p67k7Q8L45K74k8J72l96j35m92r3L20L33j32l25
2389H7O3p71n90O91N2K81J75l03m31n57M98k09L62O13Rj80Pj41J17R6N78R3k21
2412C19p2j39K41N0J21M74o6p70J09K91j52K28k72K27l59n09K5l06M45L6J49m86
2434d16l85k14L38jO29j12O8j39l69J30j07K30Q19j91k42k71j6j9J88P91J26o67
$$ plain form
2456 170 190 -115 -227 378 708 474 697 277 -164 -167 109 260 295 536 189 -126 -550 -486 217 276 -23 -147
2478 -147 -689 -436 -817 -457 31 63 30 -313 -736 -836 -257 -334 385 209 318 -213 -133 -88 562 713 739 558
2500 558 356 -131 175 253 588 784 621 307 -27 -42 -16 -154 -88 -108 232 -724 -768 -663 -677 -261 -240 -129 -822
2523 -822 -661 -585 -478 -198 -86 -31 -106 -15 240 -285 54 697 616 1142 301 598 105 449 810 902 614 782
2545 782 319 -60 -103 269 41 245 -72 -271 -268 -849 -458 -428 -406 -594 -847 -592 -966 -708 -712 -473 -47 -67 -278
2568 -278 85 -236 4 281 229 533 510 -72 318 315 461 477 719 184 259 490 60 325 236 138 325 -252 -576
2591 -576 -351 -54 -34 -42 -170 -520 -366 -544 -605 -581 -97 -80 -385 -580 -193 -100 -81 472 109 107 514 333 -219
2614 -219 26 682 539 419 125 382 88 69 709 512 20 326 -13 -43 -149 -102 155 559 -81 -125 -319
$$ packed form
2456A70K0l05j12O05L30k34K23m20m41lK76J51L5K41l47l15m24O4P03N9k99j24
2478a47n42K53l81L60M88L2l3l43m23j00N79p7P19j76J09n31Q0M5O50J51K6j81
2500E58k02m87L06P8L35J96j63l14l34j5K6j38O6k0L40r56m4J05j4M16K1J11o93
2523h22J61P6J07K80J12N5p5R1K55n25L39O43q1N26q41K97m93L44L61R2k88J68
2545G82m63l79m3L72k28K04l17j99Ln81L91L0K2j88k53K55l74K58mK39M26k0k11
2568b78L63l21K40K77n2L04k3n82L90lJ46J6K42n35P5K31m30K65q9r8J87n77l24
2591e76K25K97K0qj28l50J54j78o1K4M84J7l05j95L87R3J9N53l63kM07j81n52
2614b19K45O56j43j20k94K57k94j9O40j97m92L06l39l0j06M7K57M04o40m4j94
$$ plain form
2635 -319 -494 -251 -449 -286 -171 58 -283 -656 -642 -380 -357 322 95 -357 -295 -269 -143 170 157 569 544 8
2657 8 168 424 250 549 973 384 321 242 -1 154 302 595 549 -42 -295 110 -337 -102 313 -282 -384 -401
2679 -401 -509 -776 -258 -308 -388 -507 -447 -489 -581 -251 -274 55 161 110 -299 153 -19 200 743 448 323 369 478
2702 478 333 526 518 387 574 637 13 -5 67 170 166 66 -495 -367 -477 -455 -475 -55 -247 -576 -838 -784 -490
2725 -490 -424 35 58 -219 -131 -310 -188 -180 257 227 408 606 -45 747 333 231 811 642 468 494 -87 -128 189
2748 189 174 271 129 -75 -515 -605 -678 -564 -233 -204 -489 -767 -508 -850 -680 -357 -442 -17 -128 -241 -230 -246 184
2771 184 372 325 191 221 12 243 241 774 142 205 266 49 246 150 522 219 -59 18 -670 -416 64 -3 -94
2794 -94 -440 -17 -553 46 -451 -223 -195 216 -187 -545 -222 -267 -632 -227 29 243 -338 -182 50 125 -25
$$ packed form
2635c19j75K43j98J63J15K29l41l73J4K62K3O79k27m52O2K6J26L13j3M12k5n36
2657HJ60K56j74K99M24n89o3p9k43J55J48K93m6n91k53M05m47K35M15n95j02j7
2679d01j08k67N18n0q0j19O0m2r2L30k3L29J06n1m09M52j72K19N43k95j25M6J09
2702D78j45J93qj31J87O3o24j8P2J03mj00n61J28j10K2k0M20j92l29k62N4K94
2725d90O6M59K3k77Q8j79J22QM37l0J81J98o51P92m14j02N80j69j74K6n81m1L17
2748A89j5R7j42k04m40r0p3J14L31K9k85k78K59l42J70L23q5M25j11j13J1j6M30
2771A84J88m7j34L0k09K31kN33o32O3O1k17J97r6L72l03k78P7o88K54M80o7r1
2794i4l46M23n36N99m97K28K8M11m03l58L23m5l65M05K56K14n81J56K32P5j50
$$ plain form
2815 -25 169 188 352 293 -275 10 37 388 371 371 19 22 -132 -127 -83 296 -78 67 27 -57 -333 -470 226 52 96
2840 96 -358 -303 -509 -440 -279 -53 -133 -3 -70 -105 -144 -188 208 226 119 26 155 -306 338 233 401 432 470 132
2864 132 63 560 401 593 121 312 125 -301 -193 -228 263 92 147 -348 -439 -710 -232 -238 138 74 -257 -175 -662
2887 -662 -339 5 99 190 358 94 -71 13 41 579 584 618 442 408 126 10 972 324 768 239 -184 89 -66
2910 -66 -118 -5 -259 -104 -638 -354 -461 110 -537 -116 182 -12 337 -526 -387 468 -144 -426 403 -279 -219
2931 -219 0 580 -26 728 -218 245 437 17 -214 817 1071 -176 599 29 144 97 608 -340 -118 152
2951 152 680 -456 -487 -640 548 -5 27 393 -202 -447 -702 -172 -561 492 -139 -470 -127 -3 -622 438
2971 438 538 37 106 -278 -220 209 347 -219 379 111 31 -169 -381 8 221 67 -86 150 -39 -472 -361
$$ packed form
2815b5J94J9J64n9n68K85K7L51j7%l52Lj54NM4L79l74J45m0q4k76j37O96j74M4
2840I6m54N5k06O9J61K26q0J30o7l5l9m4L96J8j07r3J29m61O44j05J68L1L8l38
2864A32o9M97j59J92m72J91j87m26J08l5M91j71N5m95r1k71M78oL76o4l31Q2m87
2887f62L23L44R4R1J68k64j65Q4K8N38NL4j76l4k82j16R62o48M44n29m23K73j55
2910f6n2J13k54J55n34K84j07N71o47M21K98j94L49q63J39Q55o12k82Q29o82O0
2931b19K19N80o06P54r46M63J92m20k31J031K54j247P75n70J15m7N11r48K22K70
2951A52N28j136l1j53J188n53L2L66n95k45k55N30l89J053o31l31L43J24o19J060
2971D38J00n01O9l84N8M29J38n66N98k68q0k00k12L89K13j54j53K36j89m33J11
$$ plain form
2992 -361 371 -37 63 77 -297 -530 -365 182 44 280 -445 173 -295 -756 -158 -78 185 183 -56 161 -278
3013 -278 -323 43 -69 -363 375 -10 -40 205 -241 294 266 229 43 -69 158 8 103 348 274 374 -60 -149
3035 -149 45 268 -5 203 41 -95 -545 -213 -74 19 -79 -303 -94 -475 -85 -310 -57 -87 363 -437 167
3056 167 -167 395 293 189 417 215 647 334 -19 171 430 -51 129 235 129 -215 -141 -283 -185 -46 235
3077 235 -324 -587 -275 -349 -24 200 -417 -334 6 -597 -143 32 -9 243 74 32 -316 -366 572 266 430 449
3099 449 245 472 66 -258 168 18 484 219 -271 172 -52 -348 248 -478 -112 121 -363 -487 145 -14
3119 -14 350 264 -360 24 -379 -214 50 128 139 -480 -112 126 -70 14 311 395 291 -28 116 -5 28 17 476
3142 476 412 61 125 48 57 155 312 -105 -190 -86 -323 -146 -72 -211 290 176 -168 123 -429 -3 -41 -3 178
$$ packed form
2992c61P32m08J00J4l74k33J65N47j38K36p25O18m68m61N98Q0K63kk39K17m39
3013b78m5L66j12k94P38l85l0K45m46N35k8l7j86j12K27j50R5K45p4J00m34q9
3035a49J94K23k73K08j62j36m50L32J39R3r8k24K09l81L90k25K53l0M50q00O04
3056A67l34N62j02j04K28k02M32l13l53J90K59m81J80J06j06l44P4j42R8J39K81
3077B35n59k63L12p4L25K24o17Q3L40o03M54J75m1K52j69m2l48n0R38l06J64J9
3099D49k04K27m06l24M26j50M66k65m90M43k24k96N96p26L66K33m84j24O32j59
3119a4L64q6o24L84m03J65K64P8J1o19L68K38j96Q4K97Q4j04l19J44j21L3j1M59
3142D76o4l51O4p7RR8J57m17q5J04k37J77P4j39N01j14l44K91n52M26l8L8J81
$$ plain form
3165 178 -121 -301 -14 50 -349 -201 47 301 -180 -10 49 -354 50 395 85 -208 -241 146 240 7 228
3186 228 274 125 448 -103 -157 162 80 29 96 -148 48 -276 66 289 18 282 -205 -30 -152 -188 21 -20
3208 -20 265 -46 55 201 -177 -363 -1 250 -292 115 -283 -472 26 179 558 427 224 197 147 81 321
3229 321 437 216 85 349 -315 -206 -161 146 -110 374 -160 -138 -338 -229 -26 197 86 -250 -276 -35 -183
3250 -183 -158 264 -53 -48 -1 -346 -73 -385 72 45 372 491 102 258 52 205 292 373 648 -158 -84 -308 -111
3273 -111 -174 -71 222 -102 -435 -21 -429 -157 61 -187 -41 -113 76 -338 391 334 -189 86 -65 181 123
3294 123 378 -92 46 275 -22 145 32 -182 313 120 80 63 41 -201 -425 130 -109 70 -129 -28 -525
3315 -525 155 35 170 -69 170 -211 57 -239 131 198 429 625 105 -29 -19 -133 69 -138 -194 314 180
$$ packed form
3165A78k99j80K87O4l99J48K48K54m81J70N9m03M04L45l10k93l3L87R4k33K21
3186B28M6j49L23n51n4L19q2n1O7k44J96l24L42K23k71K64m87J75j22l6K09m1
3208b0K85l11J01J46l78j86L62K51n42M07l98j89M98J53L79j31k03k7n0o6K40
3229C21J16k21j31K64o64J09M5L07k56M84n34K2k00J09K03K23j11l36k6K41j48
3250a83K5M22l17NM7l45K73l12M57k7L27J19l89J56k06J53Q7Q1K75q06P4k24J97
3273a11o3J03K93l24l33M14m08K72K18k48J46p2J89m14P29n7n23K75j51K46n8
3294A23K55m70J38K29k97J67j13k14M95j93m0j7k2k42k24N55k39J79j99J01m97
3315e25O80j20J35k39K39l81K68k96L70O7K31J96n20j34J0j14K02k07n6N08j34
$$ plain form
3336 180 76 35 -434 -153 -36 -294 -280 -284 -137 158 -356 -42 296 -158 46 -45 -132 46 12 302 -76 268
3358 268 2 67 -203 346 -10 -84 113 45 -91 -195 -44 -86 -21 -425 267 -136 -228 -309 -142 -93 240 -147 -80
3381 -80 -14 -203 -157 -30 223 33 145 118 -113 -91 152 -207 61 -274 27 152 -52 -121 273 273 109 63 -123
3404 -123 -267 33 -280 -295 -4 -382 -235 -29 54 326 281 -251 144 223 -297 -57 10 294 164 -110 137 -50
3426 -50 375 163 50 74 -4 117 192 -296 233 24 265 295 2 32 -115 -82 -179 -257 -124 178 -17 -63 -412
3449 -412 -160 115 40 148 61 239 -307 87 -117 -62 -133 100 -139 56 -286 -162 84 21 -189 -2 -125 162
3471 162 -217 125 110 106 111 142 -119 -229 -5 425 474 78 9 -68 6 139 -138 -153 136 178 -198 -80 -180 -75
3495 -75 151 -56 101 -458 -38 58 -53 -342 406 -64 87 -235 -233 -218 8 505 158 24 117 287 -207 94
$$ packed form
3336A80j04m1m69K81J17k58J4mJ47K95n14L14L38m54K04r1q7J78l4K90l78L44
3358B68k66O5k70N49l56p4J97o8j36j04J51m2O5m04O92m03r2q1J67M9L33l87O7
3381h0O6j89M6J27K53j90J12k7k31K2K43l59K68l35L01J25k04o9L94%j64m6j86
3404a23j44L00l13j5K91l78J47K06Q3K72m5n32L95P9n20K40O7K84j30k74K47j87
3426e0M25k12j13K4p8J21P5m88N29k09K41L0k93L0j47L3r7p8J33L02j95m6l49
3449d12K52K75p5J08q7J78n46L94k04N5p1K33k39J95l42J24K46o3k10J87j23K87
3471A62l79L42j5mNL1k61j10K24M30M9l96o9p7P4J33k77j5K89M2l76J18j00J05
3495g5K26k07J57n59M20R6j11k89P48m70J51l22KJ5K26M97l47j34R3J70m94L01
$$ plain form
3517 94 458 296 -169 77 123 -15 169 241 76 -22 130 -36 24 -38 -274 140 15 43 132 -372 -258 -76 -374
3540 -374 -486 -23 34 -24 -118 142 -111 271 -16 -29 -216 -262 302 182 191 435 228 127 -19 37 -263 89 31
3563 31 -204 -213 -320 47 47 -732 301 -154 16 279 -226 -376 -150 -42 -275 176 -298 -42 203 47 -350
3584 -350 119 -47 286 233 -23 -406 377 -40 -272 -271 -145 154 -386 -234 9 155 128 56 -156 -16 -292 40
3606 40 -172 204 89 47 -81 159 56 -56 -223 112 248 -256 -182 -98 62 -169 241 -11 -305 -43 -58 232
3628 232 367 115 144 -46 268 206 -31 -168 -261 74 -97 -109 110 -236 87 332 6 -276 270 95 -108
3649 -108 134 58 226 468 -147 120 99 -148 -400 -123 389 -116 -7 -4 160 -134 127 68 -32 -301 43 28
3671 28 -77 2 -195 366 3 66 43 -23 259 500 175 136 161 -113 -236 142 79 -37 213 -210 41 3 -461
$$ packed form
3517I4L64j62m65K46M6j38J84P2j65r8J52j66O0o2k36M14j25K8Q9n04J14J82k98
3540c74j12M63N7n8r4K60k53L82k87j3j87m6N64j20RK44k07j01j46N6l00L52n8
3563C1k35rj07L67%p79J033m55J70K63n05j50K26J08k33M51m74K56K45j56l97
3584c50M69j66L33n3k56l83P83m17k32JJ26K99n40J52K43J46k7p2k12J40k76L32
3606D0k12L76j15m2j28K40j03j12j67L35J36n04P4Q4J60k31M10k52k94K62j5K90
3628B32J35k52K9j90L14o2k37j37r3L35j71j2K19l46L23K45l26k82N46j75k03
3649a08K42p6J68K42o15K67k1k47k52K77N12n05J09LJ64k94K61n9j00k69L44j5
3671B8j05P9j97N61l63O3k3o6K82K41l25l9K5k74j23L78o3j16K50m23K51l8m64
$$ plain form
3694 -461 -50 -167 50 -30 -188 -97 -215 -528 335 -109 119 -351 -327 181 -158 -1 -116 197 -93 144 162
3715 162 -30 -291 355 283 90 246 -132 223 232 527 287 24 -4 -284 -242 18 -282 -12 -305 -260 -120 -127 -95
3738 -95 -279 -338 107 -215 340 74 -240 124 191 181 -56 70 -87 -133 129 111 285 151 38 177 38 41 297
3761 297 124 121 272 -8 89 -150 -122 -104 -393 2 86 -492 251 418 -170 -163 284 -73 -188 -14 -21 -393 84
3784 84 -45 10 264 -24 66 55 -186 -222 343 -221 -10 252 -283 -24 66 120 -21 -305 54 74 -90 -399 -60
3807 -60 -358 -77 -10 -132 -134 27 369 -8 389 -129 -224 -162 241 86 116 63 111 -13 -19 245 123 -177 618 179
3831 179 -140 -5 32 -148 199 210 448 -266 -136 63 122 12 53 200 295 -99 122 117 -196 -91 -79 -38 75
3854 75 11 -172 -347 38 -145 -341 124 -188 -63 -376 -332 -10 174 -162 -147 -56 -132 -4 274 596 -19 51
$$ packed form
3694d61M11j17K17q0j58R1j18l13Q63m44K28m70K4N08l39J57j15L13k90K37J8
3715A62j92k61O46p2j93J56l78L55RK95k40k63k8k80M2K60l00K70k93M5J40pL2
3738i5j84n9M45l22N55k66l14L64O7j0k37J26j57m6K62j8J74j34j13J39j39LK56
3761B97j73lJ51k80R7k39K8J8k89L95Q4n78P43J67n88PM47l57j15J74pl72M77
3784H4j29N5K54k88R0j1k41l6N65n64K11K62n35K59R0N4j41k84L59K0j64l09L39
3807f0k98K81O7j22kJ61L42l77L97n18r5O2M03j55L0n3M8j24oK64j22l00P95m39
3831A79l19J35L7j80L47J1K38p14J30J99N9j10M1J47R5l94K21nl13J05J2M1J13
3854G5o4j83j75L85j83j96M65l12J25l13M4L22J84l36J5R1p6J28K78L22o15P0
$$ plain form
3876 51 294 -149 341 216 506 -117 191 -1 25 203 370 62 -148 -65 -176 -156 -17 25 235 -64 28 -61
3898 -61 -122 -254 -79 3 -492 -10 -42 219 107 -191 -14 83 20 -41 296 -169 -80 -121 -98 -257 339 46 -319
3921 -319 -6 160 -163 -200 199 -150 -209 -116 24 -147 -80 -143 56 -80 -494 258 -34 -375 -60 -93 -208 69
3943 69 -231 102 -162 191 98 302 89 124 -253 -97 159 4 100 -74 -252 -85 -93 109 60 76 471 190 98
3966 98 -92 -319 -297 17 -90 217 -260 -359 -256 -249 95 187 3 -239 -248 -152 152 351 41 235 63 87 68 22
3990 22 52 219 -237 49 56 -200 -380 -257 30 44 -115 41 -228 334 69 19 162 -65 -7 185 -245 -521
4012 -521 -245 -206 -307 8 -295 -159 95 -318 183 7 -215 -385 -309 -269 -131 89 69 -7 -19 -136 -149 -117 -120
4035 -120 100 68 88 -62 234 -110 100 -130 289 186 150 -93 -83 379 -180 191 -19 331 26 -277 -121
$$ packed form
3876E1K43m43M90j25K90o23L08j92K6J78J67l08k10Q3j11K0J39M2K10k99R2q9
3898f1o1j32J75Q2m95M82l2K61j12k98J77R7o3o1L37m65Q9m1K3j59N96k93l65
3921c19L13J66l23l7L99l49n9R3J40j71O7o3J99j36m14P52k92l41L15l3j15K77
3943F9l00L33k64L53r3K04k13L5l77J56K56j55R6j74j78J67qK02m9J6L95k81r2
3966I8j90k27K2L14j07L07m77r9J03PL44R2j84k42rR6L04J99l10J94j72K4j9m6
3990B2L0J67m56K86Pk56j80J23K87J4j59J56k69N62k65n0J43k27N8J92m30k76
4012e21K76L9j01L15l03J36K54m13N01j76k22j70P6M0J38K20k0p6j2j17j3L2l
4035a20K20l2K0j50K96l44K10k30M19j03l6k43J0M62n59L71k10L50l05l03J56
$$ plain form
4056 -121 -364 -356 331 169 82 -257 36 -18 -51 63 -57 40 159 -21 58 216 14 389 -212 -45 85 161 -30
4079 -30 -18 100 21 160 140 -11 179 -387 -198 -334 -128 -158 -205 -221 -9 -557 -255 157 -28 -326 109 251
4101 251 -115 395 164 4 38 202 -15 -218 -265 274 -375 -7 138 -17 285 -191 -41 -34 33 -200 -60 56
4123 56 -240 95 -369 77 -51 -223 -296 65 179 -148 214 231 96 -241 82 184 5 186 405 100 0
4144 0 5 181 222 -18 -200 197 29 -205 181 -96 322 -43 -491 214 267 -78 -30 59 -36 -89 -246 -90 305
4167 305 163 -116 327 -98 24 90 -96 121 465 -281 272 98 151 -236 -32 191 191 21 314 32 -6 -20
4189 -20 -42 -176 -250 48 -141 297 -335 292 104 -71 133 218 -429 147 331 -414 421 427 308 95 93 -123 202
4212 202 -155 115 312 38 -247 -170 47 -147 -80 -26 -151 -341 147 52 -383 208 -291 -196 13 -250 -52 -158
$$ packed form
4056a21k43QO87j62q7l39K93n4l3J14j20R7J19j80P9J58k02L75o01J67J30P6j91
4079c0J2J18p9J39k0j51J90n66J89j36K06l0m7j6K12n48L02M12j85k98M35J42
4101B51l66N10k31j60L4J64k17k03m7N39o49L68J45j55L02m76J50PO7k33J40J16
4123E6k96L35m64M46j28j72p3L61J14l27L62J7j35l37L23J02j79J81K19l05j00
4144@NJ76M1k40j82L97j68k34L86k77M18l65m48P05N3l45M8Q9r5n3j57J56L95
4167C05j42k79M43m25J22O6j86K17L44p46N53j74N3l87K04K23%j70K93k82l8j4
4189b0k2j34p4K98j89M38o32O27j88j75K04Q5o47N76J84p45Q35Oj19k13kk16L25
4212B02l57K70J97k74k85P7K17j94O7N4j25j90M88r5m35N91m99R5K09k63J98j06
$$ plain form
4234 -158 -65 113 44 3 -22 147 81 -131 101 151 373 67 227 -138 -4 -101 31 54 -173 263 23 -8 -136
4257 -136 170 -88 98 -448 211 -113 154 216 -270 -261 -246 115 -21 -192 225 -128 99 299 -198 -215 -30 145
4279 145 361 -103 -6 -401 -248 49 -155 94 432 -16 92 -2 -277 -70 79 16 -239 99 -114 36 -31
4300 -31 -167 142 -219 79 -375 57 -96 60 -33 428 410 304 69 -154 50 -61 38 -135 165 -393 141
4321 141 -186 -203 -225 -397 108 -15 -269 236 -96 120 12 -30 -41 70 -453 207 187 132 412 144 575 127
4343 127 -192 50 -203 45 -128 50 -97 -717 180 142 -126 -167 -19 329 173 -284 -41 225 -36 -265 144
4364 144 -127 2 307 109 -20 305 165 -422 344 -226 5 19 395 168 -188 -195 1 65 286 -102 -289
4385 -289 -218 -178 82 -240 -388 -125 -413 188 -230 -251 122 82 242 -272 232 -50 25 16 -62 -185 86 -60 -43
$$ packed form
4234a58R3J78o9m1k5J69o6k12K32N0K22l06J60l65J34r7J32K3k27M36k40l1j28
4257a36L06k58J86n46O59l24K67O2m86RJ5L61j36j71M17l53K27K00m97j7J85J75
4279A45K16m64R7l95J53K97k04K49L38m48J08r4k75K07J49o3k55L38k13J50o7
4300c1j36L09l61K98m54M32j53J56r3M61j8j06k35k23K04j11R9j73L00n58N34
4321A41l27j7k2j72N05j23k54N05l32K16j08m2j1J11n23O60k0n5K80k68M31m48
4343A27l19K42k53K48j73J78j47o20Q97l8k68m1J48L48j56m57K43K66k61k29M09
4364A44k71J29L05j98j29L25j40n87P66n70K31J4L76k27l56pJ96O4K21l88j87
4385b89P1M0K60l22j48K63k88O01m18k1L73m0J60n14N04k82P5rp8j23K71j46J7
$$ plain form
4408 -43 54 234 7 225 349 -31 -141 -164 -225 -39 -615 267 57 -359 -151 71 -3 -315 -67 -70 -82 18 12
4431 12 137 55 -83 191 224 324 -211 -183 116 -196 55 88 -25 29 -263 -273 -35 -43 -94 276 -252 -101 4
4454 4 -484 473 -108 325 -250 57 -441 66 140 100 237 -207 -39 68 65 -261 -41 -358 243 -223 42 427
4476 427 -138 -89 -106 -22 -195 -59 -373 -98 172 -7 -91 50 -115 -62 29 -369 -125 -142 276 -89 -112 -211 85
4499 85 -3 -36 281 403 160 -15 -336 -15 -158 -176 330 -30 -2 -342 -216 54 -141 115 -648 -348 171 337
4521 337 -64 -97 -66 64 -293 -185 -236 -125 338 325 -243 22 82 -206 -19 88 411 137 202 -332 259 133
4543 133 336 -161 356 175 -172 276 114 -137 -262 -212 -290 -59 -51 -32 134 -152 113 40 -76 -378 74 -71
4565 -71 26 130 206 59 -124 3 116 -27 249 405 20 98 -83 -143 49 -223 125 -141 720 -287 111
$$ packed form
4408d3R7J80k27K18J24l80j10k3o1J86n76Q82k10m16K08K22p4l12K48lj2J00o
4431A2J25q2j38K74L3J00n35K8K99l12K51L3j13N4k92j0K38qn1L70n28J51J05
4454Dm88R57n81M33n75L07m98N07P4m0J37m44J68J07ll26K20l17O01m66K65L85
4476D27n65M9j7Q4j73J36l14K75K70j79q4J41j65N3R1l98K44j7M18l65k3r9K96
4499H5q8l3L17J22k43j75l21L21j43j8N06l60K8l40J26K70j95K56p63L00N19J66
4521C37m01l3L1J30l57J08n1J11M63j3n68K65O0k88J87J07L23k74O5n34N91j26
4543A33K03m97N17j81l47M48j62k51j25N0p8K31QJ9J66k86K65p3j16l02M52j45
4565g1R7J04P6j47j83J27J13j43K76J56l85P8j81o0J92k72L48k66Q61j007L98
$$ plain form
4586 111 69 -111 127 -218 -391 -136 -282 -220 298 -114 32 318 103 -519 148 -78 -101 -87 10 -123 127 21
4608 21 408 -112 -186 -240 -228 239 -148 -40 113 -525 -178 100 -191 -9 76 -63 97 -600 -314 166 285 99
4630 99 72 110 137 -189 527 -42 170 -163 -307 -268 -14 -338 -446 70 44 -194 -71 -107 -246 -2 -256 -83
4652 -83 127 -287 -397 -139 164 222 235 401 -132 -168 231 -289 102 213 159 112 -185 251 -121 159 319 -143
4674 -143 -58 -9 6 83 -52 68 -256 72 -99 -69 -44 -72 -154 116 -178 130 276 -8 -179 -155 257 -92 77
4697 77 73 -59 249 264 218 -220 50 5 -265 29 512 502 474 -18 -216 73 22 -71 43 44 -15 -382 -260 -196 -157
4722 -157 67 -278 -189 142 195 -116 -82 -113 -245 -363 46 30 -206 -135 313 190 -184 -50 -195 -526 285 243
4744 243 -6 57 337 -127 -91 358 141 -198 -156 -76 -94 137 50 -52 82 -125 4 -284 20 -396 46 -73
$$ packed form
4586A11m2j80K38l45j73K55j46O2N18m12J46K86k15o22O67k26k3J4R7j33K50j06
4608B1L87n20p4n4J2M67l87J08J53o38L47K78k91J82Q5j39J60o97K86M80J19j86
4630I9k7L8K7l26P16n69K12l33j44L9K54l24j08N16k6k38J23l6j39K44k54J73
4652h3K10m14j10K58L03N8J3J66n33l6L99n20L91J11n4m7k97M36l72K80J60m62
4674a43Q5M9J5P7j35J20l24L28j71L0K5k8q2K70k94L08J46k84j71K4M12l49J69
4697G7mj32L08J5m6m38K70m5k70K94M83j0k8m92j98K89n1r3J14Jn9l67J22O4L9
4722a57K24l45Q9L31N3l11L4l1j32j18M09j6k36P1M48j23l74J34j45l31Q11m2
4744B43k49O3K80m64L6M49k17l39M2Q0j8K31q7j02J34k07J29k88L04m16M42j19
$$ plain form
4766 -73 -338 2 118 -3 -96 -56 -40 -189 195 -161 -9 115 -95 95 -334 12 53 -257 -345 132 -26 130
4788 130 -74 275 143 187 -129 126 101 -40 529 -59 213 52 -145 -48 -115 -83 19 -323 -63 -116 65 -285
4810 -285 -140 -24 78 -210 103 -30 -361 -333 -196 96 17 53 -246 199 13 216 58 133 185 -154 -105 -128
4832 -128 -230 -312 -21 -10 -190 -100 13 79 45 367 21 -91 -200 -295 -139 104 225 62 -305 -430 215 -176
4854 -176 1 -390 -23 49 -161 213 288 191 144 -270 321 689 169 -77 -511 120 36 7 41 -80 41 50 273
4877 273 -380 -157 458 -280 138 151 -78 -258 -391 -68 -361 251 -154 341 -172 -73 -137 -25 -161 -104 57
4898 57 384 83 -4 46 107 -230 -265 -62 -615 -255 143 82 324 -39 -1 -70 123 382 20 336 80 187 -172
4921 -172 8 -95 62 0 167 -239 -47 -280 81 245 -186 134 76 -453 -32 -111 -158 -176 -342 -73 -321 5
$$ packed form
4766g3k65L40J16j21r3M0J6j49L84l56J52J24k10J90m29L46M1l10q8M77j58J56
4788A30k04L49j32M4l16K55k5j41N69n88K72j61j97R7o7L2J02l42K60n3J81l50
4810b85J45J16J02k88L13j33l31K8J37K92p9L6k99M45j86K03j58P5N2l39M9k3
4832a28j02q2K91J1j80R0J13O6l4L22l46j12j09r5J56K43J21j63l67j25O45l91
4854a76J77l91L67P2k10L74P5r7m7m14N91L68n20k46m34O31q4k9L4j21J21RK23
4877B73o53K23O15p38M18J3k29j80j33L23k93O12m05M95n13R9o4J12j36N7J61
4898E7L27l01q7N0O1l37l5K03n53L60L98o1K42l63L8o9J93K59l62L16k56J07l59
4921a72J80j03J57o2J67m06J92k33L61J64m31L20n8n29M21p9m7j8j66K69k48L26
$$ plain form
4943 5 49 127 -321 213 -153 -27 35 -99 -73 -44 9 360 210 -175 206 -278 247 478 99 -60 -216 -53 32
4966 32 -107 -158 129 84 -27 -363 -55 -89 287 80 564 141 -210 -2 -8 224 0 -447 -340 278 41 210
4988 210 171 -66 133 320 -38 91 -34 25 -322 -111 -141 -257 255 -1 306 -478 -118 -164 -121 46 -110 168
5010 168 107 78 -201 130 207 199 -70 -300 360 436 -1 -221 -96 -9 131 239 286 72 37 262 -235 -133 -162
5033 -162 -53 99 229 118 96 -193 -133 -274 -201 101 -40 -47 45 -66 -437 -85 69 435 162 -239 90 30
5055 30 753 -69 -241 -55 -209 72 -36 392 -120 53 -201 -211 242 -197 80 18 53 -9 -81 -26 234 205 -147
5078 -147 111 281 7 -177 56 48 -77 -47 46 286 185 -237 -75 273 89 131 -31 -42 -211 -118 -50 117 -305
5101 -305 118 34 -233 68 -240 148 -9 -46 76 -63 236 -89 117 74 88 33 214 -168 -249 162 97 13 368
$$ packed form
4943EM4P8m48N34l66J26O2j34K6K9N3L51j50l85L81m84N25K31l79j59j56J63Q5
4966C2j39n1K87m5j11l36L08l4L76k07M84m23l51K08oK32k24m47J07O18k37J69
4988B10l9k37J99J87l58J29j25N9l47K11l0j16N12k56L07p84L60m6M3J67j56K78
5010A68o1k9k79L31P7qk69k30O60P6m37k20J25Q7J40J08M7k14l5K25m97J02k9
5033a62J09J52J30j11k2k89O0j41P3L02j41pR2j11l71L52J54L66k73m01L29o0
5055C0P23q22j72J86j54K81j08M28n12J73k54j0M53m39K77o2L5o2p2N5K60k9l52
5078a47K58J70k74j84K33qj25L0R3K40j01m22J62L48j84M2j62j1j69R3O8J67m22
5101c05M23q4k67L01l08L88j57l7J22j39K99l25K06m3J4n5J81l82q1M11o5q4L55
$$ plain form
5124 368 -33 33 -7 -19 -102 158 71 -10 -138 -103 -205 34 -48 88 -150 -85 170 172 159 303 -138 134 67 176
5148 176 69 -141 -170 132 -190 96 29 35 -371 66 111 25 58 -136 139 -291 114 157 232 -13 90 -89 -290
5171 -290 -359 -313 168 85 110 -27 -142 39 295 226 -174 4 -329 59 92 -10 -222 -314 -74 143 175 -26 159
5194 159 -45 36 82 -351 -354 -2 327 82 -475 -194 -202 -104 -19 -127 -237 -260 -87 -90 -79 142 -82 71 112 203 -101
5219 -101 399 -59 59 47 -35 -142 84 330 207 19 117 10 138 75 94 168 -84 -2 27 -7 -98 160 -18
5242 -18 59 -412 -278 91 -114 -81 -120 -155 92 123 94 -77 -187 490 -140 246 -215 -413 19 71 -86 -4 81
5265 81 -44 -105 113 321 227 452 -425 93 139 -11 -528 42 250 45 -195 -114 27 -283 -38 -108 47 278
5287 278 -94 -173 218 214 162 50 222 52 -112 -104 -50 -251 222 -246 -180 52 89 179 -162 60 -201 -309 -65
$$ packed form
5124C68m01O6m0j2q3K60q7q1j28L5j02K39q2J36k38O5K55Kj3J44m41K72o7J09
5148A76j07k10k9L02l22K86o7Om06M37M5q6L3j94K75m30M05M3P5k45J03j79k01
5171b90o9M6M81q3K5j37j15J81K56o9m00J78l33L88L3j02k12r2K40K17L2k01J85
5194A59k04Q1M6m33lL52L29k45n57K81qR8Q5j08j10k3J73lJ1K21k24J53M1R1l04
5219a01N00m58J18j2q2j07K26K46j23j88R8j07J28o3J9P4k52Q2K9l4r1K58j78
5242a8P7m71J34L69k05L3l9l5K47L1k9j71j10O77o30L86m61j98M32N2j57Q2Q5
5265H1j25o1K18K08r4K25q77N18M6j50n17N70K08k05k40Q1J41l10K45p0J55K31
5287B78l72p9L91mn2j12J72j70j64QN4k01M73m68O6K32L7R0l41K22k61j08K44
$$ plain form
5310 -65 126 -60 -143 -91 236 166 -88 206 -148 -218 -166 102 198 -553 34 262 -112 -214 37 7 27 156 -2
5333 -2 -220 -194 -81 -263 -310 185 13 297 -120 39 -180 -316 135 183 314 130 -28 297 235 169 -51 -102 207
5356 207 27 -69 -149 128 89 -90 -168 46 222 -129 75 -251 -502 3 -360 -338 225 -199 97 -170 333 412
5378 412 -74 -94 -104 9 -110 -392 -70 119 15 -257 200 -61 -39 -170 168 -177 -436 159 -91 169 -131
5399 -131 -136 52 -125 -534 44 -3 -221 101 88 -29 311 -107 200 278 214 -138 -168 325 177 104 306 295 -22
5422 -22 -229 -6 16 -125 -62 -420 223 -274 -41 95 -98 56 -1 223 259 271 -240 -118 116 -108 116 200
5444 200 -200 102 -82 -146 69 -27 40 132 319 387 -215 41 -201 -85 -232 -233 -366 -67 -513 -32 180 -71
5466 -71 -66 -109 -229 23 103 53 -157 72 -230 101 -218 148 5 -194 24 146 73 216 94 -185 183 317
$$ packed form
5310f5J91j86q3N2L27p0k54K94l54p0N2K68R6p51N87K28l74j02K51l0K0J29j58
5333bk18K6J13j82m7M95j72K84m17J59k19j36M51M8J31j84j58L25o2o6k20n1L09
5356B07j80r6q0K77l9j79p8K14J76l51K04l26k51N05l63K2N63m24K96k67N03P9
5378D12m86k0j0J13j19k82L22J89j04k72M57k61K2j31L38l45k59N95k50K60l00
5399a31nJ88j77m09N78m7k18L22j3j17L40m18L07P8o4l52l0M93j48p3K02j1l17
5422b2k07K23K2j41O3l58O43m97K33J36j93J54n7K24L6J2n11J22K34k24K24Q4
5444B00m00L02j84o4K15r6O7R2J87O8o02K56k42J16j47jj33K99m46M81K12k51
5466g1Nm3j20K52Q0n0k10K29l02L31l19L66j43j99K18J22p3J43j22k79L68J34
$$ plain form
5488 317 -340 212 150 23 56 122 -262 -265 58 83 -75 158 -135 -195 -199 -287 45 -151 94 136 -14 -223 168 -214
5512 -214 159 24 -3 -22 -162 264 437 104 217 -152 -183 264 -223 -115 65 -246 244 -300 90 -242 -334
5533 -334 499 104 20 315 220 -424 -289 -152 120 -146 -101 158 99 24 -180 -313 155 36 135 -41 -262 18
5555 18 16 -201 183 182 -165 -238 88 -180 -71 16 -380 210 35 -184 -28 286 -38 -37 67 263 2 229 -73
5578 -73 28 -76 -44 -260 -412 -246 21 221 -56 171 115 -188 -173 277 -41 289 119 -40 280 -129 -36 50
5600 50 -31 -229 90 484 18 -40 55 111 40 217 65 8 173 89 72 -271 -436 -19 -231 195 -63 -73 262
$$ packed form
5488C17o57N52o2j27L3O6l84lL23K5j58K33k93o0mq8L32j96K45M2j50k09L91l82
5512b14L73j35k7j9j40M26J73l33J13l69l1M47m87J08J80l11M90n44L90l32r2
5533c34Q33l95q4K95r5o44J35J37K72k66M5K59n9p5k04j33M68j19R9j76k21K80
5555A8kk17L84jl47p3L26k68J09Q7l96N90j75k19J56L14l24JJ04J96k61K27l02
5578g3J01j04L2k16j52J66K67K00k77K27n6l03J5M50l18L30j70j59L20m09R3Q6
5600E0q1j98L19L94m66n8R5N6p1J77j52n7J65q4j7l43j65M17k12M26k58j0L35
$$ [...]
8191i0
##END NTUPLES=NMR FID
##END=
