##TITLE=1H_SR82 Leu'
 CDCl3, 8 sc, 
 1.9.2021
##JCAMPDX= 6.0         $$ Bruker NMR JCAMP-DX V2.0
##DATA TYPE= NMR FID
##DATA CLASS= NTUPLES
##ORIGIN= UXNMR, Bruker Analytische Messtechnik GmbH
##OWNER= root
$$ XWIN-NMR		Version 3.5
$$ Wed Sep  1 16:08:24 2021 Russian Standard Time (UT+4h)  she@DPX200
##.OBSERVE FREQUENCY= 200.1312
##.OBSERVE NUCLEUS= ^1H
##.DELAY= (6, 6)
##.ACQUISITION MODE= SIMULTANEOUS
##.ACQUISITION SCHEME= undefined
##.AVERAGES= 8
##.DIGITISER RES= 18
##SPECTROMETER/DATA SYSTEM= spect
##.PULSE SEQUENCE= zg30
##.SOLVENT NAME= CD2Cl2
##.SHIFT REFERENCE= (INTERNAL, CD2Cl2, 0, 15.7039)
##AUDIT TRAIL= $$ (NUMBER, WHEN, WHO, WHERE, WHAT)
$$ ##TITLE= Audit trail, XWIN-NMR		Version 3.5
$$ ##JCAMPDX= 5.01
$$ ##ORIGIN= Bruker BioSpin GmbH
$$ ##OWNER= she
$$ F:/spectra/data/she/nmr/H-F/1/audita.txt
$$ ##AUDIT TRAIL=  $$ (NUMBER, WHEN, WHO, WHERE, WHAT)
(   1,<2021-09-01 16:07:26.50 +0400>,<she>,<DPX200>,
      <created by zg, POWCHK disabled, PULCHK disabled
       configuration hash MD5:
       00 E9 B6 7A A2 85 ED C7 34 08 36 98 17 FE 4E 26
       data hash MD5: 16K
       B4 29 78 CA F6 D1 5F 9C F7 67 89 F3 CC 9A 52 C4>)
$$ ##END=
$$ 
$$ hash MD5
$$ F7 FD 45 23 BD 51 D2 DE 8B 51 4E 7B 9D 47 2F 1E
##$RELAX= 
##$RELAX= 
##$RELAX= 
##$RELAX= 
##$RELAX= 
##$RELAX= 
$$ Bruker specific parameters
$$ --------------------------
##$DU= <F:/spectra>
##$EXPNO= 1
##$NAME= <H-F>
##$PROCNO= 1
##$TYPE= <nmr>
##$USER= <she>
##$AMP= (0..31)
100 100 100 100 100 100 100 100 100 100 100 100 100 100 100 100 100 100 
100 100 100 100 100 100 100 100 100 100 100 100 100 100 
##$AQSEQ= 0
##$AQ_mod= 1
##$AUNM= <au_zg>
##$AUTOPOS= <>
##$BF1= 200.13
##$BF2= 200.13
##$BF3= 200.13
##$BF4= 200.13
##$BF5= 200.13
##$BF6= 200.13
##$BF7= 200.13
##$BF8= 200.13
##$BYTORDA= 1
##$CFDGTYP= 0
##$CFRGTYP= 5
##$CHEMSTR= <none>
##$CNST= (0..31)
1 1 145 1 1 1 1 1 1 1 1 1 1 1 1 1 1 1 1 1 1 1 1 1 1 1 1 1 1 1 1 1 
##$CPDPRG= <>
##$CPDPRG1= <>
##$CPDPRG2= <>
##$CPDPRG3= <>
##$CPDPRG4= <mlev>
##$CPDPRG5= <mlev>
##$CPDPRG6= <mlev>
##$CPDPRG7= <mlev>
##$CPDPRG8= <mlev>
##$CPDPRGB= <>
##$CPDPRGT= <>
##$D= (0..31)
0 1.2 0 0 0 0 0 0 0 0.06 0 0.03 0 0 0 0 0.0002 0 0 0 0 0 0 0 0 0 0 0 0 
0 0 0 
##$DATE= 1630498045
##$DBL= (0..7)
120 120 120 120 120 120 120 120 
##$DBP= (0..7)
150 150 150 150 150 150 150 150 
##$DBP07= 0
##$DBPNAM0= <>
##$DBPNAM1= <>
##$DBPNAM2= <>
##$DBPNAM3= <>
##$DBPNAM4= <>
##$DBPNAM5= <>
##$DBPNAM6= <>
##$DBPNAM7= <>
##$DBPOAL= (0..7)
0.5 0.5 0.5 0.5 0.5 0.5 0.5 0.5 
##$DBPOFFS= (0..7)
0 0 0 0 0 0 0 0 
##$DE= 6
##$DECBNUC= <off>
##$DECIM= 32
##$DECNUC= <off>
##$DECSTAT= 4
##$DIGMOD= 1
##$DIGTYP= 9
##$DL= (0..7)
0 120 120 120 120 120 120 120 
##$DP= (0..7)
150 150 150 150 150 150 150 150 
##$DP07= 0
##$DPNAME0= <>
##$DPNAME1= <>
##$DPNAME2= <>
##$DPNAME3= <>
##$DPNAME4= <>
##$DPNAME5= <>
##$DPNAME6= <>
##$DPNAME7= <>
##$DPOAL= (0..7)
0.5 0.5 0.5 0.5 0.5 0.5 0.5 0.5 
##$DPOFFS= (0..7)
0 0 0 0 0 0 0 0 
##$DQDMODE= 0
##$DR= 18
##$DS= 0
##$DSLIST= <SSSSSSSSSSSSSSS>
$$ [...]
##$SUBNAM2= <"">
##$SUBNAM3= <"">
##$SUBNAM4= <"">
##$SUBNAM5= <"">
##$SUBNAM6= <"">
##$SUBNAM7= <"">
##$SUBNAM8= <"">
##$SUBNAM9= <"">
##$SW= 20.0189188712717
##$SWIBOX= (0..15)
0 0 2 0 0 0 0 0 0 0 0 0 0 0 0 0 
##$SW_h= 4006.41025641026
##$TD= 16384
##$TD0= 1
##$TE= 0
##$TE2= 300
##$TE3= 300
##$TEG= 300
##$TL= (0..7)
0 120 120 120 120 120 120 120 
##$TP= (0..7)
150 150 150 150 150 150 150 150 
##$TP07= 0
##$TPNAME0= <>
##$TPNAME1= <>
##$TPNAME2= <>
##$TPNAME3= <>
##$TPNAME4= <>
##$TPNAME5= <>
##$TPNAME6= <>
##$TPNAME7= <>
##$TPOAL= (0..7)
0.5 0.5 0.5 0.5 0.5 0.5 0.5 0.5 
##$TPOFFS= (0..7)
0 0 0 0 0 0 0 0 
##$TUNHIN= 0
##$TUNHOUT= 0
##$TUNXOUT= 0
##$USERA1= <user>
##$USERA2= <user>
##$USERA3= <user>
##$USERA4= <user>
##$USERA5= <user>
##$V9= 5
##$VALIST= <valist>
##$VCLIST= <CCCCCCCCCCCCCCC>
##$VD= 0
##$VDLIST= <DDDDDDDDDDDDDDD>
##$VPLIST= <PPPPPPPPPPPPPPP>
##$VTLIST= <TTTTTTTTTTTTTTT>
##$WBST= 1024
##$WBSW= 4
##$XGAIN= (0..3)
0 0 0 0 
##$XL= 0
##$YL= 0
##$YMAX_a= 198439
##$YMIN_a= -273913
##$ZGOPTNS= <>
##$ZL1= 120
##$ZL2= 120
##$ZL3= 120
##$ZL4= 120
##$ABSF1= 10
##$ABSF2= 0
##$ABSG= 5
##$ABSL= 3
##$ALPHA= 0
##$AQORDER= 0
##$ASSFAC= 0
##$ASSFACI= 0
##$ASSFACX= 0
##$ASSWID= 0
##$AUNMP= <proc_1d>
##$AZFE= 0.1
##$AZFW= 0.1
##$BCFW= 1
##$BC_mod= 2
##$BYTORDP= 1
##$COROFFS= 0
##$CY= 11.3945322036743
##$DATMOD= 1
##$DC= 2
##$DFILT= <>
##$DTYPP= 0
##$F1P= 2.36226072786647
##$F2P= -0.459571619588291
##$FCOR= 0.5
##$FTSIZE= 0
##$FT_mod= 4
##$GAMMA= 1
##$GB= 0.15
##$INTBC= 1
##$INTSCL= 1
##$ISEN= 128
##$LB= 0.24
##$LEV0= 0
##$LPBIN= 0
##$MAXI= 10000
##$MC2= 0
##$MEAN= 0
##$ME_mod= 0
##$MI= 1.114404
##$NCOEF= 0
##$NC_proc= 0
##$NLEV= 6
##$NOISF1= 3.799351
##$NOISF2= 2.8
##$NSP= 1
##$NTH_PI= 0
##$NZP= 0
##$OFFSET= 15.70392
##$PC= 1
##$PHC0= -13360.58
##$PHC1= 12.80097
##$PH_mod= 1
##$PKNL= yes
##$PPARMOD= 0
##$PSCAL= 0
##$PSIGN= 0
##$REVERSE= no
##$SF= 200.130013532006
##$SI= 16384
##$SIGF1= 3
##$SIGF2= 2
##$SINO= 400
##$SIOLD= 16384
##$SREGLST= <1H.CDCl3>
##$SSB= 0
##$STSI= 0
##$STSR= 0
##$SW_p= 3612.71676300578
##$SYMM= 0
##$S_DEV= 0
##$TDeff= 0
##$TDoff= 0
##$TI= <>
##$TILT= no
##$TM1= 0
##$TM2= 0
##$TOPLEV= 0
##$USERP1= <user>
##$USERP2= <user>
##$USERP3= <user>
##$USERP4= <user>
##$USERP5= <user>
##$WDW= 1
##$XDIM= 8192
##$YMAX_p= 0
##$YMIN_p= 0
$$ End of Bruker specific parameters
$$ ---------------------------------
##NTUPLES= NMR FID
##VAR_NAME=  TIME,          FID/REAL,        FID/IMAG
##SYMBOL=    X,             R,               I
##VAR_TYPE=  INDEPENDENT,   DEPENDENT,       DEPENDENT
##VAR_FORM=  AFFN,          ASDF,            ASDF
##VAR_DIM=   8192,          8192,            8192
##UNITS=     SECONDS,       ARBITRARY UNITS, ARBITRARY UNITS
##FACTOR=    0.0002496,     1,               1
##FIRST=     0,             0,               0
##LAST=      2.0444736,     0,               0
##MIN=       0,             -273913,         0
##MAX=       2.0444736,     198439,          0
$$ Real data points
##PAGE= N=1
##DATA TABLE= (X++(R..R)), XYDATA
0 0 0 0 0 0 0 0 0 0 0 0 -8 8 -8 8 -16 16 -24 24 -32 40 -48 56 -65 80 -90 107 -127 145 -169 193 -221 250
32 250 -287 323 -367 411 -463 520 -579 648 -722 802 -889 985 -1090 1203 -1329 1465 -1614
49 -1614 1778 -1958 2158 -2380 2624 -2900 3208 -3560 3963 -4430 4980 -5640 6445 -7455 8766
64 8766 -10545 13108 -17142 24485 -42265 183506 135299 -61425 50671 -88585 91713
75 91713 159133 -62752 -92653 -39522 -129144 -58401 -115168 -175836 -32828 -38510 -146958 -132903
87 -132903 -215278 -145599 8191 -91868 -106518 4181 -72271 -31896 19256 -89367 36565
98 36565 198439 98810 82931 53203 -29605 119137 196683 104655 140192 107983 38780 94821
110 94821 33427 11748 142241 78314 -9354 12606 -86789 -80267 22406 -68694 -88592 -32402
122 -32402 -117806 -106093 -84314 -186138 -110411 -12375 -68815 -39026 -56230 -141093 -45151 8365
134 8365 -23901 65458 62777 -8011 40719 23691 17766 130845 128949 91685 104398 29921 34505
147 34505 116367 71066 61855 91989 20834 17110 31192 -48243 -27800 15805 -35314 -26817 -34321
160 -34321 -104082 -84215 -69772 -92917 -44955 -39055 -74520 -62918 -93305 -98891 -22628 -5287
172 -5287 -892 21089 -26072 -27728 29325 27761 54198 90063 50821 50491 65362 29830 55015
185 55015 86578 60570 71754 63740 18489 31449 25579 -4769 21790 17920 -11958 -6958 -45752
198 -45752 -79203 -44172 -39186 -41180 -21956 -59317 -86322 -64290 -68791 -50640 -12006 -26670 -32237
211 -32237 -21954 -39678 -17093 22889 22656 35018 41450 20907 32379 45721 39213 56791 64760
224 64760 54562 60837 47051 23691 30299 31338 28943 35889 16793 -8908 -19002 -34032 -31193
237 -31193 -15114 -20360 -28490 -39985 -63588 -63838 -47866 -40024 -29096 -30905 -44127 -39689 -33639 -26814
251 -26814 -4756 5739 7514 17666 15609 12549 24412 29858 36704 50746 48602 43259 41306 29849
265 29849 28734 38904 38943 38077 30012 5906 -7441 -7124 -7583 -2859 -3772 -20232 -33810 -40273 -43963
280 -43963 -36985 -28977 -30655 -33816 -36823 -41246 -38062 -27234 -18672 -11403 -4506 -2147 -288 4180 8027
295 8027 14307 25932 33407 34421 33880 27604 23928 29661 35642 38915 38845 26820 14636 10726 7236
310 7236 7436 11035 3421 -9035 -17234 -25029 -26315 -21833 -22614 -24164 -26113 -32744 -34097 -31252 -29874
325 -29874 -24312 -17709 -16177 -11885 -10224 -10867 -4349 4902 11183 19185 22113 18750 16558 17818 22982
340 22982 30803 32916 30796 25555 18682 16516 18151 18765 18139 10943 1524 -3568 -9165 -12496 -9770
355 -9770 -11996 -16914 -17841 -23044 -26641 -24345 -25700 -24867 -18864 -19391 -20855 -17606 -17780 -13959 -4339 572
371 572 5475 9276 5595 6129 12892 15937 21051 26687 22314 19126 19972 19104 21171 24746 20714 15921
387 15921 12158 4981 1777 1671 -1301 -4407 -5958 -11042 -15167 -17360 -20112 -20281 -18366 -19147 -20054 -20484
403 -20484 -22502 -22256 -17128 -12250 -7254 -3058 -3535 -3583 276 4661 9131 15538 16517 15285 16070 15858 18189
420 18189 22010 21666 20968 19216 14017 11470 11212 7413 5983 4585 -477 -3826 -7207 -11854 -13249 -13515
436 -13515 -14909 -14929 -16631 -19913 -20781 -20758 -17598 -13230 -11748 -9888 -8952 -10115 -5151 207 2423 8228
452 8228 10113 7538 11462 13821 13041 18613 19657 15784 18197 15996 11196 14459 12045 7808 10743
467 10743 5488 -833 801 -5767 -9921 -5312 -9851 -12750 -10390 -17360 -18303 -13449 -17026 -13514 -8082
482 -8082 -14834 -13366 -7582 -11359 -5477 1343 -1452 3583 6515 2617 9157 12515 9213 15316 15298 10237
498 10237 14022 12773 9501 13761 10903 8261 11270 5022 843 3155 -2381 -3657 -1706 -8319 -8684
513 -8684 -8299 -14705 -10761 -7664 -13549 -9578 -8276 -14962 -9817 -8020 -10633 -3313 -2872 -5953 2536 1478
529 1478 -98 8756 6440 5533 12762 7543 6395 13619 7084 7589 14933 8284 7355 12086 3397 3479
545 3479 7029 -1309 940 1936 -8290 -5140 -2674 -10897 -5839 -3980 -11659 -7450 -7604 -13591 -6928
560 -6928 -7057 -11481 -3762 -5097 -8271 235 -963 -2043 5849 2459 2293 8886 4052 4297 10393 5788
576 5788 7324 12060 6219 8094 9890 3295 7174 7845 -35 3125 2167 -5285 -109 -1587 -7385 -2551
592 -2551 -5312 -9830 -4128 -8338 -10714 -3860 -9044 -9912 -2732 -8350 -7434 705 -4787 -2803 4636 -1577
608 -1577 1443 7583 1065 4687 9475 3400 7803 10485 3338 8565 9361 2886 7986 6451 -333
623 -333 5554 2593 -3774 2814 -1537 -7279 -667 -4908 -8869 -2811 -7710 -9529 -3288 -8746 -8599 -2260
639 -2260 -7417 -5865 -507 -5728 -2251 2297 -2319 2673 5338 449 6246 7549 2129 8460 8322
654 8322 3126 8617 6941 1937 6871 3997 1249 6126 889 -1302 2622 -3745 -4517 130 -6556
669 -6556 -5801 -1623 -9075 -6908 -2227 -8436 -4927 -1169 -7682 -3295 -835 -6044 -224 1838 -2659
684 -2659 3845 3572 -225 6349 4942 1832 8686 5317 2027 7967 3344 862 7171 2405 828
699 828 6170 -149 -1390 2509 -3154 -2828 235 -5390 -4363 -2324 -7754 -4287 -1932 -6374 -2147 -1773
715 -1773 -6603 -2078 -1621 -4946 904 435 -1997 3056 1075 4 4922 3023 3050 6840 2778 2563
731 2563 5374 1472 2949 5985 1493 2706 4092 -1258 891 2356 -2432 -207 485 -4840 -2792
746 -2792 -2669 -5683 -1957 -2142 -5114 -1506 -3479 -5975 -1288 -3181 -3403 1107 -1768 -2027 1828 -1298
762 -1298 -220 4441 1886 2080 5509 1349 2372 5062 2138 3829 6079 1654 2817 3202 -212 1992
778 1992 2424 -114 974 -684 -3508 -1200 -2627 -4203 -874 -2471 -5403 -3181 -4156 -5068 -2715 -2819
794 -2819 -2882 -1111 -2819 -2775 -628 -1100 851 2367 1064 2613 2543 1434 4203 4931 4019 5397 4896 2094
812 2094 3065 3020 1984 3809 2488 627 1221 -1599 -2505 -50 -1673 -3152 -1816 -4177 -5222 -4356 -5685
829 -5685 -4456 -2250 -3637 -3702 -2845 -3847 -2600 -735 -939 835 2078 -243 1398 3031 2388 4423
845 4423 5929 4775 5030 4253 2749 3839 4099 3282 4052 2586 248 753 30 -1063 -449 -1075 -2156
862 -2156 -3607 -5014 -5849 -4732 -3993 -4158 -3352 -3579 -4172 -4340 -3833 -1553 -510 -736 55 222 360 1133
880 1133 2153 3816 5399 4662 3924 4196 3642 3220 4710 4260 3265 3107 2309 131 450 882 640 193
898 193 -1403 -2880 -3363 -4307 -4619 -3366 -3128 -3319 -3605 -5080 -4240 -2670 -2722 -2027 -470 -765 -1688 -987 -323
917 -323 1459 2995 2771 3648 3535 2689 2756 3503 3970 4946 4191 2787 2427 1836 981 2014 1966 649 923
936 923 -700 -3505 -2789 -1796 -2756 -2463 -2594 -4170 -4110 -4332 -4287 -2793 -1676 -2100 -2377 -2163 -2487 -1457 -140
955 -140 1195 1842 1836 1538 1748 1552 2723 3763 3980 4069 3767 2847 2572 2204 3090 3416 2302 1556 583 -620
975 -620 -1161 -581 -902 -960 -1185 -3450 -4265 -3712 -4192 -3667 -2595 -3151 -3415 -3219 -3444 -2906 -1545 -444 105
994 105 -140 -497 264 1019 1428 3246 4089 3631 3582 3038 2823 4055 4280 3383 3682 3306 1090 632 636 638 919
1015 919 513 -639 -1868 -3084 -3798 -3244 -3204 -3158 -3123 -3925 -4622 -4489 -3737 -2905 -1747 -1354 -1429 -862 -1068 -915
1035 -915 1101 2407 2270 2995 3424 2513 3404 3895 4230 4832 4343 3296 2375 1961 1663 2112 2164 1391 603
1054 603 -1076 -1851 -2255 -2880 -2559 -2345 -3501 -4256 -4315 -4763 -3957 -3055 -2426 -1741 -2156 -2766 -2078 -1585 -527
1073 -527 1423 1499 1460 2174 1389 1891 3570 3702 4224 4890 3059 2497 2776 1761 2610 3501 2001 1381 750
1092 750 -1568 -1010 -446 -1857 -704 -1807 -3658 -3166 -3374 -4307 -2149 -2123 -2947 -2308 -3112 -3574 -1814 -1583
1110 -1583 -826 1218 113 -310 1033 278 1614 3359 2610 3173 3569 1502 2267 3131 2359 3733 3379
1127 3379 1388 1674 972 -399 1103 718 -513 138 -1606 -2811 -1930 -2601 -2541 -1102 -2602 -3518 -2689
1144 -2689 -4250 -3355 -1198 -2329 -1072 -681 -2481 -1287 -367 -688 1241 2167 421 2138 1746 691
1160 691 3581 3390 2594 3953 3185 1160 2486 1486 1278 3071 1374 253 848 -932 -1487 -70 -1477
1177 -1477 -1651 -1028 -3136 -3434 -2806 -4324 -2296 -1241 -2937 -1910 -1970 -3575 -1625 -810 -1129 721 600
1194 600 -612 1329 988 918 3450 2949 2774 3818 2005 2142 3531 2045 2979 3523 1250 1387 1492 -510
1212 -510 347 666 -1092 -315 -1523 -3698 -2292 -3139 -3715 -1467 -2413 -3855 -2276 -3561 -3479 -1004 -1766
1229 -1766 -1469 440 -954 -911 1193 452 1832 3747 1819 2337 3161 1693 2428 3663 2600 3567 3145
1246 3145 812 1635 1577 364 1556 603 -872 -276 -2189 -3035 -1524 -2116 -2311 -1608 -3225 -3199 -2699 -3541
1264 -3541 -2364 -1040 -2089 -972 -801 -2269 -837 652 235 1953 2267 721 1938 1820 1869 3156
1280 3156 2791 2631 3382 1547 1297 2288 1323 1534 2393 384 -70 -190 -1457 -954 -483 -1824 -1110 -1539
1298 -1539 -3259 -2680 -2288 -2893 -1399 -1627 -2337 -1477 -2019 -2248 -119 206 -8 939 155 147 994 814 1678
1317 1678 2946 2186 1863 2214 1336 1670 2490 2138 2523 1266 494 806 38 -131 592 307 -504 -678 -1654
1336 -1654 -2014 -1582 -2058 -1547 -1020 -2012 -2492 -2274 -2246 -1630 -899 -1106 34 -642 -1352 -353 188 215 1622 1600
1356 1600 1209 1505 1054 1660 2410 2264 2284 2763 1459 636 1326 1271 1225 1658 608 114 -369 -1460 -1013 -859
1376 -859 -1244 -1412 -1801 -2483 -2532 -2724 -2567 -1181 -1219 -1851 -1334 -1281 -1722 -805 -156 1024 717 246 951 961 1044
1397 1044 2074 2527 2336 2287 1850 1491 1602 1566 1945 2539 1279 689 117 -579 -489 -218 -740 -826 -1309 -2330
1417 -2330 -2393 -2114 -2629 -1744 -1374 -1809 -1767 -1872 -2154 -1043 -566 -484 231 152 29 603 1045 1132 2278 2113 2092
1438 2092 1787 1182 1202 1909 1734 1990 1837 998 626 452 52 413 746 -431 -503 -1081 -1771 -1428 -1613 -1495
1458 -1495 -1290 -1869 -2293 -1714 -2212 -1454 -733 -714 -604 -275 -980 -339 267 105 1144 1482 738 1000 1150 710
1478 710 1568 1889 1773 1968 1176 297 633 733 454 966 205 109 -156 -737 -820 -329 -883 -640 -594 -1583 -1552
1499 -1552 -1275 -1229 -587 -500 -837 -741 -1042 -1264 -681 -233 70 320 219 44 236 343 943 1504 1316 1224 1184
1520 1184 487 738 1194 1313 1628 1455 656 341 312 -180 147 248 -117 -219 -901 -1611 -894 -978 -1239 -748
1540 -748 -882 -1531 -1414 -1548 -1468 -506 -625 -387 -139 -778 -785 -262 53 894 1255 743 777 704 505 1358 1710 1341
1562 1341 1622 1390 969 550 1009 594 795 486 188 -190 -765 -872 -678 -443 -849 -1096 -1189 -1223 -1731 -1548
1582 -1548 -1289 -767 -795 -964 -1046 -942 -499 -136 177 459 530 470 548 665 926 1473 1596 1656 1406 884 862 1009
1604 1009 934 948 942 597 -84 -339 -458 -440 -513 -191 -560 -850 -1306 -1729 -1457 -842 -824 -794 -891 -1129 -836 -795 -257
1627 -257 77 -89 119 317 -295 163 671 911 1177 1260 850 613 406 534 808 1200 943 469 327 97
1647 97 97 -78 237 100 -287 -837 -709 -928 -1019 -464 -119 -306 -541 -883 -836 -755 -374 -257 -202 8 -733 -453
1669 -453 1 -99 434 745 832 416 348 264 479 590 884 894 290 32 232 126 378 795 342 336 -101 -533
1691 -533 -135 -104 -156 221 -116 -460 -327 -852 -676 -582 -220 -439 -33 -686 -893 -591 -687 -14 224 203 -90 13
1713 13 -466 368 561 280 627 784 -26 490 499 462 1279 965 582 679 138 -209 130 365 547 317 -266 -633
1735 -633 -195 -724 -749 -347 -403 -621 -504 -1224 -888 -290 -400 -194 203 -447 -289 -107 -241 607 662 592 269
1756 269 474 338 447 711 993 1168 1100 365 423 49 240 309 246 328 0 -493 -748 -527 -874 -489 -414 -805
1778 -805 -735 -873 -1197 -561 20 -267 -220 -236 -559 -39 -201 134 900 547 234 294 340 128 682 855 658 919
1800 919 379 11 306 10 -4 958 131 -265 -241 -726 -419 -422 -570 -208 -287 -834 -974 -534 -547 -166 -25 -534
1822 -534 -3 -149 -625 294 42 247 827 137 134 173 345 320 979 446 523 538 -511 -118 631 317 497 493
1844 493 -125 99 -415 -628 556 124 -182 21 -307 -667 -249 -457 -276 422 -141 -417 -104 -708 -469 276
1864 276 -115 89 95 -610 -320 60 -113 588 644 -126 99 147 -357 384 370 223 454 171 -64 240 297 133
1886 133 775 156 21 357 -273 4 529 -83 325 421 -631 -340 -516 -612 177 23 -304 113 -88 -860
1906 -860 -120 74 -338 76 31 -174 216 -139 -144 666 392 298 767 -31 -44 536 257 543 795 79 68 136
1928 136 -276 145 332 94 105 -203 -800 -339 -45 -655 88 -227 -726 -197 -664 -573 -185 -401 11 426 -329
1949 -329 -79 193 -111 647 956 200 549 378 -192 532 520 417 503 484 -71 36 -197 -381 138 -90 -366
1970 -366 -433 -634 -923 -152 -564 -270 -46 -433 -636 -431 -610 -238 418 -245 121 85 -279 357 335 259 642
1991 642 543 109 463 14 63 430 600 291 489 -19 -343 111 -49 97 295 -105 -215 -283 -556 -357 133
2012 133 -200 -103 -214 -638 -165 -192 -204 404 262 131 63 -55 -203 61 394 371 392 35 -83 176 -317 240
2034 240 512 302 370 -20 -358 -22 284 194 229 107 -400 26 -135 -302 625 -102 -234 -34 -117 -621 8
2055 8 156 -49 252 -34 -385 24 -158 47 603 286 67 112 -438 -167 310 -164 279 356 323 -78 -167 -187
2077 -187 388 282 189 14 145 -84 -26 116 248 402 339 -206 -73 -442 -310 235 -119 -115 -538 -415 -323 -119
2099 -119 -311 104 283 -302 10 -270 -415 38 273 189 676 4 -227 269 -24 220 444 467 83 244 -188
2120 -188 -43 68 9 38 115 -235 -124 -279 -536 -260 -14 -98 -221 -684 -323 -340 -49 -274 36 -122 -157 -292
2142 -292 -153 156 523 200 277 625 34 132 -9 407 435 280 129 154 19 -17 -9 117 14 120 153 -701 -161
2165 -161 -359 -298 -4 -398 -242 -408 -688 -478 -59 -48 223 37 -115 -169 2 144 527 564 501 234 241 -101
2187 -101 160 495 426 409 71 81 278 119 22 302 128 174 -482 -318 -404 -135 -174 -130 206 -440 -332 -443 -315
2210 -315 -201 176 363 -13 -111 -161 -82 73 613 333 537 278 13 202 -45 372 514 615 386 -94 -28
2231 -28 -12 -76 -43 93 -69 -146 -405 -487 -38 -204 -323 -30 -224 -233 -147 -278 -163 -334 80 44 110 -280 -18 48
2255 48 112 256 301 127 96 469 -127 223 282 199 163 202 143 24 86 38 439 192 59 27 27 87 129 -31 -78 34
2281 34 -114 -561 -492 -183 -244 -45 -286 -361 -318 -301 -132 100 -80 -56 -86 -556 -351 -20 155 181 29 105 253
2304 253 -134 155 330 375 423 460 356 405 111 64 154 419 156 -47 -106 -493 -559 -272 -55 -261 -206 -627 -329
2327 -329 -529 -473 -247 -16 -249 -242 -375 -571 -403 21 112 276 361 261 76 211 461 637 420 448 573 206
2349 206 -72 298 455 343 413 -61 -307 -202 -192 -7 -184 -364 -336 -344 -576 -539 -432 -356 -351 -104 -405 -490 -333
2372 -333 -357 -24 31 163 490 469 152 138 269 332 670 522 227 368 48 477 461 364 152 405 -189 -363
2394 -363 -37 -122 50 134 -408 -198 -467 -499 -491 -404 -207 -422 -265 -222 -391 -188 -194 17 294 -121 151 -42 271
2417 271 298 362 550 600 218 163 275 183 203 595 153 332 -7 45 58 494 -114 -175 -360 -351 -213 -400 -316 -39
2441 -39 -39 -330 -177 -484 -344 -106 -88 -75 84 -240 -199 -41 -107 -262 143 96 215 217 124 64 247 49 380 178
2465 178 314 352 219 216 155 305 149 304 -205 -274 66 11 -63 -18 -90 -296 -178 -421 -357 -83 -157 -187 -148 -526
2489 -526 -471 -493 -356 252 -59 -232 29 -187 -215 194 -24 379 396 93 267 377 83 507 530 569 297 120
2511 120 -61 114 112 25 71 38 -157 -341 -482 -492 -140 -228 -411 -154 -89 -443 -560 -395 -285 -184 -270 -206 174
2534 174 99 -159 155 -24 201 264 76 92 671 455 595 565 420 390 379 417 -45 112 -36 -100 27 -324 -628
2557 -628 -521 -531 -218 -283 -256 -544 -455 -363 -350 -330 -41 16 -262 -393 210 -169 235 264 465 270 273 296 114 618
2581 618 386 465 78 200 100 108 291 -6 215 227 -145 6 -410 -276 -174 -328 -15 -28 -886 -442 -345 -471
2603 -471 -351 43 -95 -124 86 -359 229 93 175 -2 169 35 243 192 202 316 411 262 -78 41 153 368
2625 368 255 139 76 503 146 -135 50 -113 67 -61 -276 -232 -305 -371 -88 -149 -247 -192 -175 -251 -86 -261 -381
2648 -381 152 -96 6 -126 -210 -99 156 218 219 135 257 91 -39 340 473 561 199 379 169 27 180 428
2670 428 294 131 237 284 -238 120 -115 -68 -297 -268 -351 -683 -342 -437 -55 -472 -316 -116 -425 -239 -353 -248
2692 -248 -106 279 219 -55 75 368 183 146 539 336 298 149 406 190 76 342 322 106 102 -259 -50 -121
2714 -121 130 -52 -396 -244 -219 -347 -226 -323 -364 -74 -130 -343 -178 -124 -237 64 124 10 22 121 54 456 279
2737 279 472 398 342 384 25 476 502 347 414 357 129 -270 -159 278 281 268 -318 -80 -578 -147 -326 -129 -180
2760 -180 -665 -333 -325 -328 -378 22 -97 -74 -95 -157 -76 86 -76 310 178 209 259 39 65 208 627 -7 487 277
2784 277 401 11 -155 55 76 -126 -5 -69 -32 -303 -133 -416 -143 23 -300 -261 54 -171 -137 -26 120 74
2806 74 -76 -261 -48 -119 259 56 262 259 142 111 164 247 197 237 106 374 -91 286 463 254 -106 -104 104 -312
2830 -312 154 46 -47 -64 -151 55 -146 -9 167 -156 -59 -56 -176 -258 -520 -218 -76 162 22 -234 -83 -141 -58
2853 -58 294 177 182 236 81 108 160 398 142 207 225 157 116 -36 344 160 219 181 -14 -48 122 33 86 87 189 -14
2879 -14 -323 -238 -663 -233 -27 -253 -193 -330 -152 -235 -347 89 70 147 297 325 -67 12 198 260 199 310 340 145
2903 145 -70 64 93 152 226 87 197 -119 -121 85 -117 119 -245 -25 -344 -201 -263 -327 -285 -157 -373 -228 -11
2926 -11 -180 -146 -118 93 201 71 2 177 -21 185 262 273 218 -79 1 18 180 20 107 -14 67 -125 -11 46
2950 46 67 -34 -300 -288 -264 -324 -165 -51 -104 -258 6 83 77 -178 -183 -34 -28 303 -67 3 86 308 236 255 302 116
2976 116 63 5 206 141 102 115 -44 8 17 -209 -64 116 -58 24 99 -134 -11 -66 -90 -41 -211 0 379 87
3000 87 -155 -99 -31 214 109 -108 -22 16 -116 306 172 -34 231 -125 -22 -267 101 159 170 247 -104 251 -160
3023 -160 -129 36 -28 -79 21 -228 110 -7 294 -211 292 -128 -110 1 -115 -178 10 72 41 -102 78 -180
3045 -180 -273 -77 -11 -283 -198 123 -237 115 -98 115 -51 204 -93 -37 -121 194 488 357 -19 21 -39 213
3067 213 -139 302 -8 59 -7 -274 -328 -110 -256 -33 187 -348 259 -302 -443 -74 -120 -313 150 14 265
3088 265 71 9 3 186 120 226 81 40 60 382 214 317 260 40 21 125 -148 178 -86 -41 -25 -169 118
3111 118 -106 -11 47 -66 -39 -269 216 -281 -134 209 -205 109 270 28 186 207 -167 55 25 -99 117 112
3133 112 22 499 278 -132 -97 120 102 7 192 94 13 -87 -109 -119 -197 -49 85 -291 -182 -3 -228 -249 26
3156 26 4 -154 161 60 -264 -179 -256 2 60 126 203 125 -63 260 -167 234 -55 18 73 137 -235 90 -26 -82
3180 -82 -77 235 -63 127 -417 33 -101 23 -6 141 -3 53 -117 -29 -58 63 -40 69 -262 -31 -67 9 -174
3203 -174 -243 65 -279 -48 -136 58 39 166 127 -85 -212 -89 -16 157 187 231 -1 -33 80 138 63 48 -30 244
3227 244 110 121 57 -34 85 -25 204 -49 -89 67 57 -125 -107 119 -146 91 -86 64 15 232 204 -49 34
3250 34 -28 -63 -126 137 271 74 -75 197 -19 -39 165 -64 70 -47 53 261 -59 147 -31 215 -100 33
3272 33 37 -291 -115 -235 -23 28 64 -97 57 33 -1 321 95 -189 74 -207 21 161 311 187 147 242 -353
3295 -353 -50 92 39 4 94 -20 -116 -10 -34 162 -163 21 6 -53 -263 -77 -240 -194 35 62 -81 -221 -164
3318 -164 -237 222 175 70 57 231 63 194 -40 152 111 270 241 101 17 222 128 -118 -84 75 -255 -42 -342
3341 -342 18 26 -16 -202 -134 -15 -186 130 46 329 116 23 -57 2 -19 21 81 231 -164 21 36 -76 128 -120
3365 -120 -177 48 185 -145 -109 30 278 -18 162 53 -19 145 156 -6 -212 7 -224 -80 -69 -211 -74 -91
3387 -91 51 87 530 1 89 -58 -50 -65 163 9 189 312 -100 -117 -81 -54 66 88 79 16 -71 185 48 63 -90
3412 -90 59 26 84 -70 42 -92 -135 -251 86 241 127 61 95 -205 -13 -45 -32 209 -10 -42 -12 149 274
3435 274 0 9 -58 8 -304 -70 15 202 -97 196 -29 -123 204 -77 -66 67 54 149 -7 12 -58 106 -78 139
3459 139 179 -94 223 -145 -106 -20 45 93 -83 20 -82 -161 -67 -114 -518 -77 149 97 -185 -223 149 -57 171
3482 171 90 52 133 27 193 113 192 26 151 35 84 149 75 109 -84 -58 -12 49 -92 23 -355 -177 -167 176
3506 176 88 145 -47 14 -53 -140 46 32 -133 229 121 258 -79 105 61 76 172 -176 6 106 433 -88 43
3529 43 116 -54 -151 9 -211 -169 -14 -3 90 69 -97 -322 51 -65 -162 100 6 6 278 62 38 -142 88 172
3553 172 -178 31 28 21 273 -32 151 206 31 -143 -121 -76 61 49 -41 302 -109 -50 -8 120 -154 -221 -191 -315
3577 -315 202 35 -73 -167 37 -12 -211 -204 101 245 26 98 170 -114 79 -43 78 23 64 0 -163 -248 85
3600 85 82 64 23 157 -49 148 61 -107 131 14 -74 -152 -43 -166 277 -21 -33 296 109 -78 -2 -115 -46 -29
3624 -29 229 -9 46 -48 5 -169 190 -161 -30 170 -59 -44 -183 -1 105 234 -42 57 -293 27 79 86 31
3647 31 -31 47 88 -255 94 131 -185 205 38 -145 -87 26 -177 164 156 -19 105 6 -281 248 -96 34 -173
3670 -173 71 191 38 -269 18 188 -1 112 139 193 -16 166 398 183 129 44 -29 -19 306 61 -93 -54
3692 -54 -2 -134 64 74 216 -18 -28 -29 64 -122 -63 -43 196 -28 174 -9 -254 -118 -2 12 3 -44 40 66 60 111
3718 111 133 189 160 98 -136 197 13 207 -224 173 -89 -38 -200 54 -294 -14 186 19 105 36 -159 -11
3740 -11 -36 -48 -258 2 81 -117 -243 -33 -154 -157 128 14 -8 79 -98 176 -21 71 43 97 132 -320 38 -279
3764 -279 132 -86 35 78 -10 -21 -60 -162 99 -93 -76 16 -199 -306 87 166 156 211 -87 304 72 -205 -107
3787 -107 212 -80 97 8 9 -13 -137 90 -126 31 327 -130 -17 191 -38 26 124 261 -222 -68 61 -185
3809 -185 -143 87 -61 -96 115 20 -143 145 -7 -6 132 -10 -21 -79 92 -127 -98 315 35 -56 -103 134 5
3832 5 51 -246 -55 -40 24 41 51 109 139 -302 130 -102 -72 199 -18 211 3 44 0 -93 35 28 -36 -79 27 183
3858 183 49 -26 -39 -388 -205 -214 82 -13 -32 -52 14 21 182 -45 58 -178 87 159 172 -30 270 -21 167 -39
3882 -39 77 428 193 -52 21 -118 -148 128 -186 43 -198 44 -201 37 -38 -45 -111 137 -139 122 -93 177
3904 177 128 10 -147 196 -8 -91 229 1 205 -67 88 -241 -13 135 -45 5 226 183 69 -89 352
3925 352 356 -43 4 -68 -38 -154 -28 -172 68 52 7 141 3 89 154 247 68 -16 -44 -92 -307 -37 -7 -139 108
3950 108 170 176 31 96 -70 26 28 -355 88 198 -35 123 -190 -103 -196 30 -131 -9 -38 97 -36 -165 237
3973 237 77 -145 82 45 -100 87 0 -148 437 215 78 -45 44 -246 -78 94 -6 -28 223 55 -162
3994 -162 -42 41 -24 59 20 -16 33 16 205 65 -88 19 20 -17 -206 129 -68 92 -21 34 -69 52 16 180
4018 180 5 311 -115 -101 26 -132 120 -48 -141 -193 -184 -23 144 156 -197 -183 -31 -290 47 -68 62 -217
4040 -217 65 32 120 -232 101 -73 51 -57 163 -30 24 67 88 129 -252 47 31 45 -271 -190 -6 -96 168
4063 168 93 -366 -428 28 192 -141 76 -44 206 -71 286 -55 63 299 102 115 219 164 161 -78 35 147
4085 147 265 142 -95 -66 -275 -11 68 118 -10 46 -11 -200 -52 -66 2 -263 -28 204 6 406 -152 139
4107 139 378 198 -99 -148 75 -163 145 48 -131 -126 43 -247 -179 -71 -167 142 -182 -193 -450 100 -16 -270
4129 -270 -137 185 11 284 54 -47 -64 -37 -155 -98 7 -22 195 -4 203 -108 -17 63 -24 -40 -150 64 97
4152 97 -95 26 -226 -147 111 0 -124 -61 49 13 40 -189 86 67 -225 158 167 44 -141 293 160 -40 -121
4175 -121 -122 133 56 51 62 78 137 -213 -14 -108 -103 47 109 -9 -103 -136 49 -62 -127 35 -130 -145 -79 73 28 -63
4201 -63 141 137 370 36 -91 221 171 203 190 -144 146 -63 -69 -39 103 -114 -95 -143 -69 -80 -196 29 -49 -225 146
4226 146 -5 269 15 -26 182 152 -50 15 24 -58 -72 211 -97 -47 192 -279 -73 -305 38 -98 284 127 259
4249 259 125 -196 -31 90 -199 -226 -144 -1 -76 -280 -68 101 36 -52 -144 -15 63 -55 -35 201 31 -213 348
4272 348 160 15 -69 -123 -76 30 -234 123 23 41 -141 -16 23 25 -93 -23 137 -78 -247 -83 -122 -404 4
4295 4 -181 -177 -322 54 -49 -248 -88 36 -41 55 192 456 140 93 -127 173 69 307 -99 -315 -9 -201
4317 -201 30 73 -11 -199 271 -116 -32 -153 -1 180 -82 26 13 -78 270 -145 9 149 75 -144 -112 -151 -12
4340 -12 95 -55 119 -209 257 58 -177 240 -202 -31 -33 124 -16 -247 -36 217 -58 -64 7 333 205 -145
4362 -145 180 99 -63 -12 53 5 -249 5 86 -47 11 59 -215 110 209 50 -54 228 185 -13 28 -92 -53 -240
4386 -240 0 -115 -293 -33 -135 -64 -15 9 -2 -219 65 129 61 -3 52 245 66 -60 -191 49 -79 -2 239
4409 239 -117 -212 -70 -65 62 207 411 31 -122 58 41 129 -148 7 26 -267 -14 124 -273 -10 127 39
4431 39 -113 -102 -99 -204 223 183 76 285 84 -84 -143 40 -82 -25 19 225 232 247 -14 -10 33 -2 148 -111 8
4456 8 -137 92 -68 -439 33 -66 -196 -115 -125 145 -109 -175 -1 99 -32 -169 32 -93 22 -127 -67 -165 92
4479 92 -65 98 52 -393 -249 -299 42 118 125 12 19 -48 -193 -46 182 -227 -13 -113 -74 -208 240 62 81 -1
4503 -1 -50 35 72 -97 -19 -20 36 -94 9 190 -311 -8 -70 10 -202 -229 157 -251 -32 -79 107 -8 -160 -157 165
4528 165 -36 -223 136 76 334 239 157 -350 216 -131 -212 -38 -90 258 -70 120 155 -14 33 21 -101 -86 -4
4551 -4 208 197 24 97 59 45 66 -12 144 49 33 -32 -5 23 -205 -238 121 18 -3 105 13 -21 -168 49 -122 235
4577 235 -76 -177 -191 -209 -35 -75 0 202 -39 -141 -66 -137 70 250 305 -7 -206 213 -51 179 -85 -138 -30
4600 -30 70 14 43 32 270 69 141 -73 -145 282 -20 -59 -100 -141 -14 -76 13 177 109 45 -125 69 50 -159 -84
4625 -84 -50 -76 31 -73 -195 -268 14 -240 66 36 -111 -289 83 46 196 -85 -33 -292 -229 116 -46 140 -76
4648 -76 -151 -210 -2 -226 136 -150 235 -212 177 207 157 -211 -163 -57 244 -4 3 -45 140 -39 -52 -150 -76 47
4672 47 -130 -69 -130 6 -96 35 119 -16 176 -345 -143 268 -251 106 -249 -330 9 -43 -88 169 -86 -52 27
4695 27 170 159 79 71 -262 -98 98 -54 75 -77 56 159 -75 -42 88 -53 -139 88 -73 -181 -34 155
4717 155 -34 14 -12 112 98 10 -206 135 -125 -81 95 24 -200 -117 -9 159 -5 163 28 76 126 161 117 152
4741 152 -103 -259 -81 127 81 -26 -82 -57 2 199 -610 15 -193 -46 -20 179 -100 -259 176 83 31 244
4763 244 -99 -311 190 77 78 -120 -49 -116 121 236 201 0 -72 -178 -147 -221 66 35 -61 -251 212 0 12 243
4787 243 -140 38 -7 19 97 47 27 -85 17 -9 -52 31 -52 80 -36 -76 -205 -60 -101 -142 37 -28 100 -156
4811 -156 -76 -20 -97 101 -212 96 158 -204 33 353 -244 -8 -20 190 76 -55 190 100 72 49 -26 180 40
4834 40 276 222 12 164 -195 141 -30 -73 -128 -84 -192 197 210 -83 -21 -131 -45 139 2 44 -76 -5 -147
4857 -147 94 39 -93 78 -5 -42 98 239 49 114 54 -75 -98 -119 -26 -99 -36 -196 -193 -34 -29 -223 -120 -105 112
4882 112 125 -127 -48 86 10 -485 -175 -22 4 -108 46 -68 -71 -55 -204 46 -165 -32 60 284 -128 -238 -89
4905 -89 142 216 12 173 255 141 232 -172 -171 57 -49 -31 44 67 3 26 125 263 -91 -89 132 -78 169 118 44
4930 44 61 67 -97 24 -80 173 75 116 -14 -157 212 -131 -154 -252 64 -183 90 22 127 30 61 60 -205 186
4954 186 -22 303 340 66 157 93 -192 36 130 17 100 -148 126 -82 -182 -78 107 -102 -124 -174 -114 -81 39
4977 39 -150 15 -190 -81 91 123 -68 -121 -8 143 219 200 176 223 101 119 223 112 -152 -172 26 -28 120
5000 120 280 -107 -37 -259 -358 72 -195 -62 -120 -79 16 1 -127 -215 3 61 19 117 -58 185 -65 191 95 51
5024 51 -86 -117 -265 181 247 16 117 233 239 -19 -364 29 -357 104 8 78 141 121 -322 -52 121 -163 -173
5047 -173 -271 -154 53 -91 57 -36 -137 -121 -168 -113 43 51 -103 -186 164 -295 -296 19 14 159 139 141 -81 225 27
5072 27 340 175 132 -119 -92 197 -72 -152 -137 21 237 -74 215 -63 -181 88 -163 -7 24 -100 108 -216
5094 -216 -47 -20 -142 225 -125 -12 29 -147 -99 80 294 -28 -305 179 41 54 -64 87 54 -72 53 -12
5116 -12 276 140 16 128 130 -224 173 -180 -93 173 61 261 -123 134 115 25 -107 64 280 -159 -158 222 12
5139 12 -87 -51 117 293 159 22 57 8 -13 171 -127 119 -45 189 -138 77 170 68 74 -80 426 53 -113
5162 -113 58 166 72 161 130 30 16 -202 45 102 -154 138 -290 106 173 -95 -60 71 62 -120 -59 69 -72
5185 -72 -97 37 -96 197 166 347 362 261 238 -75 241 -36 -97 -152 -79 47 -98 -117 3 -210 51 31 -132
5208 -132 -198 142 -261 -103 -213 -105 23 -72 -194 170 297 -201 224 -35 -110 107 16 -201 119 132 74 100
5230 100 26 140 249 -11 -47 181 72 106 83 37 112 -79 59 -126 28 -35 35 -73 32 89 48 -94 -3 -39
5254 -39 -134 37 84 -86 -23 -112 30 -104 158 -91 144 -140 -168 77 0 45 -74 -29 150 178 -35 -49 5 34
5278 34 -38 254 154 29 89 -198 -150 -191 73 74 37 185 109 126 -24 -100 133 94 -70 -20 -186 -95 18 -2 163
5303 163 28 3 -82 170 8 75 30 -41 26 -154 192 35 -52 179 146 117 193 22 -20 12 140 236 124 -287
5327 -287 22 47 46 82 -19 -25 73 262 33 -159 -36 -115 76 -161 52 -52 -40 204 -249 330 127 20 297
5350 297 -97 131 -201 -149 -183 242 293 -33 76 -165 -201 -109 104 -33 -181 57 -129 -232 29 -189 127 120
5372 120 41 55 228 -32 74 -77 117 181 0 246 181 115 -128 176 78 -74 -55 82 -145 27 17 62 67 43
5396 43 79 12 -75 -160 33 136 27 -21 -131 76 159 16 140 -62 30 -99 -40 289 -39 -119 -103 -89 -271 -284
5420 -284 191 117 -52 -85 91 27 146 81 -89 -210 -150 -4 -86 -55 -236 259 32 -47 -70 -34 20 -42 -7 -306
5444 -306 204 -4 -55 90 -203 92 -160 52 176 116 -54 -178 -85 -62 -140 -19 193 -68 129 -43 -17 -29
5466 -29 38 60 141 -72 301 -24 113 -354 -174 88 -105 -170 175 87 -73 -80 -132 138 215 -89 24 57 113 67
5490 67 -87 72 -259 70 -152 10 -4 -74 -51 -39 17 -126 -74 272 120 -147 -109 74 -29 -135 82 -11 72
5513 72 118 39 -32 -85 244 0 -20 -134 116 -197 45 75 -36 -61 -283 -246 -13 -59 204 -181 -154 -62 -78 79
5537 79 266 -65 299 93 126 13 228 -55 -97 121 84 -163 55 386 -172 122 70 -80 -223 124 105 255
5559 255 -17 -27 57 123 320 -202 227 -67 -36 -232 131 111 -44 -29 -22 -30 -308 102 117 170 58 195 102 137 362
5584 362 40 -124 62 15 289 -247 -151 6 -161 -19 -30 51 12 39 -129 -191 171 -303 -51 245 -79 219
5606 219 59 149 97 -101 58 -156 -90 80 -47 159 98 -25 -3 47 -158 -90 -56 -25 391 129 -52 -217 36
5629 36 57 -307 -67 -48 203 2 55 119 -87 -227 88 53 -145 -177 175 268 159 36 -52 187 -43 131 245
5652 245 -147 -36 -14 -191 -67 25 -207 73 -28 -41 -101 108 70 269 176 11 79 97 -4 44 -110 -222 -284
5675 -284 103 9 126 17 30 44 -33 114 49 120 -240 -22 197 -134 -279 150 144 -57 -47 63 16 -25 18 22 -191
5700 -191 -182 78 -143 92 -114 -73 -73 -189 113 3 52 210 -121 -194 58 126 19 -87 -104 1 265 131 130 126
5724 126 34 -117 161 -65 -104 -29 -175 140 45 -66 350 60 121 184 73 -137 58 79 -20 112 -80 39 -169
5747 -169 -118 127 -107 167 87 -195 103 196 -236 158 -221 -65 75 -17 -272 -133 143 19 125 8 217
5768 217 -77 -202 -119 -94 82 -39 -26 -14 -255 -63 53 -11 107 231 -359 6 -128 -83 -69 165 -21 -9 -172
5791 -172 11 33 -179 116 -260 15 -24 58 -2 275 237 -33 -66 151 -7 73 54 -64 108 -9 -40 25 173
5814 173 -53 12 2 -132 -318 5 -109 -208 -7 -94 -156 -53 -254 258 16 -8 51 210 34 -162 373 -141
5836 -141 43 70 -275 68 20 158 183 -14 -113 51 201 99 -68 145 -102 112 34 -116 111 72 39 -119
5858 -119 156 -12 10 -60 19 -15 -7 147 -55 -113 7 129 88 65 172 -145 55 13 27 -182 -175 -26 24 -40 123
5883 123 140 -103 -22 15 122 -124 251 22 60 6 -72 48 145 -4 -114 57 -151 -185 -237 215 39 -46 167
5906 167 61 -149 -36 54 -198 202 -115 -366 115 108 166 44 -44 10 -300 36 210 -11 81 96 45 116 130 -122
5930 -122 66 154 -24 300 -124 52 -359 8 14 -43 35 167 -54 -231 -24 37 -204 256 350 -198 -217 61 -60
5953 -60 -46 -125 78 -144 169 51 44 167 -134 79 200 86 68 -83 -50 -47 -7 -102 252 273 -21 174 269 0
5977 0 70 179 127 48 -319 -175 -264 -174 -31 147 2 64 -27 117 -23 -98 -27 146 -135 -45 44 -177 -216 28 133
6002 133 154 -17 -15 196 7 -146 -110 -167 -237 112 -10 88 -50 30 -44 -106 -228 -4 46 -4 -10 8 -114 -69 320
6027 320 231 162 79 -44 153 -91 85 105 38 -175 89 -19 8 174 -363 151 21 26 19 183 -230 84 -392
6050 -392 9 38 2 241 -313 7 -90 62 61 239 -12 -241 -29 -171 -96 29 63 -2 -209 -131 107 146 -52
6073 -52 -48 -197 -69 -37 -35 -19 451 27 -333 -92 73 27 2 36 51 163 -169 100 -53 -184 -86 269 36 191
6097 191 -158 -232 116 89 -51 52 135 89 -126 -227 29 85 10 146 -278 -245 -253 21 187 218 -84 -115 -98 -117
6121 -117 -275 52 5 -110 -11 -20 -104 57 -98 -54 205 -156 98 122 142 -116 159 -79 -32 286 83 -88 200
6144 200 -158 -13 -261 -31 85 -8 -250 83 -65 -81 56 89 -14 -104 63 71 49 302 -35 252 -40 -74 22
6167 22 330 322 359 -90 54 -148 -18 94 -78 247 -145 -207 68 -43 42 74 227 -258 -210 -141 -85 -253 -103
6190 -103 273 -162 12 74 -49 117 5 262 33 174 82 -161 -259 -209 -111 -26 -182 274 -6 152 -161 -152 96
6213 96 -159 44 -85 71 -128 -29 314 162 139 -30 148 28 -73 15 180 273 -47 52 189 10 -150 179
6235 179 -144 -101 -2 149 48 -131 -62 162 -460 11 -68 49 -17 346 58 42 207 115 78 -4 125 49 138 -321
6259 -321 -32 96 129 73 101 -49 69 -14 102 -18 -40 -24 255 -247 -91 -69 -150 42 -51 8 -84 11 0 64 134
6284 134 60 113 -113 97 168 268 116 -247 -30 -23 -52 -40 -173 -174 -227 78 203 2 -38 63 -137 -14 -44 -136
6308 -136 -137 264 66 -223 82 139 -211 98 83 71 -30 -7 -62 -74 -74 -83 -32 8 -98 95 142 -46 -12 -24 230 41
6334 41 -16 288 135 136 -213 -97 -51 271 58 -139 -102 -218 58 -281 58 173 -117 -152 116 -173 -143 -88 -142
6357 -142 -42 18 175 -80 14 194 116 189 118 255 -235 19 -230 -9 77 -271 262 -59 -38 81 -243 -244 -15
6380 -15 -275 64 -158 145 -100 292 -74 -167 -53 71 -4 -126 -60 256 157 -87 -29 -233 -118 1 -23 -116 -45
6403 -45 -239 -51 48 -3 189 -113 71 -95 145 -116 -84 185 -212 117 -130 -22 147 11 -119 -3 -122
6424 -122 44 -168 157 -128 -283 217 225 26 137 -65 125 52 193 113 34 174 -69 -39 -53 208 -71 -81 -193
6447 -193 90 -267 -28 67 85 -53 20 96 100 -17 141 -169 56 -342 -46 119 -223 81 -22 34 69 -46 216
6470 216 -216 -260 -190 -124 0 -35 200 -119 194 87 -78 -41 -30 45 52 143 277 145 -203 147 161 11 93 222
6494 222 112 -143 20 -169 17 -140 122 -60 -134 -68 -67 -17 166 17 -203 -237 98 -240 -77 12 82 -46 36
6517 36 -76 11 11 -215 157 21 -19 170 296 138 237 367 97 -329 159 -59 -125 4 61 -320 222 -180 232
6540 232 45 -127 204 64 -182 -38 -276 190 89 137 -139 -50 -155 10 -21 -263 -80 42 -174 -79 8 -68
6562 -68 292 -53 227 -67 -246 -60 65 5 -20 26 -144 -132 0 -76 -157 -263 -37 -102 33 73 51 -135 162
6585 162 -109 -95 -33 -73 -97 -134 -114 -46 34 262 -154 117 -50 104 -186 -65 160 3 -57 -97 -102 -13 79 99 -24
6610 -24 -147 -94 342 83 219 81 -28 -73 -245 85 -138 -176 82 145 82 -21 -11 100 -98 111 49 64 -65
6633 -65 -174 -27 76 22 -109 56 32 -217 146 64 159 -105 -283 137 56 100 -10 -125 71 258 -43 196
6655 196 148 -151 -66 -104 123 93 -162 -181 282 81 -55 141 211 -86 -33 7 -46 -236 86 -102 -268 -137 -43
6678 -43 -32 -101 -235 50 -88 121 -128 120 230 165 -77 7 40 -144 -195 163 157 64 -16 -72 47 -380 96 -165
6702 -165 -20 -15 92 69 63 144 -141 -143 -155 284 -26 -46 -58 -11 58 -22 -81 33 248 11 -226 -220 -78 -264 125 -115
6728 -115 -154 242 -88 44 32 -149 186 16 -183 -26 203 6 -115 -227 -34 308 -29 95 -136 126 -3
6749 -3 76 0 77 115 -14 -115 -17 1 115 197 -8 189 111 -237 78 -141 22 -64 -122 -96 134 -186 -68 43
6773 43 103 -6 -129 -25 -219 182 2 362 -50 -148 141 3 -331 128 -73 33 -120 -131 -57 -235 135 -163
6795 -163 -213 134 -231 69 -139 -165 5 -150 -128 -66 -11 -14 24 -46 32 -171 150 -184 34 85 -282 183 40 13
6819 13 102 30 -162 53 -52 232 -84 -45 -182 -158 30 -159 123 57 -152 205 10 138 200 133 36 -41 105
6842 105 -143 -252 -58 -29 58 15 13 -62 -210 -73 -77 319 49 132 -31 -74 -70 -42 -241 -92 -249 120 -7 98
6866 98 -140 141 251 18 -292 140 8 183 -36 -27 -10 -76 -23 -18 303 -156 -5 -70 -263 41 128 66 267 -59
6890 -59 -140 -233 -89 103 5 -27 66 -41 -316 73 -61 -138 161 -99 -136 -61 -120 176 -288 53 35 -105 170 195
6914 195 110 84 42 16 26 -114 -18 -44 -238 -192 -82 -212 57 -12 -359 276 -137 191 35 98 -7 -169 -17
6937 -17 19 105 -129 53 -49 -34 -2 -121 93 -83 -167 112 -40 -124 -106 -91 27 -70 26 -128 -105 -234 4 -215
6961 -215 27 -60 -81 -23 -121 -44 119 -144 -130 150 -246 -152 -28 20 -39 11 342 19 -39 -75 42 113 256 15
6985 15 -139 165 37 -7 143 -114 -267 45 138 -148 0 240 103 -111 115 -42 28 -124 103 216 -21
7006 -21 155 -188 120 -8 125 41 -22 -94 250 -136 17 -35 7 30 -316 -14 63 -215 -115 90 133 318 -181
7029 -181 -193 -152 -11 89 84 223 -152 114 -4 -42 1 -3 -184 18 169 49 -84 -49 44 47 67 46 126 126 -280 -174
7055 -174 151 -72 102 6 10 -76 34 -12 118 -62 36 131 -243 17 -128 -23 -45 -23 201 -44 36 49 49 -22 -60
7080 -60 44 -154 97 -85 -264 21 77 160 -186 -166 236 -79 -266 -301 117 -47 -61 27 -42 506 85 198 18
7103 18 -24 21 37 -112 -43 291 156 -185 122 -40 51 -56 48 27 22 -50 -103 26 -158 103 -150 -103 132 156
7127 156 -59 -446 -96 -36 -12 108 124 161 89 95 -76 286 -145 -3 65 -16 -159 -10 169 128 134 60 -156 297
7151 297 -12 25 32 -151 -203 117 166 -73 -27 47 -144 96 160 225 5 216 184 81 -169 61 52 31 -278 89
7175 89 -86 -64 9 -174 15 24 45 50 -121 -164 268 -156 -2 -136 -84 -61 -34 175 -168 140 5 254 63 -15
7199 -15 344 3 -81 123 147 163 150 -205 70 -72 -54 -85 215 72 -70 68 -268 -234 -89 -173 15 10 101 38
7223 38 -120 -88 156 -50 -36 186 67 393 -120 -50 60 -141 109 14 -93 -32 30 -36 64 -56 -26 204 384
7246 384 -116 -75 -22 66 -1 -37 80 -61 -294 -108 45 -147 -270 63 39 222 -21 80 57 -194 202 57
7268 57 147 -96 1 298 -92 -45 -82 46 280 -78 160 -22 -59 -52 10 -113 151 86 -79 -36 5 -36 31 -101 -28
7293 -28 -135 -231 140 1 13 -22 105 -145 -64 111 32 14 -11 176 145 -51 190 163 101 112 42 134 2 -81 -173
7318 -173 -43 92 11 -29 340 -41 32 169 25 -53 -128 210 140 -169 -111 -76 -131 236 -84 69 -16 4 79 81 161
7343 161 228 102 -233 -40 -93 -1 -28 79 108 178 116 168 -160 338 91 -9 -139 70 -351 198 -80 113 138
7366 138 -20 1 83 -58 -142 26 -192 -202 -136 89 40 114 18 -34 2 44 -7 39 60 232 -31 -69 -131 -45 -88 -99
7392 -99 11 -67 119 -203 -37 130 -171 -54 30 -50 -142 160 -243 -154 -260 -17 -244 -84 -45 -194 23 8 -35
7415 -35 -39 -188 7 -202 83 -229 -109 -41 -85 84 35 -139 -177 94 -67 -115 -125 222 37 194 167 -108 185
7438 185 -147 -157 -179 62 99 31 -97 -257 127 -125 42 297 -80 206 -110 -68 118 -41 134 184 123 302
7460 302 226 -63 98 -318 76 198 -182 -104 -53 -169 22 -103 -179 -177 -188 38 -138 -65 57 53 50 -125 -209 -11
7484 -11 330 100 -43 -247 -23 28 -28 31 23 112 -27 150 -164 -180 -21 -118 -169 67 86 -89 268 -100 18 134
7508 134 -127 -6 -155 47 52 -187 84 -62 -52 153 -377 -147 7 -231 -117 185 -309 357 -111 -120 72 -59
7530 -59 -137 12 -166 99 -262 67 90 -24 -83 -222 -118 272 -32 104 -242 -27 11 -34 -107 -132 -37 40 -64
7553 -64 -29 134 -47 -16 -58 -69 52 -56 8 59 -84 -55 62 58 -14 -107 -307 -61 -32 109 131 -116 66 96 22
7578 22 20 62 -143 -139 177 36 -35 201 167 187 53 -41 -115 211 78 -32 2 -85 -17 48 181 70 158 -43 64
7603 64 146 25 -237 -72 31 84 -376 -224 32 -236 53 61 -11 41 -8 100 28 53 106 -21 -2 -32 153 -93
7627 -93 -42 190 16 -76 223 -164 -3 -208 130 36 -114 -33 -80 -161 -392 -71 71 7 -91 90 -111 -11 -101
7650 -101 53 -103 3 31 36 -147 -171 76 -89 88 266 70 73 81 -117 -80 124 -121 17 109 4 59 -32 -49
7674 -49 -25 -61 55 10 74 300 -242 278 411 -135 -183 263 15 -319 -78 -209 100 173 -13 -262 68 62 -2
7697 -2 96 69 -186 230 137 -2 -56 257 -8 133 75 -72 -4 16 8 -174 74 -86 48 201 170 -211 -230 -212 175
7722 175 343 -166 -11 147 246 -101 2 189 -44 -47 175 -109 -210 -140 -136 -107 142 94 -73 24 -104 147 -143
7745 -143 -184 -139 -12 107 43 58 -225 -22 -40 -58 38 -190 236 40 90 229 -48 173 197 194 91 46 -245 55
7769 55 -53 33 -135 231 38 182 -29 143 48 -89 113 62 -49 90 -226 -83 130 13 -50 123 285 33
7791 33 -96 -228 41 241 -107 275 -88 164 -78 -36 -145 55 3 325 -79 -67 213 66 -212 190 190 -50
7813 -50 -102 -47 -257 141 55 51 75 -83 54 0 124 169 -46 -261 153 -78 173 10 178 39 53 104 -97 -137
7837 -137 -285 -3 -99 90 51 -16 69 132 -35 -85 12 280 -60 -42 -38 12 45 129 -39 116 70 43 159 29 -117
7862 -117 0 122 26 -98 -129 130 -113 -101 22 -81 -98 -87 61 -63 45 -283 -74 103 -82 -40 -58 315
7884 315 -144 205 108 -44 153 121 -201 -5 93 160 26 -145 -52 -35 32 199 -159 -47 -176 -61 74 -293
7906 -293 187 191 -190 141 -152 33 -342 180 -56 6 -135 -75 90 -31 203 156 61 106 -49 -107 81 133 117
7929 117 53 -31 4 49 48 16 -177 -124 -76 -202 51 -82 9 -76 -158 -110 197 -100 154 125 102 126 -37 75 -261
7954 -261 10 -88 -58 -172 -83 184 194 322 96 -36 24 10 -104 -212 -6 164 -79 -1 214 -243 -142 -138 106
7977 106 109 68 -132 8 -151 35 -78 67 169 -123 178 9 118 90 -147 18 111 -291 38 319 197 -18
7999 -18 -49 92 -149 -281 213 -103 -201 137 -111 13 -199 3 -215 223 252 -204 126 -23 82 136 -19 90
8021 90 -69 -44 -188 -6 76 200 -55 98 -139 52 142 247 -5 95 -103 -153 -77 30 56 -242 -74 9 25
8044 25 238 -5 -67 -282 -20 -48 24 88 -154 -199 -265 77 38 234 -87 133 -6 -128 -147 66 -57 218 8
8067 8 169 -123 -56 -60 144 -168 -25 -151 -59 -68 27 -91 186 102 109 -76 -181 -115 20 38 -117 12 -49 -88 -92 -192
8093 -192 -85 -138 -264 -18 -109 -9 99 -173 170 -28 -145 -106 15 127 116 -187 -104 187 195 -30 -144 -6
8115 -6 569 -78 -51 2 189 -139 -54 118 89 72 100 -162 -17 -27 -145 66 -179 -149 -131 -31 -188 68 4 281
8139 281 -192 68 -47 -88 -348 300 -173 -91 17 108 29 -452 179 9 -107 176 -122 50 -285 135 80 -109
8161 -109 -1 -145 -145 -104 13 15 -91 64 162 87 -193 -266 -111 -158 63 -69 194 23 62 25 -13 319 20 1
8185 1 61 76 -55 3 40 62
8191F2
$$ Imaginary data points
##PAGE= N=2
##DATA TABLE= (X++(I..I)), XYDATA
0 0 0 0 0 0 0 0 0 0 0 0 0 -4 8 -8 8 -8 16 -16 21 -24 32 -32 40 -48 56 -64 76 -88 101 -116 132 -149 171 -195
34 -195 218 -245 272 -306 344 -384 426 -473 524 -579 640 -707 780 -860 946 -1042 1149 -1266
52 -1266 1396 -1541 1704 -1889 2100 -2342 2626 -2963 3372 -3879 4523 -5377 6564 -8326 11211
67 11211 -16726 30984 -144128 -265065 31637 -167093 -224054 -25828 -76006 -135587 -133389
78 -133389 -273913 -128762 50506 -36203 -59963 -70893 -100501 52443 35764 -50981 78346
89 78346 110802 102969 173634 22996 -14864 177117 156300 129962 190746 60802 45434 112131
101 112131 -13323 8819 122850 49659 29715 -26201 -163395 -79211 -5093 -58742 -18775
112 -18775 -88369 -181740 -76766 -97923 -167110 -62705 -68143 -87355 -11662 -98795 -124157 2784
124 2784 -11916 12160 98028 26696 37429 91707 535 38675 135152 102058 139933 124930
136 124930 -3275 37606 99377 68630 112124 81136 -7303 18040 -18012 -62689 7074 -11559
148 -11559 -48819 -16435 -87798 -124261 -57918 -84757 -86327 -34476 -81099 -81155 -38322 -90421 -81305
161 -81305 -20331 -18357 23201 37224 -21147 -5275 22432 25691 86131 93589 58833 77249 49712
174 49712 23596 77721 84567 76120 93281 34300 -2794 27478 7854 5507 28389 -14635 -26511
187 -26511 -16945 -60986 -62418 -43480 -62900 -39914 -31107 -75504 -70298 -67088 -81742 -35926 -13084
200 -13084 -27249 -5287 -17842 -43249 -4257 19185 31092 64506 43792 17523 38097 38506
212 38506 49231 81108 65746 51727 56630 31219 25565 39504 26483 26801 26709 -2765 -12730 -18382
226 -18382 -39357 -32642 -25220 -34582 -30962 -42773 -67020 -64687 -56873 -44413 -21869 -25298 -38957
239 -38957 -37207 -38847 -24564 4893 14804 19877 21727 10936 16090 30278 37648 52294 55924 42856
253 42856 41449 39375 31334 37022 38161 31641 32953 21655 2943 -4707 -14136 -17145 -7785 -12218
267 -12218 -23696 -32292 -47769 -52486 -39523 -32756 -29169 -27957 -39642 -46268 -38098 -27003 -12313
280 -12313 364 147 -2070 1940 6013 14460 26689 32865 34502 35513 33090 29798 31404 33522 34981
295 34981 38023 35202 24976 16323 7660 962 3118 4259 -1095 -8800 -22001 -32985 -30520 -26321
309 -26321 -24717 -21871 -27788 -37998 -38002 -34294 -28841 -18376 -14213 -13695 -11161 -10242 -5958 4282 10628
324 10628 15748 21548 21174 21399 23109 22182 25551 32328 32828 31613 27636 19032 14023 13554 15140 15104 9428
341 9428 -634 -8803 -15240 -16095 -13067 -13481 -16069 -22540 -29506 -29546 -27262 -25613 -20176 -18303 -21659 -18904
357 -18904 -16494 -14796 -6659 -1418 1350 8555 10738 8689 12914 15269 17585 25341 26662 24506 23881
372 23881 18835 16391 21576 21509 18914 17696 8417 275 -385 -1868 -3342 -3649 -9723 -16863 -18538 -21272
388 -21272 -22079 -18604 -18989 -21078 -20373 -21398 -21601 -18405 -15057 -11056 -5443 -2323 -1568 1549 3329 6356
404 6356 12979 17730 18780 19361 17024 15035 17913 21224 21892 22421 18703 12731 10342 8405 6871 6023
420 6023 1401 -4048 -7354 -12071 -14456 -13046 -15083 -16279 -15488 -18328 -20310 -19363 -19882 -17723 -13547 -12075
436 -12075 -9371 -7590 -6643 -3141 1474 6016 11551 12101 11549 12566 11763 14534 19728 19082 19295 19034 13254
453 13254 13073 14971 10156 9902 8881 50 -1491 -3137 -9987 -8046 -7565 -13250 -10983 -12527 -19202 -15596
469 -15596 -15678 -19097 -12596 -11710 -14947 -9374 -9861 -9658 -317 714 1919 9422 5148 3787 12109 10233
485 10233 11565 18205 13626 12484 16293 11013 12630 15861 8790 8949 8886 4 356 612 -5755 -3577
501 -3577 -4434 -10088 -7665 -10405 -15702 -10519 -11845 -14342 -9371 -12184 -13777 -8706 -10746 -7023 533
516 533 -3664 -1314 4026 -507 3301 9893 5933 9921 12520 6831 11512 13035 7343 13181 12671 5864
532 5864 10249 7367 740 6743 1989 -3466 3323 -2325 -8493 -2584 -8402 -11412 -4465 -10231 -11121
547 -11121 -5699 -13312 -12052 -4144 -10450 -7584 -802 -7485 -4231 1220 -3532 1848 6374 1078 6972
562 6972 9054 3056 9389 10641 5533 11152 9687 4526 10391 7112 2487 8453 4176 258 4581
577 4581 -1319 -4309 -491 -7057 -6140 -2227 -9795 -8342 -4486 -11282 -7901 -3956 -10502 -6412 -4231
592 -4231 -9170 -3179 -1781 -5306 2346 2086 -1153 7048 4741 1789 10354 6670 3291 10848 6305
607 6305 4293 11113 5614 3820 9791 3120 2339 6481 -1953 -1639 2021 -6157 -4376 -1845 -9605 -5538
623 -5538 -3223 -10756 -5154 -4107 -11446 -5005 -4011 -9617 -2417 -2330 -6220 1996 796 -1712 6449 3946
639 3946 1937 8646 4514 3812 9868 4821 5241 9652 3399 4884 8557 1213 3368 5505 -1953 79
655 79 810 -5764 -2501 -2395 -7655 -2958 -4393 -8911 -3721 -5661 -8602 -1855 -5425 -7033 -251 -4483
671 -4483 -5024 2505 -984 -228 6314 1144 2059 7656 2209 4940 8714 2475 5187 7704 1341 5223
687 5223 6461 95 4504 3745 -2975 1485 -237 -5909 -34 -1799 -6792 -1608 -4456 -8186 -2222
702 -2222 -4565 -6753 -883 -4598 -5498 -357 -4290 -2805 2390 -1649 497 3817 -824 2171 5897
717 5897 1502 5008 6510 1630 4590 4764 1002 4841 4431 1006 4237 1363 -1630 2149 -1082 -2283
733 -2283 1512 -2717 -4402 -1210 -5618 -5319 -697 -4787 -3896 -966 -5540 -4065 -781 -3700 -1042 849
749 849 -2679 636 1087 -2156 2817 3786 1471 5273 3994 1046 4831 3473 1690 6183 3515 651
765 651 4210 1105 -567 3535 921 -101 1823 -2549 -3413 -1216 -4216 -3698 -1320 -4308 -4128 -3091
781 -3091 -5497 -2774 -1666 -4285 -913 -738 -4025 -1554 40 -1040 1734 2623 1613 3428 2337 1845
797 1845 4487 4346 3957 5263 3051 2662 3165 1509 2807 4310 1330 919 1217 -2407 -1874 -1228 -2997
814 -2997 -1996 -2659 -5059 -4242 -4865 -5627 -2407 -2467 -4297 -2603 -2927 -4157 -1466 -1183 -511 2336 1328
831 1328 830 2623 2466 2921 5417 4510 4778 5028 2635 3040 4692 3476 3354 4199 1744 384 -40 -1498
849 -1498 -1399 -685 -2304 -2936 -3509 -5667 -4895 -3773 -4588 -3576 -3179 -4311 -4289 -3834 -3501 -1301 179 126 524
868 524 952 1000 1470 2447 4805 5334 4348 3744 3976 3818 3949 4368 4358 4227 2690 936 674 501 -254 277
888 277 -435 -2344 -2950 -3555 -4979 -4334 -3086 -3528 -3936 -4174 -4951 -4072 -3337 -2545 -801 -418 -655 -674 -676 511
908 511 2507 2754 2888 4308 3658 2736 3351 4205 4602 4768 3782 2635 1937 854 1182 1371 1133 733 -19
927 -19 -2154 -2613 -2419 -3171 -2437 -2439 -4204 -3697 -4013 -5506 -3773 -1702 -2358 -1680 -927 -2073 -1998 -462 -75
946 -75 1514 2672 1796 1455 2061 2647 3370 4442 4471 4382 3335 2005 2017 1979 2219 2798 1848 669 -102 -646
966 -646 -1453 -1368 -1005 -1010 -2769 -4053 -3948 -4216 -4234 -2500 -2569 -2764 -2215 -3135 -3480 -1599 -1042 -575 637 555 64
987 64 1021 1628 2285 3794 4357 3878 3361 2491 2769 3413 3420 3938 3578 2112 929 628 67 420 492 -1003
1007 -1003 -1442 -1975 -3895 -4342 -3395 -2819 -3295 -3126 -3778 -4707 -3916 -3511 -2352 -1231 -1107 -907 -717 -852 599
1026 599 1702 2377 3295 3603 2868 3077 3621 3551 4646 5153 3776 2901 2669 1565 1505 1987 1435 791 10
1045 10 -1732 -2397 -2758 -2992 -2224 -2426 -3782 -3990 -4955 -5166 -3630 -2759 -2441 -1479 -2181 -2346 -1298 -837 279
1064 279 1589 2020 2258 2117 1505 2950 3932 3962 5058 4322 2857 3076 2205 1647 2918 2151 1207 1160 -863
1083 -863 -1882 -942 -1513 -1680 -899 -2848 -3972 -3592 -4711 -3726 -2132 -3275 -2276 -2131 -3631 -2301 -1024
1100 -1024 -1185 371 1420 -177 611 1151 656 2799 3487 3018 4295 3422 1693 2691 2682 2335 3611 2167
1118 2167 1312 1505 41 -192 1194 70 -336 -395 -2915 -2942 -2575 -3591 -2187 -1653 -3157 -3173 -2892 -3776
1136 -3776 -2191 -1553 -1781 -125 -1511 -1764 -182 -171 512 2661 1962 1766 2743 1319 1773 3363 2544 3129
1154 3129 3995 1649 1568 2430 579 1865 2523 215 858 263 -2391 -1120 -883 -2324 -509 -1698 -3841
1171 -3841 -2655 -3585 -3702 -1569 -2065 -2705 -1608 -2993 -2823 -708 -1186 -95 1604 179 509 1831 1121
1188 1121 2144 3831 2677 3534 3401 1740 2706 2809 1975 3650 2629 972 1217 -136 -948 590 -450
1205 -450 -1202 -413 -2838 -3734 -2180 -3449 -2993 -1548 -3665 -3061 -2753 -3989 -2169 -770 -1699 284 109
1222 109 -1359 589 797 406 3260 2954 1902 3724 2550 1845 3671 3282 2921 3970 1735 1060 2049
1239 2049 60 454 1764 -460 -622 -819 -2509 -2634 -1868 -2836 -1964 -1973 -4010 -3177 -3015 -3705 -1709 -761
1257 -761 -1858 -612 -1168 -1355 346 454 607 2565 1342 1626 2709 1730 2318 4066 2658 3027 3138
1274 3138 858 1468 1780 908 1974 1387 -88 -150 -1141 -1966 -707 -1422 -1968 -1314 -2574 -3295 -2257 -2970
1292 -2970 -2025 -1227 -2090 -1697 -1086 -2434 -1111 -62 -254 498 1407 50 1040 1514 915 2383 2977 1809
1310 1809 2211 1969 1195 2153 1944 1768 2123 1235 178 529 -352 -254 262 -323 -808 -1133 -2350 -2149 -1720
1329 -1720 -2205 -963 -1302 -2320 -2119 -2217 -2174 -1083 -988 -1053 -92 -616 -881 -138 597 1197 1610 1594 1684 1662 921
1350 921 1803 2787 1691 2276 2542 1337 1078 1021 908 1352 872 87 224 -1342 -1820 -992 -951 -1596 -1431 -2004
1370 -2004 -2513 -2361 -2713 -1926 -1187 -1505 -1528 -1450 -1688 -1171 -712 145 1097 988 435 1017 1357 1226 1876 2788
1390 2788 2670 2350 1718 1602 1946 1292 1761 2186 831 513 -68 -576 -235 -565 -932 -718 -1733 -2845 -2102
1409 -2102 -2483 -2471 -1715 -1893 -1781 -1897 -2266 -1616 -613 -650 32 475 8 300 611 979 1945 2413 1862 2018
1429 2018 2144 1162 1624 2005 1757 2128 1538 764 687 302 9 413 -202 -417 -1044 -1588 -1948 -1615 -1853 -1199
1449 -1199 -1251 -2043 -1940 -2033 -2014 -1405 -453 -602 -313 -247 -333 316 225 833 1622 1314 1127 1215 792 1219 2129 1472
1471 1472 1980 1700 416 544 904 347 858 932 80 -151 -513 -1399 -813 -813 -838 -571 -776 -1817 -1496 -1614
1491 -1614 -1625 -607 -589 -1051 -407 -1145 -675 -293 -80 343 481 195 453 579 346 1115 1692 1526 1461 1338
1511 1338 764 949 1102 850 1508 893 187 314 -103 -298 206 -166 -66 -426 -1213 -1462 -1299 -1387 -913 -752
1531 -752 -928 -1268 -1545 -1916 -1040 -554 -749 -226 -396 -764 -231 194 475 826 1645 1031 1328 870 658 1559
1551 1559 1570 1604 1338 903 315 604 347 675 900 600 -110 -80 -1036 -1193 -703 -743 -759 -1021 -1329 -1510 -1591 -1262
1573 -1262 -947 -389 -747 -958 -832 -804 -447 179 601 871 837 592 780 982 981 1463 1376 1594 1209 806 845 972
1595 972 1205 1232 961 404 219 -375 -783 -574 -348 -571 -596 -1118 -1815 -1470 -1333 -1182 -711 -527 -705 -994 -1080
1616 -1080 -731 -237 351 284 439 178 317 346 898 1264 1118 1033 828 901 462 684 987 1250 786 577 -158
1637 -158 -232 -43 -273 -188 -30 -27 -599 -1077 -996 -940 -463 -608 -140 -568 -1142 -1026 -620 -469 -224 308 -37 -363
1659 -363 -179 -321 123 793 592 677 610 135 170 802 684 691 1074 591 114 127 -13 208 432 361 126 -217
1681 -217 -490 -220 -291 -29 4 -255 -417 -616 -984 -674 -391 -334 44 -225 -810 -625 -555 -497 164 441 -279 -60
1703 -60 -70 -77 697 469 579 1122 554 194 333 266 626 767 768 703 447 217 -171 398 90 471 120 -736 -354
1726 -354 -533 -1038 -542 8 -539 -558 -666 -1378 -921 -632 -574 -22 17 -267 -363 -181 -62 656 686 404 672 142
1748 142 218 463 570 1017 1156 526 412 408 13 275 87 51 161 -296 -904 -710 -596 -622 -236 -327 -654 -518
1770 -518 -941 -1041 -507 -217 -500 -4 -710 -416 -52 -86 468 770 561 255 502 138 425 939 766 923
1790 923 1038 264 409 366 -12 339 537 -296 -33 -474 -821 -43 -230 -290 24 -374 -894 -754 -592 -603 -198
1811 -198 -249 -234 -244 -506 -351 267 101 647 408 -176 600 296 8 504 635 235 455 434 -210 140 235 318
1833 318 555 169 -69 120 -612 -407 237 -285 -3 -7 -576 -560 -418 -392 6 342 -522 -259 -198 -470 -45 87
1855 87 -67 486 159 -637 195 37 -170 432 331 132 388 -377 -134 750 8 246 528 -153 -85 234 204
1876 204 61 587 201 287 81 -839 -133 35 99 272 147 -521 -221 -536 -732 172 -165 -164 1 -477 -616
1897 -616 -176 -232 480 372 -183 3 151 -254 503 545 392 618 414 -238 388 277 303 742 594 175 154
1918 154 41 -413 350 123 35 223 -499 -584 -356 -775 -146 28 -693 -509 -103 -956 -293 -68 -221 337 142
1939 142 -519 79 305 50 847 734 371 521 204 140 580 869 399 748 275 -284 228 -33 -150 347
1959 347 -247 -389 -130 -817 -629 -252 -488 -143 -426 -710 -682 -618 -460 -154 24 -96 238 -364 -108 592 80
1980 80 372 617 115 225 302 154 201 602 515 454 687 -531 -23 -35 -255 252 195 -362 -253 -485 -585 -41
2002 -41 -225 -307 -100 -433 -756 -164 -193 -180 491 106 -386 165 -259 124 417 182 532 450 -193 267 332 214
2024 214 358 332 -63 210 -155 -105 -77 290 -56 129 -167 -275 146 -93 -239 232 71 -256 219 -380 -277
2045 -277 167 -235 209 240 -287 -217 -59 -453 279 371 -72 193 241 -223 -71 17 -35 564 -88 172 192 -128
2067 -128 -272 735 230 429 285 -130 -172 84 -307 -6 246 -147 3 -234 -516 -198 89 -373 172 -224
2087 -224 -273 -633 -298 -499 82 40 12 55 -122 -5 -16 268 320 584 50 -210 220 -130 209 392 430 453 240
2110 240 -112 32 -76 16 260 -60 -217 -189 -424 -258 56 -222 -242 -482 -552 -401 -399 -302 -109 -232 -236 -62 -45
2133 -45 -97 206 234 511 194 447 -37 366 245 374 346 286 279 -69 -10 -188 257 331 569 117 -341 -466 -251
2156 -251 -386 -142 -140 -292 -353 -391 -387 -407 -239 319 166 110 -45 -119 99 116 215 537 327 473 1 110 416 615
2180 615 591 581 337 129 -79 -5 306 -53 162 78 -244 -401 -150 -284 -242 37 -255 -397 -674 -438 -309 -26
2202 -26 14 -142 -69 -106 89 -172 166 261 531 73 172 127 105 198 639 458 205 376 4 80 11 8 395 114
2226 114 35 121 -344 -168 -107 -173 -89 -166 -258 -360 -409 -66 -421 65 -37 -46 -190 -16 -46 285 278 308 3 55 34
2251 34 -3 152 -165 258 203 401 321 -14 44 351 274 255 78 -119 -286 -207 -168 136 37 -96 -165 -389 -629 -491
2275 -491 45 -213 -230 -255 -183 -54 -525 -275 6 -52 -273 -82 -153 -302 138 -106 128 293 206 267 157 64 346
2298 346 407 532 355 -78 -132 -18 -29 246 240 288 42 -101 -310 -90 -71 -201 -150 42 -490 -479 -307 -670 -64
2321 -64 -267 -53 -256 -249 -276 122 254 366 472 113 54 350 481 500 486 514 429 269 137 62 631 259 456
2344 456 365 -10 -212 69 -261 -25 -70 -261 -457 -461 -282 -537 -550 -268 -238 18 -296 2 -258 -237 -43 257
2366 257 317 243 45 -116 391 614 580 473 370 200 307 363 450 195 441 291 -183 -127 -4 -53 -450 -148
2388 -148 -137 -613 -20 -580 -413 -364 -394 -335 -250 -459 -388 -402 -408 -258 198 37 -37 27 24 221 404 119 554 631 67
2413 67 403 310 126 498 279 211 326 74 -35 -51 205 126 114 -252 -301 -139 -379 -340 -251 -332 -356 -45 -396 -372
2437 -372 -293 -231 -2 81 -192 4 -178 -229 231 342 309 202 163 96 155 467 37 469 153 -27 305 -17 29
2460 29 667 284 50 411 53 -146 -376 -207 -102 -35 -86 -299 -11 -439 -410 -383 -443 -102 -212 -386 -356 -206
2482 -206 -324 263 43 73 -37 130 176 -99 419 88 254 642 332 343 135 446 443 229 245 282 -143 -102 158
2505 158 -137 166 -88 -425 -195 -254 -453 -254 -423 -125 -163 -491 -495 -64 -323 -5 -57 30 -128 -91 -18 581 280
2528 280 305 198 478 478 386 369 348 654 460 180 -2 49 197 141 134 39 -354 74 -429 -362 -299 -438 -256 -324 -402
2553 -402 -394 -590 -522 -328 -247 -98 -229 -110 -99 2 -53 240 598 193 242 283 133 359 541 557 477 401 134 236
2577 236 288 211 235 47 210 -143 -266 -246 -178 -113 -42 -263 -283 -615 -315 -216 -346 -196 -251 -272 -307 -465 -187 142
2601 142 -47 269 331 -90 -99 175 332 227 410 217 -117 357 3 228 320 72 319 219 76 99 -116 -56
2623 -56 -72 -171 -145 78 -298 -323 -358 -257 -208 -218 86 -437 -229 -234 -221 -120 4 0 -164 -7 -235 249 315 126 234
2648 234 41 353 211 107 -188 330 238 479 130 -137 245 41 177 73 142 -194 -138 -166 -309 -312 -163 -151
2670 -151 -55 -124 -115 -105 -694 -324 -26 39 -192 -279 -105 -121 215 -123 139 94 -92 187 202 114 190 82 135 176 170
2695 170 409 282 304 89 235 181 134 264 7 24 297 -237 -452 -157 -593 -396 -228 -277 -363 -275 -313 -289 -470
2718 -470 -449 -125 -107 39 -108 174 107 182 464 52 490 477 393 191 472 270 497 489 185 407 155 181 -53
2741 -53 -118 -188 110 -266 -311 -531 -398 -369 -599 -457 -360 -17 -285 -379 -183 -171 -242 -47 -66 -50 -161 -71 243 436
2765 436 296 208 239 208 123 77 246 445 379 160 216 -117 -164 164 345 165 -72 -193 -349 -382 -353 -80 -103 -115
2789 -115 -111 -312 -338 -149 -116 -151 90 -85 -56 -271 -144 34 12 259 186 -157 128 112 5 265 314 254 237 245 228
2814 228 93 66 166 -17 166 329 -14 63 222 -30 -97 -31 -78 -49 -234 -93 2 -87 -34 -109 -125 -334 -173 -291
2838 -291 57 -39 -178 -89 -99 12 -37 314 -26 354 80 120 166 291 299 314 493 439 323 -102 -102 -32 227 131 55
2863 55 338 108 -218 -242 -166 -210 60 -176 -383 -73 -360 -400 34 -174 -366 -224 -42 -198 70 274 228 10
2885 10 88 -5 -95 -71 160 485 480 605 102 208 228 173 353 394 213 78 -67 -139 -271 33 -84 -161 27 -473
2909 -473 -544 -417 -113 -319 -78 -213 -82 -269 -216 11 225 35 122 -54 73 273 417 410 315 358 186 419
2931 419 184 -57 370 385 197 175 -73 95 -44 -241 -104 -72 -149 -262 -304 -297 -230 -26 -130 46 -100 -125 -261
2954 -261 -8 -192 144 162 115 -72 19 43 8 399 -108 29 103 143 206 296 182 285 215 -8 87 103 -209 267
2978 267 222 130 -75 -124 -183 -264 -97 -205 21 -180 -16 -80 -236 73 81 70 67 -32 -57 5 35 -133 441 -3 -73
3003 -73 161 -234 27 -258 -50 92 230 21 90 126 8 153 -218 -87 15 111 35 -72 33 104 152 -77
3025 -77 -218 -39 -23 -183 71 58 -155 16 -482 -44 -124 -118 -103 56 -195 54 120 71 21 148 151 77 94 90 129 53
3051 53 69 214 281 97 -84 -18 178 275 164 226 273 -181 8 -38 -314 -311 20 -141 -73 -45 152 20 135 -37
3075 -37 -56 -274 5 -28 -108 -20 54 106 69 456 118 -290 142 58 66 303 -4 14 101 39 233 -21 -82 41 -127
3100 -127 -199 -37 -100 -132 71 -339 -133 -39 -265 -249 -166 -128 -188 -229 -14 121 -110 53 100 32 32 167 104 -25 304
3125 304 221 268 260 53 92 72 67 97 64 -2 249 -222 134 -253 -143 53 -269 -211 -109 -204 3 -190 115 143 -21
3150 -21 -6 122 36 38 206 -119 266 375 154 -65 105 -73 35 434 6 94 -118 5 194 -95 -55 -152 137
3173 137 -274 185 -53 113 4 -168 58 94 -169 59 13 132 -118 28 -84 45 -140 -133 363 -191 -118 93
3195 93 -110 9 -115 -158 -70 174 103 108 -65 -162 103 91 85 11 42 28 112 249 26 58 -136 50 41 -61 14 107
3221 107 227 60 -20 84 29 -11 -4 -131 142 86 93 161 -28 -349 86 -15 -64 -214 -10 -87 20 -212 52 30
3245 30 112 -44 163 53 339 -31 22 39 -78 207 24 -27 -104 70 -132 211 -221 -92 -140 -115 -77 -56 187
3268 187 -89 -36 -125 -272 152 21 -60 -78 -64 -68 -73 214 79 224 71 278 424 22 37 56 -59 297 104 -41
3292 -41 58 -122 -27 166 119 -138 161 -254 -277 89 33 144 -125 -55 45 -111 49 60 -56 148 -42 -84 153
3315 153 -45 15 -30 62 79 40 177 -154 502 -24 -158 138 84 82 -260 120 23 7 188 -13 -147 -218 -225 -237 -104
3340 -104 43 -109 -92 3 367 170 -137 212 -123 209 255 -152 120 327 5 -98 -61 -115 -120 270 -353 -113
3362 -113 156 -159 -181 10 -92 -223 -88 -209 -60 -384 -56 -135 -215 -164 -89 235 70 265 137 6 -195 71
3384 71 -39 5 -11 86 304 29 37 51 -158 65 111 -211 62 -64 125 -46 -56 -265 -89 45 -42 160 378
3407 378 267 195 47 -123 -41 -165 -78 77 -60 -105 -84 -64 -61 -101 -224 77 220 -255 99 92 166 -405 -146 -295
3431 -295 55 -163 -119 76 -37 101 212 91 -94 134 -20 116 -130 184 44 43 -53 -39 79 -228 -223 -105
3453 -105 172 -109 161 -51 -29 -221 -328 126 -70 -28 -166 -223 53 -149 -118 3 39 53 -28 40 79 107 42 80
3477 80 -76 84 126 153 -90 186 289 20 17 -226 -132 36 8 -66 -142 -200 -242 -317 -269 -137 125 -380 -428 33 -154
3502 -154 39 7 107 -23 -144 -37 63 207 70 -42 93 -56 81 293 135 144 -107 46 -132 3 141
3523 141 -54 101 -84 -87 -93 -122 28 -186 61 29 -169 132 -129 93 -110 -55 30 27 90 114 -37 101 -52 84
3547 84 141 252 -60 10 122 67 125 355 -94 114 137 -228 133 -284 -18 -128 166 264 35 -46 180 173 -89
3570 -89 -57 -209 63 78 -76 -60 -68 -69 10 80 -54 213 47 331 -113 71 73 -230 41 -54 -164 43 324 -18
3594 -18 6 117 -408 -233 -365 223 -101 -348 -39 -81 69 -4 239 -148 147 59 -175 -189 82 81 -6 10 -7 108
3618 108 -43 -77 -50 133 68 -166 36 -194 17 63 -114 116 -51 -45 -253 215 197 124 218 163 -75 -30 -47 -31
3642 -31 233 171 -143 208 -140 -134 -114 -131 16 206 -93 -45 -201 -185 -345 40 8 62 -41 49 64 -106 195 -5
3666 -5 65 -81 253 6 100 13 26 85 122 17 -189 16 -65 -192 -175 510 258 326 -127 -55 -401 98 70 -37
3690 -37 107 -374 -65 -338 -116 -35 -39 -63 -61 17 -213 203 10 -4 -108 117 -35 123 170 167 -44 -22 289 -197
3714 -197 199 279 255 196 111 141 -265 -129 108 -51 -197 14 -10 -98 -286 -119 213 -141 -71 -216 -124 -121 -281 -60
3738 -60 -217 106 36 -28 138 -63 324 -126 88 -36 125 67 -48 -39 -60 92 -17 223 -71 26 -50 -68 -132 21
3762 21 17 -256 -223 -153 -287 -369 -47 -394 -104 237 -126 114 -229 197 194 220 149 117 113 62 -46 -250 -105 -113 137
3787 137 -12 -102 -223 -40 89 106 -72 -49 129 -220 -144 56 32 -61 -204 -9 -149 150 -13 69 -228 -85
3809 -85 163 214 -74 28 155 -222 148 49 -186 3 -121 -313 -94 -123 -111 99 -43 -45 211 225 -106 109 -180
3832 -180 -15 -234 53 193 185 -59 165 55 -42 -4 106 -32 6 122 83 229 -46 -32 -102 -102 -145 -227 18 38
3856 38 252 76 -228 -89 336 -126 -136 46 80 103 25 66 96 -12 -8 -20 -6 206 220 -31 19 -79 162 52 -225
3881 -225 -117 -91 -159 16 -289 -34 -123 163 3 -35 -182 -237 182 -130 108 30 124 -153 82 90 66 26 -153 156
3905 156 109 206 -77 -185 85 56 -81 145 182 62 -176 -111 138 -19 -122 173 55 -41 -90 -51 -91 -48 -263
3928 -263 -54 -63 134 -149 330 -19 -221 67 128 -208 -3 89 87 170 281 -145 61 -87 9 -33 -5 -114 -106 64
3952 64 -31 -163 106 95 -76 35 100 65 61 214 -130 -44 -145 -190 -184 -107 222 236 -209 -35 35 -120 264 338 -79
3977 -79 -127 151 21 24 157 -126 -70 52 -195 31 -252 -131 49 -75 330 234 -59 252 -88 -85 123 -75 -17
4000 -17 70 20 92 -112 7 -200 86 365 15 -19 -57 171 -121 285 36 118 117 -16 78 -93 -174 144 81 -11
4024 -11 -22 -15 196 -65 113 162 13 16 178 -72 -100 40 161 -20 110 214 242 3 67 -24 239 -112 -174 -168 -134
4049 -134 -89 -19 -48 -113 107 18 -139 -173 27 14 -307 -141 -71 -214 1 214 271 79 -99 24 -153 17 370
4072 370 393 90 -180 -8 -23 -161 209 -95 -49 -128 -212 13 109 24 9 -7 -294 -12 -29 27 320 111 -120 -154
4096 -154 123 -64 131 87 10 -77 53 79 -65 -47 74 56 -88 -197 -155 -263 -48 -77 108 -174 -23 146 -136
4119 -136 -240 -120 -47 84 107 162 -29 145 -109 -226 230 -120 -389 27 113 -102 -101 167 -44 10 111 30 242
4142 242 -141 40 -116 -71 -107 -116 67 80 -37 49 -156 24 18 81 -110 80 168 -138 61 264 -103 87 0 -134
4166 -134 339 182 -10 33 -116 -121 87 123 172 2 -239 105 23 -110 6 -3 -187 -14 72 -290 48 86 -1 38
4190 38 -43 110 16 -165 48 394 232 -34 -280 -375 328 -23 171 42 142 58 -62 196 147 17 10 84 -209
4213 -209 42 -28 -93 99 -63 -71 -120 -69 78 -61 -12 93 182 73 66 -218 -77 116 1 125 10 75 65 -159
4237 -159 160 56 -40 -145 -48 -12 -144 -152 -59 -106 -174 30 -295 -195 -222 -3 43 -14 -189 -115 -149 -78 89 347 -143
4262 -143 145 80 -16 146 82 -125 16 -170 125 -94 102 137 -40 -25 -143 -98 -6 19 -36 -47 24 20 31 50 25
4287 25 -57 18 46 -19 229 108 111 254 -41 228 246 -104 -139 -76 -25 331 -130 135 114 -204 143 -65 148 79
4311 79 -138 6 174 57 69 -119 -7 136 -20 -164 60 3 -133 302 46 142 110 22 -3 -42 10 234 143
4334 143 -10 91 211 277 57 20 234 105 -77 -422 -126 -78 201 30 -150 90 238 -175 -22 32 15 129
4356 129 -157 75 217 -100 118 -57 -39 154 74 127 69 -154 -17 91 -249 -92 47 -211 -204 -34 0 108
4378 108 -56 7 -70 -166 133 12 295 82 -103 -20 374 -95 201 54 98 281 26 79 -298 267 -128 270
4400 270 -199 -97 -198 -163 128 112 116 13 -211 -247 -183 -54 -154 -37 -246 -242 -49 -182 -21 -102 335 35 27 108
4424 108 -68 2 -85 122 -138 -116 264 -47 -240 198 -166 -115 -203 212 -238 152 16 -196 -92 95 -181 -51
4446 -51 -49 -64 22 -181 36 -89 -34 254 -169 -250 41 -78 -103 56 20 204 -90 -115 97 205 218 -148 31 -170
4470 -170 77 82 49 -88 15 -302 -11 90 51 155 60 -84 298 204 169 -10 -7 17 156 143 -306 -55 64 -81
4494 -81 143 78 35 51 -55 78 20 230 79 288 -229 -49 -86 -165 166 -90 -146 -156 84 -121 -101 -59 133 -56
4518 -56 -190 -161 152 81 -138 -25 105 284 176 303 123 -9 85 259 -142 321 -54 -25 -155 -127 -230 -131
4540 -131 -4 -53 -40 -166 4 -3 116 47 -56 -211 -36 -308 19 -14 -38 -244 -25 7 -90 299 128 -188 103
4563 103 356 -25 318 195 3 -1 201 4 -127 -88 -316 -23 -104 107 298 -108 37 -58 -59 -60 -39 341 94
4586 94 71 85 -93 -20 235 63 35 146 67 37 -222 -146 -235 62 -141 -78 136 -126 390 245 -205 46 -101
4609 -101 91 75 -28 105 115 -122 64 314 -68 -50 68 -221 163 98 -33 212 128 -18 172 -93 165 49
4631 49 -107 -213 -85 -59 -238 29 -34 -119 217 -6 -62 66 -32 300 161 -36 6 182 -83 -41 -87 92 222
4654 222 -104 177 138 -96 112 70 -41 -39 -30 -82 109 156 -134 -64 -41 -1 63 67 -64 -74 116 328 -170 -263 34
4679 34 -38 -11 14 273 137 -8 23 134 -139 257 -13 46 65 399 -1 -49 -47 -58 -245 -150 38 -67 229 204
4703 204 -25 -203 -85 -146 -168 117 -83 189 -37 186 -289 112 67 -11 -45 -118 -83 95 141 -377 -164 -63 -115
4726 -115 108 -32 -104 159 -11 97 309 98 18 61 136 111 -259 -45 -6 108 151 -26 151 222 50 -110 -218
4749 -218 137 164 50 162 -23 58 22 -130 34 -236 -164 66 -18 10 43 -192 121 -89 99 210 -134 224
4771 224 -13 106 -42 47 32 222 162 50 -171 73 -33 34 94 -77 -32 8 17 -33 -14 136 20 107 159 88 -84
4796 -84 -122 100 -35 -28 -298 109 -135 45 -59 -101 82 -245 21 159 -27 -234 149 86 224 -110 -69 -107 -88
4819 -88 63 195 66 110 113 185 -180 9 102 -311 143 -53 -207 -194 16 -128 -251 132 -147 -177 -22 255 -142
4842 -142 -49 40 119 -11 -76 97 106 98 300 239 94 -88 174 -29 31 214 116 80 -52 -259 -18 -37 -44 -98 -64 -107
4868 -107 -150 -206 -221 -138 -135 8 175 -236 61 64 1 -6 58 -42 10 154 31 50 -95 -225 49 81 -123 217 114
4893 114 9 -52 145 -68 52 -128 90 77 74 106 180 93 84 -131 9 158 -193 56 149 9 -48 -49 -28 66 -125
4918 -125 18 35 -31 -40 -207 -344 -65 -175 -121 -39 -108 44 -95 -325 72 224 158 45 -13 -72 -58 20 -78 -89 66
4943 66 37 -61 -221 26 218 -132 154 74 -101 -165 133 -91 -212 116 -6 91 -234 123 -185 -180 101 43 -26
4966 -26 -210 -182 420 32 -239 -90 -7 39 -191 345 193 -73 -127 -15 180 336 214 167 63 -236 -129 13
4988 13 -193 -138 -165 185 21 -260 -1 -65 -77 -146 -109 -86 -256 -40 -262 59 -118 165 217 -45 11 44 26 -1
5012 -1 148 -118 304 -110 -8 101 -123 42 -83 -223 246 18 34 -124 87 76 34 -84 -387 23 64 -123
5034 -123 -197 108 129 -123 -217 -77 35 -143 -8 -99 249 -26 -7 -177 -256 -42 312 -198 -5 59 -77 90
5056 90 -18 -272 -51 207 120 132 -272 -97 -114 -98 -164 -122 0 -145 124 -195 -155 -198 118 -18 -38 22 -58 -78
5080 -78 -29 87 -145 71 -124 -168 105 46 41 -225 7 33 -105 -344 156 217 -35 291 143 72 72 -81 114 1
5104 1 -40 180 207 5 47 6 99 -177 -61 201 22 73 -138 -75 258 -78 -2 102 -188 -46 221 -433 -144
5127 -144 26 -4 -277 -205 -138 -232 -31 -20 -79 -256 98 -42 -147 -62 -116 51 64 246 -20 -98 127 34 -163 -113
5151 -113 77 445 -82 92 243 115 46 33 20 119 41 -111 13 -165 -273 81 -80 182 46 54 89 -102 -89
5174 -89 17 227 13 10 97 168 202 151 168 -150 154 -19 142 -1 141 178 140 -5 -62 -176 -5 -157 -66 -198
5198 -198 -106 -35 -67 -193 -128 166 -167 103 -206 -215 139 18 345 95 -59 183 -103 163 237 -40 249 -77
5220 -77 -86 -75 -63 -86 -108 -204 -132 -313 -51 -127 -96 145 -68 -17 -59 20 6 176 106 57 190 196 -207 144 -70 -19 27
5247 27 -101 121 -71 -123 240 2 -252 -6 158 3 -167 46 13 -32 85 -206 -288 100 77 -55 119 210
5269 210 109 125 42 137 54 -104 -173 15 146 -90 -31 122 -227 -22 124 -316 -16 51 76 -169 -39 -72 -207
5292 -207 -124 72 -52 224 65 -189 -124 86 269 131 -141 -102 -84 -21 141 285 -1 128 89 -251 -89 202
5314 202 124 -162 133 -2 -185 -186 -191 -212 -139 -54 -13 104 44 -209 -81 -192 105 63 -105 -196 296 68 -15 214
5338 214 61 -177 99 99 -52 -71 19 30 81 -115 273 40 171 -2 -95 137 -201 20 -88 -89 -283 -65 -134
5361 -134 -24 -180 -137 -67 159 69 440 172 -62 364 80 350 -155 -41 73 86 418 138 -64 24 67 142
5383 142 144 -65 -45 31 -57 -84 -377 -180 -43 -57 113 227 -111 172 65 -201 132 -32 -46 -36 19 -142 -85 -3
5407 -3 145 86 -121 -149 28 0 -62 256 -12 -68 -24 -146 178 -275 80 -9 184 -96 -52 114 29 117 261 118
5431 118 -92 -63 -93 80 119 147 -265 -26 196 -261 -192 -429 -95 -47 -105 -126 -6 391 -19 176 -233 58 164
5454 164 -230 -3 -38 -44 270 -83 64 -85 201 147 174 55 -48 268 -116 34 201 57 49 -36 335 -44 -135
5477 -135 -148 -24 -163 55 -98 -196 -71 -50 -129 70 -266 -86 -105 -8 14 -253 -148 -129 126 -312 -336 -32 57
5500 57 109 163 -100 -9 31 -148 -220 0 -96 217 -67 89 -178 -98 -7 22 -257 69 -143 -60 -112 -254 1 -246
5524 -246 -123 40 -155 -246 9 40 63 275 15 125 144 64 168 128 -144 150 -14 -119 -81 -121 -4 135 -20
5547 -20 11 -95 -241 71 -43 -104 -60 -104 -58 64 166 140 -216 47 3 71 70 90 -36 239 16 172 64 -16
5571 -16 225 -21 204 -19 -76 -55 -46 182 19 67 -124 -302 -115 -156 91 -10 -143 3 170 66 -8 203 29
5594 29 125 29 -110 -10 -15 83 12 -142 114 -11 11 -243 35 -18 26 -121 4 -225 39 157 -111 38 42 -67
5618 -67 266 -86 326 -171 114 -278 -4 104 16 142 -113 173 -152 344 106 168 167 197 70 -116 120 -136
5640 -136 141 26 131 35 -81 19 -55 79 -56 -84 -236 44 -2 48 38 -238 -38 105 62 105 -105 -158 111
5663 111 -86 -43 118 305 -311 115 -167 -21 46 53 198 -19 120 -45 253 40 118 14 -59 218 -19 334
5685 334 -154 -27 76 -151 42 56 113 -224 133 67 -163 -207 196 96 9 -27 16 52 -304 180 -25 21 -54
5708 -54 2 -126 40 -76 -31 -64 57 -121 -4 190 124 -63 -339 76 243 94 -49 298 -33 106 -10 -43
5730 -43 139 224 83 -185 55 -24 169 243 155 2 94 -118 44 60 188 -221 -41 -252 57 271 -37 163
5752 163 32 -89 -56 327 -113 -170 254 0 -15 -96 104 -34 -157 -245 86 -116 104 7 205 106 83 -188 -8
5775 -8 132 -51 -201 56 -88 65 38 -381 -56 -216 144 111 -69 40 82 73 121 92 -73 -116 49 -259 14
5798 14 -68 54 171 -47 -170 124 136 -22 -227 -49 43 159 -107 18 -125 86 28 -20 -28 -33 28 -6 -19 70 -169
5823 -169 186 -21 106 -137 151 -12 -187 -6 -155 227 -33 -174 177 118 45 -85 -155 89 -60 -198 22
5844 22 85 50 -170 51 -106 -9 79 -245 -111 44 -29 -4 54 177 215 257 26 84 149 15 237 211 176 116 8
5869 8 247 116 -7 -77 -159 -108 80 -8 280 63 -21 -45 32 4 25 -197 -221 287 119 49 -47 203 95 -35 -251
5894 -251 285 9 -82 5 -74 92 153 -51 150 211 -157 109 -166 41 34 126 -182 36 -137 -168 59 -132 291
5917 291 9 165 -33 213 144 -95 126 114 72 -46 52 -81 106 115 -177 16 -108 205 -210 23 16 -123 -91
5940 -91 114 -192 -224 -368 -234 -30 -49 78 244 -1 208 -30 -99 -153 95 137 47 -33 -22 -31 163 64 -177 -146
5964 -146 144 -161 -1 -62 121 178 63 -184 -75 -110 -11 -156 -72 214 -129 -106 -85 -46 -276 -57 -303 23 12
5987 12 28 99 196 -152 239 342 29 -192 81 243 -18 116 -121 46 244 -177 12 -344 -167 -64 170
6008 170 -35 -3 -26 -108 -112 143 -192 94 -131 -53 -120 -79 91 -32 12 75 240 -259 -164 -196 -188 41 182 -209 -6
6033 -6 -45 -2 -25 -128 19 159 -332 -48 196 -271 -154 53 -3 -128 237 211 121 -139 41 137 -27 337 -65
6056 -65 283 51 -114 -102 239 220 -182 33 280 80 -163 133 -41 -77 -60 -54 -9 -67 -65 100 -11 96 387 1
6080 1 -14 -152 138 72 -11 -81 -62 13 1 -110 -57 -22 82 219 -28 116 -94 139 229 5 -1 -45 -80 69 -175
6105 -175 1 122 72 4 112 -47 -217 -118 -269 39 -12 -200 -162 -21 -129 18 11 -143 -139 -26 -104 27 23 -126
6129 -126 156 15 -140 -108 -135 -128 192 35 -26 -168 -32 152 -71 31 -148 122 -24 125 -270 -37 -48 -285
6151 -285 -146 11 -19 -108 -219 70 -114 45 183 -63 -34 -317 113 -124 293 106 -98 121 43 50 118 -33
6173 -33 -332 313 -125 -209 -26 191 -142 -35 -40 264 -200 -202 -116 301 98 235 -133 32 -119 19 64 -83 10
6196 10 142 114 -10 140 -128 77 202 -78 105 -127 -139 151 141 160 -53 -123 -23 -177 -207 35 -62 56 118
6219 118 209 -75 49 -68 193 53 -157 -116 231 -33 -29 -53 -119 151 -17 -19 30 53 -91 191 61 106 -249 188
6243 188 259 -181 -301 44 -10 107 -5 -58 -66 80 169 108 96 -76 10 -111 -86 139 -86 -57 68 -96 87 -169
6267 -169 104 -420 -40 131 -100 -92 15 -16 -189 -30 -11 -104 -224 131 -76 11 150 160 125 91 -67 228 27
6290 27 -252 49 -192 -140 -187 -110 -89 -141 74 97 29 148 -32 -25 -234 -135 101 8 -135 -223 102 -61 14 -94 20
6315 20 50 83 -38 -33 3 -87 -63 26 -24 34 189 5 -22 16 100 -46 72 -38 -134 59 157 -119 -97 58 122 -74
6341 -74 8 144 -194 -153 80 -56 -16 -23 -42 -35 -63 -41 53 235 163 109 68 257 176 189 64 6 118 56 100 180 7
6368 7 28 33 -163 -18 -7 -47 78 128 52 -222 170 42 26 156 177 103 215 -13 35 -73 -156 0 -281 -234 116
6393 116 133 52 -380 59 -125 190 72 82 -36 -121 -269 -37 86 -285 -182 -70 107 168 28 120 -76 -168
6415 -168 17 147 -53 -35 -19 239 255 170 165 158 146 16 86 106 -43 4 33 -119 -38 -392 16 -31 160 -89 245
6440 245 -113 -204 85 -45 73 111 201 -28 306 368 147 85 181 -107 -84 -158 60 14 126 65 -182 64 -98
6463 -98 29 -108 -4 97 50 -144 5 -89 -39 -69 10 155 -16 -9 105 137 192 159 147 7 116 78 88 94 -39
6488 -39 19 239 -167 -65 -196 96 160 -101 -52 -184 -125 -60 44 -109 -51 -105 82 140 147 -115 34 -82 191 -161
6512 -161 -248 -21 -73 38 -7 60 41 -94 63 15 -11 -7 -110 -136 4 -333 108 113 -2 194 22 -73 -134 142 -213
6537 -213 5 266 -87 54 28 24 340 16 -38 -67 -69 -65 170 33 0 -64 227 121 116 -119 -97 -37 49 -2 -6 60 -146
6564 -146 -298 -248 -148 93 27 -103 -37 143 145 104 -190 175 -38 43 4 -31 195 23 -129 -71 174 -171 -108 9
6588 9 73 232 160 -1 -14 -76 47 164 43 -117 22 -349 -232 64 -150 -65 351 -43 -5 114 234 -42 235
6611 235 182 149 -155 44 -201 26 287 -14 -13 237 88 -16 139 -127 65 -66 56 146 -25 -153 183 -260
6633 -260 195 -371 238 12 -135 52 77 152 31 -50 52 -47 -25 -139 37 195 -4 -50 -13 -98 154 -39 -79
6656 -79 -161 132 -69 151 -63 170 -56 -293 5 323 -114 100 36 -70 61 72 104 -224 -151 116 193 104 -19
6679 -19 172 -13 67 47 -74 87 -8 -142 -149 113 97 102 -31 -114 59 180 -58 -177 -325 229 -22 -89 129 138
6703 138 -61 98 240 -70 -100 -203 180 -64 29 -146 66 -40 -175 -18 112 -120 -143 -46 -87 -79 100 22 -32
6726 -32 -49 144 38 -12 -15 -47 154 -32 201 190 81 23 -21 -122 -99 61 101 93 -34 120 -157 -85 -206 58 161
6751 161 -298 -216 -92 -163 -209 98 -376 73 120 -147 -30 -65 149 -14 -42 -143 -91 -63 -197 -139 -136 -239 276 0
6775 0 -77 -71 164 50 65 21 -45 82 115 -40 91 -133 -102 -65 -406 205 61 202 83 21 187 -66 -20 -131
6799 -131 -173 27 -137 69 171 36 93 -99 46 -41 -103 220 255 -96 -44 -19 -122 -29 69 2 21 -135 -78 -90
6823 -90 109 78 66 -136 -121 -100 1 15 26 211 45 323 -16 -151 -59 193 127 -48 -255 254 -2 -28 -1 157
6847 157 121 94 -12 59 117 -9 -38 -33 79 -214 85 212 4 -248 -237 -221 136 195 -105 117 -66 -199 60
6870 60 17 -252 47 299 153 60 -178 -101 -131 220 104 105 228 184 -56 -116 53 -130 136 36 -334 -214 -271
6893 -271 -53 -56 -264 -123 -28 143 40 63 -112 -79 284 58 -54 -127 90 -121 43 394 -192 -37 -186 46
6915 46 75 -41 -315 -106 -87 66 -58 -9 46 86 -159 5 172 -1 -24 -140 64 392 -55 181 7 -103
6937 -103 70 68 199 61 157 -43 -1 132 99 117 -142 35 -57 306 104 -87 -104 70 65 -36 90 74 94 233
6961 233 19 -31 63 61 156 138 -62 -80 -88 -2 7 76 -58 -99 -32 88 90 49 126 168 269 62 135 -43 -268 -33 206
6988 206 80 -58 -196 23 -88 3 -112 -53 -66 -177 71 91 -149 168 5 143 -83 276 343 64 -48 22
7010 22 155 264 -8 86 67 67 -160 -161 1 -62 52 -69 67 39 50 68 55 -4 337 -91 114 -177 195 -183
7034 -183 63 95 257 8 -205 138 28 229 160 -21 -97 33 -180 -76 -59 108 -186 146 18 408 33
7055 33 -200 149 98 -22 -81 -246 61 -163 127 104 129 -183 2 -92 -31 259 10 30 296 -37 -260 61 -51
7078 -51 -297 -195 122 -169 20 -95 -46 -56 -123 298 223 -18 11 218 62 68 175 49 -105 -22 89 -235 53
7101 53 110 145 -173 170 35 -71 -108 -2 -42 -36 129 -148 184 -15 -135 198 -58 -224 -352 -46 -5 43 113
7124 113 15 -11 -27 155 141 -69 -86 9 148 135 -15 153 174 -176 58 -153 395 82 18 79 22 -141 -147 91
7148 91 330 23 -60 -50 96 -130 229 -91 53 -195 -72 -46 -36 -323 280 178 -5 47 33 171 124 -128 -232
7171 -232 -180 123 -15 -1 -167 132 202 51 125 -186 150 10 -2 177 182 -68 -267 -130 105 394 62 -60
7193 -60 -55 -163 99 -14 137 148 63 95 139 98 209 -102 150 6 -104 32 -44 322 201 -106 -118 53 231
7216 231 90 111 -142 -119 87 -67 95 82 -191 -71 6 200 247 143 136 28 -62 179 -14 -406 162 141 -50
7239 -50 -294 156 89 -159 -55 53 -110 -72 100 140 113 111 88 37 -36 55 -184 -164 46 -94 238 23 157 -59
7263 -59 243 15 12 -134 -182 0 -292 122 130 -327 -135 -8 78 -113 99 -100 -133 -78 -142 -101 -313 194 -94 -150
7287 -150 -86 2 341 -136 85 71 25 262 -17 -122 -65 -90 180 172 104 232 52 -297 243 150 16 102 8 45
7311 45 -226 307 -72 226 126 216 -263 92 -312 219 66 -27 -65 -94 349 154 -96 -174 31 -199 134 -89
7333 -89 -4 248 25 -61 -209 39 71 -74 -257 -54 41 110 -225 -77 -70 -52 -19 -47 290 -340 102 165 -24 107
7357 107 183 -34 120 -352 127 -42 73 -10 68 -91 -167 -28 -62 -43 346 -105 88 35 175 -182 68 -42
7379 -42 42 70 -181 -19 -78 -47 -153 -83 140 250 135 -67 88 199 59 222 69 49 137 -15 -142 -54 -111
7402 -111 -104 -20 -7 -16 -51 -42 201 -184 -84 -123 -97 -116 -159 -60 127 89 122 14 124 -129 -179 -83 177 116 87 -239 5
7429 5 196 6 -52 -50 -1 -17 -78 -41 56 -81 19 -2 -41 -97 82 -21 13 47 10 -37 -96 33 61 36 -243 204 -55
7456 -55 9 -130 -95 33 113 116 38 198 -32 -205 -59 43 195 160 -47 -178 -473 9 -158 -33 61 51 -33 -38
7480 -38 -4 151 -207 -159 -26 46 -49 -50 276 -78 -151 -21 80 -237 -50 -80 130 81 -37 0 -191 -16 -42 30
7504 30 -94 -38 41 29 -70 271 -88 -56 52 -41 49 -1 23 -343 46 209 336 175 17 -23 -31 32 151 98 110
7529 110 -90 -193 50 11 200 -107 -57 -38 32 -206 -163 224 -30 -48 -57 9 14 72 193 -331 -71 -39 -262 -139
7553 -139 -166 -139 -95 171 152 -96 57 102 8 228 449 -84 258 -82 -51 -23 -10 -215 -85 53 56 -71 -35 25
7577 25 -198 108 116 323 192 -184 115 200 46 83 -29 47 -62 35 41 -59 -173 129 170 -10 -137 52 -94
7600 -94 18 -417 86 -7 -122 -130 52 -36 -176 53 146 41 -162 -61 -138 9 229 -118 -30 -68 -11 -272 -216 40
7624 40 -86 -169 131 98 -83 91 -97 -94 -149 325 -139 -28 -68 354 19 -125 -33 -11 -139 78 102 -111 8
7647 8 -40 -124 248 -81 158 87 1 -30 -82 -30 -189 -64 -86 56 -243 64 -113 7 103 -78 53 -146 134 -83
7671 -83 199 -140 47 274 21 -172 -90 115 -91 147 27 -37 -1 -45 -90 -108 -43 2 -72 -33 162 283 18 58
7695 58 -350 -181 120 281 47 115 49 79 -99 72 -170 107 -176 27 132 -59 161 38 -10 87 -35 142
7717 142 -15 116 78 -236 -294 85 30 -221 65 -7 -100 186 -76 2 12 -95 -31 -55 -27 109 -16 -192 -135 5
7741 5 -192 -45 18 109 -2 124 27 -51 -184 -11 -94 -207 64 -165 220 -145 -46 -21 -66 139 -20 -267 207
7764 207 -19 69 -6 -196 224 -49 183 -1 155 123 -168 13 -138 -183 193 15 -70 36 -24 53 199 -118
7786 -118 -233 34 -23 -156 42 -97 -55 85 -156 30 103 -35 26 -169 141 35 -132 -212 -197 -269 -67 86
7808 86 98 -58 -62 -1 -179 -15 -84 432 1 -166 -59 -293 -86 81 -138 -273 -91 93 -73 38 202 72
7830 72 -117 113 116 -208 -146 6 70 59 130 247 0 -258 -297 -51 -297 -112 83 -236 226 -71 94 -64 -226
7853 -226 -64 123 80 -100 68 265 183 -145 114 56 -187 -41 -132 45 -345 -5 132 4 36 -16 -37 135
7875 135 70 -104 53 -355 -64 29 -5 15 238 65 -83 180 199 -155 -188 164 -98 -276 62 114 221 85
7897 85 -208 -326 -214 -105 -8 -92 53 35 -133 47 -102 40 -81 39 -52 118 -57 5 58 -66 43 -71
7919 -71 0 157 100 112 56 -26 107 -138 -125 -70 71 3 -145 -296 87 -95 -12 30 -269 -73 -137 -33 64 113 -58
7944 -58 56 257 3 182 -52 463 -79 0 -104 23 44 321 -204 -164 75 -186 -19 60 102 -190 -65 -20
7966 -20 -203 53 -166 -96 65 -121 36 174 -96 151 -143 -77 58 3 230 117 -191 -110 -215 -1 -88 -130
7988 -130 334 -67 74 -149 79 -135 216 95 215 -235 -233 27 -96 52 -290 -210 -208 -107 -40 11 -122 -17
8010 -17 -63 -22 198 16 -119 16 49 -77 47 34 -238 -144 -229 61 58 253 107 190 58 171 89 282 -131 -113
8034 -113 158 255 241 -85 13 -74 200 -32 179 119 -99 -162 66 34 93 18 175 -81 23 155 0 -9 29 -13
8058 -13 186 -123 126 -41 -230 22 -26 -104 158 -20 -32 89 88 -65 -77 218 126 78 153 89 91 -56 -177 49
8082 49 2 31 173 -125 -39 85 41 185 126 -88 103 -9 221 88 173 89 106 115 -237 76 -189 -163 124 162
8106 162 257 28 121 -92 -73 -14 26 -120 81 64 -173 -70 125 -48 62 11 48 -44 213 106 -42 -15 202
8129 202 -144 -31 -107 -259 116 27 -217 -110 151 20 -46 69 171 -228 72 -126 3 -103 113 200 -153
8150 -153 74 -259 -22 -1 -140 192 102 263 -117 153 354 -89 10 28 158 304 53 -88 173 69 212
8171 212 176 -106 -21 -228 -229 -60 24 79 364 115 -4 66 -82 91 137 -110 -35 357 38 -91
8191i1
##END NTUPLES=NMR FID
##END=
