##TITLE=1H_SR81 ASP
 CDCl3, 8 sc, 
 31.8.2021
##JCAMPDX= 6.0         $$ Bruker NMR JCAMP-DX V2.0
##DATA TYPE= NMR FID
##DATA CLASS= NTUPLES
##ORIGIN= UXNMR, Bruker Analytische Messtechnik GmbH
##OWNER= root
$$ XWIN-NMR		Version 3.5
$$ Tue Aug 31 10:21:28 2021 Russian Standard Time (UT+4h)  she@DPX200
##.OBSERVE FREQUENCY= 200.131506
##.OBSERVE NUCLEUS= ^1H
##.DELAY= (6, 6)
##.ACQUISITION MODE= SIMULTANEOUS
##.ACQUISITION SCHEME= undefined
##.AVERAGES= 8
##.DIGITISER RES= 18
##SPECTROMETER/DATA SYSTEM= spect
##.PULSE SEQUENCE= zg30
##.SOLVENT NAME= CDCl3
##.SHIFT REFERENCE= (INTERNAL, CDCl3, 0, 15.7039)
##AUDIT TRAIL= $$ (NUMBER, WHEN, WHO, WHERE, WHAT)
$$ ##TITLE= Audit trail, XWIN-NMR		Version 3.5
$$ ##JCAMPDX= 5.01
$$ ##ORIGIN= Bruker BioSpin GmbH
$$ ##OWNER= she
$$ F:/spectra/data/she/nmr/H-F/1/audita.txt
$$ ##AUDIT TRAIL=  $$ (NUMBER, WHEN, WHO, WHERE, WHAT)
(   1,<2021-08-31 10:20:31.56 +0400>,<she>,<DPX200>,
      <created by zg, POWCHK disabled, PULCHK disabled
       configuration hash MD5:
       00 E9 B6 7A A2 85 ED C7 34 08 36 98 17 FE 4E 26
       data hash MD5: 16K
       DF 56 67 DA 76 2F 31 9A 9C 9F 8E 27 69 AF E3 E4>)
$$ ##END=
$$ 
$$ hash MD5
$$ F4 2A 1E C6 BF 0E 65 13 B8 CA 7B 10 B4 DA E3 4D
##$RELAX= 
##$RELAX= 
##$RELAX= 
##$RELAX= 
##$RELAX= 
##$RELAX= 
$$ Bruker specific parameters
$$ --------------------------
##$DU= <F:/spectra>
##$EXPNO= 1
##$NAME= <H-F>
##$PROCNO= 1
##$TYPE= <nmr>
##$USER= <she>
##$AMP= (0..31)
100 100 100 100 100 100 100 100 100 100 100 100 100 100 100 100 100 100 
100 100 100 100 100 100 100 100 100 100 100 100 100 100 
##$AQSEQ= 0
##$AQ_mod= 1
##$AUNM= <au_zg>
##$AUTOPOS= <>
##$BF1= 200.13
##$BF2= 200.13
##$BF3= 200.13
##$BF4= 200.13
##$BF5= 200.13
##$BF6= 200.13
##$BF7= 200.13
##$BF8= 200.13
##$BYTORDA= 1
##$CFDGTYP= 0
##$CFRGTYP= 5
##$CHEMSTR= <none>
##$CNST= (0..31)
1 1 145 1 1 1 1 1 1 1 1 1 1 1 1 1 1 1 1 1 1 1 1 1 1 1 1 1 1 1 1 1 
##$CPDPRG= <>
##$CPDPRG1= <>
##$CPDPRG2= <>
##$CPDPRG3= <>
##$CPDPRG4= <mlev>
##$CPDPRG5= <mlev>
##$CPDPRG6= <mlev>
##$CPDPRG7= <mlev>
##$CPDPRG8= <mlev>
##$CPDPRGB= <>
##$CPDPRGT= <>
##$D= (0..31)
0 1.2 0 0 0 0 0 0 0 0.06 0 0.03 0 0 0 0 0.0002 0 0 0 0 0 0 0 0 0 0 0 0 
0 0 0 
##$DATE= 1630390831
##$DBL= (0..7)
120 120 120 120 120 120 120 120 
##$DBP= (0..7)
150 150 150 150 150 150 150 150 
##$DBP07= 0
##$DBPNAM0= <>
##$DBPNAM1= <>
##$DBPNAM2= <>
##$DBPNAM3= <>
##$DBPNAM4= <>
##$DBPNAM5= <>
##$DBPNAM6= <>
##$DBPNAM7= <>
##$DBPOAL= (0..7)
0.5 0.5 0.5 0.5 0.5 0.5 0.5 0.5 
##$DBPOFFS= (0..7)
0 0 0 0 0 0 0 0 
##$DE= 6
##$DECBNUC= <off>
##$DECIM= 32
##$DECNUC= <off>
##$DECSTAT= 4
##$DIGMOD= 1
##$DIGTYP= 9
##$DL= (0..7)
0 120 120 120 120 120 120 120 
##$DP= (0..7)
150 150 150 150 150 150 150 150 
##$DP07= 0
##$DPNAME0= <>
##$DPNAME1= <>
##$DPNAME2= <>
##$DPNAME3= <>
##$DPNAME4= <>
##$DPNAME5= <>
##$DPNAME6= <>
##$DPNAME7= <>
##$DPOAL= (0..7)
0.5 0.5 0.5 0.5 0.5 0.5 0.5 0.5 
##$DPOFFS= (0..7)
0 0 0 0 0 0 0 0 
##$DQDMODE= 0
##$DR= 18
##$DS= 0
##$DSLIST= <SSSSSSSSSSSSSSS>
$$ [...]
##$SUBNAM2= <"">
##$SUBNAM3= <"">
##$SUBNAM4= <"">
##$SUBNAM5= <"">
##$SUBNAM6= <"">
##$SUBNAM7= <"">
##$SUBNAM8= <"">
##$SUBNAM9= <"">
##$SW= 20.0188882624521
##$SWIBOX= (0..15)
0 0 2 0 0 0 0 0 0 0 0 0 0 0 0 0 
##$SW_h= 4006.41025641026
##$TD= 16384
##$TD0= 1
##$TE= 0
##$TE2= 300
##$TE3= 300
##$TEG= 300
##$TL= (0..7)
0 120 120 120 120 120 120 120 
##$TP= (0..7)
150 150 150 150 150 150 150 150 
##$TP07= 0
##$TPNAME0= <>
##$TPNAME1= <>
##$TPNAME2= <>
##$TPNAME3= <>
##$TPNAME4= <>
##$TPNAME5= <>
##$TPNAME6= <>
##$TPNAME7= <>
##$TPOAL= (0..7)
0.5 0.5 0.5 0.5 0.5 0.5 0.5 0.5 
##$TPOFFS= (0..7)
0 0 0 0 0 0 0 0 
##$TUNHIN= 0
##$TUNHOUT= 0
##$TUNXOUT= 0
##$USERA1= <user>
##$USERA2= <user>
##$USERA3= <user>
##$USERA4= <user>
##$USERA5= <user>
##$V9= 5
##$VALIST= <valist>
##$VCLIST= <CCCCCCCCCCCCCCC>
##$VD= 0
##$VDLIST= <DDDDDDDDDDDDDDD>
##$VPLIST= <PPPPPPPPPPPPPPP>
##$VTLIST= <TTTTTTTTTTTTTTT>
##$WBST= 1024
##$WBSW= 4
##$XGAIN= (0..3)
0 0 0 0 
##$XL= 0
##$YL= 0
##$YMAX_a= 186941
##$YMIN_a= -180855
##$ZGOPTNS= <>
##$ZL1= 120
##$ZL2= 120
##$ZL3= 120
##$ZL4= 120
##$ABSF1= 10
##$ABSF2= 0
##$ABSG= 5
##$ABSL= 3
##$ALPHA= 0
##$AQORDER= 0
##$ASSFAC= 0
##$ASSFACI= 0
##$ASSFACX= 0
##$ASSWID= 0
##$AUNMP= <proc_1d>
##$AZFE= 0.1
##$AZFW= 0.1
##$BCFW= 1
##$BC_mod= 2
##$BYTORDP= 1
##$COROFFS= 0
##$CY= 11.3945322036743
##$DATMOD= 1
##$DC= 2
##$DFILT= <>
##$DTYPP= 0
##$F1P= 2.36226072786647
##$F2P= -0.459571619588291
##$FCOR= 0.5
##$FTSIZE= 0
##$FT_mod= 4
##$GAMMA= 1
##$GB= 0.15
##$INTBC= 1
##$INTSCL= 1
##$ISEN= 128
##$LB= 0.24
##$LEV0= 0
##$LPBIN= 0
##$MAXI= 10000
##$MC2= 0
##$MEAN= 0
##$ME_mod= 0
##$MI= 1.114404
##$NCOEF= 0
##$NC_proc= 0
##$NLEV= 6
##$NOISF1= 3.799351
##$NOISF2= 2.8
##$NSP= 1
##$NTH_PI= 0
##$NZP= 0
##$OFFSET= 15.70392
##$PC= 1
##$PHC0= -13358.78
##$PHC1= 7.200991
##$PH_mod= 1
##$PKNL= yes
##$PPARMOD= 0
##$PSCAL= 0
##$PSIGN= 0
##$REVERSE= no
##$SF= 200.130013532006
##$SI= 16384
##$SIGF1= 3
##$SIGF2= 2
##$SINO= 400
##$SIOLD= 16384
##$SREGLST= <1H.CDCl3>
##$SSB= 0
##$STSI= 0
##$STSR= 0
##$SW_p= 3612.71676300578
##$SYMM= 0
##$S_DEV= 0
##$TDeff= 0
##$TDoff= 0
##$TI= <>
##$TILT= no
##$TM1= 0
##$TM2= 0
##$TOPLEV= 0
##$USERP1= <user>
##$USERP2= <user>
##$USERP3= <user>
##$USERP4= <user>
##$USERP5= <user>
##$WDW= 1
##$XDIM= 8192
##$YMAX_p= 0
##$YMIN_p= 0
$$ End of Bruker specific parameters
$$ ---------------------------------
##NTUPLES= NMR FID
##VAR_NAME=  TIME,          FID/REAL,        FID/IMAG
##SYMBOL=    X,             R,               I
##VAR_TYPE=  INDEPENDENT,   DEPENDENT,       DEPENDENT
##VAR_FORM=  AFFN,          ASDF,            ASDF
##VAR_DIM=   8192,          8192,            8192
##UNITS=     SECONDS,       ARBITRARY UNITS, ARBITRARY UNITS
##FACTOR=    0.0002496,     1,               1
##FIRST=     0,             0,               0
##LAST=      2.0444736,     0,               0
##MIN=       0,             -180855,         0
##MAX=       2.0444736,     186941,          0
$$ Real data points
##PAGE= N=1
##DATA TABLE= (X++(R..R)), XYDATA
$$ [...]
1926B50j18M21l80P2J95p5n5q1J60J1j64K28l5j60J63r8l23L69k19J86P1k41p
1949A70pRQK1q9n9J90k25P0M1RN7l33J18q1k18K08j31P3j4J69l14m0R6J72j23
1975b23M3k22R6j95PJ74K30m36K35K6l32K05n9j63P8j7K3R8n5J35o0j30J9J12
1999d11k01K23r4J06l09K49K24J47k71J7J3J17K8l91J46L61q3J03k37P7J4J40
2021c2JJ03k26q2J66L7j98L11L2k81K7K82l0k41Q7j2K49l9r9JK22j68k19M36k06
2046A21L5J09l44L61o0mn04M55K03k33O3q8K77l18J5j17K69J01j87L4O1l32M46
2069C63l46n6K3K29m3q3j31L33l74K60P8l17K49j21j07L86k52m4J34M5r2NQ1Q1
2093C01R0j43l7O6L57k67Pk8m6o0j99L0P1J37J08j15j94M7M9J61k00M0p9j12L03
$$ y = [250, 132, 553, 173, 245, 440, 365, 310, 229, 389, 400, 236, 464, 429, 269, 432, 334, 11, 380, 161, 347, 418, 177, 170, 163, 172, 180, 201, 112, 53, 243, 18, 88, 129, 138, 195, -138, -20, -101, -319, -111, -242, -169, -183, -14, -328, -368, -272, -100, -223, -180, -402, -306, -501, -494, -320, -90, -526, -291, -265, -597, -392, -451, -614, -536, -553, -530, -432, -487, -352, -412, -542, -523, -411, -612, -389, -483, -377, -686, -437, -213, -66, -337, -320, -307, -190, -162, -553, -407, -46, -129, -26, -263, -186, -172, -32, -31, 72, -154, -236, -70, -33, -231, 80, 112, -169, -142, 140, 110, -131, -44, -56, 193, 154, 55, 56, 278, 110, -109, 327, 121, 156, 265, -79, 282, 222, 218, -286, 169, 372, 139, 202, 114, 391, 73, 88, -29, 240, 341, 154, 188, 249, -83, 363, 17, -39, -16, 213, 170, 87, -44, 289, -85, 175, 253, -64, 185, 64, -43, 343, 91, 47, 181, 226, 134, 139, 220, 301, 391, 248, 211, 277, 634, 367, 374, 346, 300, 240, 41, 71, 142, 279, 387, 272, 78, 125, 174, 335, 135, 175, 96, -16, 287]
2118B87n3j15L2L84j66k75m9qO7J23k25m8K13j56j27J01J43M5o95K86O7K36k4
2141D3l65J93j20J48q4J16j90K14l66J03J29R9m6l82K85k2j71k2K27p0J32Mj75
2164c20R7l35J94O2J08J52l56r4J11J48l03L78k38r6j7M37r2j60p8K29k23M01
2186El05O4Jr8J60l0O8j71M02k43J30L5q2o2m5K36K29K7j06l93L26j57J77O7n3
2211A82K39k99J78j3j24k0k38M19k03M3J23k31j31K14n9k42M99j30m3K3L6oJ40
2234C57J27k48j46J30K57l42K89j49n2j25J2oQ6J34m91L59J28j42M6k04o9K25
2256A76j1K47l15K8Pj35K31K24n63K75q8Q3j71K65j39j10K48l23J2K05j06N5J45
2279B40j68J02N9Q8l81J48M6l16L68p6j64J39l1L39l50j53J93Q7J3R3k18K79m71
$$ y = [287, 234, 119, 151, 535, 369, 94, 45, 37, 104, 227, 2, -46, 167, 11, -116, -15, 128, 173, -522, -236, -169, 67, 43, -322, -129, -249, -101, -185, -69, -259, -45, -411, -308, -179, -80, -126, -508, -223, -245, -416, -438, -211, -281, -149, -145, -320, -223, -558, -364, -302, -194, -42, -398, -492, -381, -233, -536, -158, -396, -492, -509, -72, -164, -324, -402, -173, -396, 5, -300, -236, -235, -333, -173, -203, -135, -306, 96, -147, -17, 18, -64, -126, -171, 65, 294, 321, 215, -178, 148, -9, 168, 235, 182, 421, 122, 300, 287, 163, 143, -95, 324, 121, 164, 287, 56, -75, 139, 80, -162, 337, 207, 164, 187, 223, 217, 357, 484, 236, 90, 220, 477, 135, 424, 275, 223, 98, 110, 104, 190, 324, -167, 192, 320, 178, 224, 20, -49, 176, 165, 412, 97, 125, 132, -3, 228, 452, -111, 164, 76, 159, -12, 253, 114, 4, 252, -71, -59, 146, 40, 95, 240, 72, 174, 233, 321, -60, 88, 134, -182, 186, 110, -54, 85, 54, 393, 43, -110, 83, 170, 183, 276, 58, 337, -134]
2302a34M43l18PJ02j91n9j83M04L1k65J4k8L3p7K41L4k1k41j7J72K5k42J57K43
2326A30j19l06K5J9J10j11L36m08P7J08m3Q5j44k11R6O9qj54J17K37l37J91K69
2349B8l42O8j43L35l23N2M4J42n1K16m82L15P2Q8kn5j4j15K24k41k9K03P5j43
2373g8j3J24R2k68J37k46J80O3j29J9N45n90K49l9M1K16m18J36L47j54k03K94
2395C05l9J87j67Q1j81k6L6r7K1J11j84K60j78k14K61k09L40k5j96m4K06n2k08
2418a2K94k16J14j00j6K8K78k44k28L26k78J4K14J30m95J14J42k0p5L1j55R7R4
2441C7j24r8K62N1R7j59J20o3r0K38l45K02O5k10l2j26L11k08J52J01q7k18K53
2464A29j64J02J83k01P3m9k13K35o3J1j75j7J36n5lP5nQ3j70j68J86n5J57J42
$$ y = [-134, 309, -9, -2, 100, -91, -150, -333, 71, 102, -163, -149, -177, -144, -221, 20, 54, 33, -208, -225, -53, -28, -270, -113, 130, 11, -295, -270, -251, -141, -252, 84, -324, -247, -139, -182, -97, -241, -452, -356, -287, -295, -449, -332, -95, -432, -241, 28, -314, -246, -389, -54, -377, -325, -281, -139, -190, 26, -456, -141, -69, 19, 17, -38, -52, -167, 57, -184, -213, -10, 65, -78, -91, 33, 125, -143, -6, -252, -72, -9, -138, -119, 426, -164, 85, 46, 87, 303, -115, 21, 368, 214, 11, 305, 266, 453, 286, 367, 186, 160, 196, 99, 120, 231, 47, 307, 129, -85, 176, -33, 307, 282, 86, 42, 248, 196, -12, 282, 66, 180, 80, 64, 92, 370, 126, -102, 224, -54, -40, 174, 304, -191, -77, 65, 45, -30, 1, -154, -57, 37, -87, -185, 77, 128, 225, 66, 186, 123, 33, 271, -74, 128, 193, -17, -49, -175, 136, -72, 80, 181, 94, -124, 129, -35, 67, 250, 49, 122, 73, -140, 95, 32, 43, -132, -149, -13, -68, -71, 4, -1, 82, -88, -256, -70, -125, 32, 174]
2488A74j95k8j18j41q2L77L47m82K25k38L95j93p8k32j12J67k1j50L32N3j66J11
2510e5j58J57m5k10J90J24P8j08j31K7M8k8k3q1P8j03O4m1N0R4M5M1k84L46k15
2535a40m2O3J4r4L67k3J2j48M2J2K08k46l1k61L94o5nJ45K9q0J97m4Kj31q6N6
2561A45pm6K03j52p7P6j41K70j97j41N30j61m5J40k48J2l2K53J13l65Q2o3N1J29
2585C29r0k05O7j58L2J12J0M2r3J39j6m3J57j71K4j3k89O47m63r9k0o1r8J10O7
2610h3J34l10K03J15o2o3N4J44l78K83k07L96J0m25J87l01L36N9J26k20R6j73
2632g9k14N36k70R2j01p7J46M5j56j7P8O0j92J05k10J98R9K95j95m54J90J1J12
2655Bj1n1k62M06k65L06J3j65P5l83M51J7j35J73k09K97l13J42km2k10L16l61
$$ y = [174, -21, -49, -167, -308, -390, -13, 334, -148, 77, -161, 234, 41, -37, -269, -381, -214, -235, -385, -53, 0, -166, -55, -213, -56, -101, -311, -121, 3, 81, -27, -158, -131, -83, -111, -134, -215, -137, -240, -176, -217, -167, -73, -28, 13, -271, 75, -140, -182, -119, -105, -199, 168, 145, 157, 9, 51, 63, 271, 25, -6, -267, 127, 62, 57, 202, 231, 151, 348, 304, 306, 175, 89, 145, 138, 92, 295, 143, 66, 142, 1, 271, 74, -67, 463, 302, 257, 397, 149, 161, 129, 382, 495, 130, 212, 149, 200, 329, 239, 34, 101, -57, -25, 87, 97, 139, 46, 185, 169, 126, 283, 112, 136, 123, -166, 481, 18, -81, -101, -162, -260, -150, -83, 51, -259, -56, 59, -3, -66, -12, 132, -246, 37, -170, 226, 236, -189, -2, -303, 33, 92, 218, -2, 94, -79, -293, 243, -27, 65, -36, -113, 33, 78, -78, -95, -17, 43, -149, -44, -254, -56, 43, 338, 143, -311, -121, -110, 2, -9, -60, -322, 84, -181, 125, 138, -27, 48, -335, 116, 133, -2, 171, -38, 259, -54, 88, 86, 44, -166, 150, -211]
2678b11R8K17j02j15j72J91j08J06J66j70j91L66p8k37K43j91q7K59p0jJ22k42
2700b07J78l2l3L3q8J68q3K59j07k54K99l20J83k22J42J75j50J32k39P0Q7p9J1
2723g7K79lj31j77K77m3j87J41l6J10j29l3p2R7o8L53m90K75R4l2j25n6M68l76
2747E9RqJ26J5L8j21L8j21k9r4L40j64n1J16j22J13k7k3J32k76K18m62L95P1k21
2772d9K04k59K6k47K05K33q9%O1K92l64K5j64J50k10J45l72K98N3L17k79%j80
2795b04l8QJ27q5J45Qn7j38O5K8N7n5R6j99r5K23J31l95K88J92j03k51K15J43
2819A06j38K08k25l74N42l32L1K63j54k51J45Q0L1J0l3j67M51l90nr3M21l09J06
2842g7J61j94J55j08m2J10Kj75P3R7q4o5M15j38k53J5R8o5l0q5K52l4r8J62l13
$$ y = [-211, -113, 104, 2, -113, -285, -94, -202, -96, 70, -100, -291, 75, -3, -240, 3, -188, -275, -16, -86, -87, 35, -207, -29, -61, -94, -61, -149, 19, -64, 195, 88, -166, 133, -187, -4, -226, -84, 91, -59, 73, -166, -96, -9, -88, -77, 202, 199, 68, -109, 168, 125, -62, 79, 43, 153, 24, -9, -81, 16, -52, 301, -189, 86, 180, 148, 23, -33, 435, 59, 68, 60, 186, 201, 239, 118, 156, 35, 6, -88, 252, 88, 37, 153, 31, 144, 117, 94, 226, -50, 168, -294, 101, 172, -49, 155, -104, -78, -325, -120, 113, 24, 24, 85, 377, 13, 38, -126, 24, -186, -41, -413, -115, -62, 255, -24, -24, -204, -242, -234, -107, -192, -47, -39, -96, -234, -169, -141, -84, -139, -43, -242, -337, -114, 17, -378, -90, 102, -1, -252, -37, 106, -32, 176, -49, -423, 119, -213, -182, 81, -73, -324, -179, -99, -68, -58, -91, -258, 193, -197, -202, -295, 126, -183, -77, 84, -110, 45, -63, -105, 5, 7, -168, -95, 2, -82, -147, 268, 130, -123, -108, -10, -75, -105, -190, 62, 28, -70, 92, -221]
2867b21J67Q7l8Q9k23J02j18M67k38Mkj40j55K16J9l6J27k98J45J39J19l45Q5
2890d8N7J21Q5q0j25k44L04k25J35j44K24k71L94j18M8m3J61j79J37J23k33J8
2912I7K84j04J00l63R4J35k57L22j62J3O8j76K7k27L74j66J07L0J70n7j06q8n8
2935E7J12k4P2k48J95k85K27k04N7J6R3p1P6k2oJ23k9k06k16K84K0J59m06K40
2959A4O7k61J67l29K99J01J7k27O0o4Q4j98j3L22J62l21Mj17K49ok09L46K4l89
2983b18J2Q1J66q1k27M20m83K63K82l57K61l21J44k0J1O6j84J35QJ9r4J50l16
3006b83K46N1o0R6j81K7j43K82k8R1k33K13J18Q7l45M5l7qK80j95R6k76MJ60P6
3031H3k27k8K33j46nk04K97R0p2j81K54j71m3J77k86M7pM40n51M76l90K14o3N6
$$ y = [-221, -54, 33, -5, 84, -139, -37, -155, 312, 74, 78, 76, -64, -219, -3, 16, -20, 107, -191, -46, 93, 212, -133, -48, 9, 130, 215, 135, 10, -234, 70, -155, -20, -164, 60, -211, 183, 65, 113, 70, 231, 52, 189, 312, 79, 97, 381, 277, 377, 14, 108, 243, -14, 308, 146, 159, 227, 51, 78, -149, 225, 59, 166, 196, 366, 309, 203, 115, 57, 169, 145, 217, -31, 164, -121, 106, -98, -41, -25, 68, -3, 73, 51, 45, 168, 139, -67, -283, 1, 21, 180, -226, 14, 81, -180, -13, -342, -43, 58, 75, -152, -92, -156, -72, -270, -283, 39, 201, -120, -116, -233, 16, 10, -199, 147, 171, -218, -206, -125, 41, -40, -267, 153, -330, -67, 215, -142, 119, -202, -58, -78, -67, -1, -185, -50, -42, -23, -117, 33, -283, -37, 14, -46, 50, -131, -104, -247, 35, 7, 98, -135, 78, 196, 283, -62, -17, -54, -62, 218, 23, 119, -157, -153, 7, 83, -144, -172, 61, -85, -90, -294, 3, 93, 21, -160, 94, -77, -120, 57, -229, -182, -189, 251, -300, 176, -214, 0, -63, -7]
3055gj04Q6m4J92k14K3J6P7j31Q5j22M35j64J2k77J48J60l25j5K97m5j91P7j98
3079b29K89rO8j27l5K68k66J1K48q4O4l5j10j56J57m7J1p1K81j32l49M04k23J53
3103H1J92m16L25j21K6k1l45K97J7R4k77K01r2R2o5M5j39R1k21O62m33j95O6J3
3127a23K18J00o5k59J73J0J82k65J10j22r2R9N1j85K01l70M37j19n8j66M5M39
3149B41j17j89k97Q8J82J46j23k21L14k45J15r3J14K40l30L47l7k27P7J88k85
3170a12O5J42p2P6j70N6m1m1r4L49k98J69j17K61j2k68J91K93m07L8K46m03J53
3193Dl18M3K40M6K13m0j26J04j97L17l87r1J87K99m15m4K12l8J88k65J4O7k7P2
3217E8jp9j7m6k9Q1k77J41j48M36p3o7J7j18J52j45K70L5k69Q8L7K4O4M6l14K18
$$ y = [-7, -111, -25, -69, 123, -91, -68, -52, 25, -106, -21, -143, 292, 128, 140, -137, 11, 171, -154, -169, 128, 83, -108, -31, -229, 60, 51, 119, -8, -43, 225, -41, -30, 218, 134, 198, 163, 53, -103, 54, 7, 18, -53, 228, 96, -253, 151, -72, 81, 273, -143, 182, 61, 87, 66, -279, 18, 35, 129, -148, 53, -39, 53, -12, 33, -106, -15, -236, 426, -7, -202, -136, -123, 95, 195, 130, -129, 44, 54, 236, -29, 81, -41, -133, -34, 17, -168, 33, -337, 100, -19, -77, -243, -198, 241, 124, -65, -362, -274, -92, 54, -69, -290, 24, -221, -106, -199, -85, 155, -175, 172, 135, -92, -15, 173, -112, -47, 95, 23, 99, -71, -15, -56, -97, -191, 158, -140, 29, -88, 173, 161, -107, 84, 377, -30, 8, 254, -149, 4, -314, -271, -31, 15, 228, 188, 62, 166, -31, 286, -101, -192, -5, 294, -121, -165, 47, 9, 197, -68, -54, 13, -14, 58, 57, -22, -39, -85, -114, -33, -310, -169, -317, 119, 46, -21, -4, -122, 30, -115, 155, 190, -79, 9, 46, 70, 134, 180, -134, 84]
3243H4J22l17K91k57K5n8J25K36j86J65rR8k76J76k35K99n6k23K6p5J77J06j77
3266F1o5J06k33L72j35K59o6l08K5J11n5J23k55K3J69j66L4k46J72O0K48j73R
3289G0j35J67r2J47k76J37O3p2L18l37K07j58J65m45N6J89o8k35J75PM8j77K23
3312b3K35l53m4l8K52o2k06K27o0j37k01L39J67J89l7rl11n2k0K38l91L3L03j68
3336a29j8J84l7j16Q7L44j52k98Q7j92O7K37j33M6K9N6M4k78J41O7P0o2q2J05
3360F7m7P1N4j71K21j53K6J64m28K29OK40k13q0J77p2L7J02j29J8j62q4K92j30
3384C5q3K58J42j1l56J62k52J38l13M47l39J84J64p0l58K41%j42J13K06j62K64
3406B68j10k04J87k49K93k92R0p8L10m04L19o3%P8N0k12K57k92J47n1j26K84k06
$$ y = [84, 206, -111, 180, -77, -52, -110, 15, 251, 65, 230, 221, 319, 43, 219, -16, 283, 227, 4, 30, -45, 132, 238, 61, -4, 102, -131, 241, 106, 365, 299, -9, 16, 127, 72, 195, -60, -37, 132, -34, 0, -246, -74, -14, 234, 61, 70, -65, 102, 10, 157, -119, 18, 81, 9, 327, -10, 197, 39, 204, -241, -185, 4, -64, -299, -124, -117, -69, -246, -23, 212, -141, -185, -223, 29, -33, -239, -12, -72, -209, -410, -71, 96, 285, 248, 239, -72, -124, -144, 94, -297, -264, 39, -129, -147, 37, 0, -116, -29, 315, 163, -135, -48, -240, -173, 64, -69, -23, 6, 62, 106, -172, -31, 36, 106, 44, -38, 67, 20, 91, 145, -26, 195, 42, 68, 232, -196, 33, 39, 279, 66, -14, 163, 91, 128, 230, 101, 119, -43, -127, 165, 35, -48, 210, 352, 341, -15, 147, -105, 33, -280, 167, -172, 12, 176, 106, -252, -11, -11, -153, -40, 166, 4, 268, 158, -46, 141, -108, 185, -107, -17, -95, 215, -189, 130, 67, 67, 145, 195, -17, 240, -52, 95, 44, -82, 202, -4]
3429dL8k02Q4N8NN6J33R2k46L30k54k09j4p7J18RK80j11N9o2J13j12l61K78l6
3454c5l5K9J82K4l09J91k8rQ1j77j01P8L12l20K28j45N8p4j64J43j61K81r3KJ10
3479F8l62L71m45L94k12J75J67m05L58J9k43l1K97j16K06k75o7r1N6J76J19l56
3501a97J44J15Pk68N4K40j33l9J50j29K58j07k23Q9j38K13j18j01K07J17j13j13
3523h5n4J61j21M7j19O2l0L4K12j59J33L5k65k0R4J10M5q5j7m4K70J4r8j84J13
3548D9M3k05J05k37N66l83J83j60K23j30j69K24k11K59j79N8rj46J98q5K34j39
3570H9r0J3jj42O3K40l10J90K01k70k2M6R5N1J13k63m7pK47j90j00J95M7j55J74
3595A67m30L54K0k2j82k6J97l6qj46J13N3l2j72K31j87j03P8M0P5K08J2l2l04
$$ y = [-4, 34, -168, -84, -26, -21, 35, 168, 260, 14, 344, 90, -119, -133, -210, -92, -83, 197, 86, 145, 83, 196, 84, -277, 1, -35, -70, -41, 141, 165, -144, 47, 19, 10, 91, -86, -187, -109, 203, -117, 111, -34, 24, -50, -214, -71, -232, 49, -44, -42, 68, -294, 77, -368, 26, -186, -11, 156, -249, 109, 128, -115, -146, 151, 35, 241, -34, -101, -192, -136, 40, 159, -197, -53, 62, 69, -199, -145, 95, -38, -77, 73, -56, 202, 95, -128, -39, -177, 36, -82, -183, 24, 141, 28, -85, -139, 22, -99, -52, -171, -109, -139, -105, 107, -52, 81, 116, -149, -169, -75, 35, 80, -5, -22, -66, 204, 218, 120, -64, 49, 92, -113, -8, -245, 321, -62, 121, -39, 184, 54, -115, 109, -102, 157, -22, 36, 27, -119, 79, -6, 228, 89, -1, 12, 11, -131, -68, 172, -138, 52, 253, -17, -39, 7, 102, 153, 266, 3, -44, -51, 196, 6, -94, 101, 148, -7, 167, -263, 91, 111, 89, -93, -119, 78, 42, 34, -112, 1, 54, 22, -150, 81, -106, -209, -131, -91, -16, 192, 204, 172, -132]
3619a32L52k95j13L37j58K78J9m13K23J44p2j15n0r1J47Q9q7n7K24j84j19J53
3641H0k65J51p2Q1J87n9J7j69j2J17q9O7q7P2l3P3Q9q6r9Q7J4j80Nl3K3o3n7J12
3669a29J20Q4j44J96k39kJ78m5k03K92n9k56K38k2P6m1k10O7K62j87K23k12n4
3692f7K1J47j69O6J17mj78O0N8O1J15l9j40K63k18J60j87J0J74k50j9j28R8p7
3716a26K43j38l3J9J78j14j50J26j28N1r6K23J0k47K20o7N0l6J07j1k66M4K55
3739A14K71l5l84J4P1j90J38J66K06p53M05j05K32j34j57M74o27J39K49R0k49
3760f5r0k1K76jqk24J49r3J88j32J00j49J21j39K00l00M10l19K50l93K42j82J45
3783c5L03l95K46k72J17n5J28R1k11J4J08r6J14m5o5pJ40L1J10j28o3j26L54k7
$$ y = [-132, 220, -75, -188, 149, -9, 269, 288, -125, 98, 242, 170, 55, 5, -86, 61, 150, 63, 6, 230, 46, -73, 80, -185, -34, -106, -25, 162, 103, 120, -49, -61, 56, -33, 34, -53, 19, -14, 59, 148, 62, -37, 50, 64, -116, -111, -144, -121, -184, -241, -129, -9, 75, -69, 127, -112, -114, 64, 19, -184, 108, 49, -207, 31, 9, 85, 44, -166, -99, 163, -24, 199, -13, -67, -46, 101, -68, -2, 115, 111, -67, -7, 51, 112, 227, 188, 48, 311, 93, 253, 66, 76, 250, 0, -19, -147, -49, -126, 117, -21, -54, -35, 143, 29, -121, 5, -123, -72, -168, 55, 65, -182, 38, -29, 21, -15, 92, 81, -185, -141, 114, 385, 350, -34, -20, 51, -139, -1, 165, 371, -382, 23, -82, 150, 16, -141, 333, -294, -155, 94, 184, -65, -155, -176, 100, 99, 91, -133, 16, -77, 111, -21, 79, -70, 51, -88, 112, -188, 222, -97, 153, -240, 2, -180, -35, 268, -127, 119, -153, -36, -91, 37, 128, -83, -69, 39, -57, 57, 12, -53, -60, 80, 111, 221, 93, 30, -96, 258, 231]
3807B31k19J29M0l08L92k42Mk41L11m4j59L3J64l04P3p4L57om7N1k40J35L8r7
3831b3J51J01k24j18%J99k10J38r2l1pJ51k21p8L53m02L68j21J5j97K39r0K3J7
3855e9j22L38j02R3j99J55N1k16K8j85o1L29j59J5K10K0l11K92l64L11J99m03
3877a40K35j6J07k95j05M48l02J79k19j19j9K41K7R5Kj36j12j4J84j96L14j61
3899br2K12J90l47J20P4m3k50j23m3M75j30k14L26J85l58j4J82k36k9R1Q1r0J82
3923A47R7j15k3k17K76j91n4j47M11j26qj03r9K50m03J92J81j91K03j20K25r0
3945I5k9j20j92L67k72K72k50K55k2j33j11J88j3m6p4N5j0j79K20L5j99K92j60
3968c1J76l07J12K91j83K46j58o8r5M0n8l0k10K83K54j88k65K51n2k21K73j53
$$ y = [231, 12, 141, 181, -127, 265, 23, 27, -214, 97, 53, -106, -73, 91, -213, -140, -214, 143, 137, 90, 141, -99, 36, 74, -23, 128, 229, 5, -113, -113, 86, -124, 14, -78, -109, -116, 35, -186, -264, 89, -313, 55, -66, -51, -248, -9, -99, -76, -59, -181, 157, 55, 148, -51, 104, 155, -61, -33, -218, -279, 50, -109, -94, 116, 136, -175, 117, -247, 64, 263, -140, 95, 79, 186, -109, -214, 234, -68, 111, -108, -227, -246, -5, 22, 117, 119, -17, -129, -143, 41, -155, 159, -2, -94, 118, 308, -39, 81, 155, 112, -138, -261, -304, 171, 41, -173, 153, 338, -20, -34, 148, -88, -117, -26, 55, -35, 147, 244, 129, 106, -111, 165, -26, -80, -227, 184, 58, 50, -53, -152, 98, -305, -113, 68, -123, 80, -40, 185, 95, 66, -54, -246, 121, -151, 121, -129, 126, 104, -29, -140, 48, 35, -11, -85, -30, -40, -219, 1, 36, -163, 129, -31, 145, -162, -50, 241, 58, 304, 146, 78, -17, 23, -35, -65, -275, 8, 262, 74, -191, 60, 8, -213, 60, -93]
3990i3J87j23J2J38k03l0r3M58j72J32l25M12n80L39j10j51L57j0j30j46j08J13
4012a26J40j2o2K8n1j97M06l42K95L7P4l57J41n8j96L52n3P0j25L7M0m7k30J54
4036h2J5QP1j97K19j65r0J44Q0P8K25o00M32k60j07J80J90n3j47K13k57L68k74
4059iJ01J52l9K1k08J51j99j8j10J32J21J5j50Q5j9J99l07Nk30L15K13l5j88R4
4083I2j35J26j07J49M5j44j66l3oj95M85l41J29j44J66J6N6Q0l17k3L30N5j62
4106d4Q3Qr6K7r8j77J39L50l42%M5K03j42o9K58k62j43J56J71k49j04J77J07k06
4130b08M50j23l63L76j34J8j36J68k60rL48j30P9p3J9k38J75k2J77j34K66l62
4152a16K33K4qP7k02K17l79QR8j02L56k27K95j40J34k13k40J68l1L2K2k18L19
$$ y = [-93, 94, -29, -17, 121, -82, -112, -205, 253, 81, 213, -112, 300, -280, 59, -51, -202, 155, 145, 15, -131, -239, -126, 14, 2, -60, -32, -83, -280, 126, -216, 79, 116, 190, -167, -26, -84, -280, 72, 19, 89, -36, 1, 41, -6, -236, -82, -67, -59, 12, -185, 34, -131, -221, -77, 3, 81, 306, -294, 138, -122, -229, -49, 141, 88, -59, 154, -103, 265, -9, 92, 244, 205, 226, 18, 169, -30, -48, -158, -26, 95, 110, -40, 45, 26, 225, -82, -77, -307, 8, 221, 186, -2, 92, -43, 83, -24, 125, 170, 26, -140, -173, -179, -374, 111, -230, -101, -245, -79, -63, -7, 73, -244, -267, 63, 118, -44, 39, 47, -49, -22, -120, -297, -158, 192, -150, -150, -105, 98, -44, -113, 145, -117, -260, -104, 67, -182, -286, -109, -2, -208, 242, 119, -244, 132, -2, 16, -120, 48, -212, -221, 127, -3, 76, 3, 22, -216, -41, -63, 114, -20, 246, -116, 117, 141, 133, 210, 8, 225, -154, -146, -48, -150, 206, -21, 274, 134, 268, 55, -185, -17, -48, -16, 6, -212, 107]
4175A07j42J15J55l05J20j81K71k63LJ22N6j84J83j11P6m6j01k5K05k64l4L68
4197A25r5J22j93J70j26o4mJ01ML8O3j51m8j06K28k4k15K5K76j12J66j55N0j59
4221h4k50K35K11O5l32O7K10m5R2l42K9J44j2J6k59L62j2j13J25k46K89j42K0
4244B8L15n07j1J59J11j33J41Pk15L0L52l67J4n0K92q2M0o5K56m45j15K22J06
4267H3l11N5K33j10k84L25J74K3k78J93Mj8J11j66l37N60m51R6k0J50J62j90J3
4290A7j02k49L29N2R3j03k08J22M7R9k17J63k14K63j00j22J47R6R3o6Q7l83L31
4313A75K3j48R8j85k17M19q4j12o6k4Q5l03Q4J79J72k3l8j48J14K52j33K08l10
4336A8R9j20j44L14o5m2p0n1R2K2k04o8J39J39P7k11j22L29r9J5P8M5j29o1P6
$$ y = [107, -35, 80, 235, -70, 50, -131, 140, -123, -120, 2, 58, -126, 57, -54, 22, -24, -125, -150, 55, -209, -243, 125, 30, 152, -41, 129, 3, -61, -65, 36, 40, 78, 141, -10, -58, -164, 64, 40, -175, -150, 126, 14, 180, 25, 75, -84, -334, -99, 112, 177, -155, -88, 122, 77, 169, -173, -144, 0, -12, 4, -255, 107, 95, -18, 107, -139, 150, 8, 28, 343, -164, -175, -16, 95, -38, 103, 110, -105, -75, 277, -90, -76, -126, 166, 84, 124, 59, 315, -130, -245, -23, 83, -228, -173, 60, -50, -334, -9, 165, 188, -90, 103, 107, 89, 200, 34, -303, 257, -194, -98, -118, 32, 194, 4, 17, -85, -334, -5, 47, 140, 37, -171, -49, -2, 97, -120, 43, -171, 92, -8, -130, 17, 113, 206, 140, 227, -156, 175, 198, 50, 148, -37, -254, 165, 81, -31, -97, -121, -36, -339, -255, -76, 96, 73, 35, -113, 1, 253, 120, 328, 18, 117, -3, -147, 167, 102, 60, -10, -61, 31, 53, -151, -219, -80, 59, 136, -75, -197, 132, 33, 48, 126, 171, 42, -19, 57]
4361E7R0j15j37Q1o0j42K78j6l08O5R0K54j85m3L11j29j01j7r3K99j68O6J2P9
4385A68n71O22k96qj13NL32l14K04r8J06O7P8l70L83j16K4j8j9j03O7N2R7j56
4409B3J5k8J4M9k32Q2J34m67K70Q6p0K26l4q9j06J94q9J75k94L50j88L4o4QJ4
4434A3J93J2l09MJ83p5J2K18j36l19K44j54nj37N8n8K20M6j82N4K39j79j05M53
4458B90k64R4j15J78l14l4J96k55L82k47P9M8L66k88k94K52j14M2J25l24J02P3
4480b2Kj33J37M5o0j75K67J60l57K81q5L0Mj22J34k30L31l09L60k41j72L6j36
4503b55K86O0J50m83P8J83K2R4j84Q4j32n2L65k15J9Q7jJ0j28rJ99n6k66L43j26
4528G3j89K22L9j32J34k9j22j33K33q2J7j21J64L0k36P7J30j29J14k0N8R7Jj14
$$ y = [57, 147, 32, -105, -24, -84, -226, 52, 36, -272, -207, -117, 137, -48, -91, 220, 91, -10, -27, -120, 179, 11, 77, 89, 168, -403, 219, -77, -85, -198, -193, 139, -175, 29, -69, 37, 104, 182, -188, 195, 79, 103, 85, 66, -37, 30, 82, 179, 23, 38, 10, 24, 73, -159, -77, 57, -410, -140, -54, -124, 102, 68, -21, -127, 67, -22, 153, -141, 209, 21, 55, -9, -1, 13, 206, 218, -91, -87, 96, 21, 33, 251, 115, -204, 40, -114, -119, -256, -198, -256, -36, 10, -172, -118, 121, -58, -163, 290, 26, 120, 5, 183, -131, -165, 31, -224, 158, -89, -10, 38, 404, 116, -178, 74, -40, 2, 127, -197, -95, -22, -20, -153, -16, 29, -31, -206, 61, 221, -136, 145, 60, 90, 94, -28, 106, -124, 207, -102, 258, 17, -155, -119, -255, 31, 91, 241, -242, -164, 19, 41, 135, -49, 35, -97, -149, 216, 1, 20, 107, 106, 116, -12, -21, 178, 122, -144, 199, 73, -116, 106, 145, 13, 147, 118, -4, -137, 96, 14, 31, -90, 74, 104, -132, -55, 75, -54, 60, 40, 98, 195, 196, 82]
4552H2l9k5m2R4l43L73l16J68J6Oj40j41J36J66mj71K72m3J4r0p8r9K40L7N1J9
4578A43l84M76j08r6J86j3n4j11k8K61l30J63j52q0K75k95P5O2q2K34n9r3J69
4601A59m9k01N8l2R5q0K69j45r5J42j39N7ql01K81K13j62k2l5m6J37J65k58P9
4625H2j58n4L35j54k16J20r6j39L02Pj75M55m71L32o2k48n2J20LJ25L0j95J84
4648G5l79J78Q7J08j53k7o0J33m2J45O6n21O6K11J8K78l28J09m3J37J10j72R6
4671I2r2N3j63N5k3j60M64j81M9l84N49j26J15j03J11j86K02k67J31J57k57j9
4693A7R0l30O0K99J73k36j39K23k15K70j20j60K89j8r6k77J47j48J51J44j06R0
4715A08j24j34J98r1j68K74Q3k52R9J31j92J1K31j32K7j92m6m9M0L13k11J21J12
$$ y = [82, 43, 18, -24, 70, -273, 100, -216, -48, -32, -26, -166, -307, -171, -5, -9, -180, 92, 49, 63, -27, -105, -204, 36, 73, 124, 143, -241, 235, 127, 31, 217, 204, 150, 39, 11, 272, -58, 105, -47, -127, 148, -147, -72, -10, -92, 142, 83, -10, 159, 110, -91, -33, -65, 30, -50, 219, 74, -21, 121, -18, 39, 31, -270, 11, 224, 62, 40, 5, -41, 96, 261, 3, 82, -76, -130, 205, 51, -165, -45, -141, -280, 22, 29, -146, 309, -162, 170, 108, -140, -192, -72, -69, 56, 86, -109, 75, -304, -126, -39, 69, -84, -111, -171, -38, -80, 65, 131, -390, -324, -113, -95, 183, -145, -36, -79, 58, 168, -4, 92, 0, 53, -110, -55, -78, -238, 226, 45, 94, -290, 259, 133, 248, 145, 256, 70, 272, 5, 136, 293, 36, 17, 107, -223, -163, 136, 309, 73, -66, 157, -58, 212, 92, -68, 221, 203, 107, -170, -23, -171, -20, 124, 18, 108, -16, -150, 48, -43, -211, 63, 146, -106, -7, 124, -68, -57, 174, 42, 69, -123, -169, -218, -178, 135, -76, 45, 157]
4738A57j85k41K78m4M5N2k4O6l19m9L19k26Q7p2o1k4L98L5l08K15m0j9j1k4M3
4763D8k9J24j52L6j98K67j18JJ58O9K0l50K49J5j88n6P3K3J49m44L55k30R4R6
4787A2Q0j26M8k89K95k77N65j64o6J5p3R0mk84J32J13k6J64j91Rk3L86k02j82
4811Bl3P4J05j10M9m8j39O6k76K88j45J56L8k86j50L91M9q1K68j89K2j02L2L4
4835A5ln2R6K1l04K85Jj8J23k88KJ28j7K40k37N9P9N9J5R0m67J82J02j52q6K11
4861H4M8j12O9j55j6J67o6J46j59K04k41J1K28jk99J75J23m30K19j39L49k51J30
4884H4q4o1j90L00n6K2N6p0j7k8q8N2L81l22j96M20m0j36j21Q8jj49K13J11l6
4909A32j09J64q1l42J5M02k59J34k46J20J03p9l4L1J25l28J90J71J9J19n99N63
$$ y = [157, -28, -269, 9, -35, 10, 62, 38, 104, -215, -264, 55, -171, -84, -156, -217, -241, 157, 192, -116, 99, 59, 40, 29, 5, 48, 19, 143, -9, 27, -171, 96, -22, -21, 137, 206, 226, -124, 125, 140, -48, -104, -31, -8, 141, -303, 52, -178, -84, 12, 92, -34, 14, -275, 20, -257, 308, 144, 78, 93, 20, 110, 106, -178, -46, 67, 41, 205, 14, 23, 0, 386, 184, 2, -31, 43, 148, 38, 87, 39, -100, -34, -310, -22, -167, -11, 27, -259, -409, -18, 31, -50, 218, 29, 51, -51, -19, 15, 12, -40, 56, 77, -227, 58, 59, 41, 164, -124, -122, 6, -11, 229, -8, 51, 130, 189, 204, 294, -173, 9, 111, -41, -127, 84, 132, 20, 89, -66, -82, 85, 19, 165, 6, 210, -31, -20, 208, 207, -92, 83, 206, -224, -5, -144, 205, -46, 84, 0, -61, -251, 49, -7, 15, 71, 1, -16, -44, -132, -80, 301, -21, -217, 203, 163, 27, -94, -6, -7, -156, 57, 168, 132, 23, 187, 106, -236, -221, 181, -78, 56, -190, -70, 33, -46, -80, -49, 76, -252, -62, 109, 128, 247, -352, 211]
4931B11j96j67J60Oj19J17l35K41j5J57r7R5k7k27m2K66J07j6p2l2K3J31n6K9
4955A42m0o4Q4j34j3k17J63L21m0l31K78p0j88J39P7K0J74q7k4k3l49J54j10L21
4979A83j03n4r4J91L4k97Qj6l1J38j02K85k67J41o8Mj21J21K0O1j21K07L4k79
5003a26K97m17J10K39Nlm4J35k58N0j01R3M3J82l34K98j26k69K81q9m9j4J59j05
5027d3N5j5P8j82MO3j28M67k00j18Rj57K39j36Q4k85K61J19j9O7j29p0J18P4k27
5052g1Nj87K50J59j79J04j01q8M3p8O7J24j96O2M0J11j7q8P9Q9j95j19K07K3K75
5077C19n33j5J68J95l4m22L04j12L50j79j22q0L13k85q6K70k21K45j52n8j6J42
5099ij6L9P7q2L2J5o4J57j83J93j45l7M48j89k40k10J3K4L45r5L8k1p4n5Jj34
$$ y = [211, 15, -152, 8, 14, -105, 12, -323, -82, -97, 60, -37, 58, 31, -196, -238, 28, 135, 119, 47, 15, 38, 169, 113, 142, 102, 38, 122, -12, -25, -242, -79, 242, 202, -129, 149, 79, -109, 30, 107, 127, 301, 214, 190, 167, -182, -28, -138, 183, 80, 26, -68, 123, 157, -140, -132, -148, -179, -41, -143, 142, -125, 16, -52, -48, -169, -48, -28, 33, -88, 119, 153, -126, 171, -246, -136, 103, 108, 105, 61, 196, -62, -12, -113, -20, 23, 205, -129, 169, 43, -226, 55, -34, -83, -97, 62, -43, 12, -3, 75, -107, -103, -40, -168, 299, 99, -19, -10, -167, 72, -64, 20, -265, -4, 115, 96, 163, 34, -36, 82, 156, -71, -66, -253, -3, 156, -23, 81, -20, -108, -65, -143, -76, 48, -148, -86, -46, 65, 48, -40, 39, 128, -67, -186, 21, 44, 319, -214, -229, -61, 134, 100, -322, -18, -130, 220, 41, -81, -161, 152, -133, -219, 51, -170, 75, -77, -135, -151, -9, -25, 14, 91, 9, 41, 56, -8, 149, -34, 159, 14, -23, 425, 236, -4, -214, -201, -177, 168, 73, 111, 90, 16, -39, -38, -172]
5125a72L91k48P3j07j5J16M4k6LJ11j97q5R7K4J58l29lj59L54j16q2R4P9K13j07
5150A11j85j3J19J04j7l9LK0l8P1k10J68k43J78k59R3R9qj99K97l45K90P6l83
5174c10N34l04M3J8J0k4j68L63L4j60j10J03k94L60r0L1R4m34K29l1J25R8j20
5197cP3j03R7m6Q1n7m34M28p4j50K34N3k52J26l6O0o3L66j82k35L75l38J98M5
5221A63k00l6k2j92J42J81%p1j92J28J59r1J53j08J02Q4l86J43K39o3L6k11J85
5244A43k14J19j42J33R0o8O1O8k60J81Q3k98P0j40L34n0l0j94N9K15j29k7rj43
5268a48j83L55m4J14L3J53k48P8j95J5j5P9J46l29K42l44L06k4j41J27O7R3k16
5291g9R3k05K63j35M6N0k3jj97K38j40J85j71n6q5J58R6r4j1L93n91L17J00k29
$$ y = [-172, 219, -29, 44, -63, -78, 38, 82, 56, 59, 170, -27, -112, -15, 9, 167, -162, -165, -324, 30, -86, -168, -74, 5, 218, 111, -74, -87, 32, 136, 119, 80, 83, 103, 65, 136, -74, 94, -149, 29, -230, -137, -38, -46, -245, 52, -293, -3, 73, -310, 224, -80, -37, -19, -9, -33, -201, 162, 196, 36, -74, 29, -265, 95, 5, 36, 130, -304, -75, -106, 19, 117, -3, 70, -33, 64, 18, 99, 42, -392, 36, -38, -188, 46, 99, -153, -27, -63, -3, -66, 300, 118, -117, 258, -80, 118, 163, -37, -73, -95, -287, -145, 36, 36, -35, -227, -99, 60, -31, 122, 14, 116, 200, -186, -43, 196, 133, 169, -42, 143, -71, 48, -94, 39, 129, 61, 122, 190, -70, 111, 194, -104, -34, -174, 160, 110, 80, -114, -55, 160, 31, 4, -5, -148, -331, 24, -20, 94, 127, 280, 32, 110, -85, -70, -85, -6, 140, -189, 53, -291, 15, -9, -150, -23, 44, 137, -79, 14, -191, 72, -63, -17, 33, 10, 9, -188, 50, -90, 95, -76, -132, -217, -59, 37, -57, -68, 325, -266, 51, 151, -78]
5315g8J54J29j24J43j31j73Q3J13r5J00J07q4J69m48J82l6%K8J3J85m47L29j82
5338f3J21j2k49K71j19N3q3P6P1J30k33k7J05J30k05l6J38j21J41p4J24j45J78
5361A71J05n55J86K05j14M4Q7j75o9J10j54K19P3k81J46M0k4j34J00j62P5J22
5383A5M0j88J19p6k75M62j37m5Kk0J23J96r0j93J76N7j19L5Q8o7j77r6L09J6p2
5408H3M9k62n3L87k77J25J7m3L6l0J77k66%q7R7j41K99jk92K80Q0j97j18J18j67
5433a86L15l38M26m59K45qm1K82k96K7P3M1j63K7J9j00J96j80J87j69K35j32n
5456dR5n4p8O8o0k3j08J46k33R7j43K39Q0j42R3J69k64O1J11k14J9K60j86J60
5480H9R8nj37j22J43J07j80k83K50l46L15m0J11j46K08j30L04j40m46K19L21j65
$$ y = [-78, 76, 205, 81, 224, 93, -80, 3, 116, 21, 121, 228, 144, 313, -135, 47, 11, 11, 39, 52, 237, -210, 119, -63, 58, 46, -203, 68, -51, 2, -81, -5, 66, 196, -37, -64, 41, 171, -34, -70, 68, -53, 88, 14, 138, -7, 171, 276, -279, -93, 112, -2, 42, 129, -46, -115, -5, -159, 60, 133, -148, -2, 38, 14, -120, -20, -182, -107, 15, 55, -133, -14, -90, -365, 97, -40, -85, -83, -103, 20, 216, 126, -67, 109, 166, 47, 82, 170, 103, -74, -170, 139, 155, 83, 132, -130, -183, 204, -73, 52, 69, 26, 62, 32, 209, -57, -57, -144, -47, -188, 111, 110, -182, 98, 178, -19, -137, -19, -186, 129, -209, 217, -242, 3, -5, -46, 236, -60, -33, 40, 81, -82, -55, -36, -136, 60, -120, 67, -102, 133, 1, -4, 91, 37, -41, 27, -33, -56, -164, -18, -251, -154, -297, -58, 22, -120, -27, 142, -122, -61, 50, -164, -145, 115, -71, 89, 187, 182, 45, -77, 66, 173, -7, -290, -40, -386, -71, -111, 0, -146, 62, -68, 236, 96, -350, -131, 190, 25]
5502B5km2K4k88M30M9l28K21K3p1k71M34R0L7k01k28J12O5j93J33l2k3k70K71
5526c5L6J29n3K59m02q0K83j53r3L61q9j00j82K34j59J5R1Q2p5j3l3l1r6J41Q4
5551A21J85m70J46M1K14j55j83J11j72O9j34M24m31M03l73M4k2L64N8m48L2L33
5573A57j10M9k3j86J03K09l10J59k6j96M97m18Oj17L4L60k04j26n1K05NQ3K5r1
5597C4k4j34o3Q6O7oqj57K94j83J63K1J94m00oJ18mK26k12K1j75K85j70L6j74
5622a71j12K92l7J2K9K3n6N2j4J24j46j73P8M5O5J12Q2j27j1N0k05rJ30l16J59
5647a24n2K89k62J05J26j72K13k72N0O7N7L8k21R6N0Kj78J52O0j07J05k72J61
5670h9O7p0K09j08m7J9l0J65Q5j31j59J87j91J76m30K59j70L48j29j19J11p4K58
$$ y = [25, 23, -19, 5, -283, 147, 196, -132, 89, 112, 41, -230, 204, 294, 331, 130, -98, 14, 79, -114, 19, -13, -36, -306, -35, 1, 130, 77, 336, -66, -146, 137, -16, -109, 252, 163, 63, -119, 115, -44, -29, 62, 144, 69, 56, 23, -8, -104, 37, 121, 306, -164, -18, 23, 237, 82, -101, 10, -162, -93, -227, 197, -234, 169, -204, -160, -182, 182, 240, -208, -176, 157, 47, 96, 73, -113, -10, 199, -111, 48, 22, -174, 323, -95, -89, -206, -172, 188, -16, -142, -193, 12, 17, 100, 125, 34, 10, -124, -187, -101, -34, -40, -48, -205, 89, -94, 69, 90, 284, -116, -122, -4, -8, 218, 6, 27, -148, 137, -33, 3, -171, -283, 9, -28, -16, 13, 36, -20, 32, 18, 142, -4, -177, -99, -54, 11, 123, 205, 78, 67, 117, -88, -97, 33, -283, -124, -176, 113, -149, -44, 82, -90, 123, -149, -99, -32, 25, 63, -158, -62, -12, -10, -188, -36, 24, -83, 22, -250, -89, -22, -92, 117, 9, -38, -19, -49, 116, 201, 70, -89, 98, -93, 83, -347, -88, -258, 90, -39, -158, -47, -121, 137]
5693A37q0J09k71p7K15J01j94J8K7k4k1j37K49N5k9k74K29j93j67O0K41J32l04
5716a98K65l43P3P8N8O7j30L86l32j63L63k10K54k34p0J16K6qj77K69j70m8J28
5739@P2K9K53m00K8j03M16q3k44k3K37j60Q5j88M1P8j89J97O9L4k86R7l5RK40
5764A74K9k36J7j50J34J49l26J82k35J50J39J56l07j08L57Q8J2p1m20M85j25j54
5786f0j17L50P6l23L3N0k7OO7j03J30j75L49l80o3O2K08j48J30K36j19j03o4Q7
5810A02j23o6J24k49K54K1j53O8q6J23l13K39N2j85K71r4j45P7k7K79j62J00K4
5833A31j77j63K70k09J84J09L8o2k78L47j96o5K01J11j28j82K26r3k09L1J84n5
5855A5l74N76k16k0K24l38P1K39n8q3O0k23J69J18k3k12L9J96k82K42k74J60K43
$$ y = [137, 57, 166, -105, -182, 33, 134, -60, -42, -15, -39, -60, -197, 52, 107, 78, -196, 33, -160, -327, -267, -26, 106, -198, 67, -276, -203, -125, -67, 0, -130, 256, -76, -239, 124, -86, 168, -66, -136, -20, 6, -2, -179, 90, -80, -128, 0, 72, 101, 354, -46, -18, -121, 295, 212, -32, -55, 182, 22, 107, -81, -40, 38, -151, 46, 115, 149, -137, -40, -75, -66, 174, 203, -33, -16, -166, -32, 117, -209, -27, -262, -112, 27, 183, -124, -232, 125, 213, 225, 154, -266, 219, 94, -60, -177, 173, 249, -74, -41, 9, -18, -12, 55, -48, 82, -93, 256, -124, -187, -125, 83, -65, 65, 301, 182, 79, 15, 102, -21, -87, 37, -212, 42, 63, -90, -22, -108, 15, -298, -59, -7, -192, 79, -15, -160, -83, -110, 169, 7, 107, 131, -46, -209, 61, -148, 36, 145, 183, 121, -157, 190, -6, -71, 130, 241, 113, -69, 157, 64, -145, -114, 70, 15, -359, 217, 1, -19, 205, -133, -62, 177, 119, 36, 96, -127, 42, 160, 137, -75, -36, 160, -122, 120, -154, 6, 249]
5878B49n4l69K12j67J8L1J03J77k42P6k6J21r2J98j00k17J25m4k12jJ01K33k97
5901a77R8K08j30K5q7m7J23j59J46j25o3K55p8r3j50L27K26m76O2R4J11p4j8J9
5925A7J95Jk57P9O8q3J06r0k5l7R3o9j42Q6J32j04m0k07N06m37N17j77j48N6K3
5950F3k9Q4l91L23l1j0%LJ70rn61L85j9J4R5j17J62k59Q2k3J63n9j0k34M56r1
5976A57q6j27j71L32k93O7J46J13k18J93K9J14l23K1P7m5J16k48J01q1J5K41j88
5999e8J73o5q9j29J43m8p5J40p8J30j30N2j32K86l24N5K47mJ94k76j06K05k38
6022a27o3J87L23l68O3l64J29K74k66L36k14OJ1K43l20J07k60K12L2j60L33p0
6044D4N3J59l95L45j65K9J61l13n4J75j23J2O1K59l81J17j15L7p8K31M4r3M2k24
$$ y = [249, 195, -174, 38, -129, -111, -80, 23, 200, -42, 34, 8, 129, 37, 235, 135, -82, 43, -1, -213, -214, -113, 120, -177, -79, 129, -1, 24, -63, -110, 13, -146, 0, -125, -188, 67, -11, -104, -254, 73, 299, -177, -115, -21, 90, 16, -2, 17, 212, 213, -44, 35, 103, 20, 126, 36, 11, -26, 67, -2, -144, -58, 74, -30, -70, -277, 229, -208, 309, 132, -16, 40, 63, 34, 118, -273, 50, 19, 9, 9, 12, 182, 173, -388, -3, -22, -8, 87, -30, 132, -127, -45, -68, 95, 36, 26, -208, 248, 157, 71, -56, -227, 105, -188, -121, 25, 138, -80, 113, 142, 256, -67, -46, 31, -14, 102, -146, -45, -126, -111, 130, -58, 115, 50, -39, -168, -25, -73, -148, -8, -86, 44, -86, -34, -166, 120, -204, -149, 98, 94, 288, 12, -94, 111, -127, -190, -3, 320, -48, 15, -349, -220, 54, -212, 124, -90, -84, -73, 170, -150, -43, -303, -91, -59, -219, 114, 44, 97, 256, -139, 206, 41, 70, 231, -82, -136, 39, -84, -72, -11, 248, -133, -16, -131, -94, -172, 59, 103, 10, 52, -172]
6068a72j5K67m6o8J83j76l14L83l17M19k3o3L3l3oj02J79j29q1O0k07P7K5R5j59
6093a90K65k50O3O6k03L1M49j39k92K57q4J93j77Q2K93q7k81q7M16k60O6k96j1
6116a76J75j36J28q2K22r5Q6k8K36j65q8p3q4J37Q6Jk39K68j93K34m51J61P7j96
6140a95K35j53K35j83L36k60J39m44L90k63MJ37J42l73K61J46r1J8q0j78P5J00
6162bL0J06j50K54q0k76pK77j04j7j52L19p6j49J4j54K66j93K83l16L99l90R6
6185b2J96kj12j84J41j19K15M1j17nJ97j63k08Q1n5M2Q2m6J31k55P7R6k32K14
6209gQ9R1k70L11k26o4J64n4Q1r2R6n8L9k54J01N0j81j02K16L20q0n54M94j63
6233e3J03j62J41K3J48j82J13qj92k32M04j57k72M57j04j26K18j15l9n0K34O7
$$ y = [-172, -187, 80, 34, -34, 149, -27, -341, 42, -275, 144, 121, 58, 91, 58, 52, -50, 129, 0, -81, -21, -228, -151, -126, -31, -190, 75, -175, -112, -46, -249, -218, 231, 92, -200, 57, -27, 166, -11, 71, 364, 277, -4, -91, 325, 65, 131, -165, -176, -1, -137, -9, -91, 131, 36, 122, 94, 330, 165, 77, 4, -80, 57, 143, 144, -95, 173, -20, 214, -237, -76, 1, -195, 40, -113, 122, -61, 275, 15, 154, -290, 100, -163, -159, -22, 120, -253, 8, 154, 63, 81, 1, -177, -102, -2, 28, 134, -16, 238, 158, -118, -125, 152, 48, 31, -121, 198, 122, -27, -13, -167, 99, -94, 189, -127, 272, -118, -22, 174, 172, 60, -124, 17, -102, 113, 154, 37, 32, 229, 66, -142, -61, -116, -74, 8, -38, 93, -162, -85, 11, -221, -7, 82, 173, -97, 214, -12, -76, 88, 34, 115, 23, 119, 61, 100, -154, -53, -3, -184, -286, -70, 250, 170, -384, 110, -53, 50, -112, 29, 52, 200, 18, 131, 123, -69, -301, 103, -54, -326, 131, 27, -99, 119, 4, -35, -85, 149, 216]
6255B16j42o3J99l19P3k02K74lM2O4m3p3J09j58L0j72J69J60l56K29p6J71n1j1
6279F7Q3r3j25K22o6k50L53k92P6K18m65K88N3K29j81J07l55J25j7P8m78M82K0
6302G9k95M68m24K55K04n04M80k73J47l90L17r4q8p5L19l74L9J39J85p2j24J13
6324C2m6P3l40J04j11P5M60k92l2L88m23jK36k3j33M8L7nj71l5N9K34q5L7J10
6349A96j08k76nK68q0J05j38K18l14Q9M7j3j21J0J49K49m50J59p2K26k35K57q0
6372H1K3j12j56OJ60k27O6J85j1l7J4j54l0K50p6j5J05k35K13J73k79J50r6K52
6396B50j19r1K34jk64o9P7J71p6o0oRj3N0O1J5k29k58L33J42J27k11Qr9j00K04
6422H5J11l47J11Q7J5m6J04l35l6J55n4N2M12j66k24K11j65m4L6K82j47k13NJ28
$$ y = [216, 74, 11, 210, -109, -36, -238, 36, 33, 75, 139, 96, 23, 132, -26, 4, -168, 1, 161, -195, 34, -42, 129, 78, 67, 150, 57, -68, 154, 88, -162, 191, -101, -25, 193, -272, 16, 69, 298, 117, 224, -131, -6, -23, 55, -423, 59, 79, -216, 252, -172, 83, 287, -217, 263, -10, 137, -253, 64, -30, -118, -193, 126, -248, -209, -70, 115, 43, -81, 32, -14, 59, -281, -177, -288, -213, 247, -45, -77, 311, -112, -113, 123, 100, -33, 15, 52, 47, -124, -159, -100, 134, 49, 86, 196, 88, -188, -193, 75, -5, 100, -38, 180, -134, -45, 2, -11, -132, -122, 27, 276, -174, -15, -87, 139, -96, 161, 81, 104, -8, -164, -158, 2, -225, -159, 26, 15, -22, -8, -162, -192, 58, -18, -33, 72, -163, 50, 223, -56, 94, -2, 250, 131, 40, 274, 273, 9, -60, 17, 188, 112, 52, 46, 55, 42, 92, 153, 168, -61, -319, 14, 156, 283, 72, 80, -19, -119, 85, 196, -151, -40, 47, 62, 16, 120, -215, -251, -96, -150, -98, 314, 148, -76, 135, -30, -74, -38, 244, 97, -116, -111, 17]
6446A7L7o0J46j77jRQ8o0p5N4K20j90J12k07J05R2j30j04J15Q8j49P9l75M7K38
6471h1R4J16j59j34J72q4K21K41j94k53q8J50M5j8q1j20J3K95j73L35l66J00J98
6494B29l08j35K10Q1O8j90j29K63QQJ23j36j05J10j12k27K38j48K19k2j49K19
6516A15j75m0K29l36L69k04K61l05Q4Rk15O0J84k36K2K08k0L9m0p5Qp3R1k30P8
6541a92K82J3o7j68JL6j21J53N6J75l31R7K70j25j10J87l81L58j75P1Q9j94J2
6564f4N4K04k86P9J87l22J95k06L85k95k27P9K82k9j15R1p8M55k76q3J29k48K03
6587A14q9J90m15L61k83L06j28L6k72P0O7L17k98p5L24j66k8k87K01J5O0J79n04
6610c05J06R4J7J61j71o2L40m87J15L98k11l4Q4q4j24J49K52k77L5J05j20k16
$$ y = [17, 54, -6, 140, -37, -38, -29, 59, -1, -76, -22, 198, 8, 120, -87, 18, 110, -20, -124, -9, 79, -70, 9, -366, -319, -81, 13, 129, -30, -164, 8, -76, 145, 386, 192, -61, -149, 1, 46, 28, -53, -173, -160, 135, -38, 297, -69, 31, 229, -79, -214, -4, 77, 145, -45, -174, 89, 97, 105, 228, 92, -13, 97, -15, -242, -4, -152, 67, 45, -104, 115, -60, -100, 129, -207, 162, -42, 219, -86, -2, 7, -208, -148, 36, -200, -178, 30, 10, 49, 9, -66, -58, -131, -40, -270, -192, 90, 103, 36, -132, -131, -95, -216, -63, -7, 168, -163, -66, 204, 79, -31, 156, -225, 133, -42, 29, 118, -76, -64, -10, 194, -92, -13, 174, -148, 47, -159, 226, -69, -296, -217, 65, 36, -79, 12, -66, 389, 113, 30, 159, -89, 114, 25, 215, -200, 161, -122, 184, 56, 92, -180, -110, -43, 274, -24, -99, 225, 59, 31, -256, -55, -40, 20, 199, -305, -199, -105, -88, 73, -98, -160, 180, -307, -192, 206, -5, -39, 45, -39, -163, -14, 238, -39, -4, 101, -19, -235]
6632b35J71K24j63k9l6K81j24j59J60j17L59k65n7l1Q7J99K8j38k21J58k08J04
6654a2O6J62k61M4J75j87QK56j43J11K3l81K51k82K98J8n2R1l28J78j83K10Q6
6677A48l21K64N6k46r1l8L63r2J33r7k40L37j13l4j14K99k41mrj69Q3J52K5k19
6701a68L33r8P6j83p1K26m38L24J12j12K7p6J0m6k47K97J94j02j23K2J97j62M7
6724C9K2Rj47J5j17k4K64k66J66J80L7l01L9N4j22L4M95l19QO5k47rL52l36j18
6749b27J13J82J19l12j16N59l35O0j40J32J67k31J84o9n8k2Q4n1r2M9K56j37j38
6772b3j4P3M8j07Q8k44J85q8K28l61P8N23k08m61L28Q1k94R1J7P5k06J02J63r3
6796a9P7j39N9r5j12J23P6J48l57L36m2j02K54j33J42j94N8r4R1N8j64k8L00l33
$$ y = [-235, -64, 160, -3, -32, -68, 213, 89, -70, 90, -27, 332, 67, 10, -21, 66, 265, 293, 155, -66, 92, -116, -12, 54, 216, -45, -1, 174, -13, -5, 251, 108, 219, 242, -139, 112, -170, 128, 146, 94, 185, -143, 35, -148, 62, 148, -173, 91, 147, -99, -190, -228, 135, 43, 176, 79, -161, 176, 63, 29, -85, 214, -27, -31, -40, -209, -126, 26, 51, -168, 165, 67, 143, -40, -111, 115, -323, 1, 113, 1, 28, -48, -38, -84, -331, -34, 160, 58, -65, -43, 154, -8, 39, 61, 70, -77, -62, -179, -203, 61, -205, -39, 141, 178, -123, -84, -30, -152, -118, 377, 58, 66, 131, -116, -125, 227, -109, -227, -114, 68, 187, -125, -241, 318, -17, 43, -97, 35, 202, -29, 155, 86, 28, 6, 90, 39, -53, -4, 252, 115, -23, -37, 36, 84, -23, 65, -179, 6, -82, 146, -215, -137, 386, 178, -283, 45, 126, -168, -77, -60, 15, -191, -89, 74, -19, 58, -81, -22, -117, -229, -106, -30, 118, -239, 97, 55, -47, 207, 74, 216, 22, 80, -14, 77, 135, -29, -57, 243, -90]
6820i0J82N4j05k13J36j10J52K07l8J44l08Q2j31K1J25r4J43m2j34L9k7l39L49
6843CK0j6N3j27J78j78k4q0K41j27J74j14Q0n1p6Q6J08R1m49J96J91j20j99JJ96
6868E7j89J25L19j87l33j09J18L81k43J62j20J30q4j9j84L3j11K62J15j35Q9q
6890F9k11L1J71J00K4j76l64M01o3j08K81k55j16MJ76l56J74K5J94QK0j20M3o5
6914a13j6J37l16M58m15L38j56R3Q0O2m35N56l68K4J20o7L6j41L10m7j54q7M78
6937C77n77J19J24l7O0j4n1L0l0L7O0J67l66L22p1l28O5J58j0M1J81Jk32p5k3
6962g2R8J60r4k75N0P4L33l70J60m1Ql0M3qr3j51P5L01k56K04N5j21j85L39L1
6987B35l39K73J8l05K66l48L26l23M56k19J46k65k9K05j54j1j00K53j84K48j58
$$ y = [-90, 92, 146, 41, -172, -36, -146, 6, 213, 175, 319, 11, 93, -38, -17, 108, 14, 157, 115, -19, 20, -7, -346, 3, 23, 7, 60, -67, 111, -67, -91, -171, 70, -57, 117, 3, 83, 32, -44, 42, 150, 241, -208, -12, 179, 59, -140, -139, 57, -132, -7, 312, 125, -208, -317, -199, 182, -61, 101, -19, 111, 27, 8, -176, -143, -254, 8, 123, -12, 77, 69, -142, -111, 60, 160, 184, 8, -356, 45, -18, -126, 155, -100, -216, -212, -36, -392, -218, -193, 1, 9, 29, -91, -48, -113, -129, 8, -308, 150, -265, 73, -83, 10, 90, 152, -283, 273, -95, -71, 49, -18, 18, -123, 187, 140, -14, -101, 377, -200, -81, 43, 6, 66, 52, 1, 31, 1, 38, 98, 265, -101, 221, 150, -178, -113, 45, 35, 76, 257, 258, 26, -49, -72, 26, 186, 92, -183, -133, -59, 274, -96, 64, 23, 31, 1, 44, 36, -57, -208, -133, 168, -88, 116, 171, 50, -135, 204, 235, -104, 169, 187, -118, 148, -200, 126, -197, 259, 40, 186, -79, -108, 97, -57, -68, -168, 85, -99, 149, -9]
7008il3Rj5J72k13P2M18n01j21N22j38j80M5J8K3L90p70N10r8P8r2l72M16j77
7032d6o2J3j1L12j95Nm2n5q5Q6J44j8N9k00J64j65J87j25L27k09k85K09j03M0
7056e5O3j07J05Qk10L15k33J46n9J50j36j38N1L1L06r7j47M8q0J27J9k85K01k2
7080Aj21L26j71j77Q0k52K30J57q2J07n2M4p2n9K22j65N2j8J22j01j82K72k93
7103a32L51j55k38R8O0K45k73O8Q7l0l22J42K53k88J38J27n4K4j65K04l88K96
7125D8l9J22k62J96P4q9J2k54K98j10K06k08PL0K52n09L00l44M94l65J00L4j37
7148a44K24j74r6J24J29r5j98mJ83j46KN0Q4o7N4NM86o83M07k10p9L1J03K0J23
7173A29l02J92K19j45m14O0L11oO4j82P7K32M1l96K3J58j87K6l4K89l95m1L21
$$ y = [-9, -42, -33, -48, 124, -89, -17, 401, -100, -221, 301, 163, -17, 28, 46, 69, 459, -311, 199, 101, 179, 87, -285, 131, -46, -108, -95, -106, 206, 11, 16, -26, -81, -166, -80, 64, 46, 105, -95, 69, -96, 91, -34, 293, 84, -201, 8, -95, -55, 8, -99, 6, 14, -196, 119, -114, 32, -27, 123, -13, -151, -100, -69, 237, 140, -7, 41, -39, 88, 107, -178, 23, 1, -120, 206, 35, -142, -62, -314, -84, 73, -9, 98, 46, 90, 18, -41, 181, 16, 68, 50, 172, 71, -111, 161, -132, 219, 64, -174, -76, -16, 229, -44, 24, 111, 81, -241, -99, 154, -134, 4, 131, 77, 101, -64, 140, -248, 48, 9, 131, -131, 65, 139, 50, 62, -192, 106, -4, 202, -6, 1, 31, 283, -226, 74, -270, 224, -141, -41, -7, -144, 80, -94, -190, -66, 63, -32, -230, -234, -51, -197, -195, -145, -61, -128, -74, -69, 417, -266, 141, -69, -148, -117, -14, 6, 129, -173, 19, 238, 93, -321, -261, 50, 44, 108, -74, 3, 235, 276, -120, -97, 61, -126, -100, -134, 155, -240, -281, 40]
7196D0j16K60k18L8J74m20M26k96J00j0RK70l44J60L7k21lJ45k8J75j97j08J20
7219gk6k1J59k4K56l90Kl0p5j26J31J36R5m5k48N5K44K54k27j18k10K69j97M33
7243B90k83j46O8j73K50J38j64J90j01J3j11o2J62J1J23l74K65k57J3K27j68J56
7265F7J94m82J03J07r5lR1%l6J19oj16j2J62j56J62j07J31J52m40J87p6R5j6j28
7290a03J25J85k17J30j14m8m6q7J99j29K31k4qn0o9Q6J25j18p1p6K1nj0m1J80
7315F6L8n3j19J30m0Pn9J58q4j31K09j2j76L39j93n1j38M7p9J05j82L78k00J35
7339I5j68r8J55L6m2P3qj26K86l24K76j95J3Q6l6J12k51j7Q3K71q4j57K5q6J21
7364D0L4n6K33k98J24m0R4o1M6M5p3R3n9J44k53K0P7j94R2L1j11Q0n1o7K88l25
$$ y = [40, -76, 184, -34, 4, 178, -242, 184, -112, -12, -22, -13, 257, -87, 73, 110, -111, -114, 31, 3, 178, -19, -127, -7, -33, -54, 105, 81, 337, -53, -51, -81, -156, -282, -151, -15, 80, 35, -213, -158, 86, 340, 113, -5, -215, 54, -143, 290, 7, -139, -71, -244, 6, 144, -20, 170, 69, 82, -29, -91, 71, 82, 205, -169, 96, -161, -148, 79, -89, 67, 261, -221, -118, -11, -106, -109, -18, -18, -54, 65, 59, -57, -69, 93, -63, 99, -8, 123, 275, -165, 22, -54, 41, 25, -103, 22, 207, -10, 120, 6, -42, -88, -175, 24, -105, 126, 102, 94, 44, -25, 61, 186, 68, -3, -79, -58, -63, -73, -114, 66, 104, 51, -68, 62, 22, 29, -30, 128, 44, -87, 122, 110, -66, 273, 80, 29, -109, -62, -141, -36, -218, 160, -40, 95, -73, -171, -16, 20, -22, 51, 43, -83, 203, -121, 155, -40, -27, 59, 23, 135, -116, -133, -50, 221, 137, -20, 5, -81, 40, 74, 18, 251, -47, 77, 37, 131, 70, 116, 161, 88, 181, 122, 266, 13, 33, 110, -84, 8, 39, -72, 8, -43, -110, 178, -147]
7390a47J35p5K33k26J34m7kK39n25K88q1Q2K9o8nl8J08q6J87q8j7J45p0P0j74
7415Aj78K76j29mK12l11r8R8J58n0P6m0J3mj55M14j91k69Q6L92n6m64J08K92l38
7440a61J83J6M5l17L31l36J4L47q8j33M6m9J28J91l21K17j13j2o3M3J25L5l92
7463b64M17k47J78k08J73j41J10l5k86J62J16K68l99J53J74j31m5J03n9j93Q6
7484f8j05O1JJ33M7l1n2K14k16J20n0j47K06M0j96J65Kj83K11l39M05o4l40J34
7508e2p0J94j03j83K38N3Oql09K08Jj69R6q2M0J78j45J24PK31k45M54o51J83j38
7533a42k8K85n1p1l4M6n7J59l8l2q5J18j19K89k89MJ50j63J44j45Qj66K99k10
7557a28O7R4k51L23OJ17k99J53p1j33R2j74j8N6J40J06Kk39K51m3J76k50j95K95
$$ y = [-147, -12, -87, 146, -80, 54, 7, 5, 244, -281, 7, -74, 8, 37, -31, -36, -74, 34, -52, 135, 47, 30, 175, 105, 175, 1, -177, 99, -30, -34, 178, -133, -231, -133, 25, -25, 51, 11, 24, 20, -135, 279, 88, -181, -95, 297, 241, -223, -115, 177, -161, 22, 38, 83, -234, 97, -239, -225, 122, 34, -99, -53, -102, 26, 217, -104, 113, 0, -12, -75, -32, 93, 128, -264, 153, -94, 84, -124, 49, -92, 18, -17, -303, -141, -25, 243, -156, -3, 171, 40, -5, 98, 39, -154, -68, -173, -112, -111, 22, 69, 38, -14, 200, -16, 104, 54, -93, 113, 153, -43, 122, 124, -59, 152, -187, 218, 154, -186, -52, -122, 72, -31, -214, 24, 77, 83, 75, -234, -26, -25, -194, -98, -180, -140, 38, -107, 17, 24, 255, 10, 464, -187, -4, -142, -170, 115, 64, -7, -41, 5, -52, 107, 69, 37, -48, 70, -49, 240, -49, -45, 105, -58, 86, -59, -51, -217, 82, -128, -61, 33, -218, 105, 111, 228, -71, 82, 11, -122, -30, -204, -222, -166, -26, 80, 82, -157, 94, 51, 227, -23, -218, 77]
7581G7r9K42j55j47J47j99KL66m05J27R9o0P0j0J72k14k51L09k76M22l02nNK33
7605A48k31M41m22K26pl83J62J00J82m88K59J19J00l34K41k21J37J20r4J9k87
7626b13K95J37n2o2N9m62M40N1k10O1j90K21l9j7o6R9j94L52k58J63j8J32j29
7649A00j3J73k24n7q4J51J25p1J99q8j70o9M9L1l2Q5J45m28J09K40k68P2j00J28
7673Ck2j4n3K18j11k84K41j30PK01p3J26o9l41L60L36l57l9r8K58j05k5jJ33n2
7698A09l93J36K4K03j6j90J78M4n0j42Q8m4K32k25kk4K85q8l87Q5n6K05j46j15
7722b89L93n3j61J20M4J68n48J86k44L37N9q6q1J08J46m0k72J69oQ6m3K5r3J55
7746H0j71J06n4r1M78m40K64m32L46m13L91l88M54k33J05J07j60L2K0r3J41J9
$$ y = [77, -22, 220, 65, -82, 65, -134, -132, 234, -171, -44, 55, -5, 65, 55, 227, 13, -238, 71, -205, 217, -85, -90, -85, 148, -83, 358, -64, 162, 155, -228, -66, 34, 216, -272, -13, 106, 206, -128, 113, -108, 29, 149, 55, 74, -213, 82, 219, 167, 105, 164, -298, 142, 193, -17, 44, -146, 75, 36, 19, -47, 52, -142, 210, -48, 115, 97, 229, 100, 87, 260, 36, -21, -105, 46, 171, 100, 299, 211, 41, -28, 21, 52, 20, 105, 250, -178, -69, 171, -97, -25, -125, 3, -19, -33, -86, 132, 21, -263, -22, -152, -145, 56, -17, 109, 40, -301, 59, 395, 38, -1, -99, 159, 54, 29, 28, 161, 109, -284, -148, -124, 79, 63, -127, 51, 95, 45, -97, -9, -53, 179, -46, -48, -72, 213, 125, -262, -177, -233, -28, -174, -289, 104, 51, -110, 10, 54, 222, -326, -140, -384, -47, 12, -74, -155, -47, 99, 59, -213, -44, -50, 36, -7, 18, -75, 80, -91, 15, -39, -130, 348, -92, 172, -260, 86, -327, 64, -324, 130, -103, 2, 109, -51, -19, 1, -92, 49, 68]
7768F8J06N8k9l84J64J32j82j80K42j38K04k38K85Np6m9j30P3mK14r2m3M0J50
7792A96j67j98M02m46J33L64o29R7K9M1J1L48J05k08p0N5Rp9J25r9q6K12k93K02
7816E4j24K8N9l38L35k9j48J99qj3J70k22q6K55l16J55J30n1m5J45kk67Q3L23
7840B87J00m11J29k00J96j09k2m6J90k71K90j74Jk18J75m3l0J29P7N9m02L85j08
7863a6j47L58m34J38O5Q6j40J15j92J95k07K3K20l13J26Q4r7N6J1KN3j38K41M
7887I3k03P5j47n9L35k45M07k84p8M43l73K70j47j6j58m3JJ12m2R7N5l66K91K66
7911B84o0l13r1K94j03o1n8N4Q3k2K08o8m78L30mj53P6P5P7M2QqQ1k25K25k05
7937a2K63k78M4k8j43J0m9K35j56R7l0J06K0q4J49k35Q5p5K06J01k56j62L60j36
$$ y = [68, 174, 232, 203, -181, -17, 115, -67, -247, -5, -143, 61, -177, 108, 113, 37, -12, -142, -69, -73, 141, 49, 6, 46, 196, 29, -169, 233, -213, -80, 284, -345, -248, -219, -178, -167, 181, 286, 78, 8, 63, 72, -7, 118, 19, -67, 145, -148, 54, -70, -42, 17, -321, 14, -15, -163, 36, 28, 15, 185, -37, -123, 132, -184, -29, 101, 50, 5, 150, 148, -119, -36, 287, 387, -24, 105, -95, 101, -8, -30, -76, 114, -157, 133, -41, -40, -258, -83, -126, -156, -27, 50, 109, -293, 92, -16, -163, 195, -239, -101, -36, 50, -90, 25, -167, 28, -179, -156, 64, -249, -123, -39, -136, -80, -69, -67, -14, -152, 89, 93, -110, -35, -182, -241, 94, -151, 256, -28, -106, 337, -36, 234, 87, 71, -87, -130, -129, -17, -59, 38, 93, -273, 18, 284, 224, -89, -180, 114, 11, -50, -108, -54, 29, 7, 215, 147, -331, -1, -5, -158, -82, -7, 70, 112, 120, 112, 193, -32, 193, -12, 251, -27, 17, -11, -154, -144, -193, 42, -114, -17, -47, 59, 79, -5, 144, -91, -6, -81, 125, 226, -30, -192, 168, 32]
7961C2N9J63l59L88l94P2M8j50j03K30q6j0K16k96K53o8Q6l0j59J80j53M0R1J00
7985A50k4j45jK41k38j43J47r9n2j00K99j91L24j07k0Lp3J78l31L13j04J8p8k51
8009b84L02j01N0J5J5j37J35Lm6J24M5k49J02J18j13K37Ll39K45j99k50J32L79
8032A87L3l38P8J24kk6L5N2J49l99K78j20r0J44j20k70K73l79J80K64j30o7L62
8055B18k44k3K76Nk89m9%n8J53j70L47k52K86j12J80k98J33m13J92K36k96J37
8077d1L46m41k15M93j59J16o8J01j11j74J45L46k48O9l34L88m22K60J29j72Ll9
8099b8k7k3J32k95M29j92M9J7k8o1q6J63r2M9Q0Mk14J73k56Q4K3M2K27l53K01
8124A8J88k47j48J90j03J39k64M29Pj15l4j55M9Q1k42K07oP9r1J6J5L76k44l57
$$ y = [32, 91, 254, -105, 283, -111, -39, 9, -141, -244, -14, -100, -110, 106, -190, 63, -5, 81, 51, -108, 72, -81, -41, 50, 150, 126, -19, -20, 221, -17, -160, -13, -112, -164, -264, 35, -156, 168, 61, 41, 44, -29, 149, -182, 131, 27, 45, -33, -284, 18, -83, -33, -18, -3, -140, -5, -2, -48, 76, 121, -128, -26, 92, -21, 216, 219, -120, 125, -74, -324, -192, 187, 220, -118, -40, 84, 82, 56, 91, 143, 292, -107, 171, 51, -39, 105, -15, -285, -12, -391, -211, 53, -77, -144, 218, -26, -49, 227, 232, -57, -106, -106, -164, -11, -181, 166, -86, 200, 88, 268, -30, 103, -310, -118, 118, -178, -41, 305, -136, -351, 142, -17, 99, 31, 132, 21, -153, -8, 338, 90, 159, -175, 213, -209, 51, 180, 8, 11, -28, -55, -78, 54, -241, 188, -4, 45, 62, 34, -27, -113, 50, -42, 7, 87, 91, -123, 50, -206, -122, -99, -57, 170, -183, 18, 206, -41, -189, 1, -102, 37, -227, 202, 209, 94, 60, -95, -46, 35, -207, 0, -6, 73, -18, -2, 13, 389, 145, -212]
8148b12K84j90Q1r7J71j55N0J2j1J4O6K6k8L5l9r0K9N9J30J19k79J44k6k01J75
8173F7j49J49J80j34Q9j61J11k81Q9k63K65J64n9L4l63L31k75J64
$$ y = [-212, 72, -118, -37, -134, 37, -118, -68, -56, -67, -53, 13, 39, 11, 46, 7, -83, -54, 5, 135, 254, -25, 119, 93, -108, 67, -82, 67, 247, 113, 202, 41, 152, -129, -40, -303, -38, 126, 67, 101, -262, 69, -206, -42]
8191d2
$$ Imaginary data points
##PAGE= N=2
##DATA TABLE= (X++(I..I)), XYDATA
0@%%%%%%%%%%%%%%Qj6J6j6J6j6K4l2L4m2N0n8O9p7Q8j04J20j37J56j75J98k24
36a18K51k82L16l54L94m37M86n38N95o60P26p99Q83r74J073j182J303j439J590
55H34j756J948k169K420k715L070l499M034m725N653o974R022j2668K1155p9568
70f5938n6048M8232m0850P693O4895N9991n9069j00998l1759P1098N5091k2782
82g0444m3828L2224N6457j4106p9510l3035M4011M5057k4881l9827K4765O9522
94c3595M338q2634o8964K6921P1185K7599j8723K953L2074m357p0036n5621L8515
107a30345R1866L6365m1496m2646Q553J8318k3653l7738J8798O6688K9918l9487
119d4859m0819J7815L9849p595m6641r111N7459N5497j0311m1971q962J9991m757
$$ y = [0, 0, 0, 0, 0, 0, 0, 0, 0, 0, 0, 0, 0, 0, 0, 8, -8, 8, -8, 8, -8, 16, -16, 18, -24, 26, -32, 37, -40, 48, -56, 64, -73, 83, -92, 106, -118, 133, -149, 167, -187, 207, -230, 256, -282, 313, -347, 379, -420, 463, -511, 562, -620, 683, -756, 834, -922, 1026, -1143, 1277, -1438, 1632, -1867, 2167, -2558, 3095, -3879, 5143, -7525, 13630, -65938, -121986, -73754, -114604, -106911, -42016, 17975, -41094, -142092, -173851, -102753, -47662, -70444, -114272, -82048, -25591, -39697, -119207, -152242, -108231, -63174, -88055, -127882, -103117, -33595, -29257, -111891, -180855, -153934, -82749, -55150, -73873, -70920, -38846, -43203, -113239, -168860, -130345, -38479, -2114, -43610, -86256, -77703, -59385, -83038, -120776, -101978, -35290, -5372, -44859, -85678, -67863, -28014, -35609, -82250, -91361, -33902, 21595, 11284, -30687, -39649, -19658, -24415]
132b4415l2416j279N8948N9209j2555o4534l4536K2485L0014p41l259K9655L5875
145F2451j2004n2569k6121L2863M3375r92k5112L502L3251J0970l2483l2474J1969
158A6626L4155N548j8992L055L3507J4092l4914m5166J056M3718L1038q421j3934
171F1368P550M670k5584l2283P621M5809L1372j8323l5434n778J6591j120k1153
184C5306l203K6718K3726j1814k9491n273J9217M485k3864j5421J9738L1706J833
197G3663k7564k0860N921P464j1288j0433J7881K9361q92l5656k9365N946K2709
210B6887N378j1250L81J4187k90k6167k2532Q076K4105N397j7942j1287J1649
223F592J0442j4085k4115k725J7963J0385j0247j0769Q123J0221j2773k7231o413
$$ y = [-24415, -56831, -58110, 838, 60047, 47492, -17042, -51578, -29093, 921, 180, -3079, 26576, 62451, 50447, -2122, -28243, 4620, 47995, 47003, 21891, 25393, 58644, 69614, 37131, 4657, 16626, 50781, 56329, 37337, 40392, 73899, 87991, 53077, 7911, 8967, 52685, 83723, 75302, 61368, 68918, 73588, 48004, 15721, 23342, 69151, 100523, 82200, 46766, 40988, 57579, 56459, 35306, 32103, 58821, 82547, 70733, 41242, 35969, 55186, 59671, 35807, 20386, 40124, 71830, 73663, 46099, 25239, 31160, 38624, 27336, 16903, 34784, 64145, 63253, 27597, -1768, 4178, 26887, 32265, 21015, 21396, 35583, 35293, 9126, -13406, -5330, 18775, 24172, 6230, -5057, 6592, 17034, 2949, -21166, -23891, -5928, 4457, -5790, -16559, -8436, 1785, -10988, -38219, -44632]
236d4632K2033K1105m856j7628n878O024n031j5589l748K0580J9252p085k3511
249c8964j0493J0342Q485q151q746Q940J5611j526j7644r811R608J0227o022j2120
263e0264M615J8503O010j4805j5775L139J1708K186o076K538J3896N705j5459
276c4079j7679L211J8797J0186n855n807N388O335p173j2364K801J7906J0622
289g711p803j0042L684J0363j73j0537k867J2526J2709k293r456M44Q800J218
303a138r033m483J1846J5716J359j2477o456N583O067k335k969Q196J2557R42
317B3375j4033q871O701J1798J112n647J709Q471K796r078q296M022J1454K697
331B8210o308k079P431N493o632j0498l41J0987O339l692m040L789L455n706j0354
$$ y = [-44632, -22599, -1494, -6350, -23978, -29856, -23832, -28863, -44452, -48200, -27620, -8368, -15453, -38964, -49457, -39115, -30630, -38781, -47527, -38587, -22976, -24502, -42146, -51957, -42349, -32122, -38144, -50264, -45649, -27146, -21136, -35941, -51716, -48577, -36869, -34683, -40759, -38221, -24325, -18620, -34079, -51758, -48547, -29750, -19564, -25419, -31226, -25838, -19503, -26676, -39040, -36239, -18333, -7711, -15514, -25556, -21872, -11509, -11682, -22219, -25086, -12560, 149, -2144, -11600, -11156, -2356, -1138, -10171, -14654, -2808, 12908, 14267, 1790, -4666, 917, 6984, 4649, 1680, 9876, 22433, 23375, 9342, 471, 7172, 18970, 20082, 14435, 16144, 24615, 27411, 18333, 10037, 14059, 25513, 28210, 21902, 19823, 27254, 32747, 26115, 15617, 15276, 26263, 32602, 28910, 24870, 28659, 32114, 26408, 16054]
346A6054p5J1405R401l331r048j822L603q69o184j239Q417P836l381j0440m062
361A6265M980K868n152m180N127P357r36r143o294L194M051l460m551L649P396
376B1171L32r731q748Q81N968J038l267%M482l54q655q365P53P964L553m292l646
393i16J857J176n957p187L24O720L946l554m998J80K256l118p085j326N952N640
409f090j375o403k374J680j020n217j689O392O511j432p811l888J084K390k168
424b1410j220L691N682j109p154m424J381M084M51j664J480M767Q16n786n172
439b5587J135N038K176j504O64M046J464n004n787Q31N973M413m53r49J696J042
455a0806k724m502R66O264N320k33k569p4J713p11l191L16N647N517M6l404j016
$$ y = [16054, 15979, 27384, 36785, 33454, 24406, 22584, 26187, 25318, 19134, 17895, 26312, 34148, 30767, 20327, 16265, 21245, 24113, 18961, 14781, 19908, 27265, 26329, 17186, 10892, 14086, 18137, 14677, 10126, 13775, 21171, 21503, 11772, 3024, 3905, 9873, 10911, 7644, 7644, 12126, 11772, 3117, -5248, -4495, 3469, 7022, 2730, -916, 941, 2117, -3840, -11027, -10703, -3983, -37, -3591, -8589, -8409, -6153, -9271, -16356, -17682, -11730, -6090, -7465, -13868, -16242, -14562, -15582, -20799, -22488, -16096, -9585, -11017, -18828, -22716, -21632, -19242, -21410, -22630, -18939, -13257, -14366, -21520, -25944, -24563, -20479, -20028, -21692, -20212, -15445, -14629, -20415, -25587, -24452, -19414, -17238, -18742, -18078, -14032, -12568, -17572, -23359, -22528, -16555, -12142, -12595, -13544, -11848, -10806, -13530, -18032, -17066, -10802, -5482, -5715, -8284, -8358, -6645, -7356, -10547, -10231, -4584, 933, 979, -2425, -3441]
472c441J825O68j912l82M439O134P65l845k645J339J638l92j41L792N300N03m338
489I307m008R70L478R80j12J771L685P48m055m541P97L810K271m72K07K301O72
506A7809l068m062j99L599L062M4j388O90O32k511l992r91L724M163Q5k666j012
523A3919L3j205l095n28K969L165N92l315k292m13l81j858o75K058L138L59l336
540I135l268m62O33q90r98J286K865K65l500l514r38J190N8n52R92J345N5k948
558G54l660j006J602J570n71n04J009Q9k619l440j299K262K266k48j221k5n3j689
576f783l114q57K385K118K08j447q08m0j155k222n41J691K799N02j444j967l67
593a1042J0r81o69J572L011M33j909k406m23R66j11l26J263K442L80j824j862
$$ y = [-3441, -1616, -948, -2860, -3242, 1197, 7331, 8096, 4251, 1606, 2945, 4583, 4191, 4050, 7842, 13142, 13645, 9307, 5299, 6269, 9747, 10727, 10615, 12386, 16071, 16819, 12764, 8223, 9020, 12830, 15101, 14629, 14836, 17137, 17809, 14741, 10679, 10480, 14079, 17141, 17185, 15797, 16487, 17119, 14608, 10616, 9625, 13349, 17512, 17597, 14931, 13919, 13952, 12747, 9652, 9124, 12093, 15258, 15850, 12535, 10243, 9830, 9449, 7591, 6916, 8974, 12112, 12471, 9135, 5867, 5405, 6038, 5148, 4150, 5436, 8301, 8566, 5066, 1552, 614, 1804, 1862, 1310, 2302, 3647, 3702, 754, -2906, -3912, -2310, -740, -1311, -1815, -806, -717, -3336, -6776, -8075, -5813, -3547, -3795, -5016, -5041, -5094, -6783, -9897, -10754, -8369, -6251, -6043, -7490, -8298, -8338, -9493, -11715, -12256, -10565, -7766, -7264, -8708, -10675, -11042, -11032, -12013, -12682, -11110, -8099, -7666, -9575, -11981, -12404, -11438, -11549, -11875, -10612, -8170, -7790, -9614, -11476]
610a1476k39J245Q87K3P71J792R88j592k365p5J297K159J93J78J057J126j263
627e294j883P3K132J974N83J52K80M09o01j229k65K043K531M97o7p04J80M96o43
646F64n03J696K458Q40j013o40L92P8l88k26J686K185P68j227j285q5Q10J40L79
665F729M79J510R48j382j451n12J053N68Q1M45R83K28r27j645o87J267Q67k8l06
684H220J37N52q62j554q50J320Q97K19p46n44K36r40q55j017P25J255N61j263
702E491r83k65m26q73m73N45J133K80j125j236n68k7l95m81K89O24M87o17j866
721d86q17M21j47l1L9J22N03q28j833m4K74O00n51L1M73l29o02j293m27L40O42
742c943L81m70Q6P2p31q37l71N12R29L40n38o61L99l77r17l01Q92P92M11o51n06
$$ y = [-11476, -11715, -10470, -9583, -9560, -8789, -6997, -6009, -7601, -9966, -10041, -8744, -6585, -6392, -6214, -5157, -4031, -5294, -7177, -7104, -4972, -2998, -2415, -2263, -1983, -1574, -2175, -3404, -3669, -1626, 905, 1402, 1335, 631, 811, 1307, 664, 161, 1857, 4315, 5155, 4142, 3502, 3894, 3972, 3584, 3358, 5044, 7229, 7997, 6770, 5485, 5400, 6210, 6350, 6729, 7208, 8718, 9666, 8284, 6833, 6321, 7374, 7942, 8023, 8468, 9451, 9679, 8752, 7107, 6420, 7687, 8554, 8526, 8220, 8357, 8909, 8047, 6493, 5643, 6963, 7860, 8079, 7333, 6789, 7025, 6085, 5230, 4213, 4938, 6193, 6754, 5491, 4508, 4243, 3817, 2944, 2471, 3016, 4149, 4429, 3304, 2068, 1500, 1473, 1078, 597, 886, 1510, 1997, 1380, -486, -1303, -882, -1029, -1060, -1021, -899, -396, -1224, -3057, -3101, -2827, -2227, -2778, -2747, -2274, -2603, -3205, -4498, -4925, -4585, -3943, -3562, -4032, -3946, -3874, -4605, -5442, -5813, -5301, -4372, -4032, -4570, -5231, -4832, -5209, -6126, -6427, -5535, -4743, -4332, -4983, -5489]
763e489k12n3m3l45L33J150M19l99q18l72N43P8l34O45R15K26n64p89l49R23L41
784d194K77Q2N26N03m23o95o00J091P49N24j82K73K98l53l96Q5Q30J058j85K26
804e06J43K14K2m86K01M58J215O80m00j17P3J47k93m6P06J218K12j08n97J98L48
825C282j2qM39Q98N57n44n30l19O96Q9J50L29N26L57p70n36r9J73M09K10L85m7
847E635K58k09j005l01L56O69l6P2j90Ro99n04n20K64P51j44q0n0k83o91m51n4
869B797M5N99k82l50l14m17j93q36R6L5M99J15o59q12j16k82k04k88L58N8L00
890A49p42m76o84J41l81K51Q1M06k80q19m8q06J59JK44K31j14nk76n19j56k45
912c888M44J90j43L05k52k18n77L15k4K06L22K7q8n12l2n85M69J64N79J65J3k10
$$ y = [-5489, -5701, -5754, -5797, -6142, -5809, -4659, -4240, -4639, -5457, -5829, -5286, -5208, -5542, -4897, -3982, -3756, -4320, -5109, -5458, -4535, -4194, -3917, -3835, -3309, -2806, -3229, -3924, -4524, -3433, -2684, -2160, -2342, -2069, -1771, -2124, -2520, -2435, -1605, -547, -732, -506, -363, -149, -127, -613, -412, 46, 1261, 1941, 1541, 1424, 1497, 1644, 1351, 1305, 2011, 3229, 3441, 3333, 2736, 2934, 3282, 3270, 3262, 3701, 4599, 5156, 4612, 4082, 3763, 4459, 4548, 4698, 5027, 5553, 5910, 5140, 4604, 4505, 4678, 5087, 5297, 5682, 5635, 5893, 5684, 4679, 4378, 4734, 5403, 5367, 5439, 5249, 5258, 4559, 4055, 3535, 3799, 4550, 4406, 4326, 4276, 3993, 3302, 2851, 2797, 2842, 3441, 3159, 2809, 2495, 2078, 1885, 1049, 1145, 1180, 1679, 1794, 1135, 323, 207, -75, -279, -567, -209, -151, 149, -593, -1069, -1753, -1612, -1993, -1742, -1661, -1255, -1535, -2354, -2402, -3208, -3049, -3048, -2804, -2573, -2687, -2692, -2968, -3487, -3643, -3888, -3444, -3254, -3397, -3092, -3344, -3562, -4139, -3824, -3848, -3642, -3320, -3293, -3381, -3893, -3925, -4510, -4041, -3877, -3298, -3133, -3120, -3330]
934c330j79j95L8m1L29O43R6j29k57j06Q8l14K62P51K23L04j88l16Km50N36L60
956a873J61M52M50j82q06L04p8O24O42l81O25N3k19l07l39O01K10O46K70k01m6
977F06K25k88k15M90M81L31K76j96o0p5j89O4L80L88N25k36o3L3k07m19N75J87
999B613M67N02m32j15k68M4K2K13J30J18K42L37n56l41J60j29j86L19N07P4j62
1020C559k04p27K77m9J75J42j91n3j73m83J16K2j88J68J29j81k33q8k52l82p2
1041A312k85L84p8J55k38n26k15l14Q4J67Rm23P8m53k52j43m32M95Ml6j70j70
1063a047k62k92j46k5j50M29j18j50l91k68Q1j80J04L5M8L8m3m91n2j84K56K10
1085b598J73j59j3j3l05KK4K80k06K81K33j38J82j87k70R8J58K01K18k9K8m5k02
$$ y = [-3330, -3509, -3704, -3666, -3707, -3378, -2735, -2639, -2768, -3025, -3131, -3043, -3357, -3095, -2344, -2121, -1817, -2005, -2321, -2319, -2769, -2233, -1873, -1712, -1260, -810, -992, -1798, -1494, -1572, -948, -306, -687, -62, -9, -228, -535, -874, -273, -63, 583, 853, 652, 606, 831, 543, 328, 818, 1299, 1630, 1906, 1710, 1650, 1575, 1386, 1450, 1830, 2218, 2743, 2507, 2444, 2477, 2270, 1851, 2426, 2613, 3080, 3582, 3150, 3035, 2767, 2811, 2833, 3046, 3176, 3294, 3536, 3873, 3317, 2976, 3136, 3007, 2821, 3140, 3647, 3721, 3559, 3355, 2628, 2905, 2856, 3031, 3173, 2982, 2929, 2756, 2273, 2389, 2411, 2223, 2391, 2520, 2339, 2106, 2018, 1766, 1384, 1312, 1027, 1411, 1333, 1488, 1250, 724, 509, 195, 279, 446, 455, 32, 110, -343, -595, -738, -1170, -675, -671, -707, -877, -1047, -1309, -1601, -1747, -1772, -1922, -1493, -1611, -1761, -2152, -2420, -2339, -2519, -2415, -2380, -2332, -2294, -2337, -2828, -2880, -3064, -2808, -2598, -2425, -2584, -2597, -2610, -2915, -2913, -2889, -2609, -2815, -2534, -2301, -2439, -2257, -2444, -2714, -2616, -2458, -2257, -2039, -2068, -2040, -2085, -2287]
1108b287L9P1K51K27K12M4j57K15j57l82M77O8K97n8l32L85j04p5K75J55M07O8
1130c61l5J68k47o1R5LL98R2J26j98j03j38K79lK55M17J10J79l50J23j54J09P
1153G11J65L08j06J45l17M4N7K22J05K36J38l4qj20M38m36K4P9L15J61J01l21
1175A907n2Q2j41J52M0N7M36j44l92j19J37K2K95q2R8J0j63j94k74L26r7J94k13
1198A885O0J21m3k46n4l2j41K94j08j7l58j1k21k7j71K88m81J63K59k95q8o92
1220H5M33k52K07j38L8k28n0m57k09J85j68J22j14j38l37K2q3n7k11J42j34L39
1242a003q2o08R4J28k71p1L5K2J93j55l30M22m04j90L03L89m87o6K61k32P5j71
1264b148L52j36MQ3J36l85K10j70K75Rj53N40j16J06j43M2P1J48l51N75J12Q5
$$ y = [-2287, -2248, -2177, -1926, -1699, -1487, -1443, -1600, -1385, -1542, -1924, -1447, -1379, -1082, -1140, -1472, -1087, -1191, -1266, -991, -836, -429, -361, -396, -228, -475, -536, -441, -438, -40, 52, 178, -20, -123, -261, 18, 15, 270, 687, 797, 976, 626, 749, 595, 704, 711, 876, 1184, 1078, 1223, 906, 950, 1007, 1229, 1334, 1570, 1708, 1674, 1666, 1546, 1984, 1548, 1572, 1651, 1966, 2127, 2228, 1907, 1855, 1937, 1796, 1948, 1988, 2045, 2481, 2337, 1945, 1826, 1963, 1985, 2280, 2198, 2296, 2306, 2143, 1949, 1675, 2001, 1904, 2098, 1885, 1945, 2066, 2023, 1777, 1723, 1691, 1550, 1844, 1736, 1719, 1361, 1350, 1129, 1102, 931, 1219, 738, 901, 1160, 865, 777, 85, 518, 266, 473, 335, 373, 145, 95, -362, -571, -386, -554, -432, -546, -684, -1021, -999, -1082, -1139, -1350, -1208, -1342, -1003, -1085, -1693, -1599, -1471, -1742, -1813, -1778, -1756, -1563, -1718, -2048, -1626, -2030, -2220, -1917, -1528, -2015, -2081, -1820, -2052, -1977, -2148, -1796, -1932, -1928, -1845, -1709, -2094, -1884, -2054, -1779, -1770, -1923, -1383, -1499, -1393, -1536, -1494, -1423, -1275, -1626, -1051, -939, -854]
1286h54k68nr3J53J10L31K21l10K78j40O4k9N5J75J65J41k13r5L24jj93L21J20
1309B57pJ37j78J66p9K73l23L75j37K11J9j74J44l1J44j5L0K7p2J73j09O8K26
1332A125j08j7L18l49M71j36k98M34m32L28J16Lk56N9j3P5j17Q1K0Q1N3J50j61
1355A427rk54K85k93M35k66K42j82j80k5j50K77j83l4M04l39J53j08k27O7j19
1376I21k3J76j52R0l05p0K94l92K77j84r3K1k41N6j14j19l9P2n6N8k69J35k53
1399b10J36j99L08n06J63n35N02j58j42n8k05j32J94pK02R0p23J59j4R2j15K18
1421i40n49M07k42J24qk79L06j61j85K25j99J64k56J27j38J18p5K78l8r0J03l24
1443a632K40l6J07Nj30K59J26j7j76N7M55k25M6K58Oj06P0K36j2o6qK7p2K07j17
$$ y = [-854, -1122, -1127, -1220, -1067, -957, -626, -405, -715, -437, -577, -513, -542, -487, -312, -147, -6, -219, -314, 10, 9, -184, 137, 257, 250, 387, 209, 375, 296, 569, 246, 621, 484, 695, 714, 540, 684, 653, 797, 782, 812, 839, 767, 940, 831, 899, 1125, 1017, 1000, 1318, 969, 1440, 1304, 1006, 1440, 1008, 1336, 1452, 1455, 1199, 1258, 1245, 1320, 1203, 1284, 1304, 1385, 1438, 1588, 1427, 1418, 1164, 1449, 1156, 1591, 1325, 1567, 1385, 1205, 1180, 1030, 1307, 1124, 1090, 1494, 1155, 1308, 1200, 973, 1040, 921, 898, 1074, 922, 1012, 707, 637, 931, 539, 816, 632, 539, 560, 319, 375, 261, 142, 103, 175, 119, 177, -92, 43, -210, -74, -273, 35, -471, -308, -843, -341, -499, -641, -699, -904, -1036, -842, -849, -647, -557, -1280, -1121, -1135, -1043, -1158, -940, -1489, -1082, -1324, -1200, -1208, -1487, -1181, -1342, -1527, -1302, -1501, -1337, -1593, -1466, -1604, -1486, -1561, -1283, -1321, -1411, -1308, -1632, -1392, -1428, -1321, -1316, -1446, -1187, -1061, -1078, -1254, -1197, -742, -967, -921, -663, -657, -763, -693, -457, -469, -535, -543, -516, -588, -381, -498]
1468d98K41J56q1m9rJ2L25k0j62K37p1j8K44jj81MK17K42j99K3L5J52J43j63R2
1493F71l6j34K34N7RK3Q0j11J02m1j1j7J04j26R2M1M6n1j06k1R7k84R0J8K04j2
1519I18l10K12M3Q2k29J58M9k27k9K85j69qP5j03q8K10j18JM70m65PK03k28R4
1543H33k29K47n9p9J5k62K60k72J35O0k65K24p2j11k12j86J65J23l19K62N2k6
1565B84k85J99l6K8k15M4k2k16J96j12k96M55l70J73k75K23n9j89K78p40K64K74
1587c97k34J39o2k82L64k36L4j75K70l31K4Q7j93J78l1k3j86r4J31J99j64O5j0
1610i27K43l92M17p5j09rP9ml6l02R4L48P4k10L27m00N32k01M%J1j5K23j08K7
1635d09j9K91l86L91l65L13q2J27l33K85J86Jj14P1J65J0j67K30Q7J53l35K24
$$ y = [-498, -257, -101, -182, -231, -240, -228, 97, 77, -85, 152, 81, 63, 307, 306, 125, 129, 346, 588, 389, 412, 447, 599, 742, 579, 671, 635, 501, 735, 792, 801, 824, 904, 793, 895, 854, 843, 826, 930, 804, 896, 937, 983, 932, 826, 805, 902, 618, 708, 726, 930, 918, 608, 820, 863, 945, 716, 874, 923, 696, 667, 952, 783, 775, 850, 747, 659, 869, 751, 752, 1222, 757, 764, 967, 739, 833, 604, 851, 792, 713, 728, 466, 726, 454, 589, 649, 384, 608, 536, 425, 213, 27, 192, 315, -4, 258, 310, 284, -1, 198, 162, 190, -25, 19, -3, -219, -23, -135, -431, 24, -346, -173, -448, -225, -284, -473, -195, -935, -671, -397, -631, -492, -554, -836, -472, -708, -674, -849, -579, -910, -886, -799, -992, -814, -845, -868, -1054, -1148, -1017, -818, -982, -917, -927, -684, -1076, -659, -734, -843, -852, -773, -777, -813, -1115, -1021, -673, -599, -809, -482, -882, -350, -551, -547, -547, -536, -551, -328, -436, -409, -428, -137, -523, -132, -497, -184, -266, -139, -472, -187, -1, 0, -114, -43, 122, 132, -35, 195, 282, 435, 100, 324]
1657C24L8j34j77L21j48o2J96R5K01m1q8l1J55m61J13L29M2m68M84j52j17K33
1679F52k75J32k47L5L33j48k4P7j61J13J32q4RlJ80k03l27J80J42l5K2L3j61l6
1703C36j56Q2rR8N5J4j04L9J35j16j25J07j17K49k21O2J53N5k89j68n3K92k26
1726I3L18r0J03L6k43p7O1k66K96j49m3K21k53J9N4L6j95J86N7N5n27K48k8J96
1750A08j85N4k66L36k97J58l49P6M4j56J11N0J09j39j51L8p9q6L18l66K71j45
1772e46n2J7j11J33k01K62r9m7j43K15j39rj7O7mK3o4J92j15kj93K75J17j4j88
1797f43J38q3J5J24K82k86l8J56J81j95j95M55l38M07n1n7M3j6Q3j74K83j69J32
1820E4P7L76j71m03K1P2P5K04n6j04L11k13j25J58m2oJ76r8L0K00j17j71J62M5
$$ y = [324, 362, 228, 51, 372, 224, 162, 358, 453, 654, 613, 525, 494, 649, 188, 301, 630, 672, 204, 688, 536, 419, 652, 377, 509, 262, 297, 630, 482, 458, 535, 374, 487, 619, 535, 544, 541, 721, 518, 191, 371, 513, 478, 500, 533, 372, 336, 180, 262, 253, 351, 406, 420, 316, 355, 490, 374, 249, 356, 239, 488, 267, 329, 482, 537, 248, 80, 27, 319, 93, 411, 321, 424, 460, 217, 140, 201, -65, 231, 82, 39, 260, 7, 26, 80, 116, -79, 107, 164, 219, -308, -60, -88, 108, -77, -23, -289, 47, -250, -92, -441, -365, -321, -477, -366, -316, -207, -346, -497, -459, -538, -624, -306, -672, -401, -546, -598, -581, -692, -559, -760, -498, -597, -644, -787, -572, -711, -720, -737, -670, -674, -651, -715, -523, -638, -640, -833, -558, -441, -455, -643, -505, -588, -573, -449, -167, -453, -491, -335, -154, -349, -544, -89, -427, -20, -71, -128, -85, -101, -18, -192, 91, -78, 54, 131, 507, 336, -67, -46, 26, 101, 305, 249, 145, 456, 243, 118, 276, 234, 228, 404, 306, 336, 536, 419, 248, 410, 455]
1844D55j32R1K82o9k66l3j57M42k18j32K95J32k16k08R0m3J45j10r5K55l0k5j51
1867C02J23j62K6J39j18N3j33J32l67M65l33P3m2J67p8j41l5K13k00J53k49J84
1889A72P3K79n71J44Qj65O52k86p7j23j3K69k63j58J64K4r7O0r5L02l29l0p2L3
1913i9K59m4N7J45l28J30r8j87J20J51p5n4J47l11J31n4j8K6p9N0j79k3M04m73
1937d02mJ92j64j44K08J61m12J04K36j19M8l42M06j74l8j8P1k7j35j78J68N9M2
1960d62J58m34L21o1Qr0J12j17K0O4k9Q1n0J7K2N3R5J39q9L3J21l22M5J20n1L6
1986b60K2L29l25q0L08k1K29l57K36L6j84J05L8J0R5j55J01Q9K6n3P4j63J69q1
2010A88J90J58k84m3J05j63q7J21J02J85m0o6j14R4l9L9k02o4K75%j15J91j48
$$ y = [455, 323, 414, 696, 627, 361, 328, 171, 613, 395, 263, 558, 690, 474, 266, 356, 313, 458, 348, 253, 508, 478, 453, 302, 425, 263, 289, 428, 310, 363, 230, 362, -5, 460, 127, 200, 158, 325, 247, 106, 71, 284, 84, 237, -12, 172, 245, 524, -47, 97, 105, -60, 592, 306, 229, 106, 93, 362, 99, -59, 105, 129, 32, 92, -3, 299, -30, -60, -132, -99, 160, 116, 173, 318, -10, 120, 22, -165, -45, 106, 31, -23, 124, -187, -56, -110, -128, -102, -181, -131, -310, -333, 71, -402, -406, -214, -378, -522, -314, -153, -565, -461, -225, -344, -296, -638, -232, -406, -444, -462, -391, -418, -553, -731, -563, -504, -462, -304, -738, -417, -478, -470, -560, -448, -565, -545, -481, -510, -429, -479, -462, -440, -387, -292, -153, -242, -209, -88, -410, -365, -245, -296, -260, -238, 91, -234, -314, -6, -27, 202, -155, 81, 117, -67, 38, 76, 86, 181, 26, 127, 216, 242, 189, 263, 100, 269, 188, 378, 536, 252, 209, 314, 151, 64, 185, 287, 472, 432, 366, 252, 346, 307, 346, 144, 80, 355, 355, 240, 431, 283]
2033B83J59J35k85r5R3P2%J1r6o2k46N19l00L4j74j6J63k61K51P1q7L4k54N1J49
2058A49p9l9l9J37j24R3L7Q8k37j95M17P4j80j61J34J18k71J53j81N1L17l81o8
2081a87K94k46K29j07j28L23q4P0l00J28j51K12j21J6J21j78K55l33R7J40j5k74
2103b39J40Mk03L10K7k52m9K28j19J0j6J38k6k78K70n4n6j44oj82O5L35m97M43
2127a51Q5l38L14l42K07k44M35k68K16n1k14J38j27Q5j32J94J02p9J54l41J75
2148a82k34J06K51j95J26k6KL51l93q5o5J11N3lJ84P1J00k71J1P5O2j84M02j33
2172A34p1R2J07k27Q7J21J02j76J26k61j9M56l09j17K39k1k07J29K03l2K26l70
2194B12q7j40M08k50n6J62j72L45j9m8j25R3n3k71M87l07L05p1k39PN0k87L89
$$ y = [283, 442, 577, 292, 197, 290, 362, 362, 373, 277, 215, -31, 488, 188, 222, 48, 32, 195, -66, 185, 256, 169, 203, -51, 0, 149, 70, 31, -8, 129, 5, 98, 135, 223, -14, -209, 208, 282, 102, -59, 75, 193, -78, 75, -106, -55, 262, -119, -187, 107, -139, 90, -17, -145, 178, 94, 164, -136, -8, -159, 53, -68, -52, 69, -109, 146, -187, -90, 50, 35, -239, -99, -95, -298, 12, 39, -213, -262, -34, -153, -143, -159, -21, -47, -325, -55, -109, -165, -309, -315, -497, -432, -97, -594, -151, -66, -404, -90, -432, -225, -469, -34, -302, -86, -137, -351, -213, -340, -255, -387, -193, -91, -170, -16, -357, -182, -416, -310, -59, -254, -128, -154, -152, 199, -194, -279, -344, -233, -180, -183, 1, 72, 172, -99, -88, -13, 49, -135, 267, 134, 63, 155, 262, 35, 122, 243, 345, 169, 295, 34, 15, 471, 162, 45, 284, 263, 56, 185, 388, 356, 582, 212, 125, -15, 393, 143, 87, 249, 77, 422, 403, 355, 230, 323, 270, -1, 486, 179, 484, 413, 174, 181, 231, -56, 333]
2217C33m74M64l45L03m2l39Q3k5K58l63K50M3k10K80r3k4L4j99o2r6J48Q9m02
2240c89N00m1o5j57K63n3k59N9K39k46M8J05o1K47j09k68j01L45k12O2R8m5j38
2263a78K3p6Mq0L92p0j80K15m2LJ1k27J27J98kk30n6n0J91m78L79K65m38n7M0
2288c16L04j28J76m6k27r0J52J84O8k33J43J62o51K86Nj71K44n2q7J8l53L01L02
2311ik05J31k03L22k80L6Kl30M00l24M18j84L0N9J75m15K83o8L42j64mq1j71K11
2335b9LJ47r4j64M12m42J52J08k94M74l33K55l24K08j78J56K92l03Q1J98j22k95
2357i2Q3K97K27l35m6K99P2n01O4L98l48k0j61p4K32J23r4K96k10l0L48l02J9
2380B45K3k1o1K61k92j75Q4O6K25k12k04J71l5j50L03n4j73J68J98O0k97j70L6
$$ y = [333, -141, 323, -22, 281, 239, -100, -17, -42, 216, -147, 103, 146, -64, 216, 123, 99, 133, -66, -128, -224, -76, 13, -389, 111, 70, 5, -152, 111, 58, -201, -142, 97, -149, -101, 4, -57, 190, 81, -187, -288, 57, -155, -93, 5, -40, -178, -155, -231, -227, -307, 85, 15, -165, 50, 8, 11, 22, -205, -78, 120, 118, -112, -168, -218, -27, -505, -126, 139, -299, -356, -316, -12, -140, 36, -10, -237, -327, -175, 9, 77, -156, -13, 149, -502, -216, -211, -382, -138, -190, -277, -259, -612, -311, -9, -214, -83, -286, 36, -244, -208, -206, -536, -136, -460, -42, -226, -196, -137, 38, -377, -94, -162, 180, 16, 12, -69, -240, -29, -26, 121, 27, -137, 275, -167, -15, 93, -201, 273, -60, 195, -129, 79, -99, 57, 349, 46, 127, 325, 203, -92, -9, 288, 515, 180, 134, 433, 505, 4, 68, 466, 118, 98, -63, -137, 95, 218, 124, 420, 210, 180, 528, 226, 245, 268, 247, 186, 447, 155, -20, 64, 130, 355, 143, -61, 110, 75, -75, 228, 174, 1, 169, 367, 427, 130, -40, -4]
2403dr7R7K55k61J55j39m6l1j50M6P8L1J67k14O6Q0j10n4J75p7j02J6K07P5L4
2428A97k30J72j48j15J68J45l33J72k58K50j47N6j24K24l16M11j7j4kj37q3Q2
2450d7k71L62m5k66L46m45L73j40j5K79k37Q0k3j53J14o1O6l5J92k31J03n6j4
2473a24j46J44q8K42j16K4L19l55J52n48m6O12jJ27k91l27L75l8k7j07Q0q4Q9
2496a34j46N0J74R6q8o6L24p0j88l9K5q1J82j58m0J31l1J63j56J02M6J13m44J21
2520a14K09pO4q4L9N4j42N1R2m6J89k18q4J8J38n9J23j31J17O5J8k28P7R9j82
2545E8J14j54K68k85K95r6J9q3K20m00M11k73l4l4J24l03L43k07o6%l5K8J46k65
2569b09K87o9J82j48n5L2k47K24k61L75k03J79j20j1M82n93J54l0kj49J82O3O0
$$ y = [-4, -101, -4, 251, -10, 145, 6, -40, -71, -221, -175, -97, -66, 101, -113, -47, 33, -77, -131, 44, -33, -135, -119, 88, 163, 197, -33, 139, -9, -124, 44, 189, -144, 28, -230, 20, -127, -71, -195, 29, -287, 124, 107, 93, 91, -46, -129, -47, -318, 44, -1, -267, 79, -366, 7, -133, -148, 131, -106, -26, -49, -202, -88, -149, -83, -118, 74, -157, -54, -110, -124, -270, -126, -214, 28, -88, -64, 255, -100, 52, -496, -542, 70, 69, 196, -95, -422, -47, -85, -112, -219, -139, -223, -134, -280, -230, -56, 40, -48, -114, 210, 140, -48, -87, -62, -143, 39, -119, -159, -28, -59, 104, -52, 50, 96, 209, -235, -114, 95, 88, 152, 68, 107, 161, 19, 70, 162, 116, 305, 87, 3, 21, 159, 100, 223, 92, 209, 274, 292, 64, 141, 240, 58, 172, 18, 286, 1, 296, 200, 219, 136, 356, -44, 367, 94, 60, 26, 150, -153, 190, -17, -83, -83, -118, -90, 56, -209, 78, 9, 191, 43, -12, 20, -227, -3, -264, 111, -92, 87, -33, -44, 438, -155, -1, -31, -33, -182, 0, 63, 123]
2592A23m27K24J20n09M24j61j42L84q6p6J6L2k05K68j53N3k6n2q1N5J38j67J51
2615i7K1K59l80K76k27K37j20O5l18L83Lm3q6j78J02M6m1j91L95j90Q6OL9J64
2639B11j29m9j45j29J35j46M01j80L3m46N34l7j12K70l92J09J11L4p3L8q1J66
2661A23k47P7k01J16j55K60p3N0j36J38q7N0qK8j49K31R0J4K07l31J06k01J25
2684B7Q7q5R8J81l20J01O3j41L18p7p6j80K46l01J34j35L10p1K0j0j6K27k66j04
2708C0J78J4j34O5k4J12k94J17k44J75J47J18M6k13P3l40J55J72j50K45j63N0
2730A35j2j17K11k79J88M5l13K51J95k48j71M0K3L93l80p1K50Mq3q4m5k3k4J97
2754H2l80L26M8k31P3j55L74l33M72k70k40j5L23r9j67P3J61m70L92k53J82j1
$$ y = [123, -304, -80, 40, -469, -45, -206, -348, 36, -50, -126, -110, -78, -283, -15, -168, -115, -141, -193, -274, -219, -81, -248, -97, -76, 183, -197, 79, -148, 89, -31, 34, -284, 99, 102, 59, -27, -205, -103, -57, -98, -289, 106, -84, 2, 8, 47, 211, 82, 33, -112, -241, -106, -252, 149, -31, 2, -444, 90, 53, -59, 211, -181, -72, 39, 73, 0, 38, -43, 123, -124, -47, -248, -132, -287, -27, -100, -50, -186, -48, -135, -85, -93, -65, -214, 17, 107, 121, 328, -3, 103, -98, 27, 114, 29, 127, 308, -12, 89, 152, 11, 329, 252, 176, -4, 242, -59, 75, -60, 250, 179, 199, 189, 173, 400, 134, 30, 208, 222, 88, 153, 129, 241, -53, 64, -180, -5, 142, 260, 306, 93, 166, -174, -19, 153, 3, 248, 85, 135, 123, 6, 217, -62, 126, 171, -142, 109, 304, 56, -115, -75, -52, 341, -39, -110, 140, 144, 61, -23, -68, -91, -115, 82, -298, 28, 76, -155, -82, -237, 137, -196, 276, 6, -234, -249, 74, -25, -192, -119, 42, -428, -36, -289, -107, -118]
2776a18R5k72J11k70L72Q7j82J95k87K88j64K41j78J73m32K63K7K9j75N2J37p
2798a5j99J56K34k10j22pL73j56j29J23j29P7j02K47k05J54n7j1KJ48o5M4k94
2821a43J05j03n7L49p5m7K82j67l12L33k76N8J69j38P5R3k05L22m33K8L74k10
2843B2j18j6j66K02q6N8J54J50k08K46j91k9j36M7J59k42L06r0J38o1k51K42k40
2866a10K60p6l4P2l46K15J60r9K01j88L37l25Q0j73J18q0J80K1J9j38j42K05R7
2889B54k20j3n2J88k12L47k61L13j39l08N0j19K02P1j89L17j65l1P8l4j25M2J22
2912A16k9k34K65j46J43O0j6p8L1q5j69j9N9r7OJ08M21k51k24m8N8J83j09P9k26
2937b02J66j81J56m4p3J14K3j66j29J61n2k67L38L54j62k37R4J0l6k69M03q9J22
$$ y = [-118, -23, -295, -184, -454, -82, 5, -177, 18, -269, 19, -145, 96, -82, 91, -341, -78, -51, -22, -197, -145, -8, -15, -214, -58, 176, -34, -156, -163, 210, 54, -75, 48, -81, -4, -106, 141, -64, 90, 33, 22, 24, 172, 107, 151, -143, -38, -141, -198, 151, 76, 29, 311, 144, -168, 165, -111, -53, 116, -22, 53, 146, -59, 263, -170, -142, 232, 22, -96, -112, -278, -76, -162, -104, 50, 200, -8, 238, 47, 18, -118, -71, 88, -154, 152, 62, 200, 139, -112, 130, -110, 150, 74, 40, 112, -234, -19, 141, 42, 243, 55, 392, 67, 147, -26, 92, 12, 192, 213, 232, 94, -48, 157, 254, 34, 21, -31, 157, -55, 292, 31, 344, 205, -103, -53, -172, 30, 101, -88, 229, 64, 33, 111, 77, -48, -6, 116, 87, -147, 118, -28, 115, 175, 159, 81, 112, 27, -142, -161, -102, -199, -193, -85, 336, 85, -139, -187, -129, 54, -55, 24, -202, -36, -217, -61, -105, -178, -64, -41, -207, -336, -175, -227, -494, -156, 198, 36, -201, -107, -97, -133, -402, 1, -88, 34]
2960C4J8j60n4J34J53J71l53J28J9o2m9q1K72m07K30O5Q6k88R8O0M8l4L8k27K40
2985G9n5K32j65Mp1j57n5O5j07L17rLK05k24j16M8r1J9K7K97o8j93J01n1k56J97
3011b4J73J38k72J32J72j00J40l32R0k8LJ15j81j86K04N9q4P2K56j83m09K10O7
3034C2j50L32q9J23l14L5J99j06J7r7j5n6M5L6J7Q8l13J3J17L83k79L2k50J57
3058d3O5J15J2M6l97J87M23m40j2M87m09N4k91J73O6j64L45r7r3K09k29j77p7
3081b47K97l16L81k21O0J3J29K3k94L32k89K4J61J76k30J08k71L13l4k40j35j03
3103c63N2L32j98J97k7j73O5R4j52P5rJ28r8L5M5j04j1j02L68j10j93RN9P0J08
3128I7n3q7jRm5j15L65l62K89k73J54J93j19l11J17P3J46j14o6Q3j28O0J59n5
$$ y = [34, 52, -108, -162, -28, 125, 296, -57, 71, 90, 28, -21, -102, 170, -237, -7, 58, 144, -144, -46, 14, 62, 28, 66, -161, 79, 24, 256, 91, 95, 24, -133, -188, -123, -230, 87, 78, 81, 286, 62, -54, -6, -97, -78, -51, 246, 178, -15, 86, 35, -221, -24, 149, 287, 15, 147, 319, 219, 359, 27, 117, 89, 92, 207, 26, -160, 44, 103, 19, 91, 347, 164, -245, -35, 32, -118, 214, 125, 248, -66, -31, 168, 62, 79, -18, -33, -89, -44, -8, 9, 97, -216, -203, -86, 297, 18, 50, -200, -43, 22, 137, 149, 195, -202, -15, 408, -32, -44, 443, 34, 88, -203, -30, 36, -128, 217, 120, 27, 236, 7, -170, -247, 50, -266, 115, -106, -46, -33, 96, 119, -175, 157, -132, -108, 53, 229, -1, 107, -164, 149, 115, -125, -260, -363, -311, 21, -177, 20, -7, -180, -115, -21, -173, -98, -107, 21, -77, -42, 3, -101, -112, -214, 154, 44, -149, -140, -81, -11, 97, 44, -43, -44, -35, -80, -195, 170, -192, 97, -176, -22, 171, 52, -259, -142, -69, 77, -37, -103, -20, -148, -88, 71, 16]
3152A6Q8Mj13k4L6J3J50qk12J40j01Q3j55O2J65k14L0J17p0p9J68L6l53L52j10
3177B1n9Q1K29m37J91J12j4L3j15R6o3O9P8l64J72J20p3j12Q5K36k95n1K89jl36
3202a08J92l43K28k85L29L4j7J58l03o0J73j68K21j83L34j93m6j07K43j07N0j49
3224a07q7J41l67O66l49r8K88k14J09L1K92l20N1J80l05l58L38J1J15o2o2L13
3246B06j36l03J73N6J17j74J75j67l75K28L5K46m6k0k99K26L04j33K1J6j32M8
3268F6j24r3J32n6P4J50k04P5j15M4p9K80j66Mm4MK84m91K56Rm0J51j08j75j59
3293c25J08j6K36m1n2qq4j11L68j25j38L08j96pO3NP0j0K69n17K28j41J44L7m2
3318B3j0N0M3j7k18K06j98K84j08J31k65J0p3K50k34j54K15J32O2q8L7K4p3K25
$$ y = [16, 104, 108, -5, -29, 7, 20, 170, 162, -50, 90, -11, 72, -83, -21, 144, -70, -40, 77, 7, -72, 96, 132, -221, 131, 21, -38, 43, 272, -165, 26, 138, 124, 157, 42, 138, 75, 144, 222, -142, 30, 150, 77, -35, 50, 286, -9, -60, 229, 228, -108, 84, -259, -31, -316, 13, 47, 30, 188, -115, -175, -2, -170, 51, -132, 202, 9, -37, -144, 99, -8, 42, -107, -194, -53, -420, 246, -103, -201, 87, -127, -18, 13, 305, -15, 36, 216, -89, -447, -109, -98, 17, -45, -107, 206, 70, -233, -60, -4, 113, -61, 114, -53, -428, -200, -165, 81, 35, 15, -284, -58, 246, 113, 134, 150, 18, 66, -58, -151, -19, -75, -1, 149, -55, 20, -95, -51, -130, 150, -16, -12, -56, -52, 232, -259, -3, 6, -34, 117, 9, -166, -325, -217, -233, 3, -38, -90, -98, -182, -293, 75, -50, -188, 120, -76, -83, -20, -15, 55, 45, 314, -203, 25, -116, 28, 65, 23, 13, 63, 106, 89, -129, 77, -121, 163, 55, 186, -79, -69, -142, 108, -126, -280, -65, 67, 129, 41, 78, 102, 29, 254]
3342B54n7k12l3K58l30J52J24J80j22j62K1j91M0M27m11L40m32K91o6J25l65l8
3364b07M30l84M47r3o9r8K41L8j72l5m6J29n0M0p2j14k36J85O3L03o93M55j62
3387a00J78l23L02l4M2o2j57j8p5J88K36m0j35K36m60K96j45Q1J74k97L40l97
3409a70J37J19k8j6j7K5n35P42l00J69K6r3p5r5nj9K49l1l02Q1l3J99q8K17O5
3434B22m51K54l6L4j8Q3j06j69K30j39K71o0k03L0m3J10J77j57k11J41p4OM75
3457C66n40P5N1l82K57K60l11O05l88J2Q5o4K36k65r6L9j82M45k70j09J41r9J67
3480C3j13p9K65m68M99j56M0r8J24kM4J3k30O6J21r0P2k74L53M4k20j0J12j6j02
3505g2L18j57j39J45l58J38M86m98L11l97J52J70r1J16lK61j50J0m82K44K50k68
$$ y = [254, 197, -15, -48, 210, -120, 32, 156, 336, 214, 52, 73, -118, -78, 349, -62, 278, -154, 137, 71, 196, -169, -207, 223, -161, 286, 193, 124, 26, 267, 305, 133, 98, 52, 181, 131, 171, 99, -15, -251, -66, -3, 300, -393, 62, -100, 78, -245, 57, 23, 65, 3, -154, -172, -247, -59, 177, 137, 2, 238, -222, 74, -71, 10, 184, -113, 227, -170, -33, 86, 58, 42, 25, 50, -485, 257, -43, 126, 152, 59, -16, -111, -116, -135, 114, 83, -219, -138, -171, 28, -60, 157, 222, -229, 25, -11, 23, 5, 88, -18, -187, 43, -96, 175, 115, -88, -58, -101, 9, 186, 29, -182, -41, -115, -109, 366, -174, -99, -48, -430, -173, 87, -224, 381, -7, 5, 90, 26, 262, -3, -99, -60, -242, 203, -67, -176, -35, -134, 33, -80, -159, 106, -362, 137, -19, 21, -77, 47, 45, 89, 102, -128, -62, 59, -31, 41, -233, 120, 164, -56, -66, 46, 30, -72, 246, 89, -50, 95, -263, -125, 361, -137, 174, -223, -71, 99, 8, 124, 121, 382, 232, 242, -240, 4, 254, -14]
3527a4N8J37L4k30J73j35K6K51r7j19J62qk37K33k06l1k6J81j67L12l43J07R1
3550A52m3j00q0L13k15kk11K77j31j29M53m40L8K26k42R8j4K72l46j2P7K60k16
3573a5K8L4p3p4o9l2J85O9J8p6J10j29L4p0K68j40m3L7r9m6j62K03l8J05l23K80
3599a8kL0O2J0LJ5n9J04O5k25K58k37k24J72J02k17J88l8k53M67k13k8j35L53
3623A80J3n0L7l48O4K7J79k28K80j08j09R8k6J57j10m75K68J86l2j17J31J74m16
3646b25kK08k05M8J75J22r9K5J16j05K8m9M0ml21l8K05K50l16J89k42J24LN8J79
3671A64l47J81n5J61j05P4k03R0L00k52J40L29m61l02M09j24k6j7j77L43j65k50
3693b93K45K17p6r1J12k71J08K30j10k6o4J34J08l18Q0Q6o1q3R8J88J94n35J45
$$ y = [-14, 44, 181, 215, -15, 158, 23, 49, 300, 203, 84, 246, 238, 1, 234, 28, -3, -29, 152, -15, 297, -46, 61, 152, 109, 9, -71, 242, 27, 25, -186, 91, -40, -169, 284, -156, -118, 108, -134, -36, -50, 222, -124, -136, -59, 201, -15, 13, 47, -26, -100, -169, -201, -16, 53, 71, -5, 105, -24, 10, -60, 208, 68, 25, 62, -37, -83, -245, -42, -80, 25, -298, -18, -20, 10, 72, 82, 85, 100, 41, 145, 210, -15, 243, 6, -218, -46, 56, -161, 27, -11, -264, 203, -10, -38, -173, 180, 193, 143, 180, -168, -104, -77, 102, -126, 154, 46, -63, 35, 9, 166, 56, -419, -151, 35, 3, -114, 17, 191, -225, -227, -19, -224, -176, -1, 121, 22, 47, 163, 58, 86, 37, 77, 73, -248, -286, -81, 169, -147, 42, -200, -76, -73, -15, 164, -183, -2, -57, 104, -1, 73, -130, -40, 260, 8, 148, 477, 16, -286, 123, -1, -27, -44, -221, 122, -43, -293, -48, 169, 93, 2, 114, -157, -49, 181, 71, 45, -19, 115, 223, -95, -15, 71, 10, -73, 25, 213, 407, -128, 17]
3716A7l7p1J23J57J30j85j62l58L22n1O8P8r4K7Q2j15R1J36j31k95L85j41J46
3739A22J02m51NK85k13M34n91O9J35n7M09m61K61q4k21M63l99L51jj32J44l66
3761a96O3k34K76k08J14J26k5L6P6J62k13j3LL3k49L75k4j55m6L73l01k92K06
3784a13K97J5j3k23j1j41L39k71K64r5j28J10kq4k88N53j39j81J55M9r1J14lj08
3808EL0k03J24R8l5M7j25j42P6K06Q8L9J3n05N95k34j17j65j97N52K2l78J75M4
3832A3J77m0m1J38k49J63ll33oJ72j29M03j91J75j62J05l27L78m1q2OK3j63k69
3856b83M23l19J25l4k9l6J20k35L24rq8K87k02j00J45l5r5j02O0J29k5L6k62L90
3880A85mk29J76q5p0K5kR4J30n6j79J50p2j43l2o0R2J35j9o5j66K05o1K00l80
$$ y = [17, -20, -91, 32, 189, 319, 134, -28, -386, -64, -115, -47, 31, -63, -36, 46, -69, 22, 158, 27, -268, 117, -24, 122, 224, -227, -222, 63, -150, 284, -307, -238, -103, -160, 249, -212, 49, -35, -256, 207, -192, 159, 158, 26, 170, -196, -133, -367, -91, -299, -185, -59, -84, -48, 28, 190, -23, -36, -33, 0, -249, 126, 102, -53, -99, 274, -27, -319, -113, 184, 199, 186, -37, -48, -189, 150, -121, 143, 48, -80, 30, 28, -56, -344, 209, 70, -111, 44, 93, 2, 116, 113, 5, 35, -168, -44, 54, 19, 66, -59, -201, -125, 81, 169, 208, 221, -284, 311, 77, -40, -205, -402, 150, 172, -206, -31, 13, 190, 150, 109, 247, -2, 161, 158, -175, -181, -9, -138, 265, 74, 249, 87, 192, -135, 243, 202, 120, 126, 149, -14, -283, 140, -179, -54, -88, -117, -153, -33, -268, 56, 47, -41, 246, 44, -56, 89, 54, -41, -143, -83, 46, 21, 57, -205, 185, 181, -48, 128, 43, -27, -2, -4, 90, 220, 164, -15, 135, 63, -80, -112, -172, -80, 55, 36, -29, -195, 10, -51, 149, -231]
3905b31K12r9J42k29J61KK5RK55n9j95pj07O5P1K7j27K14l68L69k01J19N0k71
3929a73J33r4j21M36k30K51j53J13J4j36o3R6m6j93J74J4o1p8L9Q0J52m0k5J27
3953B16k67J55k03p1K94l00L03j81j76K10j4J13J1J8p0j99J36J04R9j07NJ80m80
3976b24j94L61j64K97j08o1N1j56J17K70p4j66P7K62l01j24K12k02K9j42J74K28
3998A62j11p4Mj7np1J43p6J93k91J30j47K07j07N7O1j17L6j09K62j36k4L06l81
4022a05n6K25p8J3Q2j57l9j98L64r2K92l05M24m21l3M8j27L68k54j52P4J60j40
4045a07K88k42P4N0K0Q4j67J96j90m4l0m0L68k93L5j15J01N0J73j34j29j45J43
4068e4J81j02o0j66m0K03j0J15l0J35j58J04j84n7o6L06J09j05N3k35j84K22j09
$$ y = [-231, -19, -118, 24, -205, -44, -42, -17, -8, 247, 188, -7, -14, -121, -56, 15, 42, -85, 129, -239, 130, -71, 48, 98, -173, -40, -134, -255, 181, -49, 202, 49, 162, 176, 40, -23, 73, 27, -166, 8, 22, -39, -117, -78, 2, 154, 114, 89, 216, -51, 104, -99, -170, 124, -176, 127, -54, -230, -20, -34, 79, 90, 108, 38, -161, -25, 79, 178, 71, 76, 256, -224, -418, -57, -221, 76, -32, -93, -42, -198, -81, 189, 115, -51, 26, 288, -13, -137, 75, -127, -98, -240, -66, 162, 51, -23, -19, -36, -41, -112, 31, -45, 148, -143, -13, -160, 47, -60, -3, 58, -59, -23, -132, 130, -6, -30, 276, -105, -161, 64, -14, -1, 81, -76, -115, -313, 51, -41, 251, -54, 370, -51, -84, -36, -163, 205, -49, -201, -127, 33, -107, 181, -61, 13, 63, 83, 167, 0, 196, 6, -38, -68, -108, 260, -33, 2, -113, -12, 38, 211, 77, -52, -197, -54, 127, 25, -35, -201, -241, -38, -48, 67, 37, 172, 14, 118, -66, -123, -189, 117, 226, 121, 174, -61, -245, -23, -132]
4091a32K85Rk46J78J75l51J13J19l55L23k22m7J23o1J58rk6j15l8J12J07j33n
4114c8L35k97k09M9j33K56L67n39M08O5k93j10K56j25r3J41N7j5l02K15j1K8m2
4137c0J08p4j63J79J26l05j35J74k93K78M9m4K02K8p6N4N2m1r1P0j93K8J40k60
4161b17J85p7Q8K90l11J57r6j2j14J43p9l2L31m93L67k31P8m8J34o1p0J92k50
4184a26M6nJ73p2k7p0K28k70j21L47j51rp1Q4J59k31j40L01l12P2M6J84k66J27
4208a04J08j39J14Q5j6p2N9j83K25K83m74N0o7L84l58K29m1K4j45j17L71k42Q6
4231F0o1J06j01j6q8NL25l45O6k6L9p6J44o4j32J29J44m5J31k62j59J00oL06l30
4256a56j8Q0J21L8k24Q7p4J93R3k41L97j05j82J49k01j86J38MJ35k44K56R0q6
$$ y = [-132, 153, 162, -84, 94, 269, -82, 31, 150, -205, 118, -104, -151, -28, -89, 69, 60, 34, -81, -119, -7, 100, -33, -38, 297, 0, -209, -160, -293, -37, 330, -209, 199, 264, -29, -139, 117, -8, -101, 40, 97, 82, -220, -5, -16, 12, -30, 78, 4, -159, 20, 146, -159, -294, -120, -413, -135, -86, -130, 72, 100, 24, 78, 130, 89, -2, 68, -125, -97, 43, -217, -32, -109, -21, 269, -42, 115, 19, 7, -107, 36, -43, -75, 256, -237, 130, -101, -23, -71, 63, 2, -68, 124, -126, -80, -85, 88, 16, -11, -81, 147, -123, -244, 103, -48, -57, -128, -44, 115, -116, -256, 45, -267, -195, -149, 35, -231, -104, 4, -135, -21, 64, 48, -24, 35, -148, 77, 360, -114, -64, -131, 253, -105, 124, 83, 107, -38, -155, 216, -26, 60, -1, 105, 4, -12, -100, -95, 230, -115, -49, -75, -36, -112, 32, -32, -164, -35, 109, 64, 195, -67, -226, -126, -132, 174, -156, -174, -94, 27, 65, -159, -72, -146, 47, 140, -101, 296, 191, 9, 158, -43, -229, -91, -87, 48, -196, 60, 150, 64]
4279F4k20J81M2k23K02j03J20R2k04j71L06j39K45l02J65j52j04L58m8j20NM2
4301C6Q4m8j4l42K63J58L2j7l0J69k25J09p9J21k48P3j41Q4l6K5o1K47m37M70
4325A93l64J46p0J71r2K74m05J91k11P9m0K56l49J64K34l66J88mL42l12n9K17
4347A83k30L7O2j21J48k60L6J9r2K45j28R1K5k42M11l55L76k69J3j26J92l7J43
4370A21rj8j11P9j23J13j02j58J77O3k8K19j42k33J96j17J06J7j78J69K9j96K58
4393A32j47p1K15l15L45m6j84L5k35K43k22M61J97k98L8k1L1j3k3l16O5K0K99
4416A90k53N6o7j23J27j8J2j25P5N1J33K6N7l59K75L6j38k4J09o5j74L05j55J0
4440c9n1J84m9j32L0j96K49N4j65J69O3J4j45k08J30J27j34J56p0K47m47K62J81
$$ y = [64, -156, 25, 67, -156, 46, -57, 63, 155, -49, -220, 86, -53, 192, -110, 55, -97, -201, 157, 109, -11, -6, 36, 120, 72, 58, -284, -21, 137, 169, 152, 122, 291, 66, 175, 96, 217, -31, 42, -99, -15, -51, -26, -87, 160, -277, 193, -171, -25, -95, 76, -16, 258, -147, 44, -167, -88, -128, 128, -221, -57, 177, -189, -1, -5, 337, 25, -34, 183, -47, -10, 52, -69, 79, -181, -145, -126, -218, 27, -101, -10, 15, -227, 184, -171, 205, -64, -51, -177, 15, -22, 121, 112, 94, -17, 62, -61, 52, -50, -208, -31, 32, 4, 223, 81, -152, 44, -73, 33, 50, -128, 41, 70, -126, 132, -15, -86, 129, -186, 159, 113, -71, -36, -271, -28, -250, 211, 408, 110, 148, 127, 158, 145, 122, -194, -129, -109, 190, -63, -7, -74, -197, -70, -88, -76, -201, -126, -75, 58, 84, 141, -218, 57, 93, -45, -69, 40, -25, -199, 106, -49, -39, -90, 94, 45, -87, -57, -253, -4, 50, -115, 54, 117, 131, -14, -222, -92, 35, -99, 57, -13, 234, -213, 49, 230]
4463B30k45j33K25j7M5j47R3j39K19k65K02k65J19J16n3R9j46K46j72J86p9j21
4485bO6j8J41r0Q9l59J22J66k65L48j92J23l87L13J07k44J17J00r8j00J83J04
4507B24m35L78k09J17om9m8J92n4J19l06O8Q8j08L2k14O1J06n2K23j3K23l80P
4531c6l5q2K43j22q6L9K51l14J31Qq6L28j32k80K50k13PJ73j6n7J37j31kJ38j37
4556b4K65j79m2o0j4K19o8j43N2k67M44p3k74J95L06n59L38k94J26K81l32L22
4578B19l53J0m5O1Q2k1K01k35P9k11J06J79j40j13L48j93L15k67P3j14K17j22
4600G6K8kk7j04J57j90l3K20j96k4L19j59k41K01n6L74k50l55L11k56L74j47j65
4623a45r7L11n13K90m1L30j85J88j11j74J45O3q0k47J60J93j17j59J35J22j52
$$ y = [230, -15, -148, 77, 60, 105, -42, 51, -88, 131, -134, 68, -197, -78, 38, -15, 84, -62, 184, 12, 198, 119, -2, 64, 46, 187, 97, 186, -173, -51, 115, -150, 198, 6, 129, -258, 55, 162, -82, 35, 135, 37, -63, 120, 224, -211, 167, -42, 75, 69, 20, -28, 164, 110, 229, -77, -9, 79, -29, 3, -211, -150, -44, -96, 127, 114, 337, -43, -36, -71, -153, 90, -32, -118, -79, 172, -142, -11, -3, -89, 239, 107, -173, 77, -136, -129, 44, 28, -29, 108, -23, -25, 113, -24, 241, 62, 20, -40, -54, 165, 97, -46, 6, -261, 183, 110, -164, 31, 337, -222, 116, -178, -52, 229, -103, 219, -134, -124, -169, -108, -26, -47, 154, -81, -2, -213, -107, 72, -68, -181, 167, -26, 289, 22, 95, -19, 198, 76, 104, 102, 75, -29, 128, -62, -95, 125, -71, -95, 224, 65, -176, 25, -31, 343, 93, -262, 49, -207, 167, 20, -145, -242, 69, -444, -154, -195, 135, -50, 138, 27, -147, -2, 61, -19, -266, -106, 87, -30, -189, -54, 68, -84]
4644h4M1J27j23j50j19M90j7p3l72K17N2J14Jo2j35L19k62n8j05J72Q9p1j05R1
4668b3k2NJ53j65R3M9k82K60K01k17n0j35K65q7R2o7l7L2O7m9q0q0o1K95l87J12
4694a18M01k95j73J38M0J5j86L71k84J19j49L2n9J10q7j69L63J39k70P5j92K97
4716A18J44l70K10l3Qn3k01J39J17k03K90l35l1L05k79K79k91K38J70l3L9l37
4738a09L77m60Q0N2mJ23j17J17q8J36j84l2N3K51q8j08J85k21O5q6p8K17j86k1
4762a26L5J93j3J3k44R7r4K69k59J92J26r5O5J82l71J5J9q2p7Q7j76J54N7J09
4786G6q6k14L5J08J05K53k61N1J46l88J95m4J23l01K01k4m3R9k37J2K77j23R0
4809E0k56K99k22N2q9J55Q9j7r6nO4j88Q7J07r9J62k11r9L03o2N4Rj0j20L2k00
$$ y = [-84, -43, 84, -39, -189, -308, 182, 165, 92, -280, -63, -11, 103, 104, 42, -93, 226, -36, -94, -199, -27, 62, -9, -114, -23, -45, -40, 113, -52, 41, 90, -192, 68, 269, 52, 2, -133, 132, 45, 137, 70, 33, 65, 132, 83, 3, -77, -138, 157, -230, -118, 283, -12, -185, -47, -7, 8, -178, 193, -91, 28, -121, -89, -148, -38, -125, -294, 69, 208, -62, 13, -179, 118, 262, -108, 102, 69, 77, 24, -177, -38, 79, -124, 166, -169, -200, 105, -174, 105, -186, 52, 222, 189, 228, -109, 268, -192, -112, -60, -64, 59, -58, 59, -29, 107, -77, -109, -56, 195, 107, -1, 184, -37, 28, -58, -136, 81, -105, -126, -91, 102, 89, 102, -142, -45, -139, 130, -129, 63, 189, 94, 159, 341, -30, -15, 4, -78, -155, -68, -244, -90, -33, 76, -10, -224, -189, -81, 24, 277, 16, 67, 213, -175, 20, -24, 99, -202, -1, -25, -68, 31, -206, -194, 83, -40, 50, -206, 93, -129, -77, -166, -11, 78, 61, -35, -40, 24, -164, -77, 30, -69, 93, -118, -217, 86, 24, 78, 87, 77, -43, -11, -211]
4835b11K27K02k22J80k03n0k2J05rO2m2J06j65jJ21n6K87j88k16K88l49N3L71
4858B68l82J71J3L02o78K39J53k7Pj18Q3l9R6j35J52j44J13J2N6k56K72j84J98
4881A72n1q5j33Q0j20J59%K5j5J66k17Nj59J06M8J45q6j58K19l75M75o59N02j74
4905a30J52k19K58k79J25q3kJ77j38K6K26k51J27j57J65p1K13l5n3p5m2p4k53
4928c93M51J83k04o4J21n3p1l0K1O8rK49l95J08Q7J28k8k51r2J52k4O6k4j31J14
4953b1L7R5Nk57M79n36K70q8R6O5p2j0K0j03r5J53p2N7j2k44K61j31p7K17k50
4978b13Q3K59l36K58m6P0P0k73J55n3M8k0J95j48J02n5M3j70O6m04K33K20j19
5001c5j16j82N46j69L3L4k88J98Q2k71j7J63P5J04k8j76J90Q6l39n8q4J79r7L2
$$ y = [-211, 16, 218, -4, 176, -27, -77, -99, 6, -3, 59, 17, 123, -42, -43, 78, 22, 309, 121, -95, 193, -156, -103, 268, -114, 57, 70, 372, -306, -67, 86, 59, 66, -52, 31, -8, 88, -47, 105, -39, 74, 86, 142, -114, 158, -26, 172, 121, 36, -97, -17, -137, 22, 22, 47, 32, 198, -19, -14, -173, -67, -19, 126, 40, -118, 101, -274, 201, -458, 44, -130, 22, -197, 61, -218, -93, -176, -178, -1, -139, -113, 113, -138, -11, -168, -3, -74, 139, 104, 51, -24, -66, -140, -393, 58, 241, 37, -27, 94, 41, -30, -60, -39, 29, 20, 269, -126, -18, 69, 197, 169, -82, -174, -22, -46, 20, -4, -135, -21, 16, 111, 116, -141, 338, -198, 72, -16, 80, 145, 73, 63, 83, -20, -115, 38, -34, 23, 11, -233, 28, -103, -180, 37, -213, -130, 129, -207, 51, 5, 75, 145, -128, 27, -26, 22, 2, 197, 49, 151, 96, 139, -31, 35, -369, -136, 84, -35, -151, -333, 213, 44, 77, 111, -177, 21, 103, -168, -185, -22, 53, 157, 129, -47, 143, 229, -110, -168, -252, -73, -170, -138]
5025a38R5J17m6j71J05j06K0L38j37j84l9R5j02L32n7o0j59j19L88j43j31J53
5047E1k59M8K13k75R2q4J99m0J17P7k33J82k54Q9L38k40n7N5j91O0J28k10K60
5070F6l60K91j00j26N2J50k28M64j42j74q9L16j59K50l08k5Q9o1J02J08l84J44
5092a24K35o7j16K5R9k25P5J68l00L8K09o7p2J28K15N5j94j90j75J24L85l17k7
5115a18L60k02m5R4N1J14l79R7kk2J12J81k48j30J71Lj66J06MJ32j11j84J82J76
5139A76k2k39R6J72k61QqJ51j62J83N7k65j5N1J13N6k31Q6OL5J26q2l0j7O2n0
5165dj68lQ6m5N3k4j19J93j74L12k42K62j14J73j26J13o4j54J50k09N6J13n5k44
5189b34K86k09LJ84j14r2L7K51k08j5j37J59O8L42l29l9M04l11O2J08j66Q7p7
$$ y = [-138, -43, 74, 28, -143, -38, -144, -124, 214, 77, -107, -146, -51, -153, 179, 122, 62, -97, -216, 172, 29, -102, 51, -208, -160, 53, -222, -130, -214, -15, -55, 62, 139, -94, 88, -166, -77, 261, 21, -36, 19, -172, -112, 16, -194, 66, -294, -3, -103, -229, -177, -27, -255, 209, 67, -107, -196, 120, -39, 211, -97, -122, -33, -94, 8, 116, -268, -124, 111, 44, -72, -47, 52, -173, -98, 70, -230, -192, 17, -50, -122, 6, 221, 276, 82, -108, -283, -159, 226, -91, -118, 242, 40, -5, 89, 140, 254, -125, -28, -30, -52, 60, 241, -7, -137, 34, 37, -129, -23, -19, 113, 2, -182, 0, 176, 154, -85, 11, 183, -78, -70, -78, 73, -89, 94, 151, -114, -129, -78, 35, 91, -140, -54, -48, -13, 113, 31, 1, -16, 46, -4, -172, -175, -89, -134, -81, -105, -224, -31, -205, 107, -135, 127, 13, 186, 60, 173, 109, -45, 105, -104, -48, 65, 10, -234, 52, -157, -154, 30, -84, -176, -139, 112, -96, -111, -248, -89, -21, 321, -8, -47, 357, 46, 108, 216, 50, 137, 60]
5212F0L7J33k32r8%Lj43K14K70n4j2k85J89K25j65j40Q6Qr3J13k24P5K40j11l12
5237b16j16K49K04o4k12J74j28L75l92K24r2k03J08J54m3o3qJ36j96Q4R4k70K01
5260@mj47k83P35k72n8k23M28l11j9L11l26K28l7J77j84k8j31LK91J42L8l09M5
5284F6Q4k50p3j55O8M38q0j05K94j57j53j85K67ppJ60j90OJ51P0l46K07N5j70
5308a2O3k98L79R6k81k38K39n2J91mO2n14L46l6J7J70j02r8K40k06R6j07J12p6
5332a3k1O3j80P4j35M60j40Q9j90j70J72J99k64M0J44j13j76K92j66K16k67l0
5354a16K24k38L06m28J79r2J50J44m9l62L99k70J68m5N9R3j65J8J01k68K96j65
5376f1L77k02j57J23k25J26j07J23k96L77M8l7J6M1l38K98k11L09k01l8M6O7J56
$$ y = [60, 97, 230, -2, -100, -100, -97, -240, -26, 244, 190, 178, -107, 82, 307, 142, 2, 88, 96, 3, 116, -108, -33, 207, 96, -216, -332, -83, 121, 57, -155, 19, -109, 266, -126, 98, 6, -197, -89, 65, 22, -41, -49, 87, -109, -25, 69, -201, 0, -4, -151, -434, 301, 29, -29, -252, 176, -135, -154, 157, -169, 59, 22, 199, 15, -13, -144, -141, 150, 292, 330, 21, 66, 150, -100, -173, -328, -260, 178, 98, -7, 287, 130, -23, -208, 59, 52, 45, 205, 15, 21, 172, 242, -104, 103, 158, -12, 51, -247, 132, 228, -53, -291, -52, -104, 87, 83, 145, -369, -23, -59, -42, 128, 26, -72, 168, -38, 58, -49, 63, -13, -34, 29, -151, -77, -212, 248, 108, 197, 7, -163, 9, 208, -56, -16, 128, 15, -161, 131, -35, 181, -86, -116, 108, -130, 176, -252, -73, -165, -15, 129, 80, -282, 117, -153, 15, -30, 29, 122, -43, -25, 76, -192, 104, -61, 316, 114, -43, 80, -145, -19, -126, -3, -299, 78, 126, 89, 105, 146, -192, 106, -105, 204, 3, -35, 11, 78, 234]
5399B34k62N8j57J58j94L09j69K63k31L6m0K10j62lj46L3J08J55j43R7k30J26
5421E0j16lL25l68J63j59J72k65N42m84J94k34K96r5o9n3M0OL4J6j23J88m15M99
5445A41l11J86j29o4OL6j05L51j55J4j0J59j68M1J9j50K38O3k24j15L79j47j6
5468C9K7j82K01J96m06L48k59R5j26%O3k6r2K13j13j50P6l3nR2noK07j23m8K69
5494B52j33j91J05Q6j88K96k08k20L67k25J0K41j14J46m2k72j38L55k00J88l4
5515H1N4n6j21J88k62M2K27J30l61j07L90j08j58L20k84J97l26j21L27o9J39k7
5537I5j85L15k94j26J76j7M7j20j42L77j03k81L54k06l5J98P7j5j17J38k08l9
5559a11J59j20K03l36R1M40k33k46M80l30M4q2K29l57J69m7j43M35l34J24J97
$$ y = [234, -28, 30, -127, 31, -163, 146, -23, 240, 9, 45, 5, 215, 53, 50, -96, -63, 45, 200, 57, 154, -76, 50, -66, -69, 256, -112, 51, -108, 64, -201, 341, -143, 51, -183, 113, 18, -51, -104, -64, -58, -24, -8, -131, 57, -358, 141, -170, 16, -113, -177, -171, -135, -240, 111, -44, -30, -40, 119, -49, -8, 11, -139, 99, 162, -62, -177, 202, 55, 39, 66, -116, 85, 281, -125, 223, -36, 59, -67, -67, -4, -30, -122, 91, -22, -172, -96, -129, -134, -42, -47, -53, 154, 31, -17, 252, 119, -72, 33, 119, -69, 227, 19, -201, 166, -59, -49, 192, 78, 224, 182, -90, -228, 127, -73, 115, 81, 135, 79, -42, 146, -116, -74, 153, 283, -78, -185, 205, 97, -61, 259, -25, 172, -154, -275, 52, -17, 122, 95, -90, 225, -69, -195, -19, -36, 11, -109, -251, 126, 23, -258, 96, -110, -145, 53, 130, 115, -2, 136, -72, -111, 48, -72, 131, -205, -114, 326, 93, -153, 327, -3, 41, -41, 188, -169, 0, -47, -190, 245, -89, 35, 232]
5580B32j73k0J1k70J86jQ3m5R7j29R7R2j99Pj34J36J91r3M2r8j47J56m5j04J33
5605ER7j02j33m3OJ79j34J47r3j7J9J8mn7m9K68q2J28j54j14J49k1R1M1k76j3
5631a44K5R6K6j73l7J09J0k2M40m33K99j86k7K1K8J79O1k23J03n0k09J81l18k2
5655b66K72n4J50k62J0K86j38R7k11J50N6J4p1J02j7k8o7j91J00R9k91L00R4k71
5679a37K69o6k39K84K1k9m8J87j44k44K14n9J57o2k6j72n4J16j81K07N9Q6j91
5702e2J03K4o7J28%k62M7J29k6k18L24j4P9l12O8o6J01j13k6J02QQ3j1J47j16
5727F0lJ4j52l0J31j5l34K30K54r4j00kn5J02K10K4j73j1O5k79j31J03K53J38
5751B05k63J37j12k5J00j32P2Jk4J69J01p8q4K0j95L25k10K7j7j51K49K4j69K8
$$ y = [232, 59, 39, 50, -220, -34, -35, 48, 3, 100, -29, 68, 160, -39, -32, -166, -30, 161, 68, 110, 12, -135, 21, -24, -128, 5, 102, 0, -133, -176, -170, 9, -125, 22, -71, -88, -69, -51, -55, -112, -161, 107, 25, 153, -1, -115, 34, 13, 104, 145, -131, -144, -119, -23, 3, -170, -207, -98, -88, -110, 330, -103, 196, 10, -17, 4, 32, 211, 272, 49, 152, 102, -107, 74, -244, -266, 6, -48, 102, -160, -150, 136, -2, 95, -116, 34, 90, 104, 33, 135, 118, 90, 23, -168, -68, 31, -260, 40, 134, -137, 132, 66, -173, 111, 132, 103, 55, 242, 98, -146, 68, 9, 166, 104, 78, -94, -148, -32, -213, -6, 53, 139, -52, 51, 75, 8, 136, 136, -126, -79, 50, 24, -194, 130, 116, 195, -117, -49, -115, -14, -127, -153, -51, -43, 40, 29, 176, 60, 57, 71, -81, -111, 20, 5, -329, -99, 155, 61, -39, -41, -96, 6, 216, 240, 67, 56, 121, -158, -289, -186, 67, 205, -58, 79, -33, -58, 42, -90, -18, -17, -41, 128, 229, 151, 67, 87, -108, 217, 7, 34, 17, -134, 115, 139, -30, -2]
5775bp9J62j50o6R4J72j94J40J2k24J03q1K20l39N24n92L93l8m3k24K32j89j2
5798a81M26k95p5O9o5K65J49l69n8Q9Q2p3l9L01q5k8j55J3q1K97k81k4pK88J09
5823B72l91q1L82l4j38K29k80o8J39n1P2l1q3J68Qn5l0J40k72J13P0j19N0j05
5847i5l5K98Q4k52P3k48M8NK40j15q0N2k0J93k7j00j6K16rq6j88m6k4K47J42k29
5873B8j5J78N5m20R5j2J20j79J99l6q7K17k73K33Q9o6k99J53J67k90M46m26K1
5896a02K8O2j13J93k04P4m9N3j1J27J14j82P8ko9k29J67K07p1l42J52J51l66O33
5920B99m59J89kJ71J8j05J84j81n4k68L08k25L25p9j71L30n13K19o3J47m7R8p7
5943D4J65l32K88j13n0J94k33r8O6J50l8j03R1R5k83J51j07R9k7p9K3j1J96l05
$$ y = [-2, -81, 81, -69, -135, -41, 131, -63, 77, 89, -135, -32, -113, 107, -232, 292, -300, 93, 55, 12, -212, 20, -169, -181, 245, -50, -125, -56, -121, 144, 293, -76, -134, -45, 37, -36, -75, 226, 141, 113, -42, -29, -110, 187, -94, -118, -125, 163, 272, -119, -200, 182, 148, 10, 239, -41, -109, 30, -21, 51, 20, -63, 105, 113, 58, 28, 168, -104, 9, 79, -40, 10, -95, -130, 168, 252, 0, 73, -175, -127, -122, 118, 3, -77, -25, -45, 148, 121, 21, 5, 221, 212, 126, -62, -108, -132, 115, 257, 28, 13, 191, 246, -174, -79, -91, 29, -150, 49, 13, -74, 143, -130, 103, 192, 126, -173, -20, 147, -143, 303, -123, -102, -74, -12, -125, 68, -136, -62, -111, -58, -69, 58, 172, -10, 68, 66, -3, -232, -65, 142, 71, -271, -119, 32, -334, 299, -160, 29, 27, 198, 216, 111, 295, 114, 60, -208, 100, -125, 200, 121, -50, 280, -233, -14, -77, 70, 23, 121, 44, 209, -123, 165, 52, 2, 196, -37, -135, -69, 81, 43, -60, 31, 126, -157, -6, -113, -14, -41, -120, -97, -108, 88, -217]
5967b17K72k8k96J48M6J29o4K91l12j43J70o3p7L22n11M44J47l24J04r1j41J90
5989dj68J25N3j81M20l23J31r4K1Q0o7m1j79K65J27l05K65M0j43j10J36Kj54p0
6013a74l1n5M90k54m7P3k82K90q7LJ57j33J11Q7k89k5K65j22M7o7J35J01j40q
6037D5J86Rk90m2K96j47J58o5j62j72J69n5K06O7k63O5J08l10j6J46j00K40p0
6060Cq8L5k3J28r3p6K27l41o6L45J8j63K83j21k28j2J26L0j0k49K02L2j9M1r0
6085a09P4P2j0l7K09j98J3j11Q0q8J64ML9j86R7j20L99k88O2L9N8p2k30R7K48
6110B06r5j36K18M7k20K42n37J42O9J39N0j91P0J63l65R1J02j63Q5N6O2oJ97j38
6134H8o4m1J02j06J04Q0r3J6k63L64j55r4j13J20k20J80K13J53k63k38K08k3K01
$$ y = [-217, 55, 27, -269, -121, -75, 54, -10, 281, -31, -174, -4, -67, -144, 178, -333, 111, 258, -66, 38, -53, -194, -4, -172, -47, 6, -175, 245, -78, 53, -41, -20, 60, -7, -48, -227, 38, 165, -140, 125, 165, 22, -88, 48, 50, -104, -174, -205, -260, 230, -24, -71, 2, -280, 10, -77, -74, 83, -50, 61, 148, -141, -166, 99, -23, 24, -43, 92, 193, 53, 45, 231, 240, -50, -92, 204, 57, 215, 150, -12, -184, -15, -70, 136, 203, -60, 5, 113, -197, -213, -67, -167, 73, 3, -85, -50, -73, 55, -38, -114, 113, -228, -294, 51, 69, -94, 189, 68, -160, -172, -46, -16, -26, -275, -73, -41, -60, -19, -109, -35, 37, 27, -10, 199, 1, 14, -97, -17, -105, 59, 63, 102, -84, 13, -107, 292, 4, 66, 105, 163, 91, -139, -42, 206, 111, -25, 193, 240, 20, 262, -275, -133, -64, 75, 125, -66, 4, 167, -198, -107, -5, -168, -83, -27, 35, 29, 226, 88, 24, -17, 85, -21, 83, 163, 70, 86, -177, 187, 32, -62, -175, -55, -275, -95, 118, 271, 8, -230, -22, -45, 156]
6157A56N7q5k39Q6R6j23K0J87j96r5j42K03o7L2J26j18j2R0K57l97l9J02J68k12
6181a45K46k09L17k14k06k06K82m0J58K2p2J38j87J09R7j1j62M71nm68J9K2R0
6204D6k35J39R4j77K09k33J48K2P8J8j33R4L3r5Kk9j24K80j85J96R0o03K62O1
$$ y = [156, 213, 128, -111, -25, 71, -52, -32, 155, -41, -136, -278, -75, -142, -110, 16, -102, -114, -24, 233, -164, -203, -101, 67, -145, 101, -108, 209, -5, -211, -417, -135, -175, -17, 5, -67, 71, -116, -7, 90, 79, -83, 388, 383, -85, -66, -44, 46, -189, -50, 44, -133, 76, -157, -9, 13, 91, 109, -24, 70, 103, 8, 10, -19, -143, 137, -48, 148, 238, -365, -103, -42]
$$ [...]
8191E4
##END NTUPLES=NMR FID
##END=
