##TITLE=1H_SR81 ASP4
 CDCl3, 8 sc, 
 31.8.2021
##JCAMPDX= 6.0         $$ Bruker NMR JCAMP-DX V2.0
##DATA TYPE= NMR FID
##DATA CLASS= NTUPLES
##ORIGIN= UXNMR, Bruker Analytische Messtechnik GmbH
##OWNER= root
$$ XWIN-NMR		Version 3.5
$$ Wed Sep  1 09:29:28 2021 Russian Standard Time (UT+4h)  she@DPX200
##.OBSERVE FREQUENCY= 200.1312
##.OBSERVE NUCLEUS= ^1H
##.DELAY= (6, 6)
##.ACQUISITION MODE= SIMULTANEOUS
##.ACQUISITION SCHEME= undefined
##.AVERAGES= 8
##.DIGITISER RES= 18
##SPECTROMETER/DATA SYSTEM= spect
##.PULSE SEQUENCE= zg30
##.SOLVENT NAME= CD2Cl2
##.SHIFT REFERENCE= (INTERNAL, CD2Cl2, 0, 15.7039)
##AUDIT TRAIL= $$ (NUMBER, WHEN, WHO, WHERE, WHAT)
$$ ##TITLE= Audit trail, XWIN-NMR		Version 3.5
$$ ##JCAMPDX= 5.01
$$ ##ORIGIN= Bruker BioSpin GmbH
$$ ##OWNER= she
$$ F:/spectra/data/she/nmr/H-F/1/audita.txt
$$ ##AUDIT TRAIL=  $$ (NUMBER, WHEN, WHO, WHERE, WHAT)
(   1,<2021-09-01 09:27:59.07 +0400>,<she>,<DPX200>,
      <created by zg, POWCHK disabled, PULCHK disabled
       configuration hash MD5:
       00 E9 B6 7A A2 85 ED C7 34 08 36 98 17 FE 4E 26
       data hash MD5: 16K
       AD 3E 4A D2 AB A9 C0 37 E0 CF 31 02 7C CE DE 4F>)
$$ ##END=
$$ 
$$ hash MD5
$$ 52 D6 68 91 7E 3E 22 45 04 7D 22 09 FF B1 13 4B
##$RELAX= 
##$RELAX= 
##$RELAX= 
##$RELAX= 
##$RELAX= 
##$RELAX= 
$$ Bruker specific parameters
$$ --------------------------
##$DU= <F:/spectra>
##$EXPNO= 1
##$NAME= <H-F>
##$PROCNO= 1
##$TYPE= <nmr>
##$USER= <she>
##$AMP= (0..31)
100 100 100 100 100 100 100 100 100 100 100 100 100 100 100 100 100 100 
100 100 100 100 100 100 100 100 100 100 100 100 100 100 
##$AQSEQ= 0
##$AQ_mod= 1
##$AUNM= <au_zg>
##$AUTOPOS= <>
##$BF1= 200.13
##$BF2= 200.13
##$BF3= 200.13
##$BF4= 200.13
##$BF5= 200.13
##$BF6= 200.13
##$BF7= 200.13
##$BF8= 200.13
##$BYTORDA= 1
##$CFDGTYP= 0
##$CFRGTYP= 5
##$CHEMSTR= <none>
##$CNST= (0..31)
1 1 145 1 1 1 1 1 1 1 1 1 1 1 1 1 1 1 1 1 1 1 1 1 1 1 1 1 1 1 1 1 
##$CPDPRG= <>
##$CPDPRG1= <>
##$CPDPRG2= <>
##$CPDPRG3= <>
##$CPDPRG4= <mlev>
##$CPDPRG5= <mlev>
##$CPDPRG6= <mlev>
##$CPDPRG7= <mlev>
##$CPDPRG8= <mlev>
##$CPDPRGB= <>
##$CPDPRGT= <>
##$D= (0..31)
0 1.2 0 0 0 0 0 0 0 0.06 0 0.03 0 0 0 0 0.0002 0 0 0 0 0 0 0 0 0 0 0 0 
0 0 0 
##$DATE= 1630474078
##$DBL= (0..7)
120 120 120 120 120 120 120 120 
##$DBP= (0..7)
150 150 150 150 150 150 150 150 
##$DBP07= 0
##$DBPNAM0= <>
##$DBPNAM1= <>
##$DBPNAM2= <>
##$DBPNAM3= <>
##$DBPNAM4= <>
##$DBPNAM5= <>
##$DBPNAM6= <>
##$DBPNAM7= <>
##$DBPOAL= (0..7)
0.5 0.5 0.5 0.5 0.5 0.5 0.5 0.5 
##$DBPOFFS= (0..7)
0 0 0 0 0 0 0 0 
##$DE= 6
##$DECBNUC= <off>
##$DECIM= 32
##$DECNUC= <off>
##$DECSTAT= 4
##$DIGMOD= 1
##$DIGTYP= 9
##$DL= (0..7)
0 120 120 120 120 120 120 120 
##$DP= (0..7)
150 150 150 150 150 150 150 150 
##$DP07= 0
##$DPNAME0= <>
##$DPNAME1= <>
##$DPNAME2= <>
##$DPNAME3= <>
##$DPNAME4= <>
##$DPNAME5= <>
##$DPNAME6= <>
##$DPNAME7= <>
##$DPOAL= (0..7)
0.5 0.5 0.5 0.5 0.5 0.5 0.5 0.5 
##$DPOFFS= (0..7)
0 0 0 0 0 0 0 0 
##$DQDMODE= 0
##$DR= 18
##$DS= 0
##$DSLIST= <SSSSSSSSSSSSSSS>
$$ [...]
##$SUBNAM2= <"">
##$SUBNAM3= <"">
##$SUBNAM4= <"">
##$SUBNAM5= <"">
##$SUBNAM6= <"">
##$SUBNAM7= <"">
##$SUBNAM8= <"">
##$SUBNAM9= <"">
##$SW= 20.0189188712717
##$SWIBOX= (0..15)
0 0 2 0 0 0 0 0 0 0 0 0 0 0 0 0 
##$SW_h= 4006.41025641026
##$TD= 16384
##$TD0= 1
##$TE= 0
##$TE2= 300
##$TE3= 300
##$TEG= 300
##$TL= (0..7)
0 120 120 120 120 120 120 120 
##$TP= (0..7)
150 150 150 150 150 150 150 150 
##$TP07= 0
##$TPNAME0= <>
##$TPNAME1= <>
##$TPNAME2= <>
##$TPNAME3= <>
##$TPNAME4= <>
##$TPNAME5= <>
##$TPNAME6= <>
##$TPNAME7= <>
##$TPOAL= (0..7)
0.5 0.5 0.5 0.5 0.5 0.5 0.5 0.5 
##$TPOFFS= (0..7)
0 0 0 0 0 0 0 0 
##$TUNHIN= 0
##$TUNHOUT= 0
##$TUNXOUT= 0
##$USERA1= <user>
##$USERA2= <user>
##$USERA3= <user>
##$USERA4= <user>
##$USERA5= <user>
##$V9= 5
##$VALIST= <valist>
##$VCLIST= <CCCCCCCCCCCCCCC>
##$VD= 0
##$VDLIST= <DDDDDDDDDDDDDDD>
##$VPLIST= <PPPPPPPPPPPPPPP>
##$VTLIST= <TTTTTTTTTTTTTTT>
##$WBST= 1024
##$WBSW= 4
##$XGAIN= (0..3)
0 0 0 0 
##$XL= 0
##$YL= 0
##$YMAX_a= 198917
##$YMIN_a= -194083
##$ZGOPTNS= <>
##$ZL1= 120
##$ZL2= 120
##$ZL3= 120
##$ZL4= 120
##$ABSF1= 10
##$ABSF2= 0
##$ABSG= 5
##$ABSL= 3
##$ALPHA= 0
##$AQORDER= 0
##$ASSFAC= 0
##$ASSFACI= 0
##$ASSFACX= 0
##$ASSWID= 0
##$AUNMP= <proc_1d>
##$AZFE= 0.1
##$AZFW= 0.1
##$BCFW= 1
##$BC_mod= 2
##$BYTORDP= 1
##$COROFFS= 0
##$CY= 11.3945322036743
##$DATMOD= 1
##$DC= 2
##$DFILT= <>
##$DTYPP= 0
##$F1P= 2.36226072786647
##$F2P= -0.459571619588291
##$FCOR= 0.5
##$FTSIZE= 0
##$FT_mod= 4
##$GAMMA= 1
##$GB= 0.15
##$INTBC= 1
##$INTSCL= 1
##$ISEN= 128
##$LB= 0.24
##$LEV0= 0
##$LPBIN= 0
##$MAXI= 10000
##$MC2= 0
##$MEAN= 0
##$ME_mod= 0
##$MI= 1.114404
##$NCOEF= 0
##$NC_proc= 0
##$NLEV= 6
##$NOISF1= 3.799351
##$NOISF2= 2.8
##$NSP= 1
##$NTH_PI= 0
##$NZP= 0
##$OFFSET= 15.70392
##$PC= 1
##$PHC0= -13362.55
##$PHC1= 14.00097
##$PH_mod= 1
##$PKNL= yes
##$PPARMOD= 0
##$PSCAL= 0
##$PSIGN= 0
##$REVERSE= no
##$SF= 200.130013532006
##$SI= 16384
##$SIGF1= 3
##$SIGF2= 2
##$SINO= 400
##$SIOLD= 16384
##$SREGLST= <1H.CDCl3>
##$SSB= 0
##$STSI= 0
##$STSR= 0
##$SW_p= 3612.71676300578
##$SYMM= 0
##$S_DEV= 0
##$TDeff= 0
##$TDoff= 0
##$TI= <>
##$TILT= no
##$TM1= 0
##$TM2= 0
##$TOPLEV= 0
##$USERP1= <user>
##$USERP2= <user>
##$USERP3= <user>
##$USERP4= <user>
##$USERP5= <user>
##$WDW= 1
##$XDIM= 8192
##$YMAX_p= 0
##$YMIN_p= 0
$$ End of Bruker specific parameters
$$ ---------------------------------
##NTUPLES= NMR FID
##VAR_NAME=  TIME,          FID/REAL,        FID/IMAG
##SYMBOL=    X,             R,               I
##VAR_TYPE=  INDEPENDENT,   DEPENDENT,       DEPENDENT
##VAR_FORM=  AFFN,          ASDF,            ASDF
##VAR_DIM=   8192,          8192,            8192
##UNITS=     SECONDS,       ARBITRARY UNITS, ARBITRARY UNITS
##FACTOR=    0.0002496,     1,               1
##FIRST=     0,             0,               0
##LAST=      2.0444736,     0,               0
##MIN=       0,             -194083,         0
##MAX=       2.0444736,     198917,          0
$$ Real data points
##PAGE= N=1
##DATA TABLE= (X++(R..R)), XYDATA
0 0 0 0 0 0 0 0 0 0 0 0 0 0 -8 8 -8 8 -13 16 -16 24 -24 32 -40 48 -49 64 -72 81 -96 109 -124 141 -161 182
34 182 -206 231 -261 290 -326 361 -403 447 -498 549 -609 671 -742 818 -902 995 -1095 1207
52 1207 -1330 1469 -1621 1797 -1994 2221 -2486 2800 -3175 3636 -4217 4981 -6027 7557 -10024
67 -10024 14665 -26522 127890 198917 -16729 -63308 -22312 89748 101527 29344 -78492
78 -78492 -101788 -72058 -40371 -78469 -118567 -104901 -50353 -52361 -109990 -165112 -145161 -69019
90 -69019 -5864 -16865 -60915 -74135 -36662 4753 21218 20787 41170 79928 97795 69037 30275
103 30275 33047 90169 144387 134783 72916 27780 31199 61157 78303 61783 27938 7457 647
116 647 -12331 -37159 -56539 -50092 -29958 -34532 -68793 -102524 -108024 -83531 -52081 -43793 -55087
129 -55087 -61611 -55644 -48236 -42601 -27684 2593 31749 36225 17347 -151 7191 42761 82977
142 82977 92144 67295 39974 34260 45970 59314 62879 56254 45115 32295 15890 -810 -9470
155 -9470 -5066 5408 2826 -18336 -41695 -54672 -56552 -48542 -38910 -36189 -37629 -41706 -51565 -60214
169 -60214 -55080 -33827 -6693 5872 -1974 -16184 -20378 -7371 17942 39053 42140 35616 30810
182 30810 28713 28782 34208 41751 47537 47728 39697 25972 12631 8220 12796 18192 15012 5011 -6617
197 -6617 -20128 -29695 -29152 -22990 -18528 -18811 -27031 -40138 -47492 -41279 -25802 -14096 -13862 -20328 -24619
212 -24619 -21586 -11571 2036 9606 10808 11905 13801 14817 17591 23549 29571 32067 31362 28350 23438
227 23438 17954 17191 20216 20580 17284 12251 3620 -6959 -12069 -10256 -5720 -5109 -9862 -19935 -29909
242 -29909 -32439 -25195 -15501 -12471 -15408 -19424 -22423 -22134 -15002 -5470 228 3271 4893 3386 1877
257 1877 4421 10678 17641 21929 23299 21242 15467 10394 11375 15685 18810 20096 16745 6407 -3990
272 -3990 -6293 -3106 938 2222 -2298 -10726 -18811 -20945 -16579 -11538 -10456 -10783 -12107 -15576 -16283 -13004
288 -13004 -8488 -4741 -494 2090 1380 177 572 3987 8127 12106 15848 14993 10087 6982 7896 10200
304 10200 12749 15225 12341 5107 -310 -777 1045 2535 2522 -892 -6329 -10900 -11161 -9096 -8040 -7345
320 -7345 -6962 -8881 -11810 -12089 -9680 -7187 -3782 -913 -121 -1845 -3140 -2153 853 5146 9516 11540
336 11540 8798 4562 3079 4758 8314 12646 13996 9273 3224 43 313 2580 4672 5200 2208
351 2208 -2638 -6690 -7399 -7030 -5909 -3731 -3153 -6180 -9054 -10368 -10660 -9244 -5038 -1459 -975 -2691
367 -2691 -4573 -5074 -4024 -21 5797 7998 6419 3651 2837 2893 5594 9851 11296 9018 6803 5214
383 5214 3809 3826 5175 5664 4308 1417 -216 -2112 -4301 -4474 -2928 -3575 -5394 -6453 -8337 -9741
399 -9741 -9236 -6777 -5183 -5701 -6556 -6633 -6727 -5362 -1673 1383 1489 61 538 1768 3316 6850 9547
416 9547 9043 6987 6116 6520 7001 8284 9650 9380 6472 3488 2047 135 -86 1294 1846 -588 -3753
433 -3753 -6406 -9355 -9949 -7979 -4787 -4743 -6672 -9314 -10961 -11576 -8883 -3231 -414 -948 -2033 -2966 -3269
450 -3269 -916 3473 7510 8281 7909 6949 5457 4735 6514 9596 11326 10515 8549 5462 2046 680
466 680 2196 3576 3378 1947 -1459 -5687 -7869 -6983 -5006 -4511 -4359 -6085 -8495 -10594 -9313 -6950
482 -6950 -5191 -4149 -3209 -3155 -3928 -3003 -775 836 2116 4122 4806 4297 3752 4849 6039 6383 6794 7633
500 7633 6269 4923 5008 4997 4255 4019 3192 1304 -415 -880 -649 -772 -2108 -3228 -4521 -6248 -5965 -3928
518 -3928 -3728 -4580 -5212 -5270 -6315 -5785 -3710 -1877 -849 -809 -1172 -1862 -2197 -463 2167 3876 4329 4577
536 4577 3472 1368 1532 3722 5533 6693 6397 4667 1597 -3 953 2865 4139 3913 2921 -376
552 -376 -3348 -3506 -2433 -1373 -246 -170 -2128 -5299 -6553 -5994 -4889 -2950 -995 -903 -3261 -4905 -5105
569 -5105 -3897 -2043 742 2517 1789 5 -908 -329 917 3321 5525 5749 3786 2760 2200 2185 3126
586 3126 4791 5102 3846 2303 1394 145 -545 102 1466 418 -741 -1977 -3240 -3898 -3745 -2269 -2433
603 -2433 -3207 -3384 -3570 -4132 -3660 -2378 -1411 -1928 -1748 -1109 -939 -353 637 1064 1347 715 1639 2351 2441 2753
623 2753 3732 3139 1617 2151 2406 2050 2342 2876 2134 571 -246 -463 -305 -226 586 852 -413 -2157 -2337
642 -2337 -2298 -2255 -668 558 -475 -1886 -2862 -2961 -2413 -1025 586 758 -156 -1544 -1638 -2072 -809 805
660 805 2284 1592 309 -280 -1453 -1122 548 2181 2544 2084 965 -457 -572 0 1950 2968 2678
677 2678 1719 783 -339 -663 838 2147 1834 1848 782 -930 -1585 -1030 55 147 -42 -508 -1589 -2988
695 -2988 -3252 -1949 -1532 -1516 -1223 -1784 -2690 -2812 -1941 -1231 -424 -188 130 -456 -566 -44 1413 2023 2341 2438
715 2438 1802 1588 2248 3241 3102 2886 2924 2302 1456 1306 1758 1866 1117 875 199 -1524 -2392 -1499 -976 -1638
735 -1638 -1876 -2190 -3570 -4286 -3695 -2599 -1914 -1392 -1348 -2331 -3174 -2743 -1175 243 1166 1638 1397 286 -44
754 -44 1408 2616 3241 4029 3852 2316 1516 1363 2307 3142 3433 3527 2413 293 -504 6 348 385 768 -117
774 -117 -1878 -3307 -3311 -3081 -2226 -1498 -1327 -2698 -3697 -3684 -3044 -2781 -1396 -639 -868 -1632 -1804 -1079 -649 624
794 624 1924 2025 1392 1154 1518 2200 2676 3512 3643 2887 2158 2213 2407 2251 2889 3112 1971 620 -74 11
814 11 -513 4 199 -910 -2842 -3600 -3189 -3268 -3023 -2433 -2180 -3508 -4137 -4077 -3466 -2674 -1379 -378 -705 -1651
834 -1651 -1543 -485 363 1993 3465 3654 2845 2299 2460 2924 3838 5364 5435 4307 2967 2019 1628 1771
852 1771 2366 3003 1962 89 -1798 -2561 -3130 -2603 -1450 -1723 -3162 -4226 -5054 -5800 -4826 -3153 -2210 -2336
870 -2336 -2805 -2954 -2906 -2366 -555 1460 1838 1604 1983 1531 1387 2959 4162 4908 4451 4121 3793 3132 2649
889 2649 3349 3432 2814 2025 1344 -52 -682 -591 -721 -1205 -2154 -2650 -3398 -3845 -3773 -3110 -3244 -3511 -3604 -3472 -3345
910 -3345 -2657 -1340 -992 -1116 -1003 -543 -38 596 2011 3132 2999 2223 2442 2186 2415 3468 4336 4086 2913
929 2913 2250 1481 775 1413 2345 2103 776 -84 -1538 -2767 -2303 -1319 -825 -1470 -1930 -3050 -4260 -4448
947 -4448 -2973 -1554 -1281 -1332 -1596 -2672 -3182 -1866 -187 936 1333 1338 861 -219 145 1312 2887 3571
965 3571 3640 3184 1776 839 1185 2248 3009 2757 2520 1069 -354 -783 -397 79 101 158 -825 -2179 -3029
984 -3029 -2568 -2285 -1950 -1426 -1728 -2603 -3176 -2699 -2122 -1594 -1014 -359 -265 -837 -319 310 579 1205 2088 1998 1197
1005 1197 1847 2188 2789 2448 2533 2158 1408 1208 1248 1521 1298 677 509 -851 -1593 -1210 -838 -1010 -1211 -1710
1025 -1710 -2449 -3387 -2815 -2135 -592 -1006 -1665 -1327 -2384 -2101 -999 245 1083 1698 1359 484 -100 684
1043 684 1916 2524 3109 2886 2028 734 354 755 1247 2087 1999 1327 -175 -1594 -1540 -1128 -779 -119 -315
1062 -315 -1416 -2416 -3044 -2473 -1580 -713 -16 -643 -1217 -1848 -1736 -822 561 1352 1407 936 459 232 396
1081 396 1050 2099 2710 1917 1247 409 764 305 1092 1578 1084 -64 -244 -900 -1190 -738 -463 -517 -1188 -1218
1101 -1218 -1392 -1918 -1304 -542 -434 -737 -971 -461 -577 -381 439 751 479 139 356 255 561 1364 1590 1379
1121 1379 747 431 710 616 1148 1472 754 52 -479 -467 -536 -436 171 15 -513 -1183 -1484 -1836 -1587 -465
1141 -465 183 -439 -934 -1281 -1174 -1552 -457 769 671 99 -296 -431 -711 69 1373 1907 1609 949 601
1160 601 43 206 947 1735 1697 1166 513 39 -718 -9 660 923 330 -527 -711 -1396 -1764 -484 -435 -732
1180 -732 -1041 -1414 -1868 -2088 -1153 -780 -281 -657 -630 -939 -931 -791 703 1192 1024 1361 816 350 1022 1847 1783
1201 1783 1823 1915 1639 1055 742 971 1264 1007 555 567 -353 -965 -907 -197 -623 -1016 -1298 -1971 -2621 -2469 -1480
1222 -1480 -1147 -1623 -1472 -1962 -1714 -1839 -737 23 455 815 392 312 189 951 2086 2284 2361 2373 1678 1458
1242 1458 1229 1930 2465 1935 1818 1205 -31 -175 -301 -103 177 -256 -1019 -2182 -2812 -2804 -2153 -1875 -1699 -1758
1262 -1758 -2050 -2708 -2268 -1596 -1022 -577 -2 75 78 -111 390 1079 1342 2203 2027 1686 1494 1779 1840 1923 2472
1283 2472 2521 1774 1124 815 888 592 784 524 -188 -1153 -1499 -1392 -1380 -1227 -1451 -1407 -2113 -2647 -2046 -1873 -1575
1304 -1575 -1278 -749 -979 -1387 -1136 -562 131 818 760 880 346 478 971 1439 2070 2336 2167 1723 1075 1218
1324 1218 1351 1598 1826 1807 914 192 -274 -174 -60 39 523 -205 -1199 -1699 -2089 -2038 -1339 -1036 -882 -1680 -2305
1345 -2305 -1906 -2038 -1651 -623 -31 -383 -678 -811 -864 -233 599 1589 1684 1075 994 1046 1037 1556 2287 2358 1841 1682
1367 1682 1262 1043 814 902 1196 651 308 -229 -690 -1138 -1100 -883 -1071 -1541 -1473 -1897 -2213 -2008 -1695 -1263 -1323
1388 -1323 -1479 -1307 -1171 -890 -814 253 493 100 729 965 807 1345 1729 1474 1508 1577 1654 1413 1789 1842 1739
1409 1739 861 722 487 154 -16 312 325 -445 -1048 -1563 -1588 -1801 -1476 -919 -1198 -1488 -1871 -2101 -1813 -1131
1429 -1131 -440 -401 -467 -508 -604 -638 -30 795 1375 1184 1302 714 682 583 1299 1719 1889 1502 1197 670 118 455
1451 455 682 965 637 660 -300 -982 -1027 -608 -265 -313 -348 -1074 -1719 -1816 -1137 -985 -416 -367 -519 -689 -1501 -1068
1473 -1068 -688 -339 301 264 345 65 63 404 546 842 1084 997 587 572 637 928 881 1054 794 916 272 333 440
1496 440 271 285 35 141 -429 -339 -39 -413 -612 -530 -632 -881 -1120 -715 -394 -282 -595 -538 -879 -964 -657 16
1518 16 107 184 22 -111 -275 92 640 917 884 1003 781 12 147 596 1080 1146 1326 889 262 -175 -133 137
1540 137 444 532 311 -70 -1068 -789 -833 -606 -436 -375 -411 -1234 -1248 -1191 -723 -137 129 35 -255 -830 -418 -540
1562 -540 140 858 826 480 -160 -182 408 427 863 1245 888 545 429 252 208 417 538 597 -20 -439 -591 -574
1584 -574 -321 -187 158 -287 -719 -783 -756 -683 -311 -17 -380 -430 -307 -124 -235 -75 -61 429 -93 -352 74 214
1606 214 98 386 364 139 -36 -154 -178 204 79 650 342 14 -3 -305 71 348 253 215 156 -211 -13 -118
1628 -118 362 131 585 8 -433 -352 -246 -451 148 266 16 -330 -240 -262 -790 -421 -34 -4 -152 -324 -522
1649 -522 -556 -273 268 483 265 166 -240 -61 63 452 629 656 534 141 239 -237 275 585 875 499 13
1670 13 -208 -223 -480 336 307 1 -263 -32 -965 -843 -448 -257 -30 -163 -339 -527 -475 -385 -20 71 -11 2 12
1693 12 -399 -157 320 606 413 533 252 218 -113 451 834 607 220 372 -128 -323 13 228 292 221 -212
1714 -212 -5 -342 -383 -54 213 -14 -99 -143 -578 -309 -103 175 -111 -25 62 -451 -632 -96 163 346 67 60
1736 60 -40 -305 -457 94 129 198 251 71 -155 -420 -16 217 534 424 467 -59 -385 -46 78 222 183 280
1758 280 76 -54 -135 153 170 465 107 180 -82 -559 -269 -128 -277 -161 204 -472 -606 -525 -248 -573 -214
1779 -214 48 135 -580 -58 -38 -60 52 137 534 -21 128 -34 480 368 461 551 127 186 375 201 392 473 576
1802 576 105 -467 -152 -15 113 289 -22 -215 -382 -690 -561 -336 -395 -96 -64 -635 -726 -677 -165 62 303
1823 303 465 111 -248 -199 -178 74 276 619 324 193 4 151 45 310 807 391 352 -171 -144 92 7 373
1845 373 273 -148 -450 -363 -298 -260 -67 216 254 -162 -81 -223 -410 -176 -25 343 102 -255 -173 -262 -295 113 497
1868 497 96 -147 150 -9 -126 -96 89 461 16 249 -78 68 7 246 211 29 57 147 403 93 576 167
1890 167 136 -277 33 -118 -162 200 243 100 -185 -144 -197 -266 -278 -333 44 -439 -545 -178 -287 -312 196 149 -560
1913 -560 -60 -49 -261 8 521 307 522 326 43 -11 58 587 631 638 406 179 -169 -43 -78 385 661 200
1935 200 62 -313 -406 -695 -396 99 234 -129 -443 -620 -680 -454 -223 319 11 56 -510 -432 29 -39 148 343
1957 343 102 367 -14 192 -277 127 666 340 457 151 -94 71 229 258 110 219 78 -373 -540 -140
1977 -140 -124 -109 -26 10 53 -53 40 -140 -252 -131 -38 -433 -272 -231 -164 357 67 318 -205 -202 -114 104 -111 48
2001 48 85 18 -147 -29 65 -26 -71 223 -94 41 -177 -114 254 211 201 254 -218 139 19 74 71 574 135 -23
2025 -23 -233 -239 56 320 210 -48 -30 -268 -317 -161 -164 40 384 -184 -166 -711 -136 -271 -28 168 324 6 -284
2048 -284 -193 39 -93 84 694 219 222 -194 291 125 440 452 553 614 123 -58 14 29 -4 217 -2 -166 -303
2071 -303 -12 -344 -153 13 -115 -260 -425 -453 -550 -445 71 46 -39 -222 -186 31 139 71 269 346 400 117 140
2094 140 193 250 322 358 399 175 132 135 200 251 311 77 94 -146 32 -216 -55 60 -349 -359 -309 -247 -139 -586 56
2119 56 -166 -478 -315 -322 -267 -434 -159 11 -138 -86 -456 -48 -48 79 242 260 -120 64 -83 -33 113 334 468
2142 468 -66 192 221 -47 285 623 375 215 58 128 -90 -81 273 128 53 -302 -484 -269 -305 -263 -267 -69 -514
2165 -514 -376 -425 -439 -352 -80 -148 -415 -208 -85 -98 -21 506 216 289 391 153 160 383 165 146 164 502 280 258
2189 258 172 148 199 91 -50 258 -176 -192 -155 -191 -262 -376 -476 -531 -303 -700 -270 -253 -423 -321 -385 -433 -180 -142
2213 -142 86 -59 263 147 -9 264 193 487 469 346 560 469 499 185 381 519 354 545 273 188 -241 -91
2235 -91 -255 235 -35 50 -321 -496 -351 -463 -221 -367 -301 -114 -329 -628 -115 -416 -94 55 -51 -245 -22
2256 -22 -199 15 55 233 476 123 57 366 -29 387 520 416 263 395 262 282 204 106 130 37 -62 -251 -78
2279 -78 -24 -285 24 16 -220 -296 -860 -276 -339 -257 -505 -333 -178 -722 -170 -293 -69 -159 19 -114 -244 -158 136
2302 136 95 385 262 320 185 372 281 459 332 424 501 494 419 49 404 304 31 35 167 -361 -267 -340 -213 -13
2326 -13 61 -218 -277 -264 -517 -414 -232 -258 -134 -433 -519 -255 -274 -362 193 166 590 -173 -52 221 384 427 247
2349 247 442 243 348 332 87 415 295 149 78 153 -76 -174 -120 -62 -84 -101 -103 -485 -307 -346 -138 -354 -63 -175
2373 -175 -199 -112 -244 -112 173 127 24 55 -14 469 31 176 286 148 161 307 206 54 68 139 307 50 -164
2396 -164 167 21 -196 195 57 -147 -121 -120 -109 -209 16 -36 -328 -126 -206 -306 112 81 -132 91 4 50 17
2419 17 -225 -37 127 227 -134 -190 -135 168 18 7 310 17 122 50 -48 132 8 74 181 -19 21 -103 -86
2442 -86 -127 -6 -50 106 82 -78 -227 -287 -201 -37 -72 239 -144 -34 -226 149 42 -158 15 217 -29 -288
2464 -288 -55 144 -121 -73 63 -28 -177 -15 69 157 171 20 188 27 -66 117 3 119 94 -58 74 -129
2486 -129 212 122 37 51 124 10 -98 -157 -75 -35 -129 -258 -49 -278 102 -35 243 24 -215 119 143 -32 161
2509 161 155 -30 -156 315 29 -43 169 -29 44 272 -79 -41 -137 -156 -48 83 -116 95 161 -409 116 -3 135
2532 135 80 394 -80 82 34 -51 206 18 178 312 142 34 40 187 259 146 -178 130 -142 101 119 158 -451
2555 -451 -63 -160 -70 -151 -225 -257 -167 -51 0 29 -423 -228 -57 -45 276 229 88 120 -52 158 298 218 289 -10
2579 -10 -25 46 92 186 64 79 54 108 135 161 -124 77 0 -105 -11 -205 -339 -191 -202 -202 -124 -111 71 -370 -38 -49
2605 -49 -98 -191 72 -72 119 132 48 -42 49 265 221 290 162 415 197 131 321 57 -17 -68 60 80 -11 -423 -56
2630 -56 52 -115 53 -54 -320 -87 -275 143 -65 -105 -121 -72 -144 -281 147 22 -190 50 41 0 -85 190 123
2653 123 -115 -152 183 81 -75 388 64 258 316 -3 15 182 335 310 -156 115 264 -247 211 -64 61
2674 61 217 17 -330 -135 -112 -203 -69 -105 -245 13 -196 -368 -180 -133 -61 108 -108 -128 -311 -182 124 301
2696 301 275 359 -7 155 -86 96 227 6 324 174 259 47 -144 326 -97 171 118 58 -36 -164 -266 -232
2718 -232 113 -215 -313 11 58 -118 80 -353 -309 11 -240 -371 -256 -42 136 77 259 148 102 61 357 9
2740 9 438 190 144 336 338 285 202 246 182 89 183 148 -8 -150 56 76 115 -291 -290 -119 -268 -304 -191 -201 -162 -118 57
2767 57 -137 -384 7 183 -111 214 39 78 26 3 37 100 36 157 -108 169 352 446 198 1 -51 -250 -86
2790 -86 -14 -42 40 -3 286 33 27 -253 -140 -130 108 -47 -184 -167 58 -190 28 -108 -85 -184 -279 -179 77 -39
2814 -39 -99 96 -110 -22 -43 206 59 -43 240 -79 -52 -291 76 14 190 338 72 -85 -56 77 110 298 -34
2837 -34 15 121 240 261 59 -24 117 31 -124 -169 -5 -50 -278 -139 181 42 117 -338 -94 -99 32 202 -88
2860 -88 87 -187 138 25 6 249 323 215 127 212 159 470 254 12 131 47 194 -142 150 124 94 -9 -62
2883 -62 -145 103 -241 -60 -150 -33 -158 -319 -288 -165 -232 -14 -267 -78 -109 0 9 180 -352 -221 -71 78 125
2906 125 109 27 59 237 150 147 -24 74 135 -29 -20 78 30 194 -102 -76 -77 -161 130 119 34 66 174 -35 70 30 29
2933 29 -23 -26 89 -197 -171 -129 22 84 -37 -60 43 79 -176 127 -85 83 -131 343 -186 -106 -290 32 -92
2956 -92 221 185 -19 48 9 -119 84 142 19 102 18 119 141 320 56 25 -146 208 39 65 -71 106 -123
2979 -123 151 -9 112 8 -81 -78 -67 22 -169 -21 -170 -104 -52 166 253 75 104 -26 55 151 -147 72 -15 68
3003 68 69 30 388 -77 71 93 -157 94 126 -22 -103 -39 -109 -68 -149 -266 -244 -189 -23 -240 -260 116 -71 -410 -136
3028 -136 -29 74 -74 -45 138 -275 8 -214 -32 103 200 133 -125 266 10 28 117 -235 200 58 224 225
3050 225 195 38 184 71 -109 -130 27 -29 -59 115 -82 -232 59 -126 -307 126 187 -10 -19 -290 -230 -112 -81
3073 -81 179 143 181 51 -88 -93 -144 -296 46 386 -7 85 -93 129 -57 -206 193 51 -16 -118 -7 62 59 108
3097 108 41 -16 38 32 304 75 -12 96 -133 -132 162 -171 -32 55 -42 -135 29 -95 -82 -43 129 64 120 -20 -165
3122 -165 211 -344 68 186 -34 -110 -48 32 189 -22 117 -70 47 -36 124 -5 309 -134 290 200 -59 -98
3144 -98 213 -33 8 -8 91 -80 -283 212 78 -21 -242 60 -195 -46 -199 63 16 187 -26 -116 220 -170
3166 -170 70 156 167 120 29 -32 155 113 38 -100 20 136 255 43 -161 -184 107 16 173 -150 -120 9 -22 36
3190 36 -64 58 73 -117 66 -11 -47 -36 25 -225 144 31 3 -230 -314 -1 -5 15 -130 187 7 -46 -127 -12
3214 -12 92 227 27 -275 -86 -26 -172 158 54 169 238 46 -158 -101 -127 268 176 57 139 -33 233 68
3236 68 68 178 -196 84 -201 -251 167 -207 -188 -66 159 46 -22 155 84 -114 222 247 -158 114 -30 194 -126
3259 -126 141 22 129 57 264 -169 139 271 62 139 -88 204 82 153 22 300 -278 -233 181 -42 -166
3280 -166 -4 -120 -186 87 5 59 -100 -66 95 -80 -264 1 -151 17 290 369 -131 -124 -174 -93 -4 -127 236
3303 236 71 208 -35 -120 39 -46 190 92 -186 -7 0 12 -91 -83 -187 39 193 -112 -64 -288 210 -238 -11
3326 -11 -192 176 -49 109 -33 232 82 26 105 160 17 236 94 -112 13 246 61 -30 -18 -70 -125 114 96
3349 96 113 65 -100 351 -103 -38 188 -103 -191 60 -36 -106 287 243 -18 161 -111 -201 -25 99 339 67 -114
3372 -114 322 -300 101 -53 -25 35 -260 -225 -209 59 -198 8 265 11 328 -83 -110 8 159 -176 78 -223
3394 -223 -99 -90 74 -60 -1 330 27 202 -98 -278 98 125 187 -225 -153 -5 -194 -58 -50 62 47 -224 -85
3417 -85 63 19 -116 93 -143 117 -199 -187 -1 -154 -117 61 238 -50 3 -228 -70 -130 61 -58 128 2
3439 2 8 10 -94 -133 139 95 51 -220 -62 132 -152 69 -22 -155 -95 -235 -126 -176 13 -218 45 90 -14 -60 212
3464 212 14 17 190 73 -15 -153 9 17 108 -319 65 -63 65 -72 -302 -115 100 106 243 -113 -68 -50 134
3487 134 10 237 -187 -4 -18 -43 20 160 -60 -42 92 150 -49 -253 -94 -240 119 3 -507 -246 -86 -53
3509 -53 -40 121 -106 160 -175 -384 26 -177 -79 -34 124 -36 -124 87 101 124 -3 40 26 -119 -46 -119 137 119
3533 119 90 54 195 -56 -132 111 89 -131 -111 -39 5 -31 78 7 22 -33 96 -111 -352 157 -12 -98 171 267
3557 267 -109 -326 258 -211 93 254 -46 137 21 -27 151 236 342 -34 -92 33 -24 206 -40 107 -16
3578 -16 156 129 -145 -49 11 -74 -160 44 -82 -204 362 218 1 -61 -48 216 -40 -181 -230 -10 -178 270 -21
3601 -21 3 -115 6 -25 129 74 -25 139 24 -14 -62 -22 276 -119 -18 178 -226 202 33 139 70 -5 87 43
3625 43 53 -68 -271 -11 88 65 -237 75 -48 -73 -55 -179 115 9 186 38 13 79 79 207 31 7 -45 202
3649 202 -10 49 177 -89 266 -37 178 104 267 94 179 73 86 -83 160 -54 -86 311 -228 -57 -27 8
3671 8 -132 24 -57 -22 -29 15 2 -76 -139 -197 143 -151 -54 -217 -25 -106 -9 91 49 195 118 -102 68 59 208 -91
3697 -91 138 199 200 -117 165 -24 -128 104 11 -90 30 -14 6 -171 -111 143 -179 -125 103 220 -75 -13 51 80
3721 80 155 206 -19 -139 38 -80 -47 -128 -240 16 103 19 -20 -93 -199 116 -8 -3 -106 48 121 -41 -197 -138
3745 -138 123 -13 136 169 30 -262 -85 36 33 61 -55 -14 352 135 -93 178 58 -224 -195 219 110 -180
3767 -180 127 -58 -252 -19 224 143 2 -23 -182 186 -182 -52 -196 -337 -247 10 10 204 112 249 40 21
3789 21 -14 -109 108 168 129 -173 104 -46 -65 -137 186 313 -61 76 -7 -191 61 -186 -146 -214 -112 -387 -106
3812 -106 -21 50 110 83 -324 -193 264 122 42 111 32 79 -69 -285 -17 41 -164 -22 55 99 -275 56 132 -13
3836 -13 356 63 -84 -38 50 23 64 -79 210 -203 38 -56 -92 35 33 20 262 57 85 179 -121 159 221 66
3860 66 42 -45 199 -62 368 -323 -158 -204 64 168 246 -49 53 -2 -99 65 124 -160 -19 180 -100 144 -31
3883 -31 77 -34 119 -46 321 184 -106 -138 -179 -90 25 -264 -112 -298 128 -12 -229 -19 -51 49 -114 -192
3905 -192 -421 -140 -94 -36 48 -23 38 358 280 -3 24 162 239 -5 414 -133 172 -87 -53 82 11 284 -156
3928 -156 -70 -242 190 -106 13 -108 -78 -132 -56 -170 102 -50 -125 22 -59 23 125 436 46 -36 166 -170 -231
3951 -231 217 118 -185 -179 -22 83 349 133 -151 -78 81 37 -52 -25 -181 90 -206 177 135 30 -72 55 151
3974 151 -34 -4 -192 -103 6 20 187 194 84 83 -65 116 -128 29 13 99 60 68 -233 -77 8 89 259 -47 -96
3999 -96 -178 170 -1 -110 182 152 -76 148 -20 49 52 -211 137 -374 -84 130 206 68 -293 -58 -8 -56 -56 -131
4023 -131 318 44 -193 -52 67 -99 113 65 -8 172 26 235 176 -138 3 -173 -270 -14 135 -42 87
4044 87 51 17 -91 -112 67 433 66 248 176 80 57 23 37 146 174 105 -125 -188 39 -157 -192 202 -237 73
4068 73 81 -12 -15 -35 -214 7 -73 -184 30 -121 288 164 -217 98 72 20 191 104 -134 175 -42 -129 70 -41
4092 -41 165 -159 98 110 166 -250 -223 44 -8 8 -43 -8 -10 -318 -29 140 -128 1 43 -2 215 -204 34 162
4116 162 4 17 -93 -19 -237 234 1 36 82 239 172 -74 -309 87 -226 214 146 25 92 -6 207 -23 -83
4139 -83 123 -135 -214 77 -103 208 -304 -13 36 119 102 -172 153 217 32 9 24 -8 -59 -235 49 -236 394
4162 394 -421 -199 22 47 75 -86 161 23 12 -131 2 52 73 95 229 10 286 181 211 -111 71 170 -88
4185 -88 -23 26 88 -313 -230 210 -45 -150 87 -178 -96 -87 17 3 -130 -47 114 -58 -63 97 68 24 46 176 -80
4210 -80 -237 -162 -59 -165 -65 -73 -82 -324 30 198 16 -59 -179 -340 54 -16 -72 -36 -98 -121 213 -166 -128 238
4234 238 107 20 320 124 -10 -48 -145 -167 -104 -307 103 -117 -15 103 109 -186 139 65 67 55 -55 -203 -1 -62
4258 -62 -195 -38 19 97 81 -24 -32 -23 -26 203 -56 101 22 -215 55 30 -72 18 14 18 36 76 198 93 86 -113 -165
4285 -165 -56 195 -56 12 240 -258 -287 272 -126 275 4 -61 44 184 238 9 53 8 196 164 -88 90
4307 90 213 21 -37 29 -145 27 -112 -329 -6 -220 -135 -107 -4 172 299 -32 -98 35 317 -175 -1 66
4329 66 -206 101 -128 -138 70 -173 145 -27 -10 -32 329 265 -34 206 409 27 137 194 -33 307 175 -65
4351 -65 -10 -58 -87 107 23 21 92 147 -65 -2 -164 57 -342 19 -118 -120 238 -119 246 -51 -94 138 199 137 91
4376 91 -268 -66 -111 -16 -52 -70 55 -283 206 -138 18 208 -90 172 57 228 76 -109 77 -50 -44 -106 128
4399 128 33 29 118 256 121 -101 167 -221 376 -35 276 133 -19 15 74 -84 37 -25 -91 -165 11 189 20
4422 20 131 -70 83 84 210 -18 161 41 250 -12 -6 -53 -3 -330 -100 305 127 205 17 -2 51 -26 -23 200
4446 200 206 19 -143 -13 333 222 3 -7 62 -299 -95 -208 -37 -64 -24 -102 74 122 70 163 -243 127 24
4469 24 61 148 116 39 -165 -78 -51 46 62 -37 24 151 -2 108 125 137 400 184 123 215 -20 19 86 94 -165 -127 -214
4496 -214 -238 73 -134 -63 -81 135 -90 141 -40 -123 -89 -28 -172 -181 128 -11 -151 -138 -143 -46 -50 123 64 -35 -4 -96
4522 -96 94 334 -325 14 221 -206 -289 -257 86 -38 93 60 -54 9 1 -88 -18 -193 -144 64 11 -144 -137 -134 -40
4547 -40 -20 -224 -85 -20 -114 210 -111 14 -100 -152 186 132 0 13 160 207 -31 123 -18 221 246 160 -136
4570 -136 -19 41 275 28 -67 40 -100 -288 207 -174 32 -195 -120 -335 190 -145 -62 172 -68 98 80 119
4592 119 -5 -42 -147 -152 -188 -55 97 155 111 207 -60 224 -233 -223 271 104 244 253 -173 -139 189 -34 -107 -233
4616 -233 186 -106 -224 -29 -47 -89 75 -316 -55 -122 -201 113 -211 -60 -157 15 -204 0 -278 -40 57 16
4638 16 -210 153 40 115 88 221 -16 49 21 -46 -115 1 38 88 -131 -41 189 -25 42 7 149 34 41 122 149
4663 149 -212 254 -29 66 -77 35 280 131 128 258 -24 62 -52 -138 -55 48 -150 178 -36 -287 140 -89
4685 -89 -14 -88 0 143 96 2 -58 -162 -109 -496 3 -191 -86 24 2 97 -134 208 77 122 99 -40 155 -235
4709 -235 -78 -197 -94 189 -58 -261 -22 187 -190 -193 -60 -187 32 84 -229 -84 -68 -57 -149 -213 -11 -373
4731 -373 57 90 88 131 -211 -241 -51 234 171 -206 115 -258 54 14 234 -2 -326 28 109 -64 -176 8 148
4754 148 -108 -232 -262 -91 -136 61 51 256 27 -89 -66 -7 174 -141 -2 -161 28 -54 99 -6 -20 57 -95
4777 -95 -7 79 199 148 -23 -102 253 -284 73 249 0 64 -100 -51 -122 23 127 89 1 265 47 -9 -156 -33
4801 -33 17 -79 73 -289 90 103 74 -121 48 -85 -72 -132 -179 -173 175 22 -112 -10 -277 -53 160 78 -64 23
4825 23 -57 -151 134 169 215 -157 32 -55 64 -23 72 176 -200 90 -125 -224 -86 -98 -197 -37 -281 185 -249 -39
4849 -39 22 153 -121 85 -75 63 -140 224 369 225 -12 58 95 9 -105 -117 104 -60 -69 -63 44 17 12 31 109
4874 109 88 -216 -143 -103 72 96 40 -52 52 17 19 -23 -102 182 21 -151 -100 -73 -367 50 -22 -47 -157 69 79
4899 79 -62 -54 175 175 -11 29 75 -62 271 -128 -128 -209 -158 76 -75 5 -29 -305 307 -105 -103 -42 82 -38 -72 -90
4925 -90 63 -135 -52 227 -5 -130 -302 27 -104 84 -344 27 89 9 -308 -124 -51 -33 14 77 163 174 11
4948 11 36 161 53 225 203 85 -220 -111 -260 379 -55 -134 -101 -161 -9 18 149 177 -69 46 -103 -72 9
4971 9 -136 -214 -293 147 -291 -123 111 -77 -209 31 -98 6 -48 30 155 197 -100 -149 -11 18 -353 155 87
4994 87 -188 107 210 241 89 -88 474 78 -374 58 -57 -102 -10 116 45 -15 -20 -135 39 -217 200 136 66
5017 66 -16 -38 -381 -5 -87 -185 11 -179 -127 37 81 -159 7 108 -43 17 -125 38 238 48 202 174 -36
5040 -36 -10 -263 24 -58 -43 -112 154 -25 -18 91 114 58 -147 -110 -27 -12 -188 189 -206 87 -265 187 -174 -230
5064 -230 -39 139 -204 56 70 182 -121 -56 13 422 -24 -219 -102 -43 145 8 -81 -47 93 196 0 116
5086 116 -1 -37 143 52 81 120 286 -145 343 76 15 -207 -66 -213 128 -191 17 91 -69 46 -111 124
5108 124 163 -67 -23 25 72 -64 -89 151 -54 -114 -28 -136 167 153 175 291 156 -247 185 185 -17 74 214 133
5132 133 -48 204 -310 -29 -135 -77 135 -33 3 133 38 -100 -15 -217 67 76 -169 54 -99 264 138 86
5154 86 83 146 128 -100 64 239 285 -45 216 83 -100 179 30 95 -59 60 197 -40 -200 69 254 -16
5176 -16 -101 -169 -71 95 -3 49 1 -79 -171 504 0 176 -161 62 103 145 26 95 109 436 111 -26 257 60
5200 60 220 -86 30 -26 39 119 -138 -87 172 -173 -28 -140 103 -86 167 -37 -154 195 -69 -22 86 21
5222 21 2 -10 438 -3 294 261 48 -90 -57 -199 71 -21 -175 -12 -162 -44 37 62 29 2 270 -123 -293
5245 -293 118 -45 91 -238 -68 103 -134 165 103 -90 116 -58 -43 112 -11 -75 7 70 20 72 75 186 -116
5268 -116 -189 -86 -1 -307 -132 55 353 31 -86 33 -203 -246 117 -29 45 -105 -252 243 125 -162 54
5289 54 -15 -191 -182 160 140 284 258 104 114 106 9 80 119 116 19 107 -28 -119 49 -75 64 33 -172 -192 -43 -183
5315 -183 -31 -274 -75 -38 -42 220 -15 -116 -8 -48 79 -29 73 36 -139 43 7 -17 -402 -228 7 -118
5337 -118 111 -107 178 222 -22 -45 -94 -5 73 35 241 66 -194 157 -174 45 172 -45 -35 133 -152 -29
5359 -29 44 84 -30 -50 -141 -160 -127 15 -149 -196 82 173 -150 -42 -65 -50 -9 -191 -277 -213 -227 -64 -33 -337 -28
5384 -28 62 -116 68 157 -233 -292 -119 -41 75 121 88 -110 67 60 -181 270 83 98 183 269 -67 -111 -87 196 65
5409 65 169 -139 127 216 -179 87 -169 44 -15 107 118 171 7 309 -79 -39 -51 -58 -248 69 142 -223 -228 102
5433 102 -101 -74 18 105 20 141 35 -95 -74 122 -113 -91 -67 84 -201 123 19 56 43 -37 -114 74 -58 -66
5457 -66 -15 -94 281 88 29 -99 108 156 206 187 21 -118 -236 -140 -107 -136 -39 12 377 -160 50 -165 -104 56
5481 56 -1 -229 -28 -58 -75 -241 -179 10 -128 -4 10 74 43 61 -32 124 39 -23 -69 80 -20 -55 -3 47 -127
5506 -127 -240 147 75 -255 -134 -105 6 -126 -32 -74 175 -53 -45 97 -42 56 -136 67 -283 -88 -53 248 -113
5529 -113 -233 3 -14 -151 173 -11 -20 153 85 -25 71 -86 1 72 -226 -88 -234 241 28 182 -185 -47
5551 -47 129 -47 -180 173 108 -13 175 -37 -368 82 51 -171 -10 -54 -137 -164 51 -153 -122 184 136 150 133
5574 133 -205 2 171 42 -90 -233 113 5 -9 116 93 227 37 133 171 -171 -124 12 -92 87 4 -85
5596 -85 189 -74 -213 21 -59 -283 -47 -79 -161 -90 -230 180 -187 138 9 -31 130 204 -108 -449 -50 47 93
5619 93 102 -35 -25 -96 254 12 -14 -43 34 145 263 149 -111 -36 -100 -72 -124 -50 27 50 260 -206 -9 -16 78 6
5645 6 -11 31 -11 7 169 89 173 184 -111 144 -5 168 -278 -70 65 125 -183 -17 -250 227 231 54 -143 -204
5669 -204 -305 -358 -21 -46 125 -25 83 22 256 93 -150 -93 -221 -80 184 -18 131 18 -78 36 -157 20
5691 20 131 -57 -79 132 34 -33 -152 40 -158 -79 -214 66 -6 -118 -9 64 -63 148 11 247 147 -36
5713 -36 13 87 -10 159 60 -39 133 -221 -216 -51 192 28 4 126 -46 2 199 55 12 -58 205 83 -66 130
5737 130 65 22 115 25 167 13 -173 120 181 -138 -83 -3 -96 -43 24 -8 -73 125 147 -216 268 -68 -15 76 -3
5762 -3 -148 -148 -40 147 -136 -35 98 68 -24 -46 -59 -27 -296 -103 67 55 -139 -256 -287 117 -149 -34 153 62
5786 62 86 -203 -13 58 -136 51 279 -88 35 -62 65 -81 -140 60 -148 -99 -204 108 250 -63 44 -388
5808 -388 -12 125 213 162 33 230 99 17 -60 -42 263 267 140 -100 156 -86 -97 83 -16 185 134 -249 51
5831 51 115 -194 -71 -148 -8 41 139 22 -60 192 -76 -91 -54 82 -26 -53 -105 73 59 -170 -79 -63 -172 22
5855 22 100 189 2 -75 23 -131 -209 17 68 92 95 133 -113 -203 -179 -514 7 97 146 21 -85 153 22 81 -353
5880 -353 226 54 102 -29 -87 148 66 -41 -126 -13 119 -177 -31 353 -25 53 205 86 -65 -97 -95 68 110
5903 110 94 -109 270 -76 96 -118 181 17 -64 -77 16 161 -77 -80 6 -79 -193 170 63 57 -239 57 -70
5926 -70 17 -99 -153 143 13 -62 149 192 59 297 -31 -12 -43 40 63 -17 35 -117 -161 -132 -52 169 44 69 207
5951 207 -262 74 103 -90 86 278 -170 70 43 -260 74 134 -86 228 252 -27 -102 0 59 42 -53 -61 125
5974 125 109 136 41 32 116 256 3 56 22 58 223 4 53 44 -64 168 -2 14 -141 -75 -212 -211 14 92 -103 25
6000 25 10 -243 -61 -31 -69 -208 -72 20 75 -82 44 121 -94 -20 77 103 97 -57 -120 38 -124 -5 48 -107 289
6025 289 -24 -16 33 -30 -69 48 -159 40 -159 -29 35 -172 156 -154 138 141 95 242 -66 -121 -103 231 19 192
6049 192 -33 196 52 -118 -106 38 304 -40 -20 -71 72 215 233 180 59 118 182 -35 48 -190 131 -7 -214
6072 -214 -205 -30 186 29 -11 -223 110 -66 -66 99 10 -204 -2 186 79 126 -119 -119 22 -164 128 81 -43
6095 -43 -153 -14 -144 44 -116 -11 159 8 55 206 -14 -166 177 -24 -62 -64 33 -159 -207 91 -113 194
6117 194 116 -92 -25 -117 -127 -147 -15 -258 37 -42 78 181 114 182 -66 216 -136 -43 -317 -147 -96 -184 -49 53
6141 53 -143 70 -230 -34 54 -100 129 62 51 -7 -133 -65 28 164 131 -154 80 -89 -137 10 120 -194 -102
6164 -102 -69 -19 323 -84 -40 145 7 94 -16 -149 5 259 -45 -31 30 158 16 344 46 150 -80 99
6186 99 111 -59 122 -53 8 -236 -10 -176 -70 85 -87 -198 59 274 118 -158 21 -79 -94 -107 -126 140
6208 140 211 -128 -31 7 184 195 177 -332 -159 -228 19 -106 -141 164 -115 -189 -80 44 -100 185 64 -168 113
6231 113 -74 -97 89 121 -80 -18 242 16 -26 85 -76 -36 -117 28 -186 255 -44 -143 126 317 -50 -18 66
6254 66 115 186 -297 -231 -94 -98 150 259 82 128 142 -21 42 -24 161 -271 -80 14 68 -220 137 92 -40 -39 111
6279 111 36 -117 71 -161 -207 -286 -174 56 39 53 -76 181 -69 -32 40 109 -57 137 28 116 76 -243 133
6302 133 85 60 -142 -145 -219 -121 7 12 -21 234 146 -210 -94 37 282 -43 189 -220 37 -224 58 -102 112
6325 112 -152 -385 126 -242 70 -44 63 3 -162 97 50 -104 115 -287 217 282 -88 135 -74 76 17
6346 17 -212 -15 19 -84 -155 -36 56 16 -163 -102 459 -5 -30 -79 61 361 57 -4 18 113 -52 -22 105 -149
6370 -149 -84 30 -372 172 50 -181 -69 -58 -91 93 -14 48 40 288 -116 -18 63 116 109 175 -208 -91 -73 46
6394 46 -65 -104 -22 -60 6 20 -40 103 -70 -28 -173 -209 132 -75 -53 86 -334 185 -73 100 269 -59 -189
6417 -189 -147 219 -111 -52 58 55 -222 -130 202 102 163 -127 114 -48 33 -34 93 4 -3 77 16 133 152 283 128
6442 128 -20 404 127 169 -5 107 -44 -131 138 106 23 41 120 41 -77 -43 -130 -187 -47 -94 82 143 15 -276
6466 -276 -129 286 130 78 -117 -26 139 267 -13 -20 -10 -89 -136 107 161 -90 -82 104 34 -8 268 -14 36 -316
6490 -316 -167 -123 34 9 96 80 -144 12 2 -315 -55 31 -169 50 -102 51 -98 -69 -123 6 93 -20 80
6513 80 -148 -79 86 -119 -55 -125 -36 110 -59 16 23 58 83 -92 26 -68 -181 -16 1 58 -37 109 9 36 -99
6538 -99 -286 97 -102 -63 -21 -79 -24 -234 142 107 -43 60 -71 -5 -31 153 80 -5 97 242 -4 14 54 82
6562 82 276 68 -154 93 12 136 164 -189 38 -62 -51 161 -7 89 260 9 108 -194 -190 5 186 -165 361
6585 361 65 52 -82 138 15 -32 197 -118 50 -51 -35 -49 -23 1 -76 170 281 171 75 -68 43 -224 -18
6608 -18 -112 -51 -99 137 -191 -183 -256 -112 192 -92 -197 53 -68 -168 -22 41 73 -46 155 -135 -44 -2 -106 -19
6632 -19 -34 225 -361 338 -74 14 224 -25 -69 -2 273 -280 -124 152 -223 -128 -80 32 -162 -56 -20 24 23 -48
6656 -48 174 -55 32 16 144 170 -76 144 232 -36 42 -178 -31 -50 -43 80 -61 -255 -228 14 65 25 -158 120
6680 120 -149 -95 -40 151 -64 -87 -55 -51 99 137 -61 170 53 -184 176 42 -91 -167 -95 16 -119 -166 3
6703 3 -148 143 -152 -302 -184 161 0 -23 7 -43 -187 119 -192 167 241 0 107 -107 -273 116 39 197
6725 197 -54 -16 -241 108 21 -15 238 -26 -142 -40 130 50 9 20 50 17 -230 -121 6 -26 -76 -226 34
6748 34 8 -51 -118 -50 -124 -35 78 194 34 123 69 -31 -88 98 -58 211 -67 151 27 77 113 -16 -31 123
6772 123 321 -107 -371 100 -20 -278 -228 -204 -22 19 134 -72 41 -24 232 136 134 189 -80 -192 -80 -14 -175
6795 -175 -73 -357 -128 -147 29 115 -46 134 34 24 -148 -67 -89 -171 74 38 -187 -101 82 34 -34 -111 -66 91
6819 91 218 27 31 10 157 222 -45 -200 51 84 61 -85 50 24 267 -29 41 17 15 -89 12 58 51 -75 -14
6844 -14 125 -149 31 -61 -13 -4 45 -197 -23 145 10 -23 -24 -52 -75 11 187 -103 -115 23 -192 -140 126 -94 -264
6869 -264 8 18 -69 -13 -33 -5 270 -97 60 -65 239 145 182 63 34 76 503 -55 150 -108 48 91 -130
6892 -130 -56 -64 -14 -76 197 62 22 197 -161 -67 -85 344 -24 80 -194 10 -5 -77 82 -226 137 26 77 -67
6916 -67 -43 4 103 -279 -179 123 217 194 2 382 -71 -246 18 -221 34 132 -285 -42 113 -71 176 -165
6938 -165 179 0 -15 -76 87 -150 110 88 209 -51 336 -84 -298 75 -156 40 16 9 -130 -108 7 95 -35
6961 -35 -338 -27 -104 31 166 120 -3 -12 82 -138 -85 -153 55 -9 155 -91 -236 -148 -38 -137 79 4 128 124 64
6986 64 114 -99 187 -126 -373 -48 -2 27 80 -116 22 167 38 134 33 -153 -109 -75 152 81 -32 65 -44
7009 -44 142 15 -52 13 92 99 -273 404 0 -85 28 -99 246 55 3 -39 46 -92 -135 -125 171 -94 -28 314
7033 314 -197 -94 -9 -235 -267 3 -160 261 -15 -100 46 83 151 -174 129 16 87 132 -179 -303 125 -40
7055 -40 -42 70 -99 -277 -131 -96 -134 195 -125 -57 -72 -88 -25 -128 -249 -56 -180 62 9 87 52 -6 -31 46 165
7080 165 -29 21 84 -175 54 -259 39 71 78 5 71 64 94 202 295 200 8 -257 -138 37 -23 148 -139 75
7104 75 68 -252 -57 147 103 -12 47 1 -255 -4 90 64 -114 431 -45 -47 -225 -24 15 77 107 74 61 -223 41
7129 41 -322 -85 -90 58 259 -239 -278 -152 -94 7 -100 138 254 -174 -75 28 -318 61 236 -60 12 270
7151 270 -22 -21 -71 -275 464 -18 11 68 -257 -42 -89 138 174 16 -59 95 35 102 90 -13 116 -128 -14 -112
7175 -112 48 119 -118 131 -3 -100 106 203 -136 -127 -6 199 3 -90 169 41 -210 65 68 -28 -232 -50 226
7198 226 295 6 6 164 -189 179 73 236 -158 37 -238 236 158 332 -11 -109 -101 -155 -21 -71 -12 147 144 -229
7222 -229 -425 -134 59 95 2 -150 73 -135 -145 -57 -145 19 47 4 -134 -25 -68 117 -5 -95 61 122 -29
7245 -29 142 50 -307 232 -240 38 87 183 5 -84 95 -69 147 7 20 -43 28 123 -126 98 109 -47 217
7268 217 -70 -114 -9 108 101 74 -42 -340 158 -5 25 187 -318 21 -113 -123 59 -167 37 -170 131 -220
7290 -220 5 8 -209 -114 -182 7 -196 -6 -16 -115 150 -71 -200 -161 -142 29 -176 106 79 225 -212 151 56
7313 56 -4 -37 106 -16 114 -12 -44 133 42 141 216 213 116 255 79 142 -232 91 361 -172 352 -74 -170 -22
7337 -22 108 -137 52 -34 127 -24 32 -62 -65 -54 -57 220 -290 -141 -67 -249 -103 63 41 -117 230 -196 -175 -61
7361 -61 -262 110 -81 210 -44 472 -34 11 86 49 -191 33 179 -17 70 -164 7 47 148 -68 149 152 4
7384 4 -7 -163 75 -69 -62 -250 -228 173 0 128 -163 -95 -50 185 45 52 -90 72 -68 29 96 195 80 141 -231
7409 -231 -23 -34 -117 -20 -12 13 49 61 -272 -193 -83 181 45 -31 -33 -57 122 -78 -245 220 44 29 -84 72 90
7434 90 169 79 -21 -73 -71 50 -15 211 231 105 149 98 -76 34 -70 -57 62 75 30 -44 -188 358 -61 30 -99
7459 -99 205 -191 -93 -131 175 -43 -40 -56 -16 -3 77 -25 -85 202 -172 -126 -81 102 59 -114 -118 -44 166 -108 37
7484 37 79 95 -102 155 54 -170 -12 -214 -1 177 -203 -147 -75 107 134 -105 -50 -216 -94 -224 181 -39
7506 -39 197 97 -114 106 -81 79 156 -133 -37 -173 37 158 126 -46 -81 -185 -57 -64 -156 263 57 -72 -85
7529 -85 -99 141 4 130 16 -1 -69 152 -116 77 31 57 208 12 -100 -18 -50 -223 34 30 -39 113 19 -13
7553 -13 20 77 -123 197 50 36 -181 26 -224 349 1 12 104 103 -38 -76 -5 -260 242 -14 90 -14 37 167
7577 167 -272 259 262 67 127 -19 80 116 43 -84 103 -44 -133 -103 104 226 5 147 182 -154 -7 -28 162
7600 162 176 143 76 -143 174 344 -156 65 132 -106 151 -37 -108 -15 188 -231 268 4 23 -38 -77 161 122
7623 122 176 -170 -366 -22 -26 -5 -6 -26 11 -6 -74 175 133 -185 115 -125 -25 -44 -3 -4 -113 9 91 -224 81
7648 81 150 -51 -126 -90 -66 102 -110 -224 31 -51 -171 9 12 -54 155 319 85 135 40 63 -85 125 148 -419
7672 -419 -3 -113 -56 9 135 35 27 -88 67 -43 242 -82 139 90 -181 38 -38 -12 168 -67 277 16
7694 16 -69 160 -8 -122 153 394 46 33 97 86 169 24 2 38 79 223 -190 64 132 -68 141 -68 61
7717 61 -10 -153 42 -162 -166 -90 31 40 -58 19 -95 -138 150 -30 82 -78 40 -40 86 -270 174 40 -161 -17
7741 -17 -61 -8 -265 164 7 58 -116 -249 95 230 -5 98 -293 30 138 22 47 -136 119 74 -74 130
7763 130 96 -90 188 131 -34 -86 -42 -54 223 193 80 109 85 17 -75 -193 -104 138 143 195 -63 119 -134 -162 178
7788 178 139 -184 -267 33 -102 78 53 -129 169 95 116 -195 109 32 19 -193 82 200 -36 -106 -70 -126 51
7811 51 102 205 19 3 -116 -102 -1 -39 171 -111 -35 -64 67 -49 -20 57 265 163 -71 4 -19 100 115 -114
7835 -114 -32 29 -136 100 -165 -169 31 -142 -37 213 111 -86 107 66 110 125 -150 29 92 68 -27 -156 -84 -7
7859 -7 76 -173 112 173 -70 -166 300 168 -50 -3 -10 9 198 25 -55 0 -93 222 164 -110 -84 -198 46 101 218
7884 218 -84 -83 -267 7 206 289 -103 189 -59 -6 -10 128 180 -103 114 132 -125 -118 109 -144 -157 -169 -34 -33 -113
7909 -113 175 -129 -186 133 27 2 21 21 -92 192 97 44 -50 -121 31 27 -104 -130 -55 3 -134 -14 -48 144 -74
7934 -74 17 -165 235 -64 126 30 -93 -75 127 15 -151 40 -245 -61 -65 -80 25 111 -66 158 -36 -242 7
7957 7 -122 -135 -55 -4 172 60 53 178 165 -164 67 19 137 88 162 -264 -30 172 -144 -141 -23 -107 -145 110 51
7982 51 -72 74 -43 167 70 -239 -25 -242 -323 220 251 -228 -20 36 224 34 -70 -125 -145 220 -131 76
8004 76 -66 -87 -166 41 31 -46 136 132 -29 58 3 -116 -60 235 103 80 84 84 -7 267 -67 21 207 0 -17 16
8030 16 33 -6 59 -24 80 -91 92 -13 133 78 79 -25 -159 -63 52 -24 -47 107 -224 -109 189 -176 54 -117
8054 -117 95 -93 294 -42 -215 42 -11 -45 -138 107 33 162 82 10 -68 9 -154 27 -144 123 -11 -100 -47
8077 -47 16 199 107 -153 107 91 83 -49 14 -54 -156 249 -11 -18 66 221 -124 140 188 169 -98 317 32 99 104
8102 104 83 40 -57 -12 -1 5 -50 90 160 39 10 64 70 -298 144 -26 12 139 -89 -89 68 -53 69 83 17 -321
8128 -321 -130 -185 25 -80 18 99 -176 -114 -75 -128 -96 142 -19 187 79 -38 -113 30 131 202 171 -28 -37 -81
8152 -81 4 -40 91 -124 -77 146 6 -359 33 -88 -94 -73 -50 189 -139 -171 202 -76 -275 -48 -17 -121 -22 -273
8176 -273 163 363 22 -68 -158 68 -169 -133 -118 -64 53 8 -302 134 2
8191B
$$ Imaginary data points
##PAGE= N=2
##DATA TABLE= (X++(I..I)), XYDATA
0 0 0 0 0 0 0 0 0 0 0 0 0 0 0 0 8 -8 8 -8 8 -16 16 -16 24 -24 32 -36 40 -48 56 -64 73 -84 93 -108 119 -135
36 -135 152 -171 191 -213 235 -263 291 -322 357 -395 434 -480 528 -582 642 -707 780 -861 953
55 953 -1054 1169 -1302 1458 -1643 1863 -2135 2478 -2926 3541 -4447 5904 -8659 15736 -75454
70 -75454 -139785 -57625 -92648 -129350 -116394 -51598 -58799 -131945 -194083 -140429 -30600 29977
82 29977 -7655 -73121 -91510 -30197 40873 55907 29942 36713 81591 114909 92452 44910
94 44910 38341 97235 157063 150660 81294 19967 17132 54177 72994 51907 17773 -3701 -16024
107 -16024 -30602 -56631 -71806 -53781 -26802 -38266 -86269 -124675 -117187 -74917 -43333 -47821
119 -47821 -65604 -71032 -55398 -33283 -23980 -19168 3571 35575 49018 36810 16572 17080 48495
132 48495 88767 102836 80808 47178 33463 45406 60313 64083 60395 48691 26383 1120
144 1120 -15781 -18277 -5538 4832 -5260 -36253 -64558 -71058 -57202 -42954 -40141 -44745 -49553
157 -49553 -52283 -52015 -50743 -46404 -29584 -4413 9417 3806 -8791 -13615 -103 26412 48313
170 48313 54538 46184 33019 27808 30738 38343 50209 58687 51583 32936 15248 6149 7504 16199
184 16199 19727 9664 -6846 -19988 -27082 -30422 -31437 -28957 -24502 -25364 -32286 -41186 -48141 -45752
198 -45752 -30019 -13305 -8963 -14408 -20688 -21324 -12090 3886 17668 23085 20294 15730 15029 19161
212 19161 27727 37706 39806 32634 24598 20555 19184 21179 22808 19552 11774 4418 -859 -5388 -11201
227 -11201 -13397 -11273 -11082 -15884 -22400 -29495 -33515 -29374 -19303 -13420 -14882 -19843 -23752 -22732 -15375
242 -15375 -3215 6504 8420 4647 2622 3207 7511 16915 25418 26563 22297 18472 15230 13938 15559
257 15559 18981 19703 16907 11163 4586 -2522 -7471 -5162 -500 -338 -4830 -11950 -20910 -24894 -20655
272 -20655 -12492 -8653 -9271 -13808 -19129 -20041 -15011 -6080 1020 1713 431 -269 -956 1741 8066 13215
288 13215 14095 14999 14456 11701 9622 9867 12028 13826 13687 11620 6861 142 -2862 -931 1311 1059
304 1059 -1266 -6047 -12656 -14821 -11746 -7979 -6604 -7698 -10451 -13281 -13870 -9766 -4624 -1946 -1593 -1128
320 -1128 -1459 -2419 366 4582 7211 8907 9987 8501 6223 4809 6800 9851 12050 12039 9312 3817
336 3817 -916 -772 2256 4487 4671 1943 -4365 -10190 -10510 -7314 -4204 -2907 -4307 -7885 -11539 -12320
352 -12320 -9253 -5752 -3324 -1542 -1311 -3571 -4751 -3394 -670 2553 6435 8472 7138 4031 2794
367 2794 3893 6481 10029 12035 10810 5841 2420 1909 3112 4753 6503 4542 27 -3313 -4613
382 -4613 -4785 -4205 -3387 -3322 -5619 -8451 -9081 -8757 -8678 -7288 -4778 -4551 -5813 -5803 -4880 -3866 -1521 1650
400 1650 3214 2570 2274 2672 4189 6423 8925 10239 8235 5537 5887 7010 7883 8517 8689 5091 1484
417 1484 37 814 498 498 -399 -2559 -5886 -8644 -8630 -7885 -7196 -5838 -5353 -8033 -10167 -10093 -8910 -6724
435 -6724 -2664 207 29 -2114 -2909 -1602 889 5152 9393 10462 7712 4924 4755 5578 8008 11014
451 11014 12266 9398 5564 3189 1533 1030 2347 3899 2986 -888 -4323 -6856 -8487 -8012 -5012 -3783
467 -3783 -5149 -7343 -9652 -11297 -9844 -6368 -2895 -2231 -2528 -3004 -4033 -3121 -158 3623 5328 5181
483 5181 5307 5376 4516 5337 7381 8131 8239 7758 7098 5058 3250 3815 4045 3208 2042 903 -532 -2845
501 -2845 -2789 -2890 -3414 -4352 -4747 -5978 -6692 -6091 -5230 -4617 -5308 -5705 -5329 -4931 -3448 -1015 -104 -824 -1004
520 -1004 -240 120 1544 3843 5029 4714 4235 3349 3059 3419 4920 6520 6848 5182 3302 1657 -19
537 -19 751 2941 3915 2389 573 -1857 -4549 -4800 -2625 -524 -822 -1885 -4185 -6392 -7292 -5814 -2876
554 -2876 -1379 -1428 -1754 -3560 -5317 -4629 -1712 663 2359 2864 1866 -333 -1060 756 2874 4740 6100
571 6100 5933 3781 1285 1384 2906 3926 4970 5393 3428 588 -840 -723 -163 169 1083 95 -1757
588 -1757 -3711 -4153 -4050 -3859 -2837 -1854 -2829 -4074 -4496 -4109 -3777 -2217 -796 -194 -1253 -1191 -497 -127
606 -127 571 2160 3035 2029 2146 2600 2707 2746 3522 3689 2561 1955 2443 2656 2165 1161 1477 356 -940
625 -940 -735 -126 -526 -725 -535 -1600 -3124 -3156 -2390 -2018 -1295 -860 -1043 -2454 -3047 -2752 -1320 -415 289
644 289 1100 -169 -1653 -1218 -625 820 1804 2952 1837 7 -701 -600 515 1613 2719 2806 1365
661 1365 -348 -588 -399 95 1751 3013 2237 350 -601 -1211 -865 507 2132 1975 657 -652 -1786
678 -1786 -2017 -1262 291 1215 -138 -1365 -2231 -2782 -2886 -1523 -450 -435 -941 -1645 -2242 -2649 -1764 131
696 131 535 251 250 179 -313 240 1580 2420 2515 2525 2165 1599 1487 2359 3217 2809 2215 1814 1237 431 1179 1541
718 1541 641 -135 -1044 -1747 -2213 -1914 -1574 -1565 -2250 -2744 -3141 -3686 -3988 -2246 -1571 -1592 -1918 -1952 -2417 -1717 13
739 13 964 1704 1863 1272 955 882 1772 3198 4279 3898 3047 2257 1627 1424 2979 3390 2891 2349 1075 -458
759 -458 -1148 -818 180 123 -448 -1244 -2448 -3802 -4001 -2569 -1777 -1670 -1858 -2636 -3949 -3826 -2669 -1230 -654
778 -654 149 -275 -1099 -1701 -425 967 1831 2466 2776 2083 1044 1355 2383 3040 3264 3831 3225 1813 1438
797 1438 1759 2245 2108 1979 1528 36 -1007 -725 -495 -1016 -943 -1239 -2256 -3707 -3642 -3135 -2787 -2249 -2387
816 -2387 -2900 -3835 -3580 -2403 -1384 -722 -150 -315 -856 -1129 386 1516 2755 3351 3600 2726 2195 2253 3535
835 3535 4355 4681 4737 3788 1771 797 1293 1644 1877 1988 911 -1227 -2946 -3123 -2616 -2385 -2070 -2002 -3608
854 -3608 -4842 -5546 -4921 -4151 -2788 -1595 -1980 -3058 -3199 -2046 -1268 368 1980 2935 2125 1810 1822 2506
872 2506 3520 4764 5550 4809 3933 2974 2625 2861 3225 3581 2635 1147 69 -599 -1482 -1575 -1449 -1627 -2649
891 -2649 -3522 -4100 -4360 -4275 -3585 -3405 -3292 -3535 -3384 -3095 -2863 -1371 -548 -301 -89 150 712 1418 2436 3403
911 3403 3296 2951 2918 2919 3049 3455 4302 3709 2414 1668 1132 1119 1399 1402 1267 -165 -1429 -2298 -2645 -2531 -1942
932 -1942 -1491 -1736 -3017 -3957 -4163 -3719 -2857 -1136 -942 -1618 -2281 -2485 -2209 -1295 665 2335 1761 1089 893
951 893 554 875 2300 3949 3869 3177 2586 1528 833 1531 2671 3198 2488 1516 303 -1257 -1370 -739 321
970 321 36 -666 -1417 -2730 -3355 -2989 -2013 -1364 -1619 -1739 -2672 -3163 -2823 -1615 -617 -133 7 58 -521 -444
990 -444 595 1613 2114 2465 2430 2123 1892 1579 2814 2550 2463 2306 1351 921 1017 1042 1051 106 -155 -519 -1425
1011 -1425 -1560 -1368 -1210 -1592 -1951 -2417 -2840 -2839 -1762 -1098 -974 -1469 -1403 -1689 -1479 -327 899 1511 1561 428
1031 428 441 466 1212 2228 3226 3026 2518 1817 446 542 1372 2238 1884 1383 668 -702 -1954 -1614 -915 -150
1051 -150 -434 -770 -1789 -3226 -3262 -2129 -1053 -734 -315 -629 -1695 -2069 -1345 -512 673 1607 1609 989 -176
1070 -176 30 877 1973 2492 2718 1743 704 315 660 792 1227 1594 1030 -37 -1189 -1285 -1032 -547 -429
1089 -429 -207 -1055 -1759 -1755 -1794 -1300 -595 -473 -594 -933 -939 -623 -578 142 958 1153 534 205 683 1181 919 1278
1111 1278 1485 809 466 750 830 550 983 898 163 -450 -419 -137 150 -85 -40 -446 -1295 -1476 -1281 -984 -589
1132 -589 -336 -395 -865 -1556 -1284 -648 -185 655 720 143 -344 -398 -79 422 1461 1996 1416 556 118 410 655
1153 655 1032 1823 1732 797 -18 -85 -423 -188 416 980 125 -965 -1458 -1581 -1545 -559 8 -436 -834 -1744 -1561
1174 -1561 -1782 -854 -415 214 -118 -315 -517 -693 2 577 1576 1272 1175 668 613 652 1489 2099 2331 1697 841
1195 841 735 767 645 1053 1258 423 -84 -630 -1048 -1194 -849 -637 -1168 -1577 -2069 -2366 -2225 -1472 -1139 -1176 -1417
1216 -1417 -1554 -1228 -1036 -527 378 619 518 313 662 586 1398 2190 2486 2399 2001 1736 1457 1530 1791 2280 1933
1237 1933 1138 346 172 -769 -600 26 -148 -843 -1376 -1966 -2606 -2602 -1643 -1461 -1511 -1861 -1869 -2251 -2081 -1357 -479
1258 -479 -334 14 127 -75 42 509 1560 2261 2158 2177 1989 1586 1582 1914 2211 2205 2161 1657 704 352 494 684
1280 684 365 -184 -507 -1226 -1835 -1897 -1536 -1557 -1536 -1740 -2282 -2398 -2306 -1853 -1199 -1261 -1205 -1031 -1117 -1038 -3 735
1302 735 959 1087 1104 1130 1025 1358 1924 2136 2361 1940 1497 1057 1114 1474 1435 1605 1091 407 -161 -759 -557
1323 -557 -376 -56 -513 -949 -1588 -2276 -2191 -1497 -1292 -1131 -1318 -1897 -2231 -1870 -1235 -556 -236 65 -75 -582
1343 -582 -753 -108 447 1049 1837 2135 1527 846 987 1328 1833 2292 2319 1946 1052 581 371 607 841 1166
1363 1166 841 -303 -1152 -1050 -1245 -1112 -1122 -1030 -1212 -1956 -2113 -2040 -2002 -1667 -984 -865 -1655 -1274 -988 -663 -182
1384 -182 252 837 718 685 1060 1245 1438 1909 2052 1871 1276 1755 1868 1610 1651 1678 909 653 274 219 -172
1405 -172 -92 -296 -766 -1392 -1613 -1643 -1617 -1439 -1264 -1503 -1892 -2173 -1988 -1389 -940 -382 -81 -249 -721 -370 -310
1426 -310 488 1068 1626 1637 1063 883 992 1190 1551 1894 2074 1415 604 426 515 370 858 999 522 -417 -966
1447 -966 -784 -901 -496 -412 -449 -972 -1158 -1865 -1966 -1506 -466 -371 -374 -803 -738 -1000 -777 27 572 495 725 550
1469 550 204 220 588 1069 1261 1381 1008 775 369 326 894 948 751 818 484 131 -176 268 236 -48 92 -177
1491 -177 -788 -912 -469 -270 -575 -1033 -742 -910 -1087 -602 -553 -699 -364 -769 -434 -690 -383 35 469 140
1511 140 296 357 173 392 705 1175 893 910 680 573 482 822 1112 1248 770 466 93 -134 -158 295 668
1532 668 232 -252 -855 -1308 -1228 -551 -632 -390 -757 -904 -1213 -1350 -979 -281 158 -190 -115 -492 -615 -641 142
1553 142 623 1092 1044 613 278 -317 561 575 1239 982 1122 219 -152 46 493 466 253 392 6 -635 -698
1574 -698 -482 -435 -20 -55 -279 -645 -967 -598 -717 -250 143 -194 -135 -396 -658 -120 102 171 221 621 -297 -25
1596 -25 25 154 187 817 645 87 38 274 428 47 272 280 109 -80 -106 136 38 164 172 -142 -467 -332 -171
1619 -171 126 -1 28 -243 -504 -400 -223 -284 -198 -47 10 -367 -747 -462 -48 165 469 271 11 -580 -583 -157
1641 -157 -127 248 477 335 -407 -46 53 98 141 831 753 495 -3 38 201 277 646 586 216 -80 -65 34 -94
1664 -94 26 469 -84 -226 -570 -850 -645 -469 48 96 -264 -525 -578 -639 -479 8 336 161 -61 54 -172
1685 -172 77 58 564 344 460 223 173 243 150 690 604 409 406 200 -133 126 397 414 -7 -186 -157 -397 -272
1708 -272 -155 217 -217 -571 -417 -675 -588 -179 159 131 -190 -335 -46 -443 -256 78 449 168 -3 -98 -246
1729 -246 -478 145 489 267 160 28 -63 -308 214 499 428 101 -159 105 -319 267 255 434 213 283 -6
1750 -6 -431 -342 41 13 195 61 142 -55 -246 -335 -165 100 13 72 -404 -502 -534 -70 -47 177 -62 -125 -307 -592
1774 -592 -7 130 265 1 301 182 -40 47 471 525 257 289 70 -86 65 221 306 123 283 267 -406 -399
1796 -399 -253 -25 -62 49 -611 -662 -832 -361 -177 -66 59 -152 -173 -533 -305 -281 -60 241 160 -208 -226 -57
1818 -57 235 476 531 535 144 157 -219 181 490 601 462 234 -41 -243 -97 -120 9 436 -63 77 -494 -643
1840 -643 -46 -243 131 -45 71 -226 -391 -105 -98 43 348 538 28 -326 -224 -83 139 265 310 293 -203
1861 -203 -94 -88 -228 124 201 409 97 -24 -138 14 1 48 317 319 -80 180 61 53 -53 255 170 -240 -209 -107
1885 -107 -247 -200 206 45 -211 -214 -245 -102 -187 -76 150 -17 -332 -141 -152 -235 -25 159 167 -96 -42 50 155 277
1909 277 365 679 73 61 60 90 600 695 588 396 76 200 -64 74 228 446 203 -86 -342 -551 -364 -161
1931 -161 -32 246 -124 -445 -581 -570 -295 79 79 42 -170 -173 -447 -153 66 565 524 238 -17 -29 -139 201 493
1954 493 603 55 254 242 -70 50 -14 159 357 -48 -89 -241 -232 20 323 280 -199 -263 -368 -459 -634 24 -189
1977 -189 108 -48 -207 -257 -97 -122 -148 197 56 192 -135 -191 255 91 178 187 34 61 6 122 306 159 179
2000 179 70 -260 38 -107 -31 106 111 20 -173 -262 15 85 91 377 43 86 -361 -56 86 -68 70 -114 -109 -411
2024 -411 -387 -54 -80 49 173 -73 -310 -167 -471 -29 -268 279 74 207 -417 -241 -16 338 387 344 372 299
2046 299 79 110 304 605 269 247 208 -191 -198 23 148 -4 101 0 -281 -487 -168 -134 -404 -214 39 -429
2068 -429 -694 -376 -177 -407 9 141 -139 -204 -82 -31 162 292 360 411 145 228 109 144 249 199 262 309 364
2091 364 -58 113 395 -72 158 276 11 -95 -98 -94 -151 -59 -83 -311 -455 -248 -244 -254 -62 -209 -190 -123 -204 -24
2115 -24 85 -60 95 80 -502 -148 34 136 117 117 245 259 -83 204 -44 423 248 467 305 -111 235 -18
2137 -18 60 266 378 156 196 -278 -33 -114 -110 -288 106 -323 -90 -380 -356 -96 -1 -50 -32 -248 -590 -454 -393 -55
2161 -55 70 -146 -234 -116 -111 188 289 181 397 552 434 149 411 339 605 447 660 288 398 158 275 344
2183 344 16 -69 243 -29 -391 -120 -412 -192 -347 -109 -464 -488 -404 -618 -279 -425 -577 -174 -420 -450 -348
2204 -348 81 351 137 164 401 371 158 364 323 438 323 315 466 299 320 497 565 149 157 -49 -342 48 -22
2227 -22 -141 -19 -53 -336 -377 -564 -443 -442 -48 -417 -644 -407 -567 -390 -157 210 -55 -110 -20 -18 -337 4 333
2250 333 214 241 85 255 371 299 509 278 368 492 386 139 9 219 -89 104 205 7 -91 -260 -72
2271 -72 -67 -193 -91 -378 -410 -432 -143 169 -153 -135 -28 -285 -134 -325 267 -216 -144 80 116 -50 197 124 211
2294 211 364 140 461 298 47 29 603 327 454 256 327 9 -82 315 563 105 285 200 -158 -208 -54 10
2316 10 -240 -432 -289 -443 -368 -305 -187 -126 -300 -392 -238 -290 66 -122 -39 278 285 -99 179 26 70 440 153
2339 153 451 482 121 131 259 363 245 409 399 152 121 65 87 -45 -143 -62 -363 -554 -497 -199 -230 -342 -168
2362 -168 -193 -285 -301 -517 -240 -81 47 106 78 -122 33 -166 223 95 293 94 391 129 171 127 4 471
2384 471 303 180 133 94 -38 79 7 -75 -219 78 -360 9 175 -172 -310 -315 -190 -297 -4 -451 70 -214
2406 -214 53 102 -317 -132 16 -51 88 300 117 -233 115 -43 204 221 304 -50 16 53 -366 152 83 436
2428 436 19 -11 -281 66 -123 8 218 12 -115 -72 -123 -128 -410 -144 -49 98 -157 -353 -274 243 -167 74
2450 74 161 106 231 -209 -398 188 139 20 159 227 3 202 -253 196 162 181 -38 30 -77 -178 -12 191 50
2473 50 181 40 152 -150 -156 29 180 -114 101 -82 104 -151 29 79 -44 89 280 -121 15 158 -73
2494 -73 -84 4 19 -171 63 -166 66 245 21 -45 249 -12 -53 66 203 -36 -27 -62 -111 163 146 76 343 -237
2518 -237 -115 -100 -217 -159 -157 97 83 66 96 5 -157 -127 309 423 -3 -62 -35 -122 255 -36 -13 -14 141 -193 54
2543 54 -379 -187 -64 -132 -162 136 -140 -207 -112 -267 33 -58 -359 28 72 -346 188 -84 76 230 168 65 25
2566 25 19 -35 193 128 175 16 39 74 -77 -20 115 104 116 -126 -39 -108 65 -90 125 -106 -288 -165 -137 -227 -481
2591 -481 -154 -236 -54 -213 -74 -42 -191 -266 207 -51 -341 198 34 -132 203 172 19 74 117 163 381 27
2613 27 210 183 121 116 -2 37 -88 -195 -169 -53 -222 -392 -96 87 48 -281 55 92 -342 -131 -434 43 159
2636 159 -303 9 180 170 180 -387 234 269 76 75 -13 364 136 165 177 -149 14 47 -124 -29 125 135 183 166
2660 166 -8 -67 -185 37 -11 43 -72 -159 130 -29 -80 -30 84 -75 -60 -142 -156 121 67 9 -68 -70 -120 -173 -81 92
2686 92 205 215 140 106 65 136 203 384 192 232 195 174 278 -122 220 -110 15 38 53 -27 -87 -140 -8 17 -175
2711 -175 -152 -277 -486 -327 -185 52 -69 -196 -291 -41 -133 -6 -25 -62 -71 9 207 202 129 294 202 184 176 122 167 171
2737 171 214 123 -54 147 314 -114 8 56 99 215 -109 -116 -134 -461 -444 -190 -95 -69 -297 -11 118 -96 202
2760 202 162 -83 -43 29 82 182 94 -91 181 306 71 145 337 159 45 45 -45 -83 113 141 11 183 190 -204
2784 -204 -115 113 -191 133 -17 -2 -8 -194 15 -188 -178 -98 -24 38 49 24 -118 197 76 -61 -168 225 -25
2807 -25 -233 -63 1 167 412 -33 101 168 -20 161 17 306 -97 230 126 -13 -274 -56 148 2 -179
2828 -179 -3 167 -161 -65 159 23 -40 103 -8 -144 -181 -156 -325 94 -116 185 0 -228 149 -185 -39
2849 -39 -186 307 129 -294 -170 235 118 -205 83 95 -75 -111 0 146 28 21 64 324 352 -71 -7 -111 -75
2872 -75 -85 81 256 -247 14 -134 154 -168 -19 -234 -200 -105 -29 -285 -37 -341 -205 -30 -1 76 241 55
2894 55 48 -185 -89 3 8 -7 107 158 -144 -97 7 219 -153 -41 74 77 168 51 27 101 32 296 157 -18 -51 -49
2920 -49 -271 12 -85 224 162 128 -265 -143 -211 -51 120 264 39 1 -115 -146 -276 49 164 95 124 -320 -35
2943 -35 146 -77 9 337 97 162 250 138 107 207 81 -58 220 146 -60 136 -99 149 224 276 57 -140 -161
2966 -161 -3 36 95 237 50 182 269 124 -163 105 -65 133 281 19 -44 -62 170 -194 -114 160 24 60
2988 60 -21 -33 -213 -154 69 50 132 261 79 174 79 -47 213 96 25 -288 87 88 212 17 -16 -171 45 -81
3012 -81 -3 -143 -329 -365 -56 -169 -78 -81 64 220 -89 -24 51 -233 154 247 42 82 185 -38 19 -51 301 13
3036 13 -13 -5 -147 -95 82 233 94 11 53 95 -4 32 -98 90 40 162 142 -156 -273 7 -48 -222 25 27 -198
3061 -198 -111 -353 -126 -73 -211 145 -31 30 -58 -35 -16 103 202 29 71 -193 71 16 86 201 206 56 128 -237
3085 -237 -72 39 62 147 -84 -41 -103 178 67 -216 44 -230 110 155 15 19 62 -343 80 -120 -69 98 -106
3108 -106 -79 -25 -1 -237 -130 -176 -41 -64 101 63 34 -211 237 27 356 385 -63 -9 329 -84 86 10 -302
3131 -302 -12 192 167 -93 -198 65 -21 205 -228 -46 -69 -108 192 -231 -251 -203 -75 -97 -93 -92 30 45 316 63
3155 63 67 132 -69 -32 -38 259 204 38 83 175 127 16 227 284 40 92 -171 241 200 -13 166 158 191 95 14 -18 -126
3182 -126 -146 -120 -227 -144 -139 -276 -131 -176 17 138 -47 -212 74 -244 -84 -88 -85 106 154 -8 -239 -50 74 365
3206 365 -130 2 -123 307 207 -235 -18 273 46 -202 179 -127 137 125 286 66 -42 -113 177 65 -94
3227 -94 -62 -134 100 -120 93 -252 -140 64 -42 211 -168 -311 -273 -222 52 127 -32 -184 167 22 139 -51
3249 -51 -46 210 108 31 187 90 -45 75 325 125 41 -25 -31 -311 64 -50 -155 -47 17 -188 -40 -48 172 -274
3273 -274 24 -65 -46 145 -143 232 -29 -61 -170 102 -63 -15 114 103 57 -83 -24 -13 129 122 -227 124 108 200
3297 200 -136 -82 124 148 -101 239 147 -103 -13 -19 -325 -48 238 122 136 -176 -47 27 -158 -203 94 257 -130
3320 -130 -46 112 -76 -73 -25 -162 -189 60 36 -15 113 28 147 118 -106 106 128 146 -29 12 52 52 -307 55 40
3345 40 119 -175 83 74 117 275 -46 282 232 200 353 73 167 -141 -30 -37 70 154 -204 2 -245 134 -77 -243
3369 -243 137 69 -130 -84 -71 -216 6 70 58 -251 31 55 68 280 -116 189 201 -136 175 97 119 174 -212 140
3393 140 -84 81 -254 -108 65 80 172 190 -212 -2 3 61 -3 -166 90 -53 44 216 -306 82 -46 -183 -159
3416 -159 68 38 -96 124 69 136 -106 207 -42 -92 -8 459 120 -32 0 -104 129 -60 77 -20 -39 151 -43
3439 -43 -167 -106 -135 89 23 37 55 -212 -166 -141 -74 -142 -13 106 -179 -58 145 -6 194 -131 206 -216 175
3462 175 -182 -141 187 72 -153 -281 81 -45 113 -36 25 -110 140 65 113 25 115 -93 -55 -306 98 -140
3484 -140 115 178 102 -248 330 -123 -100 -171 199 -37 -66 -269 -88 62 -160 85 -158 -7 -2 159 -174 156
3506 156 41 -135 -12 96 159 -69 -103 4 191 -85 176 -62 50 282 42 96 -143 376 47 65 -135
3527 -135 -299 -171 83 97 -81 -123 -110 128 -10 -117 -36 89 -39 152 -286 140 -37 -83 -22 137 67 -291
3549 -291 -155 38 111 135 326 204 -13 3 45 162 -66 245 -35 -17 -166 -333 -18 -178 33 1 -184 -44
3571 -44 -182 0 -113 -80 -11 -201 -242 92 -174 -231 131 -159 203 -43 -77 -197 65 46 -8 171 -110 12 -161
3594 -161 -147 -67 -38 113 92 -7 -54 169 68 33 20 -157 40 66 -83 25 -101 102 -137 8 351 -48 -123
3617 -123 -132 147 -7 -75 76 -40 155 127 24 -109 62 -80 44 -231 154 -155 -285 185 76 -103 284
3638 284 14 142 -75 6 154 135 -6 208 333 18 201 37 152 261 349 307 305 -6 -190 12 8 41 -247
3661 -247 -20 -123 12 -29 72 90 -330 77 -108 120 186 -60 -89 157 101 -22 299 -114 -53 108 112 -34 159
3684 159 118 25 115 164 -183 208 4 76 47 128 -52 117 -64 136 -88 -65 196 150 361 -28 -162 -112 -159 121
3708 121 -9 46 -150 -87 -19 20 89 110 6 -99 -218 218 -49 107 -239 -25 -135 134 82 -66 4 88 89 -358
3732 -358 23 8 220 42 -5 179 89 53 177 46 37 52 -14 108 -71 189 -65 135 -97 -7 136 208 54
3755 54 -97 -140 90 46 -13 -102 -214 335 131 42 -198 0 -40 -97 -21 -64 -109 22 21 275 153 254 165 24 -173
3780 -173 -63 35 -3 -215 -108 -198 -36 58 7 -33 88 -159 -45 -115 -192 -36 -55 -33 119 -229 -59 -2 100 -6
3804 -6 -62 -274 99 124 -180 214 41 182 -53 152 -32 12 -185 237 214 -279 -8 -1 -149 131 -187 -159 -35
3827 -35 -155 54 237 96 -16 405 -203 -61 -3 -162 15 54 -81 -53 110 28 129 4 57 4 18 99 -49
3850 -49 -98 -228 -32 56 -49 159 -309 -145 -55 -18 95 -30 37 120 -27 165 -125 99 14 -109 -17 -46 85
3873 85 -106 -86 -54 -18 -223 43 2 -58 -80 160 -196 -230 -69 -54 -44 -304 68 58 140 83 113 -143 -141 221 -117
3898 -117 52 101 -6 8 -90 -98 -66 125 107 48 -11 43 106 199 71 -203 90 131 34 -120 59 21 -45 -118 -33 21
3924 21 -255 27 70 -158 -255 -275 6 -118 -136 -31 -67 120 96 259 216 -109 277 56 86 -174 125 166 214 -109
3948 -109 -28 99 -204 -172 126 113 -39 -88 158 161 -55 64 125 232 -50 54 -26 13 108 -158 -25 241 -59
3971 -59 141 -110 -26 -41 -90 69 -58 168 -213 86 -76 -2 -28 214 -146 -199 155 -80 -16 44 -24 39 -106 -6
3995 -6 -232 36 115 196 -110 -37 -179 -172 41 137 67 180 -184 104 -189 -28 2 -102 -1 -93 133 -222 11 -205
4019 -205 84 200 179 -161 -131 -57 -35 94 236 -236 -186 -79 -193 102 -143 -50 -58 51 -353 -23 -123 -234 99
4042 99 83 108 236 -2 -26 62 -53 40 11 8 -234 -19 -54 -175 -167 -141 -159 -52 -176 56 148 -260 7 -23 53 29
4068 29 105 2 87 187 23 241 -88 64 146 -99 -87 -215 -82 -68 -160 -198 -47 47 108 20 40 5 -229 17
4092 17 -26 103 266 -150 -10 -193 -73 -40 33 74 11 66 151 -216 -182 365 46 -36 167 -23 -228 -154 9 -31
4116 -31 326 51 17 -370 178 -144 49 -89 78 159 -17 26 -66 36 -45 -20 -188 168 -24 29 -124 -22 174
4139 174 12 76 -144 -270 -33 193 -266 -45 -66 -162 142 140 73 -55 181 -89 197 132 -320 26 251 98
4161 98 -91 -15 80 2 -196 215 71 -126 37 60 126 -86 170 -251 102 159 37 -250 -178 21 47 44 37 262
4185 262 -36 -326 56 -236 -6 34 -37 204 -118 -14 164 -14 -71 -72 90 -245 80 71 108 -185 42 -56 -24
4208 -24 -106 -64 -126 -133 193 -164 -5 -253 -104 -156 -111 -178 -12 115 76 150 -58 -78 328 24 41 -218 -141 101 -83
4233 -83 157 -380 2 -20 135 53 -190 144 -77 -116 253 -58 206 -35 -15 -285 -47 22 -239 24 20 182 -111
4256 -111 -3 176 -55 -62 25 -6 32 -180 97 57 222 -99 15 -279 110 156 40 30 -39 -171 -33 -180 21
4279 21 -164 52 29 -44 -147 88 -98 -234 44 226 225 -169 17 -158 -70 115 104 189 234 -148 257 52 -4
4302 -4 204 -394 39 -284 187 -72 -201 27 -190 -83 -66 -101 117 214 -217 3 -184 -8 -150 1 -202 -204
4324 -204 94 183 -47 38 155 71 223 -79 -2 41 -67 -17 263 51 -237 257 169 157 -17 -45 -95 1 121 266
4348 266 -59 149 362 -30 171 34 -195 -319 -297 -166 -81 -97 80 162 -292 -58 -60 11 -267 86 -118 137
4370 137 -101 -43 174 54 104 182 84 43 35 132 26 346 1 -127 253 45 -102 -33 106 108 -217 117 -104 51
4394 51 218 -88 49 210 -54 35 -74 -164 41 67 -100 -118 374 -24 173 -148 -91 -33 153 2 245 88
4416 88 -199 -126 -20 83 127 -1 155 64 39 -56 -28 92 89 -148 50 -232 136 100 -92 26 54 -38 43 -139
4440 -139 -64 175 97 -125 54 142 -205 -168 -50 144 -215 277 -28 -35 -75 -291 -212 -64 126 265 64 -97 391
4463 391 103 250 -123 -68 -90 67 157 193 88 -64 -336 -56 -8 -55 -274 -126 -164 -204 203 -345 -128 -50 -105
4486 -105 -157 -103 -43 28 -26 243 -52 273 -246 -118 94 -1 125 33 -230 104 -24 -161 -83 49 -1 6 -37 -111
4510 -111 164 145 62 15 -311 35 -181 20 -26 255 -22 -430 -46 -52 139 -121 -105 -22 -168 50 4 51 -134
4533 -134 -129 63 -56 56 78 9 73 73 -156 94 99 372 49 65 128 -32 -260 -57 30 72 377 217 121 -9 -36
4558 -36 -107 -33 -171 -85 66 -35 8 -15 -114 -160 -38 54 59 74 20 -178 -29 -11 154 -43 -33 117 -80 -50 -48 -158
4584 -158 -3 57 -129 -190 271 -166 -94 54 89 -101 274 93 61 -111 96 -127 -1 337 109 106 118 85 -134
4607 -134 23 -90 103 -66 -58 -272 -67 156 14 148 -38 25 -155 88 -169 -37 23 -42 -166 177 -11 120
4629 120 -264 -151 -129 -6 292 69 -139 142 248 153 -50 77 194 -231 -56 37 261 -190 175 22 7
4650 7 -186 -193 -76 -36 41 94 4 59 -55 -211 -35 -202 39 5 17 57 -158 -48 -95 20 -66 74 -122 115 -142
4675 -142 -138 -42 4 136 343 -264 -330 -21 -82 -46 30 -282 -249 -87 273 -140 -50 112 -6 167 -93 32 28 -91
4699 -91 11 228 -128 -4 106 104 -34 -118 80 78 14 147 97 -135 28 26 -22 -185 69 18 -79 -24 159 -5 133
4724 133 17 3 369 18 70 28 -206 106 7 -202 -212 -151 -126 -205 107 28 25 -127 -147 10 13 -147 330 81 -91
4749 -91 -274 -102 81 -129 109 33 -58 121 -44 -26 -76 216 131 142 -142 -133 223 -147 46 -62 155 -44 -108
4772 -108 -69 73 109 154 -30 -77 94 -41 -71 -15 -105 -2 118 -119 67 -51 -92 146 -63 106 48 241 124
4795 124 -64 -5 -91 -73 -31 -146 -183 194 285 -65 76 242 -26 -78 -6 97 -111 386 159 -135 20 345 -283
4818 -283 -63 -47 -91 -69 76 10 175 65 -184 94 104 -39 112 75 -83 158 155 -87 -46 -70 67 19 -126 -41
4842 -41 -18 149 -383 -97 277 20 35 -66 207 117 -59 56 -142 167 -46 112 229 -61 279 133 -90
4863 -90 416 -258 58 -110 -202 -26 102 96 -19 -102 -12 -131 86 176 -400 -5 142 -21 33 216 -354 -43 102
4886 102 -76 -134 -22 265 43 43 56 112 230 -19 -79 -46 44 144 259 -151 15 139 -52 -2 -83 -109 191 83
4910 83 -34 -100 -118 -95 268 3 -24 4 -10 161 -63 -387 113 224 63 -67 -112 72 9 -160 40 -196 41
4933 41 127 -190 -99 50 106 40 4 -7 117 53 145 9 -65 194 103 -103 -154 26 125 83 -147 301 22 406 39
4958 39 164 -21 105 176 21 119 56 -6 -218 -85 104 189 -63 157 45 -57 183 -131 -1 309 -74 -109
4980 -109 -58 263 -27 4 93 -114 -49 48 132 128 33 133 -123 -203 224 136 212 6 -96 -39 280 136 -171 293
5004 293 -145 284 218 -190 321 -309 -160 225 -150 139 70 -14 7 -67 -258 119 -19 -58 -52 -41 123 68 96 141
5028 141 -144 42 -75 28 152 -8 -10 27 79 -121 -123 -48 20 100 -142 89 -84 -8 -168 -100 -15 80 -204 133
5052 133 -93 -168 -34 65 -35 -154 164 -200 66 21 -112 73 33 5 73 121 -221 169 -244 52 34 189 217
5075 217 -199 -65 1 142 237 -98 104 -110 116 124 16 -224 191 21 90 58 180 -58 156 -108 -174 -152 -85
5098 -85 44 -58 -116 -47 153 -359 65 220 160 186 -310 371 -186 206 -102 -82 -17 45 185 20 66 -26 27 214
5122 214 -154 -119 1 37 153 -153 -249 -90 141 -276 -120 -24 239 -224 5 -163 27 -70 -134 233 39 3
5144 3 127 -133 106 94 216 -48 179 -161 -68 25 4 -72 67 61 -68 161 186 137 -157 -117 -219 24 28 30 -64 4
5170 4 -65 -113 -146 -103 253 -4 114 38 49 22 122 -79 108 -166 -29 88 -130 30 209 201 -125 121 71 -21
5194 -21 160 382 53 14 325 111 -22 58 113 350 17 -133 -30 83 115 208 146 -184 -126 121 16 127 104
5217 104 265 -37 16 -35 92 -138 24 131 -42 -110 49 267 -213 -39 139 -57 -236 23 -92 46 135
5238 135 81 78 80 -28 64 -9 15 -211 -245 21 -69 37 89 70 183 50 -8 -187 227 -71 41 -80 30 5 -23
5263 -23 68 -89 -79 39 -7 14 215 -87 49 38 -88 -138 -35 99 -46 -46 -190 -126 -91 -50 -122 58 117 -84 -257
5288 -257 -47 -55 76 -327 -35 -162 176 93 71 -120 34 92 -217 -164 -16 -266 32 97 -36 36 131 -250 70
5311 70 112 26 249 102 38 -23 -232 -9 -192 -179 114 16 53 -72 174 268 74 39 -64 108 69 -199 87 -36
5335 -36 -118 -303 -19 -42 -183 -71 40 -41 83 -264 183 60 -166 28 -13 -52 -336 -17 -125 -228 21 -49
5357 -49 142 9 -98 -130 66 -2 -21 -22 -102 -102 -38 -72 -15 -62 378 -48 111 157 -4 118 -114 156 61 -21 77 57
5383 57 192 -18 35 118 345 -49 17 377 -62 -215 -276 -107 163 -166 -91 176 -186 -138 -150 94 -55 -111 -11
5406 -11 13 138 -70 -83 -142 86 0 98 93 -86 162 -18 -53 -106 130 2 -126 143 -100 22 -59 -24 -10 103
5430 103 157 79 -65 -131 -291 215 40 -52 -226 -20 101 1 -211 104 -366 122 41 56 72 -73 356 -79
5452 -79 -94 -226 -163 106 -74 122 207 221 -97 -11 123 145 86 -66 -1 132 43 -98 165 -161 139 -29 149
5475 149 114 -41 -23 43 -179 29 332 23 108 131 -64 -82 191 -139 37 86 54 8 -214 290 -46 -11 101
5498 101 81 188 62 -255 200 85 -31 122 -55 256 -143 63 154 38 207 186 40 221 145 242 -13 -250
5520 -250 -64 -151 -136 -243 61 -162 -8 -162 -305 -174 -145 91 -37 -22 -53 32 -127 -123 -40 109 138 -5 34 0
5544 0 39 34 -90 -38 -477 -58 -221 -10 62 279 -100 -50 109 200 -40 -108 -163 -45 58 -206 -50 69 -186 160
5568 160 -16 -99 148 -64 62 -63 -100 51 -232 -285 83 76 62 -51 43 -43 12 -177 182 -205 19 42 124 -190
5592 -190 29 -18 -52 18 6 -131 95 -194 -7 134 -75 -46 -192 82 -54 -98 -86 44 78 145 166 -176 -162 -236
5616 -236 -38 -143 217 131 107 -160 126 -50 -164 -273 -149 -116 16 41 188 309 131 13 -59 -6 -30 237
5638 237 -156 163 123 15 134 72 54 56 -158 -184 -13 -57 57 177 11 236 -98 -268 46 100 36 52 -14 184
5662 184 -125 -100 54 259 177 30 -22 -48 -138 11 -230 37 187 157 114 -311 184 -40 251 211 28 -23 233
5685 233 -62 169 -107 -202 166 -149 -253 31 -133 195 64 -90 -241 -237 101 -164 62 150 292 -72 98
5706 98 -132 187 115 186 -239 -112 24 -104 60 -111 -261 -44 -145 -233 66 163 -135 -26 165 -154 -91 51
5728 51 0 181 41 93 117 341 48 -429 154 114 225 328 -174 145 -355 128 167 34 -101 -59 16 63 31
5751 31 -201 -116 37 236 174 -161 -191 -372 -26 -72 -71 -174 87 213 156 -175 -340 188 43 -144 -89 3 -47 -363
5775 -363 47 -40 -183 68 19 78 71 272 -140 -98 -96 -177 146 56 -85 172 -60 -70 -102 20 6 71 88 194 51
5800 51 64 35 -200 -283 127 59 157 26 62 129 -18 384 -77 71 116 60 -177 75 129 124 111 -30 -6 -276 148
5825 148 -18 48 -46 -38 -154 109 50 -77 -231 -108 -118 255 -126 -25 41 -63 -30 178 39 -14 -75 -132 151 197
5849 197 60 -98 -206 63 51 192 205 -217 -17 76 -220 53 -9 198 280 -99 -144 59 -109 -91 46 134 -50
5872 -50 128 -7 -147 -116 -171 225 229 31 192 161 163 105 -91 95 -192 166 241 -298 139 -169 42 -17 -133 -72
5896 -72 87 -111 87 78 -102 -58 -5 98 -113 146 -73 -298 -59 -229 -38 -81 -79 77 -4 -24 -16 -407 18 115
5920 115 -177 -37 17 -120 106 -106 -34 15 -14 -168 119 159 36 -193 -198 340 308 72 -27 -44 -129 245 220 180
5944 180 18 -98 -97 3 43 -323 -42 13 248 -256 62 -41 69 -37 -213 -96 -94 -199 -119 -28 -50 189 134
5967 134 -125 16 6 137 -133 -2 176 -236 -167 -177 -9 -144 30 90 279 46 5 35 120 37 -93 171 -70
5990 -70 117 -131 -21 -168 -178 -100 151 -139 -141 246 -77 191 52 -38 213 174 -170 -34 93 -23 -206 10
6012 10 -94 138 143 -177 -75 -157 -129 -55 -99 128 -113 202 -101 -279 -141 9 244 56 -68 -91 118 -27 22
6035 22 158 62 -86 -115 -71 133 -210 -99 234 -148 20 42 -43 -164 -310 -81 22 -89 -96 52 -116 45 134
6058 134 -86 78 -283 -167 -117 165 26 328 76 34 -111 80 2 78 114 25 100 -146 -99 -24 147 -203 -46
6081 -46 90 -21 -34 54 -13 294 -156 192 158 -41 198 54 76 237 334 -173 42 71 116 211 -196 -41 -138 -57
6105 -57 -87 98 241 -312 -89 -114 -135 -44 -47 -123 -80 -256 51 161 -51 101 -20 202 24 52 21 -148 185 169
6129 169 47 203 230 -49 -16 -411 -266 94 28 -32 -17 -276 57 1 -122 22 -58 -35 25 224 -6 293 85
6152 85 89 138 47 -133 56 34 128 134 -91 88 93 291 -114 31 -29 10 -197 -82 179 210 126 363 119 -139 -186
6177 -186 -81 85 5 -28 72 25 -90 -26 49 39 39 -45 -32 -37 35 -99 195 -31 204 23 -242 -45 -57 -25 32
6202 32 -234 67 99 -129 -91 171 -92 -73 60 -95 31 15 18 6 -155 217 148 39 70 267 -162 19 29 -60
6226 -60 181 182 247 188 -162 -61 -169 -112 239 -66 130 -8 39 207 -64 -63 -251 -99 -131 -23 11 -33 -75 -147 -65
6251 -65 -325 -16 7 298 -221 202 66 98 -89 -152 -80 -104 86 94 -9 224 -178 -123 138 -209 161 194 -225
6274 -225 -293 -342 -102 -128 -250 -161 -112 -238 -22 -222 8 -96 -148 215 -77 -82 28 -74 -54 285 -94 -182 -316
6297 -316 80 54 26 133 209 -180 161 -71 76 25 -78 -58 -383 -43 9 166 -2 182 -120 63 119 -61
6319 -61 -65 -103 245 90 -63 -309 174 171 -149 -181 -254 124 55 184 42 200 -56 64 -88 44 24 -7 145 -141
6343 -141 97 -119 -71 -342 -168 -312 -85 -16 -149 -195 -16 -58 -42 -226 192 -29 -81 -149 -12 367 -205 165
6365 165 -33 -28 52 119 -27 257 -275 -112 12 -36 148 119 -32 106 4 -33 51 164 91 106 -57 -1 288 -41
6389 -41 -23 47 -88 253 95 34 14 -123 -182 -68 30 186 110 -312 -51 -147 14 50 -140 72 303 -83 240
6412 240 -32 45 277 118 168 -69 62 -141 31 67 -33 -125 -110 5 236 -38 -222 67 359 -222 -65 -229
6434 -229 102 76 232 25 -149 132 -85 95 -100 167 16 99 224 87 -122 215 55 288 22 -97 156
6455 156 89 -47 129 -197 -160 98 35 151 -188 198 91 -239 133 -56 328 181 -182 34 -78 -171 -51
6476 -51 -61 -54 -151 226 -5 167 -51 -100 -82 121 28 279 146 114 7 -183 -36 -339 9 -311 -5 45 -76
6499 -76 94 340 -209 -179 -61 93 66 -147 -150 -89 36 70 98 327 -137 -101 -82 -22 194 -39 -7 -24 -51 -5 131
6524 131 -260 -228 -307 15 121 -34 -253 67 -84 -56 18 -147 198 -212 -23 -170 -49 -8 -9 -60 49 109 118 325
6548 325 -104 -113 156 -154 -113 204 86 89 -148 114 -107 100 138 -1 194 -7 -211 -5 236 -158 107 42
6570 42 54 73 -31 -346 33 86 -2 39 98 -43 -115 256 -27 -301 12 -208 -11 74 171 -96 82 188 96 62
6594 62 -50 -222 23 344 168 129 225 -90 -76 -141 -53 130 -87 -169 -160 -85 -120 -185 -179 128 168 36 159 -117 -173
6619 -173 -5 -156 -151 -54 -109 -13 -136 63 -12 14 25 -23 -217 -229 -74 55 30 21 -15 10 -42 -91 216 -196 -256 -41
6645 -41 -227 175 -316 37 -134 -27 19 -164 -103 -227 18 27 -97 52 -126 -141 273 189 -48 -55 3 44 77 -132
6669 -132 215 212 38 262 45 35 -176 55 -12 166 -87 -82 26 33 -226 -59 50 -85 113 107 180 -210 -6 239
6693 239 111 117 49 198 13 5 -66 -63 -9 55 80 265 260 121 -19 84 -75 -223 111 -58 8 -103 -143 60 -179
6718 -179 199 6 -51 -113 32 97 81 105 -172 188 -142 154 84 -101 223 -53 76 37 125 -14 140 177 256
6741 256 -136 -52 -48 -172 -70 121 203 65 47 68 91 103 253 -141 -4 111 166 -84 58 -47 75 4 -222
6764 -222 -215 -196 187 -133 44 -195 -45 -95 135 -303 -108 -78 90 154 -159 -160 3 -90 -102 -63 24 118 194 115 -189
6789 -189 -49 112 50 -49 16 -317 -36 -25 69 -43 7 -31 -42 41 -21 109 -66 -25 84 28 112 -41 -147 138
6813 138 -122 152 -109 -104 -6 -117 -86 146 87 3 -16 -5 311 -74 243 118 -58 209 61 57 -66 -208 -124 201
6837 201 -68 -22 -100 131 90 48 174 445 228 -133 17 -87 119 -166 112 116 -481 111 -100 252 13 -13
6859 -13 -163 49 55 -52 141 -17 -197 49 196 -232 -134 -69 -359 -210 137 -102 118 135 -102 214 114 21
6881 21 -70 -68 266 2 79 -58 -1 58 -210 -169 -61 119 -129 16 181 235 71 -146 91 -200 -114 -35 -74 -227
6905 -227 2 140 -2 191 -34 56 93 -249 140 -66 -221 54 4 -314 52 141 313 224 167 152 30 153
6927 153 43 4 -337 -140 5 -406 -18 147 97 -80 -13 -261 49 27 -7 -117 62 -223 -95 237 221 55
6949 55 -178 -125 5 21 -47 143 -65 246 -215 -313 10 -121 56 -217 75 -86 -125 97 13 -117 58 69 144
6972 144 -13 104 259 -25 167 -28 44 257 -197 -99 -199 360 132 -179 194 21 250 65 -29 -88 18
6993 18 -225 222 -18 -37 168 -19 -50 28 37 -335 -303 -180 -120 -121 -156 -63 54 51 0 -85 90 366 68 -29 -18 204
7019 204 108 -110 -5 132 -41 -19 -183 -161 44 -9 61 101 35 39 102 -3 44 -68 37 -55 -12 127 -37 -4 37
7044 37 -86 62 78 -16 -75 33 62 -20 -62 -133 100 104 -103 -60 97 38 -241 -62 163 91 -16 -119 79 -30
7068 -30 78 -98 -57 -26 -204 141 143 91 -33 -25 -70 -231 17 228 14 285 -72 -101 -76 -16 -28 -336 -107 -18 102
7093 102 -213 58 -173 152 -228 97 -111 346 94 97 -37 52 -9 -233 -11 -355 37 -213 30 -24 213 70
7115 70 17 -111 14 -290 -190 13 148 20 -158 66 -164 106 158 23 41 -33 33 32 -170 -80 172 -102 -67
7138 -67 56 -93 216 110 28 -109 196 -139 -153 5 121 -128 221 55 164 -207 9 81 -12 99 59 102
7160 102 -8 -157 0 21 -16 -262 -82 -179 56 -14 5 -76 12 -30 125 -102 38 118 97 -11 181 10 239
7183 239 146 -183 -60 34 76 -117 310 -22 284 -121 -155 27 -228 -204 83 21 31 -70 -157 66 -38 -55 -161
7206 -161 -256 111 129 131 -100 -149 56 135 17 -61 102 -6 51 58 -64 201 87 30 -66 -116 169 94 9 300 -19
7231 -19 42 42 -4 -131 96 -401 127 -71 235 136 -134 -113 88 -75 7 74 -202 -141 -46 -11 85 10 -20 45 40 -110
7257 -110 -90 90 -156 -95 267 14 -171 -12 -38 -46 -276 -12 231 180 -13 27 -42 -130 173 -117 -364 -10 13
7280 13 139 -127 -169 180 -6 -256 -18 5 -66 -34 -94 -53 -186 132 0 33 157 -50 71 -72 -59 -113 94
7303 94 110 -26 113 196 -95 -4 127 -23 -190 -33 129 -219 -68 290 22 51 -101 24 -191 -125 111 -101
7325 -101 143 -79 184 -224 29 -54 106 120 159 -226 194 83 124 -91 163 -341 -128 -41 -252 -10 40 76
7347 76 72 131 -180 -20 -44 -123 197 178 234 -17 -28 -114 -113 32 -93 -1 133 96 143 -30 -125 150 -153 18 34 -113
7373 -113 -160 -112 28 -276 -116 168 69 -123 -110 -11 12 -127 -55 34 -24 -2 -182 -42 129 134 -76 129 -64 -21
7397 -21 -233 -166 140 -235 288 338 81 180 -15 -206 -94 -150 99 -249 77 -91 95 137 -91 -114 -286 -155
7419 -155 -76 -192 20 -70 -146 -79 -128 358 167 -103 -20 11 -117 -132 -65 -58 105 111 -33 163 99 -80 -70 110 30
7444 30 -265 53 141 250 -8 -6 74 -180 173 96 -54 -58 89 -160 24 79 -73 -53 49 147 175 -67 124 -17
7468 -17 -60 245 -228 35 -100 -52 44 -266 -216 12 468 89 163 73 61 -348 -7 67 1 9 269 192 -40 268
7492 268 134 7 25 78 26 293 31 -131 -164 143 212 29 -87 -141 -45 -204 44 85 53 96 66 -179 233 -23
7516 -23 281 -92 184 -68 -166 229 175 -94 -153 -109 -16 -11 -53 -9 130 346 -250 -26 31 98 -25 55 -257 -140
7540 -140 -243 -62 102 -25 45 221 -91 21 50 46 -73 -236 -98 146 -161 -69 7 198 -121 -145 -16 117
7562 117 32 190 -112 -113 -104 64 -87 -249 67 -46 10 -51 -34 37 -151 -330 20 -202 231 225 -20 -21 -44 -64 58
7587 58 -29 -115 -101 233 -124 -456 128 -208 -14 -124 -29 181 -61 -28 -11 -13 24 -50 44 40 -309 -1 34 12 -10 83
7613 83 -148 223 84 -24 -164 -121 -261 -149 21 50 -26 142 -257 -79 121 -2 335 -94 18 -28 -46 -307
7635 -307 -148 1 -10 290 256 -81 -60 102 72 -130 -22 120 4 46 127 51 -65 80 116 -167 -157 -41 -16
7658 -16 -159 -27 159 64 -64 276 -95 101 101 128 107 -82 13 -110 88 9 10 -67 9 167 67 76 143 1 -12
7683 -12 -12 112 -42 293 -323 84 -147 31 -58 83 -29 -72 192 6 43 -176 34 -110 182 38 27 20 -241
7706 -241 91 -53 -198 -204 217 76 292 139 -102 -67 -57 140 128 120 138 114 -79 14 -146 185 192 -61 97 -9
7730 -9 54 -60 -155 432 125 82 -6 19 106 199 -52 123 207 38 -231 -72 83 189 -9 -77 -120 118 121 -176 -86
7755 -86 42 8 -143 -201 -197 -347 126 -109 -150 -164 82 -55 -18 -170 227 -65 34 -78 268 -27 82 -110 147
7778 147 122 12 293 -64 -85 -282 194 -50 23 -40 163 -12 42 -189 92 -37 -174 -199 -5 60 107 -40 -226
7801 -226 -138 -258 -52 -123 -28 93 7 -130 -32 51 29 -226 -46 -107 -86 -144 -174 -117 -120 151 59 76 -120 -14 88
7826 88 123 273 -42 129 90 -9 22 -151 -8 -248 -172 59 -283 -136 -32 -59 -302 -32 -49 -161 -131 -41 -170
7849 -170 103 132 109 143 66 41 -183 229 -186 69 89 81 -85 172 101 -64 -1 119 133 -86 0 22 76 -62 -65
7874 -65 73 98 71 210 -112 -167 -139 72 108 116 57 -84 180 40 74 -95 137 79 54 -69 -214 -5 -92 -160 -134
7899 -134 87 164 70 -256 -85 85 -66 37 -86 12 -177 29 91 65 -13 -77 -8 -123 -81 -20 132 -53 -72 -15
7923 -15 8 14 -12 131 -174 -85 45 -145 -154 -2 -30 -125 291 -162 28 -113 -24 53 14 102 -88 230 -62 -15 82
7948 82 -35 -49 -54 -133 148 31 5 156 107 -128 -138 170 171 89 -96 6 -35 63 -51 98 -340 128 137 -254 -9
7973 -9 -83 52 22 -215 -68 261 -36 -106 -104 41 95 19 -32 -34 196 11 3 -113 65 88 -157 -268 82 -114 -226
7998 -226 -107 -11 -7 21 -19 92 -99 -87 134 -67 96 -278 -41 -36 -238 -47 -198 47 8 -202 -2 178 26
8021 26 103 -194 271 -99 -48 16 -49 -39 -93 180 176 -37 -190 78 -177 -244 156 79 64 87 292 58 -56 -157
8045 -157 -130 205 -35 228 71 -97 -25 -55 -121 174 307 -42 62 -103 231 -305 7 -85 171 167 -46 166
8067 166 -5 193 -192 119 -179 192 -35 -92 -141 -152 106 -17 -77 28 243 146 -135 -105 -141 95 247 185 65
8090 65 -241 -6 -137 -186 -53 153 100 -70 -174 -72 -52 45 257 182 53 -66 66 117 -19 -173 40 97 -167
8113 -167 76 52 1 -130 29 -76 111 33 -67 -132 35 3 -328 49 212 81 -18 -23 -99 -131 43 -111 134
8136 134 57 -1 111 125 120 7 -133 24 89 12 154 -4 193 -256 129 -234 116 120 -58 -176 -11 95 -34
8159 -34 -218 -62 89 107 73 -84 132 -282 -12 -141 -169 71 1 29 152 39 -2 113 -206 -303 -62 -44 -267
8182 -267 67 138 -95 -90 6 24 39 -38 40
8191D0
##END NTUPLES=NMR FID
##END=
