##TITLE=1H_SR81 ASP3
 CDCl3, 8 sc, 
 31.8.2021
##JCAMPDX= 6.0         $$ Bruker NMR JCAMP-DX V2.0
##DATA TYPE= NMR FID
##DATA CLASS= NTUPLES
##ORIGIN= UXNMR, Bruker Analytische Messtechnik GmbH
##OWNER= root
$$ XWIN-NMR		Version 3.5
$$ Tue Aug 31 13:16:28 2021 Russian Standard Time (UT+4h)  she@DPX200
##.OBSERVE FREQUENCY= 200.131506
##.OBSERVE NUCLEUS= ^1H
##.DELAY= (6, 6)
##.ACQUISITION MODE= SIMULTANEOUS
##.ACQUISITION SCHEME= undefined
##.AVERAGES= 8
##.DIGITISER RES= 18
##SPECTROMETER/DATA SYSTEM= spect
##.PULSE SEQUENCE= zg30
##.SOLVENT NAME= CDCl3
##.SHIFT REFERENCE= (INTERNAL, CDCl3, 0, 15.7039)
##AUDIT TRAIL= $$ (NUMBER, WHEN, WHO, WHERE, WHAT)
$$ ##TITLE= Audit trail, XWIN-NMR		Version 3.5
$$ ##JCAMPDX= 5.01
$$ ##ORIGIN= Bruker BioSpin GmbH
$$ ##OWNER= she
$$ F:/spectra/data/she/nmr/H-F/1/audita.txt
$$ ##AUDIT TRAIL=  $$ (NUMBER, WHEN, WHO, WHERE, WHAT)
(   1,<2021-08-31 13:15:20.07 +0400>,<she>,<DPX200>,
      <created by zg, POWCHK disabled, PULCHK disabled
       configuration hash MD5:
       00 E9 B6 7A A2 85 ED C7 34 08 36 98 17 FE 4E 26
       data hash MD5: 16K
       47 F1 E3 8F B9 2B B1 09 3E 43 6E AE A2 8C F7 5B>)
$$ ##END=
$$ 
$$ hash MD5
$$ 8F 6F EB 7D A2 DD C6 5C 6C 29 E1 EF 49 CC B1 58
##$RELAX= 
##$RELAX= 
##$RELAX= 
##$RELAX= 
##$RELAX= 
##$RELAX= 
$$ Bruker specific parameters
$$ --------------------------
##$DU= <F:/spectra>
##$EXPNO= 1
##$NAME= <H-F>
##$PROCNO= 1
##$TYPE= <nmr>
##$USER= <she>
##$AMP= (0..31)
100 100 100 100 100 100 100 100 100 100 100 100 100 100 100 100 100 100 
100 100 100 100 100 100 100 100 100 100 100 100 100 100 
##$AQSEQ= 0
##$AQ_mod= 1
##$AUNM= <au_zg>
##$AUTOPOS= <>
##$BF1= 200.13
##$BF2= 200.13
##$BF3= 200.13
##$BF4= 200.13
##$BF5= 200.13
##$BF6= 200.13
##$BF7= 200.13
##$BF8= 200.13
##$BYTORDA= 1
##$CFDGTYP= 0
##$CFRGTYP= 5
##$CHEMSTR= <none>
##$CNST= (0..31)
1 1 145 1 1 1 1 1 1 1 1 1 1 1 1 1 1 1 1 1 1 1 1 1 1 1 1 1 1 1 1 1 
##$CPDPRG= <>
##$CPDPRG1= <>
##$CPDPRG2= <>
##$CPDPRG3= <>
##$CPDPRG4= <mlev>
##$CPDPRG5= <mlev>
##$CPDPRG6= <mlev>
##$CPDPRG7= <mlev>
##$CPDPRG8= <mlev>
##$CPDPRGB= <>
##$CPDPRGT= <>
##$D= (0..31)
0 1.2 0 0 0 0 0 0 0 0.06 0 0.03 0 0 0 0 0.0002 0 0 0 0 0 0 0 0 0 0 0 0 
0 0 0 
##$DATE= 1630401319
##$DBL= (0..7)
120 120 120 120 120 120 120 120 
##$DBP= (0..7)
150 150 150 150 150 150 150 150 
##$DBP07= 0
##$DBPNAM0= <>
##$DBPNAM1= <>
##$DBPNAM2= <>
##$DBPNAM3= <>
##$DBPNAM4= <>
##$DBPNAM5= <>
##$DBPNAM6= <>
##$DBPNAM7= <>
##$DBPOAL= (0..7)
0.5 0.5 0.5 0.5 0.5 0.5 0.5 0.5 
##$DBPOFFS= (0..7)
0 0 0 0 0 0 0 0 
##$DE= 6
##$DECBNUC= <off>
##$DECIM= 32
##$DECNUC= <off>
##$DECSTAT= 4
##$DIGMOD= 1
##$DIGTYP= 9
##$DL= (0..7)
0 120 120 120 120 120 120 120 
##$DP= (0..7)
150 150 150 150 150 150 150 150 
##$DP07= 0
##$DPNAME0= <>
##$DPNAME1= <>
##$DPNAME2= <>
##$DPNAME3= <>
##$DPNAME4= <>
##$DPNAME5= <>
##$DPNAME6= <>
##$DPNAME7= <>
##$DPOAL= (0..7)
0.5 0.5 0.5 0.5 0.5 0.5 0.5 0.5 
##$DPOFFS= (0..7)
0 0 0 0 0 0 0 0 
##$DQDMODE= 0
##$DR= 18
##$DS= 0
##$DSLIST= <SSSSSSSSSSSSSSS>
$$ [...]
##$SUBNAM2= <"">
##$SUBNAM3= <"">
##$SUBNAM4= <"">
##$SUBNAM5= <"">
##$SUBNAM6= <"">
##$SUBNAM7= <"">
##$SUBNAM8= <"">
##$SUBNAM9= <"">
##$SW= 20.0188882624521
##$SWIBOX= (0..15)
0 0 2 0 0 0 0 0 0 0 0 0 0 0 0 0 
##$SW_h= 4006.41025641026
##$TD= 16384
##$TD0= 1
##$TE= 0
##$TE2= 300
##$TE3= 300
##$TEG= 300
##$TL= (0..7)
0 120 120 120 120 120 120 120 
##$TP= (0..7)
150 150 150 150 150 150 150 150 
##$TP07= 0
##$TPNAME0= <>
##$TPNAME1= <>
##$TPNAME2= <>
##$TPNAME3= <>
##$TPNAME4= <>
##$TPNAME5= <>
##$TPNAME6= <>
##$TPNAME7= <>
##$TPOAL= (0..7)
0.5 0.5 0.5 0.5 0.5 0.5 0.5 0.5 
##$TPOFFS= (0..7)
0 0 0 0 0 0 0 0 
##$TUNHIN= 0
##$TUNHOUT= 0
##$TUNXOUT= 0
##$USERA1= <user>
##$USERA2= <user>
##$USERA3= <user>
##$USERA4= <user>
##$USERA5= <user>
##$V9= 5
##$VALIST= <valist>
##$VCLIST= <CCCCCCCCCCCCCCC>
##$VD= 0
##$VDLIST= <DDDDDDDDDDDDDDD>
##$VPLIST= <PPPPPPPPPPPPPPP>
##$VTLIST= <TTTTTTTTTTTTTTT>
##$WBST= 1024
##$WBSW= 4
##$XGAIN= (0..3)
0 0 0 0 
##$XL= 0
##$YL= 0
##$YMAX_a= 200686
##$YMIN_a= -180983
##$ZGOPTNS= <>
##$ZL1= 120
##$ZL2= 120
##$ZL3= 120
##$ZL4= 120
##$ABSF1= 10
##$ABSF2= 0
##$ABSG= 5
##$ABSL= 3
##$ALPHA= 0
##$AQORDER= 0
##$ASSFAC= 0
##$ASSFACI= 0
##$ASSFACX= 0
##$ASSWID= 0
##$AUNMP= <proc_1d>
##$AZFE= 0.1
##$AZFW= 0.1
##$BCFW= 1
##$BC_mod= 2
##$BYTORDP= 1
##$COROFFS= 0
##$CY= 11.3945322036743
##$DATMOD= 1
##$DC= 2
##$DFILT= <>
##$DTYPP= 0
##$F1P= 2.36226072786647
##$F2P= -0.459571619588291
##$FCOR= 0.5
##$FTSIZE= 0
##$FT_mod= 4
##$GAMMA= 1
##$GB= 0.15
##$INTBC= 1
##$INTSCL= 1
##$ISEN= 128
##$LB= 0.24
##$LEV0= 0
##$LPBIN= 0
##$MAXI= 10000
##$MC2= 0
##$MEAN= 0
##$ME_mod= 0
##$MI= 1.114404
##$NCOEF= 0
##$NC_proc= 0
##$NLEV= 6
##$NOISF1= 3.799351
##$NOISF2= 2.8
##$NSP= 1
##$NTH_PI= 0
##$NZP= 0
##$OFFSET= 15.70392
##$PC= 1
##$PHC0= -13361.16
##$PHC1= 17.20098
##$PH_mod= 1
##$PKNL= yes
##$PPARMOD= 0
##$PSCAL= 0
##$PSIGN= 0
##$REVERSE= no
##$SF= 200.130013532006
##$SI= 16384
##$SIGF1= 3
##$SIGF2= 2
##$SINO= 400
##$SIOLD= 16384
##$SREGLST= <1H.CDCl3>
##$SSB= 0
##$STSI= 0
##$STSR= 0
##$SW_p= 3612.71676300578
##$SYMM= 0
##$S_DEV= 0
##$TDeff= 0
##$TDoff= 0
##$TI= <>
##$TILT= no
##$TM1= 0
##$TM2= 0
##$TOPLEV= 0
##$USERP1= <user>
##$USERP2= <user>
##$USERP3= <user>
##$USERP4= <user>
##$USERP5= <user>
##$WDW= 1
##$XDIM= 8192
##$YMAX_p= 0
##$YMIN_p= 0
$$ End of Bruker specific parameters
$$ ---------------------------------
##NTUPLES= NMR FID
##VAR_NAME=  TIME,          FID/REAL,        FID/IMAG
##SYMBOL=    X,             R,               I
##VAR_TYPE=  INDEPENDENT,   DEPENDENT,       DEPENDENT
##VAR_FORM=  AFFN,          ASDF,            ASDF
##VAR_DIM=   8192,          8192,            8192
##UNITS=     SECONDS,       ARBITRARY UNITS, ARBITRARY UNITS
##FACTOR=    0.0002496,     1,               1
##FIRST=     0,             0,               0
##LAST=      2.0444736,     0,               0
##MIN=       0,             -180983,         0
##MAX=       2.0444736,     200686,          0
$$ Real data points
##PAGE= N=1
##DATA TABLE= (X++(R..R)), XYDATA
0 0 0 0 0 0 0 0 0 0 0 0 0 0 -8 8 -8 8 -9 16 -16 24 -24 32 -39 41 -49 57 -69 80 -89 105 -121 137 -153 177
34 177 -200 224 -250 281 -313 351 -390 434 -480 533 -590 651 -719 792 -873 962 -1060 1167
52 1167 -1287 1419 -1569 1738 -1929 2150 -2406 2709 -3072 3519 -4083 4823 -5839 7325 -9721
67 -9721 14238 -25810 124678 200686 -3583 -27224 40352 133944 105077 58904 64153 123807
79 123807 97527 7932 -44778 16646 92999 96720 32026 11962 54748 81588 21473 -46339
91 -46339 -35250 35543 62888 26906 -6120 11784 26015 -18079 -84821 -79579 -2624 52386
103 52386 25021 -32132 -52168 -38820 -44690 -73991 -72195 -16909 26523 -1982 -68029 -93329
115 -93329 -68333 -48143 -64240 -81573 -59444 -23150 -28643 -73684 -101857 -90120 -72523 -78103
127 -78103 -88639 -69390 -31081 -24807 -67283 -112816 -114449 -83965 -62452 -59668 -53799 -39008 -42733
140 -42733 -80406 -117149 -107591 -63608 -35197 -41947 -57820 -58367 -54621 -66943 -84428 -78479 -48970
153 -48970 -28197 -35412 -49681 -48545 -38922 -42808 -59723 -66232 -45710 -17066 -9481 -22205 -31456
166 -31456 -32187 -37278 -46744 -44931 -20276 10015 16227 -5866 -27873 -29908 -21108 -14314 -6898 6018
180 6018 20198 20748 3839 -13252 -10880 3697 11597 10807 13876 24785 31368 23585 8725 4092
194 4092 12466 21625 25056 30459 41820 45984 34210 15896 8415 19272 37858 48652 49091 46420
208 46420 41547 31387 21283 21921 36223 52784 57199 47567 38439 37318 37671 34423 33729 39866 48318
223 48318 50644 45361 39979 38922 37869 32728 28885 32953 43203 50312 47363 36741 27710 23875
237 23875 23431 25435 32459 41518 44054 34940 20365 12063 14763 21395 24773 26726 27887 25570 17885
252 17885 9834 6606 8458 12389 13400 11842 11883 12518 9167 2507 -4057 -6225 -2517 1994 3078 3487
268 3487 2340 -3347 -13009 -19344 -16928 -9446 -2871 -2699 -7753 -14349 -19721 -23418 -23894 -18573 -13192 -11309
284 -11309 -14357 -20128 -24938 -25645 -24738 -25136 -24602 -21785 -19537 -19860 -23260 -26222 -27593 -28544 -29505 -28252 -23310
301 -23310 -18923 -19123 -23642 -28603 -31441 -30971 -26833 -22527 -18893 -17542 -20399 -25612 -29591 -28640 -23981 -19018
317 -19018 -16773 -17231 -17827 -18781 -21382 -22596 -20639 -17320 -14859 -13705 -12938 -12421 -12358 -14145 -16173 -15916 -13095
334 -13095 -8810 -5479 -4395 -5267 -7553 -9929 -11448 -9515 -4114 1278 2974 818 -2620 -4341 -4243 -2470
350 -2470 693 4042 6293 5911 3642 2458 2270 3163 4670 6823 7890 9557 11077 10054 8248 7259
366 7259 7726 8451 10264 12362 14742 15655 13713 10216 8653 10089 12508 15330 17684 17806 15871 13420
382 13420 11745 12071 14016 16443 18095 18046 16664 14938 14470 14226 13670 14311 16669 17121 16487 16557 15461 13856
400 13856 12811 12162 13061 14774 16567 16070 14945 12424 10128 9378 10340 12067 13410 14220 12305 9220
416 9220 6840 6580 7579 8340 9176 8943 8477 6742 4451 3478 3269 3461 3655 4021 3990 3216 1781 824 -664
435 -664 -2159 -2186 -1358 -119 -139 -1217 -3024 -5214 -6845 -7129 -5778 -4076 -3961 -5088 -6141 -8267 -10228
452 -10228 -9775 -9128 -8247 -8071 -8196 -9013 -9993 -11308 -12306 -11813 -10993 -11286 -11082 -10177 -10395 -11469 -12459 -12803 -13376
471 -13376 -12549 -11448 -10237 -10162 -10759 -11799 -12858 -13135 -12244 -10633 -9056 -8994 -9994 -10607 -11252 -10942 -10374 -8741
489 -8741 -7917 -7883 -7711 -7415 -7977 -8304 -8314 -6787 -6063 -5749 -5311 -4557 -4288 -4792 -5039 -4776 -3811 -3122 -2058 -1451
509 -1451 -905 -1418 -1957 -2306 -1826 -424 1068 1693 1726 834 933 987 1213 1849 2929 3899 3604 3409 3472 3230
529 3230 3470 3448 3810 4974 5292 5157 5728 5725 5179 4299 4958 5519 6131 6904 7008 6494 5875 5605 5203 5351 6425
550 6425 7226 7711 7585 6517 5743 6014 6209 5919 6591 7226 7020 6765 6372 5874 5379 5595 5824 6074 6194 5928
570 5928 6208 6114 5560 4665 4398 4962 5116 4950 5416 5147 4310 3653 3522 3946 3647 3716 3521 3452 3170 2492 2249
591 2249 2404 1681 1747 2078 1876 1699 1280 1312 724 496 -12 -120 101 -178 -814 -599 -869 -1884 -2243 -1928
611 -1928 -1778 -2105 -2093 -2289 -3027 -3216 -3589 -3499 -3256 -3420 -3936 -3679 -3837 -4692 -4715 -4779 -4483 -4873 -4413 -4664 -5009
632 -5009 -5078 -5329 -5370 -5664 -5559 -5515 -5333 -5058 -5146 -5340 -5172 -5504 -5788 -5293 -4454 -4643 -4538 -4813 -4642 -5108 -4738
653 -4738 -4492 -4249 -3758 -3894 -3342 -3187 -3341 -3776 -3183 -3150 -2923 -2119 -1398 -1469 -1342 -1530 -1367 -1556 -1456 -567 48
674 48 220 429 388 72 240 179 744 1779 2003 2046 2095 2027 2013 1595 2269 2272 3034 3422 3601 3620 3255 2954 2745
697 2745 3153 3476 3999 4130 4360 3886 3718 3480 3206 3288 3966 4299 4592 4281 3957 3544 3102 2900 3213 4130
717 4130 4257 3985 3331 3449 2978 2765 2853 2874 3384 3301 3046 2989 2025 1734 1750 2099 1999 2235 2566 2321 1699 892
739 892 738 750 920 1323 1834 1561 920 357 -193 -321 -186 167 713 928 128 -403 -862 -872 -1457 -1122 -621
760 -621 -134 -337 -584 -945 -1452 -2316 -2392 -1633 -1029 -1089 -1184 -1649 -2053 -2891 -3081 -2728 -2363 -1887 -1824 -1517 -2438 -3120
782 -3120 -3789 -3684 -3395 -2938 -2142 -2172 -2597 -3703 -4017 -3862 -4216 -4040 -3129 -2250 -2798 -3443 -3962 -4398 -4520 -4047
802 -4047 -3440 -3080 -2793 -3272 -3464 -3980 -4425 -4473 -3802 -3173 -2630 -2497 -2587 -3413 -3647 -4145 -3717 -2793 -2312 -1697 -1710
823 -1710 -1810 -2586 -3105 -2855 -2150 -1360 -978 -180 -538 -1050 -1350 -1739 -1222 -547 198 1085 1126 721 331 276 65
844 65 243 1572 2354 2523 2617 2367 2105 1298 1796 2405 3244 3798 4156 4020 3374 2881 2765 3018 3690 4554 5013
865 5013 5283 5027 4012 3581 3509 3996 4540 5373 5571 5467 4838 4416 3700 3753 4126 4797 5395 5487 4952 4267 3684
886 3684 3292 3303 4052 4695 4603 4339 4135 3489 2544 2203 2461 3130 3466 3601 3186 2670 1618 1082 1113 1274 2183
907 2183 1948 2113 1601 638 105 -197 -111 114 572 1076 709 -206 -1200 -1268 -1476 -1207 -926 -417 -226 -823 -1767
928 -1767 -2244 -2772 -2866 -2270 -1399 -1223 -1875 -1774 -2572 -3374 -3864 -3535 -2774 -2229 -2018 -2385 -2910 -3667 -4478 -4249
948 -4249 -3750 -3120 -2670 -2610 -2822 -3578 -4350 -4634 -4262 -3796 -3216 -2412 -2837 -3011 -3931 -4641 -4617 -3982 -3567 -2947 -2525
969 -2525 -3159 -3398 -3886 -3950 -4366 -3917 -2941 -2016 -2554 -2571 -3210 -3444 -3848 -3672 -2860 -2108 -2009 -1875 -1762 -3034 -3202
990 -3202 -3037 -2508 -2126 -989 -1042 -900 -1377 -1915 -2187 -1698 -1004 -726 72 326 -166 -702 -1019 -667 -343 114
1010 114 890 1462 1353 949 688 396 551 975 1936 2727 2750 2354 2231 2014 1641 1841 2888 3406 3618 3730
1030 3730 3329 3206 2796 2583 2733 3689 4352 4354 4594 4022 3594 3121 3449 3803 4387 4968 4950 4627 3917 3525 3308
1051 3308 3440 3920 4786 5026 4724 3843 3420 3202 2927 2839 3653 4190 4132 3563 3189 2655 1931 1933 2355 2892 3161
1072 3161 3085 2502 2075 1260 459 1070 1478 1354 2102 1749 1014 281 -290 -451 -222 169 345 549 190 -512
1092 -512 -1013 -1415 -1512 -1230 -655 -330 -300 -922 -1582 -2189 -2587 -2364 -1826 -1456 -1449 -1735 -2262 -2586 -3128 -2968 -2913 -2294
1114 -2294 -2052 -2330 -2428 -2749 -3386 -3506 -3558 -2976 -2638 -2108 -2376 -2430 -3220 -3746 -3601 -3378 -2969 -2174 -2053 -2409 -2933
1135 -2933 -3185 -3214 -3518 -3242 -2363 -1902 -2145 -2730 -2822 -2975 -3228 -3153 -2782 -2120 -1743 -1755 -2353 -2575 -2752 -2997 -2669
1156 -2669 -1870 -1422 -1540 -1664 -1891 -2287 -2390 -2340 -1663 -1154 -940 -586 -1066 -1152 -1671 -1761 -1352 -1085 -256 -85 160
1177 160 -322 -797 -829 -708 -761 83 593 816 779 381 101 -123 225 701 1343 1950 1612 1531 1568 966 1125 1321
1199 1321 1970 2133 2774 2696 2469 1977 1861 1961 2396 2725 3433 3626 3238 2809 2589 2229 2721 2743 3324 3690
1219 3690 3896 3393 3079 2906 2746 2717 3228 3856 4154 3703 3046 2795 2732 2447 2851 3167 3572 3565 2773 2669 2006
1240 2006 1876 1884 2265 2623 2805 2759 2356 1599 1278 1133 1541 1663 1608 1979 1687 969 413 239 229 26 249
1261 249 746 808 245 -166 -684 -519 -786 -849 -659 -154 -220 -856 -1138 -1494 -1731 -1799 -1160 -1118 -938 -1346 -1629 -2041
1283 -2041 -2314 -2527 -1916 -1672 -1521 -1539 -1696 -2077 -2524 -2793 -2825 -2311 -2102 -1723 -1624 -1990 -2579 -2933 -2677 -2767 -2422
1304 -2422 -2021 -1792 -1732 -2173 -2592 -2821 -2758 -2346 -1960 -1498 -1762 -2124 -2316 -2593 -2473 -2339 -1672 -1380 -1390 -1470 -1489
1325 -1489 -2003 -1963 -2402 -1826 -1536 -1020 -850 -1122 -1196 -1549 -1831 -1641 -1319 -731 -646 -513 -735 -1047 -1544 -1314 -927
1346 -927 -805 -282 -5 11 -212 -947 -977 -882 -645 198 416 350 281 104 -48 -347 -66 205 764 805 748 778 617
1369 617 397 126 443 783 1148 1394 1529 1199 1194 675 1288 1355 1711 1893 1932 2241 1668 1311 1591 1640 1724 2086
1391 2086 2552 2142 1964 1905 1669 1998 2099 2279 2627 2510 2567 2224 2166 1939 1637 2013 2423 2503 2346 2328 2107
1412 2107 1618 1288 1339 1862 2280 2031 2020 1784 1185 946 840 1073 1396 1442 1596 1361 917 625 396 450 561
1433 561 451 906 804 489 121 -31 -359 -428 81 427 92 107 -359 -668 -735 -1061 -1117 -530 -117 -729 -366
1454 -366 -697 -1096 -1397 -1436 -1230 -1136 -473 -671 -1013 -1308 -1474 -1540 -1709 -1260 -1028 -986 -905 -1189 -1422 -1620 -1733 -1694
1476 -1694 -1231 -689 -938 -918 -1417 -1336 -1490 -1496 -1428 -924 -635 -596 -965 -1347 -1007 -1524 -1247 -933 -383 -652 -524 -814
1498 -814 -797 -1381 -1473 -1022 -537 -496 -336 -497 -577 -1112 -1005 -1183 -601 -505 -351 -391 -501 -718 -1008 -702 -711 -448 -275
1521 -275 70 -237 -548 -456 -702 -681 -345 -190 16 246 -214 -339 -282 -692 -225 -214 279 626 364 177 -138
1542 -138 -303 -421 -212 94 530 672 579 327 -143 -200 77 67 615 603 970 775 596 464 275 386 612
1563 612 918 1246 1021 730 688 566 327 788 1216 1107 1262 1281 990 936 820 452 874 1241 1359 1197 1384
1584 1384 910 703 771 673 948 1031 1456 1260 1168 754 415 455 791 578 839 1030 761 698 368 3 177 411
1606 411 560 687 772 371 -168 -227 -95 -259 -19 325 247 269 -87 -10 -573 -586 -483 -167 99 116 -120 -319
1628 -319 -826 -896 -879 -546 -183 -152 -13 -390 -563 -1021 -959 -633 -474 -424 -212 -493 -336 -824 -891 -874 -705 -640 -255
1651 -255 -232 -408 -592 -893 -820 -541 -583 -281 -45 -247 -324 -546 -555 -598 -473 -209 123 121 43 17 -130 -599 -388 -516
1675 -516 65 184 -122 148 -231 -215 -500 -504 35 -137 89 379 37 -149 -328 -100 -391 -223 382 453 125
1696 125 45 -322 -389 -384 -199 -115 260 223 -63 -110 -362 -217 -94 -7 143 428 13 -9 -396 -162 -592 -306 -41
1719 -41 159 288 107 -111 -328 -327 -104 -284 154 178 365 304 -109 -15 -294 50 63 347 588 608 277 235 107
1742 107 82 40 288 529 783 492 363 40 54 56 348 338 765 501 477 458 6 112 226 303 774 916 496
1765 496 487 277 -99 263 441 517 707 824 353 295 137 32 140 -16 143 525 508 286 144 -119 -176 -275
1787 -275 -134 178 288 194 -33 -289 -623 -715 -702 -44 -41 -78 -88 -221 -534 -583 -754 -366 -261 -144 -78 -233 -690
1810 -690 -592 -870 -897 -539 -401 -162 -182 -357 -717 -426 -563 -707 -455 -32 -113 -126 -510 -767 -732 -701 -606 -269 -68
1833 -68 95 -271 -291 -514 -569 -260 -232 -315 425 208 91 100 -457 -406 -174 157 268 479 474 237 -32 -225 89
1856 89 349 391 400 -12 299 -15 -77 -129 -126 262 481 648 354 132 -81 -99 33 109 77 625 328 194 181 -213
1880 -213 45 -141 153 112 301 205 145 -129 -110 -275 195 -243 114 182 199 123 -111 -273 44 -185 -225 334 345
1903 345 316 -164 51 -79 -181 -82 261 230 85 1 217 -21 -375 36 221 447 557 141 197 -174 -54 -102
1925 -102 387 197 99 470 576 197 -81 19 12 394 263 802 501 14 303 108 -8 162 111 534 668
1946 668 428 346 -55 -162 84 61 139 285 377 334 -191 -23 -77 -244 77 295 187 183 50 -112 -316 -736 -72
1969 -72 152 36 -57 -389 -15 -302 -329 -580 -443 -348 -60 -89 80 -510 -408 -524 -654 -511 -596 -396 -79 -392
1991 -392 -682 -503 -696 -568 -292 -283 -296 -378 -511 -569 -816 -767 -396 -122 -238 69 -675 -443 -474 -442 -263 -163 -148
2014 -148 -4 -33 -75 -363 -451 -124 -38 -98 230 18 -63 -106 -216 -44 -114 -12 190 575 449 245 444 -23 -75
2037 -75 198 397 433 347 603 292 331 -66 227 200 49 387 390 332 173 220 187 110 259 504 400 312 431 241
2061 241 -12 259 132 187 261 591 219 198 -14 -104 -152 -128 73 450 401 272 109 -57 -160 -419 -220 356
2083 356 179 64 158 181 -101 -350 -281 179 403 217 284 62 -99 -395 -154 104 238 158 274 85 218 -205
2105 -205 -295 -136 24 160 385 263 -127 5 -109 -295 -76 -291 480 314 347 65 -18 -246 -158 50 247
2126 247 113 313 21 -45 -125 -111 149 28 -181 -22 157 -209 -220 -460 -334 -367 35 -182 -44 61 -319 -789
2148 -789 -496 -492 -319 -301 -288 167 -395 -551 -808 -584 -413 -562 -281 -629 -455 -356 -403 -618 -709 -697 -559 -322 -533
2171 -533 -329 -570 -626 -835 -969 -418 -390 -205 -479 -303 -313 -391 -736 -360 -249 -455 -57 122 -378 -453 -352 -347
2193 -347 -158 42 -134 99 292 132 -168 -245 -162 139 318 178 418 380 34 27 62 396 551 499 276 334 567
2216 567 292 502 477 306 452 727 684 576 472 243 300 544 340 589 781 613 562 269 533 166 284
2237 284 421 677 439 556 592 277 222 302 268 182 717 577 250 171 297 181 258 170 475 536 153 367 -100
2260 -100 -26 52 19 497 293 9 198 286 158 -1 -364 45 115 72 6 117 -10 -60 -5 129 -89 393 85
2283 85 87 24 87 -126 -57 125 86 413 -107 292 334 -18 -242 -200 46 181 159 11 179 -161 -405 -181 -183 -248
2307 -248 -117 -187 -49 -318 -253 -416 -366 -252 -383 -177 -135 -127 -327 -405 -350 -624 -415 -644 -154 -197 -325 -706 -358
2330 -358 -576 -702 -484 -524 -267 -379 -643 -294 -955 -566 -602 -625 -226 -647 -524 -547 -754 -592 -571 -738 -585 -692
2352 -692 -346 -529 -482 -794 -791 -712 -488 -605 -375 -328 -711 -455 -313 -566 -436 -315 -98 50 -57 -409 -153 -304
2374 -304 -177 -212 42 52 358 -32 -94 -111 132 29 209 406 283 8 209 417 281 437 27 299 502
2395 502 657 639 516 226 244 796 649 471 566 787 311 329 464 165 498 521 510 764 557 110 638 280
2417 280 339 334 488 576 657 565 465 427 43 566 136 660 665 283 226 292 273 -148 210 145 265 263 359 267 -29 -18
2443 -18 28 -14 -208 209 271 259 45 -174 -189 60 138 96 207 321 292 156 -23 -20 -348 107 90 135 40 164 -64
2468 -64 16 33 -78 6 -54 323 79 13 -38 -79 -118 105 29 60 158 193 -113 -78 -36 -238 -362 157 -178 -165 -208 -381
2494 -381 -329 -436 -335 -353 -461 -193 -48 -435 -405 -140 -480 -345 -263 -269 -97 -208 -307 -508 -343 -373 -237 -512 -346
2517 -346 -361 -444 -353 -416 -484 -488 -614 -291 -336 -401 -504 -688 -409 -488 -520 -136 -301 -131 -265 -452 -458 -146 -419 -305
2541 -305 -239 -119 -200 -534 -277 -112 -293 -107 75 159 93 73 -90 -62 -279 5 102 73 178 -2 142 114 -43
2564 -43 -65 268 276 284 387 482 323 166 380 275 472 492 510 307 450 338 489 484 444 445 794 552 479 915 255
2589 255 162 215 430 225 486 399 652 418 270 94 150 290 312 553 282 348 193 102 147 371 80 261 269
2612 269 115 183 122 39 -48 -45 -28 126 71 228 90 -262 -8 -127 118 93 -92 81 -49 -142 -283 5 -53 -209
2636 -209 187 192 129 -34 67 -36 -96 20 -4 233 -204 37 -231 -65 -117 58 -69 114 -86 188 -12 -47
2658 -47 -282 74 -306 -39 -126 63 -170 -412 -89 -94 -287 -253 -112 -22 -17 -316 -182 12 -474 -291 -84 -182 -339
2681 -339 -204 -233 -538 -548 -374 -327 -285 -113 110 -122 -353 -249 -501 -375 -284 -69 -492 -394 -329 -242 -336 -315 -397 -201
2705 -201 4 -75 -101 -382 -122 -347 -395 -226 -302 -326 -29 -110 -249 -163 -384 -213 -382 -137 -176 136 210 -107 159
2728 159 52 277 250 -104 -115 63 146 57 91 -77 33 288 99 309 311 192 16 135 653 427 -35 558
2750 558 216 -58 441 259 85 140 364 348 323 336 529 371 316 131 350 297 541 810 227 222 309 260 121
2773 121 188 193 407 274 26 215 59 96 311 419 217 199 314 63 157 -48 141 -132 267 444 295 39
2795 39 220 -33 -98 -18 -231 100 181 -157 106 23 -146 -345 -32 -49 -38 166 -369 155 -73 52 -166 -298
2817 -298 -2 49 63 190 10 -428 -313 -53 -32 -107 -121 237 158 -268 -301 17 -213 -205 -37 131 -202 -37 -388
2840 -388 -188 -190 -182 -48 116 -222 -117 247 26 44 59 15 -36 67 -48 100 -148 -1 -155 -230 60 -104 165
2863 165 -53 -17 -144 -356 -336 -132 126 -56 -252 -148 -283 -86 -66 -348 -64 -164 -70 -264 -52 -240 -144 168
2885 168 -268 -400 5 -44 -155 94 -231 29 -317 -97 64 -46 -103 -34 -151 -138 -294 -354 82 170 122 -9
2907 -9 -103 -39 -49 -147 -9 -42 0 112 220 149 10 38 201 -27 484 121 522 215 -92 240 149 -37 223 413
2931 413 310 116 225 -41 121 100 153 165 347 235 27 303 95 142 150 -175 506 405 138 151 156 -76 -73 200
2955 200 331 67 469 -97 103 -5 -217 -39 37 5 -67 68 27 203 48 187 -137 192 -16 64 171 4
2977 4 -261 -225 -255 -208 33 -30 0 -139 -332 -222 -119 -314 -15 -28 -180 -149 11 -83 -281 -259 -272 60 -49 27
3001 27 -73 -216 -107 -357 3 -324 161 80 0 -23 -459 95 -180 52 -43 105 199 179 10 -149 -22 -124
3023 -124 -47 -8 47 -144 376 6 112 -34 -110 254 19 36 -17 199 4 -139 -201 -33 225 161 179 138 45 95
3047 95 -65 -225 5 -15 47 -89 40 -190 -435 16 92 -85 -213 -215 308 -139 27 -130 -277 -128 -185 14
3069 14 -23 -298 -238 85 234 -212 -216 23 -187 109 -47 267 -162 -123 -36 -30 -126 -90 12 -3 61 22 125 -81 186
3094 186 242 198 129 200 366 8 90 -8 -224 20 175 46 -42 172 91 124 -379 69 -142 74 -33 119 4
3117 4 57 118 280 207 298 268 70 33 -6 176 -113 28 88 59 109 112 84 -44 43 169 59 -39 159 17 33 29 -130
3144 -130 -24 -184 26 107 -16 138 -170 -158 -185 -453 -238 -225 20 16 52 -267 -324 46 104 -253 77 -327 157
3167 157 -138 -177 -250 -346 -279 -25 -52 256 180 -191 19 -216 51 53 142 -101 109 185 172 -140 -152 -31 44 153
3191 153 61 118 -81 -254 -86 90 72 284 61 182 345 171 -163 97 90 10 128 73 259 211 241 42 -85
3214 -85 -286 -1 195 180 -155 165 -106 39 36 -23 11 125 453 232 -155 -176 -24 -146 33 134 8 -215
3236 -215 -189 -111 -162 -252 -203 174 -182 300 -90 9 -115 -212 -143 -13 135 11 146 -94 -44 -180 90 18 -82
3259 -82 131 105 50 218 -119 149 -85 -216 -191 165 148 -82 35 198 30 -116 54 9 52 339 254 -117 286
3282 286 83 239 201 262 66 110 109 140 0 -252 12 -187 -146 -16 60 90 -197 -69 -260 -223 86 392 122
3305 122 54 -146 -64 172 -48 -139 193 18 33 96 -158 -69 -213 -103 -57 138 101 -24 138 -262 -198 -174 -209 0
3329 0 -125 -311 -216 -309 -167 -72 -118 -127 -323 -164 -522 152 -52 -168 -92 -226 -53 120 -291 -261 -197 -298 -253 -86
3353 -86 55 -123 -233 -116 5 202 -86 -389 -86 -81 211 -57 162 128 65 -212 -38 -1 -158 173 140 374
3375 374 36 -126 -30 200 -47 30 -6 106 168 142 -111 127 89 166 72 48 -90 8 112 25 156 32 267 54
3399 54 102 88 255 -49 272 -115 -2 154 66 57 48 429 -83 112 208 59 14 147 29 -32 -248 97 73 163
3423 163 11 -75 -82 11 -53 -32 -94 115 28 96 331 37 -86 -46 81 -241 -61 1 268 90 -81 76 -56 19
3447 19 -46 -8 -9 56 -191 169 -279 50 -168 -136 350 -19 -92 -182 334 -20 -44 -173 -102 119 -36 279 213 331
3471 331 -135 -337 -95 205 -38 119 190 -30 43 -15 -36 61 -135 51 -51 -242 72 217 -223 -53 -65 -9
3493 -9 -47 -261 -186 -105 -121 -235 -123 47 -388 -197 -134 -129 -120 -74 -123 -161 -41 -104 127 -56 -304 -6 29 8 29 -121
3519 -121 86 -163 -272 -27 112 -214 -188 -74 -57 -14 1 -122 -154 -235 -274 22 0 49 -230 -150 -198 -234 -61 -327
3543 -327 -66 120 -194 -309 -108 -2 -263 -172 239 151 -152 157 131 -9 -101 105 -105 181 169 242 314 154
3565 154 -134 91 171 189 195 54 180 326 87 204 204 -43 36 13 323 104 56 -17 -14 103 -171 -36 -72 13 349
3590 349 -91 -164 -3 89 143 56 -67 209 171 35 3 -151 91 -192 -180 156 10 70 139 -76 52 123 -438
3613 -438 60 -224 -13 127 -47 93 -12 -175 -57 47 130 204 128 -17 -349 -22 -126 -75 -78 88 -157 160
3635 160 -138 114 268 244 38 77 -126 -68 -86 -170 -66 126 67 -229 2 -193 346 -16 25 124 -76 89 -111
3658 -111 368 146 -29 -7 -8 -4 -225 11 -102 -162 47 -10 -2 67 185 -176 -99 -80 5 -169 47 -294 1 95 150
3683 150 204 -68 -201 -129 -120 -39 -259 -335 -189 97 8 -165 -96 29 -1 -37 -54 -178 -388 -146 103 -149 -128 -159
3707 -159 -212 40 -83 -141 138 78 -219 -68 -24 -206 91 -32 -91 8 8 -6 -261 -252 95 152 433 36 -58 -146 -99
3732 -99 131 123 -71 246 119 320 -45 222 -111 -39 190 260 94 -167 93 -155 25 5 279 205 131 262 17
3755 17 -18 18 41 182 39 169 248 303 135 101 151 45 304 65 70 223 87 227 176 -56 -45 48 75 -96 -100
3780 -100 -141 176 -125 -182 -90 311 -150 42 -211 -99 68 -236 -120 -166 -174 -160 -239 -128 142 -43 -156 -211 56
3803 56 8 164 -27 215 96 -67 -190 -5 41 470 38 -37 84 -53 -107 -272 -151 -333 -70 137 34 226
3825 226 278 -75 -102 83 -39 183 -30 -154 138 -217 161 33 -138 176 59 -114 -116 -5 -261 24 -32 -157
3847 -157 -199 11 -81 -44 88 -93 -453 -116 -128 153 128 126 301 -28 -269 86 74 -13 -139 -276 126 78 204
3870 204 -17 196 -193 60 -56 -25 -71 -125 -263 -105 -69 -224 -30 -24 -115 22 -238 -46 -28 -29 -173 109 -62
3893 -62 -156 77 -60 50 -354 -86 -38 -254 126 -93 71 193 20 -61 20 81 -52 121 80 74 -196 246 426
3916 426 67 211 -134 -50 37 94 -189 231 -54 -53 -144 -70 -19 217 32 190 337 1 -121 148 188 12 -183
3939 -183 -61 36 -37 104 93 105 189 -125 23 -6 -82 121 -73 -155 -26 183 -201 -97 120 61 -97 -128 107
3962 107 -156 -238 -8 -147 -90 -244 391 -113 -61 -100 -25 66 -5 179 30 37 205 140 67 -43 -290 -131 81 1
3986 1 89 -53 -95 24 152 196 86 97 134 -191 -264 126 -50 96 -58 149 50 160 -161 85 9 -124 -453
4009 -453 -38 -75 -160 -122 241 32 -215 185 -85 -98 250 130 124 -82 -23 82 -56 27 200 0 18 61 -10 225
4033 225 -57 -15 -252 -2 130 343 -21 122 82 -21 -62 -35 144 231 5 -291 -11 -33 -222 11 80 -35
4055 -35 -204 -148 0 134 7 -63 -123 -19 -243 48 123 178 -153 132 -43 -12 -410 -96 -94 114 110 -247 -206 124
4079 124 319 296 -15 -106 -35 44 55 66 132 67 -46 151 -224 118 -152 106 -196 -148 -1 -11 16 -28 152 -43
4103 -43 143 134 -177 -328 -40 -36 158 -126 -60 187 195 -150 -118 171 -139 165 -124 -54 11 92 46 -91 -102 -56 55
4128 55 206 -151 121 172 -229 120 -120 -130 -118 -10 -249 -127 39 102 132 94 -12 -22 -52 245 183 -19 -158
4151 -158 25 137 -20 -149 -72 61 -275 -247 -82 -32 47 -116 34 -56 -215 185 -137 88 -81 -149 72 -3
4173 -3 -44 -2 -130 -69 52 7 50 69 169 116 138 -25 62 267 258 159 140 238 65 124 -6 148 -162 69 77 -72
4199 -72 87 -143 -154 32 -176 108 303 -63 -41 -65 -147 -67 158 -4 61 29 -197 -8 149 95 -112 0 -303
4222 -303 -82 -19 -66 95 5 191 -33 19 26 45 43 -169 -173 120 35 -61 -138 -70 96 116 -125 -189 205 -105 40 126
4248 126 -117 97 -26 133 -2 93 -15 22 124 -21 104 -250 291 124 -1 -205 168 -158 127 67 55
4269 55 -45 -334 113 105 139 169 204 -106 101 18 332 5 277 10 211 -138 -48 37 163 120 -78 105 34 88
4293 88 64 -49 -27 -159 69 51 98 18 -93 63 -146 -245 -38 135 31 141 -101 115 140 248 -154 13 -207
4316 -207 -187 -161 -136 -39 -103 -2 -298 -52 -42 -5 130 -166 -39 -145 140 -26 -58 -39 -183 96 -115 351 -86
4339 -86 -99 16 -24 -43 64 -87 124 -365 148 -199 -37 -258 -162 -30 48 -102 107 52 137 90 -37 -170 203
4362 203 -76 -36 148 -116 142 211 140 123 -110 174 14 269 47 28 57 130 -269 -3 -34 58 -98 259 299
4385 299 -89 -163 -21 -97 -171 170 -30 174 31 177 55 -7 -153 -138 -220 44 103 -158 -109 13 47 28 -109
4408 -109 -157 -77 -102 42 76 190 172 -7 -25 -11 -19 -83 -230 -43 99 -20 -84 -47 88 -14 64 37 -161 -232 -152
4433 -152 86 134 74 -16 -76 -126 123 197 -85 -200 -67 -16 -355 229 75 224 182 77 345 46 135 70 110 82
4457 82 41 209 -352 334 -115 -118 -214 85 -8 -11 -232 73 30 30 100 -51 247 -1 78 -100 177 105 132 11 20 146
4483 146 71 107 142 -65 91 -238 -15 105 174 4 -53 37 -249 70 -37 -6 -27 224 -255 -60 -201 -31 187
4506 187 -39 -90 -84 -228 -566 7 -260 34 166 38 -176 157 3 -9 14 -181 -162 384 283 135 -103 112
4528 112 -68 40 -64 -228 -11 -236 55 211 130 47 146 105 -114 55 -47 -90 -162 -34 -36 -254 -105 -190 159
4551 159 171 58 47 -78 365 40 117 141 -115 -92 -113 156 -5 -39 233 42 27 310 -57 26 67 -30 79 86
4575 86 318 -163 147 -49 -4 152 -177 -8 35 -53 97 232 -45 -104 13 -12 85 -53 -109 150 398 -162 65
4598 65 130 27 -113 -227 69 11 -162 -289 -243 -1 93 12 34 197 -231 -63 -217 -215 4 158 323 137 74
4621 74 56 -8 62 180 -74 102 4 80 66 85 -92 -31 187 -123 282 -40 166 113 -4 -167 -130 95 -233 184
4645 184 -157 -13 -196 93 212 168 -58 196 -7 -48 191 -217 -146 -135 -31 80 -62 33 -16 -42 33 159 45
4668 45 -24 -19 172 249 -208 49 238 23 48 95 23 110 65 9 110 -226 127 -2 -53 -199 -41 246 34 -11
4692 -11 -279 -24 -18 -251 -255 -141 -237 21 -37 -121 -46 -359 186 -88 54 -161 351 32 35 257 -19 -19 55 136 -54
4717 -54 80 -21 147 67 69 21 11 11 33 42 -29 186 -84 -246 38 306 -43 59 -90 20 -139 -294 -13 122
4741 122 -130 -48 166 62 -25 -8 129 151 -229 -203 173 54 -33 -25 -36 52 -52 149 -77 -91 228 233 -205 52
4765 52 92 10 180 -35 128 -240 60 121 -117 -64 -29 215 -281 -60 -151 -165 98 -56 -19 -65 20 -427 62 41
4789 41 -226 -97 -178 16 -12 -58 -126 91 -53 276 128 6 -40 9 -39 -128 7 15 -1 -66 -76 -48 188 64 19
4814 19 177 241 272 -163 176 -17 -108 31 95 -137 -93 -9 -79 175 -43 -64 59 -17 349 -70 -44 114 82 -20
4838 -20 147 81 -21 -230 162 16 44 129 168 -20 -276 34 -26 -43 129 -30 8 56 -288 -84 156 -168 184
4861 184 10 -296 113 -214 43 61 -151 -76 14 109 -19 64 145 -53 -52 -69 -103 -130 -131 -64 -79 -122 178 141 -161 93
4887 93 -151 -128 -137 19 169 -271 175 -58 -24 216 -54 57 -177 -130 122 134 -80 20 -85 -45 162 -66 178
4910 178 26 -40 -168 -58 111 -64 156 62 -76 122 127 1 179 161 -6 49 112 -13 -39 -130 -169 327 102
4933 102 -26 -157 137 -236 -110 -72 10 225 -251 238 -65 90 30 36 -152 141 -39 -175 314 152 104 65
4955 65 46 -277 -171 -121 5 -338 -191 -39 86 -176 -39 -109 -170 -35 224 -63 -158 -46 44 -157 -35 58 -26
4978 -26 189 -17 83 -40 359 65 23 -109 25 81 170 110 137 39 333 135 224 173 17 -165 -96 55 -81
5001 -81 387 104 189 50 -116 -51 274 174 238 -75 -118 75 -49 61 316 247 203 -63 125 61 148 40 -184
5024 -184 54 11 130 -284 50 -208 66 -88 -2 250 -137 207 -86 273 -75 52 77 29 125 -86 -97 88
5046 88 -109 -11 -92 112 294 -39 -138 -118 -38 -43 28 -150 71 -17 -67 -153 20 -28 292 -83 -141 -23 -44 -14 -6 129
5072 129 -164 80 -50 83 155 132 -14 107 -129 -41 -29 207 -77 -46 2 -105 -36 47 -100 -26 448 143 -29
5095 -29 -81 173 121 22 353 -9 -69 261 -68 292 89 161 -165 126 245 -84 104 -221 -313 134 74 -13 -40
5118 -40 -158 -152 -95 193 13 146 -146 -140 -149 208 -85 100 176 -59 -113 -99 212 -244 -40 -40 -244 181 52 -8 -403
5143 -403 -218 -78 24 -246 53 -124 69 308 -103 -59 -60 122 -15 -87 176 110 78 162 -275 0 26 146 -92
5166 -92 -173 -180 206 -61 -32 -44 -93 -46 -216 34 -120 260 53 -107 136 -85 -167 60 263 -228 69 185 -20
5189 -20 181 -30 4 122 123 -29 -51 71 157 67 220 237 -14 116 134 142 -38 -61 2 -231 -364 219 136 -20 -6
5214 -6 -187 12 209 -70 1 70 -50 -209 153 146 -5 38 42 30 -32 -49 -129 193 -72 95 -163 -71 257 -113 4
5239 4 -97 -77 -111 22 -60 23 -76 46 39 239 70 107 324 63 175 114 131 140 70 -171 68 -191 -103 -144 -85 18
5265 18 175 58 -108 -151 130 -118 -147 -69 179 9 182 29 32 -11 -123 -151 -202 7 -133 71 211 178 32
5288 32 43 -16 21 -1 -50 -221 -75 15 3 -35 -207 174 33 -76 -178 -259 -238 17 -216 -114 -46 -79 -194 61
5312 61 5 97 -147 -143 -295 28 151 36 -200 -8 164 -275 63 -27 -328 -153 37 128 80 92 -155 -93 33
5335 33 213 -111 -201 -45 160 97 -166 44 -96 -9 115 -283 -18 188 63 -119 196 160 5 -361 -53 51
5357 51 168 -129 -26 106 -102 60 16 -33 -140 -208 -223 14 -284 177 189 203 46 -181 353 99 -30 286
5379 286 159 52 3 -41 46 168 56 -9 -140 -109 92 378 161 279 -13 -54 100 106 -28 -109 -173 56 82 -97
5403 -97 7 77 85 -71 26 53 1 -137 39 111 33 -18 73 -104 -38 23 440 45 109 -49 27 159 155 -71 40 127
5429 127 273 -212 78 197 -122 205 -29 -127 -49 -92 -152 70 -116 114 185 -125 -199 41 -39 34 -40 246 -90
5452 -90 -105 -174 192 -61 -223 -251 340 -312 145 -77 -193 -233 -118 200 -180 -34 -10 58 29 -17 -43 18 201 -41
5476 -41 -103 -199 374 66 76 -56 272 -93 -49 40 -27 66 -305 149 148 -89 90 14 -28 244 -343 -173 0 -26
5500 -26 -96 53 51 10 -35 -234 -52 -222 27 139 202 -13 40 -193 -90 54 51 -69 40 -100 86 -57 117
5523 117 -62 -95 105 171 -121 -275 254 19 -85 254 -71 -33 114 -38 -167 97 -67 152 -165 -129 181
5544 181 -127 3 74 8 154 7 4 69 54 79 254 -51 -58 -220 39 47 -64 37 -160 13 -117 295 -81 -92
5568 -92 85 23 -136 102 43 -46 -396 51 201 36 -145 -20 130 -12 142 -152 7 -310 -41 -83 293 -163
5590 -163 174 -22 -13 21 -13 -316 -2 -34 136 -266 -113 -104 -101 135 -154 144 170 218 -35 -131 -99 -150 -178 -18 39
5615 39 -226 91 26 193 -25 -96 251 29 377 244 -45 102 -123 31 83 69 56 256 -287 18 -287 96
5637 96 90 121 -78 -204 -135 156 -49 -162 108 -8 199 -7 267 -18 131 206 -134 -50 136 81 -260 -97 281
5660 281 71 187 135 -179 72 -153 -209 -90 -40 143 -16 -96 29 -36 -101 181 -86 51 166 -66 53 66
5682 66 161 -189 -123 13 -75 122 -114 -107 11 236 238 250 -53 51 -174 -114 4 163 -42 -78 -275 -357 224 175
5706 175 108 36 199 63 -83 142 108 -1 -18 13 -256 -148 127 238 13 42 -2 -6 229 -149 45 -73 130
5729 130 23 -169 -17 -141 -33 -33 -12 35 -126 13 60 159 -83 159 -134 279 8 -267 -240 -66 6 106 -121
5752 -121 45 -74 -135 -279 -68 261 -34 -234 -69 -257 8 -37 -56 2 -142 -213 12 -40 -187 137 -51 214
5774 214 -226 -136 -176 -76 7 -21 -49 -47 18 -17 -150 -178 -163 134 -214 -95 -136 14 -102 -94 -92 58 -172 21 -138
5799 -138 -2 108 4 271 127 41 162 -236 -188 53 46 -1 32 11 -175 -179 204 69 56 128 174 9 -55 73
5823 73 87 67 50 343 -41 -261 -18 78 -56 93 141 -64 -49 124 71 6 232 2 -40 90 299 39 52 307
5847 307 -135 44 -55 128 36 55 -164 -22 -237 -40 -213 15 73 49 -71 -379 80 1 78 1 -126 0 -88
5870 -88 -95 -162 55 -3 6 -167 -155 210 12 231 -58 -72 158 79 -21 174 139 5 35 99 -173 -64 -116 258 44
5895 44 -80 -65 238 188 -89 89 26 -63 17 -98 20 -53 -177 178 -257 -36 -112 -149 363 -40 -228 30 -68
5918 -68 56 139 59 -43 197 54 -147 -3 -88 25 57 -115 -6 73 -188 111 -36 233 124 37 81 20 -151
5941 -151 1 126 47 59 -206 294 -198 -277 146 16 -193 202 123 -109 269 2 -77 -229 25 -133 -151 -134
5963 -134 104 138 -141 -179 -1 -117 86 -324 -6 74 141 81 -338 -203 104 -144 238 -114 121 137 46 82 -64
5986 -64 139 60 47 145 98 -13 150 51 -114 -244 25 40 -131 216 35 -32 220 -198 267 -110 47 146 -173
6009 -173 143 264 50 -5 27 -175 72 -3 84 281 48 49 71 -47 -5 5 61 -108 106 -37 19 -134 105 -18
6033 -18 -184 -194 129 -17 -158 125 99 143 58 133 0 33 -192 275 -190 150 162 97 78 126 53 62 166 123 -20
6058 -20 -50 -79 -136 -111 -103 90 -44 240 -144 133 27 -100 -77 -5 -265 -146 11 67 169 -71 -6 296 -55 236
6082 236 74 -209 241 90 291 36 159 143 227 -114 232 67 219 31 -60 296 59 -131 84 168 257 -71
6104 -71 -198 67 -236 245 -315 84 5 46 118 -77 90 103 -42 73 -87 -47 3 -75 -152 -67 161 40 -56 -104
6128 -104 -140 -281 -164 35 -219 90 -115 -75 17 -9 -7 -9 41 -137 -102 -232 4 190 -315 -32 109 -217 -63
6151 -63 116 -86 10 -269 -7 169 25 -41 -31 151 -153 270 50 182 -344 -36 -29 103 88 -61 -38 -171 58
6174 58 -185 -71 43 59 88 96 93 -90 -6 0 323 118 31 -223 -31 86 -60 224 13 126 50 -74 -133 -88 -110
6199 -110 70 -46 -182 -76 101 -8 -210 -63 -195 5 132 -165 56 -70 -49 -163 -25 -159 -247 -1 -136
6220 -136 85 118 157 -147 86 -152 120 21 313 174 -149 149 188 173 -269 156 -38 85 98 22 -101 -61 -107
6243 -107 -58 -170 -126 62 191 61 189 -154 220 -151 96 -70 -80 147 -75 258 185 -184 -61 -100 -3 -71
6265 -71 -26 3 -154 143 284 -2 141 119 -21 -164 127 -175 48 141 179 -83 -9 49 -112 209 44 -100 -91
6288 -91 46 -81 -172 -139 -157 -179 82 -54 134 -132 48 97 -144 -274 -49 -97 -179 -58 53 120 -118 84 169
6311 169 -45 5 -104 139 -198 -159 37 -156 -164 -59 82 -299 24 78 -319 2 -66 -193 -26 -3 69 -393 211
6334 211 38 95 -205 -44 318 75 -71 -246 -125 -226 103 -89 34 56 345 12 11 -1 40 -82 -36 354
6356 354 -99 249 -56 -35 109 107 156 35 -157 347 -158 112 23 -85 -12 133 -20 142 -124 -113 50 35 49
6379 49 90 -87 -81 174 -174 251 147 39 -24 -5 -23 -131 -79 70 50 97 90 -35 -24 -231 135 267 -192 -102 -227
6404 -227 -25 -131 -67 -95 -89 129 64 231 -166 -204 -89 252 23 -32 48 -15 90 -94 14 -160 245 193 162 102
6428 102 17 -93 -66 -140 -210 -202 -46 -68 21 58 129 88 332 102 -53 119 24 210 -113 165 -83 -57 -26 295 100
6453 100 -133 -24 145 -11 45 132 191 153 -12 189 24 27 49 -51 196 -103 90 77 -113 -270 40 -7 -206
6476 -206 155 -10 79 7 -157 -146 4 3 -2 -52 73 65 19 81 -102 27 -33 -234 -301 11 -177 -172 -27 -140 -109 -44
6502 -44 95 -1 -117 -268 -18 83 -157 134 -140 -135 279 182 61 212 52 -33 78 234 133 -74 189 30
6524 30 119 29 26 -208 -35 179 -142 262 133 125 -124 37 38 -47 306 160 95 -92 46 -160 -75 -33 146 -32
6548 -32 -220 67 -34 -28 -84 -109 20 72 86 93 59 -364 -226 -7 133 120 -7 -75 -86 2 -47 12 -34 280 -175 224
6574 224 -90 -6 -56 80 168 -2 -139 -35 59 81 -22 -156 7 223 66 -179 52 -156 137 210 4 -248
6596 -248 -170 141 -198 -173 -217 -205 -139 -129 -158 -62 18 -87 140 27 147 63 144 -60 -4 -9 -189 72 20 -78 -178
6621 -178 -44 115 145 -62 41 -33 -100 -13 205 -71 150 144 124 -17 -303 252 27 -222 63 -63 -90 -212 105
6644 105 -220 -356 275 119 -121 -9 -44 -51 150 95 142 124 154 32 175 -49 18 386 154 31 -254 -251 50
6667 50 -156 -256 -55 20 -95 -124 37 266 -6 375 -10 -48 -53 209 53 -196 61 -152 -228 111 -92 -29 -201
6690 -201 -71 -195 138 -55 451 -109 -53 -178 335 457 45 -99 -17 -32 96 156 -67 207 23 -64 77 -161
6712 -161 177 4 105 69 -68 -88 59 88 -45 -37 127 -110 -187 157 -40 82 -61 0 -47 81 -1 105 192
6735 192 -66 26 -74 -225 -122 115 -142 37 197 52 24 -10 -3 -80 163 45 93 -50 -133 131 37 -22 -100 212
6759 212 -257 -164 45 -131 -191 -95 168 -92 44 -153 -121 34 54 -283 -159 -129 26 84 -214 0 27 5 -121
6782 -121 -133 -223 -124 -29 91 202 -118 -37 -62 37 129 268 -155 -165 114 -8 -104 -217 168 239 5 -15 -35 407
6806 407 204 124 214 9 62 -43 151 159 -98 -98 104 46 101 -171 -5 74 273 26 -35 208 -19 -126 -149 -326
6830 -326 11 1 89 -87 51 10 -136 19 -177 75 -89 -23 265 -124 -78 -261 -94 -54 -184 -37 -79 100
6852 100 -253 85 110 -183 450 10 -113 -158 -28 62 20 -221 -129 -133 69 188 -50 140 14 -111 -50 133 -415
6875 -415 -190 -17 -170 53 -38 155 -82 39 108 65 95 -154 22 -1 66 48 88 -81 -86 151 -29 -120 -142 99
6899 99 159 -109 90 236 124 -191 -51 6 21 18 212 -81 135 -161 92 52 -175 -55 -85 143 -107 -72 -148
6922 -148 43 -54 -35 -47 -81 94 96 -68 -30 -110 -201 -148 -141 -97 284 -2 -54 -76 66 240 -13 -152 9 37 127 -142
6948 -142 10 -96 -2 -58 -96 -118 204 -198 -127 -1 33 36 117 -41 -6 52 -106 -82 -5 -212 105 -90 -191 -87
6972 -87 -153 98 -275 127 101 389 -151 20 46 5 -104 5 258 -126 173 -73 37 98 130 170 263 157 -12
6995 -12 100 338 226 53 -66 -87 417 30 -180 -47 10 266 -9 -60 -221 -56 -87 -207 -55 178 80 -264
7017 -264 94 79 227 -44 -151 -1 -222 -107 -3 -115 -72 -76 -49 -32 -11 -69 -313 179 -175 26 -174 20 -169
7040 -169 -13 -14 215 299 -117 -78 159 55 -133 6 -126 2 33 107 -135 109 101 -187 130 -118 44 87 26
7063 26 25 89 -2 -106 182 29 37 2 -186 224 -28 -33 -110 -313 19 79 107 -3 64 -21 66 -22 -33 171 -168 153
7089 153 -45 34 180 194 -63 -9 -262 4 212 -250 56 10 36 -118 78 -113 -188 87 -273 -177 47 11 122
7112 122 224 -52 -2 86 -101 -30 27 22 4 -83 -200 108 -58 33 -255 66 142 -97 134 -50 -53 338 113 1
7136 1 168 48 32 -64 -220 224 -18 30 -210 -140 -36 -115 62 -10 279 -144 -335 89 181 30 -21 -336 184
7159 184 130 44 223 -138 -160 -59 110 143 -13 -29 -135 -31 168 -94 -71 25 20 81 20 162 48 215 -279 109
7183 109 -167 116 124 36 113 25 -165 18 323 -461 193 -248 82 -120 -230 0 -49 14 266 -32 3 -282 52
7206 52 -145 -132 173 -71 -97 -169 129 231 73 -343 34 87 13 186 71 33 -279 -28 27 -81 27 79 -51
7229 -51 181 189 247 49 295 90 198 0 73 26 88 69 142 -2 -114 183 83 -96 -45 -58 62 -90 -251 -12
7253 -12 344 60 -134 -47 239 -182 -6 -117 62 177 36 146 -153 -17 -56 234 52 78 261 133 -52
7274 -52 -152 220 -111 75 27 -254 -102 71 69 107 -156 -103 -261 -41 -9 -41 -302 -98 227 -150 67 -99 -159
7297 -159 67 64 -294 -98 -41 -256 -263 -70 39 -15 -242 0 -57 67 15 28 58 -54 2 125 -105 100 -188 132
7321 132 42 175 -13 111 -215 91 288 -287 -41 265 195 -14 150 -109 141 -59 -47 32 17 -79 30 12
7343 12 131 118 102 98 -45 77 5 -10 115 61 9 144 291 -174 -108 92 232 -32 82 -269 431 60 101 101
7367 101 73 -53 -217 74 12 146 -13 -309 166 34 -35 50 -184 66 -110 -47 80 -152 54 -199 -36 10
7389 10 130 -286 -132 57 -127 115 -114 315 29 121 188 -248 -98 -79 -129 -132 46 151 -168 103 289 -180
7411 -180 -236 -22 106 -64 -71 106 -92 158 -279 10 98 -102 -29 185 -174 141 391 249 -53 94 2 -181
7433 -181 8 15 -36 49 57 15 189 199 -71 195 -166 -94 -81 209 -230 33 -161 -61 -17 253 -240 -212 88 -134
7457 -134 -242 100 13 -7 47 -64 56 42 4 -129 -257 -80 72 -22 -80 -243 3 115 -67 -106 223 -154 -198
7480 -198 -28 153 -71 138 34 240 -89 -196 79 112 132 -13 -32 -136 -189 -178 205 27 -139 -164 -175 -35
7502 -35 -131 -59 65 67 -89 18 174 -51 181 127 226 -71 79 -14 -224 -62 120 -156 -119 -24 107 -138 66
7525 66 63 -134 52 327 200 102 -137 -63 -110 159 121 9 33 -129 52 -12 150 71 218 -44 55 -157 23 -114
7549 -114 12 -112 116 216 25 114 -140 119 -29 69 -16 -248 -115 -22 -213 -2 -36 -115 -144 91 -240 -147 177
7572 177 -164 -135 264 -190 173 -86 220 -40 -27 -16 -25 -95 -354 -86 182 22 -131 27 41 -3 -113 40 102
7595 102 107 72 -54 35 110 -42 -116 292 -63 -122 90 -160 496 180 -196 -128 4 -192 184 64 348 82 41
7618 41 8 158 -176 125 172 -183 179 -147 -42 100 96 113 -203 -96 85 -230 -114 -57 -173 52 -118 -301
7640 -301 -209 227 110 224 115 82 -259 -143 -123 -101 -110 87 -141 -110 -294 17 16 58 160 10 369 120 -159
7663 -159 -166 -99 -60 -159 -10 2 -54 -137 48 -182 -4 -32 -99 184 -94 -71 107 122 -9 -115 81 7 65 106 -123
7688 -123 -199 -26 -43 -83 -162 172 -206 46 221 -139 -116 -29 66 133 51 -303 -31 368 68 -56 64 52 -12 258
7712 258 196 -108 28 -73 -18 317 -49 -59 -27 -178 -16 109 -18 202 -200 -95 17 -5 -226 53 -108 82
7734 82 -80 -25 -73 -102 111 6 -131 -137 -127 -55 -180 -195 65 97 -87 -282 147 51 148 -24 -81 285 -78 34
7758 34 -197 -78 55 -131 372 -106 -87 61 -75 73 24 -37 13 -103 -192 -4 -209 208 60 -32 160 327
7780 327 -65 33 132 145 -302 39 121 38 -187 -115 -129 -209 196 -16 -256 -76 169 192 45 -278 4 -83 169
7803 169 -36 26 -16 -190 -65 267 -192 0 55 -254 -63 125 73 -22 -167 -27 68 -111 97 16 21 -38 115
7826 115 -113 -97 70 228 -80 -42 -130 27 -93 37 -58 65 -100 -122 76 62 -153 -144 220 -95 177 -172 158
7849 158 7 -24 12 -154 -155 62 -132 -46 -76 -23 -144 73 161 27 -10 -265 57 53 -95 201 -16 -104 -112 161 170
7874 170 -1 -14 -164 308 -167 115 72 17 239 -187 86 271 -265 177 -59 106 -200 -2 -79 -181 101
7895 101 84 -170 120 6 -157 12 -122 36 274 290 36 -187 -11 216 72 -235 63 -4 14 113 -18 117
7917 117 -177 -133 -338 12 -13 -63 31 235 23 73 -117 -196 -8 60 -45 -248 -9 -94 100 -208 76 22 106
7940 106 -123 22 -230 -480 -43 6 -65 227 177 18 -265 68 193 142 -57 93 -150 -170 -191 -89 -238 -33
7962 -33 -2 138 -2 -76 -255 176 0 73 -29 67 16 -161 9 -7 231 142 -286 -21 -33 -24 51 240 29 -27
7986 -27 168 207 -67 -106 33 -2 -179 99 -41 135 -8 80 -199 -70 -4 106 -83 174 145 -137 146 -33
8008 -33 202 102 66 48 -78 -139 -78 341 -156 -80 -154 -234 -238 -120 158 -169 77 -80 261 152 -165 196 -137
8031 -137 278 15 -42 44 45 86 73 22 35 -11 -41 3 -144 -92 157 -29 88 -177 -362 -41 -174 33 -127 -178
8055 -178 162 0 -119 -129 43 171 67 106 164 -77 -61 -59 -103 46 133 -72 -155 -142 -62 -91 94 49 -90 -112 -121
8080 -121 99 -346 -92 33 -148 63 229 86 259 -53 67 -23 -132 -203 -12 180 93 -127 -155 239 111
8101 111 74 -52 148 114 -23 -243 -137 -62 1 145 -14 -69 -199 85 58 -56 -55 69 -58 153 173 108 238
8124 238 118 -15 54 -159 -63 14 -89 -179 -67 56 -197 221 -241 120 -96 -100 173 77 56 122 -219 -67 -126
8147 -126 157 -41 -21 -227 -19 -157 43 29 -47 91 -41 54 -61 -55 52 -222 216 -33 16 89 -51 -98 -65
8170 -65 -150 -11 37 193 -77 -26 59 76 -3 -64 -125 124 10 -124 35 -140 -248 -93 284 -96 -110
8191a10
$$ Imaginary data points
##PAGE= N=2
##DATA TABLE= (X++(I..I)), XYDATA
0 0 0 0 0 0 0 0 0 0 0 0 0 0 0 0 8 -8 8 -8 8 -16 16 -16 24 -24 32 -33 40 -48 56 -64 72 -81 93 -104 117 -133
36 -133 149 -166 187 -207 231 -255 287 -317 350 -386 427 -470 518 -571 629 -693 762 -842 932
55 932 -1032 1144 -1274 1428 -1605 1821 -2086 2421 -2856 3456 -4331 5739 -8383 15136 -71850
70 -71850 -124833 -61774 -112949 -116551 -46638 28567 -29277 -140307 -180983 -106648 -46128 -69726
82 -69726 -118710 -85467 -23950 -37335 -124104 -162580 -116928 -61855 -77895 -119523 -105289 -43540
94 -43540 -34977 -107108 -172304 -149769 -82200 -54346 -74319 -79462 -53222 -48795 -103296 -156141 -132001
107 -132001 -53957 -13815 -40838 -78262 -79412 -66759 -81167 -109596 -98685 -44173 -9831 -31633
119 -31633 -67729 -68774 -45026 -42598 -68986 -76871 -35886 12078 12545 -21814 -40881 -33302 -29056
132 -29056 -40768 -38571 -263 43245 41604 -2954 -38261 -32652 -6888 8930 14978 28798 46249
145 46249 42230 10101 -14925 -2755 30431 46247 39094 33980 44258 52563 39034 16370 15714
158 15714 37616 53608 51595 49384 58135 63373 49136 23646 16881 39851 69027 76604 67060
171 67060 58475 52517 41009 29172 31326 54371 78809 79160 58089 41411 40833 43042 40348 40615
185 40615 50563 64082 65360 51742 38928 38189 40216 36507 32432 39014 53196 60840 50986 31894
199 31894 20432 21593 25493 28533 37228 47597 47386 30932 9877 1991 11107 24314 29085 27735
213 27735 25549 20037 9305 -1038 -2655 4777 13393 13193 6971 3156 3295 -180 -8409 -14879 -13211
228 -13211 -5317 -361 -2626 -5752 -8353 -14928 -25506 -30798 -24833 -12521 -5220 -9380 -19394 -28138
242 -28138 -33201 -35157 -32470 -25285 -17768 -16121 -22861 -33190 -38644 -36612 -33225 -32184 -31062 -27362 -25290
257 -25290 -28377 -33685 -37791 -37560 -36256 -35900 -33803 -27516 -23455 -25602 -32354 -39390 -41304 -36457 -29157
272 -29157 -23917 -21017 -21188 -26324 -34099 -37302 -33125 -24769 -17603 -16610 -19467 -21727 -23244 -25446 -25230 -20443
288 -20443 -15489 -12459 -12075 -12756 -13172 -12894 -13517 -14970 -13238 -8854 -3814 -881 -1145 -3426 -5906 -7131
304 -7131 -7576 -4295 2865 8997 9240 4886 883 -859 747 4651 8812 12803 14706 12415 8837 6977
320 6977 7728 10446 13362 15578 16129 17123 17248 15805 13138 13146 14447 16063 18746 20661 22212 21855 17958
337 17958 14038 13300 15690 19959 23150 24579 22402 18942 15508 13618 15208 19303 22567 23324 21108
352 21108 18106 15865 14996 15491 16058 17914 19472 19289 17381 16415 15069 13337 12359 12467 13890 15684 16389
369 16389 15114 12656 9945 7518 7530 9370 11566 13123 12883 9472 5399 3220 4002 5396 6720 7811
385 7811 7161 5514 2444 118 -398 462 747 1283 1734 1385 -546 -1945 -3426 -4862 -5116 -4634 -3224
402 -3224 -2873 -2910 -4411 -6864 -9381 -10723 -9914 -7321 -5862 -6515 -7916 -10191 -13023 -14106 -12888 -10906
418 -10906 -9980 -9719 -10793 -12576 -13762 -14579 -14850 -13790 -13105 -12696 -12210 -12284 -13986 -15014 -15120 -15172 -15220 -14395 -12586
437 -12586 -11447 -12057 -13475 -14899 -15482 -14852 -13340 -11404 -9963 -9873 -11287 -12334 -13484 -13442 -11001 -8788 -8297
454 -8297 -8379 -8122 -8327 -8845 -9176 -8721 -7111 -5520 -4902 -4630 -4113 -4000 -4570 -4910 -4120 -3188 -1583 102 426
473 426 130 -93 -953 -885 37 1731 3453 4791 3541 2807 2567 2970 3769 4818 6413 6653 6411 6095 6078
492 6078 6091 6072 6681 7683 8247 8649 8306 8393 8190 7433 7570 8416 8759 9506 9833 10071 9083 7952 7734 7920
512 7920 9185 9625 9747 9931 9013 7401 7200 7475 8162 8444 8869 8889 7869 7194 6736 6369 6341 6648 6876 7281
532 7281 7171 6028 5380 5289 4490 3855 4103 5233 5224 5058 4653 3383 2451 2115 2553 2807 3523 3467 2962 2041
552 2041 1104 455 880 1103 799 941 1289 222 -672 -876 -1081 -1476 -1676 -1313 -1107 -1175 -1308 -1907 -2200 -2860
572 -2860 -3539 -3331 -2703 -2538 -2911 -3130 -3628 -4317 -4853 -4749 -4057 -4138 -4239 -4522 -4615 -5137 -5509 -5273 -5021 -5170 -5689
593 -5689 -5278 -5100 -5642 -5985 -5879 -5696 -5694 -5902 -5650 -5498 -5687 -5937 -5906 -5645 -6070 -6015 -5590 -4689 -5146 -5244 -5071 -5195
615 -5195 -5337 -5012 -4385 -4191 -4171 -4440 -4087 -3828 -3699 -3646 -3153 -2706 -3019 -2410 -2142 -2064 -2131 -1885 -1874 -1518 -1129 -871
637 -871 -381 34 -51 120 91 75 389 1353 1982 1784 1752 2228 2254 1869 2309 2714 2970 3498 3326 3291 3283 3494 3150
660 3150 3558 4188 4379 4298 4993 4688 4237 4090 4234 4454 4389 4926 5395 5123 4800 3861 4099 4238 4335 4933 5141
681 5141 5364 4448 4264 3633 3307 3472 3661 4062 3875 3747 3572 3160 2355 1983 2043 2567 2460 2343 2484 1993
701 1993 1337 644 817 747 985 1382 957 859 38 -340 -751 -678 -886 -351 279 -364 -1354 -1387 -1261 -1615 -1832
722 -1832 -1758 -1684 -1474 -1274 -1918 -2378 -2960 -3058 -2894 -2334 -1903 -2459 -2308 -2847 -3350 -3590 -3419 -3092 -2562 -2150 -2471
743 -2471 -2768 -3352 -3818 -3938 -3183 -2990 -2581 -2410 -2722 -3139 -3954 -3415 -3525 -3387 -3136 -2107 -2266 -2625 -3223 -3667
763 -3667 -3593 -3564 -2914 -2280 -1900 -1971 -2488 -2740 -3010 -3183 -2957 -2317 -1635 -1307 -1415 -1641 -2546 -2772 -2516 -1744 -1267
784 -1267 -898 -750 -865 -1547 -1960 -1910 -1145 -880 -284 239 528 -36 -883 -960 -978 -285 460 922 1436 1459 888
805 888 168 378 544 1144 2091 2692 2636 2446 2392 1361 1435 1768 2766 3530 3673 3672 3461 2973 2522 2905 3329 3667
827 3667 4399 5204 4769 4106 3370 3054 3684 3966 4852 5285 5535 4497 3975 3364 3723 3756 4348 5053 5735 5402
847 5402 4541 3613 3178 3188 3252 4228 4713 4538 4103 3104 2588 2334 2049 2704 3225 3566 3356 2931 1668 662
867 662 701 1103 1633 2027 1970 1328 716 -172 -845 -894 -596 -333 303 322 -886 -1402 -2368 -2330 -2287 -2140 -1448 -1158
889 -1158 -1739 -2366 -3038 -3240 -3806 -3837 -3019 -2198 -2497 -2936 -3448 -4240 -4647 -4308 -3775 -3423 -3318 -3016 -3554 -4293
909 -4293 -4805 -4865 -4527 -4277 -3869 -3249 -3162 -3788 -4897 -5225 -4826 -4228 -3786 -3135 -3177 -3222 -3923 -4472 -4527 -3977 -3943 -2770
931 -2770 -2489 -2280 -2651 -3435 -3893 -3780 -3540 -2383 -1775 -1530 -1555 -2140 -2795 -2772 -3037 -2344 -1267 -642 -670 -870
951 -870 -1324 -2010 -1910 -1574 -534 10 249 410 284 -700 -943 -895 -240 772 1038 1436 1334 818 -74 120
971 120 229 933 1646 2296 2376 1700 1452 1224 1416 1327 2006 2814 3608 3381 2988 2418 2279 2125 2541 3456 3733
992 3733 3946 4047 3241 2746 2668 2739 3550 4253 4346 4829 4505 4023 2956 3172 3666 4002 4472 4546 4542 4228 3715 2975
1014 2975 2946 3627 4026 4449 5023 4044 3416 2800 2662 2929 3178 4010 4053 3628 3003 2105 1727 1557 2014 2419
1034 2419 2693 2679 2496 1561 993 420 128 1360 1637 1525 1469 798 -133 -760 -1167 -945 -292 86 215 115
1054 115 -1062 -1764 -2118 -2077 -2247 -1735 -1178 -1182 -1695 -2176 -3116 -3393 -3665 -3117 -2275 -2246 -2189 -2951 -3348 -3932 -4416
1075 -4416 -4118 -3302 -2738 -2723 -3144 -3246 -4269 -4552 -4430 -4310 -3270 -2951 -3082 -3264 -3978 -4454 -4426 -4181 -3513 -3077
1095 -3077 -2647 -2457 -2939 -3415 -3455 -3647 -3671 -2928 -2196 -1962 -1998 -2660 -2910 -3115 -2746 -2674 -1889 -1338 -1205 -1285 -1769
1116 -1769 -2261 -2255 -2018 -1365 -583 -570 -494 -703 -1350 -1698 -1354 -653 -191 166 191 186 -203 -653 -712 -146 126 703
1138 703 1304 1136 982 395 56 198 510 1071 1502 2047 2122 1489 1213 689 822 1270 1810 2621 2495 2220
1158 2220 1854 1480 1323 1528 1972 2456 2785 2954 2844 2313 2055 1889 2082 2944 3498 3453 3421 3104 2560 2163
1178 2163 2487 2840 3103 3573 3863 3566 2904 2558 2596 2496 2703 3435 3569 3719 3058 2704 2309 2325 2118 2502
1198 2502 3152 3188 2733 2768 2257 1904 1486 2112 2392 2514 2417 2347 1762 1009 847 1207 1135 1450 1600 1490 1074
1219 1074 223 -100 12 21 186 259 630 -93 -258 -757 -1170 -1227 -1169 -953 -563 -568 -1370 -1724 -2110 -2359 -2228 -1910
1241 -1910 -1683 -1423 -1812 -2433 -2600 -2949 -3221 -2783 -2289 -2236 -2246 -2608 -2961 -3268 -3642 -3615 -3040 -2796 -2581 -2439 -2558
1262 -2558 -3296 -3674 -3240 -3133 -2909 -2703 -2289 -2452 -2677 -3007 -3137 -3155 -3134 -2529 -1810 -1632 -2181 -2331 -2785 -2506
1282 -2506 -2307 -1922 -1836 -1093 -1182 -1509 -1859 -1930 -1849 -1523 -1096 -735 -835 -483 -688 -872 -1138 -1168 -739 -155 274
1303 274 299 248 -249 -341 -665 -109 356 478 886 836 648 180 142 314 337 775 1195 1437 1167 920 581 683
1325 683 835 858 1336 1918 1790 1515 1314 1141 919 1110 1658 1841 1809 2077 1854 1630 1306 1001 1686 1834 1984
1346 1984 2062 2338 2159 1459 1500 1548 1806 2279 2602 2390 2536 1769 1844 1504 1650 1973 2413 2599 2562 2185 1910
1367 1910 1817 1911 1513 2164 2378 2467 2088 1685 1580 1193 984 1366 1858 1764 2213 1880 1296 890 662 847 1273
1388 1273 1158 1272 1126 1127 1073 232 36 485 562 676 770 442 29 -419 -302 -610 -368 -265 -113 -109 -783 -806
1410 -806 -1262 -1166 -1294 -1224 -582 -625 -836 -1270 -1571 -1830 -2154 -1624 -1365 -1213 -990 -1167 -1744 -1848 -2046 -2158 -2128
1431 -2128 -1740 -1478 -1506 -1526 -1953 -2323 -2364 -2202 -2171 -1493 -1640 -1384 -1996 -1973 -1953 -2106 -2071 -1677 -1178 -1346 -1464 -1775
1453 -1775 -1774 -1899 -1950 -1141 -1042 -943 -813 -1045 -1029 -1519 -1423 -1350 -953 -547 -247 -563 -380 -806 -965 -771 -701 50 216
1476 216 91 379 -390 -667 -602 -327 -148 213 387 544 273 -111 -249 -204 100 -6 734 730 729 321 82 -96
1498 -96 287 308 649 984 853 820 680 337 -181 453 882 700 724 1020 727 712 123 300 992 711 1070 1211
1520 1211 735 1099 538 329 591 742 1083 1200 1213 1046 745 454 600 512 747 1342 1334 1252 844 642 565 777
1542 777 539 1044 1310 1320 1201 946 851 507 500 1000 944 1192 1064 1070 809 412 428 434 882 1176 1213 1076 716 218
1566 218 350 609 390 361 723 763 837 360 -46 -153 -51 -92 588 359 280 42 -33 -359 -698 -418 -206 -406
1588 -406 42 -197 -496 -547 -577 -1129 -790 -335 -421 -304 -334 -715 -1364 -1170 -943 -808 -492 -561 -399 -572 -1068 -1141
1610 -1141 -1029 -1395 -957 -613 -587 -660 -832 -1074 -1266 -1204 -1137 -973 -496 -276 -512 -782 -979 -1153 -974 -695 -394
1631 -394 -270 -171 -607 -690 -605 -845 -667 -63 64 -107 -13 -411 -529 -571 -277 -82 46 98 396 435 67 -47
1653 -47 -225 -115 173 247 484 429 322 209 100 -53 -144 255 471 476 532 203 119 105 -126 265 349 560 547 612
1677 612 121 97 -204 39 1 580 489 383 222 -25 6 21 78 87 331 372 651 263 -196 130 -92 27 189
1700 189 449 561 357 89 -68 48 28 72 489 433 316 -3 -54 8 -33 145 337 803 285 408 39 23
1722 23 -33 -175 159 332 343 684 424 264 -57 330 175 326 646 618 718 273 127 224 -90 102 392 935
1744 935 732 97 135 170 127 -166 146 257 555 366 320 88 -189 -333 -242 -59 291 386 137 -55 -294 -296 -678
1767 -678 -72 -182 -83 -323 -59 -184 -610 -778 -610 -309 -414 -213 -302 -366 -624 -781 -668 -897 -427 -294 -261
1788 -261 -286 -696 -729 -723 -535 -477 -244 -210 -259 -208 -300 -547 -593 -587 -601 -146 226 205 -169 -78 -444 -642 -353 -29 -248
1813 -248 94 345 77 -134 -208 -475 -181 374 214 520 164 -46 -42 61 -36 95 242 445 718 170 310
1834 310 144 63 181 379 621 482 590 164 231 165 135 154 290 601 426 492 345 261 -309 84 422 210
1856 210 202 468 466 184 -353 -166 56 120 188 617 238 137 -391 -302 44 -18 165 222 345 241 100 -238 -313
1879 -313 -490 -288 234 397 117 104 -235 -236 -191 -185 384 65 140 277 78 -48 -79 -113 231 244 347 200 240 154
1903 154 -258 -243 -104 -24 264 501 643 215 -15 -23 107 -50 -3 357 561 78 62 -136 -223 -278 69 210 345
1926 345 434 114 -55 -253 -207 -42 165 153 312 216 499 -175 -232 -162 -161 -144 -82 262 -369 -236 -637 -503 -379
1949 -379 -333 -301 -149 -113 -36 -488 -741 -714 -659 -584 -218 91 -470 -208 -435 -553 -786 -733 -255 -347 -522 -240 -446
1972 -446 -384 -662 -556 -249 -88 -146 -24 -194 -329 -576 -524 -277 -226 -261 -95 240 163 -132 -645 21 264 51
1994 51 369 299 238 247 78 -200 34 152 239 391 357 -26 -12 227 -206 101 362 597 735 494 326 332 86
2017 86 -45 321 563 595 819 494 618 97 186 442 290 426 634 647 327 328 290 37 135 247 395 507 397
2040 397 136 132 132 48 54 311 403 247 107 21 73 136 -69 -218 -75 234 18 -91 96 -327 -183 -309 -160 -227
2064 -227 1 21 -161 -279 -293 -147 -71 -48 178 130 124 -56 -565 -292 -310 -265 -155 262 -59 -425 -101 -197 -324
2087 -324 -209 69 240 102 -15 170 -209 -229 -73 -297 -50 65 -304 65 -22 -178 -195 -52 144 -120 -194
2108 -194 -204 36 -356 -265 -373 -294 -63 -352 36 -21 -326 -371 -625 -234 -207 3 -113 -221 -215 -307 -527 -460 -235
2131 -235 -379 -325 -176 -174 -175 -235 -579 -634 -586 -292 -249 -282 -95 -283 -538 -534 -383 -296 -201 -274 -32 -324 -489 -517 -368
2156 -368 -109 -103 -36 -40 159 -68 -192 -115 78 -101 74 360 255 356 380 184 37 110 136 358 684 435 156
2179 156 479 272 11 163 406 423 821 664 671 439 399 535 711 679 657 787 522 514 471 627 646 636 686 769
2203 769 935 826 515 308 502 541 670 384 933 380 264 145 175 -7 375 523 592 241 396 377 42
2224 42 36 -198 112 77 304 86 160 101 -338 -189 -88 -88 311 -32 138 -19 -188 -239 -109 -81 -213 -46 223
2247 223 -68 -134 -492 -228 -452 -300 -160 -28 143 -159 -499 -606 -214 -119 -228 -92 119 -188 -471 -272 -317
2268 -317 -799 -25 -232 -256 -241 -260 -408 -527 -497 -95 -107 -181 14 -121 -362 -494 -623 -265 -389 -375 -226 -117
2290 -117 -37 -610 -717 -571 -573 -294 -96 -147 -20 -492 -412 -228 -609 -841 -314 75 -85 54 -463 -434 -479 -682
2312 -682 -532 -568 -61 -437 29 -679 -425 -558 -512 -128 -253 -281 71 -184 -166 -469 -515 -369 -274 -57 -67 94
2334 94 -96 -114 13 -197 -288 -80 125 24 -138 -14 349 -38 199 264 269 293 373 361 343 121 241 278 373 363
2358 363 567 451 622 236 565 403 384 581 451 832 561 734 309 387 706 372 898 697 916 903 367
2379 367 499 725 598 577 700 739 912 496 489 361 446 315 645 494 672 385 531 -15 339 364 239 -79
2401 -79 331 304 302 -76 95 230 -1 -46 -46 211 391 76 -266 -179 -12 59 -321 -85 61 8 168 -196 -43
2424 -43 -187 -55 -44 -13 9 -199 -364 -254 -479 -167 -118 -52 -132 -225 -249 -276 -370 -240 -218 -121 177 -121 -121 -229 -383
2449 -383 -124 -572 -407 -393 -331 -57 -321 -359 -496 -621 -357 -211 -235 72 -111 -484 -283 -489 -107 -282 -222 -263
2471 -263 -383 -265 -239 -61 -420 -246 -265 -181 -68 -152 -133 -523 -613 -413 -543 -260 102 -160 -325 -223 -331 -559
2493 -559 -449 -350 -90 -287 -209 21 -334 -393 -457 -274 -337 -391 191 103 -139 -209 -118 -108 -312 -162 -23 289 -113
2516 -113 -93 -94 -73 -63 -57 133 276 64 79 144 -75 65 246 414 240 511 302 262 339 216 274 217 15 574
2540 574 320 339 581 231 188 570 410 510 364 645 285 274 428 35 327 471 488 539 529 686 504 316
2562 316 335 451 410 333 588 513 89 316 457 202 616 274 199 223 219 12 -80 133 205 61 216 203 116 -116
2586 -116 91 -234 -192 -117 -155 198 -62 105 -74 -199 -27 -118 -195 34 70 -506 -84 -84 -227 -359 -379 -92 -332
2609 -332 -306 33 -227 -196 -302 -318 -165 -356 -310 -177 -120 -68 -350 -347 -310 -250 -221 -276 -157 -285 -341 -235 -295 -223 -488
2634 -488 -320 -29 -256 -71 -76 -223 -413 -234 -134 105 134 -176 -307 -184 -108 -116 -119 -136 397 -115 -146 -269 -158
2657 -158 -337 -206 -300 -314 -51 -114 12 -352 -436 -322 -31 -109 -170 -136 -43 -356 -60 -69 0 37 -102 -261 -78 -430
2681 -430 -153 -183 -161 -104 -224 -90 197 -126 72 -181 -347 -262 144 375 -193 50 -283 129 -115 -137 -33 262
2703 262 38 279 236 343 29 176 248 310 287 178 246 204 127 187 429 356 449 175 385 503 289 171 502
2726 502 235 380 495 362 219 200 467 415 162 58 484 493 651 495 317 58 49 313 295 724 205 200 499
2749 499 421 68 330 7 234 182 39 249 135 -148 202 -14 190 -103 23 -15 89 2 68 89 -78 -197
2771 -197 -164 -39 8 -267 -118 -193 -280 -160 -294 -73 -151 -176 -16 54 -387 -182 -266 -383 -366 -205 -103 -103 -266 -286
2795 -286 -364 -208 -295 -96 -162 77 72 -282 19 -183 -122 188 -128 65 42 -178 -148 -249 48 -110 -312 -98 -159
2818 -159 -9 108 -181 -146 -147 -75 -27 -170 3 42 -135 -20 -132 -112 135 31 302 195 86 119 -175 -41 -207
2841 -207 -36 4 -105 -119 -89 -143 -357 -249 -71 160 90 -109 -170 -112 -151 -289 -52 -48 -90 -143 -61 -69 -12 -184 158
2866 158 -173 355 -3 331 -18 -82 -160 -236 -95 127 111 -87 -67 -106 -56 -35 160 169 164 68 172 291 -101 -78 61
2891 61 115 30 24 269 189 169 220 31 272 103 104 62 346 76 93 134 240 -6 153 241 390 137 243 161 -213
2916 -213 -59 154 -149 393 163 125 185 45 212 114 99 -161 97 -83 -10 129 -372 245 9 245 17 35
2938 35 -136 -358 -326 -226 -49 -197 -23 126 46 -371 163 -1 -164 -470 -169 -74 -193 72 -232 -139 -188 -241
2960 -241 -201 -160 -198 95 -159 139 -164 9 -273 -162 -14 -125 -85 -290 -247 -309 32 -144 85 6 170 12
2982 12 41 -224 141 23 0 65 110 210 -131 140 -27 -102 118 -97 -65 221 239 -11 141 -165 -55 -70 37
3005 37 -45 29 304 -28 -198 -77 -19 26 61 120 -64 449 55 -189 -154 -285 32 -79 98 90 -2 68 143 -180
3029 -180 -102 -100 -63 -19 312 -67 32 -246 16 16 -280 206 -90 -181 -139 -76 -131 -103 60 -65 -19 241 -266 -65 104
3054 104 -230 -90 -247 86 259 252 -150 -236 3 -39 45 -66 252 348 -55 -107 127 82 -107 22 45 195 176
3077 176 5 -136 123 213 218 26 -25 241 163 157 72 -186 -48 192 355 339 18 70 93 97 79 41 119 -19 -1 -16
3103 -16 -125 -5 -89 -112 0 118 139 60 130 -5 -96 -14 -207 -33 76 -109 -87 -92 -406 -147 -227 -72 -240 -173
3127 -173 124 77 38 20 181 -161 55 -245 -176 -212 -91 56 -264 -333 -110 199 -57 -147 -22 -141 -152 -166 88
3150 88 -121 -163 110 -19 -139 -54 25 -114 -208 38 -71 -27 -22 87 -120 9 -144 -127 232 117 70 5 -30 -64
3174 -64 -99 61 -145 -17 -67 -2 88 81 88 -293 236 85 134 132 130 256 127 179 17 261 -168 -32 546 7 69
3199 69 480 347 238 305 126 58 116 32 -6 150 -221 -32 -40 118 -110 50 268 -181 -307 -192 -291 -203 -243 40
3223 40 -114 76 -280 -59 -211 -81 -15 -49 -159 -59 58 -87 261 18 -251 35 191 -75 214 -56 -118
3244 -118 -251 16 -104 46 16 -9 145 266 -196 106 -239 131 63 -3 1 -187 70 -56 -217 25 -107 64
3266 64 122 -3 68 -165 269 66 -184 145 -44 31 285 134 108 128 -80 -273 -206 71 -215 101 89 102 50
3289 50 69 -142 -50 -95 -185 -167 149 12 -93 -153 26 -161 216 138 -6 -346 -261 -247 -254 -113 -229 193 -111 103
3313 103 -223 -64 -207 -37 32 51 -61 -208 -140 -297 93 -177 -202 136 165 104 -91 33 -105 -233 -155 -96 -305
3336 -305 131 80 -31 -14 -71 18 -152 -8 123 -23 42 -171 66 29 44 51 168 12 188 104 77 136 106 65 15
3361 15 155 245 75 126 -8 192 -49 54 311 397 272 -111 267 174 13 313 168 -60 -14 -160 -22 30
3383 30 103 -102 9 -42 180 327 105 36 -166 -33 22 -213 -119 -17 112 -92 -136 -271 97 89 147 -64 -43 -20
3407 -20 11 -407 -79 -81 -70 -185 -20 177 -93 -178 191 -67 -188 -53 -14 -53 107 -45 -247 127 87 158 -322
3430 -322 164 -66 -24 -196 -217 240 21 -326 20 25 94 -37 -128 73 -235 -166 264 199 206 -42 87 -85 4 -327
3454 -327 -78 117 67 226 101 110 -15 -96 -246 -143 178 -195 -40 -140 -198 -85 -51 -187 17 210 260 -117
3476 -117 -63 -210 -87 -33 41 148 -225 56 164 60 -106 25 -58 -61 120 -207 -362 -319 84 -427 -350 -327 -56
3499 -56 162 -162 -43 -185 105 -424 -176 -158 -8 -147 -225 -141 -100 -46 -114 120 213 56 158 -182 90 96 70 -43
3523 -43 -25 115 60 349 120 -35 37 96 49 141 110 282 211 111 113 -35 -38 8 167 128 43 -40 179 61 -109 -19
3549 -19 -240 218 73 -149 -81 123 208 -54 -50 -8 207 1 232 106 -45 -133 218 -10 102 111 -97 16 -124
3572 -124 -72 -138 -53 382 252 -306 32 -166 -338 99 -23 -98 56 -116 73 138 -58 124 -220 -76 50 194
3594 194 -262 -30 156 -123 -233 170 40 96 52 35 49 184 -16 -56 16 283 -20 -162 381 70 179 -129
3616 -129 -202 31 -49 -1 394 -196 -22 -354 -76 70 -30 -205 6 301 -122 -83 -88 -126 -68 -262 92 74 -113
3639 -113 -77 104 -2 -98 -195 -246 -209 -166 162 -146 1 11 11 13 236 -77 58 -39 128 -110 -280 -25 -7 -192
3663 -192 415 -27 4 -223 -27 -186 -200 159 -55 142 -109 -71 63 -139 115 173 60 37 -208 -113 -198 88
3685 88 -288 -80 -318 -218 -84 -72 -106 -342 79 84 16 44 -56 -6 -17 -166 47 34 -92 259 -68 146 164 313
3709 313 147 185 188 -17 8 -69 119 -300 296 96 222 -61 315 54 184 26 156 458 153 190 -264 93
3731 93 138 157 -45 -75 238 79 124 123 -39 -116 8 69 215 174 -62 252 175 248 89 209 109 -143 235 149
3755 149 -7 -127 66 53 -226 -481 -1 -177 -38 -81 264 -184 -282 -124 -46 154 151 -77 37 -38 -149 -164 -131
3778 -131 -49 -196 -1 -144 42 -263 -81 -51 -167 -96 -15 322 -131 -22 69 336 230 -105 -69 -5 -212 -148 25
3801 25 -91 72 -49 129 -50 151 45 40 309 199 -202 87 -58 95 -187 -36 -29 54 164 93 48 260 2
3824 2 117 150 12 0 -68 166 17 -210 -126 -286 -231 -148 -87 -51 251 -34 -21 -15 -174 35 -203 -11 -191 -16
3848 -16 53 44 -186 -85 -45 -33 -197 142 121 259 83 -114 23 157 -102 -127 -216 159 318 25 -209 -245 21
3871 21 153 -89 23 -23 -340 -75 -64 8 -15 -18 -23 -80 -23 36 76 -8 -23 -123 107 -108 1 129 85 199 -88
3896 -88 109 -87 170 241 236 -92 -5 -125 69 142 89 5 244 201 243 -13 -12 -131 -41 266 -1 69 373 0 5
3921 5 -58 99 88 75 85 -334 -19 103 -113 -86 -278 -95 -96 160 -1 -89 -26 -116 210 -108 -84 -138 -83 163 107
3946 107 -313 62 -129 -240 -7 -71 -74 41 197 -244 146 75 141 -119 197 -28 -59 -226 -83 -96 74 -94
3968 -94 -180 -13 -96 46 17 -71 75 85 -4 -20 -13 223 -203 4 188 110 -58 72 261 53 -184 -52 -141 103
3992 103 -57 136 -11 -180 77 112 335 108 -234 132 -13 150 23 135 3 136 -134 -42 243 -13 -216
4013 -216 -237 16 -322 -98 -89 175 182 -163 43 -166 -379 -242 -25 -297 -60 158 279 74 -114 110 -195 7
4035 7 -74 -160 294 36 114 -132 -74 -88 -48 -120 -91 -165 -285 -123 -23 47 -259 -65 -223 252 -78 -103 167 31
4059 31 14 -94 14 -25 69 440 104 232 93 -134 18 -33 9 242 -321 -82 -17 116 232 -90 162 81 9
4082 9 -133 4 -99 -1 6 157 202 -174 79 285 -120 309 294 112 91 204 100 164 1 -125 231 -134 236
4105 236 -62 -10 31 -431 -198 23 240 95 163 -15 137 -89 -236 191 154 44 373 81 246 26 28 -71
4127 -71 -133 -119 -109 -135 -146 -26 -72 -162 -5 123 -70 -85 61 176 -15 59 -125 -107 -28 -147 -52 -116 21 271 -180
4152 -180 -31 -85 195 93 -188 175 73 -137 -21 10 207 68 60 -192 82 97 -137 118 -130 17 163 112
4174 112 136 181 108 -251 55 149 -18 210 167 325 204 284 142 100 -91 -149 -53 284 -240 -95 -77 125 97 -17
4198 -17 149 -35 131 105 254 -122 25 78 204 -100 162 -118 -128 37 207 80 93 -19 -200 133 18 -66
4220 -66 -189 -19 7 123 200 -228 -239 132 146 329 -72 343 -118 -111 43 120 -119 85 4 -123 86 -145 -152 42
4244 42 22 103 19 -24 -32 -184 -113 157 240 204 69 -127 54 19 66 -62 169 249 57 239 110 -23 -46 159 111
4269 111 -54 -136 -12 38 -227 110 -34 70 19 -120 159 122 -89 -301 -72 -198 -60 -52 43 15 -42 167 131
4292 131 -27 -79 -198 -350 28 -54 -126 -81 -150 87 -141 -73 -174 -116 -144 -216 -47 -94 149 16 -66 -229 193 -107
4316 -107 -21 -4 -48 -41 -56 -317 163 184 125 233 155 -78 114 285 75 127 242 116 -35 72 127 216 212 88 -219
4341 -219 167 -6 360 99 16 108 24 -50 -156 -215 -286 124 70 56 58 -53 199 -136 247 125 -39 84 81 256
4365 256 5 -125 -5 70 65 33 -26 361 57 19 -123 177 -14 30 -115 162 43 -34 -115 -96 72 -43 -165
4388 -165 -305 -84 134 -126 -176 -168 -281 -87 -235 174 -194 -13 317 415 265 -89 146 -326 123 7 9 -222
4410 -222 16 203 56 -192 -285 126 133 155 6 -109 -78 -11 -239 20 143 154 -42 37 190 -6 23 -66 60
4433 60 102 -15 -76 216 -166 -129 -121 41 -37 -216 55 113 -112 -55 -41 71 51 -15 -200 -278 251 4 174 228 -30
4458 -30 65 -41 2 -19 -81 88 153 31 -72 -212 89 29 -288 14 1 -110 -146 127 -249 -165 -90 -19 -26 -349 -104
4483 -104 -43 -100 151 50 -87 119 76 0 -414 -130 -57 -205 -173 58 -129 -260 -149 211 -47 -4 61 -166 -70
4506 -70 -131 -177 44 -15 114 30 -86 -124 43 35 -195 121 76 -118 82 -43 174 196 15 -32 21 -8 115 -95
4530 -95 -10 -246 196 78 69 366 36 146 -50 -259 -9 -4 -72 -18 -92 37 163 185 -308 -131 -183 230 -84 153
4554 153 -109 1 -174 -18 -1 -12 183 -81 -165 -245 131 -213 91 -6 -23 -60 70 163 184 -29 -49 163 12
4577 12 4 -29 8 -194 249 -26 -135 74 62 -261 -6 214 105 74 275 63 122 0 -55 224 261 10 143
4600 143 25 29 -72 -125 -115 -116 53 -30 16 79 167 -27 136 -187 286 11 -112 266 257 71 -233 469 206 58
4624 58 82 -82 139 40 143 -167 151 -155 -331 81 -101 -157 18 -16 -36 23 -64 25 103 -72 185 152 -136 -34
4648 -34 11 66 280 -61 230 -175 -102 16 -4 126 -48 182 46 -144 90 -14 -3 79 -96 -274 -191 19 92
4671 92 -156 -135 -134 -68 74 228 8 -30 -130 102 -221 70 -91 -162 -169 38 -92 -267 191 61 171 -69 -88
4694 -88 -117 17 -26 -8 -32 38 -107 55 -141 57 287 -77 60 184 -31 -34 95 126 -206 -110 229 -108 184
4717 184 229 -83 -135 -97 202 -29 -62 16 -211 -118 123 76 298 -350 -219 -138 155 92 -45 -129 43 -30 -130 29
4741 29 225 173 -43 161 10 -37 -24 54 207 19 133 -130 -18 41 88 -136 -77 147 -12 92 43 -188 36
4764 36 41 -134 -4 42 -89 -123 122 189 127 -233 235 -146 -68 -16 11 101 120 381 35 83 -36 96 22 -88 149
4789 149 -28 -115 123 80 -270 177 -232 124 -13 253 234 -186 87 237 52 70 61 256 161 -62 125 -39
4811 -39 18 -28 29 8 -27 48 -99 57 42 -163 -175 -166 -46 68 -143 41 -202 -121 30 -138 -235 130 101 106 -58
4836 -58 -173 -185 -69 -15 212 346 87 -103 -53 -9 -84 -211 27 -342 -92 211 -109 3 -165 172 -53 -100
4858 -100 -10 101 -109 -226 -82 -134 -240 -54 98 -42 310 228 -118 82 -10 -280 -94 -134 -170 172 121 233
4880 233 175 -9 132 257 131 30 46 -39 -132 -191 81 -149 -67 104 103 19 2 142 -167 -188 -19 129 -153 -250
4904 -250 -27 106 212 26 -99 -105 125 -9 -243 -30 257 13 30 -152 -307 -185 -172 -144 -264 -231 219 -109
4926 -109 -52 -115 -55 -231 147 -165 -449 -154 -69 172 218 -12 12 18 11 -199 -55 -124 -10 184 93 25 -247 -186 -359
4951 -359 156 -44 -194 -38 55 -46 122 5 -24 -137 50 -21 113 -51 91 160 138 220 -198 44 117 11
4973 11 147 5 0 17 308 -33 45 84 -12 55 77 59 204 307 147 183 -144 11 57 51 178 70 51 -31 -28 186
4999 186 -18 15 -34 196 76 225 262 -137 -14 -139 -63 -54 -186 61 -89 -128 164 18 273 95 -24 -267
5021 -267 -257 22 18 -20 231 36 70 193 168 205 -19 -253 7 81 -164 -49 -36 -133 -264 105 11 -7 -91 0 -154
5046 -154 -59 -112 112 153 96 -97 273 292 107 -69 -24 138 -190 -133 -10 192 146 -276 -285 91 58 130 193 186 -47
5071 -47 -354 -30 44 170 149 170 -61 320 -15 -86 177 207 7 -155 39 59 -125 -142 22 112 186 0 -94 -42
5095 -42 76 112 196 -339 219 9 -166 71 -25 -92 -215 181 -15 113 57 -60 -195 130 -163 22 -253 -99
5117 -99 -100 -35 -78 -98 28 27 -209 84 -91 -153 81 7 204 -141 108 -267 -24 147 1 -234 191 -143 -51 76
5141 76 -25 -40 141 197 249 22 -158 -23 20 78 34 83 58 -73 119 42 79 -184 -67 199 -3 55 102 59 14
5166 14 60 250 354 -11 -90 -32 -16 156 -47 140 -18 -96 -103 82 11 0 -246 -63 -52 180 -121 -65 151 -67
5190 -67 280 -1 19 -52 -196 -70 400 521 77 -203 -72 -378 -80 119 -40 -111 -14 -96 108 -133 36 -159
5212 -159 -7 -58 64 219 -152 -41 -3 85 -222 -94 -37 -21 199 -194 -165 -80 56 -319 36 -29 -155 -186 73
5235 73 220 26 104 27 4 47 29 205 -73 93 -91 -88 -67 128 144 127 250 -235 43 -101 -85 216 -43 -149
5259 -149 40 12 138 4 70 -58 76 -83 -226 -69 203 154 -189 -38 -191 -198 96 70 -206 286 -40 -43 -143
5282 -143 -79 39 -42 -133 -156 -108 -38 -15 -26 192 -37 128 60 246 16 -253 164 111 -112 44 -59 180 20
5305 20 -17 -9 260 96 -99 -90 -153 -178 70 259 -190 342 -28 27 -68 193 -50 11 -167 -194 215 30 -31 34 175
5330 175 -202 39 75 40 -209 107 156 250 109 90 2 169 -48 85 -298 159 -119 168 107 -62 -20 60 -20
5353 -20 195 23 200 41 106 -6 0 89 -58 44 -150 228 144 -153 125 153 -142 307 -66 -146 -93 -145 -50 188
5377 188 117 95 12 -15 -154 70 98 -128 17 -51 -10 -308 -101 -245 -27 93 -239 -264 -18 -26 2 28 -5 -157
5401 -157 -77 -3 -35 276 -58 -21 205 220 30 153 284 113 -76 125 10 -1 9 -44 255 31 121 35 33 52
5425 52 112 -186 56 141 110 170 112 161 -141 -105 105 13 -79 40 -75 24 -94 -112 -35 88 68 61 -51 34 -111 -91
5451 -91 1 11 129 13 80 139 36 -18 -116 101 272 -43 52 -62 -178 206 124 -68 -91 -41 318 104 -242 51
5475 51 192 -46 -76 150 84 -14 -9 -73 91 164 50 -317 -29 -65 152 -222 -201 118 78 51 19 -194 49 9 181
5500 181 231 103 -204 -84 122 119 -290 37 -102 -52 133 -22 79 119 -61 194 20 -14 -256 144 36 328
5522 328 20 126 23 181 100 -228 102 70 185 -6 -109 -85 12 258 121 -81 20 -53 105 76 68 105 -106
5545 -106 221 105 -107 22 -295 -47 92 -67 -86 -14 196 52 -41 -297 -85 77 -13 -13 -64 73 -106 -280
5567 -280 146 344 -74 7 -66 -40 18 -4 39 -52 -161 125 168 -233 -106 -131 -95 146 186 -159 103 363 -189 -76
5591 -76 -46 -80 -163 11 -18 -325 19 343 4 -144 -44 -118 179 -54 93 2 -251 239 -37 226 -27 270
5613 270 -230 150 98 -236 99 230 50 111 -52 -96 237 -220 -160 41 100 -58 48 -43 -359 97 40 51 -118
5636 -118 108 -48 184 -41 88 174 -55 -267 -81 223 173 -126 -332 -224 -137 -135 163 -6 57 201 -179 119
5658 119 181 58 -9 -87 -175 -21 -6 200 -48 55 -83 -82 -184 61 -278 -181 52 -238 126 155 -5 -85 -5 151
5682 151 -84 -85 -65 50 -101 269 -173 51 105 190 -96 -71 -174 -35 -113 130 -60 191 250 -160 103 -127 211
5705 211 -75 118 200 137 54 68 39 36 -25 25 -99 40 48 -53 38 -33 99 -91 54 -335 -32 -114 259 45 -131
5730 -131 121 304 106 78 -36 159 -58 22 -4 -270 -101 -294 -130 182 -298 -136 -76 -83 -85 -153 51 77 19 -269
5754 -269 -44 -118 30 122 -178 -103 23 -34 -16 65 126 -118 39 -67 -7 170 159 74 -201 38 -66 -85 61 -51
5778 -51 167 64 108 -49 -42 84 -62 8 -18 186 -145 -154 188 8 -41 -43 146 290 144 261 67 104 -82 -174
5802 -174 213 124 63 -65 206 114 -120 -131 -394 156 130 -394 191 -13 -150 -49 -132 18 202 254 117 -51
5824 -51 -25 -16 251 -217 72 178 45 -29 -97 32 -239 -293 84 -244 -181 164 -85 -230 -278 -282 -51 67 -172 49
5848 49 58 180 -170 -32 -12 -41 -103 -154 -262 -20 269 -60 10 149 36 -127 174 66 101 6 239 112 -128
5871 -128 120 -183 -51 -142 39 62 155 -146 82 51 380 -25 56 138 108 -74 10 42 32 161 175 -83 -87 58
5895 58 -102 -142 -225 143 182 82 48 -276 -92 201 -49 -89 36 -9 -346 -413 58 -89 -201 127 -143 -307 21
5918 21 -275 4 131 33 111 138 -82 -189 -452 15 -177 -138 36 111 89 -182 -105 -7 -22 -201 -8 -163 391
5941 391 -90 -284 49 68 -40 -238 147 103 -50 -30 112 147 -67 51 -179 46 -195 89 224 196 337 -67
5963 -67 191 -206 -81 -58 -6 25 232 123 374 16 10 318 -128 310 232 60 239 -33 -117 -149 -34 89 -10
5986 -10 207 55 -200 81 122 199 325 -12 49 133 40 3 56 47 -22 67 147 -96 -136 103 109 -148 147 83 57 -21
6012 -21 -255 189 -40 -32 -45 214 -130 6 -99 6 54 171 67 -1 80 63 -138 -134 31 -74 -119 -223 31 -103
6036 -103 210 -177 38 117 -34 -147 0 377 262 -92 -15 -60 46 -11 -139 0 324 126 -195 161 -102
6057 -102 125 -62 136 192 -62 182 107 -50 47 -126 -154 -74 -180 77 2 -178 -145 72 178 -126 -16 35 -106
6080 -106 -111 -59 80 36 124 16 255 50 106 64 -26 38 -32 -105 6 -111 -224 -93 19 -7 -209 -141 -184 -58 -54
6105 -54 -347 -159 -154 -65 362 40 6 -5 -119 -119 53 -20 -35 211 -6 110 -9 -93 -161 56 223 -194 -89 -45
6129 -45 240 -210 81 328 -104 -105 162 -128 51 -114 -139 102 197 130 23 545 -119 -51 -94 -342 -118 191 -51
6152 -51 135 -128 -67 -164 35 239 -51 -115 107 42 -21 -64 -76 125 -41 -40 235 80 -99 -32 227 -85 -297 48
6176 48 144 -77 -107 175 -51 139 41 24 -184 -169 -30 -40 -1 -145 -16 -110 213 -154 -71 163 6 -130 -221 -93
6200 -93 18 -39 110 -288 -34 74 107 -8 327 -14 -165 50 46 147 -170 252 109 -239 37 -19 28 180
6222 180 -150 -261 24 87 24 12 60 120 145 -171 172 73 -139 -33 -96 -33 -30 -290 206 192 -24 -16 -206 213 -177
6247 -177 153 69 71 155 37 -28 315 5 138 -151 130 99 -128 -55 -314 -125 191 185 142 85 20 -83 219 -170
6271 -170 207 -231 -13 -163 -261 268 -182 235 -106 89 247 133 -210 136 -167 247 -180 23 20 51 -92
6292 -92 -177 -132 -214 -78 -3 -220 -213 66 280 -52 -103 88 75 181 -67 -6 -129 128 -204 246 133 -206 58
6315 58 -215 113 170 -84 213 -83 28 140 -25 9 51 23 -83 209 48 -161 211 63 -47 -113 -403 192
6337 192 -138 -26 -221 -257 -85 -15 -5 285 -1 -145 65 -38 -242 -37 84 -141 -1 199 52 64 80 -163
6359 -163 42 35 309 -93 -1 120 228 165 -100 -10 -156 63 84 -5 155 151 0 -88 -42 -103 86 70 112 -104 -174
6384 -174 -160 -152 147 -76 -28 -105 75 -160 16 -182 135 -125 -52 -49 -54 127 33 -80 -86 -77 -9 -189 41 -156 -37
6409 -37 48 -255 -26 -115 -58 -44 155 -224 -151 193 206 263 -25 250 1 305 289 -29 113 -23 77 -198 -8
6432 -8 -99 -205 -332 54 243 221 169 118 -147 -13 -24 -34 3 55 204 112 99 -194 -71 -104 -86 -160 216 -4 149
6457 149 -232 256 9 -162 11 -137 -101 -79 50 182 148 123 63 -345 -39 -258 -141 -319 10 219 141 71
6479 71 -46 -4 -306 112 -181 3 81 -52 -195 -96 46 173 18 -177 -76 48 125 -49 -94 -76 143 -15
6501 -15 -167 -63 110 -69 -32 -109 61 -66 -181 329 -30 58 37 29 195 -98 37 45 12 -176 -97 68 131 106
6525 106 75 117 -48 -205 94 -139 -82 35 300 -11 178 81 281 -11 83 -90 98 137 -27 97 49 124 -229
6548 -229 -27 138 -84 93 -41 -190 18 19 -107 -6 -101 46 20 65 109 13 201 127 73 51 10 37 -250 79
6572 79 69 -88 207 -266 -255 167 -215 -188 0 314 -14 -88 454 -163 317 157 196 134 -48 -53 -81 212 -87
6595 -87 82 128 70 132 -9 133 -26 154 329 -70 253 -72 109 161 -153 51 58 -65 31 85 -32 -64 -233
6618 -233 75 -32 -112 -16 170 280 -267 119 108 -2 -123 -78 -45 -82 -56 -105 -217 30 -157 -17 -140 36 66
6641 66 20 -157 1 -369 -77 80 58 -156 -49 6 47 -72 12 54 -104 225 -175 198 36 224 -42 263
6663 263 116 22 87 46 -88 -212 14 121 33 -42 -25 190 39 67 53 135 -55 -29 1 247 100 138 61 388
6687 388 166 54 41 -176 251 256 -299 136 -37 -83 23 362 -134 128 -199 105 44 92 416 47 168 -118
6709 -118 277 -173 -113 171 -51 -125 245 40 -92 51 -42 -60 -156 142 245 21 66 -109 -80 -93 163 -123 -45
6732 -45 14 -61 84 17 161 209 -71 -166 69 -292 -183 -331 -188 -144 -24 -34 -145 131 277 -15 -11 32 -137 122
6756 122 18 -68 198 -62 -270 -184 -105 10 40 116 39 249 -78 -75 73 -110 81 -93 -163 -21 192 -201 320
6779 320 96 224 -42 -164 -171 -21 -73 93 215 -30 -50 -18 140 -102 291 170 119 -139 -189 -205 -151 136 110
6802 110 52 205 68 3 30 -100 -48 16 -44 35 -100 -257 33 -129 -47 -56 16 -364 173 -214 -199 -64 -108 200
6826 200 46 91 -118 -3 58 35 262 350 -91 4 99 153 40 136 74 131 1 -37 -382 129 -328 107 -8 -397
6850 -397 -54 314 159 -77 -108 143 235 186 52 -21 -38 39 -125 32 3 -280 104 42 -77 -107 -15 41 3 101
6874 101 -201 -138 -87 26 142 -25 -33 -44 56 -9 71 152 -109 178 207 -91 42 95 -164 -34 -83 -26 -57 1 -27
6899 -27 94 -139 307 81 -283 284 -105 -66 -121 100 -113 -179 -178 104 142 -120 -165 -36 86 58 -162 -40 -196
6922 -196 186 45 -52 92 -122 -76 -181 -78 -5 -116 -165 120 57 -33 -167 301 -17 22 -96 212 -95 343
6944 343 29 -29 34 116 -45 -279 138 -104 -161 42 69 27 -266 47 -129 379 145 81 67 -58 -34 -22 -50 65
6968 65 -136 13 71 80 254 391 43 -46 291 252 154 92 148 5 75 135 5 -62 -166 19 36 27 -68 -33 -108 -79
6994 -79 12 170 14 69 6 -101 -173 -87 12 -88 91 -27 -89 84 -40 -129 -104 -78 95 -90 -63 -34 120 -174
7018 -174 94 -31 228 89 -216 128 -131 55 -41 167 -156 -30 -39 84 -174 100 8 55 -15 36 -10 -63 -51
7041 -51 110 -123 51 -111 347 29 299 -37 -296 51 442 -69 -28 -54 52 -14 117 83 -108 58 -1 63
7063 63 -204 -150 -209 -192 115 -142 14 -195 128 96 237 -86 27 94 -201 -118 -84 43 29 -109 -124 45 -177
7086 -177 5 -74 74 196 257 87 -37 29 -151 34 102 -40 -128 276 -14 -177 58 -37 182 -57 123 -71
7108 -71 59 16 225 85 -129 49 -24 -274 -219 70 27 1 25 73 59 -93 70 27 -58 10 87 -10 -56 89 211
7133 211 -109 34 185 -128 -15 101 -50 20 8 108 254 -113 31 99 46 172 117 88 -6 140 -177 158
7155 158 -45 4 -216 112 151 159 -29 -157 59 21 -129 257 197 36 36 -38 -3 -89 45 117 172 2 -223 69
7179 69 106 170 80 -118 23 57 53 -207 334 -60 -87 -9 -254 12 119 -94 85 -21 48 107 -187 80 130 -320
7203 -320 153 -253 77 40 -108 74 140 -147 7 44 -94 -109 34 -111 2 -224 -9 -10 -156 141 -42 34
7225 34 29 185 -63 120 -170 82 181 37 -88 -8 -10 115 -99 10 16 65 299 -12 175 -142 28 -86 -212
7248 -212 242 -45 -8 -106 152 162 81 32 152 -160 217 -21 -40 -1 -7 13 -162 -18 81 -191 -127 132 -56 26
7272 26 -71 45 242 108 215 -70 -103 -312 198 -191 -152 -21 -133 -33 122 116 -298 -171 -161 -373 -129 -111 19
7295 19 235 90 -135 -69 -59 237 -125 70 -35 -121 18 -40 -133 19 -54 20 194 -116 -278 -73 -118 121 -12
7318 -12 -161 -32 -158 -13 66 60 -45 -12 -49 -133 45 38 -147 -128 -48 104 -72 17 48 0 -166 79 24 -39 101
7343 101 95 25 65 -58 184 -162 15 49 133 149 -112 -185 -208 -11 169 -19 -66 31 125 118 188 -74 -64 -190 -187 -24
7369 -24 117 -227 -248 -102 -133 -156 -65 -155 79 171 45 81 -181 -118 22 -13 -197 -35 -379 -138 -79 167 37 217
7393 217 149 176 -81 204 -36 169 116 -169 -23 -109 -78 -281 178 253 -364 111 136 -116 -81 61 -90 -44 168
7416 168 95 220 -12 -10 -63 -178 383 -256 -129 60 3 -9 -321 134 34 46 32 -13 -249 -68 -88 -140 -127 232
7440 232 -23 -16 -169 170 -84 88 -48 148 -75 -168 134 -197 100 -164 -164 165 123 23 -69 85 328 100
7462 100 -4 -120 84 -54 111 -84 201 175 113 -193 202 -11 -53 -148 189 -86 -89 116 1 -81 27 -249
7484 -249 -129 -116 254 -243 -92 112 -52 -20 -287 -94 99 -15 -108 -55 162 229 -16 111 107 -28 -144 -182 82
7507 82 73 186 210 -101 37 -64 -161 -245 127 231 114 176 -219 -178 -180 -34 -125 -52 -75 172 120 59 218 19 -74
7532 -74 -28 182 264 -105 -118 -377 -271 131 -93 -49 23 -101 75 333 123 27 78 40 -146 88 52 107 62 -25
7556 -25 222 -259 82 -55 147 102 57 -157 -115 -270 -5 229 -226 -195 -106 -344 84 -72 8 14 39 -87 -19 -267
7580 -267 -18 -37 47 -55 103 79 -139 145 -58 -125 -16 100 -45 82 25 79 74 -129 241 -17 -110 211 -115
7603 -115 91 88 130 -247 179 169 137 13 -188 -58 116 162 -120 115 -166 67 -165 92 -135 -53 -112 -15 -275
7626 -275 -129 -142 100 -34 7 -21 45 109 -78 -96 -33 -65 -27 -14 29 100 68 -195 13 53 103 -265 57 93 242
7651 242 23 192 262 -111 -159 -145 19 -41 185 -74 -447 -46 333 114 -176 -285 77 -47 -21 -83 92 64
7673 64 54 -72 13 -66 -53 -85 105 236 75 32 -80 36 -49 42 87 139 -88 -154 251 5 99 46 122 -225 70
7698 70 -209 -5 -212 -160 -11 -89 49 -187 -170 -11 -7 250 -63 19 39 -76 94 -41 108 -245 -321 -185 -181 -26
7722 -26 -30 -2 -38 3 100 -19 82 201 105 -195 -161 115 203 103 -7 195 267 3 -110 -62 93 -49 -169 92
7746 92 -353 -105 -64 74 -60 -87 19 186 80 -27 237 -287 167 54 266 66 93 -168 -246 -90 201 -25
7768 -25 43 150 151 11 27 8 9 29 101 127 -51 68 138 -14 10 -38 -30 -93 -42 43 139 -173 92 26 -274 -70 -36
7795 -36 -314 0 39 -300 172 -46 -100 -126 -42 -381 47 -114 -17 -289 191 207 -192 -4 18 181 105 -180 -36
7818 -36 -198 -14 95 -82 -341 -44 28 -366 -83 -91 164 91 -39 -3 20 -126 -25 137 40 39 121 131 2 -34
7842 -34 -86 -263 -356 180 78 -11 144 -284 -191 -110 77 19 4 96 38 39 21 149 252 82 87 -134 -75 107 95 -51
7868 -51 106 319 -163 -157 -105 -173 56 -101 138 -69 93 11 -100 -25 -59 -154 -85 257 58 -177 3 24 202 1
7892 1 45 193 162 -169 -63 -112 -96 -183 -58 -102 126 -277 -111 62 -167 -112 -215 14 317 -179 -288 -47 91
7915 91 33 119 -40 119 -164 -70 89 48 162 193 181 116 -51 -162 -99 -184 -40 117 -120 -94 0 -189 194 -52
7939 -52 -193 -70 219 -81 143 -171 -68 246 15 15 99 130 363 146 0 188 230 -34 239 -107 -131 213
7961 213 -7 30 -43 55 -161 -11 13 58 45 -15 70 -15 5 -34 -6 167 19 79 98 -91 87 -50 38 144 28
7986 28 8 -27 -54 -88 -64 -92 32 38 74 -55 -43 -114 -47 -302 134 -64 -355 -144 -139 75 -63 -111 55 38 -104 126
8012 126 -341 -72 -88 -42 314 61 -93 47 105 57 -6 -18 192 -135 -20 -140 9 126 113 -154 33 -308
8034 -308 48 78 -142 105 105 -148 100 -11 95 53 -246 87 -131 49 -138 45 75 247 -139 -125 262 -43
8056 -43 -88 199 -123 51 146 -39 -130 23 -273 -112 -246 -7 -19 -285 74 -176 -7 -5 237 120 -143 167
8078 167 127 -32 157 -39 204 47 100 -92 -14 98 10 -90 -261 -207 139 75 237 -96 56 -132 -47 81
8100 81 75 35 155 -104 -57 -149 128 54 -162 8 -156 -8 -39 -46 152 -163 61 95 54 -29 -69 181 84 -13 -89 88
8126 88 -126 236 -181 -81 16 -12 127 -218 193 -85 -120 -40 37 -136 31 0 168 -192 -118 -41 126 -417 -19
8149 -19 -353 56 232 102 -146 234 89 44 -48 -72 -296 -268 -163 -222 176 88 -247 -111 -26 79 -286 -73 177
8172 177 83 41 -170 133 192 58 278 48 417 -50 49 104 -39 -49 -131 115 -111 -134 -100
8191a00
##END NTUPLES=NMR FID
##END=
