##TITLE=1H_SR81 ASP2
 CDCl3, 8 sc, 
 31.8.2021
##JCAMPDX= 6.0         $$ Bruker NMR JCAMP-DX V2.0
##DATA TYPE= NMR FID
##DATA CLASS= NTUPLES
##ORIGIN= UXNMR, Bruker Analytische Messtechnik GmbH
##OWNER= root
$$ XWIN-NMR		Version 3.5
$$ Tue Aug 31 11:11:56 2021 Russian Standard Time (UT+4h)  she@DPX200
##.OBSERVE FREQUENCY= 200.131506
##.OBSERVE NUCLEUS= ^1H
##.DELAY= (6, 6)
##.ACQUISITION MODE= SIMULTANEOUS
##.ACQUISITION SCHEME= undefined
##.AVERAGES= 8
##.DIGITISER RES= 18
##SPECTROMETER/DATA SYSTEM= spect
##.PULSE SEQUENCE= zg30
##.SOLVENT NAME= CDCl3
##.SHIFT REFERENCE= (INTERNAL, CDCl3, 0, 15.7039)
##AUDIT TRAIL= $$ (NUMBER, WHEN, WHO, WHERE, WHAT)
$$ ##TITLE= Audit trail, XWIN-NMR		Version 3.5
$$ ##JCAMPDX= 5.01
$$ ##ORIGIN= Bruker BioSpin GmbH
$$ ##OWNER= she
$$ F:/spectra/data/she/nmr/H-F/1/audita.txt
$$ ##AUDIT TRAIL=  $$ (NUMBER, WHEN, WHO, WHERE, WHAT)
(   1,<2021-08-31 11:10:48.82 +0400>,<she>,<DPX200>,
      <created by zg, POWCHK disabled, PULCHK disabled
       configuration hash MD5:
       00 E9 B6 7A A2 85 ED C7 34 08 36 98 17 FE 4E 26
       data hash MD5: 16K
       B3 55 6E E5 98 30 A7 5A 0C 98 74 89 69 B6 9E 00>)
$$ ##END=
$$ 
$$ hash MD5
$$ E0 3D CB 43 71 BF 50 0C 76 12 23 0B 04 6E 47 D4
##$RELAX= 
##$RELAX= 
##$RELAX= 
##$RELAX= 
##$RELAX= 
##$RELAX= 
$$ Bruker specific parameters
$$ --------------------------
##$DU= <F:/spectra>
##$EXPNO= 1
##$NAME= <H-F>
##$PROCNO= 1
##$TYPE= <nmr>
##$USER= <she>
##$AMP= (0..31)
100 100 100 100 100 100 100 100 100 100 100 100 100 100 100 100 100 100 
100 100 100 100 100 100 100 100 100 100 100 100 100 100 
##$AQSEQ= 0
##$AQ_mod= 1
##$AUNM= <au_zg>
##$AUTOPOS= <>
##$BF1= 200.13
##$BF2= 200.13
##$BF3= 200.13
##$BF4= 200.13
##$BF5= 200.13
##$BF6= 200.13
##$BF7= 200.13
##$BF8= 200.13
##$BYTORDA= 1
##$CFDGTYP= 0
##$CFRGTYP= 5
##$CHEMSTR= <none>
##$CNST= (0..31)
1 1 145 1 1 1 1 1 1 1 1 1 1 1 1 1 1 1 1 1 1 1 1 1 1 1 1 1 1 1 1 1 
##$CPDPRG= <>
##$CPDPRG1= <>
##$CPDPRG2= <>
##$CPDPRG3= <>
##$CPDPRG4= <mlev>
##$CPDPRG5= <mlev>
##$CPDPRG6= <mlev>
##$CPDPRG7= <mlev>
##$CPDPRG8= <mlev>
##$CPDPRGB= <>
##$CPDPRGT= <>
##$D= (0..31)
0 1.2 0 0 0 0 0 0 0 0.06 0 0.03 0 0 0 0 0.0002 0 0 0 0 0 0 0 0 0 0 0 0 
0 0 0 
##$DATE= 1630393848
##$DBL= (0..7)
120 120 120 120 120 120 120 120 
##$DBP= (0..7)
150 150 150 150 150 150 150 150 
##$DBP07= 0
##$DBPNAM0= <>
##$DBPNAM1= <>
##$DBPNAM2= <>
##$DBPNAM3= <>
##$DBPNAM4= <>
##$DBPNAM5= <>
##$DBPNAM6= <>
##$DBPNAM7= <>
##$DBPOAL= (0..7)
0.5 0.5 0.5 0.5 0.5 0.5 0.5 0.5 
##$DBPOFFS= (0..7)
0 0 0 0 0 0 0 0 
##$DE= 6
##$DECBNUC= <off>
##$DECIM= 32
##$DECNUC= <off>
##$DECSTAT= 4
##$DIGMOD= 1
##$DIGTYP= 9
##$DL= (0..7)
0 120 120 120 120 120 120 120 
##$DP= (0..7)
150 150 150 150 150 150 150 150 
##$DP07= 0
##$DPNAME0= <>
##$DPNAME1= <>
##$DPNAME2= <>
##$DPNAME3= <>
##$DPNAME4= <>
##$DPNAME5= <>
##$DPNAME6= <>
##$DPNAME7= <>
##$DPOAL= (0..7)
0.5 0.5 0.5 0.5 0.5 0.5 0.5 0.5 
##$DPOFFS= (0..7)
0 0 0 0 0 0 0 0 
##$DQDMODE= 0
##$DR= 18
##$DS= 0
##$DSLIST= <SSSSSSSSSSSSSSS>
$$ [...]
##$SUBNAM2= <"">
##$SUBNAM3= <"">
##$SUBNAM4= <"">
##$SUBNAM5= <"">
##$SUBNAM6= <"">
##$SUBNAM7= <"">
##$SUBNAM8= <"">
##$SUBNAM9= <"">
##$SW= 20.0188882624521
##$SWIBOX= (0..15)
0 0 2 0 0 0 0 0 0 0 0 0 0 0 0 0 
##$SW_h= 4006.41025641026
##$TD= 16384
##$TD0= 1
##$TE= 0
##$TE2= 300
##$TE3= 300
##$TEG= 300
##$TL= (0..7)
0 120 120 120 120 120 120 120 
##$TP= (0..7)
150 150 150 150 150 150 150 150 
##$TP07= 0
##$TPNAME0= <>
##$TPNAME1= <>
##$TPNAME2= <>
##$TPNAME3= <>
##$TPNAME4= <>
##$TPNAME5= <>
##$TPNAME6= <>
##$TPNAME7= <>
##$TPOAL= (0..7)
0.5 0.5 0.5 0.5 0.5 0.5 0.5 0.5 
##$TPOFFS= (0..7)
0 0 0 0 0 0 0 0 
##$TUNHIN= 0
##$TUNHOUT= 0
##$TUNXOUT= 0
##$USERA1= <user>
##$USERA2= <user>
##$USERA3= <user>
##$USERA4= <user>
##$USERA5= <user>
##$V9= 5
##$VALIST= <valist>
##$VCLIST= <CCCCCCCCCCCCCCC>
##$VD= 0
##$VDLIST= <DDDDDDDDDDDDDDD>
##$VPLIST= <PPPPPPPPPPPPPPP>
##$VTLIST= <TTTTTTTTTTTTTTT>
##$WBST= 1024
##$WBSW= 4
##$XGAIN= (0..3)
0 0 0 0 
##$XL= 0
##$YL= 0
##$YMAX_a= 196559
##$YMIN_a= -178797
##$ZGOPTNS= <>
##$ZL1= 120
##$ZL2= 120
##$ZL3= 120
##$ZL4= 120
##$ABSF1= 10
##$ABSF2= 0
##$ABSG= 5
##$ABSL= 3
##$ALPHA= 0
##$AQORDER= 0
##$ASSFAC= 0
##$ASSFACI= 0
##$ASSFACX= 0
##$ASSWID= 0
##$AUNMP= <proc_1d>
##$AZFE= 0.1
##$AZFW= 0.1
##$BCFW= 1
##$BC_mod= 2
##$BYTORDP= 1
##$COROFFS= 0
##$CY= 11.3945322036743
##$DATMOD= 1
##$DC= 2
##$DFILT= <>
##$DTYPP= 0
##$F1P= 2.36226072786647
##$F2P= -0.459571619588291
##$FCOR= 0.5
##$FTSIZE= 0
##$FT_mod= 4
##$GAMMA= 1
##$GB= 0.15
##$INTBC= 1
##$INTSCL= 1
##$ISEN= 128
##$LB= 0.24
##$LEV0= 0
##$LPBIN= 0
##$MAXI= 10000
##$MC2= 0
##$MEAN= 0
##$ME_mod= 0
##$MI= 1.114404
##$NCOEF= 0
##$NC_proc= 0
##$NLEV= 6
##$NOISF1= 3.799351
##$NOISF2= 2.8
##$NSP= 1
##$NTH_PI= 0
##$NZP= 0
##$OFFSET= 15.70392
##$PC= 1
##$PHC0= -13358.22
##$PHC1= 7.80099
##$PH_mod= 1
##$PKNL= yes
##$PPARMOD= 0
##$PSCAL= 0
##$PSIGN= 0
##$REVERSE= no
##$SF= 200.130013532006
##$SI= 16384
##$SIGF1= 3
##$SIGF2= 2
##$SINO= 400
##$SIOLD= 16384
##$SREGLST= <1H.CDCl3>
##$SSB= 0
##$STSI= 0
##$STSR= 0
##$SW_p= 3612.71676300578
##$SYMM= 0
##$S_DEV= 0
##$TDeff= 0
##$TDoff= 0
##$TI= <>
##$TILT= no
##$TM1= 0
##$TM2= 0
##$TOPLEV= 0
##$USERP1= <user>
##$USERP2= <user>
##$USERP3= <user>
##$USERP4= <user>
##$USERP5= <user>
##$WDW= 1
##$XDIM= 8192
##$YMAX_p= 0
##$YMIN_p= 0
$$ End of Bruker specific parameters
$$ ---------------------------------
##NTUPLES= NMR FID
##VAR_NAME=  TIME,          FID/REAL,        FID/IMAG
##SYMBOL=    X,             R,               I
##VAR_TYPE=  INDEPENDENT,   DEPENDENT,       DEPENDENT
##VAR_FORM=  AFFN,          ASDF,            ASDF
##VAR_DIM=   8192,          8192,            8192
##UNITS=     SECONDS,       ARBITRARY UNITS, ARBITRARY UNITS
##FACTOR=    0.0002496,     1,               1
##FIRST=     0,             0,               0
##LAST=      2.0444736,     0,               0
##MIN=       0,             -178797,         0
##MAX=       2.0444736,     196559,          0
$$ Real data points
##PAGE= N=1
##DATA TABLE= (X++(R..R)), XYDATA
$$ [...]
1950C78k33r4J78m4J21j35P9j54op0MK32q3J80k99n8k28L08K3j86K37O4k64o6
$$ 378 145 51 229 185 306 171 250 96 90 20 24 256 173 353 54 -4 -232 76 99 -87 150 214 -50 -116
1974a16j27M8k69L59O6r3R7K07m86j0k15L46k30K28J7l75K58m2p7K4J85r3J74
$$ -116 -243 -195 -464 -105 -39 -132 -35 172 -314 -324 -539 -193 -423 -195 -178 -553 -295 -337 -414 -390 -205 -298 -124
1997a24l07J90j19L18k21j01Q9n3K74k16J32o4K3j77J06l8K03j15l0J43n9j97
$$ -124 -431 -241 -360 -42 -263 -364 -275 -328 -54 -270 -138 -202 -179 -356 -250 -288 -85 -200 -230 -87 -146 -343
2019c43J93Mn4P2K09j43pn4R2P7j03J37k49L04j36k06J36j24L20k51M62n36L03
$$ -343 -150 -146 -200 -128 81 -62 -69 -123 -31 46 -57 80 -169 135 -1 -207 -71 -195 125 -126 336 -200 103
2042A03r8K70l96M7K28j06p3Q1K9o9L1P9r9j53qJ37K11P6l63J24k84M17L6n1m2
$$ 103 5 275 -121 -74 154 48 -25 56 85 16 47 126 27 -126 -134 3 214 290 -73 51 -233 184 220 169 127
2067A27Q5k38k1J48j99M49k45J85k62K05j64J12q1k05M09j58L5J41l03J62j41
$$ 127 212 -26 -47 101 -98 351 106 291 29 234 70 182 101 -104 305 147 182 323 20 182 41
2088D1n3J13q7J26J23j04j03J87k14K33Op1J9k24K86p4j23L51j98Q4k71J37K7
$$ 41 -12 101 14 140 263 159 56 243 29 262 268 197 216 -8 278 204 81 432 234 318 47 184 211
2111B11o5L34m18K71k64kK91J50m46J65k09N57j87k35O8PL4k15O4j3r2o7J74J09
$$ 211 146 480 62 333 69 67 358 508 62 227 18 575 388 153 221 228 262 47 111 98 6 -61 113 222
2135B22j42P8J53m75L57Ll69J86k37Q8o1J66j78J84j50Q0l07L97j04j83K19j6
$$ 222 80 158 311 -164 193 196 -173 13 -224 -136 -197 -31 -209 -25 -175 -95 -402 -5 -109 -292 -73 -89
2157h9j93k2o0K10k60K84m8j16P3J0k93K50J1J64j48l2j99N2o8L16l50K58k26
$$ -89 -282 -304 -364 -154 -414 -130 -178 -294 -221 -211 -504 -254 -243 -79 -227 -259 -458 -406 -474 -158 -508 -250 -476
2180d76J33N1j88L35k15NK31J0K68k03k66K63k45K4J56l4L06k28O2K08k17j58
$$ -476 -343 -292 -480 -145 -360 -355 -124 -114 154 -49 -315 -52 -297 -273 -117 -151 155 -73 -11 197 -20 -178
2202a78j15j15J68M47k95K56k24j16J85K16K9k12N4N4m32M33J72k6q8k3Q5k06
$$ -178 -293 -408 -240 207 -88 168 -56 -172 13 229 258 46 100 154 -278 155 327 301 213 190 275 69
2224F9K43k08o6M1r4K40j80J21o2o8O7R8k27L41j40mk0j28O0j74K88q6R8o0l6
$$ 69 312 104 38 79 -15 225 45 166 104 36 103 201 -26 315 175 171 151 23 83 -91 197 111 209 149 113
2249A13o6j4K05k14o2L17j94N8k82K88q1R6k31J31q7J21J51j41J37l7j65j64Q6
$$ 113 47 33 238 24 -38 279 85 143 -139 149 68 164 -67 64 -23 98 249 108 245 208 43 -121 -35
2272c5J99M1P9j56K9n2j58R2J80J9K5j7k05rR4J60m36K72J06K18l69n3k10K09
$$ -35 164 205 284 128 157 105 -53 39 219 238 263 246 41 32 126 286 -150 122 228 446 77 24 -186 23
2296B3Q1L5K11j73j50n1J76P6l07L17L6j83k1o3K23k79j68K32R6l9j35J21o3r
$$ 23 104 139 350 177 27 -24 152 228 -79 238 274 91 70 7 230 -49 -217 15 111 72 -63 58 -5 -14
2320a4j0L7m1K0J09l92o3O70n61n5J4k5P2J50K52n18J24K3j57k21M27O4O6n1p5
$$ -14 -24 13 -28 -8 101 -291 -354 316 -245 -300 -286 -311 -239 -89 163 -355 -231 -208 -365 -586 -159 -95 -29 -80 -155
2345a55m3n2J72j24K25l20Q7q0j08K85j84Q5j1J09j6l47O3J51K14p4n2M8k98J10
$$ -155 -198 -250 -78 -202 23 -297 -210 -290 -398 -113 -297 -212 -223 -114 -130 -477 -414 -263 -49 -123 -175 -127 -425 -315
2369c15o7N26l76j10L37J15k04j20J45R3j11K3L75k05K57k95OJ47j85k18K66j3
$$ -315 -382 144 -232 -342 -5 110 -94 -214 -69 24 -87 -64 311 106 363 68 74 221 36 -182 84 71
2391G1p3m8J45nj93J62n3k11J26Q7q4L73j05M9j88J14l3k26K39j16L02j62q6K71
$$ 71 -2 -50 95 90 -103 59 6 -205 -79 8 -76 297 192 241 53 167 134 -92 147 31 333 171 85 356
2415C56l91J57r5K99n3R2k11k0J14K7k25L9L05l77L17j36M%q4KN7j07M3j81M12
$$ 356 -35 122 27 326 273 365 154 134 248 275 50 89 394 17 334 198 202 202 118 120 177 70 113 -68 344
2440C44j26k25M12k33r4k5K66k71j1J74k06J05O0q1P0Q6J1j6j81k32K12K24m45
$$ 344 218 -7 405 172 78 53 319 48 37 211 5 110 170 89 159 245 256 240 59 -173 39 263 -182
2463a82J32M1M2P1j36R3R0j22J42l96K20J61j91mP8N5l93L99p2Q6O0k24o9K22
$$ -182 -50 -9 33 104 -32 61 151 29 171 -225 -5 156 -35 -39 39 94 -299 100 28 114 174 -50 -119 103
2487A03k34L06k0m3j0M3k6k28L10k70j72L67J63l16L6O6l7L6l17L95k45rk51J46
$$ 103 -131 175 155 112 102 145 119 -109 201 -69 -241 126 289 -27 9 75 38 74 -243 152 -93 -102 -353 -207
2511b07O3j9K08r0J10l51L07k27R3k14K64k32m5J9J45j40k36N34j39K5O5P0o9
$$ -207 -144 -163 45 -45 65 -286 21 -206 -113 -327 -63 -295 -340 -321 -176 -316 -552 -18 -157 -132 -67 3 -66
2534f6j70k2J8L0j75J60R9N5O7k95J14j08K24k32N7J32J69l47J27J51K71j87j92
$$ -66 -236 -258 -240 -210 -385 -225 -126 -71 -4 -299 -185 -293 -69 -301 -244 -112 57 -290 -163 -12 259 72 -120
2557a20J58j81L08j15j3p8Q6J35N1j9l77M07l92J27L9N4k49M41p1k35K49j26R5
$$ -120 38 -143 165 50 37 -41 45 180 231 212 -165 242 -150 -23 16 70 -179 262 191 -44 205 79 174
2580A74k32J32j68J35J69N3o2k3j62R9O6j28l6L65O3m98J91Q9j17J93m6j63J27
$$ 174 -58 74 -94 41 210 263 201 178 16 115 181 53 17 382 445 -53 138 227 110 303 257 94 221
2603B21l0m2p6M3j35J32lL4n8j16J20j00j57N46m15J22O5j84kn6%K57j49K16j62
$$ 221 191 149 73 116 -19 113 110 144 86 -30 90 -10 -167 379 -36 86 151 -33 -35 -91 -91 166 17 233 71
2628G1N2L5o6j88o4J41r7K91j11p0rK03k07N7j83o3r4K64K17k16K22l69J93j51
$$ 71 123 158 92 -96 -160 -19 -116 175 64 -6 -15 188 -19 38 -145 -208 -302 -38 179 -37 185 -184 9 -142
2652a42L88j36m5J06q3p4l06q3K18J68q1r6m0K91r2l57K35J38q1j29J51OL43m12
$$ -142 246 110 65 171 88 14 -292 -375 -157 11 -70 -166 -206 85 -7 -364 -129 9 -72 -201 -50 -44 299 -113
2676a13Q8J02j8j17k4nj8m0j70J99lJ11j2j32L2j5l3L01j77j80K10j42j3p9K34
$$ -113 -25 77 59 -58 -82 -87 -105 -145 -315 -116 -119 -8 -20 -152 -120 -135 -168 133 -44 -224 -14 -156 -169 -248 -14
2701a4r1k2J95J3k07R6J04k59M2n4K5J72n7J22M3k58L62l68N3O7k68K19J19l8
$$ -14 -105 -127 68 81 -126 -30 74 -185 -143 -197 -172 0 -57 65 108 -150 212 -156 -103 -36 -304 -85 34 -4
2725dpK20l86J8K26p0J73n6K5k04Q9k02L55m70N37k66j7j42L7J24K40k71L9M8
$$ -4 -11 209 -177 -159 67 -3 170 114 139 -65 24 -178 177 -293 244 -22 -39 -181 -144 -20 220 -51 -12 36
2749C6J6J94r8p0Q4k59j29M37j19K41k96L18k39j04J05Q3m8j72K08j80J63J66
$$ 36 52 246 148 78 162 -97 -226 211 92 333 37 355 116 12 117 200 152 -20 188 8 171 337
2771C37k99j64K65O9kj0J27r2k26L80k72J28l03O1J37J21j72O0P1m66K88j70M93
$$ 337 38 -126 139 208 206 196 323 231 5 385 113 241 -62 -1 136 257 85 145 216 -250 38 -132 361
2794C61k64j97J08j2L13l84oJ18J05j2j21J08k72m3j28M51j87K40j69Jj1L53j61
$$ 361 97 -100 8 -4 309 -75 -81 37 142 130 9 117 -155 -198 -326 125 -62 178 9 10 -1 352 191
2817A91j39j52j57K76L0n6j81Q1J02j7Qq9J92j45o4J44j89K35q2N5K4o8J82j52
$$ 191 52 -100 -257 19 49 -7 -188 -107 -5 -22 -14 -103 89 -56 -120 24 -165 70 -12 43 67 -1 181 29
2841B9k4qj28o5K20j10L59k59J48m30M41p5M6j75J04j42J3N8L1q2l1L9k91K98
$$ 29 5 -3 -131 -196 24 -86 273 14 162 -268 173 98 144 -31 73 -69 -56 2 33 -49 -80 -41 -332 -34
2865c4M0j98K9J34n5j65L48R6k83O8k4j87K4L72l60p5J4J67O2J46j44j52K63J04
$$ -34 6 -192 -163 -29 -84 -249 99 195 -88 -20 -44 -231 -207 165 -195 -270 -256 -89 -27 119 -25 -177 86 190
2889A90l17K78k30M57o43J02K85j43r2J03j02K9J49j83O2n8J66q8N8o0k7L14j74
$$ 190 -127 151 -79 378 -265 -163 122 -21 -113 -10 -112 -83 66 -117 -55 -113 53 -35 23 -37 -64 250 76
2912G6k33K21l6O4J98j89J30k42J16n1p1R4J15n0l1J6k26K41j17L06q9r6K97m85
$$ 76 -157 64 28 92 290 101 231 -11 105 54 -17 77 192 142 111 127 -99 142 25 331 242 146 443 -42
2936d2R1l3J85n8N3j45Q6k74J45R6J54l88M53k75J12k45L43q7k1j71j17M56l65
$$ -42 49 16 201 143 196 51 137 -137 8 104 258 -130 323 48 160 -85 258 171 150 -21 -138 318 -47
2959d7k4L05j6k08k4P0k5J15j81l33K25L04j58j18J4K00k20j8J84J33k08Q2j1
$$ -47 -71 234 218 10 -14 56 31 146 -35 -368 -143 161 3 -115 -101 99 -121 -139 45 178 -30 52 41
2982D1m4j07K91k66o4K77l83K98j84j30L94j47R6k16M20k75j1Rj45J91J79j20
$$ 41 -3 -110 181 -85 -149 128 -255 43 -141 -271 123 -24 72 -144 276 1 -10 -1 -146 45 224 104
3004A04k15L27j54k49J75j20m7K52k0k75L29J15j92r6j77K12q6J40l6j97J05Q
$$ 104 -111 216 62 -187 -12 -132 -179 73 53 -222 107 222 30 -66 -243 -31 -117 23 -13 -210 -105 -97
3026i7J65j18j01J70j72K83l06L1J47k36L42J37m04O5J77n2rR9j55j92j7J5K29
$$ -97 68 -50 -151 19 -153 130 -176 -145 2 -234 108 245 -159 -94 83 31 22 121 -34 -226 -243 -228 1
3049Aj65M9L12k42k38K21J58j36rQj6Q6J90o3l34LL68R1l41L9j10J24KO2j1q8
$$ 1 -164 -115 197 -45 -283 -62 96 -40 -49 -41 -57 29 219 156 -178 -175 193 284 -57 -18 -128 -4 -2 60 49 -39
3075c9M9L04m32J46r5K32k87n7o8Q1J52N9j24J77k48M4r7N52l06Q0k06J73J45
$$ -39 10 314 -118 28 -67 165 -122 -179 -247 -166 -14 45 -79 98 -150 -106 -203 349 43 123 -83 90 235
3098B35nj29K0N7l42L87k7j46K19k05q3K08J06J58m14k5O0p4L6J25K2k65r1O5
$$ 235 230 101 121 178 -164 223 196 50 269 64 -19 189 295 453 39 14 74 0 36 161 183 -82 -173 -108
3122a08K47j2j29J78J91l12l4N9P0l03L88k60J56j47j37J57O7N0m30M77k08l6
$$ -108 139 127 -2 176 367 55 21 80 150 -153 235 -25 131 -16 -153 4 71 121 -309 168 -40 -76
3144g6K86j01j16MJ43l05M25m85K13J00k62J14k6L0O7j86L83l37L25q0j28j46
$$ -76 210 109 -7 -3 140 -165 260 -225 -12 88 -174 -60 -86 -56 11 -175 208 -129 196 116 -12 -158
3166a58J69J2M6k02P6q8J23R0K6k72P9N8k46M67l9j52rk03O4j12L73j20%q8M20
$$ -158 11 23 69 -133 -57 -145 -22 68 94 -178 -99 -41 -287 180 141 -11 -20 -223 -159 -271 102 -18 -18 -106 314
3191C14k82J6p3R6j91j14J75L4K17p9p2j16L3M3r6j25J70J13p6J09L7P1k27n7
$$ 314 32 48 -25 71 -120 -234 -59 -25 192 113 41 -75 -42 1 -95 -220 -50 63 -13 96 133 204 -23 -80
3215h0R6j4o3J34l73K08J22j64JJ89k19O5J89O1kk6Qj60Q3K16m06K02r3p5J20
$$ -80 16 2 -61 73 -300 -92 30 -134 -133 56 -163 -98 91 152 150 124 132 -28 55 271 -135 67 -26 -101 19
3240A9k88L71k27K19M9J02k84K8K9J12o4o6q6k58K95j05L53j77j74r8J45R2o1
$$ 19 -269 102 -125 94 143 245 -39 -11 18 130 66 0 -86 -344 -49 -154 199 22 -152 -250 -105 -13 -74
3263g4L89k58J9j23J59Nk09p4K58P7j91o0K00J0K5j81j23j97M46r0R3J0M0L3j12
$$ -74 315 57 76 -47 112 117 -92 -166 92 169 -22 -82 118 128 153 -28 -151 -348 98 8 101 111 151 184 72
3288G2J14j80L6j00J41r1L0j56k2J52K25j79%J35j14J00j21Q6j40P2j03q2J69
$$ 72 186 6 42 -58 83 -8 22 -134 -156 -4 221 42 42 177 63 163 42 128 -12 60 -43 -125 44
3311D4j24K77k72l2K56k09L32k31l9q2L02k87J20Lj92K54m5k55J5r0L17j68J34
$$ 44 -80 197 -75 -107 149 -60 272 41 2 -80 222 -65 55 58 -134 120 75 -180 -165 -255 62 -106 28
3334B8K1k25rL41k17K06m53M98j36j82J79j82J1M8k3k07J61Jj77L16P3k94K68
$$ 28 49 -176 -185 156 -61 145 -308 190 54 -128 51 -131 -120 -72 -95 -302 -141 -140 -317 -1 72 -222 46
3357D6j46J70k27LJ19J1J24L3j39k34O2j5J03R5k57J58p8p4N1N1q3L92l93K57
$$ 46 -100 70 -157 -154 -35 -24 100 133 -6 -240 -178 -193 -90 5 -252 -94 -172 -246 -195 -144 -227 165 -228 29
3381B9L9j29K98k54p4j81M57j45o7J10R5M9m33J98N7m3o4K45n9k21J6J2J42k48
$$ 29 68 -61 237 -17 -91 -272 185 40 -27 83 178 227 -206 -8 49 6 -58 187 128 -93 -77 -65 77 -171
3405a71K31K19k04n8j45K27K9j08N9l00J26K81j31o8o1m9O6J38pj35J78k58N4
$$ -171 60 279 75 17 -128 99 128 20 79 -221 -95 186 55 -13 -74 -123 -57 81 74 -61 117 -141 -87
3428h7R1l14K26J89R1R7l81K15j2K08m31R8K42k99R5Rr1J80j91J45J73j12k40
$$ -87 4 -310 -84 105 196 293 -88 127 115 323 -108 -10 232 -67 28 37 -54 126 -65 80 253 141 -99
3451i9k4J44l8J64Rl44L23j29q5j3J59p4j50J38N2K63k97QJ71k4N5j67R9J0Q8
$$ -99 -123 21 -17 147 156 -188 135 6 -79 -92 67 -7 -157 -19 33 296 -1 7 178 154 209 42 141 151 239
3476B39k0n9K42l71l4l7Q5p1J81j42J1J01Lr0j58M47n26P7M3L1J86Qk88J72K51
$$ 239 219 160 402 31 -3 -40 45 -26 155 13 24 125 128 38 -120 327 -199 -122 -79 -48 138 146 -142 30 281
3501B81k49J39j47j91J43n3j40K07j5j76k5L5nJ24Q6p7J14K39m19l50L29K51n2
$$ 281 32 171 24 -167 -24 -77 -217 -10 -25 -201 -226 -191 -196 -72 14 -63 51 290 -129 -479 -150 101 49
3524D9k19j46J08K24o9m04N08j66J57M3k53J16R9n4k8N1l0Rn6P3J8L5LK2k48j9
$$ 49 -170 -316 -208 16 -53 -457 51 -115 42 85 -168 -52 47 -7 -35 16 -14 -5 -61 12 30 65 68 90 -158 -177
3550a77j85L40J3l6j02J86k40K75J02l10j24K74J27J7k14O5K04k43M8Q3N2j98
$$ -177 -362 -22 -9 -45 -147 39 -201 74 176 -134 -258 16 143 160 -54 11 215 -28 20 103 155 -43
3572d3J28j89L44k83J90k86J97N5k03J63K39k02jP3J8k52q6R8L8j1J50k36J58
$$ -43 85 -104 240 -43 147 -139 58 113 -90 73 312 110 109 182 200 -52 -138 -40 -2 -13 137 -99 59
3595E9o7LK70k92K45j29k7j21lp9Q4k9pN0Qj93J73M28n23J52J14R3K7n3j91j00
$$ 59 -8 -5 265 -27 218 89 62 -59 -62 -141 -57 -86 -93 -43 -35 -228 -55 373 -150 2 116 209 236 183 -8 -108
3621a08J44j62Q0J1N4J1k68N17k45J80m30L03j30J49Q8l46J03J08j3k05L97k43
$$ -108 36 -126 -46 -35 19 30 -238 279 34 214 -216 87 -43 106 194 -152 -49 59 46 -159 238 -5
3643eJ20k51j08L25k78J52J57J92j30l84L64j52J85l59m9L07O5j47K47k70J59
$$ -5 115 -136 -244 81 -197 -45 112 304 174 -210 154 2 187 -172 -221 86 151 4 251 -19 140
3664A40j35n7J27l1j23J70r6j65L14r7J31j04k3qj2j42J69r3J13k86j08J70J39
$$ 140 5 -52 75 44 -79 91 -5 -170 144 47 178 74 51 43 31 -111 58 -35 78 -208 -316 -146 -7
3687gj55l5m0kR4J8LP7J67n8j97L8oj20K09l1o7M5J69k85J20p1J53p8j84J25J49
$$ -7 -162 -197 -237 -239 -145 -127 -124 -47 120 62 -135 -97 -103 -223 -14 -45 -112 -67 102 -183 -63 -134 19 -59 -243 -118 31
3714C1k8J66l51J22J1K5pr3o7K40j10k1J33l39M62j32j35K09l42J99K59k02K7
$$ 31 3 169 -182 -60 -49 -24 -31 -124 -191 49 -61 -82 51 -288 174 42 -93 116 -226 -27 232 30 57
3737E7l6j92L54j34N2j63K67p7j92J41J10j79J97l98J43K46k15n7K24j26J02M9
$$ 57 21 -171 183 49 101 -62 205 128 -64 77 187 8 205 -193 -50 196 -19 -76 148 22 124 173
3759A73k50J74J9r5k53K17J6J44N2r9p4L4k56L71k73J05j63J53j35J19j73J38
$$ 173 -77 97 116 21 -232 -15 1 145 197 98 24 58 -198 173 -100 5 -158 -5 -140 -21 -194 -56
3781e6p2J28nK24M5k62P3q0j2K10k80R0r6j13J15j37O3R7o4M4J64j03j34M50l48
$$ -56 -128 0 -5 219 264 2 75 -5 -17 193 -87 3 -93 -206 -91 -228 -165 -68 -132 -88 76 -27 -161 289 -59
3806e9jOp7K59j0r9J09j92j49L66k31K46k15j58J89N4j66K34p6m5J28r7o8J30
$$ -59 -60 -54 -131 128 118 19 128 -64 -213 153 -78 168 -47 -205 -16 38 -128 106 30 -15 113 16 -52 78
3830G8jj68L88k25j0o5J30M3k60J51J26k24J35m6k4j80Q4P6R2l4l5k16N17j00
$$ 78 77 -91 297 72 62 -3 127 170 -90 61 187 -37 98 52 28 -152 -68 8 100 66 31 -185 332 232
3854B32k49L13k1l68K30q1J42m37M04l30L0M7J3J62J32k25j38K59M4L1l01L19
$$ 232 -17 296 275 -93 137 56 198 -239 165 -165 -135 -88 -75 87 219 -6 -144 115 159 190 -111 208
3876B08l19J16r0J12L0N3jm7j21J2j5J70j49L63m93j06K10N1nn7j3J66j42LK99
$$ 208 -111 5 -85 27 57 110 109 62 -59 -47 -62 108 -41 322 -171 -277 -67 -16 -21 -78 -91 75 -67 -64 235
3901B35Q1m73M7J23j83K00M1J9J9l9n3J2p1j22Q3j16K4L57j41J16n1K91l50J73
$$ 235 316 -157 -110 13 -170 30 71 90 109 70 17 29 -42 -164 -81 -197 -173 184 43 159 108 399 49 222
3925B22l68J5J50j25J51j8j48q4J84J27K7k36O4J30mk36J6O0j02L08k83L24j76
$$ 222 -146 -131 19 -106 45 27 -121 -205 -21 106 133 -103 -39 91 87 -149 -133 -73 -175 133 -150 174 -2
3948bQ0j67J92j13L3q5K66p1q7r8L7J16j71J63j12J63j87j16J87K50k43L4M2j93
$$ -2 78 -89 103 -10 23 -62 204 133 46 -52 -15 101 -70 93 -19 144 -43 -159 28 278 35 69 111 -82
3972h2J06P6p1j38J9M7mRm0J14oj35K21k11l5%M9J36k04L38l58K35m7l4j14j8
$$ -82 24 100 29 -109 -90 -43 -47 -38 -78 36 30 -105 116 -95 -130 -130 -81 55 -149 189 -169 66 19 -15 -129 -147
3998a47J5O2J22N4j94kj18K57qj90N2N3o0J1M04l76k48J31N3J92n4q6o3L46j28
$$ -147 -132 -70 52 106 -88 -90 -208 49 41 -149 -97 -44 -104 -93 311 -65 -313 -182 -129 63 9 -77 -140 206 78
4023G8K1j66J10q1Q3j58J2j08L79j93K55k18j40m5M9J42k11L71m82L28L20k94
$$ 78 99 -67 43 -38 45 -113 -101 -209 170 -23 232 14 -126 -171 -122 20 -191 180 -302 26 346 52
4045E2l3K9j84J70j36J88m74L00L1p6K17jj36j16J15Q5j14P6k4j87L60j53j15
$$ 52 19 48 -136 34 -102 86 -388 -88 -57 -133 84 83 -53 -169 -54 31 -83 -7 -31 -218 142 -11 -126
4068a26l3J77k94L48k70N0J17J58j46j53L04l6j04l8m0M3K9M3J37j42j01K52R7
$$ -126 -159 18 -276 72 -198 -148 -31 127 -19 -172 132 96 -8 -46 -86 -43 -14 29 166 24 -77 175 272
4091B72j43j91j84K50Omq8J69r9M3j22K3L7L0J95j1m5j27Q4j45j2j07L74j69l5
$$ 272 129 -62 -246 4 10 6 -82 87 -12 31 -91 -68 -31 -1 194 183 138 11 95 -50 -62 -169 205 36 1
4116AJ47l10J92J52m8JM7r8j51l2K93m39J75R0K2L5k84J55o6K48j47M1n4K16j92
$$ 1 148 -162 30 182 134 135 182 84 -67 -99 194 -245 -70 20 42 77 -207 -52 -118 130 -17 24 -30 186 -6
4141fq3M57k65O6o5q4J03l43M1J34R7J31l97QJ36j34L93j47OJ8k70J76L59l79
$$ -6 -89 368 103 169 104 20 123 -220 -179 -45 52 183 -214 -206 -70 -204 189 42 48 66 -204 -28 331 -48
4165d8l5L06k04p9j4o7k10L71k59L60k07M0mk52L11k52K15j35M25q1j9k61l8O2
$$ -48 -83 223 19 -60 -74 -141 -351 20 -239 121 -86 -46 -50 -302 9 -243 -28 -163 262 181 162 -99 -137 -75
4189g5J66j97L71l49k6J31J56j34r2J17P4m13J78J84O3Lj23N8j82K05j07j95M85
$$ -75 91 -106 265 -84 -110 21 177 43 -49 68 142 -271 -93 91 154 157 34 92 -90 115 8 -187 298
4212B98l59J7K00m4K26r4r8k12J61j07k21J01k1p2R9L3m0K32R8p2p7j13J2k25
$$ 298 -61 -44 156 112 338 244 146 -66 95 -12 -233 -132 -153 -225 -126 -93 -133 99 197 125 48 -65 -53 -278
4236b78K55n8P1J52k46J21O5j83l4J02o8J96q8n9l5J24o6K78l65J4L27k42R3k46
$$ -278 -23 -81 -10 142 -104 17 82 -101 -135 -33 -101 95 7 -52 -87 37 -29 249 -116 -102 225 -17 76 -170
4260a70K72J23j08j56%j57M81l81J7K3P8%K90m70J78m5m0K52j45K85k88j07L4
$$ -170 102 225 117 -39 -39 -196 285 -96 -79 -56 22 22 312 -158 20 -25 -65 187 42 327 39 -68 -34
4283c4K19l51R0RK3q6n5o5L46j68O0o0L34p9k46j8K54j83L08l19j63K58qk34J83
$$ -34 185 -166 -76 -67 -44 -130 -185 -250 96 -72 -12 -72 262 183 -63 -81 173 -10 298 -21 -184 74 66 -168 15
4308A5j37pM01k53O3j35P3L06k74J68m01K74k77K93l02K71k42J06M48l52L5j25
$$ 15 -122 -129 272 19 82 -53 20 326 52 220 -181 93 -184 109 -193 78 -164 -58 390 38 73 -52
4330e2J7J81l82K44O7j27K29j09k87L30l34q5N04k14M7K6L6L14n08J26j42Q4j1
$$ -52 -35 146 -236 8 75 -52 177 68 -219 111 -223 -308 196 -18 29 55 91 405 -103 23 -119 -35 -46
4353d6O4j72J02Q4O1qj05q0K24O3j24J6k55K04j18O1O0r3J66k65J90j16J36qJ52
$$ -46 18 -154 -52 32 93 85 -20 -100 124 187 63 79 -176 28 -90 -29 31 -62 104 -161 29 -87 49 41 193
4378A93Kl66J78R3J38l22n5KQ4jR4O9j76N3J4l8O2k07J69N8L2m2K1j66L59l54
$$ 193 195 -171 7 100 238 -84 -139 -137 -53 -54 40 109 -67 -14 0 -38 24 -183 -14 44 76 34 55 -111 248 -106
4404a06K16l4j3j8r2k20M29j50N3k52j18M06k76K18k22K24J87o7m3j83j62L70
$$ -106 110 76 63 45 -47 -267 162 12 65 -187 -305 101 -175 43 -179 45 232 165 122 -61 -223 147
4426A47k39k3J9O0j02N8K10j88m9K6N3j74p1R3R1J50q9j25K40l3P3k51o4K88k15
$$ 147 -92 -115 -96 -36 -138 -80 130 -58 -107 -81 -28 -202 -273 -180 -89 61 -28 -153 87 54 127 -124 -188 100 -115
4451a15L24j16k99K47l28K01jj18M89l07J84j75N6j16K26j16lm8Q0j16j99M56
$$ -115 209 93 -206 41 -287 -86 -87 -205 284 -23 161 -14 42 -74 152 36 33 -15 65 -51 -250 206
4473B06k5k06J61j45p4j26M2K04r7J07J07p1J59j51q8m0J32q0Q2k21J13L9J3O8
$$ 206 181 -25 136 -9 -83 -209 -167 37 -60 47 154 83 242 91 3 -37 95 15 97 -124 -11 28 41 109
4497A09j07j95M5j33J6L12j43K36N4k40K72l13Q1J72j50J39k63n8J41o6J90J13
$$ 109 2 -193 -148 -281 -265 47 -96 140 194 -46 226 -87 -6 166 16 155 -108 -166 -25 -91 99 212
4519B12j28k11oJ86M4J73j27m0J00l15O1m0k77n4K63M27m08K5j66O4N08k61o7
$$ 212 84 -127 -133 53 97 270 143 103 203 -112 -51 -91 -368 -422 -159 268 -140 -115 -281 -217 291 30 -37
4542c7K5%j03K63j42j16J2R1n6k60L44K45j72k05J8J45J7lj62K77rJ50J12l15
$$ -37 -12 -12 -115 148 6 -110 -98 -7 -63 -323 21 266 94 -111 -93 52 69 66 -96 181 172 322 434 119
4566A19Oo6M5j3l60K98j44o1M50l60K06j76R8j16K31j04K06k14J9J14q2N6o0k09
$$ 119 125 59 104 91 -269 29 -115 -176 274 -86 120 -56 42 -74 157 53 259 45 64 178 96 152 92 -117
4590a17J9Q6j81N5q6K26m2R5j38j8P4O2j62K58k72j68L59m9o9N9J38k51J86L5
$$ -117 -98 -12 -193 -138 -224 2 -40 55 -83 -101 -27 35 -127 131 -141 -309 50 1 -68 -9 129 -122 64 99
4614I9k51K45k28J74J56r2j91L62m60P6K73J34p5r7k21o7L06j94n32O52K36k20
$$ 99 -152 93 -135 39 195 103 -88 274 -186 -110 163 297 222 125 -96 -163 143 -51 -583 69 305 85
4636H5j48M7K5K2m6L6M6j98J2L23j87O4M1j69K54k04j12K79l62L81j23K10j94
$$ 85 -63 -16 9 31 -15 21 67 -131 -119 204 17 81 122 -47 207 3 -109 170 -192 189 66 276 82
4659H2k13K34j45O6k3nj5N8J45k19m2J80O6N8j97K13n56O06k29R0k62K30k58K23
$$ 82 -131 103 -42 24 1 -4 -19 39 184 -35 -77 103 169 227 30 243 -313 293 64 154 -108 122 -136 87
4683H7k52L28p7j99J14J17l56L17k95J12j24K62k15J49j3Q5O1j78J43j02o5j32
$$ 87 -165 163 86 -113 1 118 -238 79 -216 -104 -228 34 -181 -32 -45 40 101 -77 66 -36 -101 -233
4705b33K28j26j12r4K68L42l66o3M50n00O8K60o3m89L64j6L59k88o9K21l60L09
$$ -233 -5 -131 -243 -337 -69 273 -93 -156 294 -206 -138 122 59 -430 -66 -82 277 -11 -80 141 -219 90
4727I0O2j52k00K68j28n4M03k97J9k05J41K0r2J28K7M2j33O3J57L5l97J44N06
$$ 90 152 0 -200 68 -60 -114 289 -8 11 -194 -53 -33 -125 3 30 72 -61 2 159 194 -203 -59 447
4750D47o37J03J61k38J04q4J37O0l4J23N2l78M6J15M6k54L61j18J21l4N4j03j93
$$ 447 -190 -87 74 -164 -60 -144 -7 53 19 142 194 -184 -138 -23 23 -231 130 12 133 99 153 50 -143
4773a43J59qJ61jj10o2j06L65j86O3M6l60K62j92j4J13k15J87J4N0k6K69n3k57
$$ -143 16 8 169 168 58 -4 -110 255 69 132 178 -182 80 -112 -126 -13 -228 -41 -27 23 -3 266 213 -44
4797d4O5P7j28J13j3n2k80L64k40Q4O7L3J06K1l5k03K41j56Np1J86k15J08o2%
$$ -44 21 98 -30 83 70 18 -262 102 -138 -54 13 46 152 173 138 -65 176 20 25 -46 140 -75 33 -29 -29
4822b9J4n5Q3q1Q9q9Q7j33L53l94K51q0J20r8O8R3kl6k50J90Q8j54O9k72K62J0
$$ -29 -15 -70 13 -68 21 -68 19 -114 239 -155 96 16 136 38 106 199 197 161 -89 101 189 35 104 -168 94 104
4848A04N4l4K1j4j79J44o2o3K00k00k30K94j3k5J03l8j36J56p5J6K5k63L34k75
$$ 104 158 124 145 131 -48 96 34 -29 171 -29 -259 35 22 -3 100 62 -74 82 7 23 48 -215 119 -156
4872a56R4J13j75L08k00J67k95L64k67j73K37P9lp6j52j89J72k6L26J30k59j18
$$ -156 -62 51 -124 184 -16 151 -144 220 -47 -220 17 96 93 17 -135 -324 -152 -178 148 278 19 -99
4894i9J82k98K01k48J85J8k8J46j65L02j36O7j15M4k05J22p8Qr2J65j33J65Mn0
$$ -99 83 -215 -14 -262 -77 -59 -87 59 -106 196 60 127 12 56 -149 -27 -105 -97 -189 -24 -157 8 12 -38
4918c8j74L81j36N7k4J4o9q9K81m91L04k8O0j0j66n1K72L7n0j2J5q3l67K82j89
$$ -38 -212 169 33 90 66 80 11 -78 203 -288 16 -12 48 38 -128 -179 93 130 80 68 83 0 -367 -85 -274
4943b74K88n1J28J35j62k05r2K69j91L55k54J00l23Q5k9K42n7J87n5pk17M1K03
$$ -274 14 -37 91 226 64 -141 -233 36 -155 200 -54 46 -277 -192 -221 21 -36 151 96 89 -128 -87 116
4966A16m8k19K26P3Q4j60l09J22K9J71j68J09m2j33J44K40k91j42J07P6L2p6L5
$$ 116 68 -151 75 148 232 72 -237 -115 -86 85 -83 26 -16 -149 -5 235 -56 -198 -91 -15 17 -59 -24
4989b4q7K13n5J39n63K22K40K1P2m60K10J80j75K09J08j22o5j59K11j59q3M14
$$ -24 -111 102 47 186 -377 -155 85 106 178 -282 -72 108 -67 142 250 128 63 -96 115 -44 -127 287
5011B87o4j62l23N53l21KJ43q8M7o0rL4M0O7j64J47k84J03J50k7j56jr4J09L5
$$ 287 223 61 -262 291 -30 -28 115 27 74 14 5 39 79 146 -18 129 -155 -52 98 71 -85 -86 -180 -71 -36
5036c6k19L18l88N91n51R9K94m7m2j12l6L37j04J23k84K89k91k1k2K45j34q1J00
$$ -36 -255 63 -325 266 -285 -186 108 61 19 -93 -129 208 104 227 -57 232 -59 -80 -102 143 9 -72 28
5059B8j28K40l8J25m05L4K41j51j60L06k17J96L3J35m47K34M9l0o0L52k38k4j62
$$ 28 -100 140 102 227 -178 -144 97 -54 -214 92 -125 71 104 239 -208 26 75 45 -15 337 99 75 -87
5082h7M6k61K61m9j05J38r4J73l8N6l26K00J06k76L74J5m57M33k32J72j89J93
$$ -87 -41 -302 -41 -90 -195 -57 -151 22 -16 40 -286 -86 20 -256 118 133 -324 109 -123 49 -140 53
5104E3J41R9j83Q1j6j63j14J91Q2k31M19m87Q2n4L27l27K15J10m60R4%K64l03
$$ 53 194 293 110 191 175 12 -102 89 171 -60 359 -128 -46 -100 227 -100 115 225 -235 -141 -141 123 -180
5127a80M68k89K4L5q3J36j05J22j06J51j74l29L59p3J03k73K68l3o1r6M7J14J1
$$ -180 288 -1 23 58 -25 111 6 128 22 173 -1 -330 29 -44 59 -214 54 21 -40 -136 -89 25 36
5150C6l65L39J19j5l43n9M95m96L56m2j75J51l20K9K32Q1j9k7j54P0J0J87J46
$$ 36 -329 10 129 114 -229 -288 207 -289 67 25 -150 1 -319 -290 -58 23 4 -23 -177 -107 -97 90 236
5173B36J2l15M31l36r1l4J55kk39J47K76O5k19m5K06k89j27J33K19j02Q0q5p9
$$ 236 248 -67 364 28 -63 -97 58 56 -183 -36 240 305 86 41 247 -42 -169 -36 183 81 161 76 -3
5196cn2Q1j7O3j09j64K93l7n0NP0j04kOM8j41Q4K3m0K30j67K20k6k72R7j32J70
$$ -3 -55 26 9 72 -37 -201 92 55 5 10 80 -24 -26 -20 28 -113 -29 -6 -46 184 17 237 211 -61 36 -96 74
5223G4j59K30O2J46m63J04P7j01J05q9o7J74J11k21J0p7K59J91m59J45k29K56
$$ 74 -85 145 207 353 -110 -6 71 -30 75 -14 -81 93 204 -17 -7 -84 175 366 -93 52 -177 79
5245G9P2j19j34j64K82P5L1L4o3O2j01JQ2j5J23l22Qo7J51J20k21m6M02k25l3
$$ 79 151 32 -102 -266 16 91 122 156 93 155 54 55 137 122 245 -77 -69 -136 15 135 -86 -132 270 45 12
5270A2j89J08J93k44K8K0J23K91l06KK7J67k24J25J33k55O7k13P9N6R9k57Q6Q3
$$ 12 -177 -69 124 -120 -92 -72 51 342 36 38 65 232 8 133 266 11 78 -135 -56 0 99 -158 -72 11
5294A1l6k0R2k91J70j6J45Q6k24L07k93J93M3j52k25J24nK31j90M77m35j36J73
$$ 11 -25 -45 47 -244 -74 -90 55 141 -83 224 -69 124 167 15 -210 -86 -91 140 -50 427 -8 -144 29
5317B9jM6p0j55J10L73m41M7j12J68Q2m50M67r3k07L13l49J02L6J90R8j88j18
$$ 29 28 74 4 -151 -41 332 -109 -62 -174 -6 76 -374 93 0 -207 106 -243 -141 -105 85 183 -5 -123
5340a23K08j35Ok04K82J52k45q3K35k32m9K3J79l4M0J97R8m45O1J81k85J92n6
$$ -123 85 -50 -44 -248 34 186 -59 -142 93 -139 -188 -165 14 -20 20 217 315 -130 -69 112 -173 19 -37
5363c7r6J56m61L21L63m03K38p5R3o5J42l31L50qq1P2m27K26M6k48K61L3j18j8
$$ -37 -133 23 -438 -117 246 -157 81 6 99 34 176 -155 195 187 106 178 -249 -23 23 -225 36 69 -49 -67
5387f7mQ3r8N6J38R3k22Q5j50l2K7J55J28n43L67r5J01q8l1k5J53J06j66M5J7
$$ -67 -71 12 -86 -30 108 201 -21 64 -86 -118 -91 64 192 -351 16 -79 22 -66 -97 -122 31 137 -29 16 33
5412C3k53L15Pj69l4k21L8J56J2j15Oj0M03j93j74L93J7j16j75j63M7j13L32j26
$$ 33 -220 95 102 -67 -101 -322 -284 -128 -116 -231 -225 -235 168 -25 -199 194 211 95 -80 -243 -196 -309 23 -103
5436a03J66o8K5Q8j39J40n6kk51L90j61j30K29N5O0j41m30O34j99Ln4J35q7j04
$$ -103 63 -5 20 108 -31 109 53 51 -200 190 29 -101 128 183 243 102 -328 306 107 110 56 191 104 0
5460@K32m33J27k22L22R9k31J30l9j6L15l04J80p6Q3k42k9J90k3J69k80j36L28
$$ 0 232 -201 -74 -296 26 125 -106 24 -15 -31 284 -20 160 84 167 -75 -104 86 63 232 -48 -184 144
5483A44n2n6j50p5M34j97O5j42L7K23k86L98m59m2LQ2K5j68L5P2p9OJ41j65J10
$$ 144 92 36 -114 -189 245 48 113 -29 8 231 -55 343 -116 -158 -155 -73 -48 -216 -181 -109 -188 -182 -41 -206 -96
5508i6L24j74r4k31K74J04l6J36R0l44J17jl72K10L95n43K12K95m79M54m05J14
$$ -96 228 54 -40 -271 3 107 71 207 297 -47 70 69 -303 -93 302 -241 -29 266 -213 241 -164 -50
5530e0l9O7l2j79l6M33j63l81K80P3O0J26p0J11K05m75J59j64r6J61K66m06J06
$$ -50 -89 -22 -54 -233 -269 164 1 -380 -100 -27 33 159 89 200 405 -70 89 -75 -171 -10 256 -150 -44
5553d4P5J77J82l53K63l14J27l1R0j72L4NJ6j08lK12j09j16J94N2j87O1l2K86
$$ -44 31 208 390 37 300 -14 113 82 172 0 34 39 55 -53 -56 156 47 -69 125 177 -10 51 19 305
5577C05k93O6j66J99K8K3J65m50R9j21M9R8m4r2Rm8j73J07K43j26j28R0K20M6
$$ 305 12 78 -88 111 139 162 327 -123 -24 -145 -96 2 -42 -134 -125 -173 -346 -239 4 -122 -250 -160 60 106
5601A06j25k45J34q5K22K1K2Kl15K99j17j15L17l20L49j91O6p0J45J35n42L43
$$ 106 -19 -264 -130 -215 7 28 50 52 -263 36 -81 -196 121 -199 150 -41 25 -45 100 235 -307 36
5623C6K81k75J14k19J34l39J41K19q9j7O3j45M3J80k03K41q3N5K24k40P3q1m9
$$ 36 317 42 156 -63 71 -268 -127 92 3 -14 49 -96 -53 127 -76 165 82 137 361 121 194 113 64
5646F4j79K23j4M7k14q5K25P8k61K21p4j0K89l49R2K15k48p2Q8r5J87m4J81l82
$$ 64 -115 108 94 141 -73 -158 67 145 -116 105 31 21 310 -39 53 268 20 -52 36 -59 128 84 265 -117
5670a17K09k99L1J05P6j55j1J69j65j8K18L4P5m05J67n1K15k44K25m4M4R0j20
$$ -117 92 -207 -176 -71 5 -150 -161 8 -157 -175 43 77 152 -253 -86 -137 78 -166 59 15 59 149 29
5693B9J14l95J54K23k24j41L67k76J66pJ98k29K18j80k39K67K68q8k15N5j51K40
$$ 29 143 -252 -98 125 -99 -240 127 -149 17 10 208 -21 197 17 -222 45 313 225 10 65 -86 154
5715A54m5j61NK14l57J15m3O8K45K0m29K60L5J75j02j39j21L9J50j54Mk4J50j4
$$ 154 109 -52 -47 167 -190 -75 -118 -50 195 215 -214 46 81 256 154 15 -106 -67 83 -71 -67 -91 59 45
5739D5K47k95l7n2k47M45k20k4K42K3r4L3k18J64K46k55Nj86K32L05l56k45J92
$$ 45 292 -3 -40 -92 -339 106 -114 -138 104 127 33 66 -152 12 258 3 8 -178 54 359 3 -242 -50
5762e0K12l18L1k3P0j85K58J85j56j38p1rP1N19k05k75J00k31J13K29k62Q4J18
$$ -50 162 -156 -125 -148 -78 -263 -5 180 24 -114 -185 -194 -123 396 191 -84 16 -215 -102 127 -135 -51 67
5785F7j12j37M26M0k18k11O4O7M8m0J10r8J24r2j7m5k59J06K53j62l3l2L69k36
$$ 67 -45 -182 244 284 66 -145 -81 -14 34 -6 104 6 130 38 21 -24 -283 -177 76 -86 -119 -151 218 -18
5809a8n6J05J82k57K81k38Q7k09J53K12k74J81k68J47K2p2j41K20k1j86J47Q0
$$ -18 -74 31 213 -44 237 -1 86 -123 30 242 -32 149 -119 28 50 -22 -163 57 36 -150 -3 77
5831G7M7l66J54Pj37J84R1j62M10k75J14J5m25K07J14J43m10J24Q6J20Pj71P1
$$ 77 124 -242 -88 -81 -218 -34 57 -105 305 30 144 159 -266 -59 55 198 -212 -88 -2 118 125 -46 25
5854B5p3j24J32q7M5K76k10n2R3J49j62r7M4Q4j9j8j55PK1lk27L51K28m57L51
$$ 25 -48 -172 -40 -127 -82 194 -16 -68 25 174 12 -85 -41 43 24 6 -149 -142 -121 -124 -351 0 228 -229 122
5879A22l8N7J3k51J5J72j73J52Q7j46p1n7K94k43q8K6M6J60O2J02k76L82j84M2
$$ 122 84 141 154 -97 -82 90 -83 69 156 10 -61 -118 176 -67 -155 -129 -83 77 139 241 -35 347 163 205
5903B05l1m4P2j92J72q3n2j10R4K5J2Q0k11n0J94J05n1j9r0n4j76K38p2M8k05
$$ 205 174 130 202 10 182 99 47 -63 31 56 68 148 -63 -113 81 186 135 116 26 -28 -204 34 -38 10 -195
5928a95L33j12n8Q2j69R0K26k94P9M7j69L05o5j41m31M72Q5j69K08r9j93L01m
$$ -195 138 26 -32 50 -119 -29 197 -97 -18 29 -140 165 100 -41 -472 0 85 -84 124 25 -168 133 129
5951A29k49O7Q4j32J97j88KO2Rpo6K46n7j51L07q8J34m70O8J04JK41j15j67L5
$$ 129 -120 -53 31 -101 96 -92 -90 -28 -19 -26 -92 154 97 -54 253 165 299 -171 -103 1 2 243 128 -39 -4
5976dN6k48K07L9j20N0J74o1J36m53K49K1N5L4j01n8Qk2oj24J95K26j59q4K3k60
$$ -4 52 -196 11 50 -70 -20 154 93 229 -224 25 46 101 135 34 -24 -16 -38 -44 -168 27 253 94 10 33 -227
6002b27M51j44q6p4J22lj40o3O2J41p7J87K27k72nk56M36M2j96k55r7L87p1j31
$$ -227 224 80 -6 -80 42 39 -101 -164 -102 39 -38 149 376 104 99 -157 279 321 125 -130 -227 160 89 -42
6026d2J05j03Q3Q2m32L07j36jk3Q6j36K70l4p3k3M3J80l97J66k9N63n02K25j15
$$ -42 63 -40 43 125 -307 0 -136 -137 -160 -74 -210 60 26 -47 -70 -27 153 -244 -78 -107 456 -46 179 64
6050F4K9k10J28k02J85J45j76J41J7q2l14K51L3N8J48k57RN9J1k42J50J38j09
$$ 64 93 -117 11 -191 -6 139 -37 104 121 39 -275 -24 9 67 215 -42 -33 26 37 -205 -55 83 -26
6073b6oK50k63K70k18r6J38rj84J90M8m1m1j8M0k42J90m0ML65k17m60M79l6k9
$$ -26 -32 218 -45 225 7 -89 49 40 -144 46 94 53 12 -6 34 -208 -18 -58 -54 311 94 -366 113 77 48
6098D8n9J22l37K86K8J19j23QoR6r3k34K36j56l9j07j1K70j58J69m8j25N5M9p6
$$ 48 -11 111 -226 60 88 207 84 92 86 182 89 -145 91 -65 -104 -211 -222 48 -110 59 11 -114 -59 -10 -86
6123h6j68K37K2k21K42j7j06J96k86J91n1k8K01j83j51J2J1J21O9M7l15r8M02
$$ -86 -254 -17 5 -216 26 9 -97 99 -187 4 -47 -75 126 -57 -208 -196 -185 -64 5 52 -263 -361 41
6146D1l38J91mj7K51l76N9K64k81K51l76K14K41k66K73j31k44J65K75j72J36k26
$$ 41 -297 -106 -110 -127 124 -252 -193 71 -210 41 -335 -121 120 -146 127 -4 -248 -83 192 20 156 -70
6168g0K32m22K95mm6j87K62l28J34o9K04j11P0L0R5J07l36K71n8k7k31J99Q1r5
$$ -70 162 -260 35 31 -15 -202 60 -268 -134 -203 1 -110 -40 -10 85 192 -144 127 69 42 -189 10 91 -4
6192dO7J23p2m1k7j47j19K62Q2j33n5j09J73j33k10J40J96O0k47J65rk01K25j51
$$ -4 63 186 114 73 46 -101 -220 42 124 -9 -64 -173 0 -133 -343 -203 -7 53 -194 -29 -38 -239 -14 -165
6216a65K1K8j9L33q8j64k23K20K22q0RJ02n4j21N3n4jj30j5J33J40m00K77k06
$$ -165 -144 -116 -135 198 110 -54 -277 -57 165 85 94 196 142 21 74 20 19 -111 -126 7 147 -253 24 -182
6240a82J19J37k05K88j06J68k07O7K70K2n00j31M14kk20R9J30j17k59L21O2m7
$$ -182 -63 74 -131 157 51 219 12 79 349 371 -129 -260 154 152 -68 31 161 44 -215 106 168 121
6262A21l3K59k82k9m6R5J6j70J93p4p2r2N9J02J12k31J28j55J48J11p3R0M6k01
$$ 121 88 347 65 36 -10 85 101 -69 124 50 -22 -114 -55 47 159 -72 56 -99 49 160 87 177 223 22
6286B2K6n6J0Q4j33k7R2J19m4r4r7r4K49J24l06J46j20K34kj06J0J4k17J54K8
$$ 22 48 -8 2 86 -47 -74 18 137 93 -1 -98 -192 57 181 -125 21 -99 135 133 27 37 51 -166 -12 16
6311A6j10l8K3O0Q4m5l3M7k5j09J8K04j62K50l14J34m5R0Q6m5j89K05J04q1j42
$$ 16 -94 -132 -109 -49 35 -10 -43 4 -21 -130 -112 92 -70 180 -134 0 -45 45 131 86 -103 102 206 125 -17
6336a7N5J25j07l13L48qm2p1k01J14J84k24J52j14K71j68j03M77n83K89j14j60
$$ -17 38 163 56 -257 91 83 41 -30 -231 -117 67 -157 -5 -119 152 -16 -119 358 -225 64 -50 -210
6358b10L82k54L19j95j93J7L8K37j82J02L9j35K41l25j1K07P8k07N2K09k71L02
$$ -210 172 -82 237 42 -151 -134 -96 141 -41 61 100 -35 206 -119 -130 77 155 -52 0 209 -62 240
6380B40j73J27j66on4P6Q5j04J1j19J21Lk81K85k42Q2o0K24o4o7K7J2J74l20K66
$$ 240 67 194 28 22 -32 44 129 25 36 -83 38 41 -240 45 -197 -115 -175 49 -15 -82 -55 -43 131 -189 77
6405G7p5m5J89j26lj06K55j65J98k93K05j42O0J1%k05J88Q0R2k58L40l9r4k76
$$ 77 2 -43 146 20 17 -89 166 1 199 -94 111 -31 29 40 40 -165 23 103 195 -63 277 238 144 -132
6429a32O4Q2P6j15J53m0j30K39m71N99m67L34j23k4q8J77j96j51L5j20L01k5q
$$ -132 -68 14 90 -25 128 88 -42 197 -274 325 -142 192 69 45 -43 134 -62 -213 -178 -298 3 -22 -30
6452c0Q7j36L11k04j82O9J36p4J52N1k47J85k49J46p0J38j22q9K39J85j59j83
$$ -30 57 -79 232 28 -154 -85 51 -23 129 180 -67 118 -131 15 -55 83 -39 -128 111 296 137 -46
6474d6l74O60k94K16l44J07m5L38j03l09K40k22K42j95K6j37k4K6O7LJ77l1m0
$$ -46 -420 240 -54 162 -182 -75 -120 218 115 -194 46 -176 66 -129 -103 -240 -264 -238 -171 -168 9 -22 -62
6497f2N1j36j1K28N8k62N8J17j9j32J28j80J89Jp6J28j10J01l0k5j41l46N24k46
$$ -62 -11 -147 -158 70 128 -134 -76 41 22 -110 18 -162 27 28 -48 80 -30 71 41 16 -125 -471 53 -193
6521a93K36J29k54R8k09P6K04Q4k15Rj0q2K96r4j87Q1k4k31K61J15k31k1L59m14
$$ -193 43 172 -82 16 -193 -117 87 171 -44 -35 -45 -127 169 75 -112 -31 -55 -286 -25 90 -141 -162 197 -217
6545b17J67K79k80LK44j18Pk67L27j80N7j63J55m1m7R3m5J64j31J3j02Q4J04k24
$$ -217 -50 229 -51 -48 196 78 85 -182 145 -35 22 -141 14 -27 -74 19 -26 138 7 20 -82 2 106 -118
6569a18p5R3J10j83J91O2J12k65K81m50J46M8O4J65k69%J19k02kN8R5j62o6J72
$$ -118 -193 -100 10 -173 18 80 192 -73 208 -242 -96 -48 16 181 -88 -88 31 -171 -173 -115 -20 -182 -248 -76
6593g6K37K2l29M7R3j30L5j00J34L66o05L57JrJN8l9l42K90Q0J11r6m1P5Q9n82
$$ -76 161 183 -146 -99 -6 -136 -101 -201 -67 299 -306 51 52 43 44 102 63 -279 11 91 202 106 65 140 229 -353
6619c53K29K4K13o4j50J47r0m8J48J22l30J67j49N0j09j02M21P6m31K03P5j06
$$ -353 -124 -100 113 49 -101 46 -44 -92 56 178 -152 15 -134 -84 -193 -295 126 202 -229 -26 49 -57
6641e7K54j2K3j46l04L14j99L93l28j54K35J30N2k43K29l30M14m62L45l26K24
$$ -57 197 185 208 62 -242 72 -127 266 -62 -216 19 149 201 -42 187 -143 271 -191 154 -172 52
6662E2J17j56j27L7N0J30j60j05l2P0J17J41j80P5Mk39L42m6k49J09L18l25N3
$$ 52 169 13 -114 -77 -27 103 -57 -162 -194 -124 -7 134 -46 29 33 -206 136 90 -159 -50 268 -57 -4
6685dJ68l46J32L06k60Rk16P2l8J12O1k3M3m4J35k18l7L19k43L7N3J39k25l2q6
$$ -4 164 -182 -50 256 -4 5 -211 -139 -177 -65 -4 -27 16 -28 107 -111 -148 171 -72 -35 18 157 -68 -100 -186
6710a86L41r0j21j12j8K05l49M15k04K84n0j66nJ33j47M8j82J72K7P2q1M9k8j06
$$ -186 155 65 -56 -168 -186 19 -330 85 -119 165 115 -51 -56 77 -70 -22 -204 -32 -5 67 -14 35 7 -99
6734i9R7k30J59J65p2k05K86l8j37K13l86K39l9L01o25L73m4k2K45j47Q0k09K6
$$ -99 -2 -232 -73 92 20 -185 101 63 -74 139 -247 -8 -47 254 -371 2 -42 -64 181 34 114 -95 -69
6757f9J62j56m6J54N9j2j42m8j05L22K1k78J06J66k01K05l49L33o1Q3j46J51k86
$$ -69 93 -63 -109 45 104 92 -50 -98 -203 119 140 -138 -32 134 -67 138 -211 122 61 144 -2 149 -137
6780a37L9K47N1j77k52K95J7k25J57Q5k04J42j68L20k08J11J02k50j76J86lN1
$$ -137 -98 149 200 23 -229 66 83 -142 15 100 -104 38 -130 190 -18 93 195 -55 -231 -45 -48 3
6802CK13k46q5M16k68Q4j95o6k7J50K27j24R8k42j05L53m7j57R5l02J53J13P9
$$ 3 216 -30 -115 301 33 117 -78 -144 -171 -21 206 82 180 -62 -167 186 139 -18 77 -225 -72 41 120
6825A20j28K5j44J44J93m02M11k94K2q6p3K27P2k10K6J00P0l9K4j58p3J8n0M86
$$ 120 -8 17 -127 17 210 -192 219 -75 -53 -139 -212 15 87 -123 -97 3 73 34 58 -100 -173 -155 -205 281
6849B81l90mL48j83O8j69R1j58J70l80K34qj85M22j59j51L08j14Kj9j9o6O6k6
$$ 281 -109 -113 235 52 120 -49 42 -116 54 -326 -92 -100 -285 137 -22 -173 135 21 23 4 -15 -81 -15 -41
6873d1M3j22QJ08j1l8k11J56%M4j20J00K82l3k82K84n46M38J67k4J5k29N1p0K3
$$ -41 2 -120 -112 -4 -15 -53 -264 -108 -108 -64 -184 -84 198 165 -117 167 -379 59 226 202 217 -12 39 -31 -8
6898hNJ1M5k69K56j49M14l53j60M31l88M77m02O7j00K78q5N9j67j73J81K9QJ03
$$ -8 -3 8 53 -216 40 -109 305 -48 -208 223 -165 312 -90 -23 -123 155 70 129 -38 -211 -30 -1 7 110
6922A10J89l48M2J62j93N0j12J1K29k03k4P2q2J39J08l84K80Q5k30m4l8J20M2
$$ 110 299 -49 -7 155 -38 12 -100 -89 140 -63 -87 -15 -97 42 150 -234 46 131 -99 -143 -181 -61 -19
6945a9J70l06Q8J9J34l73K00l10N28j46j4O1K26j12r8k5Jr2r7K73k9J55j74j57
$$ -19 151 -155 -67 -48 86 -287 -87 -397 131 -15 -29 32 258 146 48 23 24 -68 -165 108 79 234 60 -97
6969i7K1L5o5J03k20L65j36Q3%j16R7Jj82K8Q9j17oJ00J06j55j91L49k61K59M1
$$ -97 -76 -41 -106 -3 -223 142 6 89 89 -27 70 71 -111 -83 6 -111 -117 -17 89 -66 -257 92 -169 90 131
6994A31j69NN9J27k24P5N8r5r5k4L63k13l40M34L6j31j23qK06n8l80M03m05L80
$$ 131 -38 -33 26 153 -71 4 62 -33 -128 -152 211 -2 -342 92 128 -3 -126 -134 72 14 -366 37 -368 12
7018A2k2o7K81j70K14l02j12J58L8J93o6j70J06r0m0P3k6j07R6q1K13jl6k04K57
$$ 12 -10 -77 204 34 248 -54 -166 -8 30 223 157 -13 93 3 -37 36 10 -97 -1 -82 131 130 94 -110 147
7043A47j41J97J4j72m5M1k04K01m16L24M2J02j78J94j44J94l02L36p8j27J41O4
$$ 147 6 203 217 45 0 41 -163 38 -378 -54 -12 90 -88 106 -38 156 -146 190 112 -15 126 190
7065A90l14Q5J60j01%q2K5O2L2l13J35J81nq4K51L2m53J01L0j09J34J37p5P2j10
$$ 190 -124 -39 121 20 20 -62 -37 25 57 -256 -121 60 55 -29 222 254 -199 -98 -68 -177 -43 94 19 91 -19
7090a9M1J6j7k69K60K57l47nJ80q6j17J71Rj71j7K8q1J37k7p3K95k68l3J12N4
$$ -19 22 38 21 -248 12 269 -78 -83 97 11 -106 65 74 -97 -114 -86 -167 -30 -57 -130 165 -103 -136 -24 30
7115C0j19J0J94q8m2n2Pq0J34n2K36j68P1l87M75l38Q9j0J40k84L71o8K5j68K82
$$ 30 -89 -79 115 27 -15 -67 -60 -140 -6 -58 178 10 81 -306 169 -169 -80 -90 50 -234 137 69 94 -74 208
7140B08k2m88K50p4L72l38K47l1l37K62p6m2J17j41K67l25J44K0rr4K01l41J77
$$ 208 186 -302 -52 -126 246 -92 155 124 -213 49 -27 -69 48 -93 174 -151 -7 13 4 -90 111 -230 -53
7163e3J5J21N5j21j11L77k81l3L17k87k91J41K79R4m75L38j77L39l10O6O1p1r7
$$ -53 -38 83 138 17 -94 283 2 -31 286 -1 -292 -151 128 222 -253 85 -92 247 -63 3 64 -7 -104
7186a04O3J9j35R2O6K63n63N29m11J03K00j99l8L35j60p2q1R8P2r8J2j88J78j7
$$ -104 -41 -22 -157 -65 1 264 -299 230 -181 -78 122 -77 -115 220 60 -12 -93 5 77 -21 -9 -197 -19 -36
7210c6K25l08q1J91m4J89j08j14Q7k82K64k2J08J14k26K95j32m9k90J76J68op5
$$ -36 189 -119 -200 -9 -53 136 28 -86 1 -281 -17 -39 69 183 -43 252 120 71 -219 -43 125 119 44
7233D4n7J55lp3k22L75n4l49K11O1j94K52k50J51m93L22L09k29J47k26j8L22l52
$$ 44 -13 142 139 66 -156 219 165 -184 27 88 -106 146 -104 47 -446 -124 185 -44 103 -123 -141 181 -171
7256a71K28J0j85pK16r7k05K79q9r3k1M3J83R2k61j7M4n0J2m4M09m55K71o05M85
$$ -171 57 67 -118 -125 91 -6 -211 68 -21 -114 -135 -92 91 183 -78 -95 -51 -101 -89 -133 276 -179 92 -513 -28
7281b8K24M2j90n9o9L42o6n0n6pq2k69K01K18j8j43o6k7N7M9j26K05j87N3k13
$$ -28 196 238 48 -11 -80 262 196 146 90 83 1 -268 -67 151 133 -10 -76 -103 -46 3 -123 82 -105 -52 -265
7306b65L60k91M9l7O2NR7j77j1J61l8J80l26J45j19J91k7J96pl66L3L51j76L6
$$ -265 95 -196 -147 -184 -122 -117 -20 -197 -208 -47 -85 95 -231 -86 -205 -14 -41 155 148 -218 -185 166 -10 26
7330B6j19j04K07k34J38l0Q0j65K71K74m84J12K7k26J73J48Q5l67K90q0p3K11
$$ 26 -93 -197 10 -224 -86 -116 -36 -201 70 344 -140 -28 -1 -227 -54 94 179 -188 102 22 -51 160
7352A60l11L58n24L91O9j13j1m2P3L1K6j36m6k12L50l7N2J12j64j01j68M25l67
$$ 160 -151 207 -317 74 143 30 19 -23 50 81 107 -29 -75 -287 63 26 78 190 26 -75 -243 182 -185
7375a85K27j62J68k52K75p4j4P2k7ol72K37J18j33J25j62J03Np5Q8J16k19L0j25
$$ -185 42 -120 48 -204 71 -3 -17 55 28 22 -350 -113 5 -128 -3 -165 -62 -57 -132 -44 72 -147 -117 -242
7399b42PM21l74L42q5o3J33l93RL86k32J53p5j24k41N31N9l24K02PN4m03L49q8
$$ -242 -235 186 -188 154 69 6 139 -254 -245 141 -91 62 -13 -137 -378 153 212 -112 90 97 151 -252 97 9
7423IK27l32J38j37L08j75K3J35j92K08k63K8O2K4k12K52M1k32KK58j84Q0K3p6
$$ 9 236 -96 42 -95 213 38 61 196 4 212 -51 -23 39 63 -149 103 144 -88 -86 172 -12 68 91 15
7447A5m3K0P7q2j4M5j30J20j73J55J77l84O0K00n6j55K05j39J29M6k38J51J98
$$ 15 -28 -8 69 -13 -27 18 -112 8 -165 -10 167 -217 -157 43 -13 -168 37 -102 27 73 -165 -14 184
7470A84j11J50k89J51j58j04K32Q4l92J30L40l40K16n6L6L3l77J12O4l7O4N0j26
$$ 184 73 223 -66 85 -73 -177 55 139 -253 -123 217 -123 93 37 73 106 -271 -159 -95 -132 -68 -18 -144
7493a44Q3L3M8j16L56n61J49J10J58j32L1k6JJ91k42q4r8K94j74L45k31J00J8
$$ -144 -61 -28 20 -96 260 -301 -152 -42 116 -16 15 -11 -10 181 -61 -145 -243 51 -123 222 -9 91 109
7516A09k39M9O6J17q5m7j37L29r7J76m17J99kn4L36j93J6L10l07p1K56m50N0P7
$$ 109 -130 -81 -15 102 17 -30 -167 162 65 241 -176 23 21 -33 303 110 126 436 129 58 314 -136 -86 -9
7540iP5J17l18L6QJ28r3P9J8j8O3q7j16K45K7p8K7O9p0O6m1k51M5J51k38J32L
$$ -9 66 183 -135 -99 -91 37 -56 23 41 23 86 -1 -117 128 155 77 104 173 103 169 128 -123 -78 73 -165 -33 -30
7567c0p4r6K35n5o7K33j46r9J11k25M68m13J09M1K2J50j48K8j51mJ51J87p9k8
$$ -30 -104 -200 35 -20 -87 146 0 -99 12 -213 255 -158 -49 -8 14 164 16 44 -107 -111 40 227 148 120
7591A20J15k66p4J16n1o3J41p1J92j73k4L27m49L35j6r9o5j01M8K8o4K13J48l36
$$ 120 235 -31 -105 11 -40 -103 38 -33 159 -14 -38 289 -160 175 159 60 -5 -106 -58 -30 -94 119 267 -69
7615f9n1J33k24K90n3o2Q9p8j67J98j81K19j19J47L6J01l4p8n1j45J2L8Q9p7p6
$$ -69 -120 13 -211 79 26 -36 53 -25 -192 6 -175 44 -75 72 108 209 175 97 46 -99 -87 -49 40 -37 -113
7640a13j6L7n3r8J86Pp9j38K9P0Q3k15K32L06J5j83j42J57J22l85J02k5p1j68
$$ -113 -129 -92 -145 -243 -57 -50 -129 -267 -238 -168 -85 -300 -68 238 253 70 -72 85 207 -178 -76 -101 -172 -340
7664c40M35k92J26o5K23N5k35J09j36K07k5k01K57j67K07j4k79J66K5j17m7P3
$$ -340 95 -197 -71 -136 87 142 -93 16 -120 87 62 -139 118 -49 158 144 -135 31 56 -61 -108 -35
7686c5jJ37j65K6M19k87j1j89J06K2K5N0j35K29j64j0M7k45JM09L3J01m07Q0J33
$$ -35 -36 101 -64 -38 381 94 83 -106 0 22 47 97 -38 191 27 17 64 -181 -180 229 262 363 -44 36 169
7711A69j98J32j55J17M4P1n3p1l0j44M8J26j02k25M09j43P2J23j72q0o6J24j17
$$ 169 -29 103 -52 65 109 180 127 56 26 -118 -70 56 -46 -271 138 -5 67 190 18 -62 -128 -4 -121
7734a21J99k46l2J76qj62L33k87R4N5Q1J42j69j39J12q6l0M15l97j08J35L01j80
$$ -121 78 -168 -200 -24 -32 -194 139 -148 -54 1 82 224 55 -84 28 -58 -88 327 -70 -178 -43 258 78
7757G8r4j60L43J22k16j9l22L14p3J24j94j29M07k96No8J26J41R6k86n6J46K43
$$ 78 -16 -176 167 289 73 54 -268 46 -27 97 -97 -226 181 -115 -110 -178 -52 89 185 -101 -157 -11 232
7780B32q0l2r9k5J0k81M91k18J11j25J61o8N2kn7N4J77m57j87L60O5k17J3M4K33
$$ 232 152 120 21 -4 6 -275 216 -2 109 -16 145 77 129 127 70 124 301 -156 -343 17 82 -135 -122 -78 155
7805A55j87j15J48N6k19L8L58k20l1j33j57K95J70k48j84M27j02j77l0K34j59
$$ 155 -32 -147 1 57 -162 -124 234 14 -17 -150 -307 -12 158 -90 -274 153 51 -126 -156 78 -81
7826h1K12p9j44L27k04mJ28j18j53J65j99KJ82j10j50L36k31K17j44n6K17l50
$$ -81 131 52 -92 235 31 27 155 37 -116 49 -150 -148 34 -76 -226 110 -121 96 -48 -104 113 -237
7848b37K3K68k8Q8j53O1Kj29N7K13O0j17J31k46K63j03k70L19j16j53O8r7l31
$$ -237 -214 54 26 114 -39 22 24 -105 -48 165 225 108 239 -7 256 153 -117 202 86 -67 1 -96 -427
7871d27M33J36k4j45J69J10l60J28K4O1J5j83Q7k11J32L15n43K94R4j53m8j35
$$ -427 6 142 118 -27 142 252 -108 20 44 105 120 -63 24 -187 -55 260 -283 11 105 -48 -96 -231
7893b31r1J53K49Pl85M40M6k45R4j61M23k99j31L59k73K4j5Qj21oQ1J13J5j91
$$ -231 -322 -169 80 87 -298 142 188 -57 37 -124 299 0 -131 228 -45 -21 -36 -28 -149 -155 -74 39 54 -137
7917a37J6P9%n1j41K13j60o5L76k1l13N3K3K1Q0j48N0J97j10j36R8k69L52j8Q5
$$ -137 -121 -42 -42 -93 -234 -21 -181 -246 130 109 -204 -151 -128 -107 -27 -175 -125 72 -38 -174 -76 -345 7 -11 74
7942G4Q5k53L5q5K10j14R2m1q3J27k3j16J75K2l38J73N3k0r6O8J0l8j44M20l18
$$ 74 159 -94 -59 -144 66 -48 44 3 -80 47 24 -92 83 105 -233 -60 -7 -27 -123 -55 -45 -83 -227 193 -125
7967a25k0O8j47L68k35J46J84k49N4k50M01k01J17j44p9K41Lj81K41n6p4j38O8
$$ -125 -145 -77 -224 144 -91 55 239 -10 44 -206 195 -6 111 -33 -112 129 132 -49 192 136 62 -76 -8
7990hqMJ31j33k6J50l78K60L92k17k50j81L77n1k2j54Q7J3J11o1PJ95n9n2N2o3
$$ -8 -16 -12 119 -14 -40 110 -268 -8 384 167 -83 -264 113 62 40 -114 -27 -14 97 36 43 238 179 127 179 116
8016A16n1mq5J99j85j25J00Q7Q2j29k4J3j03J36j81R9J48J22j94R6q2l5K08J52
$$ 116 65 61 -24 175 -10 -135 -35 52 134 5 -19 -6 -109 27 -154 -55 93 215 21 117 35 0 208 360
8040C60k42J03Jk44m5J02j9lJ5J05p7Q9l05K99k42K7N3J40j2k48j18K46k6j76
$$ 360 118 221 222 -22 -67 35 16 13 28 133 56 145 -160 139 -103 -76 -23 117 105 -143 -261 -15 -41 -217
8064b17J25R8P6j20K23L0j74K34l67R4N9o1j33M02k8n13L52j42J45j4j30J03K8
$$ -217 -92 6 82 -38 185 215 41 275 -92 2 61 0 -133 269 241 -272 80 -62 83 69 -61 42 70
8087G0J27j01p6J2j4J32O3J00l92l8K99l05L18k23oK60r2j19j62N5J76j57%k20
$$ 70 197 96 20 32 18 150 213 313 -79 -117 182 -123 195 -28 -34 226 134 15 -147 -92 84 -73 -73 -293
8111b93L11j62J11R5r0O1j8p6m4n0N6J08J47L1k17j07K58Pj20j13j66L46k51K01
$$ -293 18 -144 -33 62 -28 33 15 -61 -105 -155 -99 9 156 187 -30 -137 121 128 8 -105 -271 75 -176 25
8135B5j20rn9J44J57k13K50j66L1j24P2k66K79J76j95j47KK25J76k66K4L9j83
$$ 25 -95 -104 -163 -19 138 -75 175 9 40 -84 -12 -278 1 177 -18 -165 -163 62 238 -28 -4 35 -148
8158a48K29j17K2K17j66k1l52K71oO5k55J98j3J3KJ10K6Lk33j1L45k48k5j73M31
$$ -148 81 -36 -14 203 37 16 -336 -65 -71 -6 -261 -63 -76 -63 -61 49 75 78 -155 -166 179 -69 -94 -267 164
8183A64j67k81M42k40O6o5L18j88
$$ 164 -3 -284 158 -82 -16 -81 237 49
8191D9
$$ Imaginary data points
##PAGE= N=2
##DATA TABLE= (X++(I..I)), XYDATA
0@%%%%%%%%%%%%%%Qj6J6j6J6k3L1l2M0m8N6o5P3q8J03j17J33j52J73j96K21k48
$$ 0 0 0 0 0 0 0 0 0 0 0 0 0 0 0 8 -8 8 -8 8 -15 16 -16 24 -24 32 -33 40 -48 55 -62 71 -81 92 -104 117 -131
36a31K79l16L53l93M40m89N41o00O64p33Q11q95R85j088J201j319J454j607J774
$$ -131 148 -168 185 -208 232 -257 284 -316 348 -385 426 -469 516 -572 629 -690 764 -843 931
55I31j961K175k418K698l030L424l902M501n273O309p783J0067j4126K3556q8035
$$ 931 -1030 1145 -1273 1425 -1605 1819 -2083 2418 -2855 3454 -4329 5738 -8388 15168 -72867
70g2867n4995O3018m8347j610O8324P1948n8489j08909l6870P5666N9054k6120
$$ -72867 -127862 -64844 -113191 -114801 -46477 25471 -33018 -141927 -178797 -103131 -44077 -70197
82g0197m8621L4404O2698j3254q5389l6446M7047N0814k3466m3673K0699P0473
$$ -70197 -118818 -84414 -21716 -34970 -120359 -156805 -109758 -58944 -82410 -126083 -105384 -34911
94c4911Q480p9956p0193K5314P1042K5508k1445K06L2951J400o4792n8141L2109
$$ -34911 -26431 -106387 -176580 -151266 -80224 -54716 -76161 -75955 -43004 -41604 -106396 -164537 -132428
107a32428Q7017L8310l6350m0555O320J8189k0957l7186J3247O3185L3936l3538
$$ -132428 -45411 -7101 -43451 -84006 -77686 -59497 -80454 -117640 -104393 -41208 -7272 -40810
119d0810m0919J0063L6111k959m1149j2166N0665N5050m175m0213j3301J6624
$$ -40810 -81729 -71666 -35555 -38514 -79663 -91829 -41164 13886 9711 -30502 -43803 -27179
131b7179o2k6824m136M9946N6522m201n6069l7015J4245K8689N319j833K2299
$$ -27179 -27241 -54065 -58201 -8255 48267 44066 -12003 -49018 -34773 -6084 -765 -2598 19701
144A9701L1158m734m3568k9139K1841M0211Q268j8921k713K4384J4157k2605l0658
$$ 19701 50859 46125 2557 -26582 -4741 35470 43738 24817 22104 46488 60645 38040 7382
157G382L083K9783J2401j2478j829K2692J3987k2401l8400p078L3454L2902M93
$$ 7382 10465 40248 52649 40171 38342 61034 75021 52620 14220 7142 40596 73498 73991
170G3991j3882m06K431j6175k4277L37L3922L2501o285l0607j3776R701L628j1981
$$ 73991 60109 59703 62134 45959 21682 22019 55941 88442 82157 51550 37774 47475 51103 39122
184C9122n440J6292K1691j928k2207j2205R518O645j2432j3208R344K4598R454
$$ 39122 33682 49974 71665 69737 47530 35325 44843 51488 39056 25848 35192 59790 69244
197F9244j7220k3063n142O822j357n859R449K0725M147k3262k8336m924J6972
$$ 69244 52024 28961 23819 30641 29284 23425 32874 53599 57746 34484 6148 1224 18196
210A8196J2545l276l611M949M65j5117j8151j298J5478J0915p203j1853J023P488
$$ 18196 30741 27465 23854 28803 29268 14151 -4000 -5298 10180 21095 13892 2039 3062 10550
224A0550m597j6118r190P836J2241L74q241j250M684n095j7926j0107J0660J8934
$$ 10550 5953 -10165 -19355 -11519 722 1096 -7145 -8395 -3711 -8806 -26732 -36839 -26179 -7245
238g245N587j0763j1842k788j433o425l363R996J4108J894j3811j3809o28Q173
$$ -7245 -1658 -12421 -24263 -27051 -28484 -34909 -38272 -28276 -14168 -12274 -26085 -39894 -40522 -32349
252c2349J011n062N18Q577M241p583r778j176O344J550n332o69R788Q171m688
$$ -32349 -31338 -36400 -35882 -27305 -23064 -30647 -40425 -41601 -35257 -33707 -39039 -39708 -29920 -21749 -26437
267b6437j2186o123M325P028K416Q68N007M421n994j2137m560R255J2477L980
$$ -26437 -38623 -44746 -40421 -33393 -30977 -30109 -25102 -20681 -26675 -38812 -43372 -34117 -21640 -17660
281a7660m359k677K109o07n268j840Q145R157J521n249k366L665L201k515m288
$$ -17660 -22019 -24696 -22587 -23194 -28462 -30302 -22157 -13000 -11479 -16728 -19094 -15429 -12228 -14743 -19031
296a9031L291Q778M944j931k839K49J841j652l223L243J0511P159l601p612k572
$$ -19031 -15740 -6962 -2018 -3949 -6788 -6539 -4698 -6350 -9573 -6330 4181 11340 7739 127 -2445
311b445L081L272P16K795O304L605m845p401r87N845N366Q51j530J494L455j083
$$ -2445 636 3908 4624 7419 13723 17328 12483 5082 4095 9940 15306 16157 14627 16121 19576 18493
327A8493m649k151L778M380O39j416J178L723J9n335m804J782O800L169p14j012
$$ 18493 13844 11693 15471 19851 20490 19074 20252 23975 23994 18659 13855 15637 22437 25606 24892 23880
343B3880k04j831m169k661L204P070K951k672m739j913L90l92j251J506M088J780
$$ 23880 23676 21845 17676 15015 18219 25289 28240 25568 20829 18916 19306 18914 17663 19169 23257 25037
359B5037l189m866n11J561l88k283k9K849K101j672m227k553K83J03j056O40K444
$$ 25037 21848 16982 16471 18032 17644 15361 15332 18181 20282 18610 14383 11830 12113 12216 11160 11800 14244
376A4244J795j584n818m440O21L111R62o0k60Q4k669m855k600J714L549K50j909
$$ 14244 16039 14455 8637 4197 4818 7929 8891 8831 8571 8655 5986 1131 -1469 245 3794 4044 2135
393B135j238j36j539k735j904K54K307Q93j128j943m43n62k339k690j44K482K718
$$ 2135 897 761 -778 -3513 -5417 -5163 -2856 -1963 -3091 -5034 -5477 -6039 -8378 -11068 -11212 -8730 -6012
410f012j063k828j930n83k005j022J467K951J563j713l446k303L09N05R6Q16J479
$$ -6012 -7075 -9903 -11833 -12416 -14421 -15443 -13976 -11025 -9462 -11175 -14621 -16924 -16615 -16110 -16014 -15198 -13719
427a3719M07r41k649j665N24J610M20l27Q32J488j76k149j831j7J978J156Q68
$$ -13719 -13312 -14253 -16902 -18567 -18043 -16433 -16013 -16340 -15508 -14020 -14196 -16345 -18176 -18193 -16215 -15059 -14191
444a4191Q23R10o27j819j713O33K336K900J195q68o96l0o73k63Q92K589K488M17
$$ -14191 -13368 -12458 -13085 -14904 -16617 -15984 -13648 -10748 -9553 -10421 -11117 -11147 -11820 -12083 -11191 -8602 -6114 -5697
462e697j534j33N02L16j22Q87K303J477L98n72j14k04N30J45J050J851K195O72
$$ -5697 -7231 -7364 -6862 -6546 -6668 -5781 -3478 -2001 -1603 -2175 -2289 -2493 -1963 -1818 -768 1083 3278 3950
480C950j242j390m8Q12J435J122J536J814m11j480j470P86J587J030P54R14M73
$$ 3950 2708 1318 1270 2082 3517 4639 6175 7989 7578 6098 4628 5414 7001 8031 8785 9699 10172
497A0172n70j391o33O64J397P99Q71j19J39Q8j004j159k14J720R37Q39n37m72
$$ 10172 9602 8211 7578 8242 9639 10438 11309 11190 11329 11417 10413 9254 9040 10760 11697 12536 11999 11527
515A1527m24r37j182j78J842J476k08p78j429o82l80k90M13P01J333l82j296j221
$$ 11527 11103 10166 8984 8806 10648 12124 11916 11138 9709 9027 8647 8357 8770 9471 10804 10422 9126 7905
533G905j117lL07J78j19R53l09j477j284n39k85K67K78K26K6J5j202j502p58k46
$$ 7905 6788 6785 7092 7270 7151 8104 7795 6318 5034 4495 4210 4477 4755 4981 5007 5022 3820 2318 1560 1314
553A314N57R11j11j033j25o04j851o64O13R07j41j14k58j042p77j238j14P86M94
$$ 1314 1871 2782 2671 1638 1513 909 -942 -1606 -993 -86 -227 -341 -599 -1641 -2418 -3656 -3770 -2984 -2490
572b490l12m55k60o01q41p04L32J32K32K70l74q37n79k36k73J25M41L78K70p52
$$ -2490 -2802 -3257 -3517 -4118 -4959 -5663 -5331 -5199 -4967 -4697 -5071 -5908 -6487 -6723 -6996 -6871 -6430 -6052 -5782 -6534
592f534j281k72J09J80N3R37K28k8j167l60l38J82M07M13O17N5O1n54k35m74O61
$$ -6534 -7815 -8087 -7978 -7798 -7745 -6808 -6580 -6608 -7775 -8135 -8473 -8291 -7884 -7471 -6854 -6799 -6738 -7292 -7527 -8001 -7340
613g340O01M34L72M3m6l97l33j97R69Q88K38J77M73k4p78J2L51Q38R30P24K9j70
$$ -7340 -6739 -6305 -5933 -5890 -5936 -6333 -6666 -6863 -5894 -5006 -4768 -4591 -4118 -4142 -4920 -4908 -4557 -3719 -2789 -2065 -2036 -2206
635b206j48m3J42O01P15P83R04m50m12J58L57p4N27P44L42P14N8l59m73M59O15
$$ -2206 -2354 -2397 -2255 -1654 -939 -156 748 298 -114 44 401 327 854 1598 1940 2654 2712 2353 1880 2339 2954
656B954J71J021L69n9j97n4l87L51L90Q36KK63J6n17o2k21L32N37N59j27j64O
$$ 2954 3125 4146 4515 4456 4259 4205 3818 4169 4559 5395 5397 5660 5676 5159 5097 4876 5208 5745 6304 6177 6013 6019
678F019l67k69L47j28M55L39k52n53k32r6j20m11L87O61k54m29n14j37j96k45
$$ 6019 5652 5383 5730 5602 6057 6396 6144 5591 5359 5263 5143 4732 5119 5780 5526 5097 4583 4446 4250 4005
698D005k36M75j6K01r49n27m55o6J92K1N4J03p37k34n05n16n6M86nl98J80k32
$$ 4005 3769 4244 4228 4429 3480 2953 2498 2432 2624 2645 2699 2802 2065 1831 1326 810 754 1240 1235 837 1017 785
720G85l46j004k85K34J34J72k2n34J4n68m48j41K86R7q0L62m84m96j88k96l33
$$ 785 439 -565 -850 -616 -482 -310 -332 -866 -852 -1420 -1868 -2009 -1723 -1626 -1706 -1344 -1828 -2324 -2512 -2808 -3141
741c141L44J25J48l16k8m10l54K6J3N26J50p4l52m24Om33N5N89J32J47j92k21
$$ -3141 -2797 -2672 -2524 -2840 -2868 -3278 -3632 -3606 -3593 -3067 -2917 -2991 -3343 -3767 -3761 -4194 -4139 -3550 -3418 -3271 -3463 -3684
763c684m75j59ML03N55r6L2K05K8j035j51O51J34P57p0Q6m21q2l70J5P48J20L16
$$ -3684 -4159 -4318 -4314 -4011 -3456 -3552 -3520 -3315 -3287 -4322 -4473 -3822 -3688 -2931 -3001 -2915 -3336 -3418 -3788 -3773 -3025 -2905 -2589
786b589J11m8j61o0r6r0L75O66K57m3j74M1n3J02L8N23N47L80K7n67L06j89J08
$$ -2589 -2478 -2526 -2687 -2747 -2843 -2933 -2558 -1892 -1635 -1678 -1852 -1811 -1864 -1762 -1724 -1201 -654 -274 -247 -814 -508 -697 -589
809e89K83N18M47K08n4p3K1k02L72N37N32J31M9O9n69L9J91L04M93J93M38R8k40
$$ -589 -306 212 659 867 813 740 761 559 931 1468 2000 2131 2180 2249 1680 1719 1910 2214 2707 2900 3338 3436 3196
832C196k42o4J37K88O26J61Oj47l22J87k98O3K14Q51n7k58l37n26J17r8K48O28
$$ 3196 2954 2890 3027 3315 3941 4102 4108 3961 3639 3826 3528 3591 3805 4656 4599 4341 4004 3478 3595 3497 3745 4373
854D373L4L4k03n71n6n36J79L16J38p3J4m87n82p8k17L19k66L09J05k55p96l14
$$ 4373 4407 4441 4238 3667 3611 3075 3254 3570 3708 3635 3649 3162 2580 2502 2285 2604 2338 2647 2752 2497 1701 1387
876A387J35l93n4J22M45k97m70q26J26m15K18J91J71k70k34o06k64m33R3m5N07
$$ 1387 1522 1129 1075 1197 1642 1345 875 49 175 -240 -22 169 340 70 -164 -770 -1034 -1467 -1374 -1419 -912
897i12j0k90k33m06j67k62J47K3J22N3n6m17m29k17R4L29J40J66r0O6p80m43L78
$$ -912 -922 -1212 -1445 -1851 -2018 -2280 -2133 -2110 -1988 -1935 -1991 -2408 -2837 -3054 -2960 -2631 -2491 -2325 -2415 -2349 -3129 -3572 -3194
920c194n2J77K53J51J27l36m93j06L41j35L63J60K57k44k24N7m24J60K36P51J14
$$ -3194 -3246 -3069 -2816 -2665 -2538 -2874 -3367 -3473 -3132 -3267 -2904 -2744 -2487 -2731 -2955 -2898 -3322 -3162 -2926 -2175 -2061
941b061k04Nl27m97J21L41N77L42P3o6l58Q1l40J61M60K96K67K25j88k57j27l04
$$ -2061 -2265 -2260 -2587 -3084 -2963 -2622 -2045 -1703 -1630 -1696 -2054 -1973 -2313 -2152 -1692 -1396 -1129 -904 -1092 -1349 -1476 -1780
963a780Q69k6M26J25N1l2l04q5L3M23L59J43N50j74k76j65L0q6L88P65J87Rk02
$$ -1780 -911 -937 -511 -386 -335 -367 -671 -756 -723 -300 59 202 752 578 302 137 167 81 469 1234 1421 1430 1228
986A228J64m32j81O45K27L60J72r6p7j71k32p5M42L12K44N7J76j04m36j53L54
$$ 1228 1392 960 779 1424 1651 2011 2183 2087 2010 1839 1607 1532 1974 2286 2530 2587 2763 2659 2223 2070 2424
1007B424N0M96J05qk70r2q6k07J71K51L11M8J45o83k70J66j61J22M96L02j83m93
$$ 2424 2474 2970 3075 3067 2797 2705 2619 2412 2583 2834 3145 3193 3338 2655 2385 2551 2390 2512 3008 3310 3127 2634
1029B634j34r8j77j89J09L23K71k74l50m26k66J39j06K1K22j59r7k60o12r7L2
$$ 2634 2500 2402 2225 2036 2145 2468 2739 2465 2115 1689 1423 1562 1456 1477 1699 1540 1443 1183 571 474 506
1050E06J01J46j71K39o29k35j63m08K9L66K90j68l97k90Q2n21j52O2J88R4q2n5
$$ 506 607 753 582 821 192 -43 -206 -614 -585 -219 71 -97 -494 -784 -702 -1223 -1375 -1313 -1125 -1031 -1113 -1168
1072a168k71j9n25k58L39K09K02M2k07n52k64q3R5L70J0K3N3L7o97K54k91L13
$$ -1168 -1439 -1458 -1983 -2241 -1902 -1693 -1491 -1449 -1656 -2208 -2472 -2555 -2460 -2090 -2080 -2057 -2004 -1967 -2664 -2410 -2701 -2388
1094b388L3M42j67q9m16K61j50j19M21J30K96j42j37k84J33nK36K3N15k66j83
$$ -2388 -2355 -1913 -2080 -2169 -2585 -2324 -2474 -2593 -2172 -2042 -1746 -1888 -2025 -2309 -2176 -2181 -1945 -1922 -1407 -1673 -1856
1115a856J73J7m38L07M17L2L48k7L2m13K58l08K90J13L53k5R4n6n77K36M26J1
$$ -1856 -1683 -1666 -2104 -1797 -1380 -1348 -1000 -1027 -995 -1408 -1150 -1458 -1168 -1055 -702 -727 -633 -689 -1266 -1030 -604 -593
1137e93J33M16R9n6o44J74l4M31J36L13j20MJ58k96j13j2P5M67L11L2L4l12K54
$$ -593 -460 -44 55 -1 -645 -471 -505 -74 62 375 255 259 417 121 8 -4 71 538 849 881 915 603 857
1160H57l01j23L90K72N8J89J0j85k22J56J10P4K14K4J58k01r8K9J01J68J91R6
$$ 857 556 433 823 1095 1153 1342 1352 1167 945 1101 1211 1285 1499 1523 1681 1480 1382 1411 1512 1680 1871 1967
1182A967j58K56r8m11K88m00M95k8J25Q5l35K11k73k5l4M3M61j52n6k8m71j11
$$ 1967 1809 2065 1967 1556 1844 1444 1939 1911 2036 2121 1786 1997 1724 1699 1665 1708 2169 2017 1961 1933 1462 1351
1204A351K22p5L08l3j76%j90j62N5Nk5J88k88J54m11J56l82j23j22M7O0K04m1
$$ 1351 1573 1498 1806 1773 1597 1597 1407 1245 1300 1305 1280 1468 1180 1334 923 1079 697 574 452 499 559 763 722
1227G22o23j95k2Q0o6k16M64l36M2l68r3l40J80m6K79o6r9j2m25l6l94p9M94r6
$$ 722 99 -96 -118 -38 -104 -320 144 -192 -150 -518 -611 -951 -771 -817 -538 -604 -703 -715 -1140 -1176 -1570 -1649 -1155 -1251
1251a251J56j24k03m69N50j69o1N9k5K10j64l16M6k9K70k45K23L9J03J83n21j5
$$ -1251 -1095 -1219 -1422 -1891 -1341 -1510 -1571 -1512 -1537 -1327 -1491 -1807 -1761 -1790 -1520 -1765 -1542 -1503 -1400 -1217 -1738 -1753
1273a753p1q8L39M16o0l85nJ19j53mJ79K51k22M31k18J10M4k01Q1M17p3k43J23
$$ -1753 -1824 -1912 -1573 -1157 -1217 -1602 -1607 -1488 -1641 -1645 -1466 -1215 -1437 -1006 -1224 -1114 -1070 -1271 -1190 -773 -846 -1089 -966
1296i66N5j7k37M49J20J25j2L16j18qk50p7M10l8K03k27L37kr7J40l9n0J59K18
$$ -966 -911 -928 -1165 -716 -596 -471 -483 -167 -285 -293 -543 -620 -210 -248 -45 -272 65 63 -34 106 67 17 176 394
1320C94j59j67L33m18J67P0J28J62q4J69J98k13R9k52M9K79K47j29j40J9r7J25
$$ 394 235 68 401 -17 150 220 348 510 426 595 793 580 679 427 476 755 1002 873 733 752 655 780
1342G80J49N2L5K18j69R4m7m82K2K12K78j42J08m8L9n3K15j92J1QK39r2J35j70
$$ 780 929 981 1016 1234 1065 1159 1112 630 652 864 1142 1000 1108 1060 1099 1046 1261 1069 1080 1088 1327 1235 1370 1200
1366A200RJ44k50J3N3O7J83k49J41l44J50P1k56J39j88R2J91k05j19j11l2K12
$$ 1200 1209 1353 1103 1116 1169 1236 1419 1170 1311 967 1117 1188 932 1071 883 975 1166 961 842 731 699 911
1388I11N2k34P5k3l76J30J50o3k11K32rj65k90M8k33L3j28M09R5l55l42l8J13
$$ 911 963 729 804 781 405 535 685 622 411 643 634 469 179 227 -6 27 -101 308 403 48 -294 -332 -219
1411b19J07m76M84J9k32k1r2l43k00L7K52j78N4j3J57Q1m05R2j14J68j15p9J1
$$ -219 -112 -588 -104 -85 -317 -338 -430 -773 -973 -936 -684 -862 -808 -821 -664 -583 -988 -896 -1010 -842 -957 -1036 -1025
1434a025j5p9o0j10J47l4J81j80K38k55k19L09J19j52Q1Q3N4j46j85L46k87L61
$$ -1025 -1040 -1119 -1179 -1289 -1142 -1176 -995 -1175 -937 -1192 -1411 -1102 -983 -1135 -1054 -971 -917 -1063 -1248 -902 -1189 -828
1456h28P5l09J42K57R1j80J27l25K11J17k9pL01k48N1K01k75N4Q3K08O7L34m95
$$ -828 -753 -1062 -920 -663 -572 -752 -625 -950 -739 -622 -651 -658 -357 -605 -554 -353 -628 -574 -491 -283 -216 118 -377
1479c77P7J76n7j63L12p5n1L42j19jj08n6L62J7j62K73j72q3L21l83K10J4P6J31
$$ -377 -300 -124 -181 -344 -32 -107 -158 184 65 64 -44 -100 262 279 117 390 218 135 456 73 283 297 373 504
1503E04m0k4J56l08J19J36l8j33M07q1j99k69L06J8k00OL08K16m41j71M17l33
$$ 504 464 440 596 288 407 543 505 372 779 698 499 230 536 554 354 360 668 884 443 272 689 356
1525C56p9K82r1K50k11L0m6K34k20J03P0M02o12K84m14R3P4N6L06j53J3J14k06
$$ 356 277 559 468 718 507 537 491 725 505 608 678 1080 468 752 338 431 505 561 867 714 727 841 635
1548F35k58J04J29K14j07l7J76l96r6P9P4O4J17q7J58p8j78j66J18k20j20K35
$$ 635 377 481 610 824 717 680 856 460 364 443 517 581 698 611 769 691 513 347 465 245 125 360
1570C60P2%K7j26j63p5k45L05L7J09j7m39J69j56L9l01K06J25Q7n7q5k29j05L48
$$ 360 432 432 459 333 170 95 -150 155 192 301 284 -155 14 -142 -103 -404 -198 -73 14 -43 -128 -357 -462 -114
1594a14k54J72k58K5j8J51l22KJ9J08j53J83k7J78m43Q0N6l00K58j96L10K01m99
$$ -114 -368 -196 -454 -429 -447 -296 -618 -616 -597 -489 -642 -459 -486 -308 -751 -671 -615 -915 -657 -853 -543 -342 -841
1617h41K99n06J90K67J4k54L12q1j67K51k58j13K11K12J82j52n9J32jj31l3J39
$$ -841 -542 -1048 -858 -591 -577 -831 -519 -600 -767 -516 -774 -887 -676 -464 -282 -434 -493 -361 -362 -493 -526 -387
1639c87J56k40J03J67q8j10L39Q7k19J89o3r3O8j62N24m67J27P0k23J4L50k56
$$ -387 -231 -471 -368 -201 -289 -399 -60 27 -192 -3 -66 -159 -91 -253 271 -196 -69 1 -222 -208 142 -114
1661a14J49k71K39j08K66K18j62j69J20k66J77J37J12k6k11J29j61O9J29j51K33
$$ -114 35 -236 3 -105 161 379 217 48 168 -98 79 216 328 302 91 220 59 128 257 106 339
1682C39p0J15q2o0R6j92M1j46K40L22q9nk61j54K76j10J21j71Q2Q5k94l8j5RJ48
$$ 339 269 384 302 242 338 146 187 41 281 603 514 509 248 94 370 260 381 210 292 377 83 45 30 39 187
1707A87K1J63r1N5j7n0J0k14J21R5PR8q7K13p6j64J66N4J9k04j05L74k18m7Ok32
$$ 187 208 371 280 335 318 268 278 64 185 280 287 385 298 511 435 271 437 491 510 306 201 575 357 310 316 84
1733H4Q8J94j86K66J4k41K25l72k3J00J05J44j39k62j25J39JM5rP0q1rJ24P0m74
$$ 84 172 366 180 446 460 219 444 72 49 149 254 398 259 -3 -128 11 12 57 48 118 37 28 152 222 -252
1758b52K74J3R7j2p1j30J40j57k04Pj6K15KJ93o79N0M36k11K9k48J66N4n2Q2j96
$$ -252 22 35 132 120 49 -81 59 -98 -302 -295 -311 -96 -94 99 -580 -530 -94 -305 -276 -524 -358 -304 -356 -274 -470
1783d70j69j6O0L53r6n2L6o2l4k3j82L80R1j04Lp8J2j83p6L98J6J70l65J06L06
$$ -470 -639 -655 -595 -242 -338 -390 -354 -416 -450 -473 -655 -275 -184 -288 -285 -363 -351 -534 -610 -212 -196 -26 -391 -285 21
1808B1l78J62j37J55L13l89o8J86k44K43j3M5p0J88MJ61l79J77p0L9N2Q9L01j66
$$ 21 -357 -195 -332 -177 136 -253 -321 -135 -379 -136 -149 -104 -174 14 18 179 -200 -23 -93 -54 -2 87 388 222
1832B22j70oK15k36j65K82no4K69j10J03p8j18J82j41j97N18k70j72L43j70j12
$$ 222 52 46 261 25 -140 142 137 73 342 232 335 257 139 321 180 -17 501 231 59 402 232 120
1854A20J67K77l42N2j26K76L0l57O5O4nK1K8k2k16J23pk49J63k5Q3Q4J18k36J92
$$ 120 287 564 222 274 148 424 454 97 162 226 221 242 270 248 32 155 148 -101 62 37 120 204 322 86 278
1879B78l26J58j79K26k3l58M23J15o8k06J62M2r3M2l01K85K8j42ql9J45j95n0
$$ 278 -48 110 -69 157 134 -224 199 314 246 40 202 244 151 193 -108 177 205 63 55 16 161 -34 -84
1902h4J75M1k42K16J04k06J43J87k63L53k20o0j30N15l29m2N3j47Q7J8r5M9j28
$$ -84 91 132 -110 106 210 4 147 334 71 424 204 144 14 529 200 158 211 64 151 169 74 123 -5
1925eK51j52L5M5kj57J09l54K69j47K63l34j95P9n2J18j87M98m39K28K5j48J07
$$ -5 246 94 129 174 172 15 124 -230 39 -108 155 -179 -374 -295 -347 -229 -416 82 -357 -129 -104 -252 -145
1948a45J55l50O2l9J04j6Q8j53r3J88k10L98l62J62J55Kl37O5q9j03J67P3k9J97
$$ -145 10 -340 -278 -317 -213 -229 -141 -294 -387 -199 -409 -11 -373 -211 -56 -54 -391 -326 -415 -518 -351 -278 -307 -110
1972a10n8j0j86KrR9L4j41J54MJ85k03O5J3k18J41j17J56J2M1M73l11j05J53p0
$$ -110 -168 -178 -364 -362 -371 -272 -238 -379 -225 -221 -36 -239 -174 -161 -379 -238 -355 -199 -187 -146 327 16 -89 64 -6
1997fm6k42K30K3l5j38L04k49L54m9Jj59O4J74mJ9k32J09J5j4M0o7J18o3r2M81
$$ -6 -52 -294 -64 -41 -76 -214 90 -159 195 146 147 -12 52 226 222 241 9 118 133 119 159 92 210 147 55 536
2023E36n29K04K2rJ83o6J10n3Qk02q5j34K92j52J61L15m34L0R1j88J22k48O2N46
$$ 536 7 211 233 224 407 341 451 398 406 204 119 -15 277 125 286 601 167 197 288 100 222 -26 36 582
2047E82k40j54N1j17k40J31N7j71M10j66P9k7j11q5kj12K28J33l7q6o2mk0M9l1
$$ 582 342 188 239 122 -118 13 70 -101 309 143 222 195 84 -1 -3 -115 113 246 209 123 61 57 37 86 55
2072E5j42K42k35L49m1j83m8N6K4O0J95k76r8Q2j55J47n6J26J78m04L32l23K4
$$ 55 -87 155 -80 269 228 45 -3 53 77 137 332 56 -42 40 -115 32 -24 102 280 -124 208 -115 -91
2095i1L5J73m7l1K1L04k15l18L2j2J40j30L9J05P2j26M2j53J26j39K21j80QJ90
$$ -91 -56 117 70 39 60 364 149 -169 -137 -149 -9 -139 -100 5 77 -49 -7 -160 -34 -173 48 -132 -124 66
2119F6j15q4j14Q2KM5K5q7K47j97k33L75k64O0L7o6J91k40L43n70L73j10m9J34
$$ 66 -49 -133 -247 -165 -163 -118 -93 -180 67 -130 -363 12 -252 -192 -155 -221 -30 -270 73 -497 -124 -234 -283 -149
2143a49j48Q9j56J92l83J39J07M19k29N7k25k24M21j62J2K01r4j70J67j40K16
$$ -149 -297 -208 -364 -172 -555 -416 -309 110 -119 -62 -287 -511 -90 -252 -240 -39 -133 -303 -136 -276 -60
2164f0J6l77L30J13j24K31o4j17r1J20j33n7L86q1k4J34Q8l06Q5J3k21J96jRK81
$$ -60 -44 -421 -91 22 -102 129 65 -52 -143 -23 -156 -213 173 92 68 202 290 -16 69 82 -139 57 56 65 346
2189C46j93k2L1J39j90p2J54J5K07k79p6M4L02j47P4P7j26l24J95P7j51KL49M8
$$ 346 153 131 162 301 111 39 193 208 415 136 60 104 406 259 333 410 284 -40 155 232 81 83 432 480
2213D80l22J67m05J50L0L34j76L9k32K73j36k32J52J42L6k20M3N9p5p5K02l33
$$ 480 158 325 -80 70 100 434 258 297 65 338 202 -30 122 264 300 80 123 182 107 32 234 -99
2235i9J51j33L28o9j60j66R7J69j85K06j89J00K1R0m1J06k36J60j81J39K8k75
$$ -99 52 -81 247 178 18 -148 -51 118 -67 139 -50 50 71 161 120 226 -10 150 -31 108 136 -139
2257a39J02M4j70L10l03K73j29N1M4K2p1O9k48J57J42j70k82J74Nr9M68l22K4
$$ -139 -37 7 -163 147 -156 117 -12 39 83 105 34 103 -145 12 154 -16 -298 -124 -119 -218 250 -72 -48
2280d8j21J62q1J77k01K3j67J41Q9k4J08j69J50l54K71l20M54j85rk1O0j5oJ84
$$ -48 -169 -7 -88 89 -112 -89 -256 -115 -26 -50 58 -111 39 -315 -44 -364 90 -95 -104 -125 -65 -80 -86 98
2304I8m47K91j55j11Q5m8O9m5K53Ml59K47l41J88j1p0J2K48R1k60J96j0l00L59
$$ 98 -349 -58 -213 -324 -239 -287 -218 -263 -10 -6 -365 -118 -459 -271 -282 -352 -340 -92 -1 -261 -65 -75 -375 -16
2328a6n27J11M63k06j69K41P8j46k7r3J57j9M1J38l90L67N3l0j13J10K31k45J30
$$ -16 -543 -432 31 -175 -344 -103 -25 -171 -198 -291 -134 -153 -112 26 -364 3 56 26 -87 23 254 9 139
2351A39k15K03Q4j03M7Kj67RK34k04j0J43K87j83Om2O0l32J24j02J47J81n0K5
$$ 139 -76 127 211 108 155 157 -10 -1 233 29 19 162 449 266 272 230 290 -42 82 -20 127 308 258 283
2375B83J58l65R4N3R0j13K20q4j09J36j71J39j14l94K48P0k9P8j91J50J06j5J8
$$ 283 441 76 170 223 313 200 420 336 227 363 192 331 217 -177 71 141 112 190 -1 149 255 240 258
2398B58j75K3J77J85j85J17p5l33K38q0j45n9L80j59p6J44j56j02P2K1J68m0j12
$$ 258 83 106 283 468 283 400 325 -8 230 150 5 -54 326 167 91 235 79 -23 49 70 238 198 86
2421H6J20k85M8k14J77PM5j3k5K42l09J06J42P6m77J02K48k13J79j52K44m9J39
$$ 86 206 -79 -31 -245 -68 -61 -16 -29 -54 188 -121 -15 127 203 -274 -172 76 -137 42 -110 134 85 224
2444B24l52l2J85n1k83R3R0J04K02k87K37j01k05J23k10K50J34j92K5Q6J12k55
$$ 224 -128 -160 25 -26 -309 -216 -126 -22 180 -107 130 29 -176 -53 -263 -13 121 -71 -46 40 152 -103
2466a03J32m8j80O8L37j97j49M45o57K9J12q7K64l1k39M48j26j84L0J62j23j76
$$ -103 29 -19 -199 -131 206 9 -140 305 -352 -323 -211 -298 -34 -65 -304 144 18 -166 -136 26 -97 -273
2488b73J96J51k70N7K78l02o6j21L41o8j23k78L00K54p7j79j06K03kn0k25J10
$$ -273 -77 74 -196 -139 139 -163 -229 -350 -9 -77 -200 -478 -178 76 -1 -180 -286 -83 -85 -135 -360 -250
2510b50K09K8N6R0q9k96J96R7R0k60k1k8L32k69J38l5P0l9p3J72j64L22o5j53
$$ -250 -41 -13 43 133 44 -252 -56 41 131 -129 -150 -178 154 -115 23 -12 58 19 -54 118 -46 276 211 58
2534E8P2J58Km6l76K26J15p8L3j44L01M7l89J70J99k16o5L52o21K57QJ81OJ5N9
$$ 58 130 288 290 244 -132 94 209 131 164 20 321 368 -21 149 348 132 67 419 -202 55 63 244 250 265 324
2559C24M5m16M34r7j4M3l68K81j08J0j4k07L08k60J92Pj67n7J50j3K6L6O9j80
$$ 324 369 -47 387 290 276 319 -49 232 124 134 120 -87 221 -39 153 160 -7 -64 86 73 99 135 204 24
2583B4j85L59j54kR0o4q1j5p7L99k02j45pJ4K03j82J35r8j70J91k7j27j45J56
$$ 24 -161 198 44 42 132 68 -13 -28 -105 294 92 -53 -60 -46 157 -25 110 12 -158 33 6 -121 -266 -110
2607a10n6r3J30j39K65j15R2k37J33K30j39p2J92r4P5p3j33M8R3j98K0M04l79
$$ -110 -166 -259 -129 -268 -3 -118 -26 -263 -130 100 -39 -111 81 -13 62 -11 -144 -96 -3 -201 -181 223 -156
2630a56k8oN64o23K83j65N5J76J4n6j55o8M4K9k5r5L20o3k53K92Q7j91K37l83
$$ -156 -184 -190 374 -249 34 -131 -76 100 114 58 -97 -165 -121 -92 -117 -212 108 45 -208 84 171 -20 217 -166
2654a66M0J67j83J67p8K0j7l1r8J98k91J30%q4K79k43L21k10j78K90o7K1J52r0
$$ -166 -126 41 -142 25 -53 -33 -50 -81 -179 19 -272 -142 -142 -226 53 -190 131 -79 -257 33 -34 -13 139 49
2678D9m5k08N51m05j81K75j46Q1n5J58j84L0k9K60j94o2L1J26j5k3l8k1J04L3
$$ 49 4 -204 347 -58 -239 36 -110 -29 -84 74 -110 -80 -109 151 -43 -105 -74 52 37 14 -24 -45 59 92
2702I2k31M1N7O8K2Nj2J62k06L0n1K08p2j2r0J63k8j35R6L9Qj47o7M75j16p2Q0
$$ 92 -139 -98 -41 27 49 54 42 204 -2 28 -23 185 113 101 11 174 146 11 107 146 154 7 -60 415 299 227 307
2729C07m25L43j62o5K29L3n6j90O9R2k2L4k9oo8j51l3L43k3j71j2k2J39l12K57
$$ 307 -118 225 63 -2 227 260 204 14 83 175 153 187 158 152 84 -67 -100 243 220 49 37 15 154 -158 99
2754I9l08L75%o6n0K9q2J24o0j5p3J88m1j35K19l76J91j01j75L12j50oo6J43k41
$$ 99 -209 166 166 100 50 79 -3 121 61 46 -27 161 120 -15 204 -172 19 -82 -257 55 -95 -101 -167 -24 -265
2779b65K33qj25J08m6k0K37l58J27K16l34K34L2j04l38L64J84j22k11M53k93l
$$ -265 -32 -40 -165 -57 -103 -123 114 -244 -117 99 -235 -1 31 -73 -411 -47 137 15 -196 257 -36 -39
2801c9p4j40R4K16m0l02K45J66j34K14k61j2K64l12J73M5j47O9n2j23J79l53L17
$$ -39 -113 -253 -159 57 17 -285 -40 126 -8 206 -55 -67 197 -115 58 103 -44 25 -27 -150 29 -324 -7
2824gl32N28j93j27K59j86l44L60k6Q7r0K06K0k41K27j78j29k14L04k4L38m20
$$ -7 -339 189 -4 -131 128 -58 -402 -42 -68 19 -71 135 155 -86 141 -37 -166 -380 -76 -100 238 -182
2846a82J15J04j78R5J33k7K9l64K54n7MmjM2J06k45L10j52J1J38k19m0J89j07
$$ -182 -67 37 -141 -46 87 60 89 -275 -21 -78 -74 -78 -79 -37 69 -176 134 -18 -7 131 -88 -128 61 -46
2870d6j69M09j20j4j79J2J55J9L8q9J66l6k22J91r1j97J63K7K10r6k19J23N0o9
$$ -46 -215 194 74 60 -119 -107 48 67 105 16 182 146 -76 115 24 -173 -10 17 227 131 -88 35 85 16
2894A6POJ52o2K36k40N7k98M52r6m02K45RL07j83k31J92L1k3J68l25L2l4o5N6
$$ 16 23 29 181 119 355 115 172 -126 326 230 -172 73 82 389 206 -25 167 198 175 343 18 50 16 -49 7
2919GR9j17J72Q6m7n5Q9q0%K66j88n4k53j09K44j69L34j46L4k02K50Q5k5k26k69
$$ 7 106 -11 161 247 200 145 234 154 154 420 232 178 -75 -184 60 -109 225 79 113 -89 161 246 221 -5 -274
2944b74L31j86J84j11j24O0K1KjK29K09l32k74Q5j24J31j8j32K98r4NL7Q0j41
$$ -274 57 -129 55 -56 -180 -120 -99 -97 -98 131 340 8 -266 -181 -305 -174 -192 -324 -26 -120 -115 -78 2 -139
2968a39J39k29K46k47J35M2R9l19K21o6L0j09JJ59k00K12k39L19n0P6l07J77J03
$$ -139 0 -229 17 -230 -95 -53 46 -273 -52 -118 -88 -197 -196 -37 -237 -25 -264 55 5 81 -226 -49 54
2991E4l0R0L1k70J49k34K01j8J36k07p1L24k43J43L0rK3N4l16K19J85m92K52n
$$ 54 24 114 145 -125 24 -210 -9 -27 109 -98 -169 155 -88 55 85 76 99 153 -163 56 241 -251 1 -4
3015dO6J37m9k88J14n5j18O7P4P2K16o3K7k16m3Q7M2j03p5J83p7PK25j18k1J4
$$ -4 62 199 150 -138 -24 -79 -197 -130 -56 16 232 169 196 -20 -63 24 66 -37 -112 71 -6 1 226 108 87 101
3041A01O4j81M2j07N7k2r2k01L55j54K04j63L9J02q8J17j35K44j36r6O8j36L0
$$ 101 165 -16 26 -81 -24 -46 -138 -339 16 -138 66 -97 -58 44 -44 73 -62 182 46 -50 18 -118 -88
3064h8P5Q7kj49R8o7K76m91L82j04n2j89M68J7k00K84k55P8J70m62N3L31k35l7
$$ -88 -13 74 72 -77 21 -46 230 -261 121 17 -35 -224 244 261 61 345 90 168 338 -124 -71 260 25 -12
3088a2J54L5l46L98m14K35Q4K11m57j4L11pq8J91l93L71n1k36J0J58k53J55P7
$$ -12 142 177 -169 229 -185 50 134 345 -112 -126 185 178 90 281 -112 259 208 -28 -18 140 -113 42 119
3111A19pj6j21K5j73O5K17k71R1J55j26q0p7L32P8l27J24L57n29K49j12q2K39
$$ 119 112 96 -25 0 -173 -108 109 -162 -71 84 -42 -122 -199 133 211 -116 8 365 -164 85 -27 -109 130
3134A30m20K35J28j05k65j9J78K11j45k67L28k55M46m5j29r5j92L05Mm7R5J4l04
$$ 130 -290 -55 73 -32 -297 -316 -138 73 -72 -339 -11 -266 180 135 6 -89 -281 24 28 -19 76 90 -214
3157b14K27j30K3J39q0J99j31j00K47l27p4J88K0j61K50l50J33KJ04K31l06J20
$$ -214 13 -117 -94 45 -35 164 33 -67 180 -147 -221 -33 -13 -174 76 -274 -141 -139 -35 196 -110 10
3179A0l6j77L42j21K00k48k69J98J69q1mJ67k19J84j10j80K47j51R8q9p7Q1l3
$$ 10 -26 -203 139 18 218 -30 -299 -101 68 -13 -17 150 -69 115 5 -175 72 -79 19 -70 -147 -66 -99
3202i9N7k5P5kl0K5j34M60k40k02O9P7n0L29j75k2j52J26j15l3Nn9O5K11k09P0
$$ -99 -42 -67 8 6 -24 1 -133 327 87 -115 -46 31 -19 310 135 113 -39 87 -28 -61 -56 -115 -50 161 -48 22
3228B2J51k23Q0k5p5J76J0o0j85J95K9j34K48j89L8M8k08K14l15O3J99j02Q6m
$$ 22 173 -50 30 5 -70 106 116 56 -129 66 95 -39 209 20 58 106 -102 112 -203 -140 59 -43 43 39
3252C9j06L06k36J53K8Pmk44M2K31l31K55j05lk41K43k33J61R0k34K61k88L54
$$ 39 -67 239 3 156 184 191 187 -57 -15 216 -115 140 35 32 -209 34 -199 -38 52 -182 79 -209 145
3275A45M1n6l20L52r7J39l66MJ70J06rKj76J3J99p5o4L0K26r0k20j03J02k6Rk36
$$ 145 186 130 -190 162 65 204 -162 -158 12 118 109 111 -65 -52 147 72 8 38 264 174 -46 -149 -47 -73 -64 -300
3301c00M78l90J95j45O6K25K1j44J23m46L40q4j00J69M5m17L59k46M1L84j15n
$$ -300 178 -212 -17 -162 -96 129 150 6 129 -317 23 -61 -161 8 53 -364 -5 -251 -210 174 59 54
3323E4j45o4K12P7q6o0l44L89j63J23Mj16o8K14k06L60l08J82j75k12J51N3j06
$$ 54 -91 -155 57 134 48 -12 -356 33 -130 -7 -3 -119 -187 27 -179 181 -127 55 -120 -332 -181 -128 -234
3346b34K40j8J20m6l7m0q5K1n4N1j79K48j3J67j43K2K00J02k53j33L50k20k62
$$ -234 6 -12 108 62 25 -15 -100 -79 -133 -82 -261 -13 -26 141 -2 20 220 322 69 -64 286 66 -196
3369a96J71J95J6j34L4R4k21L54m2k49no3l1K11j32j61K23J65J21k71Lm8j54J0
$$ -196 -25 170 186 52 86 180 -41 313 271 22 17 -46 -77 134 2 -159 64 229 350 79 82 34 -120 -110
3393a10J53Kp0j21L61k97J32Nj55q5L02j13J05J43j29j32K8j74J44M3j09M4%l4
$$ -110 43 45 -25 -146 215 -82 50 55 -100 -185 117 4 109 252 123 -9 19 -155 -11 32 -77 -33 -33 -67
3417f7P7j02K11j53j26p6K20L07k89q3J49p4J70m6k9j52k5J48j81J18l1J04j64
$$ -67 10 -92 119 -34 -160 -236 -16 291 2 -81 68 -6 164 118 89 -63 -88 60 -121 -3 -34 70 -94
3440i4J02k2j97J60J34k8j52L8J3j07K61p5q1N3j08m3K99n2Lo1k8l8R4Q7Ql02
$$ -94 8 -14 -211 -51 83 55 -97 -59 -46 -153 108 33 -48 5 -103 -146 153 101 104 43 15 -23 71 158 166 -136
3466a36P0J22k8N7p5l6k93M83p5k0j99L0J35q4J24q6J11j98J33%Q9j73q3j06K43
$$ -136 -66 56 28 85 10 -26 -319 164 89 69 -130 -100 35 -49 75 -11 100 -98 35 35 124 -49 -132 -238 5
3491Ej15L17m5q2j12pj32J34m4J34l39K75m6L8Q8j14K8qj52L28j29j96K4J67m6
$$ 5 -110 207 162 80 -32 -39 -171 -37 -81 53 -286 -11 -57 -19 69 -45 -17 -25 -177 151 22 -174 -150 17 -29
3516b9M5M8P0r5K2l7L24l29k57K68M9k15J31L7j82K49k82J70J81l88L78k58j2
$$ -29 16 64 134 39 61 24 348 19 -238 30 79 -136 -5 32 -150 99 -183 -13 168 -220 158 -100 -112
3539a12j06K5NL30k74O3K39k58J70k17K21j6O3j46O5O9M7O4l50K19k24J59j2J93
$$ -112 -218 -193 -188 142 -132 -69 170 -88 82 -135 86 70 133 -13 52 121 168 232 -118 101 -123 36 24 217
3563B17j44j5nL5k56J42J27k21Jk7K09k41K70J33l6J27l39L66l76L4J17j38O1
$$ 217 73 58 53 88 -168 -26 101 -120 -119 -146 63 -178 92 225 189 316 -23 343 -33 1 118 -20 41
3586D1l1l37J13L59j74j63P1N4M3O5k31J64j68L03J08k89L1O9j15J37j7J69j18
$$ 41 10 -327 -214 145 -29 -192 -121 -67 -24 41 -190 -26 -194 109 217 -72 -41 28 -87 50 33 202 84
3609H4n0k7K01k96j30N38j1o04L92k59O4K56k50P9r9p2qP0J96j34J83R1j51k71
$$ 84 34 7 208 -88 -218 320 309 -295 97 -162 -98 158 -92 -13 -112 -184 -192 -122 74 -60 123 214 63 -208
3633b08J54O3K6q8p0K94m2j78P8q6K84P4m31j2P5M0P5J27j48L1K06m21J85j22
$$ -208 -54 9 35 -53 -123 171 129 -49 29 -57 227 301 -130 -142 -67 -27 48 175 27 58 264 -157 28 -94
3657i4O2Q7j9j36J39J74j20Q1k62j11L64o6l38J33j1L1K15j89J00k20j77L59K8
$$ -94 -32 55 36 -100 39 213 93 174 -88 -199 165 99 -239 -106 -117 -86 129 -60 40 -180 -357 2 30
3680C0m7j45O4l8j55R3J88K06j24l56J79P5q0O2j35k4K15J69k40K93j39l12J90
$$ 30 -17 -162 -98 -136 -291 -198 -10 196 72 -284 -105 -30 -110 -48 -183 -207 8 177 -63 230 91 -221 -31
3703c1j70R1J08J69L9k49Jj9K15o2L9Q3r2R5m1j16Rk08J55L10m52L62l36J58K60
$$ -31 -201 -110 -2 167 206 -43 -42 -61 154 92 131 214 122 217 176 60 69 -139 16 326 -126 236 -100 58 318
3728C18m07l6L03l64L11j02Q1K52k67k52K87qm32K15K62l7l2N0j42o6K10l92M3
$$ 318 -89 -125 178 -186 125 23 104 356 89 -163 124 116 -316 -101 161 124 92 142 0 -66 144 -248 -205
3751b05J56Q0k48J21K5Ro9j5J31L7RjJ05j42L03l77j1L38l47K63k73Q4O3j3mj29
$$ -205 -49 31 -217 -96 -71 -62 -131 -146 -15 22 31 30 135 -7 296 -81 -92 246 -101 162 -111 -27 36 23 19 -110
3777a10N2O4j50P5j53L42l32J40J35j02K16k56K08j97qJ05j2K49k80J97j38j7
$$ -110 -58 6 -144 -69 -222 120 -212 -72 63 -39 177 -79 129 -68 -76 29 17 266 -14 183 45 28
3799B8J3k99L06k51J44J85Q2j36j39J50K5P9l99K93k71J11n4J34J41k39O60m21
$$ 28 41 -258 48 -203 -59 126 208 72 -67 83 108 187 -212 81 -190 -79 -133 1 142 -97 563 142
3821A42j05j11j64J77M1Lp5Q2lN4j09k36N84k10p0r4N7J26j80J04j59K08o3J27
$$ 142 37 -74 -238 -61 -20 -17 -92 -10 -13 41 -68 -304 280 70 0 -94 -37 89 -91 13 -146 62 -1 126
3845A26R0l24m6P3rK44l49K44L06o60K67K2O4J5k03J64K2l97L48m8j45K02j36
$$ 126 216 -108 -154 -81 -90 154 -195 49 355 -305 -38 -16 48 63 -140 24 46 -351 -3 -51 -196 6 -130
3868a30L80J01k85j96O1R8j31J0j14J8K56p6M6K78j30k44mJ06r5J43j40J34r8
$$ -130 250 351 66 -130 -69 29 -102 -92 -206 -188 68 -8 38 316 186 -58 -62 44 -51 92 -48 86 -12
3891a2j27L37j97j0k4L09j90o9J5LJ15k00J36Q1k50Q8j23J24o0L66n2m09j18K83
$$ -12 -139 198 1 -9 -33 276 86 17 32 35 150 -50 86 167 -83 5 -118 6 -54 312 260 -149 -267 16
3915A6m2J05j16K73m00L91k09k5p9J66OJ46o78L56K53P9l99J88k26L19k40j00
$$ 16 -26 79 -37 236 -164 227 18 -7 -86 80 86 232 -446 -90 163 242 -157 31 -195 124 -116 -216
3937b16O0J26mN7Q7q3N2k06J43p9k81N85l10L3k0k99M23o1l59K31J09P3M5k00
$$ -216 -156 -30 -34 23 110 27 79 -127 16 -63 -344 241 -69 -36 -56 -355 68 7 -352 -121 -12 61 106 -94
3961i4n4L43k73mj26q0J97ol5jJ90q4j51K42k09K20k14k5L72j32j89J01k6j44
$$ -94 -148 195 -78 -82 -208 -288 -91 -97 -132 -133 57 -27 -178 64 -145 75 -139 -164 208 76 -113 -12 -38 -182
3985a82J74P8k76M37j67j79o1J98k42J93Po6R8L04Q0k33j1l21K80j4k71L30k66
$$ -182 -8 70 -206 231 64 -115 -176 22 -220 -27 -20 -86 12 316 396 163 152 -169 111 97 -174 156 -110
4008a10J80j18J44Q0j04N1J6l43K72m6j03J97k13J04k6l0J18J04l99J38K82J6
$$ -110 70 -48 96 176 72 123 139 -204 68 22 -81 116 -97 7 -19 -49 69 173 -226 -88 194 210
4030B10l26o3MJ69K00l95k2J5J70K24l81J39j89R4L99k65J4j44K24J16J12l88
$$ 210 -116 -179 -175 -6 194 -201 -223 -208 -38 186 -195 -56 -245 -151 248 -17 -3 -147 77 193 305 -83
4052h3J55o3l10N26K7l93m8K10%j15L23k96O1K17j44L5k20j26K72J30k71Q2K27
$$ -83 72 9 -301 225 252 -141 -189 21 21 -94 229 -67 -6 211 67 102 -118 -244 28 158 -113 -31 196
4075A96Ml19O7k5R6j51L45q0m1k79K77P1j29Q5q0q0j20K52J82n18L95k03n5L21
$$ 196 200 -119 -52 -77 19 -132 213 133 92 -187 90 161 32 117 37 -43 -163 89 271 -247 148 -55 -110 211
4099B11l31K5K78k52M9O0J4M2k38R6K2r1q3K20m2K5P8j94K32j08j4Q9k50M04j41
$$ 211 -120 -95 183 -69 -20 40 54 96 -142 -46 -24 -115 -198 22 -20 5 83 -111 121 13 -1 88 -162 242 101
4124A01N2l45L15n9m9j03J62k45J11J41k17J86k29P3j28M43l75N8K96o69M87j79
$$ 101 153 -192 123 64 15 -88 74 -171 -60 81 -136 50 -179 -106 -234 209 -166 -108 188 -481 6 -173
4146a73O1J69j94P4j42K78Ol41M25j12l2K09p6O6r2K5M1k3k57j9J45j34Q3K8N
$$ -173 -112 57 -137 -63 -205 73 79 -262 163 51 19 228 152 218 126 151 192 169 -88 -107 38 -96 -13 15 20
4171B0k4j12N3L8N7J57j32K1L4P9l90J76l48N71j14j3m1J8J61l40J04K41k38l7
$$ 20 -4 -116 -63 -25 32 189 57 78 112 191 -199 -23 -371 200 86 73 32 50 211 -129 -25 216 -22 -59
4195e9M10k34nk58L43J96n61J58K19q5k77L8K84J08j96Lj43J12j24N1n5J08j12
$$ -59 351 117 112 -146 197 393 -168 -10 209 124 -153 -115 169 277 81 84 -59 53 -71 -20 -75 33 -79
4218g9K84O6k26j21N3J07k61J64j47K81m76K76k23L26R4J01k73r6M13l12m2K97
$$ -79 205 271 45 -76 -23 84 -177 -13 -160 121 -355 -79 -302 24 118 219 -54 -150 263 -49 -91 206
4240B06l70J7P3J78r1j30J6J86k51J73o8J01k5J24R2l97L8K67j45k01N45m13L66
$$ 206 -164 -147 -74 104 13 -117 -101 85 -166 7 -61 40 15 139 231 -166 -128 139 -6 -207 338 -75 291
4263B91k98l8n2j55M87k2p0m6n3k82K66P3k4M7j56J93J3K4Pj13j56J20j25K6k38
$$ 291 -7 -45 -97 -252 235 213 143 97 44 -238 28 101 77 124 -32 161 174 198 205 92 -64 56 -69 -43 -281
4288b81L42J14k4l93L89k52Q4m3j38K48k1m9q2J67k39J51OJ90j87o7J83j18j60
$$ -281 61 175 151 -242 147 -105 -21 -64 -202 46 25 -24 -106 61 -178 -27 -21 169 -18 -85 98 -20 -180
4311a80N8J01J11j13j08q5K98L3Pj10q7nj20J3Q6J31k14K32K00k30o3k9m7K55
$$ -180 -122 -21 90 -23 -131 -216 82 115 122 12 -75 -80 -200 -187 -101 30 -184 48 248 18 -45 -74 -121 134
4335A34l14J34j52M78o27M65l53K70n3j16J40n7L01n2k42O1l0j52J78k7J59l88
$$ 134 -180 -46 -198 280 -347 118 -235 35 -18 -134 6 -51 250 198 -44 17 -13 -165 13 -14 145 -243
4357b43K10n3J8K16j96J78Q7l34K66k17l2J96m2k83J01K66J33n80J60J71k60L99
$$ -243 -33 -86 -68 148 -48 130 217 -117 149 -68 -100 96 54 -229 -128 138 271 -309 -149 22 -238 161
4379A61k28J24l3O4k09R7J2J04k30n2P3J71m6J60k22n2m1J00M6J76j18r7K05l52
$$ 161 -67 57 24 88 -121 -24 -12 92 -138 -190 -117 54 8 168 -54 -106 -147 -47 -1 175 57 -40 165 -187
4403a87O2o2K90O6j56j34Q8k13K81k62L31k87M6n0K64J82m67kM10k62j97K98k20
$$ -187 -125 -187 103 169 13 -121 -33 -246 35 -227 104 -183 -137 -187 77 259 -208 -210 200 -62 -259 39 -181
4426a81L31k46K59j37J39m81L28k49M47m10Q7r1K15p9n1M13k41L42k02J54l65
$$ -181 150 -96 163 26 165 -316 12 -237 210 -200 -113 -204 11 -68 -119 294 53 395 193 347 -18
4447a8l1%J68j26Q4k26L23j8Jl33J96N5j53J57J52p3k1j13%J10k79J82j49n1L89
$$ -18 -49 -49 119 -7 77 -149 174 156 157 -176 20 75 -78 79 231 158 137 24 24 134 -145 37 -112 -163 226
4472B26k54p2Nk1L27o2k92J49j89J55o4j40K47o4k1J61k2j73jJ55j71J96k14K68
$$ 226 -28 -100 -95 -116 211 149 -143 6 -183 -28 -92 -232 15 -49 -70 91 69 -104 -105 50 -121 75 -139 129
4496A29l8k91K50Q0j37J05l2Jk35L6Q4L6J72l15K05l4M7k42K38J93j41q0O4j9
$$ 129 91 -200 50 130 -7 98 66 67 -168 -132 -48 -12 160 -155 50 16 63 -179 59 252 111 31 95 76
4520G6j13m7J88N7l35K69p5j5M2j13O0j18j04J13K15j35J3j1J01P9l63K99N2j75
$$ 76 -37 -84 104 161 -174 95 20 5 47 -66 -6 -124 -228 -115 100 -35 -22 -33 68 147 -216 83 135 -40
4544d0Nk7j65j65M69j39p5L23q7j28n0n9J94L7p4q2K35p3l82K16k4K01j86L24
$$ -40 -35 -62 -227 -392 77 -62 -137 186 99 -29 -79 -138 56 93 19 -63 172 99 -283 -67 -91 110 -76 248
4568B48m05R9J9K73k52MN4k19J75O8k49Q9j44J21K53l33J85j76P6o6J32O1J21
$$ 248 -157 -58 -39 234 -18 -14 40 -179 -4 64 -185 -96 -240 -119 134 -199 -14 -190 -114 -180 -48 13 134
4591A34m22L52L8K63o37L5K22p3J28j92L3p9J91k88L48q2m8L91k05M3k67J33n3
$$ 134 -288 64 102 365 -272 -237 -15 -88 40 -152 -119 -198 -7 -295 53 -29 -77 314 109 152 -115 18 -35
4614c5J93j80J54p2k14L36k08nQ7J82m0j96J24K23k21j88J53k40K40j03J8P0K9
$$ -35 158 -22 132 60 -154 182 -26 -31 56 238 198 2 126 349 128 -60 93 -147 93 -10 8 78 107
4637A07qMr0j40K47k33K6N5r2%J68J66k30J14k23J52K00n51L19J51j0l48K49j45
$$ 107 99 103 13 -127 120 -113 -87 -32 -124 -124 44 210 -20 94 -129 23 223 -328 -9 142 132 -216 33 -112
4661a12K85k91j16J76J6p6J0p1J41Q3j49P8p4K67l01J06J42j75j82M8J06m0J04
$$ -112 173 -118 -234 -58 -42 -118 -108 -179 -38 45 -104 -26 -100 167 -134 -28 114 -61 -243 -195 -89 -129 -25
4684b5J33j02j07K53j36j85M8K18o2k73J56k65J63J22r1j7K05J3P0l75J60L08
$$ -25 108 6 -101 152 16 -169 -121 97 35 -238 -82 -347 -184 -62 -153 -170 35 48 118 -257 -97 211
4706B11j70O2l9j16J10qR2j29m5J0R0J59j0k24q9J10J14R9j62k3j05j71K25k2
$$ 211 41 103 64 -52 58 50 142 13 -32 -22 68 227 217 -7 -96 14 128 227 65 42 -63 -234 -9 -31
4730c1R3n5N0l8k05M19j94P9j53J5K49j43j50j47J83k1K11j96j11M02m34k28J96
$$ -31 62 7 57 19 -186 233 39 118 -35 -20 229 86 -64 -211 -28 -49 162 -34 -145 257 -177 -405 -209
4753b09M68l58J10J96j25M3k25K87l03Q4r4J14j58K54k1J55J72o57L20m3j87K59
$$ -209 259 -99 11 207 82 125 -100 187 -116 -32 -126 -12 -170 84 63 218 390 -267 53 10 -177 82
4775H2k85M35j77m89M40J55l4j15k46J67J25r0R8J59m54K96k38l9J80k43L68q1
$$ 82 -203 232 55 -434 6 161 127 12 -234 -67 58 -32 66 225 -229 67 -171 -210 -30 -273 95 14
4797A4o0n8L70j90K03k42J52k69K3N6k6j95K38qN8J4P3j5n1j2k71L41j56J53r4
$$ 14 -46 -104 266 76 279 37 189 -80 -57 -1 -27 -222 16 8 66 80 153 138 87 75 -196 145 -11 142 48
4822D8O0p6r9L1K50j2k61J3Q8J43l40K91k59K10n9j19k3J9J90k19J5p0J43j63
$$ 48 108 32 -67 -36 214 202 -59 -46 42 185 -155 136 -123 87 28 -91 -114 -95 95 -124 -109 -179 -36 -199
4846a99K61L7RK7j19L7j06O4j72q7P9N66n17K23J1j87O6O6k65j27L76j34k6K08
$$ -199 62 99 108 135 16 53 -53 11 -161 -248 -169 397 -120 103 114 -73 -7 59 -206 -333 43 -91 -117 91
4870I1j48P1J6p5j37K22j19J46j88J90k18lL29j37K3k66k3m2L16r7L04j87O5j52
$$ 91 -57 14 30 -45 -182 40 -79 67 -121 69 -149 -152 177 40 63 -203 -226 -268 48 -49 255 68 133 -19
4894a9M2J64j18k14K72j74Kl30L22J11j81M06j84Oj2m2N0P6m01k1L14r0L3J25
$$ -19 23 187 69 -145 127 -47 -45 -375 -53 58 -123 283 99 105 93 51 101 177 -224 -245 69 -21 12 137
4918A37j9j3k03J10k26L62r0l07J72K0m8j06J73j3j04J27J02J49j33K9k65K7J00
$$ 137 118 105 -98 12 -214 148 58 -249 -77 -57 -105 -211 -38 -51 -155 -28 74 223 90 119 -146 -119 -19
4941a9J2Q1k14R3K75j59n9j62L18q4q8j36N2L05j58p2p5K5j15K94k01K9j20J22
$$ -19 -7 74 -140 -47 228 69 10 -152 166 82 -6 -142 -90 215 57 -15 -90 -65 -180 114 -87 -58 -178 -56
4965e6R5k7K4j68L33j69N5j24K43j42r0k5J3k2K03m6P4j63n7J49r8j2Q7K11j27
$$ -56 39 12 36 -132 201 32 87 -37 206 64 -26 -51 -38 -60 143 97 171 8 -49 100 2 -10 77 288 161
4990A61j40k2j72K42J23q6R5P3k93Q2l1K52k74m6M6K01q6j95J40k23o5P2K95M3
$$ 161 21 -1 -173 69 192 106 201 274 -19 63 32 284 10 -36 10 211 125 -70 70 -153 -218 -146 149 192
5014A92l13J41J80l15J60J27l59R5K20j10L3q0kK03m0j17P4k1j17R7j69K80k23
$$ 192 -121 20 200 -115 45 172 -187 -92 128 18 51 -29 -31 172 132 15 89 68 -49 48 -121 159 -64
5037f4k41M22k09J79j42R2Ro6M7k04J87q7O9L9r2J43j47J70p0k56K19J63j21j64
$$ -64 -305 117 -92 87 -55 37 46 -20 27 -177 10 -77 -8 31 -61 82 -65 105 35 -221 -2 161 40 -124
5061a24J33l5n3j7o6K44j63R4J7Kj47O9j00L58k58J64l83M39k4l18j60L62n5j6
$$ -124 9 -26 -79 -96 -162 82 -81 13 30 32 -115 -46 -146 212 -46 118 -265 174 150 -168 -328 34 -21 -37
5085c7K11l52J04q7K25j82J03K61j86k63J43l9L40j26j17n5J72j48j55M06j54
$$ -37 174 -178 -74 -161 64 -118 -15 246 60 -203 -60 -99 241 115 -2 -57 115 -33 -188 218 64
5106F4p3r9J54OM5k70K37J7O3j69J52k5k7m3j15n9L83k22J3p2l7j4P1k31J4P8
$$ 64 -9 -108 46 52 97 -173 64 81 144 -25 127 102 75 32 -83 -142 241 19 32 -40 -77 -91 -20 -251 -237 -159
5132a59J43J33j81J74r5o1J46q2Ml02L51j6Lo7j2l8J77R5j75K59l86L1J19j36
$$ -159 -16 117 -64 110 15 -46 100 18 22 -280 71 55 58 -9 -21 -59 118 213 38 297 -89 -58 61 -75
5156g5j9P2j69J95J22o4K55k10j66p0L2o1N8M02k30q8J6J94j27j75N7j92N28l86
$$ -75 -94 -22 -191 4 126 62 317 107 -59 -129 -97 -158 -100 302 72 -16 0 194 67 -108 -51 -243 285 -101
5180a01K80k94Q4N3O8Nj42J19j54Q0J44n2j15j01Q1J3Q2O6l35K50J77J3l68K9
$$ -101 179 -115 -31 22 90 95 -47 72 -82 -2 142 90 -25 -126 -45 -32 50 116 -219 31 208 221 -147 -118
5204a18j12L11k48J50J8jL13n71j8K97L08n80L83Mk40j2o1K73l35K37Pjj80Q1
$$ -118 -230 81 -167 -17 1 0 313 -258 -276 21 329 -251 132 136 -104 -116 -177 96 -239 -2 5 4 -176 -95
5228i5L25k20j66j6on8K67lk41L5K06R9m1k49P9K78j47J41n1j60k03J83J65k16
$$ -95 230 10 -156 -172 -178 -236 31 28 -213 -178 28 127 86 -163 -84 194 47 188 137 -23 -226 -43 122 -94
5252i4M7l6K25K6m54J95P9j47J98L0J94m04J90R4k73n8J27R3l5Q6l7m7P5k64R2
$$ -94 -47 -83 142 168 -286 -91 -12 -159 39 69 263 -141 49 143 -130 -188 -61 32 -3 83 46 -1 74 -190 -98
5277i8K7K03k54K66j49l0q6J88N5j93J01J56k59l4j08K00j8R1n0j10J81l34L05
$$ -98 -71 132 -122 144 -5 -35 -121 67 122 -71 30 186 -73 -107 -215 -15 -33 58 8 -102 79 -255 50
5300E0P5k3q5J2l10k76O69j18n0j86K06J13J16j01j60K43k99j49K15J76m52N05
$$ 50 125 102 17 29 -281 -557 112 -6 -56 -242 -36 77 193 92 -68 175 -124 -273 -58 118 -334 171
5322A71k49J60k32L31K8l00nJ28k2J34q9k75L83k61j0K16j10M5J30k77R4n3J41
$$ 171 -78 82 -150 181 209 -91 -96 32 10 144 55 -220 163 -98 -108 108 -2 43 173 -104 -10 -63 78
5345G8j70j50J23M15l01M2n1l30N15n9p0m3j6J46K7k84NJ53p7L21k13k4M2Pq4
$$ 78 -92 -242 -119 296 -5 37 -14 -344 171 112 42 -1 -17 129 156 -128 -123 30 -47 274 61 37 79 86 2
5370BO8O4k5k09J15k22M22k66M5K62l08J3K3P7J9rL7j18JJ34l5k6R4j96R4N9j78
$$ 2 70 134 109 -100 15 -207 215 -51 -6 256 -52 -39 -16 61 80 71 108 -10 -9 125 90 64 158 -38 56 115 -63
5397f3J06J54k73K1P2j27K14k06J02q4L8N8j57j5J55k09K66R0j17M5j61J20Q6
$$ -63 43 197 -76 -55 17 -110 104 -102 0 -84 -46 12 -145 -160 -5 -214 52 142 25 70 -91 29 115
5420A15j82L3j08J14J3K71k73K2J21j94O3j05L94k54Kk92K13K63p5j57J33l33
$$ 115 -67 -34 -142 -28 -15 256 -17 5 126 -68 -5 -110 284 30 32 -260 -47 216 141 -16 117 -216
5442b16J83JJ77n4J81k27j51P8p2J61j63J95l4J24k94J89k30rK23l1O1j21k8K28
$$ -216 -33 -32 145 91 272 45 -106 -28 -100 61 -102 93 59 183 -111 78 -152 -161 62 31 92 -29 -57 171
5466A71n34K44J89m9N4l7J28j8r4k1j67K48J25l85j98M45N8k66Q6N9n7j23K40
$$ 171 -363 -119 70 21 75 38 166 148 54 33 -134 114 239 -146 -344 101 159 -107 -21 38 -19 -142 98
5489I8K0l48N4M36J51o40J09Pj22L36K08N5o85K50J29Nk25j17K46p7M2K7J46j33
$$ 98 118 -230 -176 260 411 -229 -120 -113 -235 101 309 364 -321 -71 58 63 -162 -279 -33 -110 -68 -41 105 -28
5513b8R0j55K07k90K8J78K28k42k53M14j57p6L91j84j61Q2j28J42k66K39J49k16
$$ -28 62 -93 114 -176 -148 30 258 16 -237 177 20 -56 335 151 -10 72 -56 86 -180 59 208 -8
5535hP1j05L36j75k41K96j05O2k80J69j49L0M3M0J61j88r2K7l9O5Q9p1J95l30
$$ -8 63 -42 294 119 -122 174 69 131 -149 20 -129 -99 -56 -16 145 -43 -135 -108 -147 -82 7 -64 131 -199
5559a99K96Q2m13J70J80j92j1o3O1k04N08j75J00l98Q8J32J07k29K76j44j50L9
$$ -199 97 179 -234 -64 116 -76 -87 -150 -89 -293 215 40 140 -258 -170 -38 69 -160 116 -28 -178 -139
5581a39RJ37l06J09N35l11o2Q1k74L09o7j02J17K8j33J34p1n3Lk5K90k16M8J41
$$ -139 -130 7 -299 -190 345 34 -28 53 -221 88 21 -81 36 64 -69 65 -6 -59 -56 -81 209 -7 41 182
5605A82k25J19L13l30j07J26k78L12p2J0l1k00J08JP7K85l48J50m67M90j68j54
$$ 182 -43 76 389 59 -48 78 -200 112 40 50 19 -181 -73 -72 5 290 -58 92 -375 115 -53 -207
5627b07R8K21j3kp1J29k39j93L97l18K96l4O7l76N26l84K87m00N02l79N8O8k43
$$ -207 -109 112 99 97 26 155 -84 -277 120 -198 98 64 131 -245 281 -103 184 -216 286 -93 -35 33 -210
5650b10L15k07P6K5o7j02j53L12l7k70L34nj97N9J52J6j00n7RR9O8o1j12J61R0
$$ -210 105 -102 -26 -1 -68 -170 -323 -11 -48 -318 16 11 -186 -127 25 41 -59 -116 -107 -8 60 -1 -113 48 138
5675A38J0l12m9j2L21k58M13L4j49J4l6L9Q5N3l9m54n3n6N10l25N0K27k7j86J87
$$ 138 148 -164 -213 -225 96 -162 251 285 136 150 114 153 238 291 252 -202 -255 -311 199 -126 -76 151 124 -62 125
5700A25j39k5J81p8j8j29L0J65k43N9M5M1Q5k9N0j23J99k29J1O2J8P5j21m5J00
$$ 125 -14 -39 142 64 46 -83 -53 112 -131 -72 -27 14 99 70 120 -3 196 -33 -22 40 58 133 12 -33 67
5725F7k05O9J75Q9j97N5q2j63K85j21q6K58j09Q0l68Q7p9J36K1K29k16M6J09P2
$$ 67 -138 -69 106 195 -2 53 -29 -192 93 -28 -114 144 35 115 -253 -166 -245 -109 -88 141 -75 -29 80 152
5749A52k07p6K07l85K59J8J18O1n2K9K8j13J10k12n1J60m1m0K4R1R7R5n71j5J56
$$ 152 -55 -131 76 -309 -50 -32 86 147 95 124 152 39 149 -63 -114 46 5 -35 -11 80 177 272 -299 -314 -158
5774a58jq6L60k72J5Q8j98J65j3J63J39j08j28L87k95l5k48Q3O9mJ3L2n8L3p4
$$ -158 -159 -245 115 -157 -142 -54 -252 -87 -100 63 202 94 -34 353 58 23 -225 -142 -73 -77 -64 -32 -90 -57 -131
5799a31L05l85J64j63O39n08M64l35k36K79j55L02k76P2j51J22J81J1l64J34K90
$$ -131 174 -211 -47 -210 429 -79 385 50 -186 93 -62 240 -36 36 -115 7 188 199 -165 -31 259
5820B59k15k89J46K20N6k49l9R1K24j05l82J08K8L29l5j50R3j95Q2j61K7J74R3
$$ 259 44 -245 -99 121 177 -72 -111 -20 204 99 -283 -175 -147 182 147 -3 90 -105 -23 -184 -157 17 110
5843A10j4J88l14J12q3k9J12L5k40L48l67L26k25O0K9j07J53j90M8o7J63k16J36
$$ 110 96 284 -30 82 -1 -30 82 117 -123 225 -142 184 -41 19 48 -59 94 -96 -48 -115 48 -168 -32
5866c2j66M73k96n2j4K75k19K46j72j66R6J30k75J88j67k6J73J11r5m0J94j58
$$ -32 -198 275 -21 -73 -87 188 -31 215 43 -123 -27 103 -172 16 -151 -177 -4 107 12 -28 166 8
5888Hk22J21N3J08j49JJ39m85M38j46j06N56k39k18k7J87k4K51j48r5k11K98M3
$$ 8 -214 -93 -40 68 -81 -80 59 -426 12 -134 -240 316 77 -141 -168 19 -5 246 98 3 -208 90 133
5911A33r0j21P5M1j31L9k66N77m62J25L29k73M2n7L7j10j06J12L10l16m8j1J67
$$ 133 43 -78 -3 38 -93 -54 -320 257 -205 -80 249 -24 18 -39 -2 -112 -218 -106 204 -112 -160 -171 -4
5934dO3J42m67L12k96L57r0j8J7j03k7J61k02L9K21j05k9l0o6J63J39k88P7n2
$$ -4 59 201 -266 46 -250 107 17 -1 16 -87 -114 47 -155 -116 105 0 -29 -59 -125 38 177 -111 -34 -86
5958h6J86p2k2k3P2J46j9k11P1m2r7Q6p0%J69l50L66k30O5J42j24n2l5K59r5J35
$$ -86 100 28 6 -17 55 201 182 -29 42 0 -97 -11 -81 -81 88 -262 104 -126 -61 81 -43 -95 -130 129 34 169
5984A69j67J44k07q0L05m1k06J28J35k48R7Q0l8j01M4m6J87k38N5p1p1L10p6O6
$$ 169 2 146 -61 -141 164 123 -83 45 180 -68 29 109 71 -30 14 -32 155 -83 -28 -99 -170 140 64 130
6008A30l0L7j62j55K36q8L0K06n76K97J90MK8l4j46j07P9N6N5J10J02kj84j33
$$ 130 100 137 -25 -180 56 -32 -2 204 -372 -75 115 119 147 113 -33 -140 -61 -5 50 160 262 260 76 -57
6032e7J22k76L97j30l31L69P5m57L38j26J90j77J45p0J28l69J60k13P8K77n6N0
$$ -57 65 -211 186 56 -275 94 169 -288 50 -76 114 -63 82 12 140 -229 -69 -282 -204 73 17 67
6054F7k88m0L34K6J13J2n22L82P3q2j82K61k86J27k7J37n6j4L1k9Q2K5k33M75
$$ 67 -221 -261 73 99 212 224 -298 84 157 75 -107 154 -132 -5 -32 105 49 35 66 37 119 144 -89 386
6078C86m82n7J48K0Q0P2j78LJ8j04m7J60J83m47L22k84k3J48P4J15k00MK15j42
$$ 386 -96 -153 -5 15 95 167 -11 -8 10 -94 -141 19 202 -245 77 -207 -230 -82 -8 107 -93 -89 126 -16
6102a6Q8k50P3K47j12r4j34J78J63l11j44L48n0k8k13L54J06j24j26M4j60K53
$$ -16 72 -178 -105 142 30 -64 -198 -20 143 -168 -312 36 -14 -42 -255 99 205 81 -45 -1 -161 92
6124I2J2M6k70J20k8O9q6n0J10k3Q2K71l29O9r2j3j72J71kp5J97Mn9M9pJ50l45
$$ 92 104 150 -120 0 -28 41 -45 -95 15 -8 74 345 16 85 -7 -20 -192 -21 -23 -98 99 103 44 93 86 236 -109
6151a09r3L44k29K65M0j98m4K6R2J15k22j60J40J29j23J06j7K2qk10J21J75j93
$$ -109 -202 142 -87 178 218 20 -24 2 94 209 -13 -173 -33 96 -27 79 62 84 76 -134 -13 162 -31
6174c1J26k08R5r2k93L19J96Q9l66q7L10j20J78M4j11J54j91k03J97L9j50J29
$$ -31 95 -113 -18 -110 -403 -84 112 201 -165 -252 58 -62 116 160 49 203 12 -191 6 45 -105 24
6196B4J47j78J87j82L6k61K74k69q3L81j73M7L01l22J47K05l11m20O33r6l77M63
$$ 24 171 -7 180 -2 34 -227 47 -222 -305 76 -97 -50 251 -71 76 281 -30 -450 183 87 -290 173
6218A73k69K23n11J94R3K30q2O4j21j37J79K6%k12M79r1j89K67m04L2M8Jk9j50
$$ 173 -96 127 -384 -190 -97 133 51 115 -6 -143 36 62 62 -150 329 238 49 316 -88 -56 -8 -7 -36 -186
6242a86K14j21J89k60J77J09k21L53j92k60L45K2L6j06j22J01oj84LK26o8k78
$$ -186 28 -93 96 -164 13 122 -99 254 62 -198 147 169 205 99 -23 78 72 -112 -109 117 49 -229
6264b29K82J2k28J37m0q3J63k02K84j64J7m3J55R6k75Q6K8no7P6M8k20K11o2n8
$$ -229 53 65 -163 -26 -66 -149 14 -188 96 -68 -51 -94 61 157 -118 -32 -4 -9 -76 0 48 -172 39 -23 -81
6289h1o2K95j16j2L0L9k11m6P6K17l34K18P9m9j67j3J69j10J67j04o9Q2J50j19
$$ -81 -143 152 36 24 54 93 -118 -164 -88 129 -205 13 92 43 -124 -137 32 -78 89 -15 -84 -2 148 29
$$ [...]
8191a11
##END NTUPLES=NMR FID
##END=
