##TITLE=1H_SR80 Gly4
 CDCl3, 8 sc, 
 31.8.2021
##JCAMPDX= 6.0         $$ Bruker NMR JCAMP-DX V2.0
##DATA TYPE= NMR FID
##DATA CLASS= NTUPLES
##ORIGIN= UXNMR, Bruker Analytische Messtechnik GmbH
##OWNER= root
$$ XWIN-NMR		Version 3.5
$$ Wed Sep  1 09:40:06 2021 Russian Standard Time (UT+4h)  she@DPX200
##.OBSERVE FREQUENCY= 200.1312
##.OBSERVE NUCLEUS= ^1H
##.DELAY= (6, 6)
##.ACQUISITION MODE= SIMULTANEOUS
##.ACQUISITION SCHEME= undefined
##.AVERAGES= 8
##.DIGITISER RES= 18
##SPECTROMETER/DATA SYSTEM= spect
##.PULSE SEQUENCE= zg30
##.SOLVENT NAME= CD2Cl2
##.SHIFT REFERENCE= (INTERNAL, CD2Cl2, 0, 15.7039)
##AUDIT TRAIL= $$ (NUMBER, WHEN, WHO, WHERE, WHAT)
$$ ##TITLE= Audit trail, XWIN-NMR		Version 3.5
$$ ##JCAMPDX= 5.01
$$ ##ORIGIN= Bruker BioSpin GmbH
$$ ##OWNER= she
$$ F:/spectra/data/she/nmr/H-F/1/audita.txt
$$ ##AUDIT TRAIL=  $$ (NUMBER, WHEN, WHO, WHERE, WHAT)
(   1,<2021-09-01 09:38:46.18 +0400>,<she>,<DPX200>,
      <created by zg, POWCHK disabled, PULCHK disabled
       configuration hash MD5:
       00 E9 B6 7A A2 85 ED C7 34 08 36 98 17 FE 4E 26
       data hash MD5: 16K
       07 97 25 1E 40 D8 85 28 F9 50 92 77 9F 94 06 55>)
$$ ##END=
$$ 
$$ hash MD5
$$ FC E0 74 CB 92 F0 66 75 05 76 61 18 91 22 26 08
##$RELAX= 
##$RELAX= 
##$RELAX= 
##$RELAX= 
##$RELAX= 
##$RELAX= 
$$ Bruker specific parameters
$$ --------------------------
##$DU= <F:/spectra>
##$EXPNO= 1
##$NAME= <H-F>
##$PROCNO= 1
##$TYPE= <nmr>
##$USER= <she>
##$AMP= (0..31)
100 100 100 100 100 100 100 100 100 100 100 100 100 100 100 100 100 100 
100 100 100 100 100 100 100 100 100 100 100 100 100 100 
##$AQSEQ= 0
##$AQ_mod= 1
##$AUNM= <au_zg>
##$AUTOPOS= <>
##$BF1= 200.13
##$BF2= 200.13
##$BF3= 200.13
##$BF4= 200.13
##$BF5= 200.13
##$BF6= 200.13
##$BF7= 200.13
##$BF8= 200.13
##$BYTORDA= 1
##$CFDGTYP= 0
##$CFRGTYP= 5
##$CHEMSTR= <none>
##$CNST= (0..31)
1 1 145 1 1 1 1 1 1 1 1 1 1 1 1 1 1 1 1 1 1 1 1 1 1 1 1 1 1 1 1 1 
##$CPDPRG= <>
##$CPDPRG1= <>
##$CPDPRG2= <>
##$CPDPRG3= <>
##$CPDPRG4= <mlev>
##$CPDPRG5= <mlev>
##$CPDPRG6= <mlev>
##$CPDPRG7= <mlev>
##$CPDPRG8= <mlev>
##$CPDPRGB= <>
##$CPDPRGT= <>
##$D= (0..31)
0 1.2 0 0 0 0 0 0 0 0.06 0 0.03 0 0 0 0 0.0002 0 0 0 0 0 0 0 0 0 0 0 0 
0 0 0 
##$DATE= 1630474725
##$DBL= (0..7)
120 120 120 120 120 120 120 120 
##$DBP= (0..7)
150 150 150 150 150 150 150 150 
##$DBP07= 0
##$DBPNAM0= <>
##$DBPNAM1= <>
##$DBPNAM2= <>
##$DBPNAM3= <>
##$DBPNAM4= <>
##$DBPNAM5= <>
##$DBPNAM6= <>
##$DBPNAM7= <>
##$DBPOAL= (0..7)
0.5 0.5 0.5 0.5 0.5 0.5 0.5 0.5 
##$DBPOFFS= (0..7)
0 0 0 0 0 0 0 0 
##$DE= 6
##$DECBNUC= <off>
##$DECIM= 32
##$DECNUC= <off>
##$DECSTAT= 4
##$DIGMOD= 1
##$DIGTYP= 9
##$DL= (0..7)
0 120 120 120 120 120 120 120 
##$DP= (0..7)
150 150 150 150 150 150 150 150 
##$DP07= 0
##$DPNAME0= <>
##$DPNAME1= <>
##$DPNAME2= <>
##$DPNAME3= <>
##$DPNAME4= <>
##$DPNAME5= <>
##$DPNAME6= <>
##$DPNAME7= <>
##$DPOAL= (0..7)
0.5 0.5 0.5 0.5 0.5 0.5 0.5 0.5 
##$DPOFFS= (0..7)
0 0 0 0 0 0 0 0 
##$DQDMODE= 0
##$DR= 18
##$DS= 0
##$DSLIST= <SSSSSSSSSSSSSSS>
$$ [...]
##$SUBNAM2= <"">
##$SUBNAM3= <"">
##$SUBNAM4= <"">
##$SUBNAM5= <"">
##$SUBNAM6= <"">
##$SUBNAM7= <"">
##$SUBNAM8= <"">
##$SUBNAM9= <"">
##$SW= 20.0189188712717
##$SWIBOX= (0..15)
0 0 2 0 0 0 0 0 0 0 0 0 0 0 0 0 
##$SW_h= 4006.41025641026
##$TD= 16384
##$TD0= 1
##$TE= 0
##$TE2= 300
##$TE3= 300
##$TEG= 300
##$TL= (0..7)
0 120 120 120 120 120 120 120 
##$TP= (0..7)
150 150 150 150 150 150 150 150 
##$TP07= 0
##$TPNAME0= <>
##$TPNAME1= <>
##$TPNAME2= <>
##$TPNAME3= <>
##$TPNAME4= <>
##$TPNAME5= <>
##$TPNAME6= <>
##$TPNAME7= <>
##$TPOAL= (0..7)
0.5 0.5 0.5 0.5 0.5 0.5 0.5 0.5 
##$TPOFFS= (0..7)
0 0 0 0 0 0 0 0 
##$TUNHIN= 0
##$TUNHOUT= 0
##$TUNXOUT= 0
##$USERA1= <user>
##$USERA2= <user>
##$USERA3= <user>
##$USERA4= <user>
##$USERA5= <user>
##$V9= 5
##$VALIST= <valist>
##$VCLIST= <CCCCCCCCCCCCCCC>
##$VD= 0
##$VDLIST= <DDDDDDDDDDDDDDD>
##$VPLIST= <PPPPPPPPPPPPPPP>
##$VTLIST= <TTTTTTTTTTTTTTT>
##$WBST= 1024
##$WBSW= 4
##$XGAIN= (0..3)
0 0 0 0 
##$XL= 0
##$YL= 0
##$YMAX_a= 288149
##$YMIN_a= -249815
##$ZGOPTNS= <>
##$ZL1= 120
##$ZL2= 120
##$ZL3= 120
##$ZL4= 120
##$ABSF1= 10
##$ABSF2= 0
##$ABSG= 5
##$ABSL= 3
##$ALPHA= 0
##$AQORDER= 0
##$ASSFAC= 0
##$ASSFACI= 0
##$ASSFACX= 0
##$ASSWID= 0
##$AUNMP= <proc_1d>
##$AZFE= 0.1
##$AZFW= 0.1
##$BCFW= 1
##$BC_mod= 2
##$BYTORDP= 1
##$COROFFS= 0
##$CY= 11.3945322036743
##$DATMOD= 1
##$DC= 2
##$DFILT= <>
##$DTYPP= 0
##$F1P= 2.36226072786647
##$F2P= -0.459571619588291
##$FCOR= 0.5
##$FTSIZE= 0
##$FT_mod= 4
##$GAMMA= 1
##$GB= 0.15
##$INTBC= 1
##$INTSCL= 1
##$ISEN= 128
##$LB= 0.24
##$LEV0= 0
##$LPBIN= 0
##$MAXI= 10000
##$MC2= 0
##$MEAN= 0
##$ME_mod= 0
##$MI= 1.114404
##$NCOEF= 0
##$NC_proc= 0
##$NLEV= 6
##$NOISF1= 3.799351
##$NOISF2= 2.8
##$NSP= 1
##$NTH_PI= 0
##$NZP= 0
##$OFFSET= 15.70392
##$PC= 1
##$PHC0= -13361.23
##$PHC1= 14.00097
##$PH_mod= 1
##$PKNL= yes
##$PPARMOD= 0
##$PSCAL= 0
##$PSIGN= 0
##$REVERSE= no
##$SF= 200.130013532006
##$SI= 16384
##$SIGF1= 3
##$SIGF2= 2
##$SINO= 400
##$SIOLD= 16384
##$SREGLST= <1H.CDCl3>
##$SSB= 0
##$STSI= 0
##$STSR= 0
##$SW_p= 3612.71676300578
##$SYMM= 0
##$S_DEV= 0
##$TDeff= 0
##$TDoff= 0
##$TI= <>
##$TILT= no
##$TM1= 0
##$TM2= 0
##$TOPLEV= 0
##$USERP1= <user>
##$USERP2= <user>
##$USERP3= <user>
##$USERP4= <user>
##$USERP5= <user>
##$WDW= 1
##$XDIM= 8192
##$YMAX_p= 0
##$YMIN_p= 0
$$ End of Bruker specific parameters
$$ ---------------------------------
##NTUPLES= NMR FID
##VAR_NAME=  TIME,          FID/REAL,        FID/IMAG
##SYMBOL=    X,             R,               I
##VAR_TYPE=  INDEPENDENT,   DEPENDENT,       DEPENDENT
##VAR_FORM=  AFFN,          ASDF,            ASDF
##VAR_DIM=   8192,          8192,            8192
##UNITS=     SECONDS,       ARBITRARY UNITS, ARBITRARY UNITS
##FACTOR=    0.0002496,     1,               1
##FIRST=     0,             0,               0
##LAST=      2.0444736,     0,               0
##MIN=       0,             -249815,         0
##MAX=       2.0444736,     288149,          0
$$ Real data points
##PAGE= N=1
##DATA TABLE= (X++(R..R)), XYDATA
0@%%%%%%%%%%%Qj6J6j6K4l2M0m8N6p2Q8j04J20j37J61j92K24k56K94l39L87m38
33b32M96n61O32p12P98q92R96j110J235j372J520j683J861k052K264k497K752
50A443l032L340l681M060m482M957n498O115o828P666q664R873j1383J3330j5942
65h726J9662k5415L5621n9236K19282J06961k60122n0250p5101L8318J20649J04514
77A66157j12854j66011r2770J1796L1793P8713N0177k9331r1351n2656q211N7691
89a56857R3177N5915j9391j6453j1125k9390J3659J14063R2035j5838l7259Q146
101I0682k2760l7329N3936R9673j935p0848k4223k29l4294l555M9943O793o4250
114D1604n1630k0271k6580j6971J0170N906j0100j3525k9589l7270k690K8263
$$ y = [0, 0, 0, 0, 0, 0, 0, 0, 0, 0, 0, 0, 8, -8, 8, -8, 16, -16, 24, -24, 32, -40, 48, -56, 64, -73, 88, -104, 120, -136, 158, -181, 206, -232, 264, -297, 335, -377, 421, -471, 525, -585, 650, -722, 798, -885, 976, -1076, 1188, -1309, 1443, -1589, 1751, -1930, 2130, -2352, 2605, -2893, 3222, -3606, 4060, -4604, 5269, -6114, 7216, -8726, 10936, -14479, 21142, -38094, 181188, 288149, 28027, -22223, -97324, -59006, 61643, 166157, 53303, -112708, -205478, -193682, -161889, -83176, -32999, -62330, -153681, -206337, -214548, -156857, -63680, -7765, -27156, -43609, -54734, -84124, -70465, 43598, 135633, 119795, 82536, 90682, 67922, 30593, 84529, 184202, 182267, 111419, 87196, 86967, 52673, 49118, 99061, 105854, 41604, -10026, -30297, -56877, -73848, -63678, -57772, -67872, -81397, -110986, -148256, -150946, -122683]
126a22683K1381K7696M1827l83n1235j2209N4895M8290K2781L4334J1325m7504
138B8515l0375M5781N9341J6432k076q746l7327l7327R537L5560J2270j2307k0531
151E8747l1696l2348j2094n0k817j37m390k3842k6608j0969l513L42J6364K0750
165e2261n171k2863q169J3530K1480L1973L5650Q418k0234j1195J1654K2038K7078
178E1928K4901M247j5532j2585k370L200O494P083r64j3887j6362j1806j0753
191A3594o348K434L402q517k0704k5184j6722k352R802J3614N636j2844k4188
204f8377j3516R823K1410J9189J2452J534q421k754J5493K5248J7753N339k32
217C4941j018Q2M442R751R685K902m851p219p604r099j1361l980P007L135j0140
$$ y = [-122683, -101302, -73606, -31779, -32162, -83397, -95606, -40711, 7579, 30360, 64694, 76019, 28515, -1860, 43921, 103262, 119694, 117618, 108872, 71545, 34218, 43755, 79315, 91585, 79278, 58747, 27051, -5297, -17391, -17441, -20258, -20395, -24785, -48627, -75235, -86204, -89717, -89375, -73011, -52261, -57432, -80295, -88464, -74934, -53454, -21481, 14169, 22587, 2353, -8842, 2812, 24850, 51928, 76829, 81076, 65544, 52959, 50589, 53789, 60283, 67366, 66402, 52515, 36153, 24347, 13594, 7246, 9680, 13082, 4565, -16139, -41323, -58045, -60397, -50595, -36981, -31345, -44189, -68377, -81893, -72070, -50660, -31471, -19019, -17485, -25906, -28660, -13167, 12081, 29834, 35173, 34941, 33923, 34005, 38447, 48198, 57883, 60785, 55934, 48715, 41111, 32012, 20651, 16671, 23678, 26813, 16673]
232A6673j4575j3326j4435q699O405J1082n444j8195j1453j56K026P216J3685
245b9196L891j0656o273P065J1896J2585J2512R317L969J623J194L610O717P510
259C5764N634M374K494n648j1678n163M125K281m940n112r160j6628r604N647
273g614P240l675j0373j1022j0225n799M757J0419L235n052m189r38J610M660
287b6966P456N588M639M465M374M017N434N248M721P024N826m15m856k337J718
302B5936L413L532J632o197j3049j0478k306J281M39j275n698r788p188r34J302
317a9378J31j014k461k055q34O17K824L118L834L479K054M62j78J438N181Q959
333F177Q596M138j065l616j731K827O393N622N2m820o231l484M98J081k66m694
$$ y = [16673, 2098, -11228, -25663, -34362, -27957, -16875, -22319, -40514, -51967, -52123, -50097, -42881, -29196, -25305, -35961, -42234, -35169, -23273, -10688, 1824, 11141, 15110, 16733, 17927, 21537, 28254, 35764, 41398, 45772, 48266, 42618, 30940, 25777, 29902, 32183, 27243, 22131, 12971, -3657, -13261, -7614, -374, -4049, -14422, -25444, -35669, -41468, -36711, -26292, -23057, -28109, -32298, -33236, -31626, -26966, -19510, -13922, -9283, -4818, -444, 3573, 9007, 14255, 18976, 26000, 31826, 31411, 26555, 24218, 25936, 29349, 32881, 34513, 28316, 15267, 4789, 2483, 3764, 4203, 2928, -2770, -12558, -19746, -20680, -19378, -19247, -20261, -22722, -24777, -25611, -24994, -22170, -19052, -15218, -11739, -9685, -9223, -9401, -7963, -2782, 6177, 14773, 18911, 17846, 14230, 12499, 15326, 21719, 27341, 27393, 22573, 16342, 12858, 13356, 14437, 14171, 9477]
349I477p387o435l159o88J07m58k217k492k441k309k034l3J576L387L677J835
365i594p18k016K8L295N841M814K469l24j479J627M994O151L130J90l453l050
381A1905LK313K245P96j965m211m519l067k614k119j571p67p85k466l434k951
397a3207j398J13K596J756j311k553j131J491M098M826L614o50l101m85K607M244
413A509N115L798m5j705K93J671R57R01J467q98j354j178j223j706k029j230p34
430C609k303l477l723l201o55J143J496j78j770l639k906J113M794L338R88N12
446d859l75k21J055M165L901K48r05J551J607k66J153L200J694j242j279P0j453
463H044k664o05K450J547l191m107k424k326l107M39L137m02n091l124J337J695
$$ y = [9477, 2090, -4345, -7504, -8192, -8085, -8543, -10760, -13252, -15693, -18002, -20036, -20069, -18493, -15106, -11429, -9594, -10312, -12328, -12300, -9005, -3164, 1650, 4119, 3795, 2316, 3943, 8937, 15088, 18218, 18408, 14955, 11905, 11908, 14221, 16466, 17262, 15297, 11086, 6567, 3500, 886, -1233, -2804, -3571, -4356, -6822, -10256, -13207, -14605, -14492, -11896, -10140, -11451, -14004, -15135, -13644, -9546, -4720, -1106, -1756, -4857, -5342, -2735, 1509, 6624, 10422, 10377, 8672, 8965, 10636, 11593, 12494, 13961, 13063, 11709, 10531, 9308, 7602, 5573, 4343, 3609, 1306, -2171, -5894, -9095, -9750, -8607, -7111, -7289, -9059, -12698, -15604, -14491, -9697, -6359, -5371, -4859, -5234, -5455, -4400, -235, 3666, 3914, 3009, 4560, 6167, 5901, 7054, 10254, 11948, 10706, 9427, 9497, 8044, 5380, 4775, 7225, 8772, 5581, 1474, -950, -3276, -6383, -5944, -2807, -3209, -8300, -11424, -10087, -8392]
479h392m09J589K183o76k666N25M472L210K73K71K904P68k706r30L732K706j338
496E516J66M494j049o542p75N152P96l994J79J773m114n575K715M631k330m195
512c152r08o09k338r20K730K570l87k792q81J992P79j613J231N374J868m468l14
529a838N332m99m144L261P117l734o948K760M681k883j818N299J333p182l479
544b742M176J612k079J16J889k124l096p93p9J756N59k742p23K312l50m424R80
561e752O313p26m916K419M606m582l585P281N483n056k519M353k78n156K510N900
577F295j047l768O71Q19j985k45K175l12j188J13j771j339J565J247k820J52K800
594A362k343n278J745L911k383j533M701M34n759k95M601P28j941K603K503l408
$$ y = [-8392, -8801, -7212, -5029, -5705, -8371, -7846, -3374, -164, 109, 380, 3284, 4052, 1346, 416, 4148, 6854, 5516, 5682, 10176, 9127, 2585, 1810, 6962, 7758, 3764, 3943, 5716, 1602, -3973, -1258, 3373, 1043, -3152, -4060, -4669, -7007, -7927, -5197, -2627, -3014, -5806, -6687, -4695, -3916, -5529, -4298, 1076, 2944, -1524, -1838, 3494, 2995, -1149, 2112, 9229, 5495, -1453, 1307, 5988, 3105, 1287, 6586, 7919, 737, -2742, 1434, 3046, 967, 1083, 2972, 848, -2248, -3041, -3120, -1364, -805, -3547, -4270, -1958, -2308, -6732, -5752, 561, -165, -5081, -2662, 1944, -2638, -6223, 1058, 6541, 1485, -1034, 3319, 3041, -2115, 395, 6295, 5248, 1480, 2151, 2970, 985, 740, 2915, 2603, 1415, 1528, -243, -1582, -17, 1230, -1590, -1438, 1362, -981, -6259, -4514, -603, -2986, -4519, 182, 616, -5143, -5438, -837, -109, -2050, 553, 3056, -352]
610c52j667M047J451j925J719J479l351j189K873k72j904J745J419l140k191J564
626C06M6k703J277K930j679k998J121m82j658J407K271j068j691Q30j47r91K002
643a227K959j631j512K148N87k271J123M184l90l333J696J752l254j630K943J654
659C798k482j171J248j050k591Q4K411J63j259j192j030N08N84l81J217J985j416
676e74k960P47L171k38j517K178K841k956k933K940K596k091q90L055Q33l518
692F84j926K762J003j671n90J470n76l373r15K173J695j310j630Q89j8k481m48
709d262L622K019k220j215J739P21k181K84L545J229k665j098K288j86j714N91
725D97K780L63k873j607J541K06j175O45K639r46l523r43K015J50j384Q94J562
$$ y = [-352, -2019, 2028, 3479, 1554, 3273, 4752, 1401, 212, 3085, 2813, 909, 2654, 4073, 933, -1258, 306, 352, -2351, -1074, 1856, 177, -2821, -1700, -2182, -3840, -2433, -162, -1230, -2921, -2091, -2238, -3229, -1227, 1732, 101, -1411, 737, 1324, -947, 176, 4360, 3970, 637, 2333, 4085, 831, -799, 2144, 3798, 1316, 145, 1393, 343, -2248, -2164, 247, 410, -849, -2041, -3071, -2563, -1979, -2360, -1143, 842, -574, -3534, -2787, 384, 146, -1371, 807, 3648, 692, -2241, 699, 3295, 1204, 314, 3369, 4202, 684, -1242, 1520, 2523, 852, 262, 1732, 1156, -2217, -3132, -959, 736, -574, -2204, -1315, -1333, -3814, -4262, -640, 1379, -841, -2056, -317, 404, -1777, -1493, 2052, 3281, 616, -482, 1806, 1620, -94, 497, 3277, 3640, 767, -840, 701, 907, -268, 377, 3016, 2070, -1453, -2396, -381, -231, -1615, -721, 841]
742H41j141l148J36K661P1q35R08Q94j399j422Q88K236P45q08N03M26j176j556
760a176N98L050O17j494n30J95j079j502J790K414o86k362k07M58j001l36K012
777G61R38j437j941o3N1n5N26J139M78j106j695k4L69Q42P23R15N16j132j643
796a838M44J959Q25M07N34m98j869m20R34K117K11m02j50j416j381M03J191O86
814A737P8n89j327j412k06N5J109O68n62j365j100m62K58J147J150L85n26j225
832b187n51P50J082J365J586k37j010j026M10J083J563R02J98p84j155o96j75
849A118N27J292K76j196j768j111o40K19J066M41q75j539j087q60L87R38J494
866a318Mp61r54m15L47J558J511J222k56n11o25L88J387J578J016oq36j018o11
$$ y = [841, -300, -3448, -3312, -651, -580, -1415, -507, 387, -1012, -2434, -1546, 690, 1435, 627, 1130, 1556, 380, -1176, -578, 2472, 3089, 1595, 1065, 1260, 181, -1321, 469, 2883, 2197, -165, -372, 86, -915, -1251, 761, 1699, 262, -1679, -1742, -1691, -1746, -1220, -81, 397, -709, -2404, -2428, -2059, -1217, -494, 421, 937, -195, -1838, -1394, 565, 1390, 1797, 2331, 1833, -36, -456, 478, 2595, 2806, 2404, 2254, 838, -543, -140, 1051, 1737, 1815, 1226, -101, -1513, -1719, -1664, -555, 113, -449, -1814, -2914, -3376, -3118, -1971, -821, -436, -962, -2187, -2738, -1988, -906, 459, 2045, 1808, 798, -228, 182, 1265, 2828, 3730, 3928, 3144, 1989, 1293, 1118, 1645, 2937, 3213, 2017, 249, -862, -1502, -1283, -217, 224, -651, -2190, -3277, -4137, -3750, -2812, -1318, -1314, -2075, -3029, -3444, -3097, -1539, -28, 1194, 938, 427, -198, 190, 1577, 3155, 4171, 4165, 3329, 2311, 1700]
885A700M01R22O06r0j120j323j632o64O54P18r9n85j487j218o60K44R47R83K3
904a680j025r87N7N87J136J642N21j21p07n8N8J474J573R66K7q46q24k89N29R94
924C027P06Q5j141j088j188k12N03N27r3j030j460j175p97Q74O55Q65o00r59j011
943c512k86M34J297J254K82m29o36m66N46J257J653Q48J36j143j06O2N49J114
961B854R28N6q41j408o92M48L63P99O6q05j728j315j77L49R00k45l54j096j653
980c551l62Q85J060M88j50k14o64j033N95J528J258M46m7j31k93rR82J591J019
999C398r6r82m05k23J11J087J041j13j356j304n58j74j02P96R1j010j621j100
1017b520m19K08O97K60o0r66r96p17Q45J304R20N00J69o73o41M91J708J650L41
$$ y = [1700, 2101, 3023, 3629, 3539, 2419, 1096, -536, -1200, -546, 172, 73, -512, -1999, -3217, -3877, -3633, -2686, -1703, -1680, -2705, -3692, -3635, -3048, -1912, -270, 251, 130, -577, -635, -577, 897, 2470, 3436, 3463, 2617, 1793, 1504, 2033, 3027, 3733, 3818, 2677, 1589, 401, 189, 692, 1219, 1126, 96, -1364, -2539, -3336, -2462, -1807, -942, -1542, -2501, -3512, -3798, -3364, -2067, -813, -531, -960, -1596, -2062, -1516, -259, 1394, 2242, 2378, 1235, 1129, 1191, 1740, 2854, 3782, 3838, 2997, 1589, 897, 1345, 1708, 2507, 2573, 1768, 40, -1275, -1452, -1103, -203, -448, -802, -1898, -3551, -3913, -3028, -1968, -1480, -1630, -1844, -2508, -3541, -2946, -1418, -160, 286, 239, 108, -185, -194, 788, 2379, 3398, 3302, 2320, 1915, 1692, 1803, 2890, 3931, 3818, 2462, 1158, 600, 426, 324, 1120, 1211, 201, -1420, -2520, -2939, -2731, -2034, -1774, -1834, -2800, -3796, -4513, -3668, -2364, -1444, -944, -775, -1448, -2089, -1598, 110, 1760, 2101]
1036B101N65j12q00n13J232J290O46k23p42j146r11j7O09P78o66j261j275j226
1054a671l36K80J17N38r25j165r66l07N71P92J016L79m88n02k11Q06J090J338
1072C56J181K10r62J4J28J188J154Q39J7j147o41k82P7L04P80m6j351j540n96
1091c17m58k6L26N10j117j522p52k34N51L88N35L85o21p44o38J087R73J597K19
1110A42J80o16n03M56J465J329M30j38l41j58q29L49J610N24j027p72m86r11q22
1129a18O49Q84J24j618q98o92n75l01R33Q33o47j245q63K43N52L95P55J229p10
1148a070j319P2J255P84M48J087J024j205r53N97J361N57J2M94oj356j045P49
1166A486J032L45j312p4k97j344j131P59Q23p1j490q81n4q11m57J199J192p16
$$ y = [2101, 2666, 2554, 1754, 1241, 2473, 3763, 4409, 4186, 3444, 2298, 1387, 1370, 1979, 2757, 2091, 830, -445, -1671, -2007, -1727, -1610, -1072, -1997, -3162, -4128, -4435, -3864, -3072, -2056, -1677, -2165, -2667, -2878, -2072, -982, 356, 1537, 1747, 785, 799, 927, 2115, 3269, 4108, 4125, 2978, 2337, 2055, 2132, 2436, 3216, 3170, 1819, 279, -317, -775, -801, -475, 35, -1082, -2604, -3356, -3590, -3039, -2651, -2116, -1731, -2352, -3096, -3734, -2647, -1674, -77, 142, 322, -294, -797, -341, 1124, 2453, 2883, 2745, 2404, 2246, 1417, 1766, 3376, 3900, 2873, 2101, 1615, 704, -118, 531, 1415, 1539, -79, -977, -1669, -2244, -2545, -1612, -779, -1426, -2671, -3534, -3291, -2739, -2344, -1589, -360, -1070, -2389, -2317, -1062, -278, 170, 1257, 2281, 1076, 123, 720, 2081, 2638, 2650, 3144, 3138, 1782, 737, 1486, 2518, 2863, 1551, 1477, 1180, -164, -1295, -536, 287, 216, -1274, -2155, -2209, -3020, -3477, -2278, -1086, -1802]
1184a802j227q3Q63m65O23J485J201q55r03N54R41N8J032J384P50j444p49Q57
1202B220L13J67L01K85k75j493j291N44L50m96l74K11r42j651p03Q17M61l87n91
1221b534M1o81n95K56J462Q04m6k38L81O2k34J042J163J331j69l14N3M54l4P16
1241B920J200m49j106p26k9j38m04N08K06j038j427q44j78K42l59L10O7j336q89
1260c470l07R27L19K94L62L14m47k16Q62Q21J280M81r7J94n83K3R19R03N15j08
1280B986k75o85l19k07N49J89J44j124o75r53l43m9K92L45q04q29o51l98K70O08
1300a929O03k77j36m77k82M48Q70J099o7K67l46J0K65P34O07O09K39n12j35m04
1320A186N30O6P82j34o56q49l04j27M2K66j67j53r52j088l1L28L23l09P4m04p42
$$ y = [-1802, -3029, -3112, -2249, -2714, -2091, -606, 595, -260, -1163, -609, 332, 390, 1422, 2806, 3556, 2112, 1363, 2220, 2533, 2700, 3001, 3286, 3011, 1518, 227, 771, 1121, 625, 251, 462, -480, -2131, -2834, -2017, -1556, -1943, -2534, -2493, -3174, -3769, -3513, -2051, -1247, -1293, -1531, -1150, -1088, -1322, -280, 883, 2214, 2045, 1731, 1784, 2238, 2204, 2920, 4120, 3671, 2565, 1839, 1810, 1672, 1268, 1776, 1982, 944, -483, -1327, -1505, -1263, -1622, -1312, -1245, -2581, -3470, -3777, -2850, -2531, -2237, -1875, -1561, -2008, -2224, -1362, -541, 739, 1220, 1123, 1317, 734, 757, 1676, 2579, 3094, 2986, 2711, 2026, 1707, 1500, 2049, 2238, 2382, 1258, 583, -370, -713, -762, -470, -125, -929, -1758, -2409, -2807, -2537, -1929, -1326, -1603, -1739, -2216, -2498, -2050, -1180, -81, -148, 119, -227, -217, 48, 782, 1389, 1998, 2237, 1725, 1590, 1186, 1716, 1782, 2564, 2430, 1774, 925, 621, 494, 536, 802, 635, 482, -470, -1558, -1589, -1261, -938, -1247, -1173, -1577, -2319]
1341b319l56O39O04J77M86J33o59j72M37N68R38M00j47J02m2J29M18N11O31j19
1361B359m79n66Q1l77O37N94l35r54m88p88l96L12n5L96q18o17p12n0J66L35L93
1382a362K10o22l29J37L06O18N57L50J92j01k66K99N17R64K92J77J0k38k88K50
1402A673N69LJ16n69n95r78p8L95J55n72k83q26n44m68j77Q55j15j01k45k88k85
1423b358K78M30O52L07J24j65K12K69K52P11J050q9k90j22j51L31N03M06M2l47
1443B045o26m26m2k17L11l01k00o76q74l37M46j17Q5j17k47n37n00L63N97L70
1463a000J01L14m01k18K41P44N04M81k9k40L5L1J71Q50R7J48k66n43m15K0K26
1484H51M72l35j27n04n00l52K18K80nk41m01m39l92l5N78J36o1P4k43k35j68O28
$$ y = [-2319, -2675, -2036, -1432, -1255, -769, -636, -1295, -1467, -1030, -462, 476, 876, 729, 831, 789, 918, 1336, 1847, 2478, 2359, 1880, 1314, 1395, 1018, 1655, 2249, 1914, 960, 472, -316, -712, -400, -455, -59, -877, -1494, -2206, -2256, -2090, -1755, -1362, -1152, -1774, -2103, -1966, -1660, -1042, -485, -135, 57, -44, -310, -11, 506, 1470, 1762, 1939, 1949, 1711, 1423, 1673, 2242, 2245, 2361, 1792, 1197, 219, 141, 536, 691, 119, -164, -990, -1534, -2002, -2179, -1324, -1439, -1540, -1785, -2073, -2358, -2080, -1650, -998, -691, -567, -732, -520, -251, 1, 712, 1762, 1673, 1383, 1261, 1110, 1441, 1944, 2350, 2392, 2045, 1419, 993, 951, 734, 1045, 744, 544, -132, -1006, -1343, -897, -1014, -929, -1046, -1293, -1830, -2330, -1967, -1370, -1000, -899, -585, -986, -1204, -963, -219, 285, 766, 737, 497, 532, 563, 734, 1584, 1681, 1829, 1563, 1020, 605, 625, 851, 1323, 988, 861, 357, -143, -495, -277, 3, -2, -243, -644, -1083, -1475, -1510, -932, -796, -857, -783, -1026, -1261, -1429, -801]
1506h01O08K04J58j84m44n2O46N54K72MK61p18PK42L15M33k8l87p03k04J01L2
1528C16K44K00r9o27o48k55o1M36N00n43k80l85k22k15N96O42k33J24m86j75L06
1549h65N89K37M67j34K9k98K79K49R7R84j00k56l50k21K4L37R8K24n12m54o98
1570b74Q4J09M8j2j46m08n69l29J47J34N00P1l53j66m27P0O29N73K76j28J22j81
1592b30L2L74O48N49K4n86L7j26n9K64L29L60m07o48m88J01J30n8L74l24r42j31
1614g77m24K73M0M89j66R4q68r1L98M21L01K9J08j12j88r4O14N75j01J76Pl78
1636C26l59K57N97L43k32O1l32n10j49L66R4L24n18l36m30k46M11J39J49kl53
1657d00p7k99r5R7L44L71k09j93l67K75K18M21K15N4k24n46J03J96K13O67L0m06
$$ y = [-801, -193, 11, 169, -15, -459, -511, 135, 689, 961, 965, 1226, 508, 515, 757, 1072, 1505, 1477, 1090, 387, 183, 284, 316, 560, 760, 661, 34, -614, -869, -930, -494, 6, -537, -817, -1202, -1424, -1639, -1043, -401, -634, -510, -996, -1171, -865, -276, -39, 428, 294, 323, 25, 304, 553, 650, 1634, 1534, 1278, 928, 707, 731, 1068, 1166, 1390, 878, 424, -274, -190, -81, -33, -45, -191, -599, -1168, -1497, -1350, -1216, -716, -645, -998, -1164, -1591, -1521, -892, -319, -43, -171, -49, -230, -198, 176, 824, 1373, 1397, 811, 848, 722, 663, 927, 1256, 1616, 1209, 561, 73, 174, 304, 246, 620, 296, -646, -777, -1201, -928, -888, -399, -565, -471, -1339, -1430, -1032, -611, -310, -281, -173, -285, -473, -567, 47, 622, 521, 697, 704, 326, -33, 224, 821, 1164, 932, 993, 661, 151, 2, 368, 462, 786, 268, -68, -498, -744, -333, -194, -45, -47, -400, -477, -776, -871, -774, -430, -59, -268, -461, -828, -553, -335, 86, 301, 355, 131, -415, -312, -116, 97, 764, 794, 388]
1679C88k48j62L32K03n0K30k23k72l23n6L22L79K25j88n94l31j04l1N38J8L51
1700D04n27m08k96k4L04M28K31k34j80j19k19J06O32K54j10J17l43l29J81L75
1720B43M74K34l46k3m76J54M25l6J53K60o79k31o92L77J04M3R5j48m04n30k0L27
1742f96K94J07L0n37K0Q7l2L43L59N11k43o74L70J27M78L50j82r7j16j64j16L35
1764E54K51Q3Km10l48k11k79O67J47m35j56j53n18J7K81M97rk91o08K9n8M31J88
1787c29N30j99k40j92L28q5M53L40N4j18j72k24K03J57j34J81J63m29l45J3p6
1808a21M40j31K75n09l49n09L10M01J52r6Kl48k65k8O21K39K8Q2k97j18j4l86
1830f21P19L25l7j08n6l47lK66K14m7M6n31j9K31k40O84j1j34l06j90r3J01R3
$$ y = [388, 140, -22, 310, 513, 463, 693, 470, 198, -125, -181, 141, 520, 745, 557, -37, -368, -472, -503, 35, 53, 404, -123, -531, -827, -851, -547, -119, 112, -122, -302, -421, -640, -534, 98, 352, 242, 359, 16, -313, -132, 243, 717, 951, 605, 582, 106, 260, 685, 649, 802, 1062, 383, 152, -540, -163, -59, -16, 79, -69, -473, -1003, -1023, -696, -402, -295, -265, -802, -782, -695, -727, -384, -25, 486, 243, -431, -61, 66, 544, 894, 712, 615, 499, 335, 219, 554, 805, 888, 890, 480, 132, -79, -358, 309, 456, 21, -135, -288, -806, -789, -508, -11, -20, -311, -919, -890, -948, -517, -329, 201, 2, -238, -430, -102, -187, 266, 606, 660, 542, 370, 146, 349, 506, 372, 553, 716, 287, -58, -45, -121, 319, 188, 463, -46, -395, -904, -594, -193, -41, -137, -135, -483, -748, -776, -155, 84, 112, 194, -103, -221, -235, -621, 98, 423, 386, 278, 222, -125, -128, 138, 352, 305, 351, -180, -199, 32, -208, 476, 465, 331, 25, -165, -258, -157, -64]
1853f4K98L21k27l64j65nM05N8j00L06m88k55j57N4K98K67r5j91j2m90J83M60
1875C7J44n6L44n64o9rM8M01K91J43l51l93M09l40J69L82M3k04k49n07K78R2j08
1898f9M94m08k83l15j84K72L67j0P4Jk74k77J17O0O66K05l65K3q5O8K46L1M65
1921H19k22m26n4N2Q2K63j8K5l94j83k61J63Q8L41r0j99l20m05J76M16kl8J21
1944f6j49l56O5J34M48L05O6l57j80J09k06L79N00k1j3n46p8K03l32M80J12K65
1966G62m73n71j10P6L90K19Kl84l03p8NK15J3J55j43R8k69j63L63QK93J11j15
1989A01l2k11O7L09j21L45k6j35m55L70k30L13R5j53k40M4m70K41P2K72j1Q6n23
2012b92J25j88L3J98J00l7j68j44N6L31L57N5k44j00k90MO9Q0L15J68m20o7K6
$$ y = [-64, 234, 555, 328, -36, -201, -206, 199, 257, 157, 463, -25, -280, -437, -383, -85, 182, 87, -104, -116, -606, -423, 37, 181, 125, 469, -95, -164, -173, -125, 276, 567, 710, 359, -34, 375, 35, 204, 586, 629, 425, 176, -331, -53, 39, -69, 425, 17, -266, -581, -765, -493, -126, -136, -62, -61, -335, -612, -495, -435, 231, 436, 71, 94, 9, 77, 323, 354, 819, 597, 171, 117, 169, 251, 514, 496, 521, 127, -56, -317, -154, -66, 275, 185, -14, -334, -739, -563, -147, -149, -187, -66, -215, -571, -506, -372, 76, 381, 447, 90, -90, 19, -187, 192, 692, 671, 658, 112, 34, 237, -95, 385, 497, 762, 289, -282, -392, -316, 74, 293, 295, -89, -392, -470, -465, -250, -237, -82, -225, -127, -396, -559, -196, -188, 105, 216, 101, 69, -142, -75, 234, 113, 458, 432, 297, -158, 212, -18, 295, 390, 237, -3, 41, -429, -188, -116, 156, 145, 231, -292, -167, -355, -322, -124, -24, -61, -229, -373, -317, 14, 371, 426, 182, 82, -208, -204, -135, -55, 260, 428, 8, -59, -33]
2035c3k60K08K61k81K17j38k35J1J12K22m6k8K74n48j05L6K80L21j8m9j41m11
2057c51J40O6L63pK18m71o1j56K10J08L1K00m71K09n53M18j15L34n4J04k61J9
2079h0k26Q0O51k03K2K6l82k76K39K87L41j28l11o0k8l7J49J49j4J51m21n9J19
2102a1k49R6K20J58m28j10K29k04J23M96j65j29J2O3k61J68K92J46m03o4J15k59
2124a65l5J02L12n2k96j72o6p5M81rQ4k78J14k0j26M1K75n3j12R6k51l18L87K85
2148A49K46r3Mj35k35K42l49L13K22j49l19l49M83j90q3N83j27l36k52M1q2Q6
2170c30M52j28J26o15L33j52L71R8N3k60M80k20k00K15j19N4J18KK15k40k48J24
2192A29J96j11J6k47p5k79L07k08K39k0l76J20J79n41L07M12N6k6k12q7J69p1
$$ y = [-33, -293, -85, 176, -105, 112, -26, -261, -250, -138, 84, 38, 10, 284, -264, -369, -333, -53, 268, 250, 201, 60, -351, -211, -145, 218, 211, 429, -42, -103, -259, -49, 59, 90, 290, -181, 28, -525, -107, -222, 112, 58, 162, -99, -80, -306, -226, 425, 222, 244, 270, -112, -388, -149, 138, 479, 351, 40, -20, -48, -85, 64, 213, 199, 350, -71, -130, -11, -260, -164, 56, 214, -214, -324, -95, -299, -176, 320, 155, 26, 38, 101, -160, 8, 300, 446, 43, -21, 94, -165, -200, -98, 214, 162, -134, -306, -372, -447, 34, 25, 109, -169, -55, -75, -201, -160, 115, 62, -50, 46, -205, -523, -136, 149, 395, 302, 306, 171, -64, 178, -171, 142, 364, 215, -104, -453, 30, -160, -243, 340, 213, -123, -375, -334, -416, -330, 122, -6, 120, -495, -162, -314, 57, 155, 208, -52, 428, 208, 8, 223, 104, 158, 276, 278, 493, 253, 5, 129, 325, 214, 230, -17, -92, -371, -64, -272, -33, -53, -429, -309, -130, -671, -364, 48, 104, 78, -134, -221, -52, -123]
2214a23L9M46M1j57k16NJ85K27J63j50k59j1p6J43j46OQ5l80K96n76L73j38J74
2237d9K56l78Mj83j02J67K15J76K71o23K0p4K2R2L46K40m2j32k32r3J72K75L08
2260F56k18j96j84M3k33L20j62P4n8l24K15P7k95N9N02l42Q2j51Rq5J79K49j26
2283I1j88q1l4k8J12J82J86k04k75J27q4J44O0K38j05k24P7J2n2j25M70K79m31
2306A47Nl01J19J20J70J34k54j78j21R5K3K86pk99j92j91J19j28M23m6l8N7k68
2329c25j04K64j64K96J67j03J07m18K26O6J58O9m1N4m6j06J34K25n9K29l19k72
2351C8J09m78L37m0j26J13j53j02k41J52K44l41N55m54j41J35M9j80L37K53j41
2372g5n5M5L20k9J33J13J46K6j89k26J61J6L08l39K72k88m9l17j42M99m1k63j44
$$ y = [-123, -84, 362, 403, 246, 30, 35, 220, 447, 610, 460, 201, 190, 114, 257, 111, 117, 202, -178, 118, -458, -85, -223, -49, 207, -171, -167, -350, -452, -285, -70, 106, 377, -246, -226, -300, -278, -186, 160, 400, 358, 226, -6, -99, 73, 348, 656, 438, 242, 58, 101, -132, 188, 26, 100, 42, -282, -67, 10, -285, -226, 276, -66, 16, -135, -126, -211, -32, 217, 91, -97, -178, -212, -240, -128, 54, 240, 36, -239, -112, -196, -52, 8, 246, 141, -83, -6, 6, -46, -171, 299, 578, 147, 152, -149, -30, 90, 260, 394, 140, -38, -159, -64, -41, 245, 238, -61, -253, -444, -325, -453, -30, -76, -114, -57, -325, -429, -165, -329, -33, 134, 31, 138, -280, -54, 12, 170, 239, 198, 252, 206, 100, 234, 459, 400, 629, 310, 38, 147, -331, 6, -34, -160, -47, -200, -302, -543, -391, -147, -488, 67, -387, -528, -393, -344, -524, -187, 66, -75, -130, -85, 235, 206, 339, 452, 598, 624, 435, 209, 370, 386, 694, 355, 627, 339, 290, -27, -169, 330, 289, 26, -118]
2395a18q9k60kK93L7j32Ml07M86l11J43K88m7k73J79p9L65k02L00J47k28J20j64
2418A50lJ85j9K82J15m46o8r7k89L85l90M89k20k23k49K15j17nm0K94m93M5K25
2441b74j45O8L66j79j7K8pJ25JJ69J2p0K7N0Q8L1Oj55J45K61j83k50j59L20Q8
2466C46k84J41k08l0P9j93J05%j2j58Q9k24K36N2J20j44k5l77J76M2J75P7J45
2489A28j68j80M81m94M44j21K38J8o3j52j48R0p6J21LL09n62L48j45p1J11L3n7
2512H7K83m88r6J96q3k39K84J46l50o4q3L13j01J67j06j55k2K09j96M00m6MJ16
2535A76K8j56k33N52j11L65p5l00j33K57q2k86L22l11J05j7n7k13k4M04o15M37
2557C3l00k53NJ20O5O1J45l24r5K41l2K76j22K98K5p6J27m5K73p2L46k54k21j88
$$ y = [-118, -207, -467, -469, -176, -139, -271, -267, -574, -88, -399, -256, 32, -15, -288, -109, -188, 177, -25, 275, 422, 194, 314, 150, 147, 332, 313, 595, 710, 264, 196, 99, -190, 195, -195, 294, 74, -149, -398, -183, -300, -305, -345, -51, -544, -499, -274, -419, -351, 15, -164, -181, -153, -160, -35, -34, 135, 147, 77, 104, 154, 242, 273, 279, 124, 269, 530, 347, 97, -62, 258, 346, 62, 203, -5, -35, 44, -149, -44, -44, -56, -214, -125, -349, -113, -61, 59, -85, -110, -487, -311, -269, -94, -17, 128, -40, -220, 261, -233, 211, 90, 328, 346, 283, 131, -17, 73, -3, 118, 121, 430, -132, 216, 71, 0, 111, 144, 87, 370, -118, -214, -18, -101, -340, -56, 90, -260, -324, -407, -94, -195, -28, -134, -289, -311, -102, -298, 102, 56, 60, 176, 204, 48, -185, 367, 256, 621, 546, 246, 113, 370, 288, 2, 324, 13, 118, 101, 44, -169, -193, 211, -404, 33, -267, -520, -515, -395, -330, -269, -124, -448, -543, -302, -334, -58, -180, 118, 143, 67, 194, 149, 422, 350, 696, 442, 221, 33]
2581C3J22J31J34o5j16p5k41j6j3O2j6o6j39j67m3J47j01K69J9O4n4l29L94j77
2605b43J58K14m1j36k8J48J90k74J39L08k27J03j24J64q7J3j84J71r4j3k88J71
2627D0L23l48L63m26J90k40p5k41J01K76J29j62k49j75K10R6L09j66m3j10J59
2648c9q7K07r6N30m17m5nN0J09J85J44l61P7k64q3K15p7J97k05Rk2m08K53J92
2672E9j84J63nk68R5l1K3q5j83M24k28O0k44L17k03L34R6l25K46j94K8J93M52
2695E40m21J98q1j74K22j27L30j64J17l45J42k93p7L54j26J8j52k22O2J01j55
2716b53O1p0O2k9k5J57l58M41j01r9o2J00j25K61J73O8k44K19J60k24K4j16L33
2739C53P4m04J98N1k18J35K0mM3k43j58L23n47J42K82j22pj55m8J35kjo6j68K66
$$ y = [33, 155, 286, 420, 355, 239, 164, -77, -93, -106, -44, -60, -126, -265, -432, -475, -328, -429, -160, -141, -77, -131, -460, -66, -243, -85, 129, 88, -48, -76, 72, 262, -12, 127, 435, 208, 311, 187, 351, 264, 277, 93, 264, 170, 157, -131, 40, 363, 15, 378, -48, 142, -98, -173, -414, -313, -37, 92, -70, -319, -494, -284, -188, 121, -45, -88, -198, -39, -126, 81, -15, 515, 98, 53, 48, 98, 207, 392, 536, 175, 252, -12, -95, 120, 43, 240, 35, 44, 22, -386, -133, 59, -125, 38, 33, -235, -140, -171, -148, -233, -416, 8, -220, -160, -404, -87, -290, 44, 140, -185, 61, -133, -105, 88, 540, 119, 317, 236, 62, 284, 157, 487, 323, 440, 95, 237, -56, -133, 221, 95, 113, -39, -261, -199, -98, -253, -192, -262, -200, -229, -254, -97, -455, -14, -115, -214, -276, -176, -301, -40, 133, 201, -43, 176, 336, 112, 136, 20, 353, 427, 23, 221, 272, 54, 189, 209, 205, 248, 5, -153, 170, -377, -235, 47, -75, -82, -237, -285, -150, -152, -153, -219, -387, -121]
2764a21l14J20J95J40K7J66j97J5J28j89J72k0K89j05p4j68j58J83M7l3L8k12
2786g1j45L16k74K28j03o3L62l72m71J73K68L2K65k16l9J3Q1p8J40J12j60J78
2808A76k50L6L92j45k12J23O8j82J05J14j13j40L55k68j59K67m28L02J66l13r4
2829b00K72K38l36l42J96J72J09k88K17k15l4K32j01K1K40k13k15L59k43r6K42
2850A5L43k25L39n18P6K08j49K24k92j42K48j64J02n7K24R8l38j85K25M3J48l04
2872h1R0j59J92K4l31J88j4J27J21l63K9k5L31l94L21p6J67k79j39L02j00n8J43
2895A6J99q7k0K13k20j60Q1L23j07k76K7j4J05j40j3K13j10k77J33kK04l33l6
2918b81K39n4Q0k18PK94qk10J13l07M91k30J85L11m68J74j4J13j70kJ16k53R4
$$ y = [-121, -435, -315, -120, 20, 47, 213, 16, 31, 159, -30, 142, 122, 411, 306, 232, 64, -94, 89, 136, 103, 141, -71, -216, 100, -174, 54, -49, -112, 250, -122, -593, -420, -152, -120, 145, -71, -110, -97, -16, -94, 46, 158, -2, 176, -74, -38, 354, 209, -3, 120, 188, 6, 111, 225, 112, -28, 327, 59, -100, 167, -261, 41, 207, -106, -200, 72, 310, -26, -368, -172, 0, 109, -179, 38, -177, -211, 21, -80, -59, 181, -32, -247, 112, -131, -227, 15, 358, 133, 472, -46, 30, 238, 89, 313, 21, -121, 127, -37, 65, 8, 232, 330, -8, -193, 32, 75, 223, -81, 9, -150, 42, 66, -265, -77, -91, 36, 157, -206, -177, -202, 129, -265, 56, -20, 147, -132, -271, 31, -69, -127, 16, 215, 128, 108, 321, 101, -59, 22, 345, 238, -38, -11, -25, 80, -60, -73, 140, 30, -247, -114, -116, 88, -245, -281, -42, -96, -16, -234, -227, 67, 59, -151, -38, -345, 146, -84, 101, 412, -56, 118, 104, 217, 47, 45, 161, -92, 2]
2941BLK0%K0Q8k08m2o7nk5K08J0j86j4Q7J5M6m7qQ0J68K13m09j01J56K62j05p0
2969I1j01J99j60n4Q8J37J23j29l45J92J8J90k62Q9K33k13k90L10j21R0k66K79
2991I8k05J6P9l67N98j26N9j75n9n8PJ72L6j00K89r4k84K07n1j34K73o9k22J40
3015C0L6K06m99J98J27p6N2j51Q9p9p6K06J9j01J39k71J23M1J65r1k4o5M6M6L1
3040A21q9p4R3J01j82M68o43J21K32J7j42l18L02j22K07j72K38j10l20K14n0K92
3062A84m6p6m0j80L74k06m7K58q5%k20JK2Oq1L38p5J51o8k80lJ40j93j32K55q8
3088i1J38m7k13l1N98k52J08q6k52L23k31J20o2n0o9J8k9J95Jj26J26k33K93j98
3112e0j25J05N5r4p5K11j93M2K48j58K77r9l25K46o0J78j31J71m2j4k1j43J86
$$ y = [2, 5, 25, 25, 45, 133, -75, -117, -184, -189, -214, -6, 4, -182, -196, -109, -94, -48, -95, -103, -23, 145, 358, -51, -152, 4, 266, 161, 91, -10, 189, 29, -25, 63, 200, 323, 194, -151, 41, 59, 249, -13, 76, 309, 96, -194, 116, -5, 85, -181, 98, -107, -91, -12, -379, 219, 93, 152, -23, -82, -140, -133, 39, 75, -25, 264, 170, -114, 93, 42, -92, 181, 112, -110, 30, 66, 272, -227, -29, 98, 22, 74, -77, 12, -67, -143, 63, 82, -19, 120, -151, -28, 13, 178, 87, 63, -2, 44, 90, 121, 32, -42, 51, 152, -30, 438, -205, -84, 148, 165, 23, -295, 7, -115, 92, -80, 158, 48, -272, -58, -108, 184, 138, 62, 22, -158, 216, 10, -37, 221, 136, 136, -84, -83, -61, -55, -136, 202, 127, 278, 210, -70, -73, 67, -126, -258, -3, -91, 47, 0, -213, -244, 354, 102, 210, 124, -128, 195, -36, 84, 22, -28, -97, -79, -108, 87, 88, -38, 88, -145, 148, -50, -175, -70, -15, -109, -184, 27, -166, -124, 124, -34, 243, 144, -181, 65, 5, 183, 52, 223, 181, 167, 146, 3, 189]
3135A89j77J24l73M63k07n0j51O1J87k79K13J07k1l66M5L8J58j0j21Q6J29L3P8
3158A56l04M25q8l35J91R1j04p5K01l08J80j58L3K89P0j79j3J44l88J28k00M74
3180B30l10N6K50m20L24k8L9l5J87k1k83J56j15j77J42k13K36K60j76l95L07k82
3202b68L39j57J1q4K71J1r5Qj0k50M36k58q1k77N55k09J96l14K92N8l81J33J91
3225A17P3j08p9L5R5m8k1Q0n09K55K32j00j24Oj57J8M42k19r9P5q0j14P9J18j7
3250e0q4J84j1J14k62OO9j74L20R0j54k2K92m20R3J87K5p0jk98M24k60J59l18
3274a61K53j32J62N9l31K10k58N1J27rrK0MR5J5j85o5K43k7j40J16j14L48k77
3298eJ23o1k15K59l8k28N6K38j27J21j2q7J13j97p8r5J81R3p8qR5m61L47N5j98
$$ y = [189, 12, 136, -237, 226, 19, -31, -182, -121, 66, -213, 0, 107, 86, -280, -235, -197, -39, -49, -170, -84, 45, 78, 156, -148, 277, 189, -146, 45, 136, 32, -43, 158, -150, 30, -128, -95, 194, 264, 85, 72, 216, -172, -44, -244, 230, -80, -24, 226, -194, 130, 102, 141, 106, 293, 272, -11, 145, 30, -147, -5, -218, 18, 278, 102, -293, 14, -268, 71, -86, -75, -159, 112, 123, 28, 36, 26, -224, 212, -46, -127, -404, 151, -58, 138, -176, 116, 174, -207, -74, 117, 190, 82, 3, 38, 133, 85, 64, 144, -365, -110, 122, 22, -102, -96, -253, -235, 207, -12, -111, -36, -116, -230, -151, -33, -50, -134, 50, 39, 153, -109, -103, -34, -208, 112, 202, 48, 26, 318, -102, -9, 178, 203, 133, 132, -166, 258, -2, 157, -161, 92, -40, 122, 181, -150, 60, -198, -147, -20, -29, -38, -18, -14, 81, 96, -89, -154, 89, 62, -78, 38, -76, 272, -5, 118, 57, -158, 101, 63, -165, -109, 129, 2, 123, 111, 24, 137, -60, -138, -233, -52, 41, -37, -45, 50, -411, -64, -9, -207]
3323b07K67j54J95m8Q4k03K91k14J77j17j12K41l54K20J23n8j48j07k25L61J92
3344B04n5l98L1J05j45L88m21L38O9j54L04ql81L5K98k46j34J51o0R0J43l6J12
3367B30l19M9Q1J29J7k54n0r0L17m63L47o4J53K4l33K23O9P0k09J1j77M81k12
3390C0K2J78k40k97O22m76P0N4L13l92J70j33Q8K37l54m3Q5K22m20J86j61K4K2
3413a93J32o0K92k35P3k25l7O2J46p7P2j2J75K54j30j27m1k94L18mj5K1O1l99
3437b43K44j77K45k92L02q6n2l15K85K03k42K14l83M72m0n1j16J13j25L38j81
3458A13k43O7K38L5j07j87k1K16k68J87Q7J38k6k90j22J38K27j42Q7m4k15O4J24
3481E6MKj41J16L25l17J0j67J53m1j36K09P8N4j3j79J76j37P7k57J75J40l16J60
$$ y = [-207, 60, -94, 101, 53, 137, -66, 225, 11, 188, 71, -41, 200, -154, 66, 189, 131, -17, -124, -349, 12, 204, 149, -249, -218, -113, -258, 130, -291, 47, 116, -38, 266, 258, -123, -88, 210, -36, -170, -19, -79, 11, 154, 118, 230, -89, -40, 41, 170, 187, -67, -117, -207, 110, -353, -6, -70, 83, 107, -226, -3, 66, 136, -73, -62, -239, 242, 30, 52, 230, -10, -307, 315, -161, -91, -37, 276, -116, 54, -79, 9, 246, -108, -151, -66, 156, -264, -78, -239, -215, -193, -61, -121, 171, -64, 9, -216, -253, -191, -45, -122, -50, -62, 113, 367, 237, 110, 69, -225, 93, 89, 74, 95, 156, -243, 1, -176, 69, -223, 79, -7, -59, -374, -89, 114, -128, 86, -297, 175, 135, 84, -32, 81, -44, 294, 113, -130, -63, 175, 210, 103, -84, -105, 111, -157, 30, 117, 255, 229, -61, -183, -45, 182, 40, 127, 83, -132, -68, 56, 60, 62, -79, 37, 362, 45, 55, -112, 41, 0, -136, 73, 151, 205, 192, 13, 189, 52, 129, -128, 47, 187, -129, 31]
3505C1j4j42J19K6l0j45K55j3k8l09M45L8l93K05k35J25K49J22m32k9J95M1Mq1
3529DLL4m4R3k68M67m30Q7KJ04l76J88J64l10R7L65j99j02J52k35K83J2l36R7
3553a48N26j41m51K87K4Q2m5j6m6j22j4j61K91k1pJ63k79J44k0o5k4L42k24j30
3577e5n0j24L18M7l65Q8K08k57J85k25M92j41j15K7J2j2oJ5J3J05j77j07J55j16
3601h5K52j71J04j15OJ07l70M32k62j89K48n2j1J64n3K27l83J15o2J67J36j04
3623A01o9J30r4j93J52j38K14j72q4J99lj90J16K12j04j01Q1k89M8K43r9Q8k3
3646B5k01J81M4k8N3k53K38J29m2q3L79m41k13O3L19l46K02oQ3k1N5k74J17N6
3670C6k78K70N2o9k96L53l03K32M6l00M21j34l0k12J52K09l28M20j74k12J94Q6
$$ y = [31, 17, -125, -6, 20, -10, -155, 100, 87, 59, -250, 195, 233, -160, 45, -190, -65, 184, 306, -126, -155, 40, 81, 85, 4, 7, 41, -3, 90, -178, 289, -141, -54, -52, 52, -324, -136, 28, -282, -185, 180, -19, -121, 31, -204, 79, 91, -245, -148, 378, 237, -214, 73, 97, 179, 134, 118, 72, -50, -64, -225, 66, 45, 38, 201, -78, 66, 46, -19, -43, 299, 75, -55, -105, -229, 89, 136, -229, -141, 67, -190, -5, -230, 262, 121, 6, 33, 45, 33, 27, 42, 55, 160, -17, -124, 31, -85, 167, -4, 100, -15, -9, 98, -272, 160, -102, -291, -43, -95, -106, 58, 5, 232, -151, -36, -98, 69, 205, 101, 32, 162, 68, -125, 27, -111, 103, -69, -153, 46, 43, -147, -31, 181, 77, -24, 57, -232, -184, 59, -40, 48, 25, -176, 5, 49, 21, 74, -179, 59, 188, 146, 63, 442, 1, -212, -149, 170, -176, 26, 20, 103, 82, 137, -137, -20, 36, -242, 28, 80, 11, -285, 68, -235, -3, 43, -257, 164, 30, 0, -212, -60, 149, -179, 241, 67, -145, 49, 135]
3692A35l80J48j07K66o7k51K59K2K05k41J3m1K43l09J88j23L3J35l23k68M73J03
3714A13p5P1k5L9j58n8J92J7j63M49m70m5K3J20k00Q8K57j44J46j59%nl21J45
3738a63J33P4j47J37j63K58J54l85J05j31J66m4L80k82r0R3j96r5K78j42j11N2
3760a19K35R2q6O5M6l25J49N5j59J6o7J24k4k9J46l1J5J03j43M5k77LJ65K24k06
3785A7k29K07J53j39J04M7j37J26N6j01j64J73k74M0K48J5l18n2L04j02r7K1J15
3808A3j62L08k91J67j45j41J40J33j48K8K06J07l24J63J03l90K82L5o9L50l61
3829DL8O6l06J51j00J10N3k47M40k72o2J18j9K69j83M1J1j05K39l46J34o6J54
3852A22n0j13J95J6k96J1KJ20q9J12P8k00J23o0J19k23J54j71Q8K1R2Pq6J12k5
$$ y = [135, -245, -97, -204, 62, -5, -256, 3, 25, 230, -11, 2, -39, 204, -105, 83, -40, -7, 128, -195, -463, 10, 113, 38, 109, 84, 123, -35, -93, 99, 116, -47, 402, -68, -113, -90, 30, -170, -82, 175, 31, 177, 18, 18, 13, -308, -163, -30, 44, -103, 34, -129, 129, 283, -102, 3, -128, 38, -6, 374, 92, 2, 95, -101, -196, 82, -60, -171, -119, 116, 208, 122, 187, 233, -92, 57, 112, -47, -31, -98, 26, 2, -27, 119, 88, 103, 206, 63, 108, -169, -166, -1, 223, 17, -212, -5, 148, 9, 113, 160, 23, 149, 205, 104, -60, 113, -161, -121, 127, 142, -176, -228, 76, -26, -123, -102, 13, -149, 159, -132, 35, -110, -251, -111, 22, -126, -98, 108, 215, -109, 54, 157, -233, 49, 84, 15, 365, 4, 42, 108, -198, -47, -147, -37, 16, -231, 209, -63, -125, -7, -26, 243, 60, 101, 112, 7, 246, -100, 34, -32, 122, 72, -41, 154, 170, -126, -115, -113, 7, -82, 30, 108, -92, 31, -29, 90, -133, 21, -150, -62, -41, 51, 58, -28, 84, 59]
3877E9L3k89K15o6j7K09k39L58k46L12m39J6J61j15J36k13O5N1L01j32k36j55
3899b31K71m9K65l84J18n1l7N2j25q6J76L58l0k77K54o2j56o8j2J75k22K80j83
3922b4J97J5j93JJ04J33j60k10J6j25K3M14j38J40l06J1k3j04K90K8j04K37m06
3945a84J85j86K10O2Q2p3q3q9k03J97J90j77j13L21k46l1j5K15j48L23j98J47
3967A86j38J91q3j34l21J83J37j26K30P3l93L75J40j3r9j93NJ32l78L30r1J71
3989A84k83J83l19L03K0k08K65k98L11j30k7k7J28m9j5j3j11j27mK70J39l82P0
4012a20j6R4J15L5l4O8q9j18K10q8p1K60j62l31J68N8M6q3P3j6L8k5kk9k42M51
4038A90j60J86l98r0L12O2j01J03L03l49k25K98k38J37K52j82N2jj50j34o2L3
$$ y = [59, 92, -197, 18, -48, -65, 144, -95, 263, 17, 329, -110, -94, 67, -48, 88, -125, -60, -9, 292, 160, -76, -231, 40, -9, 256, -128, -10, -61, -98, -46, -171, -257, -81, 277, 247, -30, 224, 162, 6, -62, -74, 101, -121, 159, -24, 173, 188, -5, -4, 100, 233, 73, -137, -121, -246, -223, 191, 53, 193, -113, -102, -125, -229, 61, 89, -15, 222, -184, 1, -185, 25, 87, 169, 96, 13, -76, -279, -82, 108, -69, -182, 139, -107, -138, -153, 62, -86, 237, 39, 186, 48, 239, 156, 22, -299, -116, 21, -105, 125, 198, -195, 180, 320, 307, 208, 15, 20, 152, -226, 104, 13, 184, -99, 84, -235, 68, 88, -120, 145, -153, 158, 28, 1, -26, 102, 53, 38, 25, -86, -213, -217, 53, 192, -190, -120, -136, -42, 73, 108, 74, 142, 53, -65, 145, 57, -14, 246, 84, -247, -79, -21, 25, -58, 15, -1, 37, 12, 10, -19, -261, 190, 30, 216, -182, -272, 40, 102, 1, 104, 407, 58, -167, 131, -107, 30, 282, 100, 152, 151, 1, -133, -195, -162]
4060a62L82j29j35K1l42J68K44J45k40j17M37l41j64L25j82L17k31K14k17j9n8
4081h4l9j45K23M7j43J95j48l10K58M0j99R3K02Q7O1k48K66O7j80N7j61k9J97
4104A07k28K90k93J54K5o8m7k31N77q6k31L7k79J30K03K3r8j32N17l16j53l4R1
4127d2j54J73k16K64j35M7J42nk73Q5J52p7k08J96K89l31mM5j6rM7r9J95q8Or0
4153a06K45j81j12L87l56j3K70k3J44k01l7R2l27J77K24l43L95J22m18P5n7J79
4175A36M6j60j59K27j1l78L84r3O8rr0p8k52K98K5O7k7J79M2l04lnl1K77j90L73
4201C32m41K8nK92J45p9l45m1O0J2J62q5N9k47J78r2J71l2J45l63L54j06J99k98
4225CN8K3K5L8l74J79L3O7M7O0l20J36K2Q0M5o3j17j65Q9R8L6J5k12L51N3m51
$$ y = [-162, 220, 91, -44, -23, -365, -197, 47, 192, -48, -165, 272, -69, -233, 92, -90, 227, -4, 210, -7, -26, -84, -123, -268, -45, 2, -141, 54, -94, -404, -146, -106, -305, -212, -10, 77, 138, -110, 156, 223, 43, 100, -61, -90, 107, -121, 169, -124, 30, 55, -13, -60, -291, 286, 200, -31, 6, -273, -143, 60, 83, -15, -147, 370, 54, -99, -133, -42, -196, -23, -239, 25, -110, -63, 79, 74, -199, -114, 38, -39, -247, -51, 238, -93, -97, -52, -68, -77, -30, -129, 66, -22, -16, -106, 139, -42, -154, 233, -123, -136, 134, 111, 255, 54, 17, 109, -218, -41, 183, -160, 235, 357, -61, 14, -43, 136, 182, 22, -137, 90, 79, -299, 85, -8, 60, 51, -39, -117, -369, -71, -46, 21, -6, 173, 215, -89, -92, -97, -128, 149, -41, 332, -109, -81, -86, 206, 351, 272, -73, -114, -54, -42, 120, 35, 94, -153, 25, -67, 104, 72, 217, -146, 208, 102, 301, 3, 61, 84, 109, 147, -227, -48, -15, 52, 99, 159, -161, -25, -3, 77, 122, 59, -58, -223, -134, -36, 0, 15, -197, 154, 207, -244]
4251b44K91j44R9j40L14m5k54J1J24J70j96P4j11m3J51j37j4K89Mk9P0k21J80
4274A99l66k4K71Nj34J96l13K50L3j59J45j86Q6j9k11M69k55J75j53p9L07o1j74
4297Bo5j46L54k76%J19m5R1k2k0j63NK32j14K25J6k48j35P0L95n41J95Q2j96Q5
4322a00J89n7l03M27k39K18J1q1P0m6j7k42K6q3K86N4j29L8L07o52K30J72j32
4345e3K63k23j52O6K34j86K12R3l72J61o7p5L49k13j36J19j18o0M42l83M7K07
4367A55j26j23J33j50k0J07N6J67j90l37M61j42K94k04J9J00j53J29l62J38K24
4388A76n2k48M4j19J73j20L41k42L02k91N9m0J87k8j49r3q3K63J83l79%J75p0
4411a1Mj68QJ20p3J65JK04k48P6j04N1J03j89L09p9k95L6L24q7l26L28k71j53
$$ y = [-244, 47, -97, 2, -138, 176, 131, -123, -112, 12, 182, -14, 60, -51, -94, 57, -80, -94, 195, 199, 170, 240, 19, 199, -167, -191, 80, 85, -49, 147, -166, 84, 117, -42, 103, -83, 3, -16, -227, 242, -13, 162, 9, -70, 237, 176, 2, -63, -209, 145, -131, -131, -12, -57, 34, 12, -8, -171, -166, 66, -48, 177, 193, -55, -190, -120, 275, -266, -71, 11, -185, -100, 89, 32, -271, 156, -83, 135, 146, 65, 135, 89, 72, -170, -144, -227, 59, 113, -16, 22, 329, -323, -93, 79, -53, 210, -13, -165, -99, 135, -51, 161, 254, -118, 43, -24, -99, 250, 37, -99, 20, -98, -158, 284, -99, -52, 155, 29, -94, 39, -111, -131, -24, 32, 199, 9, -328, 133, -9, 285, 81, 100, 200, 47, 176, -186, -48, 176, 124, -124, -80, -199, -26, -146, 195, -47, 255, -36, 23, -17, 170, 142, -7, -100, -183, 80, 263, -116, -116, 59, -11, -7, -175, -167, -47, -120, 45, 46, 250, 2, 78, -26, 25, 128, -61, 248, 169, -126, -90, 234, 147, -179, 149, -122, -275]
4435b75M08L0j40k62K50o3m1J24p3k14L15N9P5q5q9j31K9K2%r9L10j35q4j4O08
4460E25n28r4j23n1K28j2L54l77L84m18M3L4j01J5KL31j85J85l38K04R4J04j06
4483A70j41j33j82J58J04j12J33k14L30J69j93M1l32L93m00K04p4Q7L0j28J26
4504C6J79j46N9j27l58N78q6N8k1k30K34j99NN7j58k06M16k03j62K42j70L7P1
4527i4L6J36j97J73l3j0J80j08j38J69q6p0m0K47l8o2MQ0j65K11j42J9J50l71
4551a49J8j6K39O4k35J23k63L71o8l38J1K54J17k58J08j6P2k71L42k98M2P7L15
4574B41l46R0Q5l09%J97P7l2L63j85p0k1k40K42m7j19P9Q1n2K95n91K3J21K15
4598I7j05J15k86J30J51k26Q1k31M61p9k10lK15m7j85J93j22J63lQ2o4k75m1J48
$$ y = [-275, 133, 163, 23, -239, 11, -52, -93, 31, -42, -256, 59, 118, 193, 108, 19, -112, -83, -61, -61, -160, 150, 15, -69, -83, 525, -3, -97, -220, -271, -43, -55, 299, -78, 306, -112, -69, -35, -136, -121, -119, 212, 27, 212, -126, 78, 172, 276, 170, 29, -104, -286, -128, -24, -136, -3, -217, 113, 282, 89, 130, -202, 191, -209, -5, -79, 8, 38, -90, 36, 215, 69, 128, 1, -357, 221, 135, 193, 172, -58, 176, -23, -18, 39, -119, -325, 91, -112, -274, -32, -202, -165, -94, -58, 78, -119, 54, 21, 11, 191, 83, -55, 114, 28, -42, -82, 165, 127, 65, 69, 149, -16, 195, 53, 72, 222, -149, -131, -147, 92, 156, -79, 44, -219, 152, 84, -254, -243, 11, 128, -130, -22, -38, 34, -237, 105, -193, -151, -74, 241, -105, -15, 70, -239, -239, -42, 35, 3, 366, 181, 111, 90, -150, 92, 45, -74, 5, 86, 34, 329, -262, -239, -118, 97, -8, 107, -179, -49, 102, -124, -43, -274, 187, 108, -102, -105, 110, 63, -122, 71, -51, 112, 109, 191, 127, -148, -189, -41]
4622d1J05j46M7k8l2K89m32jJ37j03K72r4J34l4k17L84j75l9J57l11J92j00q3
4645a19N1L77m35L24l7l25L07q7K8l5j00K9J18m13K24rK42j45P1K1j04M0M8mK31
4670B98k30qk19J55l5J87q7K1j35J39J13n6q1l71K92M9j98K24k11J56p4n5K75
4693A49M2k72K30J60l02j22K27o9N7k02O6M0j36%L49K5l07J67j96j3o2K19J48
4716A98j88L7K06l08K82J4k36j35K53j04J67l41K03o7j5l35M07j01J54r4L6K4
4738E7j58K4jQj22M29l08L24l71K90k21K50j09m3j05K50k10M1k64k0O3l3J38n
4762i6K90j00j52k13L0M26o9r6L5L0j81m3J37M6o0j40K11p9K0p7K41k0k55K89
4786A74J19k46pj30L6Q3K52k61J0j20k79J86M33O6q1l36J22Qj71J49P4q9n2k2
$$ y = [-41, 64, -82, -35, -63, -95, 194, -238, -239, -102, -205, 67, -27, 107, 73, -144, 240, 65, 26, 183, -128, 64, -36, -119, -68, 309, -126, 198, 161, -164, 143, 56, 84, 49, -51, -22, 96, -317, -93, -102, 140, -5, 66, 87, -17, 23, 71, 67, 298, 68, 60, -159, -4, -39, 148, 61, 82, -53, 86, 199, 143, 62, -309, -17, 32, -166, 58, -153, 3, -71, -126, 149, 191, -81, 149, 309, 7, -115, 112, 43, 100, -102, -36, 4, -132, -132, 217, 242, -65, 102, -94, -107, -169, 50, 198, 10, 47, 253, -55, 227, 241, 5, -130, 123, 19, 186, -155, 48, -19, -34, -369, 38, -63, 91, -3, 33, 57, -101, -77, -78, -70, -192, 237, -71, 253, -118, 172, -49, 201, 92, 49, -56, 194, -16, 25, -239, -259, -196, -229, -91, -96, 194, 94, -58, -271, -241, 185, 116, 20, 55, 85, -96, -139, -2, 44, -16, -156, 55, -24, -4, -81, 160, 140, -115, 174, 293, 47, 40, -90, -54, 29, 281, 20, 30, -90, -369, -183, 250, 316, 235, -101, 21, 29, -142, 7, 81, -8, -60, -82]
4810h2PK45k89K70k98j86K50J40Qj14J97n4Nk15pK14j13L5J73p7j05J69r0r9J27
4835A11Q1o1q0J76k15n3j79J18J17r4m7J18N8j48J13l87L01J15R6l89K47k84K61
4858b5j07N2l4n4k6L29k49K26O2j88J48m04L87l5k48J79J6NR0j26J12rJ27m04
4882a76j17M30k38n5J92j26J84j84R1nJ51j96j24R6J24r4K06j90Q6P0l14K13J03
4905A27j53l03M23j27j13q7L41k40K30k16L59o0p6p0k34L75Q8k63k13K06o8j41
4927b15L86k77L06m25L92J52k67j55o3P9J10k41J4p0K12Q9l2J58j71j01J58q8
4949d9L1j2P4M0l45O5K78j23N4J53n9R5l50l8Q1P9J38O6j94J7N3j07K43k86K96
4974B00j65M0j72o5M05m52K18Q0j45L19k20o7m7J08j87J10K6j08j42K59j5K11
$$ y = [-82, -75, 170, -119, 151, -147, -333, -83, 57, 65, -49, 148, 94, 99, -116, -123, 91, -22, 13, 186, 109, 4, 173, 83, -16, 111, 192, 131, 51, 227, 12, -41, -220, -102, 15, -79, -126, -8, 50, -98, 15, -372, -71, 44, 140, -249, -2, -286, -25, -132, -80, -114, -168, -194, 135, -114, 112, 174, -14, 134, -270, 117, 82, -166, 13, 29, 34, 124, -2, 110, 101, 228, -176, -293, 137, -101, -156, 36, -90, 94, -90, 1, -4, 147, -49, -173, -77, 47, -47, 159, -31, 55, 125, -189, 24, 127, -26, -329, 94, -33, -146, -233, 108, -132, 98, -118, 241, 181, 105, 35, -199, 176, 264, 1, -212, -6, -74, -215, 171, -106, 200, -225, 167, 319, 52, -103, -166, -87, 23, -218, -204, -274, -62, 27, -5, 153, -18, -119, 39, -49, -18, -30, 44, 84, -261, -196, 82, -41, 13, 166, 107, 202, -148, -186, -105, -26, 112, 178, -16, 1, 54, -53, 190, -96, 200, 35, 75, -97, -162, 243, -209, 9, 89, -56, 263, 43, -24, -71, 37, -150, -40, -14, -122, -264, -5, -20, 191]
4996A91l54J42J1NJ84k2l76J48J2j69K59O4o2qq4M9j04N60m52k06J14Oj15K59
5020E2L5j95K80j2k09Q9L1l8Q4j38m6RK24k83J3L95j33l94K02J71k40K12k98L4
5044a55N4R7K0J04R6n1n5o2p9j15m2Pk1J67pq7p9L75N9l81J61o6M3j99J39M53
5070C76l42l4Mj72L12p1P4l11O3J14l03J30J79j76L86k82j15M4q7O8J30n6J8L36
5094B85j81j27P5K37m47J68j73J28k37O35l40O2n9l1qj62L47j75P8k02l2P7j05
5117a87K80j03J35l50L35r4R6j62m4J99q8k15L67k06K61k50Q1K9N7r7l31N29n10
5140b68J42K86l65J91Q0l18L86k57J47j0l4O6J54k90K21o3l4l2p9O0k80M54k05
5163d8J65l0l50M62p1j94J12l15J63P4j14J84m6J11R6j03l26N6j8RJ68pJ30k59
$$ y = [191, -163, -21, -10, -5, 179, 157, -219, -71, -59, -228, 31, 95, 33, 25, -59, -10, -114, 446, -6, -212, -98, -92, -207, 52, 87, -108, 172, 160, -49, 40, 71, 33, 117, -21, -67, -58, 166, -117, -104, 291, 158, -236, -34, 137, -103, 109, -189, -155, -101, -4, 16, 120, 216, 165, 110, 48, -31, -146, -188, -181, -202, -35, -42, -129, -208, 167, 226, -155, 6, -60, -17, -216, -77, 376, 34, 0, 4, -168, 144, 73, 147, -164, -101, 13, -290, -160, 19, -157, 229, -53, -168, -124, -211, -143, -13, -69, -51, 285, 104, -23, 52, 289, -158, 10, -163, -35, -272, 363, 23, 85, 26, -5, -13, -175, 172, -3, 75, -127, -159, -82, -187, 93, -10, 125, -225, 110, 16, 112, -50, -94, 105, 17, -198, 169, -37, 224, -26, 55, 84, 141, 44, -287, 242, -268, -126, 160, -205, -14, 66, -252, 134, -123, 24, 14, -20, 46, 200, -90, 131, 68, 34, 2, -77, -17, -297, 157, -48, 117, 87, -263, 199, 128, -66, 46, -269, -106, -32, -146, 38, -8, 103, 199, 96, -230, -174, -192, -183, -15, -22, 108, -151]
5187a51J95R2j37j03JOJ77k15J07J25R9j65j77L3J76j31R1J16j6o9l0n7m4K43
5211A66Q2M2k28r1Q7j18l6K4K9m0p3mL03k49J93J79l32K72k04l8J14j63J84J67
5235B66k65R5J00j43j66qK74o4n3m9j16L19k17k9J10k16J11K33j82K22o8l66J82
5258c0J27j33qJ49k12J93r5k22K60N8j78M23p1j56R0l90K46j17O8k46J1K18L40
5281C25l59J8j7M2L1j05K71l65K06K0M5k48k7J52L2k03J45M8j51J28J81k04J63
5304A28N7j70k11L79j00j77n1J45J48k39J5j93J52R6l59N11k30P0J16j75J97o4
5326D5k31J22O5q1J00l5q3K22j83J82J5k24P7J93k62K77k76J37Mo6n6Q0K28l05
5350e5j43J84K20j15J3k7m2p0j92J69J51K1k41J95k73P2M72k23j61j39K01P2J17
$$ y = [-151, 44, 136, -1, -104, -103, -97, 80, -135, -28, 97, 196, 31, -146, -113, 63, -68, 23, 139, 123, 54, 24, -33, -77, 166, 248, 290, 62, -29, 58, -60, -96, -72, -43, -83, -156, -160, 143, -106, 87, 266, -66, 206, 2, -36, 78, -85, 99, 266, 1, 96, 196, 53, -113, -121, 153, 89, 36, -13, -129, 190, -27, -56, 54, -162, -51, 182, 0, 222, 154, -212, -30, 97, -36, -44, 105, -107, 86, -9, -231, 29, 87, -91, 332, 261, 105, 195, -195, 51, -66, 2, -244, -233, -15, 325, -34, -16, -33, 9, 40, -65, 206, -159, 47, 67, 112, -136, -163, -11, 21, -182, -37, 11, -140, -12, 169, -35, 128, 185, 15, -196, 183, 83, -94, -145, 0, 148, -91, -76, -269, -117, -21, -380, 131, -99, -29, 87, -88, 109, 45, -186, -64, 1, -80, 20, -15, -98, 124, -59, 123, 138, -86, -9, 184, -78, 199, -77, 60, 64, -2, -58, 22, 250, -55, -198, -14, 206, 91, 104, 77, 35, -35, -227, -58, 93, 114, -127, 68, -205, -133, 339, 116, -45, -184, 17, 89, 206]
5373B06j4k81J35n3K7j03o7K01j38K96j14k16R4q0L36j17J44o0l1oq7j2k02J31
5397a1R0j98k3M9J12J1j33J86k09K26k20P9PN0N3k17m0J06O3K00m5j10L2n8P0
5422G0k00K22N4J0o2l35L58R4k40j9j43K16O2r6J2P4k82M4M98j61l33J44k04L23
5446A06n5m12L51o8L3j40M20l94R5J19M5k59K50j83K02Qpj02j09N2J13J77k71
5469b9l5j30J59np6r9M58m25N3o2Q9l2M13p8k70%L3k60O29m82j46J60L8J48l68
5494c17M29k46J84j17K00nj00J22Pj01J2j48J49o2Q2j68q7r3J51J43j41J29J26
5517A49J93l64K62k0k97J86j14J87j55m8M1K08k89K02Kr0k2P3J49j04r5k26M17
5540B45m88J40K24j43j38J25J2K04k61J7J94j27K02l89M44l24M5J22j64L67k77
$$ y = [206, 192, -89, 46, -7, 20, -83, -150, 51, -87, 209, 95, -121, -27, -107, 229, 112, 256, 196, 165, 159, 72, 60, -142, -11, 79, -119, -142, -93, 19, 30, -103, 83, -126, 100, -120, -41, -34, 16, 69, -148, -188, -82, -19, 181, 136, 26, 58, 0, 70, -130, 92, 146, 156, 94, -241, 117, 211, -29, -48, -191, 25, 87, -9, 3, 77, -205, -161, 337, 176, -157, -13, -217, 106, 51, -361, -10, -78, -45, -185, 235, -159, -64, 55, 100, -159, 91, -92, 110, 118, 111, 9, -100, -48, 65, 242, -29, -64, -194, -35, -40, -116, -215, 243, -182, -129, -191, -102, -134, 279, 201, -69, -69, -36, -296, 333, -149, -295, -135, -97, 51, -317, 112, -134, 50, -67, 133, 128, 28, 150, 157, 56, 68, -80, 69, 7, 89, -79, -166, -259, -108, 35, -106, 23, 149, 342, -22, 240, 220, -77, 109, -5, 182, 27, -21, 20, 228, -61, 141, 143, 53, 31, 104, 253, 149, 54, -172, 245, -243, -103, 121, -22, -160, -35, -23, 181, -80, -63, 131, 4, 206, -183, 261, -63, -18, 104, -60, 307, 30]
5561C0r1NL75k61O3j10K3p3M9j10L24k95J31P8j57ol7L6l1J47j52k04K11l58M35
5586B2L74n16J15j03P2L22k97Q9l01M07j06Q5k93O7P5j75K40j50J54j82J89k30
5608a42QJ43K62l78n2K67J89l52J31j69R7J73l33K86j10O7nJ49l99K20n3J31k85
5631a55J95j34K39J3k40m5K43N0p7P9k54q3m2M87m03J46O5j31J63L19m42J34j37
5654a0L17j26l03J66K00qj68j23p4m5K62j28r4J25J46j36j67J86k35N07l13K01
5676A80o7N2k55l8J75L1q7r9J86q1j2K3j15j26J46K49Jj91J63j43M4J63l48m2
5700a91J75o7J12j1K5jk43K90J56J11m44j27m5Q9J89j89K62j26p8j9K12j0j3l7
5724B0j20n1L11J74k51K5j37J29j15k05L23j33p0J27J20l22J35j18J74k14K07
$$ y = [30, -61, -56, 319, 58, 121, 11, 34, -39, 10, -100, 224, -71, 60, 138, -19, -25, -62, -26, -57, 90, -62, -266, -55, -413, 22, 396, -120, -5, -108, -36, 286, -11, 78, -223, 184, 78, 163, -130, -63, 12, -163, 77, -73, 81, -101, 88, -142, -134, 9, 271, -107, -159, 108, 297, -55, 76, -93, 4, 177, -156, 130, 20, 87, 82, 231, -168, 52, -1, 130, -155, 40, -94, 145, 158, -82, -127, 116, 166, 89, 168, -86, -169, -211, 276, -127, 19, 84, -47, 116, 435, -7, 127, -10, 307, 181, -122, 44, 244, 236, 68, -55, -129, -174, 88, -40, -134, -9, 137, 1, -166, 20, -215, 292, -21, 180, 113, 165, -90, -128, 47, 78, -9, -108, 78, -3, -15, 8, -107, -233, -87, 162, 163, -28, 135, -8, 36, 199, -149, -191, -16, -83, 29, 18, 43, 42, -201, 89, 245, 356, -88, -215, -260, -171, 18, -171, 91, -35, -113, -132, 80, 70, 57, 20, -100, -151, 160, 334, 83, 108, -29, 100, -15, -220, 103, -30, -100, 27, 147, -175, -40, -158, 16, -198, 9]
5745IQ8O9k42q0QJ63j06Q8j70O0M69r7l13N3j26J88K25j68j50J03l41J28L50j58
5769E0k10J75m4L83l92J63l25K35o8j59K45r9Q0K24k68j09L92m42N5J59R6j89
5791d8J87l3K7q5R8j5j35m4R9l05L32K50j59j17J00j22k9J21l65N06j99Oj3p4
5815a7p2J56J70j78L37l73J07MK03j06l89j12J46J39J05n6N5p1j01j30J14l1K26
5838A26k11J11K2j10J05P4k81j04K70n1J30j63M27m38j86K11L09l22L0J06k0M1
5860G6m9Kj37n1P0M7J52k97j13L83j68j31L7K37j05n2kn0K67k51l0K39K58m02
5884g0J16J40q3L29k48j32j81R3j00Q9Q1kJ91l39K15M5k91j76K54L16l84K29R1
5907A83n27N58J09n11j06K61j15J15j60M05l20J55Q6K2Ol36Q1N7j59M20l90Q2
$$ y = [9, 97, 166, -76, -156, -148, 15, -91, -3, -173, -113, 356, 259, -54, -1, -127, 61, 286, 118, -32, 71, -270, -142, 208, 50, -160, 15, -29, 354, -38, 125, -200, 35, -33, -192, 53, -46, 34, 258, -10, -119, 273, -169, -114, 45, 141, -48, 139, 106, 133, 48, 146, 131, -4, -48, 51, -254, 78, 328, 169, 52, 152, 30, 1, 122, -243, 263, 64, 70, 57, -17, -89, 67, 237, 59, 396, 23, 130, 134, 337, 231, -158, -270, -124, 15, 120, 64, 119, 48, -53, -183, -69, -100, 126, -85, 26, 48, -62, 43, 117, -164, -268, 2, -49, 81, -82, 345, -93, -279, -68, 241, -81, -51, 55, 35, 76, 27, 29, -108, -159, -89, -42, 110, -187, -300, 83, -85, -216, -179, 58, -47, -99, -101, -151, 116, -135, -165, 74, 332, -70, 46, 186, 103, 432, 184, 52, -129, -36, -136, -47, 34, 32, 223, -116, 99, 144, -147, -323, -69, 247, -137, 92, 183, -344, 214, 323, -188, -294, -33, -148, -33, -193, 212, -108, 47, 133, 155, 161, -175, -94, -37, -196, 224, -166, -84]
5929h4Q6j93k11L77j19j8K21q9J57%p5j01J33k83K16J81q5J24k03L6j85K20J63
5952B68m49J29J47k97M16k75J82l22J5M26j69j86J06R7j62J42j92P4K19k25J96
5973A40k00J04j78J56K4q3N7k08K75K98l22r9P8j06J91O3k98l3J92K83k67p7m9
5996e9M8K57j79N7l5j84o9J80J11k13L24j27Q8L3o8j71q3m1M5K17nn7j9Q9J81
6021C20n09J98k04L70k51R8J1N3l9M0J27k6k86J64O1m46L71j13J39J07l39L01
6043A47k14J32j78j3K35m4J64l54j58N37j15P2l24PJ53j60K04p0N6j24j0j8J41
6066F6k01J34j29J59m8pM8q5Q4j07K43l34K18L3o5k4K5p1K78k52n0K20k25n7J65
6091A8O4J98m23K61k57O6J85k27J4oPM3j7J76m7q6l8nL8k8Q8j57K4K09m4j36L28
$$ y = [-84, 2, -191, -402, -25, -144, -162, 59, -30, 127, 127, 52, -49, 84, -199, 17, 198, 113, 237, 34, 70, -115, 105, 268, -181, -52, 95, -202, 214, -61, 121, -201, -186, 240, 71, -115, -9, 88, -74, 68, -124, -50, 169, -56, 140, -60, 44, -134, 22, 46, -37, 20, -188, 87, 385, 63, -36, 42, -64, 127, 190, -108, -141, 51, 334, 67, -10, -59, -11, 246, 67, 124, 89, -95, -164, 16, 127, -86, 238, 111, 199, 232, 164, -7, -90, -131, -86, 131, 126, 69, 50, 139, 320, -189, 9, -195, 175, -76, 22, 33, 86, 47, 87, 214, 188, -98, 66, 127, -319, 52, -61, 78, 185, -154, 147, -67, 65, -113, -126, 109, 65, 229, -125, -283, 254, 139, 211, -113, -106, 47, -113, 91, 21, 77, -47, -57, -75, 66, -135, -1, -130, 29, -19, -26, 22, -63, 21, -86, 157, -177, 41, 74, 9, -15, 10, -61, 217, -35, -85, 135, -90, -147, 18, 82, 280, -143, 118, -139, -73, 112, -115, -101, -107, -100, -57, -74, 102, 55, -31, -69, -74, -36, -64, 24, -133, -109, 100, 56, -80, 248]
6118B48k07l8r7N5L1J12Ql6kJ7j73P0J91j89m3Q7O7j29r0J12L5L6J36k03p8J62
6144H2r3L35m83j11K06O2N7o0q8K07k80o1J5L25l12J46k7L7J24k51M6K12j01J48
6168A35o5j69K34k53M66k97R9k28K11k4p1n1O9P4l8l7m2l66N32l56Q9J73k44J89
6192C0j72OK37l9L2J83k78j31J10j05K70l45K33J58k22J3L36j92k40L04k86J36
6214C8j34OK18o7J5J34l79O5J24o0k3l2k5j4N9J20Lj38M6J41k2O9k32o0J37K1
6240A0j01q4J53J13n7J07l05J86M2j75J6M4j65J91K4r8Q7Q4L5m23K20K60k08n3
6264i7L82j55k72K57j98K77j92J50j08P0K04l55j23J68j8n9K02n3o3J13K0k0l0
6287A00O4j21J82p7q2j21K09j56j22K21j55Q2M2j20k21P3J42J98k6k00K25j15
$$ y = [248, 41, 3, -94, -39, -8, 104, 112, 76, 74, 91, -82, -12, 179, -10, -53, 34, 101, -28, -118, -6, 29, 65, 201, -2, -80, 82, -11, 324, -159, -270, -64, -2, 55, -5, -93, 114, -166, -227, -212, 113, -199, -53, -80, -43, 81, -170, -124, 88, -13, 135, 70, -99, 135, -118, 348, 51, 150, -78, 133, 109, 38, -13, 56, 130, 92, 55, 13, -353, 179, -177, -88, 85, -159, 30, -142, -136, 101, 62, 94, 277, -1, -132, -22, -127, 143, -202, 31, 189, -33, -20, 316, 124, -116, 188, -98, 38, -96, -90, 128, 61, 76, 210, -169, -104, 20, -40, -63, -95, -120, -134, -75, 45, 48, -90, -44, 97, 75, 144, -88, -148, -11, 10, -91, -175, -22, 91, 34, 141, -164, 22, 64, -111, -95, -51, -216, -25, -1, -99, -12, 72, 107, -316, -96, 164, -44, -97, 285, 130, -142, 115, -83, 194, 2, 152, 44, 114, 318, -37, -160, 8, -10, -69, 133, 80, 17, 130, 150, 130, 100, 164, 43, 225, 148, 66, -55, 154, -2, -124, 97, -58, 24, 66, -54, -275, -202, -60, 138, 112, -88, 137, 22]
6309B2n8j49K48n9j52L64k18J98k80r4J57K80l69L9p2J52L6j9m00K71j35Q8L23
6332A73R8j90K44m86K13l1o5j30r5L51n3J98l53J72J19m45M46l87L35J1j23j50
6354a48m1L45j03k80K74Q8j55L03m21m9j26M25P5k25n7K54J03j38M9k38J46j2
6376F9j43Q7L7j6k3o2j59M12j69k33K6K17J15k30j9O2K70k77J62j9Q5m64K42j61
6400a91K14J3j85K88p0P3k03J48k59L21L1k15J07p1n0J35l7r3J18j11L0O1m2P1
6424H3j78o1m6L06l4j5j76J03J81j75kL74j28n10J93J46j63O8J68j54L2j79J8
6447a49J35oK01k03J19j55q1J41Q4j35j65J93n2J92k18J64n8q3R3l6k59L18K30
6470B70j97j28J91q8j72J78Q8j52k8l6J81K4k46K66R1m40J85k7rR1K7o9p1j36
$$ y = [22, -36, -185, 63, 4, -148, 216, -2, 196, -84, -178, -21, 259, -110, -71, -143, 9, 45, 26, -374, -103, -238, -150, 173, 271, 81, 325, -161, 52, 21, -44, -174, -269, 82, 29, 227, -126, 46, 165, -280, 166, -221, 114, 125, 2, -148, -189, 156, 53, -227, 47, 135, -20, 283, -138, -187, -313, 112, 187, -38, -95, 159, 262, 124, 173, -65, 81, 69, -74, 13, 50, 34, 11, -51, -210, 202, 33, -200, -174, 43, 158, -72, -91, -29, 241, -36, 126, 107, 192, -272, -30, -191, 23, 36, -149, 139, 69, 142, -61, 87, -172, 149, 180, -35, 72, 1, -49, 86, 49, -44, 74, -37, -7, 54, 12, 83, -95, -156, -202, 104, 70, 55, -121, -18, 163, -12, -14, 360, 232, -278, -85, 61, -102, -34, 134, -20, 12, -167, -149, -14, -20, 181, -22, 97, -58, -139, 2, 86, -49, -214, -21, -73, 119, -99, 65, 7, -76, 17, -19, -278, 40, 270, 73, -55, 136, 48, -124, 54, 142, -10, -38, -74, 107, 131, -115, 151, 242, -198, -13, -40, -49, 42, 69, 0, -71, -207]
6494b07L88q7k93n4L12j4K49J2j91j08K12l32J86j00r0K60k55O2J8q4M8o4r2M47
6518B23j9k34J58j89N1L29k91J0j89J88l19L65k29J82j1q9Q5J88l44J69j25L97
6540C06k82j88M47j39j65m8K49r7m12N3L77k00K90k7k30J26j9K08l24q7K9L34
6562B01k46O2M0j5r3j18R0m2M50l60J00q7K06k64J47Q7K1j17K35j9l43j83J11
6585a37J96L0k15K04l49j24M99k14j8Q1J77J9l30K49l46J71K39o5L7j72j55PK25
6608Ir6J03r0K98l21L2N8M3k29j23M08j98J0L36j66n0l49K50m1L33k36j3J35j78
6632g5L8q6J31p8J25p3O3j87J77J22k85j56J79J58l8N8j62j64L15j04P0J16k76
6655a32J60k01j6J75L6L16m47k0LK67k88J93J69o7j33K50l47K85l21K02j0q0p3
$$ y = [-207, 181, 94, -199, -253, 59, 45, 294, 306, 115, 7, 219, -113, 73, -27, -117, 143, -112, -50, -32, -116, -68, -132, -224, 223, 204, -30, 128, -61, -10, 319, 28, 38, -151, 37, -282, 83, -146, 36, 25, -64, 21, 209, -135, 34, -91, 306, 24, -164, 283, 144, -21, -69, 180, 83, -329, -276, 101, -99, 191, 164, -66, 60, 41, 249, -75, -162, -133, 201, -45, 17, 57, 42, -51, -169, -79, -121, 329, -31, 69, -18, 188, -76, 71, 158, 179, 62, 297, 278, -65, -248, -137, 59, 89, -126, 78, -271, -395, 104, -110, -128, -47, 130, 149, -181, 68, -278, -107, 132, 67, 104, -68, -223, -216, 9, -87, 16, -74, 224, -97, -65, -7, 36, -193, -316, 92, -106, -96, 240, 74, 24, -325, -75, -116, 217, -19, -32, 103, -75, -37, -123, 8, -70, 55, -18, 45, -142, 35, 157, -128, -284, -105, 53, 15, 73, -89, -253, 62, -42, 28, 144, -132, 28, -173, -189, -14, 22, 338, -109, -129, -126, 141, -147, 46, 215, 148, 15, 265, -82, 203, -118, 84, 74, -6, -79]
6678g9M19m66%K65Q9k51k58K98K7p9N4k9J55j55j38M6n0J56j1j1K5n1R1J10k17
6703f0R5nN2q7M3q2k9K40l47L05k7k2k3j24N00k75o6J41k4k53O2M8p8k5k0J12
6729E1J26L5q9M5j97J08j4l62J66L38k11K3j18j18K5J56R1m2K40j03J03L5m30
6752a42L06j63J51j1l53M78l95j82J22J10j15J12L70j77k74L6j59N16m18J56K21
6773A89r6k9J68n8j75k6K57j57j83J65j05j85L9K58j32J43r7L11j28l3n9N3J38
6796B58j61Kj39K22j69j09j36O5J87J4k38K49J06l8j53K2Kk8o2J16k78J90O8K7
6820A7Q7J61l62J90k87J10N8K19j94l09J55J50Rj09J42p3j75J91K15j70j20l0
6842a25K74k51J98Q3k63N2J56kj78J45J13l52J85k82L10J11k00j29K79j46m2j2
$$ y = [-79, 340, -126, -126, 139, 228, -23, -281, 17, 44, -35, 19, -10, 145, -10, -148, -102, -152, 4, -7, -18, 7, -44, 47, 157, -60, 35, 30, 82, -5, 38, -44, -73, 167, -180, 125, 98, 76, 53, -71, 429, 154, 88, 229, 205, -48, 14, 62, -16, -41, -61, 51, 177, 212, 123, 168, -29, 79, 65, -297, -131, 207, -4, 19, -99, -217, -192, -36, 55, 13, 253, 150, 253, 288, -142, 164, 1, 152, 141, -212, 266, -129, -311, -189, -79, -194, -82, 288, 111, -163, -127, -286, 230, -188, -32, 189, 93, 64, 232, 174, -1, -27, 230, 73, -110, 55, -50, -235, -196, 62, -70, 73, -24, 287, 159, 126, 67, 120, 258, 97, 99, -40, 182, 13, -96, -232, -167, 20, 34, -204, 45, 151, 113, -40, -18, -16, -44, -106, 10, -268, -78, -10, 17, 104, 265, -97, 93, -194, -84, -26, 193, -1, -310, -155, -5, 4, -105, 37, -36, -211, -20, 195, 25, -95, -125, 149, -102, 96, 179, -84, -32, 124, 122, -56, 89, 202, -150, 35, -247, 63, 174, -26, -155, 124, -22, -64, -76]
6864g6J18k32M0J40K7J62j45N2M7k9l69M31j75j81J14J15L6j46J75l06K21n2J9
6887a4J21R9n6k15J7J55k75K65k51K44k63J92o9K02J34k51k4K4K73m32k5Q2M2
6910b5j17K38k97m8K34J33m30J06L08j82M9P6j54K00k15J00K25r7j64R0k03P5
6932i8J63j73NJ61R2j29K93j50j37p1r6J64k22K90l3j64p3J16J03j35K20j18n8
6955e0P7q7QL9J60j47J20j18k01N1j30L72k20J64k36J56J04J81m36l50M95k00
6977b48K11o7K6K87k16j78J19J31j36R1n3j31L33k01J1Ln6K89k65O6L17l68Q5
7000E0Pj90j02J95j70K0J64Oj71J10K7j67Q7P5J09j06J08j4q0l1M5O9q7j07Q2
7025g1M3m2R9J50j42N8j60P8Q0n8o6m9J23K23k32r0PL1oj47K86j57M9K2N4k0q8
$$ y = [-76, 42, -190, -150, -10, 17, 179, 34, 86, 133, 104, -265, 166, -9, -190, -76, 39, 75, -71, 104, -202, 19, -33, -14, 107, 206, 150, -65, -48, 107, -168, 97, -154, 90, -173, 19, -50, 152, 286, 35, 11, 35, 308, -124, -149, -67, -25, -142, 96, -201, -249, -15, 118, -312, -206, 102, -80, -31, 45, -109, 91, -124, -24, 201, 104, -60, 30, -173, -98, 65, -108, -103, 58, 150, 21, 314, 164, 27, -44, -140, 24, -198, 92, 59, -105, -178, -62, 41, -94, 126, 8, -50, 27, -60, -52, -13, 147, 0, 120, 2, -199, -148, -278, 94, -126, 38, -198, -42, 62, 243, -193, -543, -48, -248, -37, -104, -78, 209, -7, -185, -66, 65, -71, 20, -33, -164, 169, -32, -21, -18, -74, 215, -50, 16, 333, -35, 50, 57, -133, -235, -40, -210, -190, -26, -20, -191, -81, -54, -221, -134, -59, 50, -56, 52, 38, -42, -73, -28, 41, -46, -153, -71, -28, -70, 29, 179, 37, 95, -65, 13, 93, 35, -31, -80, 43, 266, 34, -56, -49, -18, -24, -171, 115, -42, 7, 29, 83, 63, -25]
7052b5L84m93M6L9j44L54j89J63j43n5L2p8J02J26J0j77o9q9K22r7J8q8qK73j70
7077e6m3J00oJ74m37J53L22m22O3q0K68O4k24J61J3J40J42k16k64K40j78k16J32
7100a70M52k79j33J20j3O9q8j48P4J11j37K20j9O6k29J16L9K6k90L52k04K18m2
7123A11k4k17K26K16k33P4j5j27R0P3k33j62K28R7m86N3M08j17l2L48j52k30M72
7146C68k24J25l64N0N6%J9j10M0J75l50M71m63K68J9p9k8P9j79m3L23j51j2r3
7170a03Q5N4J9m37L92J26j95L7r3R5J88j43r0O4J27j96P5k80M14k01J91k71J63
7193B1n4J82P3j75j03J28k21J22J84j93j26J92r9R7k0l6j91K84J01r8j38Q6n2
7216c6o8J05J55m23K94k53N29k04j28O1L3m3j3j47r5M98n02J46J35m0R1q3k41
$$ y = [-25, 359, -134, -88, -49, -193, 161, -28, 135, -8, -63, -31, -109, -7, 119, 129, -48, -117, -206, 16, -81, -63, -151, -159, 114, -56, -99, 1, -5, 169, -268, -115, 207, -215, -152, -232, 36, 100, -124, 37, 50, 190, 332, 116, -148, 92, -86, -302, -170, 282, 3, -130, -10, -23, 46, -42, -190, -116, -5, -142, 78, 59, 125, -104, 12, 51, 77, -213, 139, -65, 153, 111, 87, -130, 96, 312, 79, 153, 138, 11, 101, 174, -59, -221, 7, 104, -382, -329, 79, -38, -70, 278, 126, -104, 368, 144, 269, -95, -45, 11, 11, 30, -80, -40, 135, -215, 256, -207, 61, 80, 1, -27, 52, -127, -170, 153, 2, -10, -103, -18, 36, 55, -382, 10, 136, -59, -22, -115, -20, 168, 25, -65, -1, 126, -70, 5, -275, 139, -62, 129, -142, 21, -33, 149, 222, 47, -56, 72, -149, -27, 157, -36, -162, 30, -69, 28, 8, -28, -219, 65, 166, 68, -70, 16, -36, -104, 1, 156, -267, 27, -226, 303, 99, -29, 32, 65, 22, 9, -138, -233, 265, -237, -91, 44, 4, 95, 12, -229]
7239b29K81Lj95j89K43lK39k91k9L49r3l21L47j63p9L8j95M38k10Q2J51O7Jr3
7263A49j38p9j62O9K36o4l22M00l13m2M71l27KK06j11q6K86m01J4P3R8j27J44
7286b4O5J60n7j43q8J43r5J10j64r9l2K42J58j67l0J67o66L46J67P7N0j3J81r1
7310A97j32O4P7l46K67q5J52m52L71j37PJ01k40Q9J83j58j30m8j08K08J84J42
7332B06o52M97J39j19q0J50M1l95K24n9O4k98J99O4K0j20J20L3k0l9r7k8L43K
7356A95k89J03J98kl28J98J13l58pL02r8p1oN1J62k59K21j72K85l12K22j81k1
7379e4j5J43l05L0nL50P8l30R3r6J91j20K1P7j50K60k4k72J39k3J77k85K33k23
7403a10k42M46j33J03k04J05j36K77k30Q4Q6%M2j59J29j05J97j32j92J50o4on
$$ y = [-229, 52, 55, -140, -329, -86, -89, 150, -141, -170, 179, 86, -235, 112, -51, -130, -92, -287, 151, -59, 23, 174, 241, 242, 149, 11, -68, -230, -161, 75, 11, -311, 89, -224, -266, 205, -122, -120, 86, -25, -111, 175, -226, -212, -139, -41, -168, -24, 41, 201, 144, 1, -87, 56, -39, 71, -93, -192, -224, 18, 176, 9, -21, 146, -520, -174, -7, 70, 120, 107, 288, 197, 65, 129, 206, -140, 127, 42, 194, -258, 113, -24, -17, 84, -156, -67, 116, -42, -172, -220, -328, -120, 64, 206, -446, 51, 190, 71, -9, 141, 182, -213, 11, -48, 16, -282, -83, -19, 1, -119, 1, 34, 14, -25, -122, -150, 193, 195, -94, 9, 207, 205, -123, 75, 188, -170, -177, 125, 27, -44, -50, 1, 163, -96, 125, -47, 238, -74, 148, -33, -54, -69, 74, -231, -201, -206, 144, 222, -108, -15, -111, 80, -40, -19, 58, -92, 168, 144, -128, 11, -12, 165, -120, 113, -110, -352, 94, -39, 64, -140, -35, -171, 106, -124, -40, 46, 46, 88, -71, 58, -47, 150, 18, -174, -24, -88, -94, -99]
7426i9l1J40m6j33L29l45j37L93J6L0r1J18k22J27k81J31J3n4J68j07n5O3k5L45
7450B47j26j13j08L29j61J11j3j56Q4j33J47l52N34n30K30j07Q6K32k84J72K29
7471C18l81K7o6K7j27J78j95J41j2M6J39j10K22K0l88K83j52M4k52M35n27M12
7493H2n2j6l01L41L01l08j22J12J20k29oJ40K7j20J25l86J96K63J0J6j66J14o8
7516G3J81m92K11Q9j47K75L4l04p9O8j81L52j87j06N91o42R5J57Rk23J15L3N9
7539a9k4pj41J17N9j79J14K80K2l59K42l76J59J34j03j1j11L71l85J95R5J60m0
7562A93P9qJ6m24K43Lk04J93j93M58o16K80K04l13K8K65k33N1J30m30J98J61o1
7585B0K38l97L15k19p9J36k8p4n8J68K43q3k42L56K2k19k00R1k30K64o0K22R0
$$ y = [-99, -130, 10, -36, -169, 160, -185, -322, 71, 87, 117, 26, 144, -78, 49, -232, -101, -88, -142, 26, -81, -136, -73, -98, 247, 121, 8, -100, 229, 68, 179, 166, 10, 94, -39, 108, -244, 290, -240, -10, -117, -31, 201, -83, 89, 318, -63, -36, -102, -75, -202, -24, -219, -78, -90, -44, 95, -15, 207, 227, -161, 122, -30, 14, -238, 197, -330, 82, 30, 14, -287, 54, 355, 47, -75, 37, 157, -72, -78, 62, 89, -31, 94, -292, -96, 167, 177, 193, 27, 141, 73, 254, -238, -27, 62, -85, 190, 224, -80, -159, -91, -272, 80, -107, -213, 378, -264, -169, -12, -3, -226, -111, -78, -19, -43, -50, -191, -74, -15, -194, -80, 200, 222, -137, 105, -271, -112, 22, -81, -92, -203, 168, -217, -22, 73, 233, 193, 272, 264, 280, -144, 99, 102, -102, 91, -102, 356, -260, 20, 224, -89, -61, 204, -29, 22, 152, -278, -80, 81, 20, 258, -139, 176, -43, -122, 14, -14, -88, -146, 22, 265, 182, -60, 296, 318, 99, -101, -10, -240, 24, -36, 186, 276]
7608B76k32L40n28J40m39L96J89J32l19j91J93J54J51l92J0k2l19L14M7j3J49
7629C6l0k13J11o2K0K47r5M7J01j63j3l7J76Nk00J56N5n7J8P9L0m88O32l01m7
7654Gl4K17k76K45j80lJ3Qj10J17L9on1Lj86J35j36J2J68j36L25m8m8M0M5j30
7680C0J0j25J20P8j56j28M72m12K00k32K99j42j1L65l14k62K69Lj28J05o8M7k59
7703b39K47j42J91n2O8l42K83J80L6k40q4J29N9N2j40k29K2J12p3J65j49J00K56
7726B10j99R1J8j17j78J12j04J11K67k60j09K68L0j11J8Pj90o4J17r8L38Pk07
7749d3k2%J44m1j19k7K63N3j41k70M16l47K2j66J45O9q2J46J04l1j16K10j11J12
7773A68k33R1j6%J81k11J0r0J88M5j89J73l26O2K62K6j94J21p8o0J9j11M61k60
$$ y = [276, 44, 384, -144, -4, -443, -47, 142, 274, -45, -236, -43, 111, 262, -130, -120, -142, -461, -147, -100, -113, 36, 6, -207, -96, -158, -138, 109, 14, 61, 162, -1, -14, -51, 125, 130, -70, 86, 141, 84, 102, 181, 211, -277, 355, 54, 7, -27, 190, -86, 159, -21, -24, -11, -3, -113, 4, 43, 37, -14, -11, -197, -62, -198, -186, -18, -154, 171, 123, 75, 115, 160, 30, 40, -85, 35, 113, -43, -171, 301, -111, 89, -143, 156, 14, 3, 368, 54, -208, 61, 64, -64, 41, -27, 20, -239, 8, -134, 57, 5, 73, -269, 14, 194, 230, -10, -94, 35, 94, 146, 6, -223, -201, -89, -162, 3, -146, -46, 210, 11, 102, 120, 3, -175, -63, -167, -56, 211, -49, -158, 110, 140, 29, 47, 54, -136, -200, -83, -181, 157, 164, -43, -65, -65, 79, 38, -81, -108, 155, 208, 67, -203, 213, -134, -112, -278, -133, -64, -146, 0, 104, 73, -43, 167, 56, 168, -65, 26, 10, 10, 191, -20, -10, -100, 88, 133, -56, 117, -209, -147, 115, 141, -53, 68, -10, -70, -51, -162, 299, 39]
7797C9J61q1M0k1M6k05j53l8L23p7j52N2j43L58j42n1M6j35J18M5j40K42k49J81
7821F4j05L9Jj49j34K77k5k36J10KL1K44M3q3M5K1n2N7l9k8pj71J08O9j43K84
7847B23m13J16P9qJ0K0q3j61K45M1J52n6J5j72Q8j26j64j8K20p1J62K03n62L14
7871E4L4pJ37j81j67q6K87j9k50N05r0k32Q1l76L08L48k99q4j0k%M7q5K29Om29
7897b81L76j79K73k17q2l2J6l9Q1J04n0j21K09l9K35l06k2K5K15l21kJ51j23K88
7921A59j08N6K3o5j46N9J29j52J99R1q3O7j82QR6p8k37J28j46K30R0k25K28j39
7945Bj66L31m36R1J94p0j80L20j69J67r1P8n9J58j16j67J51k60L54k54J39n1j
7968c5q7k4J25K07k31K8K33k00jj3J32l56L56j98L7ro7P2p2J84j9j50J53n7j62
$$ y = [39, 200, 119, 159, 138, 184, -21, -174, -212, 111, 34, -118, -66, -209, 149, 7, -44, 2, -133, -15, 30, -110, 132, -117, 64, -41, -2, -1, -150, -284, -7, -32, -268, -158, -156, -125, 119, 162, 79, 124, 145, 93, 150, 111, 83, 76, -95, 13, 82, -61, 223, -190, -74, 5, -3, 7, 27, -56, -217, 28, 69, 221, 165, 180, 8, 96, -30, -194, -212, 8, -63, 99, 302, -260, 54, 88, 81, 218, 37, -130, -216, 71, 52, -198, 307, 217, -15, 66, -310, -2, 346, 47, -37, -47, -49, -49, -2, -87, 142, 148, -281, 95, -84, 189, -28, -110, -142, -126, -165, -84, 20, -30, -151, 58, 19, 254, -52, -74, -49, 166, -155, -157, -6, -129, 159, 51, 107, 130, 65, -81, -22, 107, -45, 154, 245, 162, 229, 47, 55, 151, 73, -164, -36, -182, 48, 138, -87, 141, 2, -164, 167, -269, -178, 16, -54, -234, 86, -83, 84, -7, 71, 12, 170, 54, -113, 38, -222, 132, -122, 17, -34, -35, -122, -146, -21, 186, -45, -17, 216, 16, 15, 2, 134, -222, 134, -64, -27, -36, -103, -31, -103, 81, 62, -88, 65, 8, -154]
7993a54R1k0J22k32K88N9j76j53K03j10m5K47m4J80n22M38j48m9M7NQ8L6l19L56
8017A88Ok42J91j59j27R4o4K44k02K09k65j23L11K09l45J55j30J95l00J26j33
8038a62k0K50r9J14j10l2p2j2L29k63J72p2n9j51p4O08l63%K6j45N9M28n38K75
8062H9J81l55O0RJ85j65o0N6j71K34j41l8kJ52k45J75L0QP4m3k45M85j60j47n6
8087i0O9j4l3J98k55K14p6n9r6O7l63M77j06K6q7J65m9M7m4J07j36Q2j39J47j31
8112g9J04j25K10M2l11N40j86k23JL5%j80K31p4N2k2M8O3r3K5K42l43j2m1J90
8137I4r2J55m59M05j94K08r9o6L22k03j35Q7m5M2Oo5k7rK83l12K96q8j0j74R6
8162A6J10J6n5K7j31n5K18l06Q9J08K29l47Q6N9n2j1Qj42P2K06k68J94J2m2o3
$$ y = [-154, -63, -83, 39, -193, 95, 154, -22, -175, 28, -82, -127, 120, 76, 256, -266, 172, 24, -25, 22, 27, 115, 151, -168, 188, 194, -48, 143, -16, -143, -49, -113, 131, -71, 138, -127, -250, 61, 270, -75, 80, -50, 145, -155, -29, -162, -182, 68, -31, 83, -27, -59, -131, -143, 186, -77, 95, 23, -36, -187, -261, 347, -16, -16, 10, -135, -76, 352, -186, 89, 270, -85, -25, -16, 169, 4, -56, 0, -171, 63, -78, -116, -118, 34, -211, -36, -6, 2, 76, 33, -212, 273, 113, -34, -90, -21, -35, -68, 130, -125, 89, 13, -46, -142, -75, -438, 39, -67, -41, -128, 37, -12, 35, -9, 98, -38, 44, -95, 52, -79, 25, -100, 110, 152, -159, 381, 195, -28, -27, 8, 8, -172, 59, -15, 37, 15, 63, 126, 33, 58, 300, -43, -55, -96, 94, 2, 157, -302, 103, -91, 117, 18, -48, 274, 71, -64, 23, -22, 20, 26, -39, -66, -75, 208, -104, 192, 104, 94, -80, 16, 126, 142, 87, 114, -17, -72, 146, -160, -71, 37, 266, -81, 5, 64, 12, 1, 9, -133, -61, 145, -123, 71, 83, 41, -22]
8187b2k12K87M8m4
$$ y = [-22, -234, 53, 101, 57]
8191E7
$$ Imaginary data points
##PAGE= N=2
##DATA TABLE= (X++(I..I)), XYDATA
0@%%%%%%%%%%%%Qj6J6j6J6k4L2l2M0n2O0p2Q8j04J20j36J54j78K04k32K64l00
34a60L40l83M30m83N40o02O71p46Q29r19J015j120J236j364J505j658J826k010
52a053K215k445K700k987L313l688M122m630N239n982O911q111R736j2069J5720
67H991k2305L7898j45129j29270J93808L1992p5610p0015k574m3315J8803J00118
79i6608Q1237l9614n0823j460L1035L5358N6228K7531K100J1837K0793N675K8302
92A11591K4876k8045k5868N9378N6864l6095n8185j2772l8054n8506K8126P9203
104A02513k3369j02859m9755l718k4983K452N6337R190p2909n4217O030J6804
116a38484K5029M5572K5756j1898j7255r478L346M1765O1803L0706M869Q687j2030
$$ y = [0, 0, 0, 0, 0, 0, 0, 0, 0, 0, 0, 0, 0, 8, -8, 8, -8, 8, -16, 16, -16, 24, -28, 32, -40, 48, -56, 64, -72, 82, -96, 108, -124, 140, -160, 180, -203, 227, -256, 284, -318, 353, -393, 436, -483, 532, -588, 648, -716, 789, -869, 957, -1053, 1162, -1283, 1417, -1570, 1743, -1945, 2177, -2453, 2786, -3196, 3715, -4396, 5340, -6729, 8991, -13314, 24584, -120545, -249815, -56007, -24015, -99625, -169640, -172214, -215529, -196726, -96608, -15371, -54985, -105808, -107268, -76233, -40875, 15353, 42884, 44984, 56821, 77614, 83289, 111591, 136467, 108422, 82554, 141932, 198796, 162701, 104516, 91744, 53690, -4816, 23310, 102513, 79144, -23715, -73470, -77188, -102171, -99719, -43382, -34192, -107101, -161318, -155288, -138484, -113455, -67883, -42127, -54025, -71280, -80758, -77412, -35647, 26156, 56862, 61731, 70418, 58388]
129E8388l6081J1134O9526L9123j7932j4464j2645m4070j9994M6493L7967k9450
141H7995m9909l0707l2248k4425J5037K7662r869l6005k6780j7567j0722R110
153i8428J8852R878O215M917o562o396J3707K1877J8231K2989J9341n321j7372
166A928N266K8205K6995J9618J1130j3750l2629j1436J8291K0386R200j696k1371
179F0137l2214j9658j671K075k042o691j4772k2160j7113n470o63J322N632L503
193d9785o788j3192n914Q583K0665K4276J6472L523r613j0824O153K6596K7573
206C7725J2726m35p969r860j11J5459J7176K159j2184j3480p906l412l40K143
220C1691k312j0433j5475j4536r950q097o535l97O274k65j3131j3090l618J231
$$ y = [58388, 22307, 33441, 102967, 142090, 124158, 109694, 97049, 52979, 32985, 79478, 117445, 87995, 38086, 7379, -24869, -49294, -34257, -6595, -16464, -52469, -79249, -96816, -107538, -98428, -79576, -69698, -63483, -58566, -65128, -71524, -57817, -35940, -17709, 5280, 24621, 19300, 1928, 7194, 35399, 62394, 82012, 93142, 79392, 46763, 35327, 53618, 74004, 83204, 81508, 60137, 27923, 8265, 6594, 8669, 6627, -64, -14836, -36996, -54109, -59579, -60242, -58920, -53288, -49785, -56573, -69765, -75679, -67096, -46431, -22155, -5683, -2160, -11773, -22597, -16444, 10152, 37725, 50451, 50016, 42047, 32187, 32076, 47535, 64711, 66870, 54686, 41206, 33300, 29888, 29548, 31691, 29379, 18946, 3471, -11065, -21015, -29112, -35647, -36044, -29770, -30035, -43166, -56256, -59874, -58643]
234e8643O415J6274J5306k022j0802J617J6091J4772J1843J1986J665r339k120
247A3043J2754J3560O636K397k542o710o189m084p67J431j24l426o060p210j0939
262A770j2875m815M710j76q578r194o693r008j115J2559R791m617q894k405K302
277c7238Q145J5117J4481M445l761l48N729P419P130O772L402k36j90k89j075
292B9503k05o10k320j093k628p945r034l934J078P82j930m808r760j2191m922
307c0017M131N688Q43k406m466n216n3N989O868L892J910J785K863M682O031N770
323H294M908L676K412K23p59n1J483L324L846R45m771q043o929k810J628K927
339A0303o45n631q280o576j212K005J056j497m890n578k410K319L393K558J043
$$ y = [-58643, -52228, -35954, -20648, -22670, -33472, -31855, -15764, -992, 10851, 22837, 24502, 15163, 13043, 25797, 39357, 45993, 48390, 45848, 39138, 32949, 28865, 28098, 29529, 29405, 25979, 19919, 12709, 1770, -11105, -15920, -11210, -11386, -19964, -29158, -35851, -44859, -45974, -33415, -23624, -28241, -37135, -39540, -37238, -29093, -13976, 505, 4950, 1189, 841, 6570, 13989, 21119, 27891, 31293, 31057, 30867, 30578, 29503, 29298, 28688, 26368, 25275, 22647, 14702, 5668, 1734, 2812, 3594, 1664, -3144, -12904, -25095, -30017, -25886, -20198, -19355, -21761, -26227, -31443, -31496, -25507, -18639, -14747, -12837, -11052, -8189, -3507, 2524, 8294, 13202, 16878, 19290, 19513, 18754, 18703, 20186, 23510, 27356, 28301, 23530, 15487, 8558, 5748, 7376, 10303, 9658, 4027, -4253, -10829, -12041, -10036, -8980, -10477, -15367, -20945, -23355, -21036, -17643, -15085, -14042]
354a4042p70o99Q90J840K907M319N386M811L888R88m32k55J669M770M670J418
370B1358k333l403l641Q6K725Q26k989n695o081l457K27K108K18k288m368m095
386a0802k780j013L72Q44O20Q23K71r96j425R80K212L146M080K530k07r59K696
403C92M382N198L856N82k580k720J95L254L219R54j119m024n277j833K74j003
419C750j811j491k192k795j701r85j130j465J93j22q82j749j001O98K426L629
435f628K067j48j509q65J081M040O253L016l94k38K54K75J754L329J492j931k861
452H987m61M23j562j046K32j161m039l309j848o00k110q2K260O26l616m006J29
469a1183J055K38K963L537m3l866p23L817L679M27J156J795o93j686J916M780
$$ y = [-14042, -14812, -15511, -14621, -12781, -9874, -5555, -169, 4642, 8530, 9518, 9086, 8831, 10500, 15270, 19940, 21358, 19025, 15622, 11981, 12067, 14792, 15618, 12629, 6934, 853, -2604, -2377, -269, -51, -2339, -6707, -10802, -13582, -14595, -14223, -13379, -12759, -11936, -11665, -12661, -14086, -13106, -10894, -7748, -3668, -1138, -1345, -2304, 392, 4774, 9972, 13828, 14410, 11830, 9110, 9305, 12559, 15778, 16732, 15613, 11589, 6312, 4479, 4753, 3750, 1939, 448, -1744, -4539, -6240, -7225, -8355, -9820, -9627, -9749, -10631, -12380, -13381, -12683, -10257, -6628, -4561, -4709, -6218, -7083, -6002, -1962, 4291, 7307, 6913, 6675, 6929, 7204, 8958, 12287, 13779, 11848, 8987, 8526, 8949, 7387, 6341, 6573, 5412, 1373, -1936, -3784, -4384, -6494, -6576, -4316, -3690, -7306, -11312, -11183, -10128, -9890, -6927, -3390, -3433, -7299, -8022, -4205, -526, -99, 1057, 2852, 2159, 473, 2389, 7169]
485G169K584j471j233J200k31k834j284L276J343l169k089J387k275o588j017
500e232N233R8n154j250K138k585l443L954N632k486m590R08K274nJ059L474K502
517B527j482k763j1L108J475j052P31M042K65m624q21M399K90m508J876N189m159
534D482p655K691N403l238l471L178L52p267l001N611K771k973m73J484j613k210
550e929Q36K120J939R47j861p20K973O09l371J387N602p84n254J101M981l110
566A466l415O349M844o572m028M314R78m722J534N841k555n778L60J602j581r94
582b357J969l56k633K31k91p41J520J696j864p06L048r29l591K272M976j206k341
599a303L689L97n075R7N736J022l287J338J936l393k016L854J494k617m00J436
$$ y = [7169, 9753, 8282, 7049, 8249, 8018, 5184, 3900, 7176, 8519, 5350, 3261, 4648, 2373, -4215, -5232, 1, 99, -5055, -6305, -4167, -6752, -10195, -6241, -609, -3095, -7685, -6777, -4503, -4508, -3449, 25, 2527, 1045, -1718, -1729, 1379, 2854, 1802, 2533, 6575, 6840, 2216, 1395, 5794, 6084, 1576, 3452, 8641, 4482, -3173, -482, 4921, 1683, -1788, 1390, 1742, -5525, -8526, -2915, -144, -3117, -3590, -2106, -3719, -5929, -5093, -2973, -1034, -87, -1948, -2668, 305, 914, -2457, -1070, 4532, 3748, -1506, -405, 4576, 1466, -1949, 4400, 9244, 2672, -1356, 2958, 3936, -786, 748, 6589, 4034, -1744, -1384, 218, -1363, -2357, -388, -744, -3377, -3146, -3437, -4178, -2658, -962, -2826, -3532, -484, -1413, -5004, -2732, 2244, 1038, -1303, 2386, 2783, -2292, -2195, 3541, 4563, 1276, 2614, 4550, 1157, -859, 2995, 4489, 1872, 1472, 2908]
615B908l219j378K921N05l092P12J206k950k590K165J406k537J310K647j201l004
631d191J252J801q04J300L062j181j871J150P77n09J584K171j953k372J235J406
647B857k247J54L679j443m429N65K621k502j944K709K053l089j942J446m60j752
663c724R47K387K91j851o69M23J061R52L53O64R27p69k551J073L995j60k263J008
681B094J972k824k917K598K479k422j854K181K08l718j209K924J521k437r04J770
697e38m65k483J09L345J551k112j486J072O02j269M17L382J344k776j758J876
713H11J185j517O7K887Q6l004j110K005M06j824K38K077n68l508j075J999O61
730a84j438M87J723j160l294l89L056J483j289J99J516q34k722J200L081K52j259
$$ y = [2908, -311, -1689, 1232, 1737, -1355, -643, 563, -2387, -4977, -2812, -1406, -3943, -2633, 14, -1187, -4191, -2939, -1138, -1942, -642, 2420, 1239, -632, 518, 1295, 786, 2370, 4541, 2588, 216, 1451, 2857, 610, 764, 4443, 3000, -1429, -864, 1757, -745, -2689, 20, 2073, -1016, -2958, -1512, -1972, -3724, -2777, -390, -99, -1950, -2619, -2196, -1135, -183, 170, 834, 1761, 992, -1559, -486, 3509, 3349, 1086, 2094, 4066, 1242, -1675, 923, 3402, 980, -874, 1307, 1515, -2203, -3412, -488, 1033, -1404, -2308, -538, -1003, -3486, -3377, -32, 1519, -593, -2079, -1007, -405, -1674, -1257, 2125, 3469, 693, -1065, 811, 1996, 479, 546, 3433, 3519, 515, -595, 1410, 1816, -8, 230, 2307, 1739, -1769, -2844, -845, -184, -1622, -1135, 588, -572, -3866, -4255, -1199, 284, -1005, -806, 710, -124, -2846, -1646, 1435, 1687, 428]
747D28J90Q28r47j127P70K620J87j597q86O26o82j136J018K236l4k217j202J73
765g52j0q59J768J529j289k592k33R76O7k02J541N31j705j535P43J017N66M76
783C7J204k54j468j091Q53J355R38L67l70j12r72j250P95K079O73m15o11p88j594
802f24p8J736J145o74j271r38q88n48M02J540M58j017q59j241m36O12J127R77
820e77L08o40r82k77M92J306J343P64L37j187q14J41J288J423Q60m2j045j488
838A210n95M91Q72P00j05q77j733j384j85P46P31L1r37j361j319j48M10J117N44
857a792O99r14r07k51P56J496J461O89J29p83q61Q57J075J833O06J8j204j092
875A815k61N61Q33N84m34j416j498j153j74M16R10j72r61j258j628LM77P99R06
$$ y = [428, 618, 1446, 499, -628, 142, 2762, 2949, 1352, 466, 1092, 410, -726, 292, 2528, 2494, 277, -925, -752, -762, -1621, 147, 1676, 387, -2205, -2438, -1462, -1395, -1597, -56, 475, -1230, -2765, -2022, -1005, -439, 37, 1241, 987, -481, -1572, -719, 636, 1574, 1941, 1571, 1459, 487, -763, 32, 2111, 2784, 2369, 1758, 970, -624, -702, 1034, 2179, 1505, 234, -704, -1592, -2140, -1738, -198, 260, -757, -1616, -2857, -3293, -2681, -1554, -577, -269, -909, -1891, -2168, -1676, -370, 973, 1737, 2074, 887, 73, 214, 1502, 2925, 3785, 3743, 2698, 1210, 615, 1106, 1978, 2678, 2573, 1696, -37, -1421, -1606, -860, -129, -98, -1035, -2396, -3715, -3863, -3453, -2336, -1792, -1093, -2007, -2914, -3165, -2409, -913, 548, 1237, 1366, 583, -278, 579, 1654, 3487, 4093, 4111, 2907, 1815, 1554, 2115, 2948, 3532, 3098, 1682, 184, -969, -1143, -727, 183, 11, -950, -2208, -3836, -3833, -3356, -2557, -1651]
894a651j16j114r62R6P80J519J367Q48j66p42m52R12J364J347J085n00j079p09
912A827q5O32Q93O47p09q91j515r34J20O51P3Qr66j471j525l82P24J150K85l61
932a829q54j068l24Q51J772R46L99p18p69J37N12J517J414N92j90q14n19K77R21
951B253R64O38Q8j335j571p3k17R64M66j5j363j267j479j7N43R03O7p50j111j502
971c814j28R71J126N91j04p53p60J7Q34J406J359J63m33l08J3P0R76J978N03m47
991C260j088j82m39M83P67J022m14j398j246o01k90J08P36K07j350j747j175K13
1009c134M27O23N27k59j061j064n7Q18J274Q98M19j27l64o51R33J507J390O71
1027B770P7n21o05k32R81J414L23n80o82q09p82m61Q88O41l57j680j361q87n69
$$ y = [-1651, -1767, -2881, -3843, -3747, -2967, -1448, -81, 767, 601, -141, -593, 319, 1683, 3030, 4115, 3615, 2536, 1827, 1742, 2374, 3267, 3914, 3205, 2314, 799, -135, -15, 636, 709, 717, -249, -1720, -3245, -3627, -2903, -1753, -1468, -1829, -2683, -3751, -4075, -3224, -1452, -506, -107, -825, -1594, -1457, -945, 572, 1986, 2578, 2388, 1574, 1055, 1332, 2253, 3217, 3855, 3943, 2608, 1037, 964, 747, 1711, 2177, 2162, 799, -468, -1947, -1964, -1421, -518, -451, -1201, -2312, -3814, -3942, -2971, -1845, -1254, -1358, -2111, -2871, -2854, -2020, -614, 745, 908, 475, 167, 180, 250, 1226, 3204, 3707, 3260, 2172, 1990, 1551, 2034, 2801, 3823, 3409, 2011, 765, 164, -126, -18, 718, 925, -425, -2172, -3347, -3134, -2707, -2084, -1557, -1816, -2877, -3941, -3998, -3180, -1906, -1008, -589, -716, -1080, -1731, -798, 709, 2099, 2770, 2847, 2326, 1721, 1489, 2470, 3884, 4207, 3627, 2945, 2136, 1354, 893, 1781, 2422, 2065, 385, -976, -1863, -2432]
1046b432N87O16l05m56j395j237L47O56R40J067J97m61q77J62Q26J561J191O75
1064A662L28o32l52N86J153J074K82j18o96j035p43Q31K04K13R0j458j186j258
1082a055q0L45K77O3r24j516j060o8P89M34Q12K16j092o83K87R40J455P00M89
1101C29J46l27m39N50J345J485J37l82m22m59k74K17J477O51j294j320j61p24
1119E35n98L31Q53j31j467j541k83m8j75M92J157p48j238r37O84M50M68J183P14
1138b99k87j467L39J201J184K51O62O70n92j291K38J845N86m08L65N0j424j090
1156E33O96J316Q2j167m51o08j249r45O90J349m47j483o95k4p40l04J419J069
1174i59o14j125nL96L14K72J427R79l28j074N01J063P32L11J019P23j325j166
$$ y = [-2432, -1845, -1229, -1534, -1990, -3385, -4622, -4275, -3619, -2679, -1612, -1415, -1876, -2753, -2591, -1765, -204, 987, 1662, 1990, 1358, 1006, 1592, 2745, 3819, 4101, 3983, 3287, 2252, 1509, 2340, 2544, 2757, 2847, 1389, 203, -1055, -1135, -790, -513, -450, -1374, -2890, -3950, -4018, -3229, -2795, -1983, -1767, -2859, -3542, -3255, -2315, -860, -160, 329, 475, 148, -291, 259, 1604, 3089, 3226, 2844, 2422, 1963, 1689, 1906, 3383, 4034, 2740, 1420, 1259, 535, -63, 268, 1121, 990, -477, -2018, -2301, -2349, -2524, -2032, -875, -1623, -2861, -3798, -3114, -2664, -2196, -1013, -299, -586, -2053, -1714, -513, 671, 922, 1584, 2254, 1662, 371, 609, 2454, 3040, 2632, 2997, 3047, 1623, 533, 1229, 2545, 2627, 1460, 1009, 401, -848, -1793, -1103, 246, -201, -1684, -2379, -2403, -3143, -3447, -2028, -959, -1573, -2698, -2703, -2307, -1993, -1721, -294, 685, 357, -717, -216, 847, 1579, 1890, 2909, 3632, 2307, 1141]
1192A141O59J124J57l94M09l66j787r73Q16N78o19n86k60q88j690m33P38R23m25
1211a876o07l78j74q83O35J384Q73m8k28Q0M01J27Q64J592R67p94k30LM59L77
1231B544N33P87qj547n26n2j55k70K26j2r56j817m84r1J97n7L9k29r47j016N3
1252c788J201P22o4K00J94l35k34Q55J236R93J26M05l9l54J43P28R88L63k83r21
1272B136N0l82j83O34J77n05r79j329m18J0K2L44j91o66p17r32M7K37P52M97n10
1293a906L6m48J07M04R64R14M48j68m95J5O02N85J150K42j98n11l60J4M53N85
1313B433R5l14p33q21l39l12N46k92K43l93j177r40L08J78L67q6l85j51r26J22
1333b577M46J182M9O1O6n67M96L5R28P36J84j66N06p80M58L35P10N67j53o12o47
$$ y = [1141, 1800, 2924, 3081, 2687, 3096, 2730, 943, -30, 786, 1364, 745, 159, -101, -989, -2679, -3112, -2374, -1451, -1876, -2483, -2861, -3035, -3918, -3283, -1899, -1026, -1074, -1302, -1222, -821, -694, 170, 1762, 2729, 1935, 1705, 1708, 2167, 2544, 3077, 3864, 3856, 2309, 1783, 1731, 1576, 1306, 1532, 1520, 564, -1253, -1737, -1828, -1631, -1688, -1649, -1878, -2825, -3841, -3788, -2587, -1865, -1929, -1729, -1535, -1870, -2104, -1249, -13, 980, 1106, 1511, 1472, 1118, 1261, 1989, 2977, 3340, 3057, 2136, 2186, 1804, 1621, 2255, 2432, 1927, 948, -381, -799, -789, -767, -423, -614, -1280, -1997, -2929, -2882, -2645, -1893, -1396, -1906, -1870, -2318, -2211, -1807, -843, 71, 519, 351, -144, -129, 473, 1058, 2208, 2450, 2252, 1741, 1381, 1395, 1848, 2433, 2528, 2214, 1481, 660, 321, 9, 555, 263, 506, 113, -1064, -2004, -1696, -1518, -1151, -1237, -1622, -1773, -2699, -2577, -2131, -949, -900, -839, -773, -1340, -844, -809, 119, 855, 1039, 873, 1379, 599, 1057, 1392, 2102, 2669, 2516, 1904, 1257]
1354A257o5mJ51M05j25j099o67k95n00L40L04r3o34q49l38J75k27P24L47K84n82
1375a491m36k6O0J233N31K82K67l39q1L9J235P21J21n4Pn66k52O95K72J68l43
1396B043p53m71p98j48M43L72m25o95n83r09k2k21M46K39j36k19p34L5N47M36
1416a553J012J59k64L0n5N63M87Q06Q89k2n45l86K33M55M65O0K8o39o36m81j44
1437D62L19J93k66m28j003o18lJ56M0J34k19m79m93J43M6Q81L11l3L59o12j51
1458a261O41O32R41J05k01l36J31L3M14N73L67k31k75m39n15K2K58O49j96n05
1478H07r06k78k51M2M90k12n4n67o92l4L28L28N50k12m35k07k43K19P27N80L95
1499C75k70l13p7K84O36L90J45K51m39m24LK66K64K54J09m89p22j93k6N22n4L32
$$ y = [1257, 1192, 1188, 1339, 1744, 1619, 520, -147, -442, -942, -602, -298, -391, -1025, -1874, -2212, -2037, -2264, -1540, -1193, -909, -1491, -1927, -1953, -1893, -660, -129, 153, 420, 81, 0, 39, 1274, 1995, 2116, 2062, 2069, 1503, 1251, 1946, 2218, 2386, 2043, 1290, 819, 21, -127, 316, 688, 263, -432, -1015, -1924, -1946, -2167, -1721, -1482, -1618, -1837, -2571, -2536, -1989, -1553, -541, -382, -646, -616, -671, -108, 379, 1185, 2074, 2052, 1507, 1121, 1354, 1809, 2274, 2334, 2362, 1723, 1087, 606, 462, 781, 974, 708, 280, -723, -1341, -1344, -1188, -1148, -1014, -1233, -1712, -2205, -2062, -2016, -1135, -824, -857, -498, -1110, -1261, -620, 12, 953, 1058, 857, 521, 652, 685, 1099, 1672, 2039, 1808, 1533, 1094, 579, 601, 859, 1508, 1312, 807, -99, -377, -628, -586, -96, -308, -362, -929, -1621, -1655, -1327, -999, -449, -661, -1096, -1303, -1546, -1327, -600, -20, 375, 105, -208, -285, -1, 635, 1025, 1170, 1421, 982, 558, 561, 827, 1091, 1345, 1454, 965, 243, 50, 24, 546, 492, 824]
1521H24p64o51j22k82K48L08L0Q5o43o36o8M36M09L60J71j31m11k78K56P30K66
1542A37N29M5m22q2P7L32L37L19K48m03n38r2J10K95M13M7q56l66l79L5k5K97
1564E8j42j82n51n42r7R7O18q2J01k20k15m11L66P24M38J16pR4m9k92O15M91L14
1587A242J47l28j5k81j09M50K82L87j040m33p3k17j51O04j01l73n81m99J48l5
1607i76J93M63j75l46o39J1M93J80O61M3j25p9k51O0N96O31R9O4j14l74j65L44
1629E94M60N80l70n74p1m47j30J66L77j91l69Ko77N4j20M05N35k65p58l09K45
1650h63oM23O4N00k76k86l53J94O68J65L0L92n07l23m2M77L30j2L21l12m80k79
1672a75L02L81K03j68k67Lp98J88K3M70K86l83k28nm47l6K02O82j56l18m30k48
$$ y = [824, 60, -591, -713, -995, -747, -439, -409, -324, -967, -1603, -1671, -1235, -826, -466, -295, -426, -837, -1115, -859, -129, 137, 666, 711, 289, 207, 284, 616, 953, 1272, 1520, 1117, 579, 487, 597, 892, 1305, 1352, 496, 130, -249, -214, -239, 58, -84, -266, -817, -1359, -1456, -1359, -741, -823, -722, -942, -1157, -1568, -1202, -478, -40, 76, 69, 163, 114, -178, 437, 928, 1242, 1389, 1061, 1046, 765, 656, 1106, 1388, 1775, 735, 302, 229, 12, -139, 465, 364, -9, -590, -1089, -941, -976, -783, -320, -495, -841, -1480, -1469, -976, -796, -135, -92, -217, -296, -547, -487, 109, 740, 839, 903, 789, 415, 250, 594, 1054, 1634, 1264, 690, 619, 172, 42, 208, 585, 394, 25, 27, -650, -596, -716, -311, 224, -41, -799, -1108, -863, -869, -446, -382, 118, -158, -444, -797, -603, 65, 230, 260, 652, 145, -178, -220, 257, 587, 575, 896, 584, 104, -175, 127, 508, 711, 543, 276, 279, -519, -331, -308, 162, 448, 65, -163, -168, -615, -651, -449, 233, 77, -241, -671, -919]
1694i19Q9J34O49K77l97p2r0rl5K84P05n6m58nk98o3P43K99J4J35o53j54j78N10
1718D52M72rk67n21l80k01J73L21K72k36j83o85k3m0j1N07K57k54j56k76j66M17
1740e37L92K85J37l37l01L03p1P71R9L2J10m74l25J22K41M47P9j74l32n82l0L39
1762A94M5K84p61Q2j93j30k60M0P12j94k7l77o9k86L57M03J08k72J66J04mL25
1784B47J78L40K27p51j69J92o0M78l3O1J37q40l54L23K60q0J8Q9j36m28l77J19
1806e59K23K24K6n0m76k40M79p0P39j71k44q3k5l19L99K75M14r1k39k59P3j0K82
1829B98K22j5j9n44m8p1R1J16N46J5o44l68K27R7K23j64J61k3m94k16K98N07j26
1852F9M82m44k38l67M4K38K03K69o5k74j66l15M78L39L09l98L1p6l28j05K99L11
$$ y = [-919, -830, -696, -47, 230, -167, -239, -329, -338, -373, -89, 616, 560, 102, 97, -201, -264, 479, 778, 792, 927, 274, 120, -58, 452, 924, 915, 648, 127, -253, -454, -281, 40, 312, 76, -107, -792, -815, -855, -866, -359, -102, -356, -512, -788, -954, -537, -145, 140, 277, -60, -361, -58, -129, 642, 741, 773, 883, 409, 84, 206, 447, 894, 973, 799, 467, -115, -145, 194, 239, 523, -238, -156, -349, -479, -739, -699, 13, -181, -208, -585, -654, -940, -583, -180, -72, -344, -178, -74, -78, 247, 425, 765, 992, 241, 72, 264, 204, 682, 649, 710, 847, 7, -347, -24, 236, 156, 174, 263, 127, -301, -678, -559, -336, -112, -86, -136, -612, -852, -373, -443, 296, 125, -119, -202, -227, -546, -147, 128, 542, 451, 212, -47, 26, 16, 298, 520, 505, 486, -58, -106, -177, -86, 30, 576, 591, -53, -421, -194, -97, 126, -38, 123, 100, -394, -610, -312, 195, 69, 551, 107, -131, -498, -454, -216, -13, 256, 191, -83, -249, -564, -86, 253, 562, 164, 195, 119, -209, -314, -15, 296]
1874B96L45k43l89l89K14K04L59O8Q0k18m07k1jK1L05Nk27k94k92J44J11M60j50
1897a9N3l95j04JP1K72L39j30j12R3k79p0N37j12M36J22m10n43K39J15M3L97J1
1920E55k10k94l67L51J00J52l24m5k9l50j8KL00j1M3k66j90L17k04O89l5Q4l29
1943g9O1m2j3M03K00K00j99j52n3l50K97K66L53l77m69P7p07K78M36Q8k5m07n47
1966g61K1K69j7O98o3l61l77N6J40K42M0K95nj28j05q2N9K81M54j85L3l41j83
1989b0J23N1L12j4l49j21k81k15K92L22K55k14l79j06j15j09J56N53J06j95k95
2010b43k12L38k9N82N3k82l14Q7k60K21M01k07K31k11l53o0p1L69L18j11j72J43
2032B18n44jL40K71j41M1m68K26m48M18J04N9K44j20j88l65J97J46P5L2J16k00
$$ y = [296, 641, 398, 9, -380, -166, 38, 397, 465, 545, 327, -80, -101, -102, -81, 224, 229, 2, -292, -584, -440, -329, 131, -19, 34, -361, -465, -464, -393, -121, 218, 88, -24, 69, -210, -280, 257, 145, 581, 703, 293, -250, -11, 104, 147, 544, 555, 345, 51, -316, 35, 135, 287, -37, -82, -111, -461, -479, -477, -177, -188, -145, -411, -601, -284, -488, 201, 166, 250, -79, -18, -60, -73, 330, 530, 730, 531, 379, 326, -24, 273, 539, 892, 515, 46, 123, -584, -306, 130, 218, 193, -214, -761, -740, -471, -488, 210, 147, -214, -591, -535, -395, -153, -113, 182, 177, 49, -56, -138, -79, 202, 656, 471, 504, 163, -20, 103, 154, 466, 452, 103, -18, -299, -514, -222, 100, 355, 141, -238, -344, -459, -568, -412, 141, 247, 52, -243, -455, -117, -146, 436, 489, 207, -107, -20, -280, -59, 342, 135, 366, 155, -198, -258, -329, 40, 358, 247, 75, 218, -326, -327, 13, 284, 143, 184, -284, -58, -506, -88, 16, 75, 319, 199, 11, -354, -157, -11, 64, 96, 212, 12]
2054A2l51L25jL16J3J12n48kl7K19j66K25J75J12n73P9k87L89L51k47L31m87j36
2077a76J76krJ40J09J85o63Kk03L65K72Lj1k52l23O8r1P2O86o27J56l26P3j38
2101e14K59M98m1j87P1j33j37J37M45J53l11j87j20P2P9K77m3J5j26l88l14P8
2123d17N66pJ36l62Ok52O3K08k00L37L3j71j38o8M55k6j99L34k68q4j18L25R6
2146B49j3K27k15k59m4j14k8J76J17k2j23j49o0k1J77O2o3N2P6l82O1M67j1J65
2170C25J27k07j70P8j91M94k15J37p3l83M3j64M23k7J89k52k67j53K3P6QJ85J22
2193A28j80J7n48J81K21N61m50M7q9m01M58l00N40q4L07l60j06K14j4M36j46O4
2215D96l19J0j41N6J07j16N5k88J20m05L22j48J6M2J05jj92l22K00J06M87m5l25
$$ y = [12, -339, -14, -15, 301, 314, 426, -122, -124, -161, 58, -108, 117, 292, 404, -169, -90, -377, 12, 363, 116, 447, -40, -176, 0, -2, -11, 129, 238, 423, -240, -238, -441, -76, 196, 199, 188, -64, -387, -319, -410, -338, 348, -279, -123, -449, -376, -514, -255, 243, 202, 15, 86, -47, -184, -47, 398, 551, 240, 53, -67, 5, 84, 361, 318, 333, 207, -181, -495, -417, 149, 142, 278, -84, -78, -330, -267, -59, -259, 78, 111, -60, -198, -266, 189, 163, -36, 298, 30, -54, -172, 153, 249, 236, 463, 248, -11, -55, -169, -197, -21, 96, 74, -49, -198, -258, -279, -102, -40, -103, -51, 25, -357, -296, 171, 160, 325, 452, 245, 75, 153, -38, 456, 241, 378, 305, -78, -35, -199, 224, 197, 386, 134, -133, -286, -263, -187, -179, 6, 128, -52, -35, -583, -402, -181, 380, -70, -23, -112, -513, -55, -355, 185, 101, 408, 48, -58, 156, 142, 578, 432, 496, 177, 187, 46, 102, 209, 93, 148, -140, -20, -425, -103, -251, -235, -193, -88, -89, -281, -603, -403, -297, 190, 145, -180]
2238a80K1k19K39K09L02Rj38L1j69j99J87K82k7p5j35j76P2k05K92M7j20J4l16
2261b54Q4M7J74J28o7j05k01j80j76L01J43j2J43O4l58J19K03Qm1K68l4k19k00
2284a65mK28J7J70j2k41NK41m54M23l14L72l52K07J34l36J15nJ25j86j39n5j00
2307c26M2L09L68j50o68J60j71M25j35K68j97j8m4j55r1L81m2o3K42j74j45K28
2329D4N8N2L41k09R5l03o3O4J70PJ70j72m07j2J6J55k10L61l68r9J35k06j64K78
2353b67K32j54q4j3k16K88q7r3M71j44k4J63j87L17j70L74J59l25O1O1k76L16
2375D02J22N4l33k90k1J27J88J17M6o27o2Q0k76P5j9L5p4J16l74K23K73k83L94
2398a07j51K20L77m20O6M2J46N13k86q8n1j07p4K84Op0k06J68k30n4J45O9j99
$$ y = [-180, -159, -378, -139, 70, 372, 381, 243, 274, 105, -94, 93, 375, 348, 273, 138, -38, 34, -171, 121, 168, 48, 62, -254, -170, -123, 51, 179, 112, 7, -194, -374, -550, -249, -106, -118, 25, 89, -269, -150, 53, 61, 20, 288, 254, 35, -165, -169, 59, 76, 246, 234, -7, -2, 239, -215, 208, -106, 266, -86, 121, 255, -81, 34, 29, 154, -32, -171, -226, -326, -284, 25, 393, 243, -425, -265, -436, -11, -146, 122, -75, -93, -137, -292, -383, -2, -44, -107, 135, -39, -184, 44, 102, 154, 495, 286, 381, 78, 15, 79, 249, 256, 426, 254, -153, -165, -149, 6, -204, 157, -211, -310, -175, -381, -545, -267, -35, -189, -273, -286, -502, -214, -301, -394, 77, -67, -91, 72, -115, 202, 32, 406, 565, 240, 301, 362, 86, 402, 524, 578, 245, -45, -66, 61, 249, 366, 412, -215, -277, -197, -473, -398, -417, -382, -456, -340, -714, -491, -218, -501, -107, -258, -38, 339, -81, -15, 27, 173, 686, 400, 312, 261, 154, 80, 364, 370, 300, 94, 262, 32, -22, 123, 192, -7]
2421gj03m6l37K21m8P1L4Q4j89k55L8J22J43J25J69OM3n69L15K60r9K71M2J2k75
2446B8J58Q6o2J2L24k65j51n0p4L9K3O5q6j93l5p1k49K73M20j97j61k03J13p0
2470c26K74K15k11l56j50L79p0L95k54J25k41nJ62o8K0J93M7J81R6n30K03Q0m
2493A55K45K41n01J35l13J45k1j79N11l94K72k61k74J49j4k60K44n3k53M0J05
2514b81J50j05K38o8N7l57J05K09N6L9J98k26J19j49J67K31J80j02J30n46L2j7
2536F0N34j1k91j67J57k52j60l08J11L38j78J5j83l01J33j07K77R8J70m54K13
2557c06J75nl7J86J10O4k72j54N45L2K90k82K02l78NJ11j37L41%l11k44K85j56
2580F4m6l29K08j1M2k58j7J46k34O14l10j71j87M3J95q5K72o4L9K60J01j92j01
$$ y = [-7, -110, -156, -493, -272, -320, -249, -215, -131, -320, -575, -537, -415, -272, -147, 22, 28, 71, -498, -183, 77, -22, 249, 291, 303, 28, 186, 272, 210, 222, 546, 281, 130, 80, 6, 45, 68, 133, 47, -146, -181, -252, -501, -228, 192, -5, -166, -369, -256, -326, -52, 163, -48, -404, -554, -175, -245, 150, -104, 21, -220, -225, -63, -131, -111, 82, 129, 310, 406, -124, 79, 159, 155, 400, 641, 140, 275, -38, 107, 86, -93, 418, 24, 296, 35, -239, -90, -104, -364, -120, -173, -426, -386, -281, -131, -236, 2, -66, -9, -366, -261, -52, 4, 43, 241, 15, 134, -15, 152, 383, 563, 461, 591, 45, 77, 60, 594, 583, 292, 125, 282, 30, -130, -438, -327, 11, -167, -152, -335, -636, -503, -610, -333, -235, -65, -519, -306, -131, -136, -173, 13, 123, 187, -85, -239, 306, 338, 628, 346, 548, 170, 175, 286, 149, 490, 490, 179, -65, 220, 64, 18, -311, -103, -114, -72, -330, -347, -201, -435, 179, -131, -302, -489, -446, -251, -336, -64, -128, -89, 171, 272, 80, -21]
2603b1J39L28j62Q6m03J82J22j61K38j07J56k68r6o5P9j29j22q1K54k07j1J02
2625a47J46k89M1J17j08j54P9K32k7k3o8J39r5j07K28J97l5M8L47l68j04J31L0
2648B10%J39Rj95k14J97J78j1k67M4j07n5j44K74k29J78J20m7l61j70L21k05L32
2671cj24K21o87N72k9m1L72k70J15p5O3l81L59R3j03k6J24qm8j93J92J41k32J26
2695A58Mm8j47K64M7k75J26K35o10J28j68L44o9j2p3k5Q9k85j62K26j1J56Qk46
2719c46M07L5j49N10m41J88j45j4r3J51K50j4o9q1k9n2p4J54n0j16K07l82J11
2742d2l11K57j23k9r3R1J53l90K58J7R6k83J97Lp9K44N3l3K64j59j2R5K46l79
2766D1K81j48J05k24J15k08J28%P4j30L21l83l1Mj55J7M6P4o6k61L3J00q5K19
$$ y = [-21, 118, 446, 284, 370, -33, 149, 271, 110, 348, 241, 397, 129, 33, -32, 47, -82, -204, -285, -31, -238, -249, -147, -1, -290, -249, -132, -240, -394, -315, -83, -110, -133, -201, -62, -157, -264, -36, 161, 126, 174, 521, 153, 49, 180, 210, 210, 349, 358, 163, -51, 146, 324, 313, 46, 90, -17, -72, -216, 58, -171, 7, 127, 80, -281, -451, -130, -335, -3, -127, 94, -593, -21, -50, -91, 281, 11, 126, 51, 114, -267, 92, 185, 82, 56, 180, 172, 124, -69, 123, 264, 32, 158, 162, 114, -33, 231, 278, 3, 129, 364, -246, -118, -286, 58, -11, -23, -96, -121, -32, -317, -479, -253, -264, -108, -100, -346, 61, 96, -53, 457, 16, 204, 59, 45, -48, 103, 353, 339, 270, 189, 160, 108, 34, 188, 138, 22, 229, -153, -42, -353, -96, -219, -248, -341, -250, -97, -487, -229, -212, -116, -399, -202, -199, -278, -34, 19, -14, 250, 91, 79, 174, 420, 41, 322, 174, 279, 55, 170, -38, 90, 90, 164, 34, 355, -28, -59, -55, -210, -193, -147, -73, -139, -400, -367, -267, -352, -133]
2790a33J40l22j8K47K29R4l83L57k47J79l17J95K40j26M1P0k77M3J27j33n8m6
2812i8K02J41k80j39J64J72l23O8J23Jj42r6J48q9L25m04J3P0K2j08J64K29N7
2835B20l83J71n7J45R6k43M49k65k67J41L3R1k85K40L0j51l3M2k0jQ3j7N1j9j06
2860e5k28L32M8J5q1p9j94r2J44J99N6j53j31J91J33l72O0J56J60Q5M1m14K99
2883A20qj64L26k30J86k60K52L6k29J21R4k55l1J47P4k59Q5K2M1J7l15NR8NQ5
2908c7k39J89J4K27k45K26j10R6k25r3L29M2l8L2j72L57k20j36l3K62j19k1o0
2931B6J42k89Q0J26j35K8J00P0k97RJ35j93R6K5o7J35k98L65k3k4n7J09p6r6N6
2956e3pJ41J64Kp0k25j2K65m13L08r1J30QNk25L2J33j63L5P9j22j91K55J40j62
$$ y = [-133, 7, -315, -333, -86, 143, 237, -146, 211, -36, 143, -174, 21, 261, 135, 176, 246, -31, 12, 139, 6, -52, -98, 104, 245, -35, -174, -10, 162, -161, -93, 30, 31, -111, -207, -59, -148, 177, -227, -214, -144, -122, -230, -66, 163, 220, -163, 8, -49, 96, 192, -51, 398, 133, -134, 7, 40, 131, -154, 86, 116, -35, -68, -26, -46, -47, 36, 19, 70, 51, -55, -283, 49, 97, 112, 31, -48, -242, -334, -190, 9, 65, -88, -219, -28, 105, -267, -207, -51, 109, 194, 235, -179, 120, 112, -52, 274, 44, 230, -30, 222, 258, 29, 150, 244, -11, -42, 105, 179, -80, 5, 27, 68, 85, -230, -225, -127, -122, -37, -276, -87, -73, 154, -91, 135, 25, 121, -104, -197, 132, 174, 136, 168, -4, 353, 133, -3, -36, 226, 107, 86, 26, 168, -121, -41, 85, -50, -22, 78, 148, -149, -140, -5, -198, -102, -77, -144, -9, -307, 58, 35, 11, -46, 63, -13, -109, -53, -60, 81, 245, 247, 177, -48, -60, 205, -208, 100, 9, 139, 147, 152, -73, -41, 92, -71, -36, 43, -79, -270, -15, 125, -37]
2981c7P8j57j82L67j70J10M8p7J18j28m6P5n4J60K52k48o8M1j04M3p8K29m4j09
3005A9k6J40j63k40J49Q6Q3QOk12Q8O7j28L70j53l7k18R4K48K07m67L15n34L02
3029DJ3m31P76m66k0k64N40Q0m03q0N3k35L40K8P6J10l1k09K08j10J56k40K13
3052A08J52q4J67m02J4J22j52r5N5K74q6j37K01j36J5L5nr8n2O0j42K69P3k28
3076g2K35l91J50L11m38K42K63r3j54J20j27P3m53N13o2O7M7j44j46j03K81R6
3098B15l5j75o0J66l08j9K70k04j1K55J95p59J14J05L94k23K27j62q4K0k9K3K33
3121A48j23j10J83K3q6O2j51Q5K15k24J15j06j89K79J21j88j05j37p3k8K50k22
3143b61N08l64O5j34N9J44L8J26k88n9pJ74j45J36J43j4j75J78j08k10K63P4j34
$$ y = [-37, 41, -116, -298, 69, -101, 9, 57, -20, 98, -30, -76, -1, -55, 105, 357, 109, 41, 82, -22, 21, -57, 172, 128, 19, -7, 133, -30, -270, -121, -35, 48, 56, 62, -150, -62, 5, -123, 247, 94, 57, -161, -67, 181, 388, -79, 236, -298, 4, 17, -414, 362, -104, -124, -388, 152, 232, -171, -251, -198, -433, -93, -65, 11, 121, 90, -119, 89, -21, 135, -105, 108, 260, 176, 343, -59, -45, 77, -75, -170, -115, 159, 73, -64, 137, 1, 16, 51, 46, -52, -104, -44, -186, 83, 156, -72, 163, -228, -78, 233, -205, 37, 300, 207, 53, 173, 46, 119, -334, 179, 117, 184, 231, 87, -59, -162, 119, 215, 180, 5, -55, 111, -197, -216, 54, -150, -161, 94, 289, -470, -356, -251, 143, -80, 147, -15, -99, -79, -108, -85, 148, 25, -85, 98, 121, 35, 97, -54, 31, 246, 22, 137, 31, -158, 121, 242, 54, -51, -188, -261, -289, -39, -261, 247, -117, -52, -186, -127, 17, 55, 181, -107, -166, -173, 1, -144, -8, 135, 121, -54, 124, 16, -194, 69, 143, 9]
3166IJ31k90K14O6J05l63K53J46j43j50r4j31K90K46l57K60k87J44j65K03p8j34
3188a25K92Jn02L21n4K66m24M02m6J40n06O2P3qJ48pj59J87p5n4J33M6J34k18
3212B7KP1j32j90M18k28J3j06L64l01R0K8J0K53l54K52l91L97j83J41k26j36O3
3235a18L3P8k25J42j96L06m02R4J19K91j34k88J95J43q0J5K99m1j21r9J34p6j40
3258g1P8l0O2k5j95L53l84K53M0k92J99O0k42L17j2k43Q4j25K01pN1l29J3J08
3282a36L48k25J74j23j06L15m00J39K9Kj48Q0K3j39J49J9J45j95q2J20k24O5r8
3305b68J35K37j3R2m75L97k7Q4J2j57J24r9K56l56M8K6J7J24p3J58l23j0j53L38
3329I4k19K36k2j24P9R0k31j26K34l57M32p5j43O3M2j27O7j4J10p2M8J48nQ8k10
$$ y = [9, 140, -150, 64, 130, 235, -128, 125, 271, 128, -22, -116, -247, 43, 289, -68, 192, -95, 49, -116, 87, 9, -125, 167, 168, -334, -13, -67, 199, -225, 177, 131, 271, -235, -173, -100, -108, 40, 33, -126, 61, -14, -68, 65, 111, 245, 27, 29, 100, -32, -222, 196, -32, -19, -125, 239, -62, 28, 56, 66, 319, -35, 217, -174, 223, 40, 181, -45, -181, -118, -85, -7, -232, -90, -286, 20, -382, -288, -169, 122, -12, -300, -105, 38, -42, -27, 272, 231, 110, 11, 145, 69, -71, 7, -23, 39, 14, -181, 172, -212, 41, 81, -211, -12, 48, -194, 123, 111, -132, -48, -173, 28, 21, 72, -257, -244, -136, 212, -13, 161, 38, -68, 247, -153, -14, 15, 17, -131, -51, -28, -167, -18, 1, 146, -49, -131, -11, -235, -170, -268, -133, 104, 91, 183, -292, 105, 78, 162, 174, 17, 141, 42, 298, -58, -10, 16, 33, 157, 84, 242, -81, -91, -244, 94, -125, 111, 89, -35, 44, 134, -97, -223, 11, -346, 86, 11, -132, -69, -27, -154, -87, -101, 9, -63, -15, 133, 128, 216, 6]
3354FL9L3n1J15r1M3j03k26K53K2j27j1r8J98O1k63J71L84l48p1K10k67J2L48
3378B39j82k28r7K97j00J17K3P2j95kN8J23j25o2l2K97j77q1J51nk07J37r7M1
3402c5J46j21k38J33N4k73L65J58j57nj18K19j97k5L5M6p3J97Q3n1O4k00J86j32
3426F1L1q2j84N0r8N0l5L64j35k09O0n0L45l10J60j31j71K60n5K8L6Lj3J38k40
3451a27k2J58Q8J74k00K19k17l5p6K68k0k20j62KK19l41K33j12L45l13J34J29
3473A24k9j79J88J66l06K47k48j18J76o2P6K35l82k37L65M4j9K18m16J51R5K4
3495A13l61K59rj32P8J16J54m66P4l03N08j32j8n1M8K04J52j42k18L24l67J69
$$ y = [6, 45, 78, 27, 142, 51, 94, -9, -235, 18, 40, -87, -98, -196, 2, 63, -200, -29, 355, 7, -64, 146, -121, -109, 239, 57, -171, -268, 29, -71, 46, 69, 141, -54, -56, 2, 125, 0, -62, -94, 203, 26, -55, 96, 91, -116, 21, -76, -35, 111, -10, -248, -115, -61, -334, 31, 189, 32, 27, -91, 128, -69, -94, -59, -13, -86, 111, 194, 143, 207, 7, 193, 61, 92, 10, -174, -124, -222, -172, -207, 157, 22, -187, -127, -177, 168, -142, 18, -113, -284, -24, -79, -51, -15, -12, -25, 113, -127, -149, 9, 97, 271, 71, 290, 73, 38, -38, 230, 210, -10, -172, -170, 49, -292, -59, -171, 174, -139, -5, 124, 95, -84, 104, 270, -36, 211, -37, -155, 21, -41, 35, 270, -112, -349, 16, 60, 41, 259, -157, -6, 89, 113, -248, 11, 2, -130, -52, 64, 218, -248, -174, -477, 31, -101, -119, -170, -122, 82, 234, 92, -126, 198, -169, 0]
$$ [...]
8191A09
##END NTUPLES=NMR FID
##END=
