##TITLE=1H_SR80 Gly3
 CDCl3, 8 sc, 
 31.8.2021
##JCAMPDX= 6.0         $$ Bruker NMR JCAMP-DX V2.0
##DATA TYPE= NMR FID
##DATA CLASS= NTUPLES
##ORIGIN= UXNMR, Bruker Analytische Messtechnik GmbH
##OWNER= root
$$ XWIN-NMR		Version 3.5
$$ Tue Aug 31 13:32:03 2021 Russian Standard Time (UT+4h)  she@DPX200
##.OBSERVE FREQUENCY= 200.131506
##.OBSERVE NUCLEUS= ^1H
##.DELAY= (6, 6)
##.ACQUISITION MODE= SIMULTANEOUS
##.ACQUISITION SCHEME= undefined
##.AVERAGES= 8
##.DIGITISER RES= 18
##SPECTROMETER/DATA SYSTEM= spect
##.PULSE SEQUENCE= zg30
##.SOLVENT NAME= CDCl3
##.SHIFT REFERENCE= (INTERNAL, CDCl3, 0, 15.7039)
##AUDIT TRAIL= $$ (NUMBER, WHEN, WHO, WHERE, WHAT)
$$ ##TITLE= Audit trail, XWIN-NMR		Version 3.5
$$ ##JCAMPDX= 5.01
$$ ##ORIGIN= Bruker BioSpin GmbH
$$ ##OWNER= she
$$ F:/spectra/data/she/nmr/H-F/1/audita.txt
$$ ##AUDIT TRAIL=  $$ (NUMBER, WHEN, WHO, WHERE, WHAT)
(   1,<2021-08-31 13:31:01.89 +0400>,<she>,<DPX200>,
      <created by zg, POWCHK disabled, PULCHK disabled
       configuration hash MD5:
       00 E9 B6 7A A2 85 ED C7 34 08 36 98 17 FE 4E 26
       data hash MD5: 16K
       F6 8B CC F6 61 1C 49 2A 0C 3D DE 02 DF 07 BD A7>)
$$ ##END=
$$ 
$$ hash MD5
$$ 60 4B 31 D7 C2 7E 42 8D 2E 53 52 01 88 F9 37 B9
##$RELAX= 
##$RELAX= 
##$RELAX= 
##$RELAX= 
##$RELAX= 
##$RELAX= 
$$ Bruker specific parameters
$$ --------------------------
##$DU= <F:/spectra>
##$EXPNO= 1
##$NAME= <H-F>
##$PROCNO= 1
##$TYPE= <nmr>
##$USER= <she>
##$AMP= (0..31)
100 100 100 100 100 100 100 100 100 100 100 100 100 100 100 100 100 100 
100 100 100 100 100 100 100 100 100 100 100 100 100 100 
##$AQSEQ= 0
##$AQ_mod= 1
##$AUNM= <au_zg>
##$AUTOPOS= <>
##$BF1= 200.13
##$BF2= 200.13
##$BF3= 200.13
##$BF4= 200.13
##$BF5= 200.13
##$BF6= 200.13
##$BF7= 200.13
##$BF8= 200.13
##$BYTORDA= 1
##$CFDGTYP= 0
##$CFRGTYP= 5
##$CHEMSTR= <none>
##$CNST= (0..31)
1 1 145 1 1 1 1 1 1 1 1 1 1 1 1 1 1 1 1 1 1 1 1 1 1 1 1 1 1 1 1 1 
##$CPDPRG= <>
##$CPDPRG1= <>
##$CPDPRG2= <>
##$CPDPRG3= <>
##$CPDPRG4= <mlev>
##$CPDPRG5= <mlev>
##$CPDPRG6= <mlev>
##$CPDPRG7= <mlev>
##$CPDPRG8= <mlev>
##$CPDPRGB= <>
##$CPDPRGT= <>
##$D= (0..31)
0 1.2 0 0 0 0 0 0 0 0.06 0 0.03 0 0 0 0 0.0002 0 0 0 0 0 0 0 0 0 0 0 0 
0 0 0 
##$DATE= 1630402261
##$DBL= (0..7)
120 120 120 120 120 120 120 120 
##$DBP= (0..7)
150 150 150 150 150 150 150 150 
##$DBP07= 0
##$DBPNAM0= <>
##$DBPNAM1= <>
##$DBPNAM2= <>
##$DBPNAM3= <>
##$DBPNAM4= <>
##$DBPNAM5= <>
##$DBPNAM6= <>
##$DBPNAM7= <>
##$DBPOAL= (0..7)
0.5 0.5 0.5 0.5 0.5 0.5 0.5 0.5 
##$DBPOFFS= (0..7)
0 0 0 0 0 0 0 0 
##$DE= 6
##$DECBNUC= <off>
##$DECIM= 32
##$DECNUC= <off>
##$DECSTAT= 4
##$DIGMOD= 1
##$DIGTYP= 9
##$DL= (0..7)
0 120 120 120 120 120 120 120 
##$DP= (0..7)
150 150 150 150 150 150 150 150 
##$DP07= 0
##$DPNAME0= <>
##$DPNAME1= <>
##$DPNAME2= <>
##$DPNAME3= <>
##$DPNAME4= <>
##$DPNAME5= <>
##$DPNAME6= <>
##$DPNAME7= <>
##$DPOAL= (0..7)
0.5 0.5 0.5 0.5 0.5 0.5 0.5 0.5 
##$DPOFFS= (0..7)
0 0 0 0 0 0 0 0 
##$DQDMODE= 0
##$DR= 18
##$DS= 0
##$DSLIST= <SSSSSSSSSSSSSSS>
$$ [...]
##$SUBNAM2= <"">
##$SUBNAM3= <"">
##$SUBNAM4= <"">
##$SUBNAM5= <"">
##$SUBNAM6= <"">
##$SUBNAM7= <"">
##$SUBNAM8= <"">
##$SUBNAM9= <"">
##$SW= 20.0188882624521
##$SWIBOX= (0..15)
0 0 2 0 0 0 0 0 0 0 0 0 0 0 0 0 
##$SW_h= 4006.41025641026
##$TD= 16384
##$TD0= 1
##$TE= 0
##$TE2= 300
##$TE3= 300
##$TEG= 300
##$TL= (0..7)
0 120 120 120 120 120 120 120 
##$TP= (0..7)
150 150 150 150 150 150 150 150 
##$TP07= 0
##$TPNAME0= <>
##$TPNAME1= <>
##$TPNAME2= <>
##$TPNAME3= <>
##$TPNAME4= <>
##$TPNAME5= <>
##$TPNAME6= <>
##$TPNAME7= <>
##$TPOAL= (0..7)
0.5 0.5 0.5 0.5 0.5 0.5 0.5 0.5 
##$TPOFFS= (0..7)
0 0 0 0 0 0 0 0 
##$TUNHIN= 0
##$TUNHOUT= 0
##$TUNXOUT= 0
##$USERA1= <user>
##$USERA2= <user>
##$USERA3= <user>
##$USERA4= <user>
##$USERA5= <user>
##$V9= 5
##$VALIST= <valist>
##$VCLIST= <CCCCCCCCCCCCCCC>
##$VD= 0
##$VDLIST= <DDDDDDDDDDDDDDD>
##$VPLIST= <PPPPPPPPPPPPPPP>
##$VTLIST= <TTTTTTTTTTTTTTT>
##$WBST= 1024
##$WBSW= 4
##$XGAIN= (0..3)
0 0 0 0 
##$XL= 0
##$YL= 0
##$YMAX_a= 302622
##$YMIN_a= -295698
##$ZGOPTNS= <>
##$ZL1= 120
##$ZL2= 120
##$ZL3= 120
##$ZL4= 120
##$ABSF1= 10
##$ABSF2= 0
##$ABSG= 5
##$ABSL= 3
##$ALPHA= 0
##$AQORDER= 0
##$ASSFAC= 0
##$ASSFACI= 0
##$ASSFACX= 0
##$ASSWID= 0
##$AUNMP= <proc_1d>
##$AZFE= 0.1
##$AZFW= 0.1
##$BCFW= 1
##$BC_mod= 2
##$BYTORDP= 1
##$COROFFS= 0
##$CY= 11.3945322036743
##$DATMOD= 1
##$DC= 2
##$DFILT= <>
##$DTYPP= 0
##$F1P= 2.36226072786647
##$F2P= -0.459571619588291
##$FCOR= 0.5
##$FTSIZE= 0
##$FT_mod= 4
##$GAMMA= 1
##$GB= 0.15
##$INTBC= 1
##$INTSCL= 1
##$ISEN= 128
##$LB= 0.24
##$LEV0= 0
##$LPBIN= 0
##$MAXI= 10000
##$MC2= 0
##$MEAN= 0
##$ME_mod= 0
##$MI= 1.114404
##$NCOEF= 0
##$NC_proc= 0
##$NLEV= 6
##$NOISF1= 3.799351
##$NOISF2= 2.8
##$NSP= 1
##$NTH_PI= 0
##$NZP= 0
##$OFFSET= 15.70392
##$PC= 1
##$PHC0= -13363.15
##$PHC1= 17.60098
##$PH_mod= 1
##$PKNL= yes
##$PPARMOD= 0
##$PSCAL= 0
##$PSIGN= 0
##$REVERSE= no
##$SF= 200.130013532006
##$SI= 16384
##$SIGF1= 3
##$SIGF2= 2
##$SINO= 400
##$SIOLD= 16384
##$SREGLST= <1H.CDCl3>
##$SSB= 0
##$STSI= 0
##$STSR= 0
##$SW_p= 3612.71676300578
##$SYMM= 0
##$S_DEV= 0
##$TDeff= 0
##$TDoff= 0
##$TI= <>
##$TILT= no
##$TM1= 0
##$TM2= 0
##$TOPLEV= 0
##$USERP1= <user>
##$USERP2= <user>
##$USERP3= <user>
##$USERP4= <user>
##$USERP5= <user>
##$WDW= 1
##$XDIM= 8192
##$YMAX_p= 0
##$YMIN_p= 0
$$ End of Bruker specific parameters
$$ ---------------------------------
##NTUPLES= NMR FID
##VAR_NAME=  TIME,          FID/REAL,        FID/IMAG
##SYMBOL=    X,             R,               I
##VAR_TYPE=  INDEPENDENT,   DEPENDENT,       DEPENDENT
##VAR_FORM=  AFFN,          ASDF,            ASDF
##VAR_DIM=   8192,          8192,            8192
##UNITS=     SECONDS,       ARBITRARY UNITS, ARBITRARY UNITS
##FACTOR=    0.0002496,     1,               1
##FIRST=     0,             0,               0
##LAST=      2.0444736,     0,               0
##MIN=       0,             -295698,         0
##MAX=       2.0444736,     302622,          0
$$ Real data points
##PAGE= N=1
##DATA TABLE= (X++(R..R)), XYDATA
$$ plain form
0 0 0 0 0 0 0 0 0 0 0 0 -8 8 -8 8 -8 16 -16 24 -24 32 -40 48 -56 64 -74 88 -104 120 -137 157 -178 203 -233
33 -233 264 -297 335 -376 421 -470 524 -584 649 -718 796 -881 974 -1074 1184 -1305 1439
50 1439 -1585 1747 -1924 2123 -2346 2599 -2885 3216 -3599 4050 -4593 5263 -6105 7209 -8723
65 -8723 10940 -14508 21231 -38407 183938 302622 16631 -31443 -12453 102445 189893 229973
77 229973 110565 -7723 -7330 108089 131344 49053 -26821 18959 110072 165901 117068 247
89 247 -85608 -38726 56793 75202 17843 -634 25599 33163 5936 -20296 -67673 -119354 -83950
102 -83950 54831 127463 23782 -128937 -153533 -78660 -31816 -33557 -32873 -36300 -59462 -68540
114 -68540 -56458 -78065 -130024 -136722 -80020 -28855 -31683 -73540 -123121 -147963 -128771 -96029
$$ packed form
0@%%%%%%%%%%qJ6j6J6j6K4l2M0m8N6p2Q8j04J20j38J62j92K24k57K94l35L81m36
33b33M97n61O32p11P97q91R94j108J233j367J514j677J855k048K258k489K744
50A439l024L332l671M047m469M945n484O101o815P649q643R856j1368J3314j5932
65h723J9663k5448L5739n9638K22345J18684k85991m8074J8990J14898Q7448M0080
77B29973j19408j18288L93J15419K3255q2291p5874M5780R1113N5829m8833j16821
89B47q5855M6882R5519J8409n7359j8477K6233P564k7227k6232m7377n1681L5404
102h3950J38781P2632j03681j52719k4596P4873M6844j741O84l427k3162r078
114f8540J2082k1607n1959o698N6702N1165k828m1857m9581k4842J9192L2742
$$ plain form
126 -96029 -103322 -131767 -109598 -43680 -25346 -83992 -145411 -161630 -149876 -115584 -54953 -21712
138 -21712 -68096 -141483 -154937 -116603 -94354 -98462 -87245 -58530 -48953 -67137 -93085 -114469
150 -114469 -124153 -107139 -69223 -46994 -55058 -66436 -64839 -60532 -61053 -64644 -72022 -73283 -50866 -13975
164 -13975 -2806 -35296 -76842 -86005 -62124 -31484 -3872 14464 9656 -14001 -30504 -32426 -31776
177 -31776 -26824 -6452 19974 28385 16382 -1830 -11421 -7678 6734 23915 31615 28453 26821
190 26821 33198 36671 26654 11541 8096 22757 47565 66316 68226 53947 34503 20920 22970
203 22970 40574 61701 73541 73083 66230 53947 38426 30963 41531 63611 78657 77114 64355
216 64355 53219 48930 50952 56369 61958 65244 65431 64664 64463 61983 55099 42849 35514 43361 59888
$$ packed form
126i6029p293k8445K2169O5918J8334n8646o1419j6219J1754L4292O0631L3241
138b1712m6384p3387j3454L8334K2249m108J1217K8715R577j8184k5948k1384
150a14469r684J7014L7916K2229q064j1378J597M307n21l591p378j261K2417L6891
164a3975J1169l2490m1546r163K3881L0640K7612J8336m808k3657j6503j922O50
177c1776M952K0372K6426Q411j2003j8212r591L743J4412J7181P700l162j632
190B6821O377L473j0017j5113l445J4661K4808J8751J910j4279j9444j3583K050
203B2970J7604K1127J1840m58o853j2283j5521p463J0568K2080J5046j543j2759
216F4355j1136m289K022N417N589L286J87p67k01k480o884j2250p335P847J6527
$$ plain form
231 59888 69824 68147 62501 53857 40143 28152 30118 45209 57218 55518 46902 37445 25275 15930
245 15930 21786 38902 49042 44284 33581 24144 17348 13250 11804 11419 13113 15890 17529 16466
259 16466 14011 9549 2825 -4724 -6937 -506 6092 4217 -1772 -7240 -16035 -26922 -28085 -15354
273 -15354 -2409 -345 -7945 -18321 -28728 -36372 -35962 -26572 -18217 -18605 -25451 -31252 -35006 -37130 -36649
288 -36649 -33761 -31642 -30964 -30740 -32428 -35121 -37373 -40131 -43268 -44330 -40327 -33052 -29520 -30793 -35122
303 -35122 -41258 -46805 -48020 -40804 -29791 -24631 -27223 -33546 -39761 -43838 -42307 -35556 -27995 -25033 -26522
318 -26522 -29990 -32770 -33121 -30990 -27457 -24018 -21636 -20886 -20847 -21101 -22033 -23727 -24692 -24232 -20404 -13654 -7724
335 -7724 -5107 -7068 -12036 -16714 -17296 -12400 -5286 633 1386 -2835 -7123 -9765 -7594 -1200 6435 10521
$$ packed form
231E9888R936j677n646q644j3714j1991J966J5091J2009j700q616r457j2170r345
245A5930N856J7116J0140m758j0703r437o796m098j446l85J694K777J639j063
259A6466k455m462o724p549k213O431O598j875n989n468q795j0887j163J2731
273a5354J2945K064p600j0376j0407p644M10R390Q355l88o846n801l754k124M81
288c6649K888K119O78K24j688k693k252k758l137j062M003P275L532j273m329
303c5122o136n547j215P216J1013N160k592o323o215m077J531O751P561K962j489
318b6522l468k780l51K131L533L439K382P50L9k54r32j694r65M60L828O750N930
335g724K617j961m968m678n82M896P114N919P53m221m288k642K171O394P635M086
$$ plain form
351 10521 10325 7201 3346 1537 2237 5056 7755 10296 12136 13432 14276 14550 14265 13281 13041 14267 17326
368 17326 20853 22017 20334 16871 13843 12884 16372 22817 27847 29239 26864 21755 17111 16507 19414
383 19414 24161 27202 27822 25486 22362 20494 20324 22074 24299 25156 25266 25579 24633 22869 21556 20126
399 20126 18762 18633 21303 23894 24768 23279 19825 16115 13083 14194 17747 21593 22321 19852 15798 11172
415 11172 7938 9274 13112 15215 14469 12202 9464 6418 4990 5497 7159 7733 6961 5845 4645 2871
431 2871 289 -1590 -2798 -3211 -1842 -49 750 -124 -2298 -6001 -9747 -10588 -7987 -5585 -4828 -6699
447 -6699 -9470 -12677 -15472 -15656 -12292 -8296 -8057 -10881 -13074 -14906 -17261 -18686 -17496 -15256 -14467 -15315
463 -15315 -16210 -15467 -15095 -17162 -19346 -18587 -16434 -15512 -16102 -15161 -14963 -17484 -20709 -21333 -17216 -13361 -12308
$$ packed form
351A0521j96l124l855j809P00K819K699K541J840J296Q44K74k85r84k40J226L059
368A7326L527J164j683l463l028r59L488O445N030J392k375n109m644o04K907
383A9414M747L041O20k336l124j868j70J750K225Q57J10L13r46j764j313j430
399B0126j364j29K670K591Q74j489l454l710l032J111L553L846P28k469m054m626
415A1172l234J336L838K103p46k267k738l046j428N07J662N74p72j116j200j774
431B871k582j879j208m13J369J793P99q74k174l703l746q41K601K402P57j871
447f699k771l207k795j84L364L996K39k824k193j832k355j425J190K240P89q48
463a5315q95P43L72k067k184P59K153R22n90R41J98k521l225o24M117L855J053
$$ plain form
480 -12308 -12877 -13233 -15062 -17904 -18906 -16112 -11758 -9795 -11187 -12808 -12552 -12039 -12842 -13473 -10105 -6636
496 -6636 -7184 -9595 -8661 -5346 -6396 -9787 -9238 -4827 -2642 -4044 -3931 -771 -932 -5268 -6796 -3023
512 -3023 1006 2361 1945 1931 1802 543 -1050 -111 3096 6174 6033 3563 3172 5380 6091 3894 3883 8819
530 8819 10579 6539 4873 9279 10471 6246 3318 7943 11764 9823 8030 10845 13174 8753 5530
545 5530 7555 11217 11402 10234 10919 10321 8902 8095 8388 9551 12234 13427 10967 7746 8962 10795
561 10795 8844 5969 8374 12498 10368 6130 7750 12301 9496 4494 6101 10526 9170 5339 6906
576 6906 9353 6494 3037 3597 6670 6836 5638 6242 5331 3411 2293 3273 2989 2947 4556 4291 1278
593 1278 -419 1993 2990 -351 -1042 2119 2145 -1440 -2472 566 516 -3320 -3783 -1208 -527 -3522 -3686
$$ packed form
480a2308n69l56j829k842j002K794M354J963j392j621K56N13q03o31L368L469
496f636n48k411R34L315j050l391N49M411K185j402J13L160j61m336j528L773
512c023M029J355m16j4j29j259j593R39L207L078j41k470l91K208P11k197j1M936
530H819J760m040j666M406J192m225k928M625L821j941j793K815K329m421l223
545E530K025L662J85j168O85n98j419q07K93J163K683J193k460l221J216J833
561A0795j951k875K405M124k130m238J620M551k805n002J607M425j356l831J567
576F906K447k859l457N60L073J66j198O04r11j920j118R80k84m2J609k65l013
593A278j697K412R97l341o91L161K6l585j032L038n0l836m63K575O81k995j64
$$ plain form
610 -3686 -1415 -3243 -6555 -5546 -3179 -4184 -5122 -3993 -3840 -6611 -8070 -5749 -5251 -6684 -7096 -5292
626 -5292 -5785 -8796 -8559 -6254 -6250 -7805 -7254 -5900 -7432 -8685 -7468 -6731 -8034 -8168 -6968 -6642 -7959
643 -7959 -7272 -5413 -6511 -8162 -7424 -4889 -5623 -7480 -6056 -3903 -5995 -8180 -6386 -3323 -3642 -5359
659 -5359 -4089 -2909 -3998 -5373 -4344 -2588 -1826 -2722 -2735 -2113 -1971 -1314 -1514 -1033 -265 759 121 -1228
677 -1228 75 1928 1014 -561 295 3107 2936 1201 1788 4027 3747 1261 1222 4196 5413 3776 2528
694 2528 3973 4938 3663 2661 4189 6060 5735 4192 3534 4716 5425 4431 3871 5228 6593 5828 3543
711 3543 4054 5638 5571 3621 3543 5800 6585 4141 3531 4427 4924 3870 2483 3967 6081 5466 2907 2265
729 2265 3631 3789 2168 2305 3998 5089 3367 1276 1888 2952 2329 823 1808 3170 2694 804 393
$$ packed form
610c686K271j828l312J009K367j005r38J129J53k771j459K321M98j433m12J804
626e292m93l011K37K305Mj555N51J354j532j253J217P37j303j34J200L26j317
643g959O87J859j098j651P38K535p34j857J424K153k092k185J794L063l19j717
659e359J270J180j089j375J029J756P62q96j3O22J42O57k00M81P68J024o38j349
677a228J303J853r14j575Q56K812j71j735N87K239k80k486l9K974J217j637j248
694B528J445R65j275j002J528J871l25j543o58J182P09r94n60J357J365p65k285
711C543N11J584o7j950p8K257P85k444o10Q96M97j054j387J484K114o15k559o42
729B265J366J58j621J37J693J091j722k091O12J064o23j506R85J362m76j890m11
$$ plain form
746 393 1481 1549 670 -25 1275 1982 1273 -371 -729 203 -144 -1085 -551 607 1142 -210 -1798 -1908 -1184
765 -1184 -1376 -1928 -1192 -17 -608 -2505 -3244 -2129 -2055 -2756 -2598 -1436 -1483 -2492 -3702 -3585 -3086 -3530 -3497
784 -3497 -3116 -2320 -2699 -3372 -3785 -4018 -4007 -3869 -3819 -3315 -2753 -2807 -4048 -4950 -4754 -4390 -4347 -3500 -2877 -3010 -3649
805 -3649 -4859 -4706 -4052 -4185 -3675 -2909 -2754 -3371 -3946 -3868 -3704 -3969 -3314 -2609 -2403 -1945 -2383 -2727 -3248 -3339
825 -3339 -2763 -2339 -1456 -1108 -865 -1321 -2089 -2132 -1638 -1037 -422 297 711 282 -185 -483 -167 240 842 1245
845 1245 1858 2066 1620 1483 1137 1591 2052 2522 3101 3461 3295 2761 2483 2388 2283 3479 3889 4566 4674 4317
865 4317 3723 3021 3009 3662 4385 4926 4918 4455 4011 3610 3187 3529 4060 4782 4917 4758 4338 3859 3172 3184 3214 3605
887 3605 4309 4568 4052 3612 2708 2177 2181 2530 2943 3497 3540 3222 2163 1469 1327 1103 1876 2173 2320 1742 1525
$$ packed form
746C93J088O8q79o95J300P07p09j644l58R32l47r41N34J158N35j352j588j10P24
765a184j92n52P36J175n91j897p39J115P4p01J58J162m7j009j210J17M99m44L3
784c497L81P96l79o73m13k33J1J38N0N04N62n4j241r02J96L64M3Q47O23j33o39
805c649j210J53O54j33N10P66J55o17n75P8J64k65O55P05K06M58m38l44n21r1
825c339N76M24Q83L48K43m56p68m3M94O01O15P19M14m29m67k98L16M07O02M03
845A245O13K08m46j37l46M54M61M70N79L60j66n34k78r5j05J196M10O77J08l57
865D317n94p02j2O53P23N41qm63m44m01m23L42N31P22J35j59m20m79o87J2L0L91
887C605P04K59n16m40r04n31ML49M13N54M3l18j059o94j42k24P73K97J47n78k17
$$ plain form
908 1525 670 329 -100 296 463 975 583 339 -356 -543 -1400 -1223 -912 -167 -413 -538 -938 -1295 -1915 -2655
928 -2655 -2301 -1754 -1243 -1027 -1460 -1925 -2638 -3191 -3063 -2773 -1906 -1677 -1902 -2271 -2764 -3493 -3707 -3670 -3138 -2457
948 -2457 -2337 -2434 -3095 -3116 -3671 -3729 -3691 -3134 -2474 -2494 -2483 -3123 -3596 -3848 -4051 -3429 -2818 -2113 -2399 -2656 -3100 -3686
970 -3686 -3869 -3407 -2709 -1809 -1835 -1966 -2559 -2770 -3273 -3254 -2640 -2011 -1695 -1200 -1774 -1813 -2442 -2529 -2378 -1694 -820
991 -820 -600 -805 -1033 -1432 -1812 -1423 -1308 -395 192 557 15 -471 -729 -607 -473 82 1020 1629 1367 816
1011 816 570 104 534 911 1698 2521 2191 2080 1760 1675 1492 1463 1669 2646 3117 3305 2869 2289 2452 1860 2175
1032 2175 2755 3767 3657 3710 3518 2940 2680 2324 3136 3509 4284 3985 3455 3166 2904 2682 2921 3261 3605 3772
1052 3772 3535 3169 2855 2286 2101 2575 2920 3289 3523 2822 2499 1987 1545 1379 1834 2077 2817 2238 2079 1630
$$ packed form
908A525q55l41m29L96J67N12l92k44o95j87q57J77L11P45k46j25m00l57o20p40
928b655L54N47N11K16m33m65p13n53J28K90Q67K29k25l69m93p29k14L7N32O81
948b457J20r7o61k1n55n8L8N57O60k0J1o40m73k52k03O22O11P05k86k57m44n86
970c686j83M62O98R00k6j31n93k11n03J9O14O29L16M95n74l9o29q7J51O84Q74
991h20K20k05k28l99l80L89J15R13N87L65n42m86k58J22J34N55R38O09k62n51
1011H16k46m66M30L77P87Q23l30j11l20q5j83k9K06R77M71J88m36n80J63n92L15
1032B175N80J012j10N3j92n78k60l56Q12L73P75k99n30k89k62k22K39L40L44J67
1052C772k37l66l14n69j85M74L45L69K34p01l23n12m42j66M55K43P40n79j59m49
$$ plain form
1072 1630 902 659 867 1251 1466 1603 1407 691 -103 -257 -464 41 238 421 520 398 -364 -1016 -1156 -1015
1092 -1015 -853 -694 -185 -165 -963 -1566 -1999 -1978 -1776 -1536 -955 -997 -927 -1714 -2341 -2698 -2418 -1843 -1489 -1661 -1588
1113 -1588 -1579 -2148 -2863 -2611 -2483 -2053 -2055 -1671 -1535 -2198 -2533 -3217 -2565 -2191 -2481 -1946 -1628 -1820 -2507 -2924 -3050
1134 -3050 -2392 -2231 -2187 -1483 -1147 -1799 -2315 -2824 -2401 -1925 -1606 -1939 -1590 -1324 -1529 -2508 -2590 -1633 -1264 -1662
1154 -1662 -1540 -832 -974 -1613 -2125 -2132 -1332 -1064 -1096 -595 -574 -917 -1395 -1643 -1010 -562 -692 -340 -141 6 -445
1175 -445 -1183 -1066 -442 -21 70 208 594 403 -200 -297 -171 703 665 647 1110 1526 1224 470 290 802 1612
1196 1612 1564 1611 1852 1895 1621 877 1076 1627 2057 2198 2297 2586 2117 1410 1264 1927 2239 2470 2609 2726 2752
1217 2752 2423 1768 1711 2205 2697 2350 2881 2673 2569 2090 1691 1991 2335 2488 2316 2855 2635 2337 1591 1420
$$ packed form
1072A630p28k43K08L84K15J37j96p16p94j54k07N05J97J83R9j22p62o52j40J41
1092a015J62J59N09K0p98o03m33K1K02K40N81m2P0p87o27l57K80N75L54j72P3
1113a588Rn69p15K52J28M30kL84J36o63l35o84O52L74k90N35L18j92o87m17j26
1134c050O58J61M4P04L36o52n16n09M23M76L19l33L49K66k05r79q2R57L69l98
1154a662J22P08j42o39n12pQ00K68l2N01K1l43m78k48O33M48j30L52J99J47m51
1175d45p38J17O24M21R1J38L86j91o03r7J26Q74l8j8M63M16l02p54j80N12Q10
1196A612m8M7K41M3k74p44J99N51M30J41R9K89m69p07j46O63L12K31J39J17K6
1217B752l29o55n7M94M92l47N31k08j04m79l99L00L44J53j72N39k20k98p46j71
$$ plain form
1237 1420 1600 1862 1833 1734 2110 1990 1446 648 792 1159 1184 1252 1153 1461 1118 406 262 351 601 613 775 669
1259 669 402 8 -486 -517 -222 -239 -457 -1 -202 -360 -942 -1152 -1204 -1050 -1054 -1027 -379 -815 -808 -1669 -1701 -1516 -1325
1282 -1325 -1162 -1104 -1229 -1348 -1596 -1966 -1851 -1855 -1707 -1366 -1247 -1377 -1663 -1830 -2157 -2022 -2097 -1642 -1575 -1467 -1612
1303 -1612 -1516 -2049 -1922 -1965 -1481 -1300 -1184 -1405 -1458 -1821 -1828 -1769 -1577 -1312 -1479 -1153 -991 -1247 -1489 -1637 -1549 -1280
1325 -1280 -1135 -885 -940 -1058 -908 -1047 -1451 -1104 -1067 -491 -270 -596 -921 -653 -906 -818 -743 -320 -222 -195 -223 -474
1347 -474 -266 -551 -488 -123 265 390 109 179 23 -11 -26 -383 328 448 934 559 434 385 384 41 584 729
1369 729 1264 964 777 767 771 569 953 1108 1527 1654 1492 1315 1362 985 1098 1333 1674 1705 1390 1684 1556 1270
1391 1270 1327 1551 1474 1636 1821 2072 1834 1555 1629 1302 1476 1753 1717 1901 1528 1671 1190 1264 1431 1501 1342 1580
$$ packed form
1237A420J80K62k9r9L76j20n44p98J44L67K5O8r9L08l43p12j44Q9K50J2J62j06
1259F69k67l94m94l1K95j7k18M56k01j58n82k10n2J54mK7O48m36Pq61l2J85J91
1282a325J63N8j25j19k48l70J15mJ48L41J19j30k86j67l27J35p5M55O7J08j45
1303a612R6n33J27m3M84J81J16k21n3l63pN9J92K65j67L26J62k56k42j48Q8K69
1325a280J45K50n5j18J50j39m04L47L7N76K21l26l25K68k53Q8P5M23R8K7k8k51
1347d74K08k85O3L65L88J25k81P0j56l4j5l57P11J20M86l75j25m9jl43N43J45
1369G29N35l00j87j0Mk02L84J55M19J27j62j77M7l77J13K35L41L1l15K94j28k86
1391A270N7K24p7J62J85K51k38k79P4l27J74K77l6J84l73J43m81P4J67P0j59K38
$$ plain form
1413 1580 1568 1192 1182 1015 760 900 829 978 1325 1019 816 559 530 454 436 190 454 587 384 216 86 81
1435 81 -162 36 89 4 -141 -96 -262 -474 -553 -729 -499 -232 -313 -507 -488 -790 -1077 -848 -1083 -733 -758 -393 -601
1458 -601 -942 -1116 -1088 -1461 -1227 -797 -625 -1059 -889 -1291 -1266 -1235 -1431 -1086 -824 -531 -1065 -1048 -1129 -1169 -1514 -1139
1480 -1139 -828 -692 -840 -879 -957 -980 -1213 -1109 -883 -605 -750 -677 -754 -680 -881 -1135 -979 -783 -386 -368 -403 -584
1502 -584 -858 -778 -608 -563 -609 -104 -392 -503 -689 -735 -723 -705 -421 -304 -55 -207 -256 -454 -639 -459 -223 -173 7
1525 7 206 186 -111 -95 -403 -224 204 48 476 360 -2 145 110 189 52 280 583 484 617 376 113 409
1547 409 355 272 599 802 920 774 690 516 467 324 1034 975 864 854 756 774 627 951 920 726 840 1002 773
1570 773 1007 978 713 484 1011 1150 875 1217 1075 997 701 893 740 801 966 927 1080 773 939 681 331
$$ packed form
1413A580j2l76j0j67k55J40p1J49L47l06k03k57k9p6j8k46K64J33k03j68j30n
1435H1k43J98N3q5j45M5j66k12p9j76K30K67q1j94J9l02k87K29k35L50k5L65k08
1458f01l41j74K8l73K34M30J72m34J70m02K5L1j96L45K62K93n34J7q1m0l45L75
1480a139L11J36j48l9p8k3k33J04K26K78j45P3p7P4k01k54J56J96L97J8l5j81
1502e84k74Q0J70M5m6N05k88j11j86m6J2J8K84J17K49j52m9j98j85J80K36N0J80
1525GJ99k0k97J6l08J79M28j56M28j16l62J47l5P9j37K28L03r9J33k41k63K96
1547D09n4q3L27K03J18j46q4j74m9j43P10n9j11j0r8J8j47L24l1j94J14J62k29
1570G73K34k9k65k29N27J39k75L42j42p8k96J92j53O1J65l9J53l07J66k58l50
$$ plain form
1591 331 647 665 814 1004 747 600 441 194 476 308 827 407 591 577 50 163 -169 -30 282 266 422
1612 422 28 -120 -184 -326 -103 -96 -103 -137 -52 -189 -137 -753 -394 -332 -417 -365 -325 -348 -207 -500 -774 -624 -413 -409 -376
1637 -376 -216 -320 -868 -899 -660 -553 -437 -618 -540 -596 -433 -782 -584 -584 -699 -577 -312 -470 -311 -323 -392 -618
1659 -618 -681 -226 -405 -324 -310 -173 -179 -492 -581 -404 -516 -262 -292 -162 -253 -455 -450 -461 -331 -448 -198 224 35 -203
1683 -203 -440 -395 -161 -460 -394 -103 -103 -71 -53 -153 -320 -412 -254 -55 108 81 -89 -331 -311 -213 -131 215 205 291
1707 291 -60 92 -47 -363 -174 -145 84 63 22 50 -7 311 4 248 -71 330 427 412 182 139 114 96 232
1730 232 319 69 219 401 148 255 403 45 48 640 673 507 339 460 62 183 446 210 769 657 282
1751 282 474 493 217 444 147 538 561 646 420 560 403 365 577 280 548 554 746 684 409 441 243 416 223
$$ packed form
1591C31L16J8J49J90k57j47j59k47K82j68N19m20J84j4n27J13l32J39L12j6J56
1612D22l94j48o4j42K23Ppl4Q5j37N2o16L59O2q5N2M0k3J41k93k74J50K11ML3
1637c76J60j04n48l1K39J07J16j81P8n6J63l49J98%j15J22K65j58J59j2o9k26
1659f18o3M55j79Q1J4J37ol13q9J77j12K54l0J30r1k02Nj1J30j17K50M22j89k38
1683b03k37M5K34k99O6K91%L2J8j00j67r2J58J99J63k7j70k42K0R8Q2L46j0Q6
1707B91l51J52j39l16J89K9K29k1m1K8n7L18l07K44l19M01R7j5k30m3k5j8J36
1730B32Q7k50J50J82k53J07J48l58LN92L3j66j68J21l98J21K63k36N59j12l75
1751B82J92J9k76K27k97L91K3Q5k26J40j57l8K12k97K68OJ92o2k75L2j98J73j93
$$ plain form
1774 223 236 173 91 203 262 79 61 -34 232 322 234 25 104 44 -27 -73 -297 152 91 114 -149 -116 -366 -384 -64
1799 -64 -23 -241 -117 49 -441 -287 -380 -582 -252 -173 -324 -163 -295 -267 -251 -777 -351 -234 -248 -398 -113 -202 -430
1822 -430 -498 -614 -606 -136 -330 -153 -313 -351 -297 -469 -436 -573 -289 -55 -203 -286 -101 -273 -358 140 -188 -40 130
1845 130 -149 -160 -124 -422 -160 -208 -236 -7 147 57 -288 -107 -156 -108 -195 210 133 128 -179 -53 -85 -281 -215 214
1869 214 -11 -7 210 -102 -90 -79 -213 -98 151 47 85 48 136 -60 -369 -205 188 242 17 -1 43 -165 -168 58
1893 58 24 79 308 438 139 418 122 98 142 -170 403 256 316 186 6 49 -64 285 214 544 188 465 443
1916 443 3 209 12 337 478 354 279 414 205 161 540 152 440 509 350 518 146 391 224 118 514
1937 514 285 608 452 516 203 317 257 212 378 531 314 399 161 144 -6 -12 90 7 491 198 285 161 -85
$$ packed form
1774B23J3o3q2J12N9j83j8r5K66R0q8k09P9o0p1m6k24M49o1K3k63L3k50j8L20
1799f4M1k18J24J66m90J54r3k02L30P9j51J61j32K8J6n26M26J17j4j50K85q9k28
1822d30o8j16QM70j94J77j60l8N4j72L3j37K84K34j48q3J85j72q5M98l28J48J70
1845A30k79j1L6k98K62m8k8K29J54r0l45J81m9M8q7M05p7nl07J26l2j96O6M29
1869B14k25MK17l12J2J1j34J15K49j04L8l7Q8j96l09J64L93N4k25j8M4k08lK26
1893E8l4N5K29J30k99K79k96k4M4l12N73j47O0j30j80M3j13L49p1L30l56K77k2
1916D43m40K06j97L25J41j24p5J35k09m4L79l88K88O9j59J68l72K45j67j06L96
1937E14k29L23j56O4l13J14o0m5J66J53k17Q5k38j7j50oJ02q3M84k93Q7j24k46
$$ plain form
1960 -85 165 127 -86 58 166 185 25 22 -404 -49 -3 -229 -89 -88 -198 18 -216 -331 31 -218 -247 -75 39
1983 39 144 -611 -580 -459 -253 -367 -66 -280 -77 -248 -286 -221 -576 -451 -242 -342 -252 -35 -244 -476 -412 -450
2005 -450 -372 -54 47 -30 -137 -283 -245 -315 -452 -338 -309 -69 -69 73 -108 -368 -340 40 -35 -39 -58 -110 -79 38 -45
2030 -45 -96 45 -33 144 -229 301 8 -43 -40 -153 93 -212 -226 315 186 9 -255 -120 186 320 89 206
2052 206 128 95 38 69 -110 -63 333 215 172 138 18 -2 -34 -21 91 288 181 179 25 100 194 -18 68 -28 30 142
2078 142 227 22 -29 89 257 281 196 422 358 119 201 -170 -19 188 97 180 260 137 232 275 -132 106 35 100
2102 100 191 184 78 -52 29 100 319 229 149 344 342 209 199 124 6 281 413 236 27 330 205 -82 95 153
2126 153 173 -116 109 7 124 208 -175 -363 -133 -158 182 9 257 37 -357 -126 -198 175 -164 -77 38 -104
$$ packed form
1960h5K50l8k13J44J08J9j60lm26L55M6k26J40Jj10K16k34j15L62k49k9J72J14
1983C9J05p55L1J21K06j14L01k14K03j71l8O5l55J25K09j00R0K17k09k32O4l8
2005d50P8L18J01p7j07j46L8p0j37J14K9K40%J42j81k60K8L80p5mj9n2L1J17q3
2030d5n1J41p8J77l73N30k93n1Lj13K46l05j4N41j29j77k64J35L06J34k31J17
2052B06p8l3n7L1j79M7L96j18m3l4j20k0l2J3J12J97j07kj54P5R4k12Q6r6N8J12
2078A42Q5k05n1J18J68K4q5K26o4k39Q2l71J51K07r1Q3Q0j23R5M3m07K38p1O5
2102A00R1pj06j30Q1P1K19r0q0J95kj33j0p5j18K75J32j77k09L03j25k87J77N8
2126A53K0k89K25j02J17Q4l83j88K30k5L40j73K48k20l94K31p2L73l39Q7J15j42
$$ plain form
2148 -104 -142 -208 -319 -138 -210 -322 -94 -287 -164 -153 -349 -154 -201 -81 37 -192 -279 -154 -247 -213 -235 -203 -81
2171 -81 -178 -150 -135 -6 -288 -263 138 -180 -259 67 -117 -17 -138 -234 -212 -355 -48 66 68 -22 -48 -177 2 -159
2195 -159 45 -116 9 -74 -160 -47 -56 -3 14 197 160 119 143 254 125 35 3 44 345 54 506 56 340 107
2219 107 -91 -79 165 314 18 344 312 -28 79 217 482 142 359 398 158 67 106 259 -57 57 162 239
2241 239 309 11 90 97 -35 49 -37 250 64 224 194 125 -30 107 19 155 280 244 123 56 160 -114 57 -97
2265 -97 -52 98 -88 192 17 -146 181 -157 144 251 1 260 -52 258 31 -98 -16 93 157 15 -30 113
2287 113 41 -12 -6 -37 -59 -125 43 7 169 -13 -139 -13 9 -9 -204 -168 -118 214 -166 77 -134 -149 42 -254
2311 -254 47 -305 -149 -114 -115 -148 -1 -34 236 -163 -292 -347 -157 -268 -104 -182 -265 -156 -270 -326 -397 -116 -31 -108
$$ packed form
2148a04l8o6j11J81p2j12K28j93J23J1j96J95m7J20J18k29q7J25r3L4k2L2J22
2171h1r7K8J5J29k82K5M01l18p9L26j84J00j21r6K2j43L07J14Kr0k6j29J79j61
2195a59K04j61J25q3q6J13rN3J7J83l7m1K4J11j29r0l2M1L01k91M52m50K84k33
2219A07j98J2K44J49k96L26l2l40J07J38K65l40K17L9k40r1L9J53l16J14J05P7
2241B39P0k98P9Pj32Q4q6K87j86J60l0o9j55J37q8J36J25l6j21o7J04k74J71j54
2265i7M5J50j86K80j75j63L27l38L01J07k50K59l12L10k27j29Q2J09O4j42m5J43
2287A13p2n3Ol1k2o6J68l6J62j82j26J26K2j8j95L6N0L32l80K43k11j5J91k96
2311b54L01l52J56L5jl3J47l3K70l99j29n5J90j11J64p8q3J09j14n6p1K81Q5p7
$$ plain form
2335 -108 -434 -240 -248 -292 39 -144 -68 -266 -145 -38 -86 26 -98 -381 -280 -98 -440 -229 -325 74 -35 -143
2357 -143 4 -1 -90 -31 205 -207 5 -163 -36 -217 64 89 121 -111 111 207 163 125 94 95 -20 283 128 -104
2381 -104 50 88 -196 -111 -117 105 344 89 208 185 39 182 163 76 477 327 -42 226 -197 -6 190 194 285
2404 285 65 282 293 306 135 26 58 111 478 290 253 256 -50 206 200 -73 210 157 259 33 195 -8 192
2427 192 75 39 -44 118 315 -161 -121 258 28 31 -328 -60 -39 33 231 113 -188 -96 28 -92 243 -23 -131
2450 -131 162 -111 40 -213 -27 33 73 57 -140 -93 -73 -223 55 -51 48 235 71 100 -328 -115 78 -54
2472 -54 88 -133 -201 13 45 -64 -311 24 -82 70 -190 0 -215 -215 -264 -114 -280 -51 -75 -260 -117 -127 9
2495 9 -188 -127 -9 -72 -51 -105 -67 -196 8 -105 -114 -173 -290 -8 -150 -294 -54 -85 -190 -210 -110 -114 81 -146 -159
$$ packed form
2335a08l26J94qm4L31j83P6j98J21J07m8J12j24k83J01J82l42K11r6L99j09j08
2357a43J47nq9N9K36m12K12j68J27j81K81K5L2k32K22R6m4l8l1Jj15L03j55k32
2381a04J54L8k84Q5oK22K39k55J19k3j46J43j9q7M01j50l69K68m23J91J96MR1
2404B85k20K17J1J3j71j09L2N3L67j88l7Ll06K56ok73K83n3J02k26J62k03K00
2427A92j17l6q3J62J97m76M0L79k30Ll59K68K1P2J98j18l01R2J24j20L35k66j08
2450a31K93k73J51k53J86O0M0j6j97M7K0j50K78j06R9J87j64K9m28K13J93j32
2472e4J42k21o8K14L2j09k47L35j06J52k60J90k15%m9J50j66K29k4j85J43j0J36
2495Ij97O1J18o3K1n4L8j29K04j13rn9j17K82j42j44K40l1j05k0J00mJ95k27j3
$$ plain form
2520 -159 208 -130 -120 28 -122 -6 -58 -139 -208 124 -283 -134 -229 -63 -8 -149 49 -20 -81 76 -80 193 2
2543 2 261 102 35 49 287 174 -14 9 112 29 37 72 49 91 191 273 318 211 78 266 -152 280 208 174 255
2568 255 132 300 274 163 79 34 142 478 259 377 156 178 214 -107 216 86 24 355 108 -61 245 237 47
2591 47 -35 107 151 199 -99 -229 98 134 3 82 91 -162 -114 134 27 145 -145 -7 -16 74 168 -20 1 -3 203
2616 203 35 -24 -238 46 -79 113 2 6 -117 92 -163 -90 -31 54 -28 18 -29 -227 178 -61 29 187 5
2639 5 -47 96 -52 -58 -164 -153 -237 -219 -405 -335 -189 -374 12 47 -201 -311 -151 -148 -118 -406 4 2 -340 -100 173
2664 173 79 -137 -90 -114 -225 -13 -277 -134 -116 -97 -31 -282 5 53 -13 -142 -233 -136 -103 -108 -191 -51 -267 223 73
2689 73 -182 -44 -207 -56 -199 -164 -96 144 -96 10 -1 -5 75 -203 -195 2 -130 65 -15 152 107 -127 -105 -11
$$ packed form
2520a59L67l38J0J48j50J16n2q1o9L32m07J49r5J66N5j41J98o9o1J57j56K73j91
2543BK59j59o7J4K38j13j88K3J03q3QL5k3M2J00Q2M5j07j33J88m18M32p2l4Q1
2568B55j23J68k6j11q4m5J08L36k19J18k21K2L6l21L23j30o2L31k47j69L06qj90
2591D7q2J42M4M8k98j30L27L6j31P9Rk53M8K48j07J18k90J38rR0R4j88K1mK06
2616B03j68n9k14K84j25J92j11Mj23K09k55P3N9Q5q2M6m7j98M05k39R0J58j82
2639En2J43j48oj06J1q4J8j86P0J46j85L86L5k48j10J60LL0k88M10kl42K40K73
2664A73r4k16M7k4j11K12k64J43J8J9O6k51K87M8o6j29r1R7L3nq3J40k16M90j50
2689G3k55J38j63J51j43L5O8K40k40J06j1mQ0k78QJ97j32J95q0J67m5k34K2R4
$$ plain form
2713 -11 133 -57 348 176 103 -128 -166 77 -17 -81 169 -22 0 49 32 102 -299 140 47 7 -11 30 -25 216 2
2738 2 167 5 295 185 160 269 77 35 132 55 34 369 5 319 -39 21 318 -42 -51 -161 -14 17 2 265
2762 265 84 -12 58 207 136 -225 -54 -206 171 -130 -26 -114 97 30 30 -7 -72 145 149 0 -247 190 -125 49
2786 49 205 -120 -86 164 -66 51 168 32 33 -57 -252 -179 -22 128 39 -31 38 44 -42 -65 79 -90 -291 -239 -118
2811 -118 179 -209 -310 181 -254 170 -200 253 -124 -277 38 -20 34 -121 149 -245 82 -65 28 -66 -11 -188
2833 -188 -44 -90 -127 -187 -174 195 -245 -59 -51 47 -152 -34 5 72 -196 -216 -41 -119 -116 193 113 -89 -285 -288 -105
2858 -105 -160 28 -84 107 51 -7 -161 60 137 -1 -87 -122 -90 -266 -181 -51 204 58 -57 249 -155 -34 71
2881 71 238 142 86 -58 0 -126 19 96 -253 -84 -1 -269 -14 172 -116 108 -57 -111 193 -18 7 -332 57
$$ packed form
2713a1J44j90M05j72p3k31l8K43r4o4K50j91K2M9j7P0m01M39r3m0j8M1n5K41k14
2738BJ65j62K90j10k5J09j92m2R7p7k1L35l64L14l58O0K97l60rj10J47L1j5K63
2762B65j81r6P0J49p1l61J71j52L77l01J04q8K11o7%l7o5K17Mj49k47M37l15J74
2786D9J56l25L4K50k30J17J17j36Jr0j95P3J57J50q9p0O9Oq6k3J44j69k01N2J21
2811a18K97l88j01M91m35M24l70M53l77j53L15n8N4j55K70l94L27j47R3r4N5j77
2833a88J44m6l7o0J3L69m40J86QR8j99J18L9O7k68k0J75p8LL09q0k02j96lJ83
2858a05n5J88j12J91n6n8j54K21P7j38q6l5L2j76Q5J30K55j46j15L06m04J21J05
2881G1J67r6n6j44N8j26J45P7l49J69Q3k68K55J86k88K24j65n4L04k11K5l39L89
$$ plain form
2904 57 81 -18 -63 350 -65 55 116 -167 295 1 -29 -42 -59 187 118 -167 -30 178 239 15 -26 -170 275 -27
2928 -27 57 52 135 -226 -264 243 233 -93 -12 174 -343 31 108 2 16 -46 -26 -118 181 -199 123 140 164 -54 193
2953 193 141 -77 -218 -319 -327 52 196 -24 132 -123 -283 -218 -288 262 216 -110 3 14 -122 120 70 139 -118
2976 -118 213 64 57 -167 -226 -36 -213 -72 -314 -106 -104 -170 35 -37 70 -103 -17 25 -115 -164 63 -6 -164 -38
3000 -38 17 52 95 -57 -3 102 163 -176 40 57 -21 168 -68 -121 -77 97 7 74 -389 280 -26 256 81 47
3024 47 84 125 59 -201 -209 11 65 52 -77 -25 74 217 188 -137 154 -18 -114 -107 -210 22 -81 -23 95 106 143 166
3050 166 -49 218 100 -80 55 -63 -234 198 -39 -264 -129 -54 72 -24 72 -109 61 47 -48 -85 -109 -29 -83
3073 -83 -83 -8 17 -216 -54 -60 -41 178 -208 -16 96 107 18 -21 -126 47 -147 -56 -90 75 -12 -285 -19 -102 339
$$ packed form
2904E7K4r9m5M13m15J20O1k83M62k94l0j3j7K46o9k85J37K08O1k24m1j44M45l02
2928b7Q4nQ3l61l8N07j0l26Q1J86n17L74P7j06J4o2K0r2K99l80L22J7K4k18K47
2953A93n2k18j41j01qL79J44k20J56k55j60O5p0N50m6l26J13J1j36K42n0O9k57
2976a18L31j49pk24n9J90j77J41k42K08Ko6K05p2J07j73Q6M2j40m9K27o9j58J26
3000c8N5L5M3j52N4J05O1l39K16J7p8J89k36n3M4J74r0O7m63O69l06K82j75l4
3024D7L7M1o6k60qK20N4j3j29N2R9J43k9l25K91j72r6Pj03K32j03N8J18J1L7K3
3050A66k15K67j18j80J35j18j71M32k37k25J35P5J26r6R6j81J70j4r5l7k4Q0n4
3073h3%P5K5k33J62oJ9K19l86J92J12J1q9l9j05J73j94R1l4J65q7k73K66q3M41
$$ plain form
3098 339 187 49 273 -54 60 386 218 -5 -196 97 267 100 34 135 -212 67 178 -50 -50 -84 68
3119 68 38 -37 101 -232 -56 1 -211 -42 -31 15 -97 -45 47 53 -173 -14 219 -73 -17 -26 429 -111 -94 157 -164
3144 -164 -52 -27 58 -69 -103 -159 75 -291 83 -38 -55 14 103 -17 235 -123 7 119 -91 202 252 263 -144
3167 -144 -54 201 113 157 -79 -44 145 -77 -100 263 211 243 -186 -71 -126 -42 -179 -171 175 -101 -110 -35 -26 -53 -72 24
3193 24 -98 109 141 139 253 106 105 260 -85 -77 112 -68 321 34 -90 83 225 -160 108 -20 37 -4 -273
3216 -273 181 109 41 6 -83 261 89 15 -58 79 59 -165 90 99 95 154 -66 164 178 83 50 83 142 259 -177 -46
3242 -46 26 -118 -56 -155 197 225 82 -32 219 310 -12 163 -121 30 -113 4 -94 -148 39 -143 -46 150 -154
3265 -154 -59 68 407 -27 214 -27 209 223 -35 -8 112 29 37 79 12 -276 -110 -49 -31 70 -133 -99 -15 -2
$$ packed form
3098C39j52j38K24l27J14L26j68k23j91K93J70j67o6J01l47K79J11k28%l4J52
3119F8l0p5J38l33J76N7k12J69J1M6j12N2R2Ok26J59K33k92N6rM55n40J7K51l21
3144a64J12K5Q5j27l4n6K34l66L74j21j7O9Q9j20K52l58J30J12k10K93N0J1m07
3167a44R0K55q8M4k36L5J89k22k3L63n2L2m29J15n5Q4j37QL46k76rP5Rk7j9R6
3193B4j22K07L2kJ14j47jJ55l45QJ89j80L89k87j24J73J42l85K68j28N7m1k69
3216b73M54p2o8l5q9L44j72p4p3J37k0k24K55RmN9k20K30J4r5l3L3N9J17m36J31
3242d6P2j44O2r9L52K8j43j14K51R1l22J75k84J51j43J17r8n4J87j82R7J96l04
3265a54R5J27L39m34K41k41K36J4k58K7J20q3QM2o7k88J66O1J8J01k03L4Q4J3
$$ plain form
3289 -2 75 -70 -24 187 -38 -45 288 13 -92 -17 -92 -203 -68 -8 55 89 -203 10 -78 -151 113 151 -17 -236 -19
3314 -19 -99 -164 101 94 111 -66 72 -141 319 116 -136 -89 211 36 -26 -111 -32 98 107 56 24 106 30 -94 253
3339 253 72 -162 -67 317 19 30 181 153 -100 -90 0 52 39 136 -36 156 -187 40 -294 -89 -80 160 -48
3362 -48 100 -161 15 -59 -196 -19 -164 5 -88 22 -205 -255 199 114 95 217 -277 -12 136 208 217 127 -163
3385 -163 165 -41 -137 -72 -71 56 -116 75 -21 -7 12 77 -204 27 -314 187 107 -32 -131 176 74 -179 152
3408 152 -25 -105 123 -37 154 -87 -128 -74 -177 -53 3 111 152 56 64 19 -45 -224 -69 -91 38 -4 -182 177
3432 177 259 -190 -285 139 -52 -50 -193 134 143 -122 88 132 -401 3 256 60 215 -68 153 136 -17 70 119
3455 119 -319 16 -88 22 313 -114 214 -273 -54 -378 131 139 194 76 98 -296 159 -5 -214 162 -158
$$ packed form
3289bP7j45M6K11k25pL33k75j05P5p5j11J35O0O3L4k92K13q8p3K64L8j68k19K17
3314a9q0o5K65pJ7j77J38k13M60k03k52M7L00j75o2q5P9J30Rn1l2Q2p6j24L47
3339B53j81k34R5L84k98J1J51k8k53J0R0N2j3R7j72J92l43K27l34K05RK40k08
3362d8J48k61J76p4j37J77j45J69r3J10k27n0M54q5j9J22m94K65J48P2Rr0k90
3385a63L28k06r6O5JJ27j72J91r6J4J9O5k81K31l41N01q0j39r9L07j02k53L31
3408A52j77q0K28j60J91k41m1N4j03J24N6J08M1r6Qm5o4j79J55k2J29m2j78L59
3432A77Q2m49r5M24j91Kj43L27Rk65K10M4n33M04K53j96J55k83K21j7j53Q7M9
3455A19m38L35j04J10K91m27L28m87K19l24N09QN5j18K2l94M55j64k09L76l20
$$ plain form
3476 -158 -327 -297 -98 -165 -141 -176 -6 41 -145 217 142 -48 117 -76 81 45 157 48 -72 98 69 -93 274
3499 274 -78 -346 -174 -150 179 55 -20 254 146 -17 -41 72 -354 -37 77 -84 -12 -13 254 116 -31 211
3521 211 -135 -39 -50 -96 -170 233 -228 206 26 -145 93 25 167 140 15 -142 230 -55 78 41 -33 -12 -65
3544 -65 171 48 -312 118 144 -39 27 72 89 -110 -122 -205 145 -43 132 34 192 -48 -140 -76 64 7 -87 2
3568 2 -233 -12 -109 -22 3 -36 -144 -300 68 271 -117 264 -70 -129 193 13 24 2 205 -129 -130 -96 128 -21
3592 -21 87 144 102 180 -116 -41 96 -196 123 160 91 -92 -83 217 88 15 334 177 20 -181 -245 41 169 103
3616 103 -37 -103 101 -81 166 70 241 -74 11 -33 70 206 117 207 90 -132 -88 -9 -278 -31 87 34 93
3639 93 180 12 -97 -91 149 2 51 -272 53 -167 -42 186 9 -25 -14 97 206 182 112 -33 61 -161 -120 33
$$ packed form
3476a58j69L0J99o7K4l5J70M7j86L62p5j90J65j93J57l6J12j09j20J70k9j62L67
3499B74l52k68J72K4L29j24p5K74j08j63k4J13m26L17J14j61P2jK67j38j47K42
3521B11l46R6j1m6p4M03m61M34j80j71K38o8J42k7j25j57L72k85J33l7p4K1n3
3544f5K36j23l60M30K6j83O6M5J7j99j2q3L50j88J75r8J58k40r2O4J40n7r4Q9
3568Bk35K21r7Q7K5l9j08j56L68K03l88L81l34n9L22j80J1k2K03l34jL4K24j49
3592b1J08N7m2P8k96P5J37k92L19L7o9j83RL00j29p3L19j57j57k01o4K86J28o6
3616A03j40o6K04j82K47r6J71l15Q5m4J03J36q9R0j17k22M4P9k69K47J18n3N9
3639I3Q7j68j09OK40j47M9l23L25k20J25K28j77l4J1J11J09k4p0j45R4k22M1J53
$$ plain form
3663 33 -13 -35 -23 -307 44 85 -72 -81 -1 165 28 121 213 131 77 160 -98 -153 50 -19 -59 12 55 119 236 -81
3689 -81 -12 -146 11 126 -123 -64 -90 -117 296 -6 1 -47 80 312 -46 116 59 72 -166 -277 -11 25 87 114
3713 114 -75 66 -200 -99 -60 113 -12 30 -28 135 -76 -101 -80 -109 129 -248 -163 32 -38 89 -173 41 -92
3736 -92 35 -63 142 -134 97 -266 -206 -7 4 95 -86 192 -115 38 155 263 -29 -21 -150 -26 -200 27
3758 27 50 -178 151 -4 34 129 2 -68 -54 -113 -244 15 161 -241 215 32 -91 -216 280 -23 -110 -57 -22
3781 -22 -82 206 345 -82 -146 4 105 -187 14 200 36 5 -176 -178 -83 -17 -28 -156 -157 -71 110 -96 -35 104
3805 104 258 48 118 -41 329 22 79 47 -77 99 25 -111 -147 185 -40 -31 31 269 245 220 -88 -76 -132 16
3829 16 211 145 141 -148 14 43 -222 -52 204 38 72 272 -216 -25 -32 -169 -65 -128 74 -85 136 -26 -57
$$ packed form
3663C3m6k2J2k84L51M1j57rQ0J66j37R3R2q2n4Q3k58n5K03o9m0P1M3O4J17l17
3689h1O9j34J57J15k49N9k6k7M13l02Pm8J27K32l58J62n7J3k38j11K66L6O2K7
3713A14j89J41k66J01L9J73j25M2n8J63k11k5K1k9K38l77Q5J95p0J27k62K14j33
3736i2J27r8K05k76K31l63O0J99J1R1j81K78l07J53J17J08k92Qj29J24j74K27
3758B7K3k28L29j55L8R5j27p0J4n9j31K59J46m02M56j83j23j25M96l03q7N3L5
3781b2o0K88J39m27o4J50J01k92K01J86j64l1j81kR5O6j1j28jQ6J81k06O1J39
3805A04J54k10P0j59L70l07N7l2j24J76p4j36l6L32k25RO2K38k4k5l08J2n6J48
3829A6J95o6mk89J62K9k65J70K56j66L4K00m88J91pj37J04o3K02j59K21j62l1
$$ plain form
3852 -57 -224 45 -154 55 -58 210 94 -37 113 118 199 -38 -156 174 122 -112 95 26 -19 -52 -102 -86 -83 95
3876 95 -344 -72 155 -257 -121 33 58 61 72 -168 226 69 -39 -5 166 -44 -56 110 -126 136 -29 -286
3898 -286 150 -56 -67 -150 135 242 -169 45 -11 133 -3 -114 -73 18 -38 -81 -363 -117 329 191 -87 -185 -192
3921 -192 -193 89 78 -117 49 -114 -112 -15 -112 0 83 -2 -235 39 -79 22 -100 -8 85 91 78 131 72 -148 -244 -242
3947 -242 42 -38 105 -24 -98 153 -187 54 43 54 -145 32 138 146 -87 78 46 -276 123 -52 -303 137
3969 137 -105 198 177 -5 107 80 155 142 7 -81 81 -186 247 35 28 -170 -151 -36 34 228 -32 -310 30
3992 30 -193 -103 -116 -107 148 -24 -28 31 90 1 -97 164 62 20 398 -54 -148 118 128 -116 -74 197 -208 -123 114
4017 114 113 9 155 -50 123 17 45 131 97 34 25 46 2 183 -23 152 -108 122 -267 -413 277 -5 54 -140
$$ packed form
3852e7j67K69j99K09j13K68j16j31J50NQ1k37j18L30n2k34K07o9m5l3n0J6LJ78
3876I5m39K72K27m12J36J54K5LJ1k40L94j57j08L4J71k10j2J66k36K62j65k57
3898b86M36k06j1q3K85J07m11K14n6J44j36j11M1R1n6m3k82K46M46j38k78r8p
3921a92jK82j1j95J66j63KR7r7J12Q3q5k33K74j18J01j22R2R3Oj3N3n9k20r6K
3947b42K84q0J43j29p4K51l40K41j1J1j99J77J06Qk33J65l2l22L99j75k51M40
3969A37k42L03k1j82J12k7P5j3j35q8J62k67M33k12pj98J9J15P0J94k60k78L40
3992C0k23R0j3RK55j72mN9N9q9r8K61j02m2L78m52r4K66J0k44M2K71m05Q5K37
4017A14jj04J46k05J73j06K8Q6l4o3rK1m4J81k06J75k60K30l89j46O90k82N9j94
$$ plain form
4041 -140 -169 -38 83 -240 -85 -1 -47 112 160 117 49 364 92 98 -64 348 -194 -58 38 20 -215 -5 158
4064 158 -86 240 -217 -312 -203 -166 -166 96 123 -112 -75 -71 181 -6 -73 -233 -28 -129 68 69 86 26 75 -59 30
4089 30 -268 -242 206 -105 -165 105 19 128 118 -235 85 86 51 117 -74 138 119 221 -3 102 -185 104 26 100
4113 100 -102 -176 94 -253 64 -24 -125 -47 -273 242 94 -157 -157 110 7 179 132 232 -341 -39 132 47
4135 47 99 97 -107 -24 65 11 -252 -290 173 88 82 -24 -10 147 -51 253 209 -21 171 65 45 -280 160 -7 -176
4160 -176 199 216 38 110 -32 -29 -200 -27 75 -222 76 150 -49 -145 309 -96 -116 -16 -40 16 -268 -56 -104
4183 -104 -256 -36 -37 -149 312 10 -4 -78 -5 -285 93 131 281 -337 -114 -87 77 -129 -50 135 -89 55 229
4206 229 43 198 -151 -248 177 22 157 144 -214 -114 -7 -49 314 -139 31 -195 -95 112 68 355 51
$$ packed form
4041a40k9J31J21l23J55Q4m6J59M8m3o8L15k72Oj62M12n42J36R6j8k35K10J63
4064A58k44L26m57r5J09L7%K62K7k35L7MK52j87o7j60K05j01J97JJ7o0M9j34Q9
4089C0k98K6M48l11o0K70q6J09j0l53L20Jl5O6j91K12j9J02k24J05k87K89p8P4
4113A00k02p4K70l47L17q8j01P8k26N15j48k51%K67j03J72m7J00n73L02J71q5
4135D7N2kk04Q3Q9n4k63l8M63q5oj06J4J57j98L04m4k30J92j06k0l25M40j67j69
4160a76L75J7j78P2j42Lj71J73J02k97K98P4j99r6M54m05k0J00k4N6k84K12m8
4183a04j52K20jj12M61l02j4p4P3k80L78L8J50o18K23K7J64k06P9J85k24J44J74
4206B29j86J55l49r7M25j55J35j3l58J00J07m2L63m53J70k26J00K07m4K87l04
$$ plain form
4227 51 -36 -27 119 85 85 60 44 -105 57 31 -85 -16 152 205 60 -91 -243 74 -81 -43 -195 187 139 -163 195
4252 195 -90 -312 -137 -12 56 195 -80 -67 73 -103 44 -14 -149 45 -65 61 268 37 64 116 -73 121
4274 121 -232 -33 24 -6 214 67 213 -47 -187 -22 24 9 -85 -51 63 8 18 -100 380 -10 128 -208 0
4297 0 -119 -108 217 -297 5 151 141 251 68 13 45 -242 -118 126 183 158 -58 51 -178 278 54 -255 -29
4320 -29 -223 -51 224 -64 288 19 -64 -101 42 15 67 -53 85 -204 52 48 45 74 74 -363 -31 131 38 126 -47
4345 -47 19 -30 121 290 19 5 -158 -132 -32 -137 -172 -326 144 -54 17 228 -249 140 85 -60 102 44 -173
4368 -173 109 64 -224 -96 12 135 -15 -23 14 -42 -80 164 16 79 11 -47 -22 50 83 57 -220 1 -87 147 272
4393 272 2 80 107 -55 129 -149 51 7 -187 -253 -31 -162 174 76 19 106 -179 25 -2 37 -219 -101 -144
$$ packed form
4227E1q7RJ46l4%k5j6j49J62k6j16O9J68N3j45j51j52L17j55L8j52L82m8l02L58
4252A95k85k22J75J25O8J39k75J3J40j76J47n8j35J94j10J26K07k31K7N2j89J94
4274A21l53J99N7l0K20j47J46k60j40J65M6j5r4L4J14n5J0j18M80l90J38l36K08
4297@j19J1L25n14L02J46j0J10j83n5L2k87J24K44N7k5k16J09k29M56k24l09K26
4320b9j94J72K75k88L52k69q3l7J43k7N2j20J38k89K56mlK9%m37L32J62r3Q8j73
4345d7O6m9J51J69k71j4j63K6J00j05l5j54M70j98P1K11m77L89n5j45J62n8k17
4368a73K82m5k88J28J08J23j50qL7n6l8K44j48O3o8n8K5P2L3k6k77K21q8K34J25
4393B72k70P8K7j62J84k78K00m4j94o6K22j31L36r8n7Q7k85K04k7L9k56J18m3
$$ plain form
4416 -144 343 -33 -80 142 184 96 70 -79 226 -37 81 -355 204 52 -73 -129 143 143 -89 -78 -307 124 121
4439 121 103 -55 155 29 -220 18 10 133 56 -80 201 83 57 159 -28 -11 -155 -124 147 -80 -31 30 140
4462 140 -60 254 -15 190 164 -64 -212 0 -88 261 5 26 31 -13 133 -129 -40 -53 -430 -143 57 129 -73
4485 -73 176 92 218 316 -142 59 31 -269 93 52 30 66 -62 -88 -345 162 -206 92 2 84 119 112 -250 -78
4509 -78 25 137 -119 -217 -104 72 -32 -38 45 43 -152 45 35 -58 -84 20 -123 -189 25 -222 26 -151 -79 -77 95
4534 95 2 97 -164 12 -157 363 -43 -239 -87 -162 23 -148 140 -89 40 33 118 -132 -55 -5 194 -117 -168
4557 -168 42 -65 -29 -53 -127 -102 8 317 54 -83 367 -239 -45 -382 -150 123 0 64 76 -237 18 -52
4579 -52 -15 81 87 -337 86 52 16 130 53 -60 263 -93 67 -47 99 122 -152 -55 -1 176 -167 17 -92 70
$$ packed form
4416a44M87l76m7K22M2q8k6j49L05k63J18m36N59j52j25n6K72%k32J1k29M31l
4439A21j8j58K10j26k49K38qJ23p7j36K81j18k6J02j87J7j44L1K71k27M9O1J10
4462A40k00L14k69K05k6k28j48K12q8L49k56K1Nm4J46k62Q9j3l77K87K00P2k02
4485g3K49q4J26R8m58K01k8l00L62m1k2L6j28k6k57N07l68K98r0Q2L5pl62J72
4509g8J03J12k56r8J13J76j04oQ3kj95J97j0r3k6J04j43o6K14k47K48j77P2KJ72
4534I5r3R5k61J76j69N20m06j96J52p5J85j71K88k29J29pQ5k50P7N0J99l11n1
4557a68K10j07L6k4p4K5J10L09k63j37M50o06J94l37K32K73j23O4J2l13K55p0
4579e2L7R6Om24M23l4l6J14p7j13L23l56J60j14J46K3k74R7N4J77l43J84j09J62
$$ plain form
4603 70 112 17 -10 12 -143 6 -1 -68 284 -72 32 -62 -167 98 -319 198 22 272 7 -155 -260 -4 150
4626 150 -142 13 114 -151 55 102 14 -160 44 -84 189 93 171 9 11 -118 -47 157 172 4 -213 23 106
4649 106 71 25 -40 56 39 -126 176 195 -78 -143 29 111 -311 164 297 90 -72 27 -16 205 -210 56 -43 39
4673 39 -96 -26 -9 -84 63 124 -59 51 58 -199 109 379 118 -96 -47 111 201 -105 -142 -4 -4 32 44 -88 -19
4698 -19 36 -308 444 -250 13 -139 58 -277 63 -47 -261 7 83 49 115 101 -121 93 -77 145 -107 222
4720 222 -111 -3 -22 -58 -94 105 82 -213 -223 52 43 14 64 -38 -197 -250 -35 -9 48 -78 -93 202 -130 132
4744 132 135 53 104 107 63 -184 87 -102 254 32 -272 -183 33 -85 204 -45 -21 -3 -67 -281 302 -114 138 164
4768 164 -121 36 -193 10 106 -182 120 11 183 212 -109 -18 191 68 -202 -81 50 44 -57 -24 17 -205
$$ packed form
4603G0M2r5k7K2j55J49po7L52l56J04r4j05K65m17N17j76K50k65j62j05K56J54
4626A50k92J55J01k65K06M7q8j74K04j28K73r6P8j62Kj29P1K04J5j68k17K36Q3
4649A06l5m6o5R6j7j65L02J9k73o5J72Q2m22M75J33k07j62R9m3K21m15K66r9Q2
4673C9j35P0J7p5J47O1j83J10Pk57L08K70k61k14M9J58R0l06l7J38%L6J2j32O9
4698a9N5l44P52o94K63j52J97l35L40j10k14K68P6l4O6j4k22K14j70K22k52L29
4720B22l33J08j9l6l6J99k3k95j0K75rk9N0j02j59n3K15K6N7j26j5K95l32K62
4744A32Lq2N1Lm4k47K71j89L56k22l04Q9K16j18K89k49K4J8o4k14N83m16K52K6
4768A64k85J57k29K03R6k88L02j09J72K9l21R1K09j23k70J21J31oj01L3M1k22
$$ plain form
4790 -205 61 59 -88 -48 63 106 65 137 14 -12 170 80 88 -181 238 143 -87 130 -35 104 -53 -156 -39 153
4814 153 166 -30 -66 97 -180 -259 125 172 -63 138 235 203 -113 143 -67 -73 59 -175 259 171 -124 -116 3 -44
4838 -44 197 -176 -229 159 36 -1 -269 4 -173 132 77 141 251 208 233 142 41 -139 -203 144 140 -97 -214 -34
4862 -34 75 215 84 101 193 -24 112 -236 -31 12 -230 -146 -80 -99 74 133 -188 153 -151 -42 -34 -41 180 97
4886 97 -80 -94 100 -8 265 79 -57 80 54 -25 -3 92 192 272 -50 -16 -24 -10 121 -212 -141 25 201 -47
4910 -47 -154 -154 -318 -152 44 -142 -76 57 248 -69 118 52 -34 243 4 58 -36 103 28 20 -220 -42 -190 37
4934 37 -57 -66 -183 160 91 9 -175 -188 64 -26 170 78 29 12 62 130 161 67 74 -14 168 -187 -34 -39 -298 61 -168
4961 -168 -238 44 206 -206 -6 -93 -252 -112 62 -7 168 130 -121 134 -166 -25 -91 -2 4 -9 214 303 2
$$ packed form
4790b05K66kj47M0J11M3m1P2j23k6J82r0Qk69M19r5k30K17j65J39j57j03J17J92
4814A53J3j96l6J63k77p9L84M7k35K01R7l2l16K56k10oJ32k34M34q8k95QJ19m7
4838d4K41l73n3L88j23l7k68K73j77L05n5O4J10m3K5r1j01j80o4L47mk37j17J80
4862c4J09J40j31J7R2k17J36l48K05M3k42Q4O6j9J73N9l21L41l04J09QpK21q3
4886I7j77j4J94j08K73j86j36J37k6p9K2R5J00Q0l22L4qJ4J31l33P1J66J76k48
4910d7j07%j64J66J96j86O6J33J91l17J87o6q6K77k39N4r4J39p5qk40J78j48K27
4934C7r4rj17L43o9q2j84j3K52r0J96r2m9j7N0O8L1r4Pq8J82l55J53nk59L59k29
4961a68p0K82J62m12K00q7j59J40J74o9J75l8k51K55l00J41o6Q9Oj3K23Q9l01
$$ plain form
4984 2 12 -1 134 374 -23 64 -354 -197 62 173 123 235 -31 -156 -170 -167 222 221 -42 85 -39 194 -160 77
5008 77 69 139 136 -104 54 -90 -369 69 205 -30 202 303 99 7 96 -119 339 96 -164 101 -53 45 -94
5031 -94 323 153 245 -96 -145 -43 92 -58 -75 -136 -26 36 -227 -239 47 -67 83 58 219 -73 20 167 114
5054 114 -277 121 -212 -74 -9 -134 -174 221 36 116 -13 -157 -33 -288 -174 7 -31 167 265 24 -203 118
5076 118 -27 -98 -10 25 146 233 7 97 44 49 46 -62 301 71 16 37 94 1 -315 -162 35 -27 69 166 130 -81
5102 -81 -19 416 -243 146 48 174 196 -157 55 146 116 66 238 135 203 -124 40 77 -141 -37 -112 -303 -115
5125 -115 177 -39 303 -93 73 53 -245 156 -4 -84 -170 69 19 102 94 -101 94 175 -176 298 -71 84 -178
5148 -178 49 -14 -66 14 13 60 -113 -339 -88 169 -132 195 235 207 21 236 -10 128 49 439 79 -372 -157
$$ packed form
4984BJ0j3J35K40l97Q7m18J57K59J11n0J12k66j25j4LL89jk63J27j24K33l54K37
5008G7qP0lk40J58j44k79M38J36k35K32J01k04r2Q9k15M58k43k60K65j54R8j39
5031i4M17j70R2l41m9J02J35j50j7o1J10O2k63j2K86j14J50k5J61k92R3J47n3
5054A14l91L98l33J38O5j25m0L95j85Q0j29j44J24k55J14J81l8J98R8k41k27L21
5076A18j45p1Q8L5J21Q7k26R0n3Nlj08L63k30n5K1N7r3l16J53J97o2R6R7l6k11
5102h1O2M35o59L89r8J26K2l53K12R1l0n0J72j03O8l27J64L7k18J04p5j91J88
5125a15K92k16L42l96J66k0k98M01j60q0q6K39n0Q3qj95J95Q1l51M74l69J55k62
5148a78K27o3n2Q0jM7j73k26K51K57l01L27M0k8j86K15k46J38p9L90l60m51K15
$$ plain form
5171 -157 -128 77 -129 -136 48 83 32 92 -187 -119 119 106 170 -136 5 -49 -202 119 -103 115 35 -131 -118 197
5195 197 -41 80 -119 -68 273 19 -39 233 165 27 159 -180 -4 -163 321 84 -116 144 226 -231 -120
5216 -120 -239 -54 1 -20 57 183 28 -13 140 259 101 -89 102 126 56 114 -157 206 121 172 -190 14 207
5239 207 -283 -108 -89 252 -191 20 -11 121 34 296 -60 -75 159 -160 86 77 -18 -63 -145 160 32 -110 -21
5262 -21 -191 182 -99 80 -227 -268 152 -58 42 3 178 -212 -58 -103 43 -163 -215 -33 115 152 -84 -285
5284 -285 99 -184 -148 119 -72 -39 55 -79 51 11 12 218 21 -140 53 265 172 -37 -144 108 -69 -93 26
5307 26 3 43 -47 -115 49 48 165 283 89 -266 -356 -19 76 -41 130 12 -186 31 -130 287 -61 223 45
5330 45 -165 94 22 149 -48 -179 129 -45 -99 19 72 16 -76 138 -65 24 -125 -94 422 -159 199 139 60
$$ packed form
5171a57K9K05k06pJ84L5n1O0k79O8K38j3O4l06J41n4j53L21k22K18q0j66J3L15
5195A97k38J21j99N1L41k54n8K72o8j38J32l39J76j59M84k37k00K60Q2m57J11
5216a20j19J85N5k1P7J26j55m1J53J19j58j90J91K4p0N8k71L63q5N1l62K04J93
5239B07m90J75J9L41m43K11l1J32q7K62l56j5K34l19K46rr5m5q2L05j28j42Q9
5262b1j70L73k81J79l07m1M20k10J00l9J75l90J54m5J46k06n2J82J48L7k36k01
5284b85L84k83L6K67j91L3R4j34J30m0JK06j97j61J93K12r3k09j07K52j77k4J19
5307B6k3M0r0o8J64jJ17J18j94l55r0L37R5j17J71j18j98K17j61M17l48K84j78
5330D5k10K59p2J27j97j31L08j74n4J18N3n6r2K14k03Q9j49L1N16n81L58o0p9
$$ plain form
5353 60 171 -82 -242 -74 69 -7 -111 -33 -34 -175 36 -32 -53 -269 -44 7 -186 18 -1 -88 -18 -257 97 219
5377 219 -89 -403 -63 217 -323 -47 -190 -36 149 -54 -52 -125 -77 -49 148 -113 77 111 -27 17 247 -293
5399 -293 215 73 77 -233 -77 303 67 153 -14 127 5 55 316 -125 -286 254 129 -88 202 398 44
5420 44 248 119 145 -148 -14 11 0 -147 155 285 -109 126 -55 -112 75 272 -84 -9 -142 -46 230 -169
5442 -169 -106 77 23 5 -264 24 24 24 -62 -94 -26 -70 -28 -2 -152 -19 -192 8 10 130 -139 -225 151 -64 -105 -54
5468 -54 4 -81 -106 -228 10 95 21 36 148 -186 -43 138 -177 115 9 103 228 54 -60 148 -2 -87 -149
5491 -149 135 113 -116 199 41 -177 151 -67 -110 -17 30 -128 -3 -184 -36 227 23 150 -11 -52 -137 202
5513 202 -267 -251 211 83 157 -292 153 154 145 61 -60 21 -126 -86 -81 349 -48 80 238 -115 -127 41 -16 83 166
$$ packed form
5353F0J11k53j60J68J43p6j04P8jj41K11o8k1k16K25N1j93K04j9q7P0k39L54J22
5377B19l08l14L40K80n40K76j43J54J85k03Kp3M8K8J97k61J90L4j38M4K30n40
5399b93N08j42Ml10J56L80k36Q6j67J41j22N0K61m41j61N40j25k17K90J96l54
5420D4K04j29K6k93J34K5j1j47L02J30l94K35j81n7J87J97l56P5j33R6K76l99
5442a69O3J83n4j8k69K88%%q6l2O8m4M2K6j50J33j73K00KJ20k69q6L76k15m1N1
5468e4N8q5k5j22K38Q5p4J5J12l34J43J81l15K92j06R4J25j74j14K08j50q5o2
5491a49K84k2k29L15j58k18L28k18m3R3M7j58J25j81J48K63k04J27j61m1q5L39
5513B02m69J6M62j28P4m49M45Jrq4j21Q1j47M0NM30l97J28J58l53j2J68n7R9Q3
$$ plain form
5538 166 38 179 -26 49 109 70 -147 30 29 83 -112 24 -42 190 22 -325 -5 123 266 149 81 115 175
5561 175 -44 -14 192 -105 -123 40 -83 171 208 9 -26 145 83 277 -47 4 239 170 -57 332 -135 45
5583 45 2 -62 -180 -209 -241 -128 -50 -275 -56 -53 357 -10 86 -329 107 -52 157 228 392 -69 -11 8 86 -238
5607 -238 141 218 21 50 -110 172 86 -39 -68 14 -61 -38 -3 44 -42 108 137 92 0 -4 24 114 -17 -24 187 -24
5633 -24 -188 12 216 -2 366 -30 -356 -75 84 341 4 -5 -21 16 197 64 271 -38 -15 -37 -66 -140 -10
5656 -10 -199 -53 74 94 -108 280 1 -178 24 77 24 -369 -60 -58 252 453 -241 -35 -241 -180 148 -227
5678 -227 108 90 30 -231 -104 231 -69 -308 -34 -52 -193 225 -79 104 122 -80 -206 -46 -81 -58 -2 59 -380
5701 -380 56 -65 197 -107 129 162 -153 -93 89 58 16 104 -90 235 -1 -209 -111 -104 -10 80 45 245 -15 -111
$$ packed form
5538A66j28J41k05P5O0l9k17J77jN4j95J36o6K32j68l47L20J28J43j17o8L4O0
5561A75k19L0K06k97j8J63j23K54L7j99l5J71o2J94l24N1K35o9k27L89m67J80
5583D5m3o4j18k9l2J13P8k25K19LM10l67R6m15M36j59K09P1J64m61N8J9P8l24
5607b38L79P7j97K9j60K82q6j25k9Q2p5K3L5M7q6J50K9m5r2mK8R0j31pK11k11
5633b4j64K00K04k18L68l96l26K81J59K57l37rj6L7J81j33K07l09K3k2k9p4J30
5656a0j89J46J27K0k02L88k79j79K02N3n3l93L09KL10K01o94K06k06O1L28l75
5678b27L35j8o0k61J27L35l00k39K74j8j41M18l04J83J8k02j26J60l5K3N6O1m39
5701c80M36j21K62l04K36L3l15O0J82l1m2Q8j94L25k36k08R8PR4R0l5K00k60r6
$$ plain form
5725 -111 5 168 180 -43 101 -125 76 219 -46 -214 -95 164 6 35 182 91 -145 30 146 215 -91
5746 -91 93 160 -23 20 -165 61 208 -78 72 -159 -93 -124 -67 6 -285 -30 -84 -151 32 89 -125 26 58 -90
5770 -90 166 325 -92 -34 119 -76 -183 37 101 88 -22 -131 25 -196 -104 -25 -106 204 -86 -74 73 -119 182
5793 182 -98 243 52 196 -86 150 -11 -98 60 -23 -203 -107 223 -102 5 27 -14 -18 113 83 232 -200 107
5816 107 -172 -313 -243 144 257 80 -118 67 14 125 243 -150 -66 -14 112 104 -31 -59 269 8 -132 -35 -25
5839 -25 -317 293 -97 255 24 -61 -47 47 238 -42 -41 71 -88 -139 177 -58 -255 6 46 -13 31 -188 248
5862 248 -78 51 3 -9 -135 79 30 -25 134 -330 174 47 -36 50 89 96 -76 -53 -417 177 -71 288 -24
5885 -24 -7 234 -135 -179 -253 108 -18 -71 -164 29 -54 -196 135 -49 -252 -183 156 131 3 -66 25 -159 -7 301
$$ packed form
5725a11J16J63J2k23J44k26K01J43k65j68J19K59j58K9J47r1k36J75J16O9l06
5746i1J84O7j83M3j85K26J47k86J50k31O6l1N7P3k91K55n4o7J83N7k14J51L2j48
5770i0K56J59m17N8J53j95j07K20O4j3j10j09J56k21R2P9q1L10k90J2J47j92L01
5793A82k80L41j91J44k82K36j61q7J58q3j80R6L30l25J07K2m1mJ31l0J49m32L07
5816A07k79j41P0L87J13j77j98J85n3J11J18l93Q4N2J26qj35k8L28k61j40R7J0
5839b5k92O10l90L52k31q5J4R4J91k80JJ12j59n1L16k35j97K61M0n9M4k19M36
5862B48l26J29m8j2j26K14m9n5J59m64N04j27q3Q6L9Pj72K3l64N94k48L59l12
5885b4J7K41l69m4p4L61j26n3r3J93q3j42L31j84k03O9L39k5j28o9R1j84J52L08
$$ plain form
5909 301 38 48 -102 212 -151 -176 141 -81 -148 -247 -249 -92 186 -91 55 222 114 -20 89 -64 61 25
5931 25 34 -112 -72 -137 88 33 -43 10 -136 42 -76 -13 -105 2 28 42 -252 110 -10 -84 175 72 16 122 131
5956 131 -172 -120 95 20 157 -131 -255 91 49 206 -165 140 258 -103 -25 -312 39 -90 -116 -70 -156 -93 -63
5979 -63 44 -86 117 -24 0 -65 24 -313 -40 50 -14 75 14 -166 265 192 -239 -64 50 -71 -212 125 -46
6002 -46 -1 -13 -380 157 177 -16 154 -11 16 -37 65 238 -52 115 43 8 248 191 236 55 35 365 -256 -347
6026 -347 -8 130 5 46 2 -71 220 -4 36 -176 -23 144 -69 -8 191 164 -90 168 8 201 -227 41
6048 41 36 26 254 212 -79 27 21 -151 -150 -31 80 187 35 78 -183 -76 -137 -42 -9 -2 53 -116 -173 103 -157 -79
6074 -79 -33 59 9 -122 -207 162 69 97 -63 37 177 -206 77 23 -40 -131 28 68 -200 -68 51 67 -51 56
$$ packed form
5909C01k63J0j50L14l63k5L17k22o7r9kJ57K78k77J46J67j08j34J09j53J25l6
5931B5Rj46M0o5K25n5p6N3j46J78j18O3r2J07K6J4k94L62j20p4K59j03n6J06R
5956A31l03N2K15p5J37k88j24L46m2J57l71L05J18l61P8k87L51j29k6M6q6O3L0
5979f3J07j30K03j41K4o5Q9l37K73R0o4Q9o1j80M31p3m31J75J14j21j41L37j71
6002d6M5j2l67N37K0j93J70j65K7n3J02J73k90J67p2l5K40n7M5j81k0L30o21r1
6026c47L39J38j25M1m4p3K91k24M0k12J53J67k13O1J99k7k54K58j60J93m28K68
6048D1nj0K28m2k91J06oj72JJ19J11J07j52M3k61J07o1R5L3PN5j69n7K76k60P8
6074g9M6R2n0j31q5L69r3K8j60J00J40l83K83n4o3r1J59M0k68J32J19J6j18J07
$$ plain form
6098 56 153 91 -44 -123 -184 -93 -32 -133 -98 -82 -78 53 -25 -69 -67 -8 164 220 -104 -74 174 183 -129 17 39 100 70 -97
6126 -97 102 16 80 186 4 4 -48 34 -94 49 72 119 87 -13 -37 -221 41 -90 131 154 82 -136 10 -15 -63
6151 -63 281 -1 24 -35 -239 174 -28 48 -229 70 -18 124 103 30 293 5 -98 -293 -132 -214 96 21 -108
6174 -108 229 -110 7 -81 -187 -25 110 -117 -144 83 201 143 70 -51 -243 -176 -16 -9 -103 202 -12 76 80 -120
6198 -120 -85 -84 -92 93 -55 -151 85 -143 -3 -114 -110 147 191 43 -15 -172 -98 140 202 -62 9 12 -87 -171 -442 -48
6224 -48 -111 -219 -73 -320 -9 -187 153 98 -107 71 -115 38 128 272 -258 -201 -14 87 159 63 144 209 138
6247 138 175 47 154 28 -60 170 344 91 134 364 -191 -29 175 112 -105 6 -163 -182 -55 -7 -117 71
6269 71 125 50 -40 -44 -77 -15 -21 -66 145 -8 206 12 -53 -94 -79 158 -164 -220 -243 -124 -389 -201 253 -137 -62 -106
$$ packed form
6098E6R7o2j35p9o1R1O1j01L5J6MJ31p8m4KN9J72N6l24L0K48Rl12J46K2O1l0j67
6126i7J99q6O4J06j82%n2Q2j28J43K3M7l2j00k4j84K62j31K21K3p2k18J46k5m8
6151f3L44k82K5n9k04M13k02P6k77K99q8J42k1p3K63k88j03j95J61q2L10p5j29
6174a08L37l39J17q8j06J62J35k27k7K27J18n8p3j21j92O7J60Pr4L05k14Q8Mk00
6198a20L5JqJ85j48r6K36k28J40j11MK57M4j48n8j57P4K38O2k64P1Lr9q4k71L94
6224d8o3j08J46k47L11j78L40n5k05J78j86J53R0J44n30N7J87J01P2r6Q1O5p1
6247A38L7j28J07j26q8K30J74k53M3K30n55J62K04o3k17J11j69j9J27M8j10J88
6269G1N4p5r0ml3O2om5K11j53K14j94o5m1J5K37l22n6k3J19k65J88M54l90P5m4
$$ plain form
6295 -106 -68 -114 65 282 67 -160 193 98 13 -62 48 148 -16 -173 51 54 -204 0 -85 21 -208 -189 80
6318 80 -326 -75 133 75 -67 -13 -94 -363 29 -98 181 -140 -27 155 -46 36 -46 -224 -61 164 -121 163
6340 163 99 19 13 45 -41 -248 189 -109 -147 -55 245 -191 16 -21 48 129 96 -40 -2 47 115 -117 37 -19 119
6365 119 52 248 -6 -292 -40 101 48 -188 -61 -44 -122 -60 112 -5 -43 -13 12 -54 233 8 116 -70 -112
6388 -112 -68 -231 227 248 -92 18 -131 -98 -19 -32 95 -145 122 -97 224 -193 188 -31 53 22 -48 56 -152
6411 -152 12 205 -256 -138 91 110 168 55 254 158 -115 218 204 8 151 86 -55 156 -28 115 45 -121
6433 -121 53 -123 -227 18 55 61 52 166 -122 135 -33 -21 -87 122 155 -287 111 29 123 -206 223 118 -29
6456 -29 125 -34 -17 -10 111 -233 7 160 -35 -55 -122 117 -69 -162 -103 29 334 -125 -24 193 21 125 22
$$ packed form
6295a06L8m6J79K17k15k27L53r5q5p5J10J00j64j57K24Lk58K04q5J06k29J9K69
6318H0m06K51K08n8j42N4q1k69L92j27K79l21J13J82k01Q2q2j78J63K25k85K84
6340A63o4q0oL2q6k07M37k98l8R2L00m36K07l7O9Q1l3j36L8M9O8k32J54n6J38
6365A19o7J96k54k86K52J41n3k36J27J7p8O2J72j17l8L0K5o6K87k25J08j86m2
6388a12M4j63M58K1l40J10j49L3P9j3J27k40K67k19L21m17L81k19Q4l1p0J04k08
6411a52J64J93m61J18K29J9N8j13J99r6k73L33j4j96J43o5j41K11j84J43p0j66
6433a21J74j76j04K45L7OrJ14k88K57j68J2o6K09L3m42L98q2R4l29M29j05j47
6456b9J54j59J7PJ21l44K40J53j95k0o7K39j86r3N9J32L05m59J01K17j72J04j03
$$ plain form
6479 22 535 29 -7 129 -231 204 165 -49 68 -310 -161 74 -114 136 -91 79 118 -76 -68 -102 160 9
6501 9 108 -147 120 18 -193 -255 -58 -177 70 -104 -230 -156 117 162 165 128 202 87 -327 161 27 -50 -135 78
6525 78 104 -167 -64 31 -2 -200 -81 -84 -66 121 -111 -9 22 -104 104 -40 -148 -283 -89 -247 -33 273 -58
6548 -58 73 144 -73 99 -26 -16 -37 279 108 -53 -131 -202 49 51 37 -84 51 -54 5 0 -84 -96 19 -214 -24
6573 -24 -161 26 145 7 21 198 -117 -63 14 -99 -36 16 201 37 81 -240 -207 -97 122 -62 -183 -50 141
6596 141 -206 5 81 -90 -73 13 53 -190 78 -58 35 129 -309 -122 -244 55 -190 12 92 120 92 209 15
6619 15 13 255 53 -153 64 53 47 -112 71 111 -296 -59 -147 -35 70 24 8 122 -195 3 28 135 56 -211
6643 -211 269 58 -72 -63 51 -164 -94 -9 98 -16 -232 141 -55 99 107 -153 -237 -24 234 -125 -117 -7 -160
$$ packed form
6479B2N13n06l6J36l60M35l9k14J17l78J49K35j88K50k27J70L9j94Ql4K62j51
6501IR9k55K67j02k11o2J97j19K47j74j26P4K73M5Ll7P4j15m14M88j34p7q5K13
6525G8K6k71J03R5l3j98J19lJ8J87k32J02L1j26K08j44j08j35J94j58K14L06l31
6548e8J31P1k17J72j25J0k1L16j71j61p8p1K51Kj4j21J35j05N9nq4j2J15k33J90
6573b4j37J87J19j38J4J77l15N4P7j13O3N2J85j64M4l21L3J10K19j84j21J33J91
6596A41l47K11P6j71J7Q6M0k43K68j36R3R4m38J87j22K99k45K02Q0K8k8J17j94
6619A5kK42k02k06K17j1oj59J83M0m07K37q8J12J05m6j6J14l17J98K5J07p9k67
6643b11M80k11j30RJ14k15P0Q5J07j14k16L73j96J54Qk60q4K13K58l59QJ10j53
$$ plain form
6666 -160 45 -55 -36 -168 104 17 18 -119 41 4 -79 245 75 -85 81 -66 -87 -50 -9 18 -145 31 -226
6689 -226 78 138 -10 114 131 -250 39 213 23 -38 -241 -200 89 -98 137 338 63 182 -201 54 -138
6710 -138 -195 18 93 -5 40 67 120 243 -53 80 -108 11 7 112 -108 -151 258 81 -24 156 332 120 113 57
6734 57 25 68 62 238 -158 193 -56 97 108 -127 16 -53 -152 14 -37 81 -91 -78 -63 -110 40 226 8 -69
6758 -69 4 -195 -65 131 111 -151 -37 -163 41 -88 -141 -191 203 251 72 198 -91 -111 69 56 -35 -33 200 -76
6782 -76 -113 -33 -70 3 83 -93 -106 86 82 119 374 -178 -102 -47 -180 -208 -106 233 -176 -160 -51 -145 -102 -103 15 -29
6808 -29 125 175 76 -32 -5 -21 -22 109 -15 -241 -107 186 185 9 183 6 -111 0 -55 75 -190 -1 139
6831 139 -180 97 72 159 -163 72 -66 -213 -150 -137 58 -6 -2 -164 192 103 4 -52 140 192 4 -84 61 -30
$$ packed form
6666a60K05j00J9j32K72q7Jj37J60l7q3L24j70j60J66j47k1L7M1K7j63J76k57
6689b26L04O0j48J24J7l81K89J74j90o1k03M1K89j87K35K01k75J19l83K55j92
6710a38n7K13P5r8M5K7N3J23k96J33j88J19mJ05k20m3M09j77j05J80J76k12pn6
6734E7l2M3oJ76l96L51k49J53J1k35J43o9r9J66n1J18j72J3J5m7J50J86k18p7
6758f9P3j99J30J96k0k62J14j26K04j29n3n0L94M8j79J26k89k0J80j3r1KK33k76
6782g6l7Q0l7P3Q0j76j3J92mL7K55n52P6N5j33k8J02L39m09J6J09r4M3jJ18m4
6808b9J54N0r9j08K7j6jJ31j24k26J34K93jj76J74j77j17J11n5J30k65J89J40
6831A39l19K77k5Q7l22K35j38j47O3J3J95o4Mj62L56q9r9n6J92N2j88q8J45r1
$$ plain form
6855 -30 -69 344 -123 -201 -11 62 -93 -172 -131 84 -41 -79 -195 98 130 97 -43 -107 107 0 217 20 -32 -61
6879 -61 -136 23 236 -106 91 -136 -112 67 -95 254 -15 -130 401 -128 -204 190 -83 -1 -49 143 32 60
6901 60 167 127 -163 -90 146 -186 -366 387 -31 -15 -178 -361 -25 -33 184 -51 -7 -119 -45 -8 13 -143 -224 234
6925 234 -138 -154 -57 -203 42 -137 -86 -104 -323 316 -162 -200 -196 31 2 23 213 30 -135 46 23 -120 -32 -47
6949 -47 89 -204 -45 -263 -99 -74 12 221 70 71 -113 112 19 155 -173 53 -19 103 -36 121 -73 -114 9
6972 9 -130 51 -83 111 -130 98 230 24 140 -56 -44 -127 -105 260 -190 199 142 -63 -355 -84 90 103
6994 103 114 63 -88 -201 -159 -107 0 183 202 9 -28 -108 -207 -107 -201 205 9 -57 10 147 -204 -4 12 -99
7018 -99 -32 -73 93 19 156 -69 -45 332 -211 -224 132 113 57 -107 137 -145 -103 -229 76 67 52 50 149 102 -233
$$ packed form
6855c0l9M13m67p8J90P3j55p9M1K15j25l8j16K93L2l3j40o4K14j07K17j97n2k9
6879f1p5J59K13l42J97k27K4J79j62L49k69j15N31n29p6L94k73Q2m8J92j11K8
6901F0J07m0k90P3K36l32j80P53m18J6j63j83L36qK17k35M4j12P4L7K1j56q1M58
6925B34l72j6R7j46K45j79N1j8k19O39m78l8MK27k9K1J90j83j65J81k3j43Q8j5
6949d7J36k93J59k18J64K5Q6K09j51Jj84K25r3J36l28K26p2J22j39J57j94m1J23
6972Ij39J81j34J94k41K28J32k06J16j96J2q3K2L65m50L89n7k05k92K71J74J3
6994A03J1n1j51j13M2N2J07J83J9j93l7q0r9J00r4M06j96o6O7J37l51K00J6j11
7018i9O7m1J66p4J37k25K4L77n43j3L56j9n6j64K44k82M2j26L05rj5kR9m7l35
$$ plain form
7043 -233 188 -86 60 87 150 -136 211 -219 -13 -78 -68 -41 381 -23 -68 282 -10 -85 42 -99 -58 -24 60
7066 60 133 159 -98 36 170 14 131 -11 139 -320 367 68 -67 -34 -33 -23 28 67 37 -137 9 -11 -94 151
7090 151 -59 -165 127 174 -283 -103 253 113 -84 27 -28 -89 164 -98 39 15 -33 -49 -118 254 -82 14 106
7113 106 169 117 57 216 -123 -55 -77 9 124 32 182 -144 -89 138 119 -32 75 100 83 -63 7 -443 -180 312
7137 312 43 -37 141 104 -61 -65 -136 25 18 -174 -22 184 -108 175 168 -60 -178 248 120 -4 -70 -175 -81 39
7161 39 100 9 35 -235 -10 60 -150 71 92 -208 168 -174 64 -114 42 -180 -2 161 -82 -130 -86 -121 27
7184 27 95 37 -96 -1 -146 21 -7 -35 -141 -87 71 -125 -4 -246 -62 -53 -181 -39 -50 7 39 -148 96 0
7208 0 -192 186 -79 299 -6 63 -5 49 60 -58 -44 101 37 -76 -61 90 11 90 -64 42 -7 -178 77 54
$$ packed form
7043b33M21k74J46K7O3k86L47m30K06o5J0K7M22m04m5L50k92p5J27j41M1L4Q4
7066F0P3K6k57J34J34j56J17j42J50m59O87k99j35L3JJ0N1L9l0j74J46k0q3K45
7090A51k10j06K92M7m57J80L56j40j97J11n5o1K53k62J37k4m8j6o9L72l36R6R2
7113A06O3n2o0J59l39O8k2Q6J15r2J50l26N5K27j9j51J07K5j7j46P0m50K63M92
7137C12k69q0J78l7j65mp1J61pj92J52K06k92K83pk28j18M26j28j24o6j05R4J20
7161C9O1r1K6k70K25P0k10K21K1l00L76l42K38j78J56k22J78J63k43m8M4l5J48
7184B7O8n8j33R5j45J67k8k8j06N4J58j96J21k42J84Rj28J42j1N7L2j87K44r6
7208@j92L78k65L78l05O9o8N4J1j18J4J45o4j13J5J51p9P9j54J06m9j71K55k3
$$ plain form
7232 54 192 -316 -4 75 29 -331 8 82 61 -114 45 6 38 238 -52 156 85 -113 -96 33 -40 -41 -37 49 -21
7257 -21 -56 -124 78 42 -49 159 11 -172 -181 -40 -128 -171 153 -30 -124 45 -208 291 163 -58 16 179 86 19
7281 19 -114 37 214 100 138 -8 -151 -197 17 119 21 -114 189 3 -56 53 269 38 -160 177 -140 188
7303 188 183 150 112 57 57 -151 -133 -9 -242 -172 147 -148 76 -43 236 18 137 -113 -59 -182 -104 -181 -35 6
7327 6 91 5 -163 197 108 249 -131 105 -69 -152 4 -14 -405 38 -87 14 27 43 49 21 -79 -8 117 22 26
7352 26 -53 -41 -161 -94 0 -86 189 -33 -168 -275 3 -82 -225 36 -45 41 56 33 169 35 -58 85 236 -48
7376 -48 -120 -33 -29 -139 -14 58 162 93 44 -52 -320 20 64 49 -90 0 39 132 78 90 214 -22 178 153 28 141
7402 141 205 -206 16 225 -23 -57 -90 -76 78 -94 -81 166 -56 123 1 -65 34 123 115 -240 -104 -106 -67 -147 -11
$$ packed form
7232E4J38n08L12P9m6l60L39P4k1j75J59l9L2K00k90K08p1j98J7J29p3jMQ6p0
7257b1l5o8K02l6r1K08j48j83rJ41q8m3L24j83r4J69k53M99j28k21P4J63r3o7
7281A9j33J51J77j14L8j46j43m6K14J02r8j35L03j86n9J09K16k31j98L37l17L28
7303A88nl3l8n5%k08J8J24k33P0L19k95K24j19K79k18J19k50N4j23P8p7J46M1
7327FQ5q6j68L60q9J41l80K36j74q3J56j8l91M43j25J01J3J6Ok8j00P1J25r5M
7352B6p9J2j20O7R4q6K75k22j35j07K78q5j43K61q1Q6J5k3J36j34r3J43J51k84
7376d8p2Q7Mj10J25P2J04o9m9r6k68L40M4j5j39R0L9R3n4J2J24k36K00k5j25J13
7402A41O4m11K22K09k48l4l3J4J54j72J3K47k22J79j22o6R9Q9ql55J36kL9q0J36
$$ plain form
7427 -11 -155 -172 76 -42 300 -122 -355 -183 -327 8 23 -139 180 -274 -202 -86 93 -168 96 -125 -168 -87
7449 -87 41 103 -94 -73 -148 -224 -186 -62 -237 146 111 -255 170 -64 -90 205 -155 91 -153 66 78 -54 48
7472 48 154 103 56 -16 -86 55 85 -8 34 -34 38 -74 -83 -144 -181 -8 133 -20 0 -76 75 -26 240 12 -118
7497 -118 288 -142 20 96 -294 -205 95 -88 -188 -15 118 253 -136 67 6 -14 173 112 155 236 39 108 130
7520 130 -56 99 182 230 182 -42 -9 -176 -67 148 98 333 32 166 64 368 -7 -63 -98 -284 76 -219
7542 -219 22 -34 29 -8 -42 -291 -42 102 169 181 -14 59 -144 62 -315 -51 64 -68 -102 77 188 23 -37
7565 -37 -22 387 -50 -95 76 67 -33 7 -73 -30 -62 5 -138 19 40 164 -238 -37 64 -30 -12 -5 -133 -33 -276
7590 -276 -153 -49 176 126 361 -101 -94 -76 125 -98 -108 111 -1 31 81 61 -79 119 103 -54 -145 34 -67
$$ packed form
7427a1j44j7K48j18L42m22k33J72j44L35J5j62L19m54P2J16J79k61K64k21m3Q1
7449h7J28O2j97K1p5p6L8J24j75L83l5l66M25k34k6K95l60K46k44K19J2j32J02
7472D8J06n1m7p2p0J41L0r3M2o8P2j12ro1l7J73J41j53K0p6J51j01K66k28j30
7497a18M06m30J62P6l90Q9L00j83j00J73J33J35l89K03o1k0J87o1M3Q1j97O9K2
7520A30j86J55Q3M8m8k24L3j67J09K15n0K35l01J34j02L04l75n6l5j86L60k95
7542b19K41n6O3l7l4k49K49J44O7J2j95P3k03K06l77K64J15j32l4J79J11j65o0
7565c7J5M09m37m5J71rj00M0q0M3l2O7j43J57K1J24m02K01J01r4J8Pj28J00k43
7590b76J23J04K25n0K35m62PJ8K01k23j0K19j12L2N0k0j40J98j6j57r1J79j01
$$ plain form
7613 -67 -123 -59 -202 -181 35 15 158 -170 16 -174 91 -212 -40 338 -21 104 -69 -87 -284 157 -109 324
7635 324 -149 179 119 6 -50 -32 -6 227 -116 -49 60 -132 131 21 328 -42 -163 188 -39 -3 -6 -131 38
7658 38 -76 65 -132 -37 -271 178 -120 129 201 -206 80 -205 203 27 146 -91 221 182 -72 59 162
7679 162 137 193 -81 -6 125 4 130 172 14 15 125 98 -220 15 -44 -153 48 10 135 177 83 -2 151 133
7703 133 84 97 283 -126 -243 -8 -85 -110 -74 72 -20 91 90 -72 64 -115 350 197 -188 51 79 9 -114
7726 -114 -2 81 23 22 117 243 135 -18 -46 -110 -214 266 -174 -128 280 -32 95 -55 313 -12 -208 1 41
7749 41 -52 29 -62 -130 -278 -144 -250 -200 -160 -378 -76 35 54 15 -36 -46 -153 144 32 -76 120 116 -6 83 134
7774 134 97 -30 112 -9 -68 229 108 85 -29 -156 -221 158 89 -1 -5 -329 46 -102 -13 12 121 28 22 -198
$$ packed form
7613f7n6O4j43K1K16k0J43l28J86j90K65l03J72L78l59J25j73j8j97M41k66M33
7635C24m73L28o0j13n6J8K6K33l43O7J09j92K63j10L07l70j21L51k27L6lj25J69
7658C8j14J41j97R5k34M49k98K49P2m07K86k85M08j76J19k37L12l9k54J31J03
7679A62k5N6k74P5J31j21J26M2j58JJ10k7l18K35n9j09K01l8J25M2r4q5J53j8
7703A33m9J3J86m09j17K35p7k5L6J46r2J11jj62J36j79M65j53l85K39K8p0j23
7726a14J12Q3n8jR5J26j08j53k8o4j04M80m40M6M08l12J27j50L68l25j96K09M0
7749D1r3Q1r1o8j48J34j06N0M0k18L02J11J9l9n1j0j07K97j12j08J96mj22Q9N1
7774A34l7j27J42j21n9K97j21k3j14j27o5L79o9r0ml24L75j48Q9K5J09r3ok20
$$ plain form
7798 -198 192 -12 -5 -102 39 80 113 -171 -102 58 -372 -228 -29 17 -96 12 91 -235 -226 175 -222 15 -106
7821 -106 140 -112 102 111 74 74 -177 -16 -22 74 242 154 75 -94 119 27 297 52 40 198 13 174 -458 -134
7845 -134 9 36 94 -184 -164 149 127 111 71 -224 -95 262 -96 66 26 101 -120 -83 188 190 99 -6 148 -98
7869 -98 207 48 56 142 17 -131 51 66 -4 -271 -207 61 109 -146 42 188 -70 -20 -7 70 -265 52 -86 6
7893 6 245 73 54 122 74 227 -15 -23 -64 -282 120 165 171 116 -49 -114 36 -27 116 -86 305 37 -439 159 33
7918 33 237 4 208 12 119 51 142 53 123 -32 -9 190 -28 -90 -51 203 77 -8 -47 372 -44 75 66 29
7942 29 115 -88 199 -124 -240 -294 -167 -21 -96 145 168 -57 11 -130 -58 -44 335 130 145 -68 -35 39 245 0
7966 0 -258 -314 7 -225 48 54 -104 227 -67 148 -22 45 86 -20 122 -16 28 103 77 215 -175 -53 -148 -114
$$ packed form
7798a98L90k04Pr7J41M1L3k84O9J60m30J44J99M6j13J08P9l26RM01l97K37j21
7821a06K46k52K14Rl7%k51J61oR6J68q8p9j69K13r2K70k45j2J58j85J61o32L24
7845a34J43K7N8k78K0L13k2j6m0k95J29L57l58J62m0P5k21L7K71Kr1j05J54k46
7869i8L05j59QQ6j25j48J82J5p0k67O4K68M8k55J88J46k58N0J3P7l35L17j38R2
7893FK39j72j9O8m8J53k42qm1k18M02M5On5j65o5J50o3J43k02L91k68m76N98j26
7918C3K04k33K04j96J07o8R1q9P0j55K3J99k18o2L9K54j26q5l9M19m16J19rl7
7942B9Q6k03K87l23j16n4J27J46p5K41K3k25O8j41P2J4L79k05J5k13L3P4K06k45
7966@k58n6L21k32K73Oj58L31k94K15j70O7M1j06J42j38M4P5k6J38l90J22r5L4
$$ plain form
7990 -114 36 -84 -47 -261 -100 -84 -206 -83 4 151 90 -176 28 -318 -189 4 -62 -236 34 76 201 137
8012 137 -213 61 -36 -169 80 392 -37 20 154 -132 -34 -2 50 14 147 6 147 -129 95 17 -159 -275
8034 -275 -88 4 -51 156 -121 -518 -9 40 -267 -109 -136 56 234 172 -138 -83 49 -136 -139 13 -168 -43 350
8057 350 48 -157 195 57 -174 165 -299 44 102 -86 -36 -15 154 -158 -152 -159 275 -78 41 103 -342 -47 -41
8080 -41 -16 -34 -76 8 -55 -72 -5 135 -153 96 185 -33 101 -221 -94 120 8 67 8 70 -79 -77 -192 -286 -155
8105 -155 232 289 29 -91 -37 74 -9 221 -150 -90 300 -7 -3 212 128 -318 -48 93 45 -84 -85 1 -184 -38
8129 -38 -269 97 -44 89 79 271 174 27 -220 31 -126 130 205 -231 -17 -125 -126 -108 151 -175 178 84 -128
8152 -128 -31 -25 89 -218 -172 49 -89 102 127 260 -148 75 -174 43 116 165 -158 75 -22 260 -131 -200 98
$$ packed form
7990a14J50j20L7k14J61J6j22J23Q7J47o1k66K04l46J29J93o6j74K70M2J25o4
8012A37l50K74r7j33K49L12m29N7J34k86R8L2N2l6J33j41J41k76K24p8j76j16
8034b75J87R2n5K07k77l97N09M9l07J58k7J92J78o2l10N5J32j85lJ52j81J25L93
8057C50l02k05L52j38k31L39m64L43N8j88N0K1J69l12OpM34l53J19O2m45K95O
8080d1K5j8m2Q4o3j7O7J40k88K49Q9k18J34l22J27K14j12N9n9O2j49Kj15r4J31
8105a55L87N7k60j20N4J11q3K30l71O0L90l07MK15q4m46K70J41m8j29jQ6j85J46
8129c8k31L66j41J33j0J92r7j47k47K51j57K56P5m36K14j08jJ8K59l26L53r4k12
8152a28R7OJ14l07M6K21j38J91K5J33m08K23k49K17P3M9l23K33r7K82l91o9K98
$$ plain form
8175 98 264 -186 -22 -65 41 158 -154 41 79 169 9 -46 -159 28 -111 -65
$$ packed form
8175I8J66m50J64m3J06J17l12J95L8R0j60n5j13J87j39M6
8191f5
$$ Imaginary data points
##PAGE= N=2
##DATA TABLE= (X++(I..I)), XYDATA
$$ plain form
0 0 0 0 0 0 0 0 0 0 0 0 0 0 7 -8 8 -8 8 -16 16 -16 24 -24 32 -40 48 -54 64 -72 81 -95 108 -121 140 -156
34 -156 180 -200 226 -251 283 -315 348 -388 431 -476 529 -583 643 -709 781 -861 949 -1046
52 -1046 1152 -1270 1403 -1556 1727 -1925 2157 -2425 2756 -3157 3667 -4336 5254 -6606 8791
67 8791 -12931 23607 -112897 -208843 -37701 -62342 -168647 -185524 -30177 38424 -61307 -221361
79 -221361 -259989 -190982 -77294 -13833 -41692 -150995 -209330 -159785 -82120 -87779 -145589 -185749
91 -185749 -166035 -90627 -11888 -44666 -193043 -295698 -223490 -87582 -51690 -96968 -106095 -86148
103 -86148 -105535 -140521 -137892 -131266 -145712 -117897 -32459 -4583 -98122 -200620 -189602 -104924
115 -104924 -46706 -40507 -60956 -83561 -80504 -50317 -44965 -88581 -125359 -102042 -43899 1290
$$ packed form
0@%%%%%%%%%%%%Pj5J6j6J6k4L2l2M0m8N6p2Q8j02J18j36J53j76K03k29K61k96
34a56L36l80M26m77N34n98O63p36Q19r07J005j112J226j352J490j642J810j995
52a046K198k422K673k959L283l652M082m582N181n913O824q003R590j1860J5397
67H791k1722L6538j36504r5946J71142k4641j06305j6877J55347O8601r9731j60054
79b21361l8628O9007J13688O3461k7859j09303n8335M9545P7665n659n7810m0160
91a85749J9714P5408P8739l2778j48377j02655P2208J35908L5892m5278r127J9947
103h6148j9387l4986K629O626j4446K7815Q5438K7876r3539j02498J1018Q4678
115a04924N8218O199k0449k2605L057L0187N352m3616l6778K3317N8143M5189
$$ plain form
127 1290 20118 5701 -48553 -95300 -71123 -8342 10090 -9438 4102 42014 30374 -29212
139 -29212 -60080 -37000 3782 44461 78457 76822 28103 -17324 -8555 33551 55680 49532 45750
152 45750 54345 66195 71736 61138 33585 17869 38170 74250 91655 88857 82075 72188 56880
165 56880 47411 53602 66712 78986 98026 114748 101204 56684 25951 36980 70825 99814
177 99814 112761 104185 80147 61257 59428 65136 65153 63210 69040 79858 83316 75824 64699 54011
191 54011 48426 52905 65049 74430 75732 71009 61117 46672 29532 18176 23775 47354 71463
204 71463 75132 55608 29159 12767 11090 21242 36650 44151 37005 20963 8587 3994 3605
217 3605 4178 7775 15314 20085 16075 5355 -5678 -11844 -14809 -18632 -21324 -15158 -4514 -1269 -8317
$$ packed form
127A290J8828j4417n4254m6747K4177O2781J8432j9528J3540L7912j1640n9586
139b9212l0868K3080M0782M0679L3996j635m8719m5427Q769M2106K2129o148l782
152D5750Q595J1850N541j0598k7553j5716K0301L6080J7405k798o782r887j5308
165E6880r469O191J3110J2274J9040J6722j3544m4520l0733J1029L3845K8989
177I9814J2947q576k4038j8890j829N708J7j943N830J0818L458p492j1125j0688
191E4011n585M479J2144R381J302m723r892j4445j7140j1356N599K3579K4109
204G1463L669j9524k6449j6392j677J0152J5408P501p146j6042j2376m593l89
217C605N73L597P539M771m010j0720j1033o166k965l823k692O166J0644L245p048
$$ plain form
232 -8317 -19096 -30001 -40158 -42102 -28504 -9898 -6619 -23112 -41666 -49479 -50526 -48602 -39254
245 -39254 -26150 -23735 -33558 -44881 -50238 -52862 -52038 -47444 -41868 -38984 -40132 -43819 -47951 -50119 -51372
260 -51372 -53939 -55967 -52252 -41510 -33720 -36953 -46304 -52314 -55039 -56224 -48227 -33584 -25817 -33105
274 -33105 -45193 -51484 -52267 -48854 -39626 -27317 -19490 -22841 -31813 -36948 -37231 -33964 -29497 -23860 -21703
289 -21703 -21536 -21689 -20798 -19644 -18589 -17249 -16114 -13057 -6603 -783 -1189 -6581 -12239 -14456 -12997 -6431
305 -6431 4063 13477 14273 8231 1886 -325 909 7082 15005 20075 18248 12966 8883 9049 12749
320 12749 17848 22707 25386 25987 24646 23643 22577 20994 20127 20446 22541 27102 31781 33357 31313 26347
336 26347 22527 21545 25311 31949 36968 37310 32456 25362 20599 21163 26099 32533 36717 35339 30304 25302
$$ packed form
232h317j0779j0905j0157j944J3598J8606L279j6493j8554p813j047J924R348
245c9254J3104K415r823j1323n357k624Q24M594N576K884j148l687m132k168j253
260e1372k567k028L715J0742P790l233r351o010k725j185P997J4643P767p288
274c3105j2088o291p83L413R228J2309P827l351q972n135k83L267M467N637K157
289b1703J67j53Q91J154J055J340J135L057O454N820m06n392n658k217J459O566
305f431J0494R414P96o042o345k211J234O173P923N070j827n282m083J66L700
320A2749N099M859K679O01j341j003j066j583q67L19K095M561M679J576k044m966
336B6347l820r82L766O638N019L42m854p094m763N64M936O434M184j378n035n002
$$ plain form
352 25302 22577 22835 25444 28717 29777 28989 27771 25602 23513 21984 20557 19740 20069 22043 23589 25095
368 25095 22967 18345 14487 12554 13272 16656 20357 20324 16224 10071 4599 3234 5714 11289 14025 13882
384 13882 10258 5241 1085 -200 345 1954 2774 1596 79 -1284 -2445 -4376 -5244 -5334 -5729 -5227 -3973
401 -3973 -3496 -5636 -10307 -14129 -16520 -16068 -13206 -9051 -6898 -8888 -13791 -17842 -20029 -19676 -16690 -13122
417 -13122 -12894 -16419 -19912 -21986 -22994 -21629 -19269 -17046 -16340 -17744 -19256 -19814 -21040 -22353 -22611 -21991
433 -21991 -20698 -18737 -17199 -17016 -19016 -20931 -22334 -22319 -19980 -15494 -13142 -14363 -17003 -19655 -20521 -20033
449 -20033 -17094 -12522 -9287 -10512 -13751 -15124 -14482 -13597 -12542 -9510 -6635 -6392 -7598 -8320 -7383 -6696
465 -6696 -7392 -7506 -5309 -1485 -717 -635 -645 -449 -1727 -2791 -1241 3734 6709 5808 3574 2560 2065 1949
$$ packed form
352B5302k725K58K609L273J060p88j218k169k089j529j427q17L29J974J546J506
368B5095k128m622l858j933P18L384L701l3m100o153n472j365K480N575K736j43
384A3882l624n017m156j285N45J609Q20j178j517j363j161j931q68r0l95N02J254
401c973M77k140m671l822k391M52K862M155K153j990m903m051k187L53K986L568
417a3122K28l525l493k074j008J365K360K223P06j404j512n58j226j313k58O20
433b1991J293J961J538J83k000j915j403J5K339M486K352j221k640k652q66M88
449b0033K939M572L235j225l239j373O42Q85J055L032K875K43j206p22R37O87
465f696o96j14K197L824P68Q2j0J96j278j064J550M975K975r01k234j014m95j16
$$ plain form
483 1949 3144 7581 11666 11928 9032 6775 7634 8636 8263 8549 11184 13665 12239 9336 10383 13461
499 13461 12703 9757 10773 15622 16784 13176 11980 13567 13054 9109 9119 13864 17340 16381 13940 12710
515 12710 12550 11037 10256 11876 14397 15604 12914 9479 8430 10962 11646 9437 9304 13015 13405 8695
531 8695 6267 9506 10841 5899 3615 7987 11238 7559 4574 6535 7557 3894 485 3842 7833
546 7833 6286 3812 2939 1831 599 159 864 2015 3229 2882 -280 -3450 -2133 658 -981 -3771
562 -3771 -1837 1492 -1512 -6287 -4406 -569 -3468 -8147 -6053 -1333 -3164 -7230 -6351 -3500 -5870
577 -5870 -9197 -7482 -4325 -4691 -7176 -7261 -7729 -9227 -9323 -7347 -6897 -7371 -6220 -6519 -9272 -10619 -7956
594 -7956 -6746 -9477 -10108 -6734 -6568 -10203 -10638 -6898 -6271 -9625 -9528 -6293 -5690 -8601 -8864 -6380 -7220
$$ packed form
483A949J195M437M085K62k896k257Q59J002l73K86K635K481j426k903J047L078
499A3461p58k946J016M849J162l608j196J587n13l945J0M745L476r59k441j230
515A2710j60j513p81J620K521J207k690l435j049K532O84k209j33L711L90m710
531H695k428L239J335m942k284M372L251l679k985J961J022l663l409L357L991
546G833j547k474q73j108j232m40P05J151J214l47l162l170J317K791j639k790
562c771J934L329l004m775J881L837k899m679K094M720j831m066Q79K851k370
577e870l327J715L157l66k485q5m68j498r6J976M50m74J151k99k753j347K663
594g956J210k731o31L374J66l635m35L740O27l354R7L235O03k911k63K484q40
$$ plain form
611 -7220 -9835 -8237 -5194 -5560 -6802 -5453 -5151 -7258 -7147 -4931 -3321 -5090 -5185 -3430 -3655 -5634 -4769
628 -4769 -1743 -1417 -2933 -2456 -620 -1678 -2580 -807 335 -582 -864 724 1048 394 516 2399 1880
645 1880 320 1804 4328 3795 2003 3277 4949 3449 1566 3902 6593 6136 3504 4289 5960 5415
661 5415 4160 5124 7365 6916 5546 5340 5749 6103 6270 6008 5700 6613 7106 6214 4998 5599 7518 6439
679 6439 4346 5331 7549 6982 4286 4703 6501 5566 3343 3610 6161 6787 4366 2918 3798 4657 3444
696 3444 2517 3654 4960 3315 1726 1129 2305 3123 2030 1023 2159 3007 1376 -390 -70 1137
712 1137 935 -875 -1047 790 1115 -1088 -2066 -895 -224 -1716 -2426 -1393 -44 -859 -3558 -3558 -2359 -2141
730 -2141 -3160 -3220 -1863 -1139 -3352 -4783 -3970 -2271 -2959 -4067 -3688 -2368 -2969 -4994 -4804 -3191 -2893
$$ packed form
611g220k615J598L043l66j242J349L02k107J11K216J610j769r5J755k25j979Q65
628d769L026L26j516M77J836j058r02J773J142r17k82J588L24o54J22J883n19
645A880j560J484K524n33j792J274J672j500j883K336K691m57k632P85J671n45
661E415j255R64K241m49j370k06M09L54J67k62l08R13M93q92j216O01J919j079
679F439k093R85K218n67k696M17J798r35k223K67K551O26k421j448Q80Q59j213
696C444r27J137J306j645j589n97J176Q18j093j007J136Q48j631j766L20J207
712A137k02j810j72J837L25k203r78J171O71j492p10J033J349q15k699%J199K18
730b141j019o0J357P24k213j431Q13J699o88j108L79J320o01k025J90J613K98
$$ plain form
747 -2893 -4081 -4078 -3356 -2897 -3806 -4725 -4624 -3476 -3756 -4283 -3854 -2701 -2641 -4101 -5315 -4881 -3806 -2945 -3718
766 -3718 -3316 -1966 -2988 -4617 -4607 -2902 -2387 -3021 -3127 -1862 -2027 -3209 -4034 -3084 -2296 -2309 -2374 -1583 -1133
785 -1133 -1733 -2588 -2583 -2187 -1569 -1194 -890 -336 -11 -386 -1687 -1496 -630 219 340 549 1146 907 -216 -653
805 -653 537 1286 1445 1755 2570 2204 1701 1305 1561 2109 2191 2907 3279 3617 3365 2889 2547 2520 2889 3630 4244
826 4244 4322 4061 3855 3579 3009 3318 3909 4446 4946 5006 4600 3813 3445 3494 4066 4458 4865 5161 4783 4167 3533
847 3533 3234 3340 3458 4225 4386 4448 3782 3576 2768 2691 2306 2819 3355 3764 3229 2690 2081 1022 730 1474
867 1474 1806 2075 2314 1557 857 89 -185 -283 87 500 554 235 -355 -1119 -1722 -1731 -1519 -1207 -1011 -730 -1390
888 -1390 -1925 -2795 -3423 -3057 -2687 -2589 -2213 -2024 -2545 -3060 -3600 -4043 -3970 -3433 -2749 -2583 -2995 -3355 -4069 -4218 -4419
$$ packed form
747b893j188LP22M59r09r19J01J148k80n27M29J153O0j460j214M34J075Q61p73
766c718M02J350j022j629J0J705N15o34j06J265j65j182q25R50P88j3o5P91M50
785a133o00q55NL96O18L75L04N54L25l75j301J91Q66Q49J21K09N97k39j123m37
805f53J190P49J59L10Q15l66n03l96K56N48Q2P16L72L38k52m76l42k7L69P41O14
826D244P8k61k06k76n70L09N91N37N00O0m06p87l68M9N72L92M07K96l78o16o34
847C533k99J06J18P67J61O2o66k06q08p7l85N13N36M09n35n39o09j059k92P44
867A474L32K69K39p57p00p68k74r8L70M13N4l19n90p64o03rK12L12J96K81o60
888a390n35q70o28L66L70R8L76J89n21n15n40m43P3N37O84J66m12l60p14j49k01
$$ plain form
909 -4419 -3756 -3595 -2989 -3051 -3299 -3775 -4007 -4240 -4250 -3816 -3091 -2817 -2898 -3321 -3459 -3869 -4111 -3896 -3051 -2074 -2200
930 -2200 -2413 -2718 -3269 -3506 -3158 -2791 -1833 -1361 -1325 -1763 -2239 -2617 -2409 -1958 -1388 -742 -626 -544 -1194 -1338 -1368
951 -1368 -1228 -903 -205 386 323 165 -297 -531 -579 -392 2 838 1297 1644 636 176 201 440 513 1160 2123
972 2123 2345 1793 1467 1153 1112 1286 1681 2550 2955 2781 2401 1946 1792 1994 1991 2726 3509 3764 3265 2925 2449
993 2449 2437 2355 2802 3226 3861 4176 3414 3290 2272 2588 2865 2955 3798 4160 3719 3220 2583 2442 2571 2735 3155
1014 3155 3693 3827 3233 2679 2330 2285 2029 2727 2868 3116 3084 2541 1704 1502 1506 1175 1659 1944 2530 1919 1395
1035 1395 374 625 377 484 874 1268 1411 491 -165 -634 -487 -839 -311 -17 132 -225 -525 -1569 -1652
1054 -1652 -1825 -1740 -1394 -943 -1075 -1170 -1890 -2622 -2418 -2315 -2068 -2189 -1959 -1485 -2506 -2668 -3184 -3326 -3156 -2888
$$ packed form
909d419O63J61O06o2k48m76k32k33j0M34P25K74q1m23j38m10k42K15Q45R77j26
930b200k13l05n51k37L48L67R58M72L6m38m76l78K08M51N70O46J16Q2o50j44l0
951a368J40L25O98N91o3j58m62k34m8J87L94Q36M59L47j008m60K5K39P3O47R63
972B123K22n52l26l14m1J74L95Q69M05j74l80m55j54K02lP35P83K55m99l40m76
993B449j2q2M47M24O35L15p62j24j018L16K77R0Q43L62m41m99o37j41J29J64M20
1014C155N38J34n94n54l49m5k56O98J41K48l2n43q37k02Ml31M84K85N86o11n24
1035A395j021K51k48J07L90L94J43r20o56m69J47l52N28K94J49l57l00j044q3
1054a652j73Q5L46M51j32r5p20p32K04J03K47j21K30M74j021j62n16j42J70K68
$$ plain form
1074 -2888 -2384 -2219 -2674 -3048 -3298 -3807 -3526 -2798 -2686 -2480 -2575 -2227 -2980 -3438 -3513 -3047 -2441 -2231 -2169 -2157 -2484
1095 -2484 -2837 -3111 -3096 -2541 -2159 -1617 -1835 -1764 -1804 -2766 -2569 -2299 -1747 -1106 -1070 -1182 -1213 -1778 -1510 -1923 -1519
1116 -1519 -556 -519 -918 -492 -699 -1087 -1244 -1234 -612 -120 64 85 207 -173 -390 -1010 -323 557 708 605 738
1137 738 625 384 -19 -193 427 1462 1404 1130 1171 1273 791 229 691 1326 1761 1471 1549 1720 1580 954 703
1158 703 1386 1873 2114 1792 2053 2268 1939 1243 1228 1979 2475 2425 2113 2339 1969 1888 1466 1689 2415 2918 2564
1179 2564 2419 2568 2355 1617 1346 2290 2775 2726 2370 2439 2586 2156 1321 1659 1962 2651 2287 2172 2312 1840
1199 1840 1594 1097 1270 1987 2396 1888 1652 1518 1169 421 685 1188 1410 1279 795 770 745 301 -250 7
1219 7 404 684 456 92 141 -162 -888 -1018 -601 -447 -218 -463 -651 -912 -1412 -1871 -2062 -1024 -985 -1349 -1165
$$ packed form
1074b888N04J65m55l74k50n09K81P28J12K06r5L48p53m58p5M66O06K10O2J2l27
1095b484l53k74J5N55L82N42k18P1m0r62J97K70N52O41L6j12l1n65K68m13M04
1116a519R63L7l99M26k07l88j57J0O22M92J84K1J22l80k17o20O87Q80J51j03J33
1137G38j13k41m03j74O20J035n8k74M1J02m82n62M62O35M35k90P8J71j40o26k51
1158G03O83M87K41l22K61K15l29o96j5P51M96n0l12K26l70q1m22K23P26N03l54
1179B564j45J49k13p38k71R44M85m9l56O9J47m30q35L38L03O89l64j15J40m72
1199A840k46m97J73P17M09n08k36j34l49p48K64N03K22j31m84k5k5m44n51K57
1219GL97K80k28l64M9l03p26j30M17J54K29k45j88k61n00m59j91J038L9l64J84
$$ plain form
1240 -1165 -1389 -1682 -1889 -2468 -2215 -1629 -1397 -1579 -1944 -1764 -2080 -2459 -2587 -1890 -2226 -1847 -2074 -2059 -2215 -2261
1260 -2261 -2594 -2431 -2108 -1449 -1803 -1848 -1947 -2246 -2640 -2246 -2327 -1602 -1632 -1537 -1535 -1734 -1859 -2339 -1780 -1391 -1352 -1272 -731
1283 -731 -1075 -1314 -1398 -1280 -1020 -757 -531 -441 -564 -550 -646 -1007 -764 -456 -422 66 169 -10 -92 -286 -341 25
1305 25 188 367 679 708 465 153 70 538 522 576 977 1080 835 611 690 577 785 818 1035 1125 1322 1063 724
1328 724 861 858 924 1427 1240 1915 1549 1116 962 922 1333 1445 1340 1539 1946 1322 957 1148 1341 1459 1475 1657
1350 1657 1809 2017 1632 1524 1130 1047 1211 1211 1703 1876 1530 1398 1287 1166 1209 1452 1589 1780 1911 1504 1189
1371 1189 857 1145 859 1216 1584 1634 1121 811 649 758 615 819 815 1011 1185 1028 464 538 131 177 232 537
1393 537 571 383 -74 55 -338 -443 -419 -282 -361 -182 -383 -648 -685 -653 -986 -824 -768 -452 -377 -690 -965 -1230
$$ packed form
1240a165k24k93k07n79K53N86K32j82l65J80l16l79j28O97l36L79k27J5j56m6
1260b261l33J63L23O59l54m5r9k99l94L94q1P25l0R5Kj99j25m80N59L89L9Q0N41
1283g31l44k39q4J18K60K63K26R0j23J4r6l61K43L08L4M88J03j79q2j94n5L66
1305B5J63J79L12K9k43l12q3M68j6N4M01J03k45k24P9j13K08L3K17R0J97k59l39
1328G24J37lO6N03j87O75l66m33j54m0M11J12j05J99M07o24l65J91J93J18J6J82
1350A657J52K08l85j08l94q3J64%M92J73l46j32j11j21M3K43J37J91J31m07l15
1371A189l32K88k86L57L68N0n13l10j62J09j43K04mJ96J74j57n64P4m07M6N5L05
1393E37L4j88m57J29l93j05K4J37p9J79k01k65l7L2l33J62N6L16P5l13k75k65
$$ plain form
1415 -1230 -1472 -946 -1102 -928 -706 -844 -1271 -1484 -1626 -1450 -1352 -1598 -1217 -1194 -1015 -1362 -2049 -1608 -1559 -1517 -1370
1436 -1370 -1203 -1329 -1297 -1288 -1521 -1889 -1511 -1029 -1189 -902 -1112 -1269 -1476 -1501 -1519 -1287 -1113 -785 -722 -860 -991 -878
1458 -878 -887 -1007 -879 -629 -450 -549 -275 -444 -652 -544 -648 -524 24 -50 55 -141 116 -471 -297 -48 -103 73
1480 73 337 246 87 61 187 -85 -77 256 687 422 344 415 159 390 260 242 524 478 598 543 385 376 540 475
1504 475 702 858 1059 943 596 512 557 679 772 1101 1000 980 681 769 408 734 808 844 1260 1123 874 819 768
1527 768 653 463 631 1006 973 971 1013 817 645 592 772 1087 958 1008 969 951 807 725 814 551 857 976 1110
1550 1110 825 850 800 527 267 668 893 737 731 693 446 283 133 213 625 574 343 476 465 -120 43 -306
1572 -306 91 103 199 106 202 34 -328 -377 -278 -465 -12 -33 -180 -580 -406 -654 -833 -671 -375 -394 -521 -577 -480
$$ packed form
1415a230k42N26j56J74K22j38m27k13j42J76R8k46L81K3J79l47o87M41M9M2J47
1436a370J67j26L2Rk33l68L78M82j60K87k10j57k07k5j8K32J74L28O3j38j31J13
1458h78rj20J28K50J79r9K74j69k08J08j04J24N48p4J05j96K57n87J74K49n5J76
1480G3K64r1j59k6J26k72QL33M31k65p8P1k56K31j30j8K82m6J20n5j58rJ64o5
1504D75K27J56K01j16l47q4M5J22R3L29j01k0k99Q8l61L26P4L6M16j37k49n5n1
1527G68j15j90J68L75l3kM2j96j72n3J80L15j29N0l9j8j44q2Q9k63L06J19J34
1550A110k85K5n0k73k60M01K25j56ol8k47j63j50Q0M12n1k31J33j1n85J63l49
1572c06L97J2R6r3R6j68l62m9R9j87M53k1j47m00J74k48j79J62K96j9j27n6R7
$$ plain form
1595 -480 -673 -694 -796 -588 -681 -650 -641 -888 -817 -778 -1086 -1021 -827 -751 -899 -842 -857 -847 -1117 -955 -931 -737 -376 -736
1619 -736 -479 -827 -710 -859 -920 -589 -687 -403 -523 -402 -810 -905 -973 -635 -206 -237 -455 -311 -252 -691 -493 -185
1641 -185 -410 7 -47 -73 27 -164 -427 -339 -214 60 38 12 185 212 21 -97 -7 -21 415 341 427 75 282
1664 282 -27 5 99 274 300 356 436 292 237 -193 -67 -19 466 197 260 437 154 263 -76 206 383 497 124
1687 124 265 338 448 34 160 225 179 245 518 516 264 30 67 108 129 236 494 436 580 195 299 159 366
1710 366 393 441 484 478 558 334 152 103 407 367 352 438 222 646 108 310 281 328 371 459 323 347 377 -34 304
1735 304 310 235 578 406 458 260 26 217 -7 10 666 282 127 0 364 -50 -192 125 -202 113 185 113
1757 113 -112 -27 -199 -318 -306 -246 40 -13 30 -215 -535 -582 -504 -377 -588 -397 -101 -186 -442 -576 -532 -223 -578
$$ packed form
1595d80j93k1j02K08r3L1Rk47P1L9l08O5J94P6j48N7j5J0k70J62K4J94L61l60
1619g36K57l48J17j49o1L31r8K84j20J21m08r5o8L38M29l1k18J44N9m39J98L08
1641a85k25M17n4k6J00j91k63Q8J25K74k2k6J73K7j91j18R0j4M36p4Q6l52K07
1664B82l09L2R4J75K6N6Q0j44n5m30J26M8M85k69O3J77k83J09l39K82J77J14l73
1687A24J41P3J10m14J26O5m6O6K73kk52k34L7M1K1J07K58n8J44l85J04j40K07
1710C66K7M8M3oQ0k24j82m9L04m0j5Q6k16M24n38K02k9M7M3Q8j36K4L0m11L38
1735C04Op5L43j72N2j98k34J91k24J7O56l84j55j27L64m14j42L17l27L15P2p2
1757A13k25Q5j72j19J2O0K86n3M3k45l20m7P8J27k11J91K96q5k56j34M4L09l55
$$ plain form
1780 -578 -357 -172 -420 -360 -549 -398 -789 -209 -312 -424 -274 -591 -702 -397 -551 -472 -497 -419 -152 -279 -215 -321
1802 -321 -504 -421 -727 -517 -277 -109 149 -172 -425 -403 -46 -429 14 52 -119 22 -59 23 -478 -127 -149 -226
1824 -226 -52 105 70 -80 -13 -85 -62 -38 140 185 65 63 49 47 171 211 11 272 286 170 124 -143 124 -216 201
1849 201 349 98 343 255 28 44 225 -76 356 458 122 316 120 10 -138 186 132 208 377 382 215 218 267
1872 267 -320 121 70 368 271 76 -66 113 60 60 70 160 351 311 237 334 215 181 -153 136 282 324 251 324 105
1897 105 160 10 -131 404 416 401 259 528 281 -62 -68 469 412 458 332 412 -35 79 38 -91 56 33 148
1920 148 155 98 76 35 -352 -146 4 200 117 -79 -90 29 -196 18 62 -7 -68 18 99 -84 -507 -227 -49 -75
1944 -75 -72 68 -228 -28 64 -243 -411 -390 -476 -87 -239 -438 -342 -628 -385 -399 -447 -413 -265 -398 -417 -99 -645 -575
$$ packed form
1780e78K21J85k48O0j89J51l91N80j03j12J50l17j11L05j54P9k5P8K67j27O4j06
1802c21j83Q3l06K10K40J68K58l21k53K2L57l83M43L8j71J41q1Q2n01L51k2p7
1824b26J74J57l5j50O7p2K3K4J78M5j20kj4kJ24M0k00K61J4j16m6k67K67l40M17
1849B01J48k51K45q8k27J6J81l01M32J02l36J94j96j10j48L24n4P6J69Nj67LM9
1872B67n87M41n1K98r7j95j42J79n3%J0R0J91m0p4R7j19l4l34K89J46M2p3P3k19
1897A05N5j50j41N35J2j5j42K69k47l43oN37n7M6j26Q0m47J14m1j29J47k3J15
1920A48Pn7k2m1l87K06J50J96q3j96j1J19k25K14M4o9o1Q6Q1j83m23K80J78k6
1944g5LJ40k96K00R2l07j68K1q6L89j52j99R6k86K43j4m8L4J48j33j9L18n46P0
$$ plain form
1968 -575 -695 -334 -389 -120 -381 -287 -111 -499 -433 -126 -222 1 -264 -263 -558 -282 44 -463 -71 6 -53 -283 -3
1991 -3 -123 -188 -198 -156 -82 73 64 124 -7 -52 -194 -260 -187 243 385 54 379 277 140 -16 297 24 425 88
2015 88 357 229 -1 354 -64 -8 269 220 313 505 -62 106 133 337 67 231 176 267 466 227 151 375 91
2038 91 265 264 470 167 279 221 180 90 97 267 -70 88 223 274 135 211 94 198 -19 44 472 214 -27 -108
2062 -108 -110 261 75 157 219 87 66 171 98 -99 275 -16 155 123 354 149 73 91 120 -17 310 26 181
2085 181 278 -26 94 95 63 -101 181 137 81 -12 -157 -67 99 129 36 114 172 49 -154 52 -173 -43 -162 -416
2109 -416 150 98 -166 -323 -406 158 -28 -114 4 -182 -52 -185 -363 -269 -444 -233 -308 128 -290 98 -156 -283
2131 -283 -230 142 -326 -47 -386 -297 -372 -279 -447 -191 -333 -211 -84 28 -282 5 -601 -349 -94 -96 -182 -111 81
$$ packed form
1968e75j20L61n5K69k61R4J76l88O6L07r6K23k65Jk95K76L26n07L92P7n9k30K80
1991cj20o5j0M2P4J55rO0j31m5j42o6P3M30J42l31L25j02j37j56L13k73M01l37
2015H8K69j28k30L55m18N6K77m9R3J92n67J68K7K04k70J64n5R1J99k39p6K24k84
2038I1J74jK06l03J12n8m1r0PJ70l37J58J35N1j39P6j17J04k17O3M28k58k41q1
2062a08kL71j86Q2O2j32k1J05p3j97L74k91J71l2K31k05p6J8K9j37L27k84J55
2085A81R7l04J20Jl2j64K82m4n6r3j45R0J66L0r3P8N8j23k03K06k25J30j19k54
2109d16N66n2k64j57q3N64j86q6J18j86J30j33j78R4j75K11p5M36m18L88k54j27
2131b83N3L72m68K79l39Q9p5R3j68K56j42J22J27J12l10K87o06K52K55kq6P1J92
$$ plain form
2154 81 -65 -15 -303 -40 -247 -66 24 43 219 113 -26 -143 -97 137 222 -75 320 -48 255 118 -69 -211
2176 -211 208 401 310 88 144 203 153 26 316 269 -13 224 352 150 105 494 141 294 282 336 117 300 -62
2199 -62 280 186 -132 -6 200 288 325 235 272 186 525 143 -109 41 28 47 107 84 -182 82 118 422 145 218
2223 218 184 139 91 82 64 -101 119 -78 249 321 -136 68 -30 -116 -103 -96 148 -123 -160 -335 -159 -66 29 -254 -83
2248 -83 -1 30 -53 -91 -232 -128 -175 -184 -263 26 74 -324 -82 -270 33 44 -16 82 -366 -94 -297 21 -39 -275 -14
2273 -14 -196 -34 -332 -43 -269 -320 46 -34 -127 -281 -6 41 -260 9 10 40 -145 25 -429 42 -433 -368 -239
2296 -239 -376 -102 -156 36 -248 -141 -136 -114 -374 -197 40 -281 -164 -376 2 -158 -96 -136 -119 57 142 81 -62
2319 -62 -215 -92 253 -259 -1 129 -36 -12 80 20 21 -123 1 205 151 97 28 103 -150 41 -55 148 76 294
$$ packed form
2154H1j46N0k88K63k07J81R0J9J76j06j39j17M6K34Q5k97L95l68L03j37j87j42
2176b11M19J93r1k22N6N9n0j27K90m7k82K37J28k02m5L89l53J53j2N4k19J83l62
2199f2L42r4l18J26K06Q8L7r0L7q6L39l82k52J50j3J9O0k3k66K64L6L04k77P3
2223B18l4m5m8rj8j65K20j97L27P2m57K04r8q6J3PK44k71l7j75J76R3R5k83J71
2248h3Q2L1q3l8j41J04m7rp9K89M8l98K42j88L03J1o0R8m48K72k03L18o0k36K61
2273a4j82J62k98K89k26n1L66q0r3j54K75M7l01K69JL0j85J70m54M71m75O5J29
2296b39j37K74n4J92k84J07NK2k60J77K37l21J17k12L78j60O2m0J7J76Q5o1j43
2319f2j53J23L45n12K58J30j65K4R2o0Jj44J24K04n4n4o9P5k53J91r6K03p2K18
$$ plain form
2343 294 197 211 147 248 48 106 312 114 351 206 244 115 264 214 85 139 668 290 249 364 413 370 84
2366 84 363 338 399 108 -52 166 141 120 224 250 318 522 92 -41 1 447 300 116 221 442 180 129 -32
2389 -32 -73 -94 113 319 147 39 -30 -71 20 18 -144 72 -105 -136 102 -100 56 104 -36 43 29 63 242 -149
2413 -149 -242 -174 38 13 -27 3 -211 -55 -255 100 89 5 -76 118 -48 -353 -210 -112 -88 -87 -28 -110 -236 -281 71
2438 71 -17 -7 -232 -162 98 -403 -172 -105 -356 43 -148 214 -200 -250 -358 2 -76 -253 -114 155 -59 -41 -279
2461 -279 -336 -33 -141 -233 -141 17 -142 -170 -40 -292 8 187 -212 -175 0 -68 -320 -59 50 262 -34 -241
2483 -241 -19 -199 117 -235 -68 -58 -75 43 -21 -280 -96 -93 102 -108 186 -123 39 39 142 256 66 -155
2505 -155 -201 36 9 38 -14 -34 77 7 121 193 327 -83 -20 -217 -44 75 8 90 409 298 221 290 176 -26
$$ packed form
2343B94r7J4o4J01k00N8K06j98K37j45L8j29J49n0j29N4N29l78m1J15M9m3k86
2366H4K79k5O1k91j60K18k5k1J04K6O8K04m30j33M2M46j47j84J05K21k62n1j61
2389c2m1k1K07K06j72j08o9m1R1kj62K16j77l1K38k02J56M8j40P9j4L4J79l91
2413a49r3O8K12k5m0L0k14J56k00L55j1q4q1J94j66l05J43R8K4JN9q2j26m5L52
2438G1q8J0k25P0K60n01K31O7k51L99j91L62m14n0j08L60p8j77J39K69k14J8k38
2461b79n7L03j08r2R2J58j59k8J30k52L00J79l99L7J75o8k52K61J09K12k96k07
2483b41K22j80L16l52J67J0j7J18o4k59J84LJ95k10K94l09J62%J03J14j90k21
2505a55m6K37k7K9n2k0J11p0J14P2J34m10O3j97J73J19o7Q2L19j11p7O9j14k02
$$ plain form
2529 -26 313 96 30 -1 174 205 161 -25 416 512 -92 239 266 142 292 190 68 244 287 138 79 218 193
2552 193 358 146 -198 -58 287 200 164 146 -42 311 76 199 250 286 -209 -159 -28 23 32 -4 -133 41 -45 92
2576 92 4 -2 68 80 40 -196 113 192 -43 -58 -152 -62 -171 -227 -27 -177 -287 -319 -12 -201 -157 -18 -98 -11 -52 165
2602 165 144 -168 17 -118 -204 126 -282 -170 -127 -20 -256 -377 -84 58 57 -165 -5 -106 -57 2 -6 56 -261
2625 -261 364 90 64 -23 -183 -224 -204 -213 57 -220 -55 -180 -206 84 -159 -66 13 0 -70 -417 -175 62 -382 82
2649 82 -199 108 80 174 45 -145 -140 138 -88 -65 -99 242 25 -172 -154 105 -80 15 206 7 -48 -6 110 50
2673 50 -130 -171 -115 -353 59 -57 -39 -35 57 -97 -232 121 7 6 287 -208 -111 -81 -10 -120 101 -17 -101 63
2697 63 197 -90 175 302 -304 154 2 90 167 202 320 -184 -95 508 250 332 78 111 55 -93 236 209 49
$$ packed form
2529b6L39k17o6l1J75L1m4j86M41R6o04L31K7j24J50j02j22J76M3j49n9J39k5
2552A93J65k12l44J40L45q7l6j8j88L53k35J23N1L6m95N0J31N1Rl6j29J74q6J37
2576I2q8oP0J2m0k36L09P9k35j5r4R0j09n6K00j50j10l2L07j89M4J39q0Q7m1K17
2602A65k1l12J85j35q6L30m08J12M3J07k36j21K93J42jk22J60j01M9N9qO2l17
2625b61O25k74k6q7j60m1K0rK70k77J65j25k6K90k43R3P9j3p0l47K42K37m44M64
2649H2k81L07k8R4j29j90NK78k26K3l4L41k17j97J8K59j85R5J91j99n5M2J16o0
2673E0j80m1N6k38M12j16J8MR2j54j35L53j14jK81m95R7L0P1j10K21j18q4J64
2697F3J34k87K65J27o06M58j52Q8P7L5J18n04Q9O03k58Q2k54L3n6j48L29k7j60
$$ plain form
2720 49 140 318 127 206 3 108 -15 46 79 273 -288 12 219 52 66 -30 45 -156 80 -205 187 -113 -51
2743 -51 90 178 -10 19 -110 127 3 -48 -89 -63 232 -1 155 -51 -67 -2 -144 14 -121 -129 -165 -76 173 -277
2767 -277 -22 44 -52 -217 -95 389 62 81 -376 43 -304 -137 -45 28 121 -195 -187 -180 5 135 -152 -16 -45 -51
2791 -51 -24 -312 -485 30 6 -53 388 -172 -211 309 -24 248 207 53 -322 18 -34 -93 107 273 -161 -117 3
2814 3 -175 6 -148 425 -122 45 69 -31 -57 -172 -155 -34 -136 114 -127 191 -128 -233 179 151 240 -251
2836 -251 21 32 41 151 -68 57 89 232 11 -70 32 225 -94 151 -64 17 188 -12 -41 149 15 211
2858 211 18 77 -59 271 26 33 -12 -46 -292 -163 207 39 76 320 99 137 209 159 155 -4 29 40 95 -321 214
2883 214 -18 297 -179 160 -23 29 -52 179 159 -93 15 24 -269 102 129 -49 -162 -27 250 45 260 -70
$$ packed form
2720D9R1J78j91P9k03J05j23O1L3J94n61L00K07j67J4r6P5k01K36k85L92l00O2
2743e1J41Q8j88K9j29K37j24n1m1K6K95k33J56k06j6O5j42J58j35ql6Q9K49m50
2767b77K55O6r6j65J22M84l27J9m57M19l47J67R2P3R3l16QPJ85J30k87J36k9o
2791e1K7k88j73N15k4n9M41n60l9N20l33K72m1j54l75L40n2n9K00J66m34M4J20
2814Cj78J81j54N73n47J67K4j00k6j15J7J21j02K50k41L18l19j05M12k8Q9m91
2836b51K72J1RJ10k19J25L2J43k21q1J02J93l19K45k15Q1J71k00k9J90j34J96
2858B11j93N9j36L30k45Pm5l4k46J29L70j68L7K44k21L8P2n0mj59L3J1N5m16N35
2883B14k32L15m76L39j83N2q1K31k0k52J08Rk93L71K7j78j13J35K77k05K15l30
$$ plain form
2905 -70 -69 37 186 93 -38 82 144 -229 -102 -195 177 -203 -27 -136 -52 174 -6 98 122 25 -25 167 -171
2928 -171 -62 97 128 -293 60 -203 -405 -68 -125 83 -145 -108 -342 -241 285 133 -165 -26 117 -203 210
2949 210 -216 -115 165 -387 13 -109 -360 -144 -37 -38 100 47 -321 6 207 -223 46 -133 61 36 177
2970 177 0 -379 141 -15 -63 -175 19 0 -141 -254 163 187 42 -60 -117 -8 7 20 178 -140 -382 141
2992 141 -88 250 -115 -115 98 234 210 1 130 -157 178 44 196 60 -133 117 11 132 -33 14 11 21
3014 21 -376 -15 -209 250 -47 78 9 46 163 -163 -329 116 70 68 -24 123 -188 0 -332 90 100 -69 216
3037 216 -127 -36 68 257 -193 -9 -332 -153 172 -62 21 -7 -42 68 -12 -164 102 -42 52 -50 -9 -82 216
3060 216 270 44 -109 -75 -171 -195 193 -7 94 -321 -38 -290 -178 -244 69 -180 -2 -204 -144 116 -24 260
$$ packed form
2905g0JJ06J49r3j31J20O2l73J27r3L72l80J76j09Q4K26j80J04K4r7n0J92l38
2928a71J09J59L1m21L53k63k02L37n7K08k28L7k34J01N26j52k98J39J43l20M13
2949B10m26J01K80n52M00j22k51K16J07jJ38n3l68L27K01m30K69j79J94k5J41
2970A77j77l79N20j56m8j12J94j9j41j13M17K4j45j02n7J09J5J3J58l18k42N23
2992A41k29L38l65%K13J36k4k09J29k87L35j34J52j36j93K50j06J21j65M7lJ0
3014B1l97L61j94M59k97J25o9L7J17l26j66M45m6kr2J47l11J88l32M22J0j69K85
3037B16l43R1J04J89m50J84l23J79L25k34Q3k8l5J10q0j52K66j44R4j02M1p3K98
3060B16N4k26j53L4r6k4L88k00J01m15K83k52J12o6L13k49J78k02O0K60j40K84
$$ plain form
3082 260 -199 -17 -9 46 12 159 110 -56 155 101 -80 -180 -36 -35 89 -154 -63 69 53 69 -376 35 157 282
3106 282 152 66 -4 -52 171 230 210 230 86 79 22 15 -153 65 -329 -172 -5 15 -34 68 8 82 -123 -27 107
3131 107 169 -281 82 63 8 148 484 251 56 20 26 78 1 133 22 -59 167 117 -161 7 53 73 -174 63
3155 63 -16 -45 -74 -96 38 -200 -14 39 -22 123 -108 -32 -178 -138 45 19 -73 -44 320 -162 -175 26 -60 57 -86
3180 -86 56 127 249 220 2 36 -191 231 475 -107 233 -141 -11 171 -170 -174 -15 6 58 80 -257 102 369
3203 369 -112 -76 202 89 -24 -74 16 -9 195 137 116 20 33 -135 41 -136 -34 72 -80 102 -54 80 10
3226 10 -22 -253 45 55 236 241 -170 157 11 -62 -26 109 -161 -182 92 79 33 -13 -112 112 186 38 -251 -205 -59
3251 -59 98 -15 -77 -111 48 136 -111 106 8 165 -87 -100 233 155 182 70 3 221 -49 147 277 -45 -43 65
$$ packed form
3082B60m59J82QN5l4J47m9j66K11n4j81j00J44JJ24k43R1J32j6J6m45M11J22J25
3106B82j30q6p0m8K23N9k0K0j44pn7pj68K18l94J57J67K0m9J02o0P4k05R6J34
3131A07O2m50L63j9n5J40L36k33j95l6ON2p7J32j11q1K26n0k78J68M6K0k47K37
3155F3p9k9k9k2J34k38J86N3o1J45k31P6j46M0J83k6r2K9L64m82j3K01q6J17j43
3180h6J42P1J22k9k18L4k27M22K44n82L40l74J30J82l41mJ59K1N2K2l37L59K67
3203C69m81L6K78j13j13n0R0k5K04n8k1r6J3j68J76j77J02J06j52J82j56J34p0
3226A0l2k31K98J0J81Nm11L27j46p3L6J35k70k1K74j3m6m6r9K24P4j48k89M6J46
3251e9J57j13o2l4J59Q8k47K17r8J57k52j3L33p8K7j12o7K18k70J96J30l22KJ08
$$ plain form
3275 65 -98 -45 -67 -121 -149 226 60 195 -78 467 -296 -144 -57 202 -220 -108 -95 60 187 -47 156 -90
3297 -90 7 -135 84 146 -86 -40 -343 -130 43 45 -163 -196 -15 -63 -176 -146 329 93 13 6 70 -22 -57 130 -218
3322 -218 84 -219 -39 -85 -110 -51 248 213 -67 56 141 -176 -75 -277 42 -86 188 -41 218 146 -238 202
3344 202 -134 33 -197 240 -39 -169 -135 50 -74 280 96 -60 279 38 -48 -180 31 -230 -187 -161 -54
3365 -54 -160 40 227 2 257 183 -100 67 -256 -111 93 201 -36 -267 -190 145 238 85 160 117 -179 -23
3387 -23 59 55 16 208 257 -68 56 30 -193 156 -69 -27 464 138 38 -63 9 -29 -19 -54 -121 -45 121 56 114
3412 114 81 113 -4 -39 -159 281 -15 -209 -31 -50 51 124 -49 16 48 -57 32 -347 96 -90 170 -47 42
3435 42 171 61 217 91 -104 -153 -127 66 -63 -60 -40 13 134 49 -39 79 68 -170 48 133 146 -180 118 176
$$ packed form
3275F5j63N3k2n4k8L75j66J35k73N45p63J52Q7K59m22J12J3J55J27k34K03k46
3297i0R7j42K19O2k32M6l03K13J73Kk08l3J81m8j13L0M75k36q0pO4r2l5J87l48
3322b18L02l03J80m6k5N9K99l5k80J23Q5l17J01k02L19j28K74k29K59p2l84M40
3344B02l36J67k30M37k79j30L4J85j24L54j84j56L39k41q6j32K11k61M3K6J07
3365e4j06K00J87k25K55p4k83J67l23J45K04J08k37k31P7L35R3j53P5m3k96J56
3387b3Q2ml9J92M9l25J24k6k23L49k25M2M91l26j00j01P2l8J0l5o7P6J66o5N8
3412A14l3L2j17l5j20M40k96j94J78j9J01P3j73O5L2j05Q9l79M43j86K60k17Q9
3435D2J29j10J56j26j95m9K6J93j29LK0N3J21q5q8J18j1k38K18Q5J3l26K98N8
$$ plain form
3459 176 61 -52 -71 104 10 79 -94 -89 14 82 133 -156 -52 185 -111 84 -11 58 2 81 -55 110 61 -140
3483 -140 -73 -147 -43 -164 -46 -163 -95 -24 22 -197 91 80 -36 162 121 38 -207 109 -189 -98 17 112 183 49
3507 49 266 293 237 17 5 195 290 -124 -237 -187 -54 43 -30 -69 -230 -57 74 -18 96 105 2 -14 24 164 -4
3532 -4 -110 274 -28 11 -101 -137 -73 95 60 111 100 -121 -141 -57 -178 -218 -29 -266 -2 -162 -112 138 73 21 90
3557 90 -100 -5 -105 96 80 47 -242 -11 18 141 -59 92 -270 -465 228 -140 34 2 -79 147 -77 70
3579 70 -106 -139 76 -76 315 47 -189 -33 -82 -173 -6 139 24 -133 17 168 -84 31 -205 -106 137 -171
3601 -171 226 82 -104 -137 101 30 85 230 -139 21 104 -14 23 -159 -219 -122 185 -274 -127 334 162 -41
3623 -41 194 66 -47 -72 -86 -35 106 112 65 -82 71 -178 -159 44 71 -97 -18 82 -115 -199 124 64 -77 103
$$ packed form
3459A76j15j13j9J75r4O9j73NJ03O8N1k89J04K37k96J95r5O9n6P9j36J65m9k01
3483a40O7p4J04j21J18j17O8P1M6k19K88j1j16J98m1q3k45L16k98R1J15R5P1j34
3507D9K17K7n6k20j2J90R5m14j13N0J33R7p3l9j61J73J31r2J14Rj03j6L8J40j68
3532dj06L84l02L9j12l6O4J68l5N1j1k21k0Q4j21m0J89k37K64j60N0K50o5n2O9
3557I0j90R5j00K01j6l3k89K31K9J23k00J51l62j95O93l68J74l2q1K26k24J47
3579G0j76l3K15j52L91k68k36J56m9r1J67J45j15j57J50J51k52J15k36R9K43l08
3601a71L97j44j86l3K38p1N5J45l69J60Q3j18L7j82o0R7L07m59J47M61j72k03
3623d1K35j28j13k5j4N1J41Om7j47J53k49J9K03K7j68P9J00j97q4L23o0j41J80
$$ plain form
3647 103 67 -159 127 49 16 39 -15 -40 -117 127 -127 -240 -58 60 -199 -240 -87 -72 190 26 45 6 92 67
3671 67 170 -11 38 -50 111 257 21 146 -3 125 -283 51 62 135 41 -82 -70 203 37 137 46 -153 -74
$$ packed form
3647A03l6k26K86p8l3K3n4k5p7K44k54j13J82J18k59m1J53J5K62j64J9l9Q6k5
3671F7J03j81M9q8J61J46k36J25j49J28m08L34J1P3r4j23J2K73j66J00r1j99P9
$$ [...]
8191a5
##END NTUPLES=NMR FID
##END=
