##TITLE=1H_SR80 Gly2
 CDCl3, 8 sc, 
 31.8.2021
##JCAMPDX= 6.0         $$ Bruker NMR JCAMP-DX V2.0
##DATA TYPE= NMR FID
##DATA CLASS= NTUPLES
##ORIGIN= UXNMR, Bruker Analytische Messtechnik GmbH
##OWNER= root
$$ XWIN-NMR		Version 3.5
$$ Tue Aug 31 11:40:22 2021 Russian Standard Time (UT+4h)  she@DPX200
##.OBSERVE FREQUENCY= 200.131506
##.OBSERVE NUCLEUS= ^1H
##.DELAY= (6, 6)
##.ACQUISITION MODE= SIMULTANEOUS
##.ACQUISITION SCHEME= undefined
##.AVERAGES= 8
##.DIGITISER RES= 18
##SPECTROMETER/DATA SYSTEM= spect
##.PULSE SEQUENCE= zg30
##.SOLVENT NAME= CDCl3
##.SHIFT REFERENCE= (INTERNAL, CDCl3, 0, 15.7039)
##AUDIT TRAIL= $$ (NUMBER, WHEN, WHO, WHERE, WHAT)
$$ ##TITLE= Audit trail, XWIN-NMR		Version 3.5
$$ ##JCAMPDX= 5.01
$$ ##ORIGIN= Bruker BioSpin GmbH
$$ ##OWNER= she
$$ F:/spectra/data/she/nmr/H-F/1/audita.txt
$$ ##AUDIT TRAIL=  $$ (NUMBER, WHEN, WHO, WHERE, WHAT)
(   1,<2021-08-31 11:39:16.79 +0400>,<she>,<DPX200>,
      <created by zg, POWCHK disabled, PULCHK disabled
       configuration hash MD5:
       00 E9 B6 7A A2 85 ED C7 34 08 36 98 17 FE 4E 26
       data hash MD5: 16K
       7E 2F DD 51 DE 1C 03 42 32 F6 A0 76 04 A9 DD 0D>)
$$ ##END=
$$ 
$$ hash MD5
$$ 78 0D 22 01 FB 67 96 D4 19 47 A6 02 E7 4A 50 F9
##$RELAX= 
##$RELAX= 
##$RELAX= 
##$RELAX= 
##$RELAX= 
##$RELAX= 
$$ Bruker specific parameters
$$ --------------------------
##$DU= <F:/spectra>
##$EXPNO= 1
##$NAME= <H-F>
##$PROCNO= 1
##$TYPE= <nmr>
##$USER= <she>
##$AMP= (0..31)
100 100 100 100 100 100 100 100 100 100 100 100 100 100 100 100 100 100 
100 100 100 100 100 100 100 100 100 100 100 100 100 100 
##$AQSEQ= 0
##$AQ_mod= 1
##$AUNM= <au_zg>
##$AUTOPOS= <>
##$BF1= 200.13
##$BF2= 200.13
##$BF3= 200.13
##$BF4= 200.13
##$BF5= 200.13
##$BF6= 200.13
##$BF7= 200.13
##$BF8= 200.13
##$BYTORDA= 1
##$CFDGTYP= 0
##$CFRGTYP= 5
##$CHEMSTR= <none>
##$CNST= (0..31)
1 1 145 1 1 1 1 1 1 1 1 1 1 1 1 1 1 1 1 1 1 1 1 1 1 1 1 1 1 1 1 1 
##$CPDPRG= <>
##$CPDPRG1= <>
##$CPDPRG2= <>
##$CPDPRG3= <>
##$CPDPRG4= <mlev>
##$CPDPRG5= <mlev>
##$CPDPRG6= <mlev>
##$CPDPRG7= <mlev>
##$CPDPRG8= <mlev>
##$CPDPRGB= <>
##$CPDPRGT= <>
##$D= (0..31)
0 1.2 0 0 0 0 0 0 0 0.06 0 0.03 0 0 0 0 0.0002 0 0 0 0 0 0 0 0 0 0 0 0 
0 0 0 
##$DATE= 1630395556
##$DBL= (0..7)
120 120 120 120 120 120 120 120 
##$DBP= (0..7)
150 150 150 150 150 150 150 150 
##$DBP07= 0
##$DBPNAM0= <>
##$DBPNAM1= <>
##$DBPNAM2= <>
##$DBPNAM3= <>
##$DBPNAM4= <>
##$DBPNAM5= <>
##$DBPNAM6= <>
##$DBPNAM7= <>
##$DBPOAL= (0..7)
0.5 0.5 0.5 0.5 0.5 0.5 0.5 0.5 
##$DBPOFFS= (0..7)
0 0 0 0 0 0 0 0 
##$DE= 6
##$DECBNUC= <off>
##$DECIM= 32
##$DECNUC= <off>
##$DECSTAT= 4
##$DIGMOD= 1
##$DIGTYP= 9
##$DL= (0..7)
0 120 120 120 120 120 120 120 
##$DP= (0..7)
150 150 150 150 150 150 150 150 
##$DP07= 0
##$DPNAME0= <>
##$DPNAME1= <>
##$DPNAME2= <>
##$DPNAME3= <>
##$DPNAME4= <>
##$DPNAME5= <>
##$DPNAME6= <>
##$DPNAME7= <>
##$DPOAL= (0..7)
0.5 0.5 0.5 0.5 0.5 0.5 0.5 0.5 
##$DPOFFS= (0..7)
0 0 0 0 0 0 0 0 
##$DQDMODE= 0
##$DR= 18
##$DS= 0
##$DSLIST= <SSSSSSSSSSSSSSS>
$$ [...]
##$SUBNAM2= <"">
##$SUBNAM3= <"">
##$SUBNAM4= <"">
##$SUBNAM5= <"">
##$SUBNAM6= <"">
##$SUBNAM7= <"">
##$SUBNAM8= <"">
##$SUBNAM9= <"">
##$SW= 20.0188882624521
##$SWIBOX= (0..15)
0 0 2 0 0 0 0 0 0 0 0 0 0 0 0 0 
##$SW_h= 4006.41025641026
##$TD= 16384
##$TD0= 1
##$TE= 0
##$TE2= 300
##$TE3= 300
##$TEG= 300
##$TL= (0..7)
0 120 120 120 120 120 120 120 
##$TP= (0..7)
150 150 150 150 150 150 150 150 
##$TP07= 0
##$TPNAME0= <>
##$TPNAME1= <>
##$TPNAME2= <>
##$TPNAME3= <>
##$TPNAME4= <>
##$TPNAME5= <>
##$TPNAME6= <>
##$TPNAME7= <>
##$TPOAL= (0..7)
0.5 0.5 0.5 0.5 0.5 0.5 0.5 0.5 
##$TPOFFS= (0..7)
0 0 0 0 0 0 0 0 
##$TUNHIN= 0
##$TUNHOUT= 0
##$TUNXOUT= 0
##$USERA1= <user>
##$USERA2= <user>
##$USERA3= <user>
##$USERA4= <user>
##$USERA5= <user>
##$V9= 5
##$VALIST= <valist>
##$VCLIST= <CCCCCCCCCCCCCCC>
##$VD= 0
##$VDLIST= <DDDDDDDDDDDDDDD>
##$VPLIST= <PPPPPPPPPPPPPPP>
##$VTLIST= <TTTTTTTTTTTTTTT>
##$WBST= 1024
##$WBSW= 4
##$XGAIN= (0..3)
0 0 0 0 
##$XL= 0
##$YL= 0
##$YMAX_a= 300871
##$YMIN_a= -290915
##$ZGOPTNS= <>
##$ZL1= 120
##$ZL2= 120
##$ZL3= 120
##$ZL4= 120
##$ABSF1= 10
##$ABSF2= 0
##$ABSG= 5
##$ABSL= 3
##$ALPHA= 0
##$AQORDER= 0
##$ASSFAC= 0
##$ASSFACI= 0
##$ASSFACX= 0
##$ASSWID= 0
##$AUNMP= <proc_1d>
##$AZFE= 0.1
##$AZFW= 0.1
##$BCFW= 1
##$BC_mod= 2
##$BYTORDP= 1
##$COROFFS= 0
##$CY= 11.3945322036743
##$DATMOD= 1
##$DC= 2
##$DFILT= <>
##$DTYPP= 0
##$F1P= 2.36226072786647
##$F2P= -0.459571619588291
##$FCOR= 0.5
##$FTSIZE= 0
##$FT_mod= 4
##$GAMMA= 1
##$GB= 0.15
##$INTBC= 1
##$INTSCL= 1
##$ISEN= 128
##$LB= 0.24
##$LEV0= 0
##$LPBIN= 0
##$MAXI= 10000
##$MC2= 0
##$MEAN= 0
##$ME_mod= 0
##$MI= 1.114404
##$NCOEF= 0
##$NC_proc= 0
##$NLEV= 6
##$NOISF1= 3.799351
##$NOISF2= 2.8
##$NSP= 1
##$NTH_PI= 0
##$NZP= 0
##$OFFSET= 15.70392
##$PC= 1
##$PHC0= -13360.34
##$PHC1= 10.40099
##$PH_mod= 1
##$PKNL= yes
##$PPARMOD= 0
##$PSCAL= 0
##$PSIGN= 0
##$REVERSE= no
##$SF= 200.130013532006
##$SI= 16384
##$SIGF1= 3
##$SIGF2= 2
##$SINO= 400
##$SIOLD= 16384
##$SREGLST= <1H.CDCl3>
##$SSB= 0
##$STSI= 0
##$STSR= 0
##$SW_p= 3612.71676300578
##$SYMM= 0
##$S_DEV= 0
##$TDeff= 0
##$TDoff= 0
##$TI= <>
##$TILT= no
##$TM1= 0
##$TM2= 0
##$TOPLEV= 0
##$USERP1= <user>
##$USERP2= <user>
##$USERP3= <user>
##$USERP4= <user>
##$USERP5= <user>
##$WDW= 1
##$XDIM= 8192
##$YMAX_p= 0
##$YMIN_p= 0
$$ End of Bruker specific parameters
$$ ---------------------------------
##NTUPLES= NMR FID
##VAR_NAME=  TIME,          FID/REAL,        FID/IMAG
##SYMBOL=    X,             R,               I
##VAR_TYPE=  INDEPENDENT,   DEPENDENT,       DEPENDENT
##VAR_FORM=  AFFN,          ASDF,            ASDF
##VAR_DIM=   8192,          8192,            8192
##UNITS=     SECONDS,       ARBITRARY UNITS, ARBITRARY UNITS
##FACTOR=    0.0002496,     1,               1
##FIRST=     0,             0,               0
##LAST=      2.0444736,     0,               0
##MIN=       0,             -290915,         0
##MAX=       2.0444736,     300871,          0
$$ Real data points
##PAGE= N=1
##DATA TABLE= (X++(R..R)), XYDATA
$$ [...]
1907B68j18l2j18L20m9P2j07J6%p6k06J84pLL21j5j1R9n3k37K9k3K02N6m1j2N
$$ 268 150 118 0 320 271 343 236 252 252 176 -30 154 147 150 471 456 445 544 491 254 283 260 462 518 477 465 470
1934D70J5k18J09k57K45J70J02j35K1n1J5q1J10o1m4K24q2k03q3Q7m6K30p5j70
$$ 470 485 267 376 119 364 534 636 501 522 471 486 405 515 454 410 634 552 349 266 353 307 537 462 292
1958B92k6K17m8O3N9k50o3m2J14k0k88R9k81L34k5J37mk62J47K09m04j9o0nK12
$$ 292 266 483 435 498 557 307 244 202 316 296 8 107 -174 160 135 272 268 6 153 362 -42 -61 -121 -126 86
1983H6J14l73J25k64K9m7R2n4Q6R8j34j05j52J99j88k32M83n0K99n89j75N92k63
$$ 86 200 -173 -48 -312 -283 -330 -238 -292 -206 -108 -242 -347 -499 -300 -488 -720 -237 -287 12 -577 -752 -160 -423
2006d23O7J07Nj00M9j58K58k79K38l40K80o0j29o0J8K30N3j4l86L76j8L65j24
$$ -423 -356 -249 -244 -344 -295 -453 -195 -474 -236 -576 -296 -356 -485 -545 -527 -297 -244 -258 -644 -268 -286 79 -45
2029d5r2n2J48l01L41K0k32K1n1R7J09j95K54M0k16M49m89L92q4l39K09j81L46
$$ -45 -137 -189 -41 -342 -1 19 -213 -192 -243 -146 -37 -232 22 62 -154 295 -194 198 114 -225 -16 -197 149
2052A49j23j18J77j03pN5K55k66L9o3K76k97J61j65N6n9M57k26Q9k23j54J65L6
$$ 149 26 -92 85 -18 -25 30 285 19 58 -5 271 -26 135 -30 26 -33 424 198 287 64 -90 75 111
2075A11j17k02L67j91P1j24O5j13L91N9J45k28P4l07l1K56m30M11J75j40k18J47
$$ 111 -6 -208 159 -32 39 -85 -20 -133 258 317 462 234 308 1 -30 226 -204 207 382 242 24 171
2097A71J79k03L8k2j46m3L23%J60j69j68L06j12j49K65J2j27J0k1k23M8Q0p8J90
$$ 171 350 147 185 163 17 -26 297 297 457 288 120 426 314 165 430 442 315 325 304 81 129 209 131 321
2121C21L21m64J94j40k5N9K60l24r6J82k01J53j49J68K03l27l3j53Q7K11q7Q5
$$ 321 642 178 372 232 207 266 526 202 106 288 87 240 91 259 462 135 102 -51 36 247 160 245
2143B45q2N0k18N3R0l90K03k20L01m3l03M6L18j75j06K54m61J89Q2O7k33J99j34
$$ 245 163 213 -5 48 138 -252 -49 -269 32 -11 -314 -268 50 -125 -231 23 -438 -249 -167 -100 -333 -134 -268
2166b68j05oo2N7J28K95k42M6jk99N4O6k53K60J3j41j69L51J25k51NL1L58j46
$$ -268 -373 -379 -441 -384 -256 39 -203 -157 -158 -457 -403 -337 -590 -330 -317 -458 -627 -276 -151 -402 -397 -366 -8 -154
2190a54q8J78j19l05L98k24J59j8K7j27K36k12j24L01j71j23K62JK72k29M9p8
$$ -154 -242 -64 -183 -488 -90 -314 -155 -173 -146 -273 -37 -249 -373 -72 -243 -366 -104 -103 169 -60 -11 -89
2212h9k00K99R4j63K50o1M1j48j88L41j27J38J05j99J34j96Nk23K80K6j37L23
$$ -89 -289 10 104 -59 191 130 171 23 -165 176 49 187 292 93 227 31 36 -187 93 119 -18 305
2234C05k31q5K05k08J37l58N88p7J5o5l1j38j35K22R4O8Q9k29j17J26l5K09m09
$$ 305 74 -11 194 -14 123 -235 353 276 291 226 195 57 -78 144 238 306 395 166 49 175 140 349 -60
2257f0J10L30k26J34J62l45n0q1R1K46n0J4K0k48P7n3N1j89J70J34j8k6j71%l10
$$ -60 50 380 154 288 450 105 55 -26 65 311 261 275 295 47 124 71 122 -67 103 237 219 193 22 22 -288
2282b88P56j86k44J6M7q8J63L1o5q4J79K15o7k42l57J48J92j67Q2R0K86k7m41
$$ -288 468 282 38 54 101 13 176 207 142 58 237 452 385 143 -214 -66 126 -41 41 131 417 390 -51
2305e1K02j07K31k5M6k04k31p2q3K95K2L7k65L30j27j41P5NM8n8q9k0j12k9L73
$$ -51 151 44 275 250 296 92 -139 -211 -294 1 23 60 -205 125 -2 -143 -68 -63 -15 -73 -162 -182 -294 -323 50
2330E0k15M01m44k95K24J93j91J18P4q2j89k0J33qn4O3r1P6r9j37J81P5K5p0m6
$$ 50 -165 236 -208 -503 -279 -86 -277 -159 -85 -167 -356 -376 -243 -251 -305 -242 -333 -257 -356 -493 -312 -237 -212 -282 -328
2355c28j25P9J73p4K6P3J86k91P9p6K49k91kM7K14l21K68r2o7J09j42J09K0r6
$$ -328 -453 -374 -201 -275 -249 -176 10 -281 -202 -278 -29 -320 -322 -275 -61 -382 -114 -206 -273 -164 -306 -197 -177 -273
2379b73M5L71M8l03k03J15p0j5J83J09J13l89K70M4K2j69J52K34j92L09k71K3
$$ -273 -228 143 191 -112 -315 -200 -270 -285 -102 7 120 -269 1 45 67 -102 50 284 92 401 130 153
2401A53k41M08o5j76O1K37k14K2k5N3j02L2p0KO7J46l9J24j99N4kj54K12j56L3
$$ 153 -88 320 255 79 140 377 163 185 160 213 111 143 73 75 142 288 249 373 174 228 226 72 284 128 161
2426A61KK35o23M36J60l66k9P4K6L38j34j47p8J92n4o2J1LM2L3j19k9J79j54P7
$$ 161 163 398 -225 211 371 5 -24 50 76 414 280 133 55 247 193 131 142 145 187 220 101 72 251 97 174
2451A74J5l61j56J46N09o3j87M05m66N0J22p9J51j19Kq9j6j2k00K63r0J02j58
$$ 174 189 -172 -328 -182 327 264 77 482 16 66 188 109 260 141 143 54 38 26 -174 89 -1 101 -57
2474e7j8M20l00L13m68K3K13M4k8k26K3J96r7k93OR0j3O6K34L6k4k63K78k78J93
$$ -57 -75 345 45 358 -110 -87 126 170 142 -84 -61 135 38 -255 -249 -159 -172 -106 128 164 140 -123 155 -123 70
2499G0k92J89K9lj08M4j17j40K64j85K88r1j81q3r2J41M08j20j57k70J93N9l52
$$ 70 -222 -33 -4 -7 -115 -71 -188 -328 -64 -249 39 -52 -233 -316 -408 -267 141 21 -136 -406 -213 -154 -506
2522e06L37P7p3J16k35n6K35J34k31J74j74j13N7N6O4j36K06l30K90l16J49L8
$$ -506 -169 -92 -165 -49 -284 -340 -105 29 -202 -28 -202 -315 -258 -202 -138 -274 -68 -398 -108 -424 -275 -237
2544b37J94J20k72N4R0k5k1J50l14K06o9J77j54L11k33j20R3K13n0k4k76K02j8
$$ -237 -43 77 -195 -141 -51 -76 -97 53 -261 -55 -124 53 -101 210 -23 -143 -50 163 113 89 -187 15 -3
2567cRk8J25R3m1N0j84P7R2N7n0J80p04N78n8j82L5j57M72J09k58l27L73j16Q0
$$ -3 6 -22 103 196 155 205 21 98 190 247 197 377 -327 251 193 11 46 -111 361 470 212 -115 258 142 222
2592B22j11J08j90J37j36kJ19Q5j14J22n3m9J41m53M70k36M9j28r9M00j55J25
$$ 222 111 219 29 166 30 28 147 232 118 240 187 138 279 -174 296 60 109 -19 -118 282 127 252
2614B52k22j65R0J95m4j3J67j7O3K6N1l64J98m88J98R9J8Q3l3j10k5J0K83m00
$$ 252 30 -135 -45 150 106 93 260 243 306 332 383 19 217 -271 -73 26 44 127 94 -16 -41 -31 252 -148
2638a48Q3j55K05J70k86R7K43k48j3J96j01k1om14N91k03J10n5O1p4J2j13mJ8
$$ -148 -65 -220 -15 155 -131 -34 209 -39 -52 144 43 22 16 -398 193 -10 100 45 106 32 44 -69 -73 -55
2662e5J59k8j54K62j3k79l4Q7J95K2m66J60K90l0k06L4J89j00k03J12p2J41Oj80
$$ -55 104 76 -78 184 171 -108 -142 -55 140 162 -304 -144 146 116 -90 -56 133 33 -170 -58 -130 11 17 -163
2686a63K46k85J37Q1j42n9J00q4R2k01j14N84n16K34L3r0J91r7j20M1M6r9qR1
$$ -163 83 -202 -65 16 -126 -185 -85 -169 -77 -278 -392 192 -324 -90 -57 -147 44 -53 -173 -132 -86 -185 -193 -102
2710a02k61L36m20o1M36l4J80j62J03r3J97m4k39M5J57j96q0M64l27o3K72j62
$$ -102 -363 -27 -447 -508 -72 -106 74 -88 15 -78 119 75 -164 -119 38 -158 -238 226 -101 -164 108 -54
2732e4r5J95Pj23J26j36o2k0J36Q7j45K60r9J15L5K8l65L12j69q3L78l31L21k02
$$ -54 -149 46 53 -70 56 -80 -142 -162 -26 61 -84 176 77 192 227 255 -110 202 33 -50 328 -3 318 116
2756A16p6j90J96K35k27L05p6k10Q8J09K1k07J45pl8q3J77j24j16J54j2j54J06
$$ 116 40 -150 46 281 54 359 283 73 161 270 291 84 229 222 184 101 278 154 38 192 180 26 132
2779A32K9k39K60j83J83j36M8R6l9j23q6N9J48j60j75J98j17K41j02m5n3Q4l1
$$ 132 161 -78 182 -1 182 46 94 190 151 28 -58 1 149 -11 -186 12 -105 136 34 -11 -64 20 -11
2802a1L08j89k16r7J64J19J08l63J85K05M2n58K92k8N8PJ7m2k65N53k35l6O2o3
$$ -11 297 108 -108 -205 -41 78 186 -177 8 213 255 -303 -11 -39 19 26 43 1 -264 289 54 18 80 17
2826A7r2o1O8J3K4o7M22k66k63K63q0k52L16j68J74rj59K22j28J54l8m17J94K92
$$ 17 -75 -136 -68 -55 -31 -98 324 58 -205 58 -22 -274 42 -126 48 39 -120 102 -26 128 90 -327 -133 159
2850A59j24k83L66k83K38nk91K84j88j35K1M28j58k01j20K78K89k68j47J57J6
$$ 159 35 -248 118 -165 73 68 -223 61 -127 -262 -241 187 29 -172 -292 -14 275 7 -140 17 33
2871C3k24R8j81J38J72l1l02J97j12K66j0j78LL38k31J25n9k58K77J92k66J17
$$ 33 -191 -93 -274 -136 36 5 -297 -100 -212 54 44 -134 -131 207 -24 101 42 -216 61 253 -13 104
2893A04j93N5O2p3J29j72N2J6P0jR8l06P2K4mj0M9N1j24K01m1J18l76J82L4k3
$$ 104 -89 -34 28 -45 84 -88 -36 -20 50 49 147 -159 -87 -63 -67 -77 -28 23 -101 100 59 177 -199 -17 17 -6
2919fJ7RO2J12j50K41l31J90k07K09j01J13J06j57J25k24J78j57lJ19J46k30Q1
$$ -6 11 20 82 194 44 285 -46 144 -63 146 45 158 264 107 232 8 186 29 26 145 291 61 142
2942A42r8k7o3O2NR6o1K9J64l75K34k29J67J6Jj20K11l7j30L34m87L30l71M05
$$ 142 44 17 -46 16 21 117 56 85 249 -126 108 -121 46 62 63 -57 154 117 -13 321 -166 164 -207 198
2966A98n11L79k14J76J41j13J46k26q6j83N02n5k81M86m66K3J66r0j85j90L07
$$ 198 -313 66 -148 28 169 56 202 -24 -110 -293 209 154 -127 359 -107 -84 82 -8 -193 -383 -76
2987g6J02o9J89l89J90j13K54q7Pl6J38J13p4o1j39J24k22K55l10O8M4p1R2J92
$$ -76 26 -43 146 -243 -53 -166 88 1 8 -28 110 223 149 88 -51 73 -149 106 -204 -136 -92 -163 -71 121
3011A21K0j57j83M31q1l05M1j43O0L10l9R1k20RP4P0l93oJ66q4J40L50l75K87
$$ 121 141 -16 -199 232 151 -154 -113 -256 -196 114 75 166 -54 -45 29 99 -294 -300 -134 -218 -78 272 -103 184
3035A84m11L47J7k93J91j8q3j36L60m53M56n6R8j97j93J05M8J5oj03M36k98P5
$$ 184 -227 120 137 -156 35 17 -66 -202 158 -295 161 105 203 6 -187 -82 -34 -19 -25 -128 308 10 85
3058H5j62k14J00L21L9j11m7J74j26k6J40k96J1J7J1J24k4kK4R3P8l81N1J32j23
$$ 85 -77 -291 -191 130 169 58 11 185 59 33 173 -123 -112 -95 -84 40 16 14 38 131 209 -172 -121 11 -112
3083a12N3L6O4j86k0K42l7J5N3p7k02J41J28j52l7O9J22J33k68P8J0J55m1Q0k13
$$ -112 -59 -23 41 -145 -165 77 40 55 108 31 -171 -30 98 -54 -91 -22 100 233 -35 43 53 208 167 247 34
3108C4Q5j3p6j16Q5J3K97k74q8l2R5J28m09L23J1l1J87l27K10p7J06q3P0q7m5
$$ 34 119 106 30 -86 -1 12 309 35 -53 -85 10 138 -271 52 63 32 219 -108 102 25 131 48 118 31 -14
3133a4K35l3K2l54K26j70K58j99Q5k75p4M11j12k8K13k43K02j45l71L38J99o5
$$ -14 221 188 210 -144 82 -88 170 -29 56 -219 -293 118 6 -22 191 -52 150 5 -366 -28 171 106
3155A06k71L46j21M7n0j62K17k06j47J81M7nJ58j33J79J9l42M95n60K08mJ8k1
$$ 106 -165 181 60 107 57 -105 112 -94 -241 -60 -13 -18 140 7 186 205 -137 358 -202 6 2 20 -1
3178ak71K52LJ22Q7k39Q4j34L25m80j12L13J04n4J18j29p5Mm0q4K67l8N4J9k64
$$ -1 -272 -20 -17 105 192 -47 37 -97 228 -252 -364 -51 53 -1 117 -12 -87 -83 -123 -207 60 22 76 95 -169
3203a69K79l68J58K05N2j26l22K73m2j16J15J57j44M32n00J54k15K26j34J18N9
$$ -169 110 -258 -100 105 157 31 -291 -18 -60 -176 -61 96 -48 384 -116 38 -177 49 -85 33 92
3224I2j12Q8j90L6J53m5k6j12j08M77n60M81k10m4K41M3j00j34N6l75L56M8q4
$$ 92 -20 68 -122 -86 67 22 -4 -116 -224 253 -307 174 -36 -80 161 204 104 -30 26 -349 7 55 -29
3247b9j71J56j87K54j41J05J01m8m7k11K36M5k6j89L13k30K41j84QJ05j27l6j39
$$ -29 -200 -44 -231 23 -118 -13 88 40 -7 -218 18 63 37 -152 161 -69 172 -12 -4 101 -26 -62 -201
3270b01K11j17jj6L7L71q1J7j35j7Kp1J45k46K07J22p9J11l74J92q4l8Q9j0J52
$$ -201 10 -107 -108 -124 -87 284 203 220 85 68 70 -1 144 -102 105 227 148 259 -115 77 -7 -45 44 34 186
3295A86j61K7rj23K33j53K03k93M01m50J91k76K14P9j73K16j51K93q2Q1m63O48
$$ 186 25 52 43 -80 153 0 203 -90 311 -139 52 -224 -10 69 -104 112 -39 254 172 253 -210 438
3317D38l46j71K85p4k83Q0K97k32k18K57p7j32P2N8j03K24J6j99K3j45J72l6R5
$$ 438 92 -79 206 132 -151 -71 226 -6 -224 33 -44 -176 -104 -46 -149 75 91 -108 -85 -230 -58 -94 1
3340AO3J25k22n0k38M19k62K44k5m9j23K85m43J53P9j38L76l57K72j42L0k51Q9
$$ 1 64 189 -33 -83 -321 98 -164 80 55 6 -117 168 -275 -122 -43 -181 195 -162 110 -32 -2 -253 -164
3363a64J98L6j45Q0l6LR5%J64n07J35J18J3j54J18J51j4NK2k40%J42j97J48lK15
$$ -164 34 70 -75 5 -31 -28 67 67 231 -276 -141 -23 -10 -164 -46 105 91 96 118 -122 -122 20 -177 -29 -32 183
3389A83k96O6J69p9k49K28j20K50k15j86M34k77J94k30K36j10Jk36K01R2n4QK47
$$ 183 -113 -47 122 43 -206 22 -98 152 -63 -249 185 -92 102 -128 108 -2 -1 -237 -36 56 2 10 257
3412B57o9j49m9L8k65K07J17P0m9j4r1q6k8KK44j77j8K29q6m5j4p5J15L1k36K67
$$ 257 188 39 -10 28 -237 -30 87 157 108 94 3 -83 -111 -109 135 -42 -60 169 83 38 24 -51 64 95 -141 126
3438A26k87Q7j6K0L3Q9o2K06l00j94K67%J6R8K5k12l2L82l1j65O2j1Ol97L57o8
$$ 126 -161 -74 -90 -70 -37 52 -10 196 -104 -298 -31 -31 -15 83 108 -104 -136 246 215 50 112 101 107 -290 67 -1
3464aj05p5J14O3J06O8k74O2J09Mp5J72k06j1M37o32L38K7j49j8O5k07O7J47P4
$$ -1 -106 -181 -67 -4 102 170 -104 -42 67 71 -4 168 -38 -49 388 -244 94 121 -28 -46 19 -188 -121 26 100
3489A00n5J99l66L76j25j33j00O3j17M3K69r3k26K47K07k93l49M96l40j09L40
$$ 100 45 244 -122 254 129 -4 -104 -41 -158 -115 154 61 -165 82 289 -4 -353 143 -197 -306 34
3510C4j48OM9j51J83P1o4q1o2L11m5j58n5K45M0l38J47j4N4m1l5j7j3J03k01L39
$$ 34 -114 -108 -59 -210 -27 44 -20 -101 -163 148 103 -55 -110 135 175 -163 -16 -30 24 -17 -52 -69 -82 21 -180 159
3536A59n6j71OJ67q6j96K65k09J43J1j33J79KL3n3k09L5R3J88j68j48Q0j83P9
$$ 159 103 -68 -62 105 19 -177 88 -121 22 33 -100 79 81 114 61 -148 -113 -20 168 0 -148 -68 -251 -172
3560a72J40Jj68N0J93j34L21k5k01l4m7q3k8J38j20k8K92m01L47j26L7n6p8K6
$$ -172 -32 -31 -199 -149 44 -90 231 206 5 -29 -76 -159 -187 -49 -169 -197 95 -306 41 -85 -48 -104 -182 -156
3584a56K7K11k36j2J02N4j27J13K7j46Q6j43M7j10M09l54j17M24n3R4k10J80k
$$ -156 -129 82 -154 -166 -64 -10 -137 -24 3 -143 -57 -200 -153 -263 146 -208 -325 99 46 140 -70 110 108
3607A08j29k9J93j93k08M48Pq2o2j87K49k73J37K0N5r0K54l43L9K20m83M50J33
$$ 108 -21 -50 143 -50 -258 190 197 115 53 -134 115 -158 -21 -1 54 -36 218 -125 -86 134 -349 101 234
3630B34q4J3O1m52J67j65K56l90L12N6J35r8m0N3k09J82N0p0j86N9K42l26K57
$$ 234 150 163 224 -228 -61 -226 30 -360 -48 8 143 45 5 58 -151 31 81 11 -175 -116 126 -200 57
3653E7j39m0L32k75L17n69M78j15K9P9k0l06L46j37m19M48lj26J03k57lL16j33
$$ 57 -82 -122 210 -65 252 -317 161 46 75 154 134 -172 174 37 -382 66 63 -63 40 -217 -220 96 -37
3676c7J15j78J63k73J81l3%nr6n8J09P4J43j63J3R0j21p2J53R9k28N5R8j62j5
$$ -37 78 -100 63 -210 -29 -62 -62 -67 -163 -221 -112 -38 105 -58 -45 45 -76 -148 5 104 -124 -69 29 -133 -148
3701a48K34k27L01j55J32l43K82K2j01j4O5l9o9j02J85P0l2P1j57J6J88p9o2j35
$$ -148 86 -141 160 5 137 -206 76 98 -3 -17 48 9 -60 -162 23 93 61 132 -25 -9 179 100 38 -97
3725i7J21n9K42k15Q7k13J68J78k28K4K51m58K42R8r4L7K17l39m8l6J07k56J77
$$ -97 24 -35 207 -8 79 -134 34 212 -16 8 259 -199 43 141 47 84 301 -38 -86 -122 -15 -271 -94
3748i4o5L54l54J26K68r8k46J55m6j32n0J03m6Q6K39l34J64R6Nj39J98nl2P2l20
$$ -94 -159 195 -159 -33 235 137 -109 46 0 -132 -182 -79 -125 -39 200 -134 30 126 131 -8 190 185 153 225 -95
3773i5k4Q0j17J59M1J26k98J75J06l27K89n27O10j96OK84n52J08L1J93J19k52
$$ -95 -119 -39 -156 3 44 170 -128 47 153 -174 115 -412 198 2 8 292 -260 -152 -121 72 191 -61
3795f1K54p9j12K9K09k31j76L19k01J03j15j4j54J26M93m97Q0L65j80O6m00L27
$$ -61 193 114 2 31 240 9 -167 152 -49 54 -61 -75 -229 -103 390 -107 -27 338 158 224 -176 151
3817A51j29J77j58j06J48K31m09Q4N8Pj68L93m65j73K54J78J93l42p8M5Q6l2l0
$$ 151 22 199 41 -65 83 314 -95 -11 47 54 -114 279 -186 -359 -105 73 266 -76 -154 -109 -23 -55 -85
3840h5L31m62K41k61K81m2J04j85k3J7o9L37N2k03J0J74m00J57k03J22lMJ38L6
$$ -85 246 -216 25 -236 45 3 107 -78 -101 -84 -153 184 236 33 43 217 -183 -26 -229 -107 -110 -106 32 68
3864F8J1J12m70O30m6l85j23Q4Q5k57K34l5K30k33l6K38q1L3J67m10O1M71k46
$$ 68 79 191 -279 351 305 -80 -203 -119 -34 -291 -57 -92 138 -95 -131 107 26 59 226 -184 -123 348 102
3887A02k29J73Q4l5k95L74k92L5J12O0K53k80j03J29J10k90MQ3M6j79K17N5K84
$$ 102 -127 46 130 95 -200 174 -118 -83 29 89 342 62 -41 88 198 -92 -88 -5 41 -138 79 134 418
3910D18o38K19Q8l23M35k8j61k02Q1K04j18J69m5j05J32j25J7k24K54k50K37J04
$$ 418 -220 -1 87 -236 199 171 10 -192 -111 93 -25 144 99 -6 126 1 18 -206 48 -202 35 139
3932A39k05K8m1K96k77j27L01j00r8L91l31L0p5J36J52j07m6j31m7J22l3J08m10
$$ 139 -66 -38 -79 217 -60 -187 114 14 -84 307 -24 6 -69 67 219 112 66 -65 -112 10 -23 85 -325
3955c25R5J92k6Q5KJ2J26P4k38L6j52O0K90k57o5J23j55P8K86k31p9O9j82L21
$$ -325 -230 -38 -64 21 23 35 161 235 -3 33 -119 -59 231 -26 -91 32 -123 -45 241 10 -69 0 -182 139
3979A39n30M64k19K79j99M5J70j67PN1j95R4p3J17j32L04p7j38r9L08k76J7K65
$$ 139 -391 73 -146 133 -66 -21 149 -18 -11 40 -155 -61 -134 -17 -149 155 78 -60 -159 149 -127 -110 155
4002A55j73j6J09k09n2J40l79K02L49k97J90n1N7j91N3J0R0K10j39J1J07j1p5
$$ 155 -18 -34 75 -134 -186 -46 -425 -223 126 -171 19 -32 25 -166 -113 -103 -13 197 58 69 176 165 90
4025I0j26O3k26PK06q2J94j19j56o5L70k75o5J49J95l16K25K2q8N2j17j37J93
$$ 90 -36 27 -199 -192 14 -68 126 7 -149 -214 156 -119 -184 -35 160 -156 69 91 3 55 -62 -199 -6
4048fl00K75J30j64N8M1K50l37j79J91M5K42m5m44L75k59P7O5p3L07l05J04J91
$$ -6 -306 -31 99 -65 -7 34 284 -53 -232 -41 4 246 201 -243 132 -127 -50 15 -58 249 -56 48 239
4071B39l78L96l05k13L51j06L04j79l9P5j61K56k47q7O6j24J62k43JK23j75R1
$$ 239 -139 257 -48 -261 90 -16 288 109 70 145 -16 240 -7 -94 -28 -152 10 -233 -232 -9 -184 -93
4093i3L49j68j28J8j77J63O4K14l41L8J13J8j30j82L46l09K52m8J65k33J6J71
$$ -93 256 88 -40 -22 -199 -36 28 242 -99 -61 52 70 -60 -242 104 -205 47 -1 164 -69 -53 118
4115A18k80K22J87o0l31J76r7L32j65J52j53l78L27l9K06n0k78M7RJ07k28K55
$$ 118 -162 60 247 187 -144 32 -65 267 102 254 101 -277 50 11 217 167 -111 -64 -55 52 -176 79
4137G9l16L53j43J70m09J30J28l5L38l67p8J4K88J91m32q8K35J17l18J99K55j93
$$ 79 -237 116 -27 143 -266 -136 -8 -43 295 -72 -150 -136 152 343 -89 -177 58 175 -143 56 311 118
4159A18o1Mj72j66L71j4N0m81N77l32K03j85k4J07j8LQ4l19K95J02j36J22N5j16
$$ 118 57 61 -111 -277 94 80 130 -351 226 -106 97 -88 -112 -5 -23 -20 64 -255 40 142 6 128 183 67
4183F7j30JR3J9J60j70j60J39O7j55K1O8R7k25J36j00j5K72l97K99k82L32j44
$$ 67 -63 -62 31 50 210 40 -120 19 86 -69 -48 20 117 -108 28 -72 -87 185 -212 87 -195 137 -7
4206gL7K98j83J20n12J23o2JN66n39K31O0o3o1J64j44Q3k2K9L5k63K42m5k22L55
$$ -7 30 328 145 265 -247 -124 -186 -185 381 -158 73 133 70 9 173 29 112 90 119 154 -109 133 88 -134 221
4231B21l12K0N1j95J8M9J38q9O4J40j70j5N4j56J32l6l1M0j3K73k99K82M1kN6
$$ 221 -91 -71 -20 -215 -197 -148 -10 -99 -35 105 -65 -80 -26 -182 -50 -86 -117 -77 -90 183 -116 166 207 205 261
4256B61k88k62K80KK8j2q4K17n4k09M7r7R6L51l89K29j83J42r4K2l6J09j37m0
$$ 261 -27 -289 -9 -7 21 9 -75 142 88 -121 -74 -171 -75 276 -113 116 -67 75 -19 3 -33 76 -61 -101
4280a01P8m1L1N1k11P1K78j39n0Pj71j9M21M0j64L3n7o0L5q4K27m21J05K34O6
$$ -101 -23 -64 -33 18 -193 -122 156 17 -33 -26 -197 -216 205 245 81 114 57 -3 32 -52 175 -246 -141 93 159
4305A59k67J53K2j76J17j6j03jL77j27p1k38J27J02l2j70J04o1j21K01j21Q6M9
$$ 159 -108 45 67 -109 8 -8 -111 -112 265 138 67 -171 -44 58 26 -144 -40 -101 -222 -21 -142 -56 -7
4328gM7N1l29J22K0p1K53j28O7j79J47KM0J21k92K0K05j29k6K96l39O7M1K3J66
$$ -7 40 91 -238 -116 -96 -167 86 -42 25 -154 -7 -5 35 156 -136 -116 89 -40 -66 230 -109 -42 -1 22 188
4353A88q1k73K62l68L19J00k63j48K04K7K35l94K80m6J33m05J84L62m31OL12k18
$$ 188 107 -166 96 -272 47 147 -116 -264 -60 -33 202 -192 88 42 175 -230 -46 316 -115 -109 203 -15
4375a5j56J55J92j33o7K30l02L67j80j71o6K48l20M02Q2j82j43K18r5k40jj0J18
$$ -15 -171 -16 176 43 -24 206 -96 271 91 -80 -146 102 -218 184 266 84 -59 159 64 -176 -177 -187 -69
4398f9q3K2K80j10R6k78k33N27k20P5J36j45k55K18J17k74L9o8K04j47M03k75
$$ -69 -152 -130 150 40 136 -142 -375 152 -68 7 143 -2 -257 -39 78 -196 -157 -225 -21 -168 235 -40
4420d0q6K15m8j40m1J16J60O9k34J87J23k74j38P6J14j70J82l11O7J45l6K24k04
$$ -40 -126 89 41 -99 -140 -24 136 205 -29 158 281 7 -131 -55 59 -111 71 -240 -173 -28 -64 160 -44
4443d4L4k3K04j83M4J12j83K42p1Pk14M7j17N41K8l54l71L53q4p1K40N5j94j43
$$ -44 -10 -33 171 -12 32 144 -39 203 132 139 -75 -28 -145 396 424 70 -301 52 -32 -103 137 192 -2 -145
4467a45J66L2j52J18K3k02L62k31ML2r5p1M63n30K40k8J08j5k6j09j31J51m9K0
$$ -145 21 53 -99 19 42 -160 202 -29 -25 7 -88 -159 304 -226 14 -14 94 79 53 -56 -187 -36 -85 -65
4491f5J64j04j61O2J37O4K8l9K8j28K3J03j53J0o8J22j4j24K47q6q0K44l92K26
$$ -65 99 -5 -166 -104 33 97 125 86 114 -14 9 112 -41 -31 -99 23 9 -115 132 46 -34 210 -182 44
4515D4j18J58j05j7J31L2j68J94l4j14k01J47k41j26K82K56j39K95k59Q4l41L42
$$ 44 -74 84 -21 -38 93 125 -43 151 117 3 -198 -51 -292 -418 -136 120 -19 276 17 101 -240 102
4537A02J59l85K81m4L5m16K77N6j0M0j72j54L97p0m5N4j76j63lL52K41m55R4N4
$$ 102 261 -124 157 113 148 -268 9 65 55 95 -77 -231 166 96 51 105 -71 -234 -237 115 356 -99 -5 49
4561D9L4k44M57j73k86M29k02N1L3k43J0r2O4M03l33J18k29J60J91m21N46l29
$$ 49 83 -161 296 123 -163 266 64 115 148 -95 -85 -177 -113 290 -43 75 -154 6 197 -224 322 -7
4583gn2j50J94J41j25j65j51K53J45l82K99K60j93N7k77J76k47K03J51l24J49
$$ -7 -59 -209 -15 126 1 -164 -315 -62 83 -299 0 260 67 124 -153 23 -224 -21 130 -194 -45
4604d5K6J10j82L46m54P0J31K08j50l5k13J95k99K59n3J08J6K05k79l1O6J99n0
$$ -45 -19 91 -91 255 -199 -129 2 210 60 25 -188 7 -292 -33 -86 22 38 243 -36 -67 -1 198 148
4627A48l20K04j14J86K5k07P9q3J34q3J47J50l82K45j86J15J19m9r6j59M0Q2r8
$$ 148 -172 32 -82 104 129 -78 1 -82 52 -31 116 266 -116 129 -57 58 177 128 32 -127 -87 -5 -103
4650a03j51M63n4k16J21l5J06j63M3N3o4j77Q7K67j32J35j68K7j98NL30om31J62
$$ -103 -254 209 155 -61 60 25 131 -32 11 64 0 -177 -90 177 45 180 12 39 -159 -154 176 170 -261 -99
4674i9j2J03Q3j39J56P3o7O1j70j20K46nn19K36K15L16m26N5j02j7N4P3Q6k1m1
$$ -99 -111 -8 75 -64 92 165 98 159 -11 -131 115 110 -409 -173 42 358 -68 -13 -115 -132 -78 -5 81 60 19
4699A9J10K03k67p8o2L01k99L36j74j84R1k64M4J51J5k3K89k35k4K39m21R9O5
$$ 19 129 332 65 -13 -75 226 -73 263 89 -95 -4 -268 -224 -73 -58 -81 208 -27 -51 188 -233 -134 -69
4722f9m0P2lJR9j50J60j05j06L60k25K0l2J2K13q3k17J53p9k3J18J10k47K07Q5
$$ -69 -109 -37 -40 -39 60 -90 70 -35 -141 219 -6 14 -18 -6 207 124 -93 60 -19 -42 76 186 -61 146 231
4747B31k27R6j30k82M50J7k40K68k35J20j45K7J3j89Q4L4J16J8j97K78J1q9K47
$$ 231 4 100 -30 -312 138 155 -85 183 -52 68 -77 -50 -37 -226 -142 -108 8 26 -171 107 118 29 276
4770B76k93J14M8q5j25j1K46l50K34o4m7j70J06m2K16r9L7K4l10M26j14k23J53
$$ 276 -17 97 145 60 -65 -76 170 -180 54 -10 -57 -227 -121 -163 53 -46 -9 15 -295 131 17 -206 -53
4793e3J93J05J35k83k55J31r4n4Q2M85k20K19k32k68J68j30m1K42l42J86J97k70
$$ -53 140 245 380 97 -158 -27 -121 -175 -93 392 172 391 159 -109 59 -71 -112 130 -212 -26 171 -99
4815i9J11K0j57K39k83J0K0P1R3q8q1K82K5j42k18J49J32k77L92p8l43L35o5M2
$$ -99 12 32 -125 114 -169 -159 -139 -68 25 -63 -144 138 163 21 -197 -48 84 -193 199 121 -222 113 48 90
4839I0P2m8k18K5Q4J04o0k23J76m9k76K63k3k4r4N7K98j86Rmk59K26l64M31j16
$$ 90 162 114 -104 -79 5 109 49 -174 2 -47 -323 -60 -83 -107 -201 -144 154 -32 -23 -27 -286 -60 -424 7 -109
4864a09J22j46j05J43Mj44J85L24j58l3j29j11J10l55L18k78K55K46j22n5j53
$$ -109 13 -133 -238 -95 -91 -235 -50 274 116 83 -46 -157 -47 -402 -84 -362 -107 139 17 -38 -191
4885a91K32l0o5j73P0R0r9O4Q3j37J94j01L58l03p7n5j08K12K53l48J61M78o74
$$ -191 41 11 -54 -227 -157 -67 -166 -102 -19 -156 38 -63 295 -8 -85 -140 -248 -36 217 -131 30 508 -166
4908a66O7K06J70m07R5J07k64R2r6K44R6j86k4J67m5j51L4L17l39J11l16K39l9
$$ -166 -99 107 277 -130 -35 72 -192 -100 -196 48 144 -42 -66 101 56 -95 -61 256 -83 28 -288 -49 -88
4931h8J36k75K32r8J19PN5Jj8j51P8J30k36K17J18l04K4P0K5K1j51l4M6r8K05
$$ -88 48 -227 5 -93 26 33 88 89 71 -80 -2 128 -108 109 227 -77 -53 17 42 63 -88 -122 -76 -174 31
4956C1j88M12m66J77J5J3R6k90P6J70k1J66m7l20J11q8M39j97k21R9mJ31q4P2
$$ 31 -157 255 -211 -34 -19 -6 90 -200 -124 46 25 191 144 -176 -65 -153 286 89 -132 -33 -37 94 10 82
4980H2j19L7q7J42K32m80J78O2r8j49QK60K44l74K45l20k24L31K1l7J0J01j49
$$ 82 -37 0 -87 55 287 -193 -15 47 -51 -200 -192 68 312 -62 183 -137 -361 -30 -9 -46 -36 65 -84
5003h4K56k3m9j11L00m40J2J06K11j27k02K18o3RQ4J08j99j20j25J10J76j76M73
$$ -84 172 149 100 -11 289 -151 -139 -33 178 51 -151 67 4 13 97 205 6 -114 -239 -129 47 -129 344
5026C44m09J87L5k89p2L18J4o8J8l7j17O5l4L57k37j46J61k32J22L6M1j34K43
$$ 344 -65 122 157 -132 -204 114 128 60 78 41 -76 -11 -45 312 75 -71 90 -142 -20 16 57 -77 166
5049A66k50K6R8Q3j07P0k10p1rJ56j5p7p2J27L0pm9P4j4j17J98j04K55j95ql3
$$ 166 -84 -58 40 123 16 86 -124 -195 -204 -48 -63 -140 -212 -85 -55 -62 -111 -37 -51 -168 30 -74 181 -14 -22 -55
5075e5j00J32R7J7j3k14J30k31m2K89k45M58l05J14k54rK36l9O2n9O4Q3j0m40
$$ -55 -155 -23 74 91 78 -136 -6 -237 -279 10 -235 223 -82 32 -222 -231 5 -34 28 -31 33 116 106 -334
5099c34L32J4P2j72K38l9O6M1k59p4J98j24K36N0k88j29K85J4k07K0J49j02N8
$$ -334 -2 12 84 -88 150 111 177 218 -41 -115 83 -41 195 245 -43 -172 113 127 -80 -60 89 -13 45
5122D5K83k33m7kj34PK06m12K83K1l2k85K34K22j37P3j9pk63L47k23q3K97Ql02
$$ 45 328 95 48 46 -88 -81 125 -287 -4 17 -15 -300 -66 156 19 92 73 66 -197 150 -73 -156 141 149 -153
5147a53L96j33j35P6j77K21J11m41K35o8J83l84N29l78K47N4j59K06k90N8k05
$$ -153 243 110 -25 51 -126 95 206 -235 0 -68 115 -269 260 -118 129 183 24 230 -60 -2 -207
5168b07mJ05j1j42K04N0j7L9J31K0k15k36L02O2r8j72J83K33o6q8k59K48Q2k59
$$ -207 -211 -106 -117 -259 -55 -5 -22 17 148 168 -47 -283 19 81 -17 -189 -6 227 161 73 -186 62 144 -115
5192a15J04j70J91n8l6K5j31K94k67K42j74m8J19p3L05j78K0j39K27l9j64K76
$$ -115 -11 -181 10 -48 -84 -59 -190 104 -163 79 -95 -143 -24 -97 208 30 50 -89 138 99 -65 211
5214B11Qj56m4j03M1j08K83k2q4k7J57l66J56J18O4o6j16J36o1j90O8K18P2m4
$$ 211 219 63 19 -84 -43 -151 132 110 26 -1 156 -210 -54 64 128 62 -54 82 21 -169 -101 117 189 145
5238A45j84K9R5k51J1J47l7j9L5j28L76l30J50l01K48L5r4J07L8l6k3J63k18P0
$$ 145 -39 -10 85 -166 -155 -8 -45 -64 -29 -157 219 -111 39 -262 -14 21 -73 34 72 36 13 176 -42 28
5262B8p1k76M26l47L61j79j69M29k26J17l3J27k34J17Q2Jj54n2j31J68l51L21
$$ 28 -43 -319 107 -240 121 -58 -227 202 -24 93 60 187 -47 70 152 153 -1 -53 -184 -16 -367 -46
5284d6J1j13J81%p2J45J6j20p0J9L00j73J08m1k15K39k45jN8j17J63j10L31l81
$$ -46 -35 -148 33 33 -39 106 122 2 -68 -49 251 78 186 145 -70 169 -76 -77 -19 -136 27 -83 248 -133
5308a33K95N4j89p5n0R3o0J93N2k52K95k04R4l9L2o6k03J46o6L08k10n7J20L1
$$ -133 162 216 27 -48 -98 -5 -65 128 180 -72 223 19 113 74 106 40 -163 -17 -83 225 15 -42 78 109
5332A09j49K4r6K47j42n5J47j39O1J56Nk69J3o9K66j79L1M1K09j10l4l9k71K58
$$ 109 -40 -16 -112 135 -7 -62 85 -54 7 163 168 -101 -88 -157 109 -70 -39 2 211 101 67 28 -243 15
5356A5k7r9N8J03O9j0k23J64j48O2J68r0l8j01k9L8N8r2J0J16k5K86l51P8n2J16
$$ 15 -12 -111 -53 50 119 109 -114 50 -98 -36 132 42 4 -97 -126 -88 -30 -122 -112 4 -21 265 -86 -8 -60 56
5382E6k89J57J54k90J36K0R5K16m85P8j20N59k41j58O5N6Q2O9l4m1j44J33j61
$$ 56 -233 -76 78 -212 -76 -56 39 255 -230 -152 -272 287 46 -112 -47 9 91 160 126 85 -59 74 -87
5405h7K07nJ55L7l78j6Oj04N1M03m63J98l8l4K99m23J14L39n57J10K44k03O0K10
$$ -87 120 115 270 307 -71 -87 -81 -185 -134 269 -194 4 -34 -68 231 -192 -78 261 -296 -186 58 -145 -85 125
5429A25j10k5m0P0r7p8J93n0K44k10K5K0k24N6K76k76J17j11K32k06J71R7k90
$$ 125 15 -10 -50 20 -77 -155 38 -12 232 22 47 67 -157 -101 175 -101 16 -95 137 -69 102 199 -91
5452i1J67q1K61m28J11j64K39R5j82J82k04L99k63j35m1J62K14k77j31J3r0K86
$$ -91 76 -5 256 -172 -61 -225 14 109 -73 109 -95 304 41 -94 -135 27 241 -36 -167 -154 -244 42
5474D2l4K34m14L62k96m7K76j37j52J46J47l02k8M30n27O69m09R3l8nL28m32J41
$$ 42 8 242 -172 190 -106 -153 123 -14 -166 -20 127 -175 -203 227 -300 369 -40 53 15 10 338 -94 47
5497D7o7RJ86M3j00j16j40L73j97Kk63M32k15k22K66K28o1l54J67n9N6J3o5j04
$$ 47 -20 -11 175 218 118 2 -138 235 38 40 -223 209 -6 -228 38 266 205 -149 18 -41 15 28 -37 -141
5521a41K92J63l23l1j16K25k03J25k0R5J06j87K63k43l8j23L36j11j66m9J26K15
$$ -141 151 314 -9 -40 -156 69 -134 -9 -29 66 172 -15 248 5 -33 -156 180 69 -97 -146 -20 195
5543A95J15k33j63o6Q1R4j59L10kl94K20P0N1l26K50m0j05K36k22J82j23J92J6
$$ 195 310 77 -86 -152 -71 23 -136 174 172 -222 -2 68 119 -207 43 3 -102 134 -88 94 -29 163 179
5566A79l45L96n55J10M23k06K15k67J11m1r5J88O8j13k05J42K35j82N6P0j38J62
$$ 179 -166 230 -325 -215 208 2 217 -50 61 20 -75 113 181 68 -137 5 240 58 114 184 46 208
5588B08n9j96J30q4p4J88j68J98M7l00L40k48J81q0k42N4R4K31k5j91j2K5r0o2
$$ 208 149 -47 83 -1 -75 113 -55 143 190 -110 230 -18 163 83 -159 -105 -11 220 195 4 -8 17 -73 -135
5612a35K14K2j4N8k51J16J02r7L03n10K60q0J0j32J02p0J51j50l3K88l9O7L9l17
$$ -135 79 101 87 145 -106 10 112 15 318 -192 68 -12 -2 -134 -32 -102 49 -101 -134 154 115 182 221 -96
5636i6K45k2m40L41L8r9N8j27K49k75J97j4k56K67j84j82O87m52j25K98L7p9n3
$$ -96 149 127 -313 28 66 -33 25 -102 147 -128 69 55 -201 66 -118 -300 387 -65 -190 108 145 66 13
5659A3r3J67k30J22k3j71K40l0l6O9o5J68j80j02n4K63r5k26m3L76l53K34p4J83
$$ 13 -80 87 -143 -21 -44 -215 25 -5 -41 28 -37 131 -49 -151 -205 58 -37 -263 -306 70 -283 -49 -123 60
5683F0J36l78K51j02PP3N1J1k42K03Pl19L40J55l17K44k43j75L91j78k66M58j92
$$ 60 196 -182 69 -33 -26 47 98 109 -133 70 77 -242 98 253 -64 180 -63 -238 153 -25 -291 167 -25
5706b5K4L00l00O1n8MJ61k08p7M5m4J70K95k34k81K04J47k54O6M7j78J61m6P3
$$ -25 -1 299 -1 60 2 6 167 -41 -118 -73 -117 53 348 114 -167 37 184 -70 -4 43 -135 26 -20 53
5730E3P9p1q4j25J42K69k63j6J91l84J75K55j41Q3k59J66j83J25j16K67o1K1j04
$$ 53 132 61 -23 -148 -6 263 0 -16 175 -209 -34 221 80 163 -96 70 -113 12 -104 163 102 123 19
5753A9n9M3o7k06K11N9J24K20m29K20L5o0n1l26J09M4K80m32M06j52j40M9J67
$$ 19 -40 3 -64 -270 -59 0 124 344 -85 135 170 110 59 -267 -158 -114 166 -266 140 -12 -152 -103 64
5776F4j1j78K43p6J32kj90J26j20j91J12j25L7Q7K38j18k15K63j83M7K7L5o0m3
$$ 64 53 -125 118 42 174 172 -18 108 -12 -203 -91 -216 -179 -92 146 28 -187 76 -107 -60 -33 2 -58 -101
5800a01k9L17j29J17j04k21J63j30R4k8L19k84K97k19K3k41K19j50R2J25l93K21
$$ -101 -130 187 58 175 71 -150 13 -117 -23 -51 268 -16 281 62 85 -156 63 -87 5 130 -263 -42
5822d2N2k4j5k73K05J1L20k23j84K08j6K23r3j26j49J88R7l03K97j60P4m98K77
$$ -42 10 -14 -29 -302 -97 -86 234 11 -173 35 19 242 149 23 -126 62 159 -144 153 -7 67 -431 -154
5845a54L44k06J47l83L21k39K10J36l57K66m37J79L0J11l2K13l51K44K10k89j18
$$ -154 190 -16 131 -252 69 -170 40 176 -181 85 -352 -173 -143 -32 -64 149 -202 42 252 -37 -155
5866a55R4K15j08k25j1j0M63j98O2j27J61l68K15J11k70J57Oo7l2K9n5J40M8k04
$$ -155 -61 154 46 -179 -190 -200 263 65 127 0 161 -207 8 119 -151 6 12 -55 -87 -58 -113 27 75 -129
5890a29J9J61Pj61J59k02J87k50K62q7q3R6o4L14o5k03j03J11o4j58J32J29M4
$$ -129 -110 51 58 -103 56 -146 41 -209 53 -34 -117 -21 -85 229 164 -39 -142 -31 -95 -253 -121 8 52
5913E2j5J50q7Q0j39N4K08k14n3N6l53M87m53L36k08O6K09r1m9j2K80k66J26J9
$$ 52 37 187 100 180 41 95 303 89 36 92 -261 226 -227 109 -99 -33 176 85 36 24 304 38 164 183
5937A83qj33J18j35Q8j0J92l89J85K8j12m11N22n0M1M5o3j89J84J50k54j76K26
$$ 183 175 42 160 25 113 103 295 -94 91 119 7 -404 118 68 109 154 91 -98 86 236 -18 -194 32
5960C2j0N4q7q2J75oj22k20J73J5k5K3N1K82m11K80j64J82j84L5k7j24L14o5K95
$$ 32 22 76 -11 -93 82 76 -46 -266 -93 -78 -103 -80 -29 253 -158 122 -42 140 -44 -9 -36 -160 154 89 384
5985C84k88n1j03J36l20J90J68k72L82m0j46j41R2L07m47K89k39J01J81j43j61
$$ 384 96 45 -58 78 -242 -52 116 -156 226 186 40 -101 -9 298 -149 140 -99 2 183 40 -121
6006a21J51J9P4l15L47q5o2k43L45q7j51L7J93j86J32N8j41K31n5j19j59Q9J6
$$ -121 30 49 123 -192 155 70 8 -235 110 23 -128 -91 102 -84 48 106 -35 196 141 22 -137 -48 -32
6029c2k23J76J00L9j79k2K25Rj71J86k37K4J80o5J84p1k27J98l15q6L29o5J02
$$ -32 -255 -79 21 60 -119 -141 84 93 -78 108 -129 -105 75 10 194 123 -104 94 -221 -307 22 -43 59
6052E9l8O9K8j93nj38K63k07K05p5l7O6o1L38j77J37l31J48j44J4r2L30j45o0
$$ 59 21 90 118 -75 -80 -218 45 -162 43 -32 -69 -3 -64 274 97 234 -97 51 -93 -79 -171 159 14 -46
6076d6O9j21Q5k47J30O6K03j67k4j4J65o3p1Q9J29j23k15J40j46J35J45k23K30
$$ -46 23 -98 -13 -260 -130 -64 139 -28 -52 -66 99 36 -35 54 183 60 -155 -15 -161 -26 119 -104 126
6099A26k09R0k62N11J1m89J79j25J45J40J03l24J93j1n7O1j35K67k87J27j31J25
$$ 126 -83 7 -255 256 267 -222 -43 -168 -23 117 220 -104 89 78 21 82 -53 214 -73 54 -77 48
6121D8j07j14Q5K02P8k28J79k85K75j58K63k86n7K44J4k39k30K31L22k27J60j82
$$ 48 -59 -173 -88 114 192 -36 143 -142 133 -25 238 -48 -105 139 153 -86 -316 -85 237 10 170 -12
6143a2l6R3k4p6K02j62k73J01J90j14J41j12J77k7j82P5J5K0J02l1l14K35O9j57
$$ -12 -48 45 21 -55 147 -15 -288 -187 3 -111 30 -82 95 68 -114 -39 -24 -4 98 67 -247 -12 57 -100
6167a00j52L48k23K87p6R2j96M5j81M4K46Lj77j52L19k08J40O4J65k24J39n0k05
$$ -100 -252 96 -127 160 84 176 -20 25 -156 -112 134 137 -40 -192 127 -81 59 123 288 64 203 153 -52
6190e2M2k5j0K41j13j18K7j11K23l21K93M6j71J15rj24K27q0k43N5L06j58L2J88
$$ -52 -10 -35 -45 196 83 -35 -8 -119 104 -217 76 122 -49 66 57 -67 160 80 -163 -108 198 40 72 260
6214B60m71O3L90k48J22L1j82J04j78O8J9O9P8p8j75M6p8p4J95n5%J04j50M9J62
$$ 260 -211 -148 242 -6 116 147 -35 69 -109 -41 -22 47 125 47 -128 -82 -160 -234 -39 -94 -94 10 -140 -91 71
6239G1j29j42K53m9J01K7j62J14j82K15N5j79jQ2o4q9j7M2J96j62L3Q0Pj29P9
$$ 71 -58 -200 53 4 105 132 -30 84 -98 117 172 -7 -8 74 10 -79 -96 -54 142 -20 13 93 100 -29 50
6264E0o3jNk29J47j99L69J99j81q6q0O1K7J20j86K15L7k11j20K24R0M2l03K7n
$$ 50 -13 -14 -9 -238 -91 -290 79 278 97 11 -69 -8 19 139 -47 168 205 -6 -126 98 188 230 -73 -46 -51
6289e1R5N7k36J56N9K36m51L23J2j27j15K88l16p0K57j35M2J42r0l53L23j58L78
$$ -51 44 101 -135 21 80 316 -135 188 200 73 -42 246 -70 -140 117 -18 24 166 76 -277 46 -112 266
6312B66j55k50K35K45j70l38M49j83j63J07P4j17p2K32k76r3K42J73j50j10L2
$$ 266 111 -139 96 341 171 -167 282 99 -64 43 117 0 -72 160 -116 -209 33 206 56 -54 -22
6333b2L48m76K50j3j1j69M9P0J63o3k63J65K2j34M0r6J31j91J99K5M0J09n08O4
$$ -22 326 -150 100 87 76 -93 -44 26 189 126 -137 28 50 -84 -44 -140 -9 -200 -1 24 64 173 -335 -271
6357b71K09k9P2L04l94J68j57K6K39j23k48J38P8N4k93K93j35J51l16L32j94K33
$$ -271 -62 -91 -19 285 -109 59 -98 -72 167 44 -204 -66 12 66 -227 66 -69 82 -234 98 -96 137
6379A37o3j65K66j52n0L3O3j51P1k35L85k62J42r8J80k7p2j33J11p8J79k38J98
$$ 137 74 -91 175 23 -27 6 69 -82 -11 -246 139 -123 19 -79 101 74 2 -131 -20 -98 81 -157 41
6402D1pP3k70K19l36L00k65M50j10n5Noj5j7k2J6n5R4j53l44L91r4N0J23j3k11
$$ 41 34 107 -163 56 -280 20 -245 205 95 40 45 39 24 7 -15 1 -54 40 -113 -457 -66 -160 -110 13 0 -211
6428b11L81l27K83o7k25J59j50J22K7p4J53q8R7K06k16r8q6J8j92J59k63K45L7
$$ -211 170 -157 126 59 -166 -7 -157 -35 -8 -82 71 -17 80 286 70 -28 -114 -96 -288 -129 -392 -147 -110
6451a10K49l49O0K30m1o3j68j54M38Q2l09Q0j15k6R6q2J88n6J0J35j36r9Q8o5
$$ -110 139 -210 -150 80 39 -24 -192 -346 92 174 -135 -55 -170 -196 -100 -182 6 -50 -40 95 -41 -140 -52 -117
6475a17j44K78J01j91K37o5j29p0M5n7J49l0m3l0k3J6n3J93M1j70k32K31J28k4
$$ -117 -261 17 118 -73 164 99 -30 -100 -55 -112 37 7 -36 -66 -89 -73 -126 67 108 -62 -294 -63 65 41
6499D1j48J35p6n7J40k40J59L5K90L4l33l71N36j87J3Oj36P0O4N4j3j72K90qO4
$$ 41 -107 28 -48 -105 35 -205 -46 -11 279 313 -20 -391 145 -42 -29 -23 -159 -89 -25 29 16 -156 134 126 190
6524A90m01K88O4j56L15o3k27J84j99o5O0K13l28J32J21j98q7J12K60K9l03j50
$$ 190 -211 77 141 -15 300 237 10 194 -5 -70 -10 203 -125 7 128 -70 -157 -45 215 244 -59 -209
6546b09J78p2j08L18k76L41l7l7J1j38J20L5p4j71L8J32N4r8L19k92j76L5N2J8
$$ -209 -31 -103 -211 107 -169 172 135 98 109 -29 91 126 52 -119 -81 51 105 7 326 34 -142 -107 -55 -37
6570c7J61Oj86%J9q0n7J00j8K70l12J96q8J53k83N07m23P1J05J34l27R4Q5r2M4
$$ -37 124 130 -56 -56 -37 -117 -174 -74 -92 178 -134 62 -26 127 -156 351 -72 -1 104 238 -89 5 90 -2 42
6595D2k72L12K09p1l67P2QJ87k79M25k07k37Q5J01P3J34l28j34K15K3or7m3J59
$$ 42 -230 82 291 220 -147 -75 -67 120 -159 266 59 -178 -93 8 81 215 -113 -247 -32 -9 -15 -112 -155 4
6619DL93m36P5j78m2J70J50j81K68l41K29j13L1N8l22K76O2j74J41j02k2J46j59
$$ 4 397 -39 36 -142 -184 -14 136 -45 223 -118 111 -2 29 87 -235 41 103 -71 70 -32 -54 92 -67
6642f7J96k56J95r2J92k71K75k95K5K9Q2o1L35m27R2K40k19J67K7m32K40k4J65
$$ -67 129 -127 68 -24 168 -103 172 -123 -98 -69 13 -48 287 -140 -48 192 -27 140 167 -265 -25 -49 116
6665A16Lj72R8k37N7J16J45J82m04L4O6Q6n7l7J34k94K81j24no8J11j27p3j6J87
$$ 116 119 -53 45 -192 -135 -19 126 308 -96 -62 4 90 33 -4 130 -164 117 -7 -12 -80 31 -96 -169 -185 2
6690Br8K10k78M09r7j3k26J66o4j83P6K51j85K80n85M98k63K76j20m22L46j4l9
$$ 2 -96 114 -164 245 148 135 -91 75 11 -172 -96 155 -30 250 -335 163 -100 176 56 -366 -20 -34 -73
6713g3K12q1J48q1j21m9J51k6j33kk02L65k62L82k92J74j56k93L56j23N5P0k0
$$ -73 139 58 206 125 4 -45 106 80 -53 -55 -257 108 -154 228 -64 110 -46 -339 17 -106 -51 19 -1
6736ak09L06j87J50n9J89p1l64K48p0L11k69J48k33K24j91m6J53k13K87L1j35
$$ -1 -210 96 -91 59 0 189 118 -246 2 -68 243 -26 122 -111 113 -78 -124 29 -184 103 134 -1
6758aO1k5m4M1J32Q5j85J27l32MJ46k30M84j22l5j00J70rk64K74j60j88J78n1
$$ -1 60 35 -9 32 164 249 64 191 -141 -137 9 -221 263 141 106 6 176 167 -97 177 17 -171 7 -44
6782d4J05J21l09K1j65K23k42K28K8L76l56R1p1l7JL26p4l36K15j16o9j09L5M28
$$ -44 61 182 -127 -106 -271 -48 -290 -62 -34 342 -14 77 6 -31 -30 296 222 -114 101 -15 -84 -193 -158 270
6806B70l1j43r4j20JK82K4k43J87k23K40q1J24j46o4j83KL26k38L24m75K47J27
$$ 270 239 96 2 -118 -117 165 189 -54 133 -90 150 69 193 47 -17 -200 -198 128 -110 214 -261 -14 113
6829A13q8q5O8j70Q8K96l00J11j77j24k5L05J86j63J13kM6l12J77J74m46J35%
$$ 113 25 -60 8 -162 -74 222 -78 33 -144 -268 -293 12 198 35 148 146 192 -120 57 231 -215 -80 -80
6852h0Q1M6k47J78K04k66J42R4j9n4k02J71j57K08l65K7K14j5p5J61n2J09k45
$$ -80 1 47 -200 -22 182 -84 58 152 133 79 -123 48 -109 99 -266 -239 -25 -40 -115 46 -6 103 -142
6875a42J15l25N20op9j35n5M8K86j35n8MR3J62l24J11jK17k19j62N12l74j15J62
$$ -142 -27 -352 168 162 83 -52 -107 -59 227 92 34 38 131 293 -31 80 79 296 77 -85 427 53 -62 100
6899A00j16K5J83j82J08l19L28k05oJ46j91K64j76O6K9q4M9J88o38N59jJ4p6J28
$$ 100 -16 9 192 10 118 -201 127 -78 -84 62 -129 135 -41 25 54 -30 19 207 -431 128 127 141 65 193
6923A93j90J72l62J8O1J92J29j11l6L0j60l7P8o4K05j45P1k58L79l56O0K27k33
$$ 193 3 175 -187 -169 -108 84 213 102 66 96 -64 -101 -23 -87 118 -27 44 -214 165 -191 -131 96 -137
6946a37J11J42j03L13k98K7j67R7j17J95q3rJ83l92L54n9k31K78j35j83J63m1
$$ -137 -26 116 13 326 28 55 -112 -15 -132 63 -20 -29 154 -238 116 57 -174 104 -31 -214 -51 -92
6968i2J40q1m6j07M46k57Q4j98k36M47j13K5j87Q9J78j70k0n8J77j68J49k08J48
$$ -92 48 -33 -79 -186 260 3 87 -111 -347 100 -13 12 -175 -86 92 -78 -98 -156 21 -147 2 -206 -58
6991e8O0r4K25q9k19J08R4j75J54n6J04K0j27j15R5J1j49R2K50l23J70k07J91
$$ -58 2 -92 133 44 -175 -67 27 -148 6 -50 54 74 -53 -168 -73 -62 -211 -119 131 -192 -22 -229 -38
7014c8J03o6J80j11m1m7PJ01j80j48K96j34j4P7j39J37J74J17j05j79M3J31j19
$$ -38 65 -1 179 68 27 -20 -13 88 -92 -240 56 -78 -92 -15 -154 -17 157 274 169 -10 33 164 45
7037D5O9K4j43j71K66J0R0l75L65k52j53M45m29M41l4rj86j29L4J31J60o6j88
$$ 45 114 138 -5 -176 90 100 190 -185 180 -72 -225 220 -209 232 198 189 3 -126 -92 39 199 133 -55
7060e5K06k53J0K15J2p8n4j97K50j87M8j58Q8J68N7q2OJ10J05k12J47k03J92J25
$$ -55 151 -102 -92 123 135 57 3 -194 56 -131 -83 -241 -153 15 72 -10 -4 106 211 -1 146 -57 135 260
7084B60k26j23K8J16k40J83k2K14q7m46M90J32k54K0k6l48L02K61l93K1j30K87
$$ 260 34 -89 -61 55 -185 -2 -24 190 103 -343 147 279 25 45 19 -329 -27 234 -159 -138 -268 19
7106A9m7j15K5R1L8q1p6K1K8J9J96rk07J94J72j24J01k73k21J7J3M37M0m40N36
$$ 19 -28 -143 -118 -27 11 -70 -146 -125 -97 -78 118 109 -98 96 268 144 245 -28 -249 -232 -219 218 258 -182 354
7131C54m05J00j07J25j3k4K3j50L4J6J89j85r9K7q0n8N47l7k86n2L6k1K85k06
$$ 354 -51 49 -58 67 54 30 53 -97 -63 -47 142 -43 -142 -115 -195 -253 294 257 -29 -81 -45 -66 219 13
7155A3k9K6k6j1Mq3j55J05O4jJ06J34l93N73k07qr1n3R5j59L2j58J52J01k83M53
$$ 13 -16 10 -16 -27 -23 -106 -261 -156 -92 -93 13 147 -246 327 120 112 21 -32 63 -96 -64 -222 -70 31 -252 201
7181B01j25J0Mn03M34o5Q8j78L94l41J59O8j59k53L12J77n03K50J6j58K40M9j45
$$ 201 76 86 90 -413 21 -44 44 -134 260 -81 78 146 -13 -266 46 223 -280 -30 -14 -172 68 117 -28
7204b8r7R6K87j00j31j00j6J73j30J67k77j36M03m44N16j32P3p3j72K75k22J2
$$ -28 -125 -29 258 158 27 -73 -89 84 -46 121 -156 -292 111 -333 183 51 124 51 -121 154 -68 -56
7226e6L0q1j0J86Q3L6k2j81n5L8O6m1j6K62j93p9j77K70K3R6p7j03N5o2l6K47
$$ -56 -26 -107 -117 69 152 188 166 -15 -70 -32 34 -7 -23 239 46 -33 -210 60 83 179 102 -1 54 -8 -44 203
7252B03j23m9j28R7o2J4J43k18N26l42k4k46K46q5K38j54o2Kn1qJ5J21n9J42n3
$$ 203 80 31 -97 0 -62 -48 95 -123 403 61 37 -209 37 -48 190 36 -26 -24 -75 -83 -68 53 -6 136 83
7277H3J33k85L2j66K73l86N08j29k86N04l90K6J54R2p3j60Q6k5q5M47l16R5J51
$$ 83 216 -69 -37 -203 70 -316 192 63 -223 281 -109 -83 71 163 90 -70 16 -9 -94 353 37 132 283
7300B83j41j53J6R6j38j99P4NK09O1k11n3L56o9k64K27RK1j62P7l01N27k63J18
$$ 283 142 -11 5 101 -37 -236 -162 -157 52 113 -98 -151 205 136 -128 99 108 129 -33 44 -257 270 7 125
7324A25l48K76J03L4l74K7l1K94O9k02k94N65k87J06R9n0j07p2J98k85P0Q2q1
$$ 125 -223 53 156 190 -184 -157 -188 106 175 -27 -321 244 -43 63 162 112 5 -67 131 -154 -84 -2 -83
7347h3J84k63J38j71L74o5k86J33K09k88J33j02L2n1J78J02j1j54j71L40p8J09
$$ -83 101 -162 -24 -195 179 114 -172 -39 170 -118 15 -87 -55 -106 72 174 163 9 -162 178 100 209
7369B09K7j82k27J32R3k6o9P5N4l2Qr9Q2J48o4l60J49J33j07R9k51M67k56O2n
$$ 209 236 54 -173 -41 52 26 -43 32 86 54 62 -37 45 193 129 -231 -82 51 -56 43 -208 259 3 65 60
7394F0n6L34l24j48m7P1N08m04O6k05K86q2J8j38Q2L03j16l21Q4M1l38K15K47
$$ 60 4 338 14 -134 -181 -110 398 -6 60 -145 141 59 77 -61 21 324 208 -113 -29 12 -326 -111 136
7417A36j85K98j85j8j92L78j21k80K83k36M9J40o9l2k33J89K85n2p6j37J44q4
$$ 136 -49 249 64 46 -146 232 111 -169 114 -122 -73 67 -2 -34 -267 -78 207 155 79 -58 86 2
7439Bl6K4L59o83N46j55O9k15j5J62k8j39j8N0R4J53k56J73rk63J27o0J70k9r5
$$ 2 -34 -10 349 -334 212 57 126 -89 -104 58 30 -109 -127 -77 17 170 -86 87 78 -185 -58 -118 52 23 -72
7464g2j23K87j74J65j68K05l10J46J19P2k34r6J58o4J78l04M77n40K81j5P0M6
$$ -72 -195 92 -82 83 -85 120 -190 -44 75 147 -87 -183 -25 -89 89 -215 262 -278 3 -12 58 104
7486A04k20j0K72rJ11j42r7J31k30R8l8K1R6l08J55K4q1J04Q0L9j33j89P0J29
$$ 104 -116 -126 146 137 248 106 9 140 -90 8 -30 -9 87 -221 -66 -42 -123 -19 61 100 -33 -222 -152 -23
7510b3N9Q6k13K07k3l69J85J29j01J6R0m6Q4j47j6nL01N0l82J71p8n5j7K10j77
$$ -23 36 122 -91 116 93 -276 -91 38 -63 -47 43 -3 81 -66 -82 -87 214 264 -118 53 -25 -80 -97 113 -64
7535f4K80j50j37Ok54K64m0K64k36N07m16Rj6k40J11n1J84p3P6L7k74L7K06L7
$$ -64 216 66 -71 -65 -319 -55 -95 169 -67 440 24 33 17 -223 -112 -163 21 -52 24 61 -213 -176 30 67
7559F7j01K31l33L1K51j18j07m2N3L74l18RJ98l55j08K13J62l62K61m7Q9K43l04
$$ 67 -34 197 -136 -105 146 28 -79 -121 -68 306 -12 -3 195 -160 -268 -55 107 -255 6 -41 48 291 -13
7582a3l70K84J05R5q9p9J35j43M21m91K67k34J01q4K29M3j39R3j93l7J75J4l67
$$ -13 -383 -99 6 101 12 -67 68 -75 346 -145 122 -112 -11 -95 134 177 38 131 -62 -99 76 90 -277
7605b77K01Q7O8j73k29K99R7j77N8q0P3K54l38J41K5O0P7k00O3o7K62j44q4mJ42
$$ -277 -76 11 79 -94 -323 -24 73 -104 -46 -126 -53 201 -137 4 29 89 166 -34 29 -38 224 80 -4 -8 134
7630A34k47K83l50K02P3J68l03J34k64K84j17k35K93JQ2l40Q5O1K57m5j12Pk3
$$ 134 -113 170 -180 22 95 263 -40 94 -170 114 -3 -238 55 56 138 -202 -117 -56 201 156 44 51 28
7653B8j28QJ18m4P6j14O4l37M77l14N02k62l77L47k85m4P6K08L7k6k8K9k71P6
$$ 28 -100 -92 26 -18 58 -56 8 -329 148 -166 336 74 -303 44 -241 -285 -209 -1 36 10 -18 11 -260 -184
7677a84N34m16L59q8l23J10r7L28k80l8n2K08j34j14J01L67n38L31ll49O9L09
$$ -184 350 -66 293 205 -118 -8 -105 223 -57 -95 -147 61 -73 -187 -86 281 -257 74 71 -278 -209 100
7699A00j99o5K87p7M9m7j9o8L06k73r8m1K65J4m2k23J81N0j45J06q1n0m0L06j66
$$ 100 -99 -164 123 46 95 48 29 -39 267 -6 -104 -145 120 134 92 -131 50 100 -45 61 -20 -70 -110 196 30
7724C0n8M15k39k29l4L6J87n5K1j9J40l45M33k83Rk0j45J10K35k44K03r0j87J39
$$ 30 -28 387 148 -81 -115 -79 108 53 74 55 195 -150 283 0 9 -11 -156 -46 189 -55 148 58 -129 10
7748A0k6l2j6K12j32j32J46K44o9k90p0Q5j07K65K1j13o1J25NM9r9J93j56N0l53
$$ 10 -16 -48 -64 148 16 -116 30 274 205 -85 -155 -70 -177 88 109 -4 -65 60 65 114 15 208 52 102 -251
7773b51M02l37K99k00n5K40r2k7J10l23M18m72K96K9j20l8m9J91k4k48O9k18M84
$$ -251 151 -186 113 -87 -142 98 6 -21 89 -234 184 -288 8 37 -83 -121 -170 21 -3 -251 -182 -400 84
7796H4K36o79M20l84J30J69J17k25K03m53N54j21Q7J00q8j60m2J4K49j61k41r9
$$ 84 320 -359 61 -323 -193 -24 93 -132 71 -382 172 51 138 238 150 -10 -52 -38 211 50 -191 -290
7818b90M55l58K84j15J21p8p1j62R6K30p9j37J18k1l7m6K84j95qk45L60j6R3j07
$$ -290 165 -193 91 -24 97 19 -52 -214 -118 112 33 -104 14 -7 -44 -90 194 -1 -9 -254 106 90 183 76
7842G6k43L52k56j7K74k63N21n79k1K33K6p5K19m8l03L95k67L63n84L41j52J74
$$ 76 -167 185 -71 -88 186 -77 444 -135 -156 77 103 28 247 199 -104 291 24 387 -197 144 -8 166
7864A66r2r4J75k59K21j46J4j75L57j26k20J47k96R8R1n3J96j45J95k53L36m1
$$ 166 74 -20 155 -104 117 -29 -15 -190 167 41 -179 -32 -328 -230 -139 -192 4 -141 54 -199 137 96
7886I6j02p4r4K59j59J36Q1l1J98o0k02l57K97q4jn7r2J17J1NL14j99j70Q1M4
$$ 96 -6 -80 -174 85 -74 62 143 112 310 250 48 -309 -12 -96 -97 -154 -246 -129 -118 -113 201 2 -168 -87 -43
7911d3J33k92K55j24J73k59K88Q0k00L1J08l03R2P5k9RP9K7l0j35K18j99j16l2
$$ -43 90 -202 53 -71 102 -157 131 211 11 42 150 -153 -61 14 -15 -6 73 100 70 -65 153 -46 -162 -194
7935a94K79m3K3L1l4j11J0L99m26rj76K3O3J02j8J48j47j1r7O2L57R0m57%L14
$$ -194 85 42 65 96 62 -49 -39 360 -66 -75 -251 -228 -165 -63 -81 67 -80 -91 -188 -126 231 321 -136 -136 178
7960A78k03M6k17L15L4k73J35P8r3j76K90k3N2j31l7K5J71Q2k82K7m5J29k8j46
$$ 178 -25 21 -196 119 153 -120 15 93 0 -176 114 91 143 12 -25 0 171 253 -29 -2 -47 82 54 -92
7984i2q3J53j1m5J53L14m76J46K95m51R1PO4k73L08k03L44k54j4o8J91P6l84K86
$$ -92 -175 -22 -33 -78 75 389 -87 59 354 -97 -6 1 65 -208 100 -103 241 -13 -27 -95 96 172 -212 74
8008G4j08J49Q8q1o2r7K86l41PM3O6k51R9K18j90r3R6Lj51P0J73qQk43M00l03
$$ 74 -34 115 203 122 60 -37 249 -92 -85 -42 24 -227 -128 90 -100 -193 -97 -94 -245 -175 -2 -10 -2 -245 155 -148
8034a48O2K50j90j80L55j40l1q9MJ10k05M29k93N2p4M2n3J47m1J48j86m3Q5j31
$$ -148 -86 164 -26 -206 149 9 -22 -111 -107 3 -202 227 -66 -14 -88 -46 -99 48 7 155 -31 -74 11 -120
8058a20K43j68R8P5N8j96r0j43K53j60K53k9j01r6J93j09j09J56o1K73m48K40
$$ -120 123 -45 53 128 186 -10 -100 -243 10 -150 103 74 -27 -123 70 -39 -148 8 -53 220 -228 12
8080A2J38Nm58M80p3R3j89J02o5j75J60m1l0n9L20j30j25J4L44j37n0k90lJ50
$$ 12 150 155 -303 177 104 197 8 110 45 -130 30 -11 -41 -100 220 90 -35 -21 323 186 136 -154 -157 -7
8104gj18K47mJ9j09j48K17j0k52N7J75k1l27Q6K18r4p4L84j86MJ11k79M5m0r0
$$ -7 -125 122 118 137 28 -120 97 87 -165 -108 67 46 -281 -195 23 -71 -145 239 53 57 168 -111 -66 -106 -196
8129a96J86QM6p6j21KJ72j22o6J68l0J58J44m8q1k19m1j18L89l95K59q0j58L68
$$ -196 -10 -2 44 -32 -153 -151 21 -101 -167 1 -29 129 273 225 144 -75 -116 -234 155 -240 19 -61 -219 149
8153A49l87K14j45P7r2K07K2k0K0j51L29k38N2k45J34k29K54j29J49k6n2N59j99
$$ 149 -238 -24 -169 -92 -184 23 45 25 45 -106 223 -15 37 -208 -74 -303 -49 -178 -29 -55 -107 452 253
8176B53k65J19J61n94M06n4P0P0m4j31j83K60M7m3q6
$$ 253 -12 107 268 -326 80 26 96 166 122 -9 -192 68 115 72 -14
8191a4
$$ Imaginary data points
##PAGE= N=2
##DATA TABLE= (X++(I..I)), XYDATA
0@%%%%%%%%%%%%Oj4J6j6J6k4L2l2M0m9N7p2Q8j02J18j36J54j76K03k32K64k99
$$ 0 0 0 0 0 0 0 0 0 0 0 0 0 6 -8 8 -8 8 -16 16 -16 24 -25 32 -40 48 -54 64 -72 82 -94 109 -123 141 -158
34a58L37l79M25m79N35n97O69p42Q24r16J010j114J231j359J499j650J819k007
$$ -158 179 -200 225 -254 281 -316 353 -389 435 -481 529 -585 646 -713 786 -864 955 -1052
52a052K211k437K692k979L303l676M105m607N211n945O860q043R636j1913J5458
$$ -1052 1159 -1278 1414 -1565 1738 -1938 2167 -2440 2771 -3174 3686 -4357 5279 -6634 8824
67H824k1796L6627j36796r4357J68731l1267j06713o036J65512O4038j17827j70503
$$ 8824 -12972 23655 -113141 -207498 -38767 -70034 -176747 -182783 -17271 46767 -71060 -241563
79b41563k4514R3936J19601L9231n5683j06266k4178P6652O5824m6395q2133j8435
$$ -241563 -266077 -172141 -52540 -13309 -68992 -175258 -199436 -122784 -56960 -103355 -185488 -203923
91b03923O2411Q9272M7419p1843j49450o4801J03884J23007p700o8395J8190O8233
$$ -203923 -141512 -52240 -4821 -76664 -226114 -290915 -187031 -64024 -71724 -140119 -121929 -53696
103e3696p562p5958m4738Q450L5458O6759P0022k4287j22067p5253O2083J00401
$$ -53696 -61258 -137216 -181954 -173504 -138046 -71287 -1265 -25552 -147619 -222872 -160789 -60388
115f0388K0065m2396k2678K3437M3314J7284m3472p1763j2484P0695P2572R080
$$ -60388 -40323 -82719 -105397 -81960 -38646 -21362 -64834 -136597 -149081 -78386 -5814 3266
127C266k3717j2356r179j1379O174J3563o005P607O1448N2462m6084j03106l4793
$$ 3266 -20451 -32807 -41986 -53365 -47191 -33628 -39633 -32026 29422 81884 35800 -67306 -102099
140a02099O3021P7398L0019q917k4562k4585m118J9586J0477j5955o368L2301
$$ -102099 -39078 38320 68339 59422 34860 10275 6157 25743 36220 20265 13897 46198
152D6198L9836J991l1289l0184p245J9067K8060Q489j3165M95K7253J5943k7947
$$ 46198 86034 88025 56736 26552 19307 38374 66434 74923 61758 62253 89506 105449 77502
165G7502m6226j2917L2794M7788K9430o385m1394m4734n572L1798K5897J806l76
$$ 77502 31276 18359 51153 98941 128371 121986 80592 35858 30286 62084 87981 89787 89411
178H9411Q851K315j4311k3590j6719K448K2310K3312K623k0187j7718K959J1850
$$ 89411 98262 100577 86266 62676 45957 48405 70715 94027 96650 76463 58745 61704 73554
191G3554k269j4949p929J2221K3994J1108j6742l5391k7868p82K3502K7153J1537
$$ 73554 71285 56336 48407 60628 84622 95730 78988 43597 15729 14947 38449 65602 77139
204G7139r984j7247j1115o884j0297o246R464J9873R041j4353k6913j7426J976
$$ 77139 67155 49908 38793 31909 21612 15366 24830 44703 53744 39391 12478 -4948 -2972
217b972J4324J2406R04q559q318j255J068n996j4828j4731l2J7504J8498j123
$$ -2972 11352 23758 24662 16103 7785 6530 7598 1602 -13226 -27957 -27989 -10485 8013 6890
231F890j7241j5428m883j637k125M760J2145P624p127j5972j4777j0098R4J6800
$$ 6890 -10351 -25779 -30662 -32299 -34424 -29664 -17519 -9895 -17022 -32994 -47771 -57869 -57775 -40975
245d0975K1352L322j7942j8195m107N129M075J5j550J004N245K141m875q839n505
$$ -40975 -19623 -16301 -34243 -52438 -56545 -51416 -47341 -47326 -48876 -47872 -42627 -40486 -45361 -54200 -59705
260e9705K07L578N837O525L142l475m952k874m919o239N156J8343J4009n104j6585
$$ -59705 -59498 -55920 -50083 -43558 -40416 -43891 -48843 -51717 -56636 -62875 -57719 -39376 -25367 -30471 -47056
275d7056j2400j370Q146J2630J1484L718n357p293j895Q92l5K153O397O291K046
$$ -47056 -59456 -60826 -52680 -40050 -28566 -24848 -30205 -37498 -39393 -38501 -38536 -36383 -29986 -23695 -21649
290b1649j641k899q11L492M537J520N32M063P334L167l978p740n931J455Q664
$$ -21649 -23290 -26189 -27000 -23508 -18971 -17451 -16919 -12856 -5522 -2355 -6333 -14073 -20004 -18549 -9885
305i885J4234J0079j062r062o307l95K971N647O942M927K52m096n371k118K725
$$ -9885 4349 14428 13366 4304 -2003 -2398 573 6220 13162 18089 18341 14245 8874 6756 9481
320I481P456P290L931p62l068j778L60J67j197j072J635N716O805J841l336o058
$$ 9481 16937 24227 28158 27396 24328 22550 22910 23077 21880 20808 22443 28159 34964 36805 33469 27411
336B7411m246O49N408O249M176k7m529o723n018l03M646Q012O294n17n967p758
$$ 27411 23165 23814 29222 35471 39647 39620 35091 28368 23350 23047 27693 35705 41999 41482 35515 27757
352B7757l679J132M656L842L56j598j853j119j961j732k177n05J545K429J761
$$ 27757 24078 25210 29866 33708 34064 32466 30613 29494 27533 25801 23624 23119 24664 27093 28854
367B8854l18l100m714l545j911Q05L416M482O44m192p145o867k136L704O378M005
$$ 28854 28536 25436 20722 17177 15266 16071 19487 23969 24613 20421 13276 6409 4273 7977 14355 18360
383A8360j082n237o327l974p35Q76J627J243p08k223j601k851k423m68M01O73
$$ 18360 17278 12041 5714 1740 1005 1881 3508 4751 4043 1820 219 -2632 -5055 -5523 -5122 -4449
399d449K95K22k37k251m310m566k566M42L066M997K675l001o307n137j937J355
$$ -4449 -4154 -3932 -4169 -6420 -10730 -15296 -17862 -17420 -14354 -9357 -6682 -9683 -15990 -21127 -23064 -21709
415b1709L632L793N0l829m369k862j128R71L338L154J433j872k704k272j397m78
$$ -21709 -18077 -14284 -14234 -18063 -22432 -25294 -26422 -25451 -22113 -18959 -17526 -19398 -22102 -24374 -25771 -26249
431b6249j57J169J475J724K035n27k194k409j506O00K910N160K296j666l832k642
$$ -26249 -26406 -25237 -23762 -22038 -20003 -20530 -22724 -25133 -26639 -26039 -23129 -17969 -15673 -17339 -21171 -23813
447b3813j267J319L357N528L800r18m247k584J72J326K302L728K918J74j589j198
$$ -23813 -25080 -23761 -20404 -14876 -11076 -11994 -16241 -18825 -18653 -17327 -15025 -11297 -8379 -8205 -9794 -10992
463a0992P08R91J7Q6L197M006J242r33q70j96o23m62K379N108L812j135k620j720
$$ -10992 -10284 -9293 -9276 -9190 -5993 -1987 -745 -1678 -2548 -2744 -3367 -3829 -1450 3658 7470 6335 3715 1995
481A995m29j01K110M832M758P86l819k819j18J807Q69O80K553K965j187l408n3
$$ 1995 1566 1465 3575 8407 13165 13951 10132 7313 7195 9002 9871 10551 13104 16069 14882 11474 11421
498A1421L311j55k059Q46N123J799l686k486J348k70l141m19N447M085q98l257
$$ 11421 14732 14577 12518 13364 18487 20286 16600 14114 15462 15192 12051 11632 17079 21164 20266 17009
514A7009j721j001o11n01K051L381P15k570m556j321K104J827j823k66L919P38
$$ 17009 15288 14287 13676 13175 15226 18607 19322 16752 12196 10875 12979 14806 12983 12717 16636 17374
530A7374n242l986K888K057m066k664M235L768l277m143O61J736l513l044L129
$$ 17374 12132 8146 11034 13091 9025 6361 10596 14364 11087 6944 7605 9341 5828 2784 5913
545E913M199j035l740k057j004p49m40J373J180J232n01l314m026K03L038n56
$$ 5913 10112 9077 5337 3280 2276 1527 1087 2460 3640 4872 4371 1057 -2969 -2766 272 -284
561b84k592J381K990k265n919M39M317j482m453J084N110j072n033l25K270j695
$$ -284 -2876 -1495 1495 -770 -6689 -6250 -1933 -3415 -7868 -6784 -1674 -2746 -7779 -8104 -5834 -7529
577g529l272J575L724j56k284j477m24k063J64K049J266l59M54l57l389j943K830
$$ -7529 -10801 -9226 -5502 -5658 -7942 -9419 -9843 -11906 -11742 -9693 -8427 -8786 -8332 -8689 -12078 -14021 -11191
594a1191K274j922j333K596J257m179j462L294J533k423o90L605J201l276j362
$$ -11191 -8917 -10839 -12172 -9576 -8319 -12498 -13960 -10666 -9133 -11556 -12246 -8641 -7440 -10716 -12078
609a2078K097k34k070R98L883M62j524N42L15j927r47K957K488p88p42J122m23
$$ -12078 -9981 -10215 -12285 -11287 -7404 -6942 -8466 -7924 -7609 -9536 -10483 -7526 -5038 -5826 -6568 -5446 -5869
626e869j965M48L689J184j198K5J918p17j638J294J492k48o3J876P99q20k10J571
$$ -5869 -7834 -7386 -3697 -2513 -3711 -3686 -1768 -2485 -4123 -2829 -1337 -1585 -1648 228 1027 207 -3 1568
644A568j03j666J163L276O50k193J91J693r64k159K265L804J2k302R3J618r37
$$ 1568 1465 -201 962 4238 4888 2695 2886 4579 3615 1456 3721 7525 7537 5235 5328 6946 6009
661F009j467J166K419Q87j182r21K32L40k02mkJ227P08m73j243K2J322o84j828
$$ 6009 4542 5708 8127 9014 7832 6911 7143 7483 7281 7277 7275 8502 9210 8737 7494 7516 8838 8154 6326
680F326M91K492L05k130j063J274K44k213o32K975J544k258k189M28J161j634
$$ 6326 6817 9309 9614 7484 6421 7695 7939 5726 5094 8069 9613 7355 5166 5594 6755 5121
696E121j330J598J592m84k310j075N98J008j305q57R47J519j273k210l59J095
$$ 5121 3791 5389 6981 6497 4187 3112 3710 4718 3413 2556 3503 5022 3749 1539 1180 2275
712B275m0k286l59K144P72j810j757O03O13j214j101Q91J836m54k454j216J080
$$ 2275 2235 -51 -410 1734 2506 696 -1061 -458 155 -1059 -2160 -1269 567 113 -2341 -3557 -2477
729b477N36j407R7J476O39j568k233L70J508l60j250Q8J886l99j939q76J386L67
$$ -2477 -1941 -3348 -3251 -1775 -1136 -2704 -4937 -4567 -3059 -3419 -4669 -4581 -2695 -3094 -5033 -5909 -4523 -4156
747d156r10o21J378P76n38j351n39O89j77l13N66J257J39r27j610n5J069M10m56
$$ -4156 -5066 -5687 -4309 -3533 -4071 -5422 -5961 -5272 -5449 -5762 -5196 -3939 -3800 -4727 -6337 -6392 -5323 -4913 -5369
766e369L56J360m66j921k85J268O03q12N28P55P93j072r32M33Q08j49K6O09R73
$$ -5369 -5013 -3653 -4119 -6040 -6325 -5057 -4454 -5266 -4738 -3983 -3190 -4262 -5194 -4761 -3953 -4102 -4076 -3467 -2494
785b494q4p38l30j91N73M16O56M19O98j00q12p32O91O74O96Q7R60Oq95n79L01
$$ -2494 -2578 -3316 -3646 -3837 -3264 -2848 -2192 -1773 -1075 -1175 -1987 -2719 -2028 -1354 -658 -571 389 395 -500 -1079 -778
806g78J143M08Q6Q83J00j31o41N0K74M74O00N69L50Q9j82k03r7J60N46N68O27
$$ -778 365 773 859 1742 1842 1711 1070 1120 1394 1868 2468 3037 3387 3476 3294 3091 2994 3154 3700 4268 4895
827D895J84n85k16k95m60Q09R09K73M81p2m79o58j42K33L98J03M33K30j57o34
$$ 4895 5079 4494 4278 3983 3523 4332 5241 5514 5995 5923 5444 4786 4644 4877 5275 5378 5811 6041 5884 5250
847E250l96q4K51j55P13M75o11o00m09m26k46J70L94L81l2l72o40m97p28K42K84
$$ 5250 4854 4770 5021 4866 5579 6054 5443 4843 4434 4008 3762 3932 4326 4707 4675 4303 3663 3166 2438 2680 2964
868B964M36J94o43n55n39q78k15L15N73K2m92n34m13n87k93l4M5L48O5j80o61
$$ 2964 3400 3594 2951 2396 1857 979 764 1079 1652 1674 1182 648 235 -352 -645 -679 -634 -286 -221 -401 -1062
889a062n83m59m30M7L86K26L57m19o64o79l28j23J34O71Q8L2n74p52k32m11O19
$$ -1062 -1645 -2104 -2534 -2487 -2101 -1875 -1518 -1937 -2601 -3280 -3608 -3731 -3597 -2926 -2838 -2806 -3380 -4132 -4364 -4775 -4156
910d156J78M75L28n15r84j82r5k83O41N57L5L72k06n02m17m16L35M46Q25K41K7
$$ -4156 -3978 -3503 -3175 -3690 -4674 -4856 -4951 -5234 -4593 -4036 -4001 -3629 -3835 -4337 -4754 -5170 -4835 -4389 -3564 -3323 -3296
931c296j27p47O2k48L28N69O63O89p41k78m76j11N72O72K05N91k65pn60J10j09
$$ -3296 -3423 -4170 -4108 -4356 -4028 -3459 -2796 -2107 -2848 -3126 -3602 -3713 -3141 -2469 -2264 -1673 -1938 -1945 -2505 -2395 -2504
952b504J16N85P47N53m19J14m45J02k01L44P83M89J25r1o29n3j4K10M37R35K47
$$ -2504 -2388 -1803 -1056 -503 -922 -808 -1253 -1151 -1352 -1008 -225 264 389 298 -331 -384 -398 -188 249 1184 1431
973A431j7l52n08R2J61L65M98O87K36k40m23l48K54k14Q04N25K27N76o76k41j50
$$ 1431 1414 1062 554 646 807 1172 1670 2357 2593 2353 1930 1582 1836 1622 2426 2951 3178 3754 3078 2837 2687
994B687j0j36P31O71L48n50l32J31p74M26Q4P33M28J70n16n11l51O9K05R2O03
$$ 2687 2677 2541 3272 3943 4291 3741 3409 3540 2766 3192 3276 4009 4437 4607 4091 3580 3229 3298 3503 3595 4198
1015D198N09k40n63p63j2P7OL11K17K00j94p92o00k22L30J62N98p0J38p07o63
$$ 4198 4707 4467 3904 3141 3129 3206 3212 3523 3740 3940 3746 2954 2354 2132 2462 2624 3222 3152 3290 2583 1920
1036A920m70K05j79K0Q38qp52q94K05n30J03j94M62K50j73p44q32kk20K90J54
$$ 1920 1450 1655 1476 1496 2334 2326 1574 680 885 355 458 264 726 976 803 59 -773 -775 -995 -705 -551
1057e51J36k6k61l86m58n48Q1p2L56Q2O4l08o67o50L76O4r4O57o8l26k09l27k92
$$ -551 -415 -441 -702 -1088 -1546 -2094 -2013 -2085 -1729 -1647 -1583 -1891 -2558 -3208 -2832 -2768 -2862 -2205 -2273 -2599 -2808 -3135 -3427
1080c427j37N06L04M61j82k56k87k51m97O8O72K1J85J37j24l58l58pJ98N75L57
$$ -3427 -3564 -3058 -2754 -2293 -2475 -2731 -3018 -3269 -3766 -3698 -3026 -3005 -2820 -2683 -2807 -3165 -3523 -3530 -3332 -2757 -2400
1101b400K54k43k52m51J11J05oP04L05O3m52P9o8l23J85N84N60Q8r7m3J1p00q2
$$ -2400 -2146 -2389 -2641 -3092 -2981 -2876 -2882 -2178 -1873 -1810 -2262 -2183 -2251 -2574 -2389 -1805 -1245 -1157 -1254 -1297 -1286 -1986 -2068
1124b068R19K31L28m15N3L67j60p11K75O55N69k51K25J23l42l30l28L71R54J85
$$ -2068 -1149 -918 -590 -1005 -952 -585 -745 -1456 -1181 -526 43 -208 17 140 -202 -532 -860 -489 465 650
1144F50k59J61J26j67o08k13J100N09k78l47L89K24n92l18L44Q92J33k02K17J97
$$ 650 391 552 678 511 -97 -310 790 1299 1021 674 1063 1287 695 377 721 1613 1746 1544 1761 1958
1164A958l05l77k66N49N66K17k70O8L10n29p1r6L56O89k96J20O2l26k40m17L14
$$ 1958 1653 1276 1010 1559 2125 2342 2072 2140 2450 1921 1850 1754 2110 2799 2503 2623 2685 2359 2119 1702 2016
1185B016R46n5j48n0J67k36o45M10L36M7M7l28m7K88m67p40L07N65K74j38l06
$$ 2016 2962 2907 2759 2709 2876 2640 1995 2405 2741 2788 2835 2507 2460 2748 2281 1541 1848 2413 2687 2549 2243
1206B243j0p1m64n78N27O44o7n63k63K9qo06m05O14N02k51n69j1J37o84m98K81
$$ 2243 2233 2162 1698 1120 1647 2291 2224 1661 1398 1427 1419 813 408 1022 1524 1273 704 693 830 146 -352 -71
1228g1N56j80l22j65m9k27l61n12O42K75n2n70M6j88l73l97P9M03K17k22k19J74
$$ -71 485 305 -17 -182 -231 -458 -819 -1331 -689 -414 -466 -1036 -990 -1178 -1551 -1948 -1869 -1466 -1249 -1471 -1690 -1516
1250a516n53Q8l38J18K88K48m97nm9j3l57MJ37M57j07M0Qk72k84Q5P8L52M01L6
$$ -1516 -2069 -1981 -2319 -2201 -1913 -1665 -2162 -2167 -2216 -2229 -2586 -2582 -2445 -1988 -2095 -2055 -2047 -2319 -2603 -2518 -2440 -2088 -1687 -1651
1274a651j91l53j10m0J50M57K05m0J3j17Rn35L66Q7P9N37R6j3l4j3l09PL51J79
$$ -1651 -1842 -2195 -2305 -2345 -2195 -1738 -1533 -1573 -1560 -1677 -1668 -2203 -1837 -1750 -1671 -1134 -1038 -1051 -1085 -1098 -1407 -1400 -1049 -870
1298h70K3N34k02m42M64r7j1K39K72Q7J37j60k50P9O1J14K19K07K4r2lj04l9K29
$$ -870 -847 -313 -515 -957 -493 -590 -601 -362 -90 -3 134 -26 -276 -197 -136 -22 197 404 428 336 333 229 190 419
1322D19J42L01r7L34k93j41j83J74j46J79L34L24k10J3l56L73l13J70J42N47p6
$$ 419 561 862 765 1099 806 665 482 656 510 689 1023 1347 1137 1150 794 1167 854 1024 1166 1713 1637
1343A637m24Q7j96J2K96k7o2J67L97j81m77K35r5K00k07M63R7J70j69k76k28L63
$$ 1637 1213 1300 1104 1116 1412 1385 1323 1490 1887 1706 1229 1464 1369 1569 1362 1825 1922 2092 1923 1647 1419 1782
1365A782j86n7K74J29r1j99j53k83J7K24q4M21J47j05n42p1j17o7J61J68J57k70
$$ 1782 1596 1539 1813 1942 1851 1652 1499 1216 1233 1457 1373 1794 1941 1836 1294 1223 1106 1039 1200 1368 1525 1255
1387A255l87J79k34m6O1LJ0p9J64m51N8k45Q4j67K51j27j10p1o36K44p6j9n3J21
$$ 1255 868 1047 813 767 828 831 841 762 926 475 533 288 372 205 456 329 219 148 -488 -244 -320 -339 -392 -271
1411b71J07j22l65k06j95K15j33j3J2k9j04J48mm35j37N2K28K21m24N9L9o5l86
$$ -271 -164 -286 -651 -857 -1052 -837 -970 -983 -971 -1000 -1104 -956 -960 -1395 -1532 -1480 -1252 -1031 -1455 -1396 -1357 -1422 -1808
1434a808L15Q8Q3J01k80j9m7J20k79l08N86Q5n5j14Rr4K28k23K34J21n1M2j47
$$ -1808 -1493 -1405 -1322 -1221 -1501 -1520 -1567 -1447 -1726 -2034 -1448 -1363 -1418 -1532 -1523 -1617 -1389 -1612 -1378 -1257 -1308 -1266 -1413
1457a413J41k4P3j38J78M27l09J06R2K82o11K44n0J42K59o8J06j17Q9n8K73j76
$$ -1413 -1272 -1296 -1223 -1361 -1183 -756 -1065 -959 -867 -585 -1196 -952 -1002 -860 -601 -669 -563 -680 -591 -649 -376 -552
1479e52L58P6m3nO1l66j21M77K5J38l1J92p4j81nR1P8J49J07K09k21O4j90M3O8
$$ -552 -194 -118 -161 -166 -105 -471 -592 -115 -90 48 17 209 135 -46 -51 40 118 267 374 583 362 426 236 279 347
1504C47K04j75J03K88j25l18K40J64k73K34K03j3j55j7o3n3j93M97Rj4%K6k9j77
$$ 347 551 376 479 767 642 324 564 728 455 689 892 879 724 707 644 591 398 895 904 890 890 916 887 710
1528G10J95p4L01J3P0N3k51r1l7k1q4L27j99K08R2l79J65l4k00L07j48O0N8n9
$$ 710 905 831 1132 1145 1215 1268 1017 926 889 868 784 1111 912 1120 1212 833 998 964 764 1071 923 983 1041 982
1552I82j99L4j40J64K46Q7nk32N7O9l20K4l1L55j07M4k01l53J82j00k93J65J15
$$ 982 783 817 677 841 1087 1174 1169 937 994 1063 743 767 736 1091 984 1028 827 474 656 556 263 428 543
1575E43j72L0J48l82m7r5P7J76l19J14N3j22l73n6J01oKO1j16k2J54m24J70k32
$$ 543 371 401 549 167 120 25 102 278 -41 73 126 4 -369 -425 -324 -330 -328 -267 -383 -405 -251 -675 -505 -737
1599g37J45J01lK59l17j58l57L14P4j2J26m00K78l80q8L83j05K20j92J19k83J13
$$ -737 -592 -491 -494 -235 -552 -710 -1067 -753 -679 -691 -565 -965 -687 -1067 -1155 -772 -877 -657 -849 -730 -1013 -900
1621i00j52OO9K42r6M4J5nJ23l29J67k63L05L46j28q6K29k40n1n5LM36k57p1L78
$$ -900 -1052 -1046 -977 -735 -831 -787 -772 -777 -654 -983 -816 -1079 -774 -428 -556 -642 -413 -653 -704 -759 -756 -320 -577 -648 -270
1646b70p9n1j27K85L6k12M96n00L00k57K45j23K75j08J67q9j38O9J77r8k48L43
$$ -270 -349 -400 -527 -242 -206 -418 78 -422 -122 -379 -134 -257 18 -90 77 -12 -150 -81 96 -2 -250 93
1668I3K1Q2k22J74j0m5o1M9J94R8j13M8J28j51m02K12J42Q7L6l3Q5mk05j78J73
$$ 93 114 196 -26 148 138 93 32 81 275 373 260 308 436 285 -117 95 237 324 360 327 412 408 203 25 198
1693A98O6J13j17J70J0K58p53R7RK45m6K09N6J97k28j14j88J82J87Lp8m7K07j72
$$ 198 264 377 260 430 440 698 -55 42 51 296 250 459 515 712 484 370 182 364 551 554 476 429 636 464
1717D64j99K37J31j11LJ63L0m04J45J09k63J00M11k40O9J0k05M5q6j00J16K76
$$ 464 265 502 633 522 525 688 718 314 459 568 305 405 816 576 645 655 450 495 409 309 425 701
1739G01l43L96j16P7m21P6J26j23k7L1J84k03J5k74M5M8J91k6p7Q6m60oQ6j9K9
$$ 701 358 754 638 715 294 370 496 373 346 377 561 358 373 99 144 192 383 357 280 366 -94 -100 -14 -33 -4
1764dk4L02om42J97j25n3k49J59J51j75j43k4m3n7j20K04J12j5P2k45N7P4l39
$$ -4 -28 274 268 -174 23 -102 -155 -404 -245 -94 -269 -412 -436 -479 -536 -656 -452 -340 -355 -283 -528 -471 -397 -736
1788g36J45P9j02K26k24O9j58M00k87J02K3Jp5k8K00m72J40J12L40l12j60K03
$$ -736 -591 -512 -614 -388 -612 -543 -701 -301 -588 -486 -463 -462 -537 -565 -365 -837 -697 -585 -245 -557 -717 -514
1810e14j04J21J11l28L06L43j52R7o6Q1k64r2M5P2K26MN6K5J43k32k17K10J87
$$ -514 -618 -497 -386 -714 -408 -65 -217 -120 -186 -105 -369 -461 -416 -344 -118 -114 -58 -33 110 -122 -339 -129 58
1833E8r5K25P8j48m8j60Q1J0J01N5m7k00L42m32K64n0K62k11K5L37m20J91J62
$$ 58 -37 188 266 118 70 -90 -9 1 102 157 110 -90 252 -180 84 34 296 85 110 447 27 218 380
1856C80j68j92K10J43n3r6j74k2J27n0R6K88j54j19P0p8R8j17OK6K55k38J24j17
$$ 380 212 20 230 373 320 224 50 28 155 105 201 489 335 216 286 208 306 189 195 221 476 238 362 245
1880B45j49K90R2l15j39Q1K92J02l10p1J54m09L80L64l07L4j15P4NL4l36M38k00
$$ 245 96 386 478 163 24 105 397 499 189 118 272 -137 243 607 300 334 219 293 298 332 -4 434 234
1903B34J30p8j34L66j64k80L58Op9p3P4OK8l31J9L4J7N6Q5J46l85L9J96j87K68
$$ 234 364 286 152 518 354 74 432 438 359 286 360 366 394 63 82 116 133 189 274 420 35 74 270 83 351
1928C51J02k58K33j63L9q8j86o9J93l4k1l7k72J58j37N3J14K32n7j17k50J45l57
$$ 351 453 195 428 265 304 216 30 -39 154 120 99 62 -210 -52 -189 -136 -22 210 153 36 -214 -69 -426
1951d26l1L24mK2j82q0p8j57K20K6J33j98K32j64j57K6%Pn6K66l92J83J07ok41
$$ -426 -457 -133 -137 -115 -297 -377 -455 -612 -392 -366 -233 -431 -199 -363 -520 -494 -494 -487 -543 -277 -669 -486 -379 -385 -626
1976f26KJ32R3j02O2J72M2o4k12r9P0K62k14K73j23J16n0k40L41p2j61K17k5r3
$$ -626 -624 -492 -399 -501 -439 -267 -225 -289 -501 -600 -530 -268 -482 -209 -332 -216 -266 -506 -165 -237 -398 -181 -206 -299
2000b99P2K94l42n3M05O4L6l59L01l0k66J32O4M8j07M0L59k85j16J44k5l0L34
$$ -299 -227 67 -275 -328 77 141 177 -182 119 89 -177 -45 19 67 -40 0 359 74 -42 102 77 47 381
2023C81j10J9k98Nk03L35J40K34l58J42j28j2R5l7q0J80j07J35kM9m00O7l5JJ81
$$ 381 271 290 -8 -3 -206 129 269 503 145 287 159 147 242 205 125 305 198 333 331 380 -20 47 12 13 194
2048A94J31j68K09j93L9l58K8L56o6K19l61K75k96L85j85P2J7k31J80n6j14O6
$$ 194 325 157 366 173 212 -146 -118 238 172 391 30 305 9 394 209 281 298 67 247 191 77 143
2070A43Qp2J06k29K80Q1K9j50j74R5j02J92J37l57J66l7k4J78k69J85j08K04p2
$$ 143 151 79 185 -44 236 317 346 196 22 117 15 207 344 -13 153 116 92 270 1 186 78 282 210
2093B10N2l5p9K57p8k10j85K01L71m00K5k0l05K31l5k8K0J95j77J0j28k00K08
$$ 210 262 227 148 405 327 117 -68 133 504 104 129 109 -196 35 0 -28 -8 187 10 20 -108 -308 -100
2116a00j37Q7k40M18J69J36o72K37m1J63l40L93n5n5J5l59J51m0K01j96L2j0l5
$$ -100 -237 -150 -390 28 197 333 -339 -102 -143 20 -320 73 18 -37 -22 -381 -230 -270 -69 -265 -233 -243 -278
2139b78m7j34K4j00L89m03R0K11k97R5J96%j32k4J47J53l86O4M18q2j85qK69k27
$$ -278 -325 -459 -435 -535 -146 -549 -459 -248 -545 -450 -254 -254 -386 -410 -263 -110 -496 -432 -14 -96 -281 -289 -20 -247
2163b47J02k86K80l05J09J32J25j11R3J62q8q0j08l1L28K15j08j22P6j67n5Q7
$$ -247 -145 -431 -151 -456 -347 -215 -90 -201 -108 54 -34 -114 -222 -253 75 290 182 60 136 -31 -86 1
2185AM9M3O7L2j75j10K36m9j55R8K33m3P7q2M9l7j5R1m0l7L31l59q9P1j90M07
$$ 1 50 93 160 192 17 -93 143 94 -61 37 270 227 304 222 271 234 219 310 270 233 564 205 116 187 -3 404
2211D04ml1j17K30n84K57J43k58K43j59K03J57k90p7r7J71R4l17M22k14J92p3
$$ 404 400 369 252 482 -102 155 298 40 283 124 327 484 194 117 20 191 285 -32 390 176 368 295
2233B95j69K00k49o9R5J39L3k45K64k05j0J3K01l42K64j5M7k17M6j5k30K11n2
$$ 295 126 326 77 8 103 242 275 30 294 89 79 92 293 -49 215 200 247 30 76 61 -169 42 -10
2256a0J36j48J26j13O2j91L5J00J40R3k21l1J08j87R8q9m0K54rk59K10l6j32j47
$$ -10 126 -22 104 -9 53 -138 -103 -3 137 230 9 -22 86 -101 -3 -92 -132 122 113 -146 64 28 -104 -251
2280b51Q3p1J18j4J04j14k39J46L64j26M1J64m94q4OJ32J8J57J38Pl03R6l24N15
$$ -251 -168 -239 -121 -135 -31 -145 -384 -238 126 0 41 205 -289 -373 -367 -235 -217 -60 78 85 -218 -122 -446 69
2304F9l26L0R9L7j76J54j31J7J13j49l1R6L15l08j49j2K23l39o1M17o6m7J24L2
$$ 69 -257 -227 -128 -91 -267 -113 -244 -227 -114 -263 -294 -198 117 -191 -340 -352 -129 -468 -529 -112 -178 -225 -101 -69
2328f9rj66k73K88J89j22J71m25K08K61m32l21O30p0J12M4q2p0K55q5j24J19N4
$$ -69 -78 -244 -517 -229 -40 -162 9 -416 -208 53 -379 -700 -70 -140 -28 16 -66 -136 119 34 -90 29 83
2351H3j6K46m69R8K90k27J4Q4j62L59l19J95r4m9L50m50L9L78q7k67L05j06j82
$$ 83 67 313 -156 -58 232 5 19 103 -59 300 -19 176 82 33 383 -67 -28 350 263 -4 301 195 13
2374A3N78l00K26k21K1J25Rk30K0j33L34n7m35j09L61j3qq3J19K21n0j90N3O1
$$ 13 591 291 517 296 317 442 451 221 241 108 442 385 -50 -159 202 189 181 98 217 438 388 198 251 312
2398C12k43K16j12K2j54K85j56o7oj75k9K13j11J78J06k7j03L2k42n3K21r1J45
$$ 312 69 285 173 195 41 326 170 103 97 -78 -107 106 -5 173 279 252 149 181 -61 -114 107 16 161
2421A61J75%l36j57L59o2J30k37P1m5r2l1k08pL51r2J8q8J22j51K6L8Q5p3J13
$$ 161 336 336 0 -157 202 140 270 33 104 59 -33 -64 -272 -279 72 -20 -2 -90 32 -119 -93 -55 30 -43 70
2446G0qk52J67j63k57J91K47k29L94j53j93n2K90l04K61j38L9r9K48n7k39L85
$$ 70 62 -190 -23 -186 -443 -252 -5 -234 160 7 -186 -238 52 -252 9 -129 -90 -189 59 2 -237 148
2468A48k22n1l2K10j70Q2j14M4l1Q3j02k18R2P4J45l3k46M4J53K07rl29J54J22
$$ 148 -74 -125 -157 53 -117 -35 -149 -105 -136 -53 -155 -373 -281 -207 -62 -95 -341 -297 -144 63 54 -275 -121 1
2492Aj75J18j59j34N23k04j39K59j94N1k02L9p8L38k86J22J80j19J12q7k62J30
$$ 1 -174 -56 -215 -349 174 -30 -169 90 -104 -53 -255 -216 -294 44 -242 -120 60 -59 53 -34 -296 -166
2514a66Q0j06K25j39po2L7K65p1k59Q4K08k12J38q9M6J25j6r4j70L70k39K62j07
$$ -166 -86 -192 33 -106 -113 -175 -138 127 56 -203 -119 89 -123 15 -74 -28 97 81 -13 -183 187 -52 210 103
2538A03Q9J28j53k06K30J21r4J14q9q9P9N7j25K71j57j42L46n8l67j73L62M09
$$ 103 192 320 167 -39 191 312 218 332 243 154 233 290 165 436 279 137 483 425 58 -115 247 656
2560F56m13K50m98K25j19J41Q4l52K75m52M08n4J49j00k00K10rN8o7j52j85M30
$$ 656 243 493 -5 220 101 242 326 -26 249 -203 205 151 300 200 0 210 201 259 192 40 -145 285
2582B85l46K70K9j60J6j19nj7J33j15K45k30R4K03j94k13R7j44K41l9Q5k07L63
$$ 285 -61 209 238 78 94 -25 -30 -47 86 -29 216 -14 80 283 89 -124 -27 -171 70 31 116 -91 272
2605B72m18k49L62p5j11k1R8J98O8k81Kr7J25k99N90l29m1n8l4J81j38M5j4L1
$$ 272 -146 -395 -33 -108 -219 -240 -142 56 124 -157 -155 -252 -127 -426 164 -165 -206 -264 -298 -117 -255 -210 -224 -193
2629a93L56k97K00l39L2J15K68nj91q1R7k27J08M7J74j35j41R8J05k30J26R8l14
$$ -193 163 -134 66 -273 -241 -126 142 137 -54 -135 -38 -265 -157 -110 64 -71 -212 -114 -9 -239 -113 -15 -329
2652c29L61n8j69l9R2K11m9n1j91j73L75k89K12j54K58k45J46J5J07L9K4j92L1
$$ -329 32 -26 -195 -234 -142 69 20 -31 -222 -395 -20 -309 -97 -251 7 -238 -92 -77 30 69 93 -99 -68
2675f8N8k49J30J77n9M2P8k16lo9J06q0p7K25k36M19l63R2O2K88o8j23k49P3O
$$ -68 -10 -259 -129 48 -11 31 109 -107 -110 -179 -73 -153 -230 -5 -241 178 -185 -93 -31 257 189 66 -183 -110 -104
2700a04J18K60l21%K32O3j10l23K11m6P4L6j67M12k17P1k32J3J37j13L66l19q6
$$ -104 14 274 -47 -47 185 248 138 -185 26 -20 54 90 -77 335 118 189 -43 -30 107 -6 360 41 -45
2723d5K74l02J78J17k06j60L58m0K4j56L20q0p1k80K93q2K3l8J53j34r0M34m17
$$ -45 229 -73 105 222 16 -144 214 174 198 42 362 282 211 -69 224 142 165 127 280 146 56 490 73
2746G3K38j22l49J93L11j23L0k63J58M0m9L0l02L4J5J47K26m75K86j08K93j80
$$ 73 311 189 -160 33 344 221 251 -12 146 186 137 167 -135 -101 -86 61 287 -188 98 -10 283 103
2768A03kqq5J8L5m7k06J29J85k1k6o7K48l63J26OP1k62J82k20K06N1K9l5r6R0
$$ 103 101 93 8 26 61 14 -192 -63 122 101 75 8 256 -107 19 25 96 -166 16 -204 2 53 82 47 -49 41
2794D1j92J16j21J26J69lk23q1QM10l09J09j78L3J82j64R9O9P7l51J24o8Q8J00
$$ 41 -151 -35 -156 -30 139 136 -87 -168 -160 250 -59 50 -128 -95 87 -77 22 91 168 -183 -59 -127 -39 61
2818F1R4p7l42P6J01J00r1J03j8j10j62K55j95JQ3M3O2j53J29Q6j84o0J0J53J71
$$ 61 155 78 -264 -188 -87 13 -78 25 7 -103 -265 -10 -205 -204 -121 -78 -16 -169 -40 46 -138 -198 -188 -35 136
2843A36l87J50J85l06J08K05l63L05N6j09r5Nj12K67J4N4l3k33M48j78n5n7P9
$$ 136 -251 -101 84 -222 -114 91 -272 33 89 -20 -115 -110 -222 45 59 113 80 -153 295 117 62 5 84
2866H4j77J48k32r1K66p4K08k83J61j38j29L41J04m89N21n3j01Mj05K02k67J50
$$ 84 -93 55 -177 -268 -2 -76 132 -151 10 -128 -257 84 188 -301 220 167 66 70 -35 167 -100 50
2888E0k6K3j1m7L9J14k62K94j54K6r7K52J13m15J53p6J34K63l24J71L0j6N8k05
$$ 50 24 47 36 -11 28 142 -120 174 20 46 -51 201 314 -101 52 -24 110 373 49 220 250 234 292 87
2912H7K30m9j89K17j53q2N1k75J93K0O6k05J68j17PN6j21R4q5L83k6j92J40l60
$$ 87 317 268 79 296 143 61 112 -163 30 50 116 -89 79 -38 -31 25 -96 -2 -87 296 270 78 218 -142
2936a42j2Km2J8M71k99p5M54m55K4m8J7j2P4N6j20j45N00k30q1K4Pk71K51k1Q0
$$ -142 -154 -152 -194 -176 295 -4 -79 375 -80 -56 -104 -87 -99 -25 31 -89 -234 266 36 -45 -21 -14 -285 -34 -55 25
2962B5k5j60j01K48n7O3J6J18k91K26o2j44K76k57J95p5M6J24j90L65j34k17K52
$$ 25 0 -160 -261 -13 -70 -7 9 127 -164 62 0 -144 132 -125 70 -5 41 165 -25 340 206 -11 241
2985B41k44k04N1K03N5j56o4j2J9N3N7M0j70OK61R0k66l0K29j15J01j19j66K11
$$ 241 -3 -207 -156 47 102 -54 -118 -130 -111 -58 -1 39 -131 -125 136 226 -40 -70 159 44 145 26 -140 71
3009G1j78j3J2J31r4J32J53l97J64J89l75L57l35J53K83j31P1k52J76l3j95L61
$$ 71 -107 -120 -108 23 -71 61 214 -183 -19 170 -205 152 -183 -30 253 122 193 -59 117 84 -111 250
3031B50j13k13n1K3J77L31m26J71j72j1K50j41k03J10r6J57R0n2k73K97k8j48
$$ 250 137 -76 -127 -104 73 404 -22 149 -23 -34 216 75 -128 -18 -114 43 133 81 -192 105 77 -71
3053g1M6k28K35L92k80J02l67K82K65m18J07l1p1L7J88N3j35j61P0K3j23K41m5
$$ -71 -25 -253 -18 374 94 196 -171 111 376 -42 65 34 -37 0 188 241 106 -55 15 38 -85 156 111
3076A11k37R1L1j21K87j89q0J15o0K2o5L18k18j16L15j21L7Q0q3J63r7j27r7Q5
$$ 111 -126 -35 -4 -125 162 -27 -107 8 -52 -30 -95 223 5 -111 204 83 120 200 117 280 183 56 -41 44
3100D4J69l98J98L12l79J2K15M0j68J7l8oJ9J53k17rJ71l92J75J3PJ48m9j59n9
$$ 44 213 -185 13 325 -54 -42 173 213 45 62 24 18 37 190 -27 -36 135 -257 -82 -69 -62 86 37 -122 -181
3125a81K12n1O6N2k1k0K8l19L64m7l4k1k10j17M97l40J87q1j51J97k81K85J51
$$ -181 31 -20 46 98 77 57 85 -234 130 83 49 28 -182 -299 198 -142 45 -36 -187 10 -271 14 165
3148A65k36J26j58J38k08K10N1j11O4k40K98k05mK23j90K28k3n6j83J57m76N18
$$ 165 -71 55 -103 35 -173 37 88 -23 41 -199 99 -106 -110 113 -77 151 128 72 -111 46 -430 88
3170H8k2j48L99n06n9K17j97K24J82k10k43L96j65R4k39j5K37j71J81j68rJ89
$$ 88 66 -82 317 -189 -248 -31 -228 -4 178 -32 -275 121 -44 50 -189 -204 33 -138 43 -125 -134 55
3192E5j66J56J34j79j06K5J34j57J27Jj02j54J36q3K16j46J69k10R7n2O2R4lr3
$$ 55 -111 45 179 0 -106 -81 53 -104 23 24 -78 -232 -96 -179 37 -109 60 -150 -53 -105 -43 51 48 -45
3216d5l7Q4J2j49k1L1J56m7Rj23p7P1J49K4m4q0J96n0n2N5j99l3N8L03k04l6l7
$$ -45 -82 2 14 -135 -156 -125 31 -16 -7 -130 -207 -136 13 37 -7 -87 109 59 7 62 -137 -170 -112 191 -13 -49 -86
3243h6L49l01j60k0J93j60r6L90k07j0J14K27k57M3k24J25J56n3p1m9pK11o3m9
$$ -86 263 -38 -198 -218 -25 -185 -281 109 -98 -108 6 233 -24 19 -205 -80 76 23 -48 -97 -104 107 44 -5
3267eN9j62O7k4K96j37j94K22j68m9j9NO0q2J58j17J60j36L44m65L37k34K8L07
$$ -5 54 -108 -41 -65 231 94 -100 122 -46 -95 -114 -109 -49 -131 27 -90 70 -66 278 -187 150 -84 -56 251
3291B51j43J93l23J54l48J9L42j06k82K56L4K25m42M08m29K6M16k20J2k94L10
$$ 251 108 301 -22 132 -216 -197 145 39 -243 13 47 272 -170 238 -191 -165 251 31 43 -251 59
3312E9j92K26n0k4p4N1J03l23M14k15K2q1j05L39j80n6O0j24J50p6P1K43l87k7
$$ 59 -133 93 43 19 -55 -4 99 -224 190 -25 -3 -84 -189 150 -30 -86 -26 -150 0 -76 -5 238 -149 -176
3336a76K87n6K5k30L19m68N19j12J37k76j70M73l05NJ27j0j03Q8Q2j84K33j14
$$ -176 111 55 80 -150 169 -299 220 108 245 -31 -201 272 -33 -28 99 89 -14 74 156 -28 205 91
3358I1k92K96J64q5L1l89j21J07L35Q4l60q7M47J45k62K66l47J19n9J76l97K46
$$ 91 -201 95 259 174 205 -184 -305 -198 137 221 -139 -226 221 366 104 370 23 142 83 259 -138 108
3380A08j67J14j90k67N33j61J07K00k79j94L13k04L51m01K77m3p7J25k34J12j16
$$ 108 -59 55 -135 -402 131 -30 77 277 -2 -196 117 -87 264 -137 140 97 20 145 -89 23 -93
3401i3K1J11j3j69K50q2m0j31J55J62j99O5J02l90J29P3J56k3J34L2k19O7q1J56
$$ -93 -72 39 26 -143 107 25 -15 -146 9 171 -28 37 139 -251 -122 -49 107 84 218 250 31 98 17 173
3425A73r6J16k50J01k5l53J62O3r7P1J43p7Nk7P8J54MJ09l39L08k91L11j79j75
$$ 173 77 193 -57 44 19 -334 -172 -109 -206 -135 8 -69 -64 -91 -13 141 145 254 -85 223 -68 243 64 -111
3449a11K45j06J39q8q7L9o4m1J2j1J66l08K79Q2j27J93J6k86j19j8P6K26k5j56
$$ -111 134 28 167 79 -8 31 -33 -74 -62 -73 93 -215 64 146 19 212 228 -58 -177 -195 -119 107 82 -74
3473g4K48k34j6K59k46MLj45K14j21j23%L11j10q5j01J79k87J88K56j99L29l18
$$ -74 174 -60 -76 183 -63 -59 -56 -201 13 -108 -231 -231 80 -30 -115 -216 -37 -324 -136 120 -79 250 -68
3496f8k12N2L98l17K0R9j00O0J77J0q1J3q2RkJ46l4p5J43l72K33J66m3R3m17J80
$$ -68 -280 -228 170 -147 -127 -28 -128 -68 109 119 38 51 -31 -22 -24 122 88 13 156 -216 17 183 140 233 -184 -4
3522dm9J3K9j78K80j33K77k77J85l06J58K30k70k0O9J13m63L76j71K21n5k43J44
$$ -4 -53 -40 -11 -189 91 -42 235 -42 143 -163 -5 225 -45 -65 4 117 -346 30 -141 80 25 -218 -74
3545g4L7NP2k25K07r6J66qO2j28k38j5M15l44o8J45J17r2J17r6J59k49J66k85
$$ -74 -37 -32 40 -185 22 -74 92 84 146 18 -220 -235 180 -164 -232 -87 30 -62 55 -41 118 -131 35 -250
3569b50J68J3J57k79J07K08J4l79L87k50j67M70k78K04k50jL81j82J1J15r4p4
$$ -250 -82 -69 88 -191 -84 124 138 -241 146 -104 -271 199 -79 125 -125 -126 255 73 84 199 105 31
3591C1k79L20j98n0K04R1P4j18k2j55J38j4k88J89J12k07P4O6J43q7j56J80J36
$$ 31 -248 72 -126 -176 28 119 193 75 53 -102 36 22 -266 -77 35 -172 -98 -32 111 24 -132 48 184
3614A84k41J24k34Lr3K68r8k13k3M04j09o5K14rk9j14o7K38L0j16k53K60j15k22
$$ 184 -57 67 -167 -164 -257 11 -87 -300 -323 81 -28 -93 121 112 83 -31 -98 140 170 54 -199 61 -54 -276
3638b76K68j47J5J3Q7kk1P0j33J10M1K09j0k58J24m0k1mJ9k54K69K08k06O3q3
$$ -276 -8 -155 -140 -127 -40 -42 -63 7 -126 -16 25 234 224 -34 90 50 29 25 44 -210 59 267 61 124 41
3663D1k37L34J00l00J64j25J16k00J78p4k50K41o4Jj26J08K67j07p0r1L83k25
$$ 41 -196 138 238 -62 102 -23 93 -107 71 -3 -253 -12 -76 -75 -201 -93 174 67 -3 -94 289 64
3685F4k93J23q5J19j9J94o3l53L90m0J21j19J75l40J17R0k38R4k09J16J38N1k10
$$ 64 -229 -106 -191 -72 -91 103 40 -313 77 37 158 39 214 -126 -9 81 -157 -63 -272 -156 -18 33 -177
3708a77j38J41K28K14l87J92L2l48R5J27J42k25L9O3O9j40R5K51l03J52L6l03
$$ -177 -315 -174 54 268 -119 73 105 -243 -148 -21 121 -104 -65 -2 67 -73 22 273 -30 122 158 -145
3730a45O5M50m23J24r1Mm73P71j42k59J35k75M77k44P2M4N2L2m76L58l84K50J37
$$ -145 -80 370 -53 71 -20 -16 -489 282 140 -119 16 -259 218 -26 46 90 142 174 -302 56 -328 -78 59
3753E9J01j15O5k41J32QL3j45R6J2j5j23K17j31O8r3L4p4q4L34m48L54l7K16l89
$$ 59 160 45 110 -131 1 9 42 -103 -7 5 -10 -133 84 -47 21 -72 -38 -112 -196 138 -310 44 7 223 -166
3778a66J35l8j22J78K24j12k08M08l04j13oK65j54J79j48r0K54k38J83r2k56K28
$$ -166 -31 -69 -191 -13 211 99 -109 299 -5 -118 -124 141 -13 166 18 -72 182 -56 127 35 -221 7
3800Gm5J0J74j3m66K91J44l17N1J14Q9J44k66L34l58K3J60J48l72K44q6j77L98
$$ 7 -38 -28 146 133 -333 -42 102 -215 -164 -50 39 183 -83 251 -107 -84 76 224 -148 96 10 -167 231
3823B31p3k27J39l3j0q8L1J04j42o2J65l9K28M5m16J34J13j93rj14J70j91K9J83
$$ 231 158 -69 70 37 27 -61 -30 74 -68 -130 35 -4 224 269 -147 -13 100 -93 -102 -216 -46 -237 -208 -25
3847b5j00j29L64o4j35K4K43oj46M6J88n4m85L02m7Q0r8q9K11J35l64L17l9j52
$$ -25 -125 -254 110 46 -89 -65 178 172 26 72 260 206 -279 23 -24 56 -42 -131 80 215 -149 168 129 -23
3871b3j20J47j91R9j07j79N86j87k95L62l45K78R6r6L05p4j73j05M4J25p1k82
$$ -23 -143 4 -187 -88 -195 -374 212 25 -270 92 -253 25 121 25 330 256 83 -22 22 147 76 -206
3893b06J87k19L05j74M1K56n5k91o7J07R6K29j31N7m4j27o8pq8M44l14r1J99r6
$$ -206 -19 -238 67 -107 -66 190 135 -156 -223 -116 -20 209 78 135 91 -36 -104 -111 -199 245 -69 -160 39 -57
3917e7M6j92M6M07j73m3j11J12k4j08j68K24NJ06m40L39J03J5j10J73o8j87K74
$$ -57 -11 -203 -157 250 77 34 -77 35 11 -97 -265 -41 -36 70 -370 -31 72 87 -23 150 82 -105 169
3940A69k67KL41l08mj15L29n1M0O9l43M15k15j0k13J58Q0j44m5K04O0l65L1K95
$$ 169 -98 -96 245 -63 -67 -182 147 96 136 205 -138 277 62 52 -161 -3 77 -67 -112 92 152 -213 -182 113
3964A13j6k60K27r9n0J88j42k55J28J25K02k84K39r9N7J13j82N6J86m25K64k86
$$ 113 97 -163 64 -35 -85 103 -39 -294 -166 -41 161 -123 116 17 74 187 5 61 247 -178 86 -200
3986b00L74l07L37j18J15k13M5J49j97p5LR0k3K1J13q4k12l1jJ62K44k52K79r5
$$ -200 174 -133 204 86 201 -12 33 182 -15 -90 -87 3 -20 1 114 30 -182 -213 -214 -52 192 -60 219 124
4010A24k92K20j96K1J03K9K8j42R1M6j4j91q5K56q1K21P3l62pK95o9l04L36J9
$$ 124 -168 52 -144 -123 -20 9 37 -105 -14 32 18 -173 -258 -2 -83 138 211 -151 -158 137 68 -236 100 119
4034A19k4P9j41%J1m9N7k22L46Q1n30M41j89N7j19k4P4K03l21O9K58l11J75k01
$$ 119 95 174 33 33 44 -5 52 -170 176 257 -273 168 -21 36 -83 -107 -33 170 -151 -82 176 -135 40 -161
4058a61J15J35l52K32j30m6L20k10K41k77J78q5o7J7N4J71k10l1k1K0J34J04j19
$$ -161 -46 89 -263 -31 -161 -207 113 -97 144 -133 45 -40 -107 -90 -36 135 -75 -106 -127 -107 27 131 12
4081A2k1O7J17p7K59m55k4O7J15kl2J6J39j66O5l5j40l7K13j11r9J33j36J5j72
$$ 12 -9 58 175 98 357 -98 -122 -55 60 58 26 42 181 15 80 45 -95 -132 81 -30 -129 4 -132 -117 -289
4106b89K54K43n9k72J67J28j66k48K27J18P1j02j4l05K14o5Q9m3J21pj01J5K31
$$ -289 -35 208 149 -123 44 172 6 -242 -15 103 174 72 58 -247 -33 -98 -9 -52 69 62 -39 -24 207
4129B07r2l16J85j18K07j69q5K58j68J51j36Kl8j9J64j95m5J81j04O2j04J23M3
$$ 207 115 -201 -16 -134 73 -96 -181 77 -91 60 -76 -74 -112 -131 33 -162 -207 -26 -130 -68 -172 -49 -6
4152fr9n6J78k9K70j93l23K78l3rk5k36M1K37k15L96oj15j48j13K58l20L61j9
$$ -6 -105 -161 17 -12 258 65 -258 20 -13 -22 -47 -283 -242 -5 -220 176 170 55 -93 -206 52 -268 93 74
4176G4N8l01J93J99j1l55J13m9J15P7j20N8J7L18n60L15q0k36Q8K73j73k0J51
$$ 74 132 -169 24 223 212 -143 -30 -79 36 113 -7 51 68 386 -174 141 61 -175 -87 186 13 -7 144
4199A44l8k00J90k0L5J04l41J63J54m5k42P9K2r0j20Q1K8J65l8J0R5j82j55K22
$$ 144 106 -94 96 76 111 215 -126 37 191 146 -96 -17 5 -85 -205 -124 -96 69 31 41 136 -46 -201 21
4223B1j12K92j74k27L47j38R0l58K94J12q2j40ljj17Q4K45R6jn3m05J90pJ76j25
$$ 21 -91 201 27 -200 147 9 99 -259 35 147 65 -75 -78 -79 -196 -112 133 229 228 175 -230 -40 -47 129 4
4248DL2Q7j50J94p7j67j46LK35k18K05M0n8l0R6l4J67J42l69P6j8N5k11K60k13
$$ 4 36 123 -27 167 90 -77 -223 -220 15 -203 2 42 -16 -46 50 16 183 325 -44 32 14 69 -142 118 -95
4273i5J57k03JKP7L08l09J36k78K53J16l37J19K8k31J31J44m9j11K91j80J60j34
$$ -95 62 -141 -140 -138 -61 247 -62 74 -204 49 165 -172 -53 -25 -256 -125 19 -30 -141 150 -30 130 -4
4296dM3r0J36m4K10q8j65J13%k15n5J51K5l8O7k7l5k58M65k58J15n2J28k88J96
$$ -4 39 -51 85 41 251 163 -2 111 111 -104 -159 -8 17 -21 46 19 -16 -274 191 -67 48 -4 124 -164 32
4321C2J31k19J12J40k53J92j35J23o0q9J54k95L60l47p2K82j23Q5O5r9J28m89
$$ 32 163 -56 56 196 -57 135 0 123 63 -26 128 -167 193 -154 -226 56 -67 18 83 -16 112 -377
4343c77L68P3j11J50k23K38l1q8j91M55m18J88J26k46J17J21j64L09l16j88K82
$$ -377 -9 64 -47 103 -120 118 87 -1 -192 263 -155 33 159 -87 30 151 -13 296 -20 -208 74
4364G4Q2Kk21R9j11L06j05m1j65N5R5k76M7OJ96J29j98O6J2m4K59j14j49m0j30
$$ 74 156 158 -63 36 -75 231 126 85 -80 -25 70 -206 -159 -153 43 172 -26 40 52 8 267 153 4 -36 -166
4389a66M12n01K10J10n8KP0O8q1j85Q7LM9P9kN5j03J03k25P3K71j49k23L92k88
$$ -166 246 -255 -45 65 7 9 79 147 66 -119 -32 -29 20 99 97 152 49 152 -73 0 271 122 -101 291 3
4414CK43oj13k51O5J33j26k08J18K89k63K59J15j04l85J97K33j49Mk31K81l23
$$ 3 246 240 127 -124 -59 74 -52 -260 -142 147 -116 143 258 154 -231 -34 199 50 54 -177 104 -219
4436b19K04L6k38L04j24N7r1R0j14k3K94k98K82j82J61l24J42K95l35K11j64Q7
$$ -219 -15 21 -217 87 -37 20 -71 19 -95 -118 176 -122 160 -22 139 -185 -43 252 -83 128 -36 51
4458E1j29N0J12n5j1j02J81j31K10k69P8J83r2k54J60P2R5n8k67L8K16q3J02q3
$$ 51 -78 -28 84 29 18 -84 97 -34 176 -93 -15 168 76 -178 -18 54 149 91 -176 -138 78 -5 97 14
4482A4j23J34n1M0Q7o9J6N8l70K16N3R7k56N7K0j35K81J00k62j47J63l2L67p3
$$ 14 -109 25 -26 14 101 32 48 106 -264 -48 5 102 -154 -97 -77 -212 69 169 -93 -240 -77 -109 258 185
4506A85k27K08j05J28n1l13N43j72k18J01j30K22r7p2J6L59n13K64j27k2P1k6
$$ 185 -42 166 61 189 138 -175 368 196 -22 79 -51 171 74 2 18 377 -136 128 1 -21 50 24
4528B4K16l13j97J00J30j4q3K64j24J87m05M34k25k45L27J30j29l80L08Nj48l0
$$ 24 240 -73 -270 -170 -40 -54 -137 127 3 190 -215 219 -6 -251 76 206 77 -303 5 10 -138 -168
4550a68K13j50o9K88K7p7N1rJ8R1o1m8p3k0N4j20o3O3L3M2K77j61k92J30j01K02
$$ -168 45 -105 -174 114 141 64 115 106 124 215 154 106 33 13 67 -53 -116 -53 -20 22 299 138 -154 -24 -125 77
4576G7L14j64j95p9R8k2j02L81k62j12j81K86l46L57p8l8K4K3J19J29n4l26K91
$$ 77 391 227 32 -47 51 29 -73 308 46 -66 -247 39 -307 50 -28 -66 -42 -19 100 229 175 -151 140
4599A40j47KJ95k62J15J59j13j94J61j25j01L23j04N0k28L31k98j93L40lJ32L
$$ 140 -7 -5 190 -72 43 202 89 -105 56 -69 -170 153 49 99 -129 202 -96 -289 51 48 180 183
4621A83j17k8l8k18J78K01j17k69J21R8q6J24k93L01Q2j13k4O2o1m7J29J82k99
$$ 183 66 38 0 -218 -40 161 44 -225 -104 -6 -92 32 -261 40 122 9 -15 47 -14 -61 68 250 -49
4644d9k2M1j77L66k15K08r0k0j86p2K06l34J42K17J3K8o2J96o9j21j62J45J8k0
$$ -49 -71 -30 -207 159 -56 152 62 42 -144 -216 -10 -344 -202 15 28 56 -6 190 121 0 -162 -17 1 -19
4668a9K2n1J30k7r3O7k03J68K28j85J02j19k20K05J48n28M23J95J96m44p4K07
$$ -19 3 -48 82 55 -38 29 -174 -6 222 37 139 20 -200 5 153 -375 48 243 439 -5 -79 128
4690A28j00j86J80j89L2K01J00k95J67j21k7J53J03j26k54L88O8j33l77M78k98
$$ 128 28 -158 22 -167 -135 66 166 -129 38 -83 -110 43 146 20 -234 154 222 89 -288 190 -108
4711a08K56Q1k41M8M4m2k49L66L9k95K01l18K95p0j61j9j03K85N1L3j08J88k64
$$ -108 148 229 -12 36 80 38 -211 155 194 -101 100 -218 77 7 -154 -173 -276 9 60 93 -15 173 -91
4734i1q0K72j64k9K75k79j13p1K41r8J3J20RM4n8o5J26J9k74l4K66j16k0N8q9
$$ -91 -171 101 -63 -92 183 -96 -209 -280 -39 -137 -124 -4 5 49 -9 -74 52 71 -203 -237 29 -87 -107 -49 -138
4759a38m3J25J39m14L2N62Mj42N3j06l02L71j46j21j02K09K36j09j04K20l20N7
$$ -138 -181 -56 83 -331 -299 263 267 125 178 72 -230 141 -5 -126 -228 -19 217 108 4 224 -96 -39
4781c9j5J97M7k22J6O6k42j84M61J15k36K96j28k46P5j6Q8j98K88j33P5j42o5
$$ -39 -54 143 190 -32 -16 50 -192 -376 85 200 -36 260 132 -114 -39 -55 33 -165 123 -10 65 -77 -142
4804a42J83r7j8J07l3r0K61o0j17J68k10k45K12j7j0J18K58l17j0K70k49pJ76
$$ -142 41 -56 -74 33 0 -90 171 111 -6 162 -48 -293 -81 -98 -108 10 268 -49 -59 211 -38 -45 131
4827A31j45O8j70K58k8l76L26K20k82L7p5J73k07J12r4k21J47O1r2L00m24N88
$$ 131 -14 54 -116 142 114 -262 64 284 2 39 -36 137 -70 42 -52 -273 -126 -65 -157 143 -281 307
4849C07m27k8J76L6j03l0k7l2J08J40o4k3J3n9O0k17P2J00R3k90J14K38M9j04
$$ 307 -120 -148 28 64 -39 -69 -96 -128 -20 120 56 33 46 -13 47 -170 -98 2 95 -195 -81 157 206 102
4873A02k7k07J65K14Oj31k00J35J15Nj32j83oJ64N2k62K52Jo1k5n7J16NK23l35
$$ 102 75 -132 33 247 253 122 -78 57 172 177 45 -138 -144 20 72 -190 62 63 2 -23 -80 36 41 264 -71
4898g1J12k02Q8j6K37j64j87J32o6K95j27k15J40J10l2N8j68P1j43O4K0O6P3r4
$$ -71 41 -161 -73 -89 148 -16 -203 -71 -137 158 31 -184 -44 66 34 92 -76 -5 -148 -84 -64 2 75 -19
4922a9K06k97J12J04k39J68K0P3r1k5p3qL71J6m10J37j53K10m6jNJ2j72q1J53
$$ -19 187 -110 2 106 -133 35 55 128 37 12 -61 -69 302 318 -92 45 -108 102 56 55 60 72 -100 -181 -28
4947b8J2o7Q7JJ57o2j79K20L9j82L0K7L0j97K17j63Q8J28j59j39K68j42QP9j68
$$ -28 -16 -83 4 5 162 100 -79 141 180 -2 28 55 85 -112 105 -58 30 158 -1 -140 128 -14 -6 73 -95
4972i5j95N35l50K99k38P7J37l1k41J44j39K26L6O6l60J86j06j14M95j08n12L21
$$ -95 -290 245 -105 194 -44 33 170 139 -102 42 -97 129 165 231 -129 57 -49 -163 332 224 -288 33
4994C3J49k13P1N9k7m44K00K00K81j14j99o5N3O4J47j01N3nm75L83j2j7J14L5
$$ 33 182 -31 40 99 72 -372 -172 28 309 195 -4 -69 -16 48 195 94 147 142 -333 50 38 21 135 170
5018A70j84J3j76J49o3J02j00K20N3k90J31M5j30J56j23j0J61n1o1K15l57K59
$$ 170 -14 -1 -177 -28 -91 11 -89 131 184 -106 25 70 -60 96 -27 -37 124 73 12 227 -130 129
5040A29L3l49K6J06J70k81o7J76J44p7r5K4Q7j24L1J06j14J00k05K29J43J39m45
$$ 129 162 -187 -161 -55 115 -166 -233 -57 87 10 -85 -61 26 -98 -67 39 -75 25 -180 49 192 331 -114
5063a14J25J04j81J4R0k9M2MM1k71J16p0K79M1k84j31J15J50r1M20n33L33k49
$$ -114 11 115 -66 -52 38 9 51 55 96 -175 -59 -129 150 191 -93 -224 -109 41 -50 370 -163 170 -79
5086g9J27M3np0J24j12mj25J83k32j96L81j12J19O1M5p3J30P4k62r8L8J18l0l14
$$ -79 48 91 86 16 140 28 24 -101 82 -150 -346 35 -77 42 103 148 75 205 279 17 -81 -43 75 45 -269
5111b69M18J5j18N3l1jR0q6j55q4L21k2J5o3j28L8j07J11O5k98lL38n1j10J55
$$ -269 149 164 46 99 68 67 157 71 -84 -168 153 131 146 83 -45 -7 -114 -3 62 -236 -239 99 48 -62 93
5136I3Q6k03J10J02j79n7n0M02j54k36l7J87J04l16J07M6K26n37L05j73J44L16
$$ 93 179 -24 86 188 9 -48 -98 304 150 -86 -123 64 168 -148 -41 5 231 -306 -1 -174 -30 286
5158B86j75o2k26L85l5j05J16j9j70j77K50j16R2k8j6k20l2K44J01j03l5Q7M5
$$ 286 111 49 -177 208 173 68 184 165 -5 -182 68 -48 44 16 0 -220 -252 -8 93 -10 -45 42 87
5181H7O4k05k16L26P7k15J65j76K32j49Q3j84M1O1j2J18k3j36J3J77n4j47k6J56
$$ 87 151 -54 -270 56 133 -82 83 -93 139 -10 73 -111 -70 -9 -21 97 74 -62 -49 128 74 -73 -99 57
5205E7Nj17J36k22J43K54l17L28q5k29J6Q7q9J35P5m17K07k99K89J34k14L7J50
$$ 57 62 -55 81 -141 2 256 -61 267 182 -47 -31 56 -33 102 177 -240 -33 -332 -43 91 -123 -86 64
5228F4p7J05N5j11o0K8K25k89K26k42j33J87L0J78j61j30k70M28j91N5R7O0om48
$$ 64 -13 92 147 36 -24 4 229 -60 166 -76 -209 -22 8 186 25 -105 -375 53 -138 -83 14 74 68 -380
5252c80M38k38N8j07R8J55n1p5j49K43j21m0K48l46K87l51J00K78j57J91k74L69
$$ -380 58 -180 -122 -229 -131 24 -27 -102 -251 -8 -129 -169 79 -267 20 -331 -231 47 -110 81 -193 176
5274A76l68K71l5k30J80m3J71R4j51j73J95q2J91m2l29R3J50j13j23r2K90K41
$$ 176 -192 79 44 -186 -6 -49 122 216 65 -108 87 5 196 154 -175 -82 68 -45 -168 -260 30 271
5296B71j23k36J83j29o3j7J75j03J02l2J9m7k88K51L07m53K11k58J3L08j6l7k29
$$ 271 148 -88 95 -34 -97 -114 61 -42 60 28 47 0 -288 -37 270 -183 28 -230 -217 91 75 38 -191
5319a91M47M4m71K77j77j11O1p9N1K30k88K99j93K77k41K46j67k87L19m0J9J01
$$ -191 256 300 -171 106 -71 -182 -121 -200 -149 81 -207 92 -101 176 -65 181 14 -273 46 6 25 126
5341A26k67K82k87N5J48k19L19l50J67MJ23k88J53q6R2J14k16R2Q7l28J55j3L11
$$ 126 -141 141 -146 -91 57 -162 157 -193 -26 -22 101 -187 -34 -120 -28 86 -130 -38 49 -279 -124 -137 174
5364A74q6m4j25k7Q6p3K42l21M07k46j19J72J34j85J03k49k2L60k97O9mK42l04
$$ 174 88 44 -81 -108 -22 -95 147 -174 233 -13 -132 40 174 -11 92 -157 -179 181 -116 -47 -51 191 -113
5387a13K51k48Q5O5j94K60N2j56M0JJ02l80R1J19J95k45J7j32J62L7L7OK6q7q
$$ -113 138 -110 -25 40 -154 106 158 2 42 43 145 -235 -144 -25 170 -75 -58 -190 -28 9 46 52 78 -9 -17
5412a7K45k87K03J63l72lk34N16j11j32K67l37L53k33l7J5r9J70k7q7OP0K03j58
$$ -17 228 -59 144 307 -65 -68 -302 214 103 -29 238 -99 254 21 -16 -1 -100 70 43 -44 -38 32 235 77
5436G7k30N1j5Q9R1k1K08k06q5k21J11KR2L41l56o4J26O4n2K36m91J62K39l26
$$ 77 -153 -102 -117 -28 63 42 250 44 -41 -262 -151 -149 -57 284 -72 -136 -10 54 2 238 -253 -91 148 -178
5460a78J99n3Q6j0ML1J42k75K75l51J51l2k50J53M0J6M8j35NK66j05O7j15J04
$$ -178 21 -32 54 44 48 79 221 -54 221 -130 21 -11 -261 -108 -68 -52 -4 -139 -134 132 27 94 -21 83
5484H3k02J08Nj33J26L5J96J7k49K83n8m36J19M21k81k26K57j33k6q7L57j88N2
$$ 83 -119 -11 -6 -139 -13 22 218 235 -14 269 211 -225 -106 315 34 -192 65 -68 -94 -181 176 -12 40
5507D0L2m9j63l9K69j26k6l34L09Q1p3O1O8O2j09j13m0K20j42O2j18K08j4j78
$$ 40 72 23 -140 -179 90 -36 -62 -396 -87 -6 -79 -18 50 112 3 -110 -150 70 -72 -10 -128 80 66 -112
5531a12L90l61M4R3j66K64j15k73k6M06j45J96p9k67K84j28K16k26j16L95k08
$$ -112 278 -83 -39 54 -112 152 37 -236 -262 144 -1 195 116 -151 133 5 221 -5 -121 274 66
5552F6o2K6Kj66J37J14M8Q7j29n3k5P1j74J0L12l72r4O2K17l9k21L90j18j5k08
$$ 66 4 30 32 -134 3 117 165 252 123 70 45 116 -58 -48 264 -108 -202 -140 77 38 -183 207 89 74 -134
5577a34n2Q3K9k9O6Q6J5j63M3J58p2j08M1pm3K5M19l02j13Q9l6j81J39J47j82
$$ -134 -186 -103 -74 -103 -37 49 64 -99 -56 102 30 -78 -37 -44 -87 -62 357 55 -58 31 -5 -186 -47 100 -82
5602h2K42l52K98m5k55J7J12j4J30j01P8j22n0r9L76R6l58K28j73r7J60M7j14
$$ -82 160 -192 106 61 -194 -177 -65 -79 51 -50 28 -94 -144 -243 133 229 -129 99 -74 -171 -11 36 -78
5625g8nK29k01M1J1oK6J3l71K79o1n9L86j84k17M41n36K92p1P4R7k75K07O7pl8
$$ -78 -83 146 -55 -14 -3 -9 17 30 -341 -62 -123 -182 204 20 -197 244 -292 0 -71 3 100 -175 32 99 92 54
5651E4k97M61l33J31m3K17l56K58k13K07O1q4n7r5P5m5m8K1J39o1K03k60J12K2
$$ 54 -243 218 -115 16 -27 190 -166 92 -121 86 147 63 6 -89 -14 -59 -107 -86 53 -8 195 -65 47 69
5675F9j34J74j37j6J77j49j05M08k06m9J53k28n8K53%j92J0mo6K7n6L38j32k43
$$ 69 -65 109 -28 -44 133 -16 -121 287 81 32 185 -43 -101 152 152 -40 -30 -34 -100 -73 -129 209 77 -166
5699a66L19k76J67k00K98l90K60l43J66K67p3j1k34K26l22N69k53q5P5P1l9k07
$$ -166 153 -123 44 -156 142 -248 12 -331 -165 102 29 18 -216 10 -312 257 4 -81 -6 65 26 -181
5721a81K42j83K24k44K50k5qj54O8j16J78l16M53m22J57l98J36N00j94J42m1m1
$$ -181 61 -122 102 -142 108 83 75 -79 -11 -127 51 -265 188 -234 -77 -475 -339 161 -33 109 68 27
5743B7j1j9L3j80M33j15j41k44N8P9J82k26o3k3m4L96j07K0rj11j05k5K71j91
$$ 27 16 -3 30 -150 283 168 27 -217 -159 -80 102 -124 -187 -210 -254 142 35 55 46 -65 -170 -195 76 -115
5767a15K04r5Q0o0K6P2k25rL34j74j33L16l0l7l5q2l01L38K65j44l26R9N7J63
$$ -115 89 -6 74 14 40 112 -113 -122 212 38 -95 221 191 154 119 37 -264 74 339 195 -131 -32 25 188
5791A88m21J33L05k39J25l54J91J7mL8m5J59K05o8m21O4J04J39j90L2m4K05r3
$$ 188 -233 -100 205 -34 91 -263 -72 -55 -59 -21 -66 93 298 230 -191 -127 -23 116 -74 -42 -86 119 26
5814B6r1P0Q1J8R1k02O1q0P0n4j26K26K1M7m15J71J59l1K26j67p3N1j0k83K03
$$ 26 -65 5 86 104 195 -7 54 -26 44 -10 -136 90 111 158 -257 -86 73 42 268 101 28 79 69 -214 -11
5839a1Pj72K64j26K06k41L9n4J85o0j34j8J45l04N77l47p6J46L6R1j14Q1j57J58
$$ -11 -4 -176 88 -38 168 -73 -34 -88 97 37 -97 -115 30 -274 303 -44 -120 26 62 153 39 120 -37 121
5863A21L8J5q4l6j73M01k71P3P6k90K49p9N1M9j26K27l03K38l53K72k00J30R3
$$ 121 159 174 90 54 -119 282 11 84 160 -130 119 40 91 140 14 241 -62 176 -177 95 -105 25 118
5886A18j03P1j49o8K49j07p4r5M20m07N8L0J03j71m6j66K85l9j97L62rN8O1j24
$$ 118 15 86 -63 -131 118 11 -63 -158 262 -145 -87 -57 46 -125 -171 -337 -52 -91 -288 74 65 123 184 60
5910F0O1r2o8K63J01l06K22o9j63lj31j2L53l03J50j52J6J38k7o3J23r4p8N8J72
$$ 60 121 29 -39 224 325 19 241 172 9 6 -125 -137 216 -87 63 -89 -73 65 38 -25 98 4 -74 -16 156
5935A56K5o2r7k7J77k25J69j46p7j44O90m53ll3K7k87K84J05j21K13o2J20j57
$$ 156 181 119 22 -5 172 -53 116 -30 -107 -251 439 -14 -17 -50 -23 -310 -26 79 -42 171 109 229 72
5958G2q0j14k2L59j13j4m8j01pJ35J77m14M52m19K0J23K70m11j14J69J55P4k13
$$ 72 -8 -122 -144 215 102 88 40 -61 -68 67 244 -170 282 -137 -117 6 276 -135 -249 -80 75 149 -64
5981f4L30j53Lj47R0pk36J74m0L17l85J87R8nk10j19M6j0J66J2J08l44M12Lj20
$$ -64 266 113 116 -31 59 52 -184 -10 -50 267 -118 69 167 162 -48 -167 -121 -131 35 47 155 -189 223 226 106
6006A06l9k60K66k17o5K38K85k10k1n0J0o3n7M3k58K60O3j67Qj34K50j2J00J77
$$ 106 67 -193 73 -144 -209 29 314 104 83 33 43 -20 -77 -34 -292 -32 31 -136 -128 -262 -12 -24 76 253
6030B53r7j87l0K36q3j4r0p2R3J64k85J67J0k42L61l52J98J19j69L4q4J13P4k56
$$ 253 156 -31 -61 175 92 78 -12 -84 9 173 -112 55 65 -177 184 -168 30 149 -20 14 -70 43 117 -139
6054a39K14l2o7q0P6pK54j70m28M79j7o1k08J73j23J36M9J9j18l4J57j37Q9m8
$$ -139 75 43 -24 -104 -28 -35 219 49 -379 100 83 22 -186 -13 -136 0 49 68 -50 -84 73 -64 25 -23
6078b3k7K50l39M6N3k47K50qJ98j29j28j1K59j4k04J4J11k43P9n3K78Q7k27l61
$$ -23 -50 200 -139 -93 -40 -287 -37 -45 153 24 -104 -115 144 130 -74 -60 51 -192 -113 -166 112 199 -28 -389
6102c89L73q9J19L3j55K72k06M2o4K53k55O3p1l1K53m00J78L53k57K2l2MK49j48
$$ -389 -16 -105 14 47 -108 164 -42 0 -64 189 -66 -3 -74 -105 148 -252 -74 279 22 44 12 16 265 117
6126A17q3o0K9l94K60J34o9k2K08k51k32O38l60K4l4JK01k15K62l10J18P1j43
$$ 117 34 -26 3 -391 -131 3 -66 -88 120 -131 -363 275 -85 -61 -95 -94 107 -108 154 -156 -38 33 -110
$$ [...]
8191b47
##END NTUPLES=NMR FID
##END=
