##TITLE=1H_SR7_2
 CDCl3, 8 sc, 
 27.1.2020
##JCAMPDX= 6.0         $$ Bruker NMR JCAMP-DX V2.0
##DATA TYPE= NMR FID
##DATA CLASS= NTUPLES
##ORIGIN= UXNMR, Bruker Analytische Messtechnik GmbH
##OWNER= root
$$ XWIN-NMR		Version 3.5
$$ Mon Jan 27 14:03:04 2020 Russian Standard Time (UT+4h)  she@DPX200
##.OBSERVE FREQUENCY= 200.1315
##.OBSERVE NUCLEUS= ^1H
##.DELAY= (6, 6)
##.ACQUISITION MODE= SIMULTANEOUS
##.ACQUISITION SCHEME= undefined
##.AVERAGES= 8
##.DIGITISER RES= 18
##SPECTROMETER/DATA SYSTEM= spect
##.PULSE SEQUENCE= zg30
##.SOLVENT NAME= CDCl3
##.SHIFT REFERENCE= (INTERNAL, CDCl3, 0, 15.7039)
##AUDIT TRAIL= $$ (NUMBER, WHEN, WHO, WHERE, WHAT)
$$ ##TITLE= Audit trail, XWIN-NMR		Version 3.5
$$ ##JCAMPDX= 5.01
$$ ##ORIGIN= Bruker BioSpin GmbH
$$ ##OWNER= she
$$ F:/spectra/data/she/nmr/H-F/1/audita.txt
$$ ##AUDIT TRAIL=  $$ (NUMBER, WHEN, WHO, WHERE, WHAT)
(   1,<2020-01-27 14:01:20.50 +0400>,<she>,<DPX200>,
      <created by zg, POWCHK disabled, PULCHK disabled
       configuration hash MD5:
       00 E9 B6 7A A2 85 ED C7 34 08 36 98 17 FE 4E 26
       data hash MD5: 16K
       E6 F9 5C 3E CA 25 E7 8B F1 FA AD 9B 32 4B A2 60>)
$$ ##END=
$$ 
$$ hash MD5
$$ E1 7F 6A 59 4D 15 9C 56 96 E8 FF 1E D8 F7 53 11
##$RELAX= 
##$RELAX= 
##$RELAX= 
##$RELAX= 
##$RELAX= 
##$RELAX= 
$$ Bruker specific parameters
$$ --------------------------
##$DU= <F:/spectra>
##$EXPNO= 1
##$NAME= <H-F>
##$PROCNO= 1
##$TYPE= <nmr>
##$USER= <she>
##$AMP= (0..31)
100 100 100 100 100 100 100 100 100 100 100 100 100 100 100 100 100 100 
100 100 100 100 100 100 100 100 100 100 100 100 100 100 
##$AQSEQ= 0
##$AQ_mod= 1
##$AUNM= <au_zg>
##$AUTOPOS= <>
##$BF1= 200.13
##$BF2= 200.13
##$BF3= 200.13
##$BF4= 200.13
##$BF5= 200.13
##$BF6= 200.13
##$BF7= 200.13
##$BF8= 200.13
##$BYTORDA= 1
##$CFDGTYP= 0
##$CFRGTYP= 5
##$CHEMSTR= <none>
##$CNST= (0..31)
1 1 145 1 1 1 1 1 1 1 1 1 1 1 1 1 1 1 1 1 1 1 1 1 1 1 1 1 1 1 1 1 
##$CPDPRG= <>
##$CPDPRG1= <>
##$CPDPRG2= <>
##$CPDPRG3= <>
##$CPDPRG4= <mlev>
##$CPDPRG5= <mlev>
##$CPDPRG6= <mlev>
##$CPDPRG7= <mlev>
##$CPDPRG8= <mlev>
##$CPDPRGB= <>
##$CPDPRGT= <>
##$D= (0..31)
0 1.2 0 0 0 0 0 0 0 0.06 0 0.03 0 0 0 0 0.0002 0 0 0 0 0 0 0 0 0 0 0 0 
0 0 0 
##$DATE= 1580119279
##$DBL= (0..7)
120 120 120 120 120 120 120 120 
##$DBP= (0..7)
150 150 150 150 150 150 150 150 
##$DBP07= 0
##$DBPNAM0= <>
##$DBPNAM1= <>
##$DBPNAM2= <>
##$DBPNAM3= <>
##$DBPNAM4= <>
##$DBPNAM5= <>
##$DBPNAM6= <>
##$DBPNAM7= <>
##$DBPOAL= (0..7)
0.5 0.5 0.5 0.5 0.5 0.5 0.5 0.5 
##$DBPOFFS= (0..7)
0 0 0 0 0 0 0 0 
##$DE= 6
##$DECBNUC= <off>
##$DECIM= 24
##$DECNUC= <off>
##$DECSTAT= 4
##$DIGMOD= 1
##$DIGTYP= 9
##$DL= (0..7)
0 120 120 120 120 120 120 120 
##$DP= (0..7)
150 150 150 150 150 150 150 150 
##$DP07= 0
##$DPNAME0= <>
##$DPNAME1= <>
##$DPNAME2= <>
##$DPNAME3= <>
##$DPNAME4= <>
##$DPNAME5= <>
##$DPNAME6= <>
##$DPNAME7= <>
##$DPOAL= (0..7)
0.5 0.5 0.5 0.5 0.5 0.5 0.5 0.5 
##$DPOFFS= (0..7)
0 0 0 0 0 0 0 0 
##$DQDMODE= 0
##$DR= 18
##$DS= 0
##$DSLIST= <SSSSSSSSSSSSSSS>
$$ [...]
##$SUBNAM2= <"">
##$SUBNAM3= <"">
##$SUBNAM4= <"">
##$SUBNAM5= <"">
##$SUBNAM6= <"">
##$SUBNAM7= <"">
##$SUBNAM8= <"">
##$SUBNAM9= <"">
##$SW= 24.9337058887773
##$SWIBOX= (0..15)
0 0 2 0 0 0 0 0 0 0 0 0 0 0 0 0 
##$SW_h= 4990.01996007984
##$TD= 16384
##$TD0= 1
##$TE= 0
##$TE2= 300
##$TE3= 300
##$TEG= 300
##$TL= (0..7)
0 120 120 120 120 120 120 120 
##$TP= (0..7)
150 150 150 150 150 150 150 150 
##$TP07= 0
##$TPNAME0= <>
##$TPNAME1= <>
##$TPNAME2= <>
##$TPNAME3= <>
##$TPNAME4= <>
##$TPNAME5= <>
##$TPNAME6= <>
##$TPNAME7= <>
##$TPOAL= (0..7)
0.5 0.5 0.5 0.5 0.5 0.5 0.5 0.5 
##$TPOFFS= (0..7)
0 0 0 0 0 0 0 0 
##$TUNHIN= 0
##$TUNHOUT= 0
##$TUNXOUT= 0
##$USERA1= <user>
##$USERA2= <user>
##$USERA3= <user>
##$USERA4= <user>
##$USERA5= <user>
##$V9= 5
##$VALIST= <valist>
##$VCLIST= <CCCCCCCCCCCCCCC>
##$VD= 0
##$VDLIST= <DDDDDDDDDDDDDDD>
##$VPLIST= <PPPPPPPPPPPPPPP>
##$VTLIST= <TTTTTTTTTTTTTTT>
##$WBST= 1024
##$WBSW= 4
##$XGAIN= (0..3)
0 0 0 0 
##$XL= 0
##$YL= 0
##$YMAX_a= 643723
##$YMIN_a= -334968
##$ZGOPTNS= <>
##$ZL1= 120
##$ZL2= 120
##$ZL3= 120
##$ZL4= 120
##$ABSF1= 10
##$ABSF2= 0
##$ABSG= 5
##$ABSL= 3
##$ALPHA= 0
##$AQORDER= 0
##$ASSFAC= 0
##$ASSFACI= 0
##$ASSFACX= 0
##$ASSWID= 0
##$AUNMP= <proc_1d>
##$AZFE= 0.1
##$AZFW= 0.1
##$BCFW= 1
##$BC_mod= 2
##$BYTORDP= 1
##$COROFFS= 0
##$CY= 11.3945322036743
##$DATMOD= 1
##$DC= 2
##$DFILT= <>
##$DTYPP= 0
##$F1P= 16.9975609425685
##$F2P= -3.02152046262296
##$FCOR= 0.5
##$FTSIZE= 0
##$FT_mod= 4
##$GAMMA= 1
##$GB= 0.15
##$INTBC= 1
##$INTSCL= 1
##$ISEN= 128
##$LB= 0.24
##$LEV0= 0
##$LPBIN= 0
##$MAXI= 10000
##$MC2= 0
##$MEAN= 0
##$ME_mod= 0
##$MI= 1.114404
##$NCOEF= 0
##$NC_proc= 0
##$NLEV= 6
##$NOISF1= 3.799351
##$NOISF2= 2.8
##$NSP= 1
##$NTH_PI= 0
##$NZP= 0
##$OFFSET= 15.70392
##$PC= 1
##$PHC0= -9785.053
##$PHC1= 13.4008
##$PH_mod= 1
##$PKNL= yes
##$PPARMOD= 0
##$PSCAL= 0
##$PSIGN= 0
##$REVERSE= no
##$SF= 200.130013532006
##$SI= 16384
##$SIGF1= 3
##$SIGF2= 2
##$SINO= 400
##$SIOLD= 16384
##$SREGLST= <1H.CDCl3>
##$SSB= 0
##$STSI= 0
##$STSR= 0
##$SW_p= 3612.71676300578
##$SYMM= 0
##$S_DEV= 0
##$TDeff= 0
##$TDoff= 0
##$TI= <>
##$TILT= no
##$TM1= 0
##$TM2= 0
##$TOPLEV= 0
##$USERP1= <user>
##$USERP2= <user>
##$USERP3= <user>
##$USERP4= <user>
##$USERP5= <user>
##$WDW= 1
##$XDIM= 8192
##$YMAX_p= 0
##$YMIN_p= 0
$$ End of Bruker specific parameters
$$ ---------------------------------
##NTUPLES= NMR FID
##VAR_NAME=  TIME,          FID/REAL,        FID/IMAG
##SYMBOL=    X,             R,               I
##VAR_TYPE=  INDEPENDENT,   DEPENDENT,       DEPENDENT
##VAR_FORM=  AFFN,          ASDF,            ASDF
##VAR_DIM=   8192,          8192,            8192
##UNITS=     SECONDS,       ARBITRARY UNITS, ARBITRARY UNITS
##FACTOR=    0.0002004,     1,               1
##FIRST=     0,             0,               0
##LAST=      1.6414764,     0,               0
##MIN=       0,             -334968,         0
##MAX=       1.6414764,     643723,          0
$$ Real data points
##PAGE= N=1
##DATA TABLE= (X++(R..R)), XYDATA
0@%%%%qJ6j6J6k4L2l8M6n7P4r0J08j32J62j93K24k64L12l62M18m83N56o37P25
$$ 0 0 0 0 0 -8 8 -8 8 -16 16 -22 24 -33 41 -49 59 -73 89 -104 120 -144 168 -194 224 -259 297 -340 385
28C85q23R35j057J188j333J498j677J868k080K315k571K851l160L499l872M286
$$ 385 -438 497 -560 628 -705 793 -884 984 -1096 1219 -1352 1499 -1661 1838 -2034 2252
44B252m749N263n837O491p235Q088r084J0261j1678J3424j5639J8556k2595K8608
$$ 2252 -2497 2766 -3071 3420 -3815 4273 -4811 5450 -6228 7196 -8443 10113 -12482 16126
58A6126l8616N9280j72912L58248J94873o05960m8658L97717k1450m73616M9077
$$ 16126 -22490 36790 -136122 222126 416999 -188961 -237619 160098 138648 -334968 -285891
69b85891M14360J6095l13480O3421K12319j38859j86000K73538K62064k42347
$$ -285891 128469 144564 -168916 -105495 106824 -32035 -218035 55503 317567 75220
79G5220l17652J30328J82183j41955q3993K83095J80983k24491k14331J12135
$$ 75220 -242432 -112104 70079 -71876 -155869 127226 308209 83718 -130613 -18478
89a8478J02739j22547n3595J87628J22439j34056j62431L6985J39982N9228n5402
$$ -18478 84261 -38286 -91881 95747 218186 84130 -78301 -41316 98666 157894 102492
100A02492p4823o226M2201j4221o3542L3723J49831O4954j05762j08976q314l126
$$ 102492 27669 21443 63644 49423 -14119 19604 169435 234389 128627 19651 11337 8211
112H211p171Q9587J01443n5116r6349O3748P4895j24161j12697J48803J55885
$$ 8211 1040 90627 192070 136954 40605 104353 179248 55087 -57610 91193 247078
123B47078j43348j84930J09331J74757p7881j09082J31119J08871j78950j75032
$$ 247078 103730 -81200 28131 202888 125007 15925 147044 255915 76965 -98067
133i8067J13159J38697r0666o9458J56174R9684j56285j30656R5634P7263r6150
$$ -98067 15092 153789 63123 -6335 149839 249523 93238 -37418 58216 135479 39329
144C9329m0051J10699K0340j27565j5396J41951K9536j27908k5285J12108p255
$$ 39329 -722 109977 130317 2752 -12644 129307 158843 30935 5650 117758 110503
155A10503j53934l2058J47706P7946q4037n3441N8900J2989r1382m2055P1587
$$ 110503 -43431 -75489 72217 150163 66126 12685 71585 84574 -6808 -48863 22724
166B2724N0792l8978k4085M0315O976o0586k0459N8338K3469o4427m4264M4399
$$ 22724 73516 34538 10453 50768 57744 -2842 -23301 35037 58506 -5921 -50185 -5786
178e786L8725l6384j9018O1751L5581p1697p1282K6883L5036l9465j6120P6842
$$ -5786 32939 -3445 -22463 39288 74869 3172 -68110 -41227 -6191 -45656 -61776 15066
190A5066M9728o3963o0027L9449L1673n8033m0365N3101L7879n0190l0925N6723
$$ 15066 64794 831 -59196 -19747 11926 -46107 -86472 -33371 4508 -45682 -76607 -19884
202a9884L7291m1670k3416L5808o747p2375j8577O4122L0008l3004K683M8025
$$ -19884 17407 -24263 -47679 -11871 -18618 -90993 -109570 -45448 -15440 -48444 -45761 2264
214B264o606o3022k0008L4216P120k4773O628L0901j555k0951O344K0693p609
$$ 2264 -4342 -67364 -87372 -53156 -46036 -70809 -64181 -33280 -34835 -55786 -49442 -28749 -36358
227c6358k2437m925K433q615j878J9254K0598N439l536j0145j7054j0697J444
$$ -36358 -58795 -63720 -61287 -69902 -71780 -52526 -31928 -26489 -30025 -40170 -57224 -67921 -66477
240f6477L376N220J8210J4096j0184j3567R151Q473j6815j2090J5900P820j7942
$$ -66477 -63101 -57881 -39671 -25575 -35759 -49326 -40175 -31702 -48517 -60607 -44707 -36887 -54829
253e4829j732L1035J6539j8712p646J6182r147l5091j123L8570J3562j8335Q767
$$ -54829 -56561 -25526 -8987 -27699 -35345 -19163 -28310 -63401 -64524 -25954 -12392 -30727 -21960
266b1960K9613j1166l8257J860K9490q015k5515J6546L3176q318k0632K0268K4274
$$ -21960 7653 -3513 -41770 -39910 -10420 -18435 -43950 -27404 5772 -2546 -23178 -2910 21364
279B1364k2510k9017J2913J7325j8185r289L4828K7032j9809j8174J7082N784
$$ 21364 -1146 -30163 -17250 75 -18110 -27399 7429 34461 14652 -3522 13560 19344
291A9344l0182j2430K9055J6794j7001m96K8143O368k5084p582J7489l364k3578
$$ 19344 -10838 -23268 5787 22581 5580 5084 33227 39595 14511 6929 24418 21054 -2524
304b524K351K5957P362r744Q425J8620r186k5452l827J2645l740r663J3552K3549
$$ -2524 -173 25784 33146 23402 31827 50447 41261 15809 11982 24627 20887 11224 24776 48325
318D8325j20j1414L371N048j2953j5619L790R618j445o0J4004J2097m555r411
$$ 48325 48205 36791 40162 45210 32257 16638 20428 30046 28601 28541 42545 54642 50087 40676
332D0676j536l273j2098p058P919J1463L210K353P583J741r915j0905l451k516
$$ 40676 39140 35867 23769 16711 24630 36093 39303 41656 49239 50980 41065 30160 26709 24193
346B4193l634K598Q532O065L243K191j105p829j0093n652j934n95K389P521Q585
$$ 24193 20559 23157 31689 37754 40997 43188 42083 34254 24161 18509 16575 15980 18369 25890 34475
361C4475K562l008m700o612q715n410r24R16L678P572O300j269n041j871m319
$$ 34475 37037 34029 29329 22717 14002 8592 7668 8584 12262 19834 26134 24865 19824 17953 13634
376A3634j0826q351J673N602K099M221O527K416o114q841o448n230n689M85P287
$$ 13634 2808 -5543 -3870 1732 3831 8052 14579 16995 10881 2040 -4408 -9638 -15327 -14842 -7555
391g555O481O07J070K371l794r082o668j631l662l153N242R297M239m14o60l272
$$ -7555 -1074 -467 603 2974 -820 -9902 -16570 -18201 -21863 -25016 -19774 -10477 -6238 -6652 -7312 -10584
407a0584q951r817l460L666N164K955L667L059m35m061l655l318m377l577R77
$$ -10584 -19535 -29352 -32812 -29146 -23982 -21027 -17360 -14301 -14736 -18797 -22452 -25770 -30147 -33724 -32747
422c2747K653K390M369O669L175m899r656o462j199J375J624M397O865L848k687
$$ -32747 -30094 -27704 -23335 -16666 -13491 -18390 -28046 -34508 -35707 -34332 -32708 -28311 -21446 -17598 -20285
437b0285m463r74n73k772m62O75q07J68P027Q946J03n226k486j340o560o007N690
$$ -20285 -24748 -25722 -26295 -29067 -29529 -28854 -29661 -29493 -22466 -13520 -13417 -18643 -21129 -22469 -29029 -35036 -29346
454b9346J3087N671k783J39L037m335p640R34N959j761l764M972P821K83K26O779
$$ -29346 -16259 -10588 -13371 -13232 -10195 -14530 -22170 -21236 -15277 -17038 -20802 -15830 -8009 -7726 -7500 -721
470g21J460j1070q704M245M929k028K943J3482O935r604q115N637M605q120n815
$$ -721 739 -10331 -19035 -14790 -9861 -11889 -8946 4536 11471 1867 -6248 -611 3994 -4126 -9941
485i941Q447O955m510k846Q732P528j769m020j004l573m236K670O280J255l19
$$ -9941 -1494 5461 951 -1895 6837 14365 12596 8576 7572 3999 -237 2433 8713 9968 9649
500I649N868M047n515q742J420Q737J868o975k130O154N270k386m400J495N470
$$ 9649 15517 19564 14049 5307 6727 15464 17332 10357 8227 14381 19651 17265 12865 14360 19830
515A9830J160p311o339M373Q708J01m557K263N502m415q947J002P151n6k789L844
$$ 19830 20990 13679 7340 11713 20421 20522 15965 18228 23730 19315 10368 11370 18521 18465 15676 19520
531A9520L592n021m935L406L310n062k902O915R06j0475j150J5070N693j4966
$$ 19520 23112 18091 13156 16562 19872 14810 11908 18823 19729 9254 8104 23174 28867 13901
545A3901o655J3460L516j9659r599J8415J4502j2046j1389R893Q737j0871r885
$$ 13901 7246 20706 24222 4563 -5036 13379 27881 15835 4446 14339 23076 12205 2320
558B320Q319O065q661n669Q381J585j0201K243J6120L4j9939n314J4941J511j7699
$$ 2320 10639 16704 8043 2374 10755 12340 2139 4382 20502 20536 597 -4717 10224 11735 -5964
573e964j257K0926O176j9070q886J4278N988j4233n201J3856M066j6589o630J3623
$$ -5964 -7221 13705 19881 811 -8075 6203 12191 -2042 -7243 6613 10679 -5910 -12540 1083
587A083O578j0235k529J0556m92j4651l319J1500K427p413K591Q867p006j5533
$$ 1083 7661 -2574 -5103 5453 4961 -9690 -13009 -1509 918 -6495 -3904 4963 -2043 -17576
601a7576K712J4727N75j1862K88J1637k032j4341j298J3256M977q873o504J296
$$ -17576 -14864 -137 438 -11424 -11136 501 -1531 -15872 -17170 -3914 1063 -7810 -14314 -13018
615a3018K47j067L615N774J303k909l621m666l704O18M844N109J402l088m697
$$ -13018 -12771 -13838 -10223 -4449 -3146 -6055 -9676 -14342 -18046 -17428 -12584 -7475 -6073 -9161 -13858
630a3858j660M873L649j975l008J175j273p323l489J0635J0621k017n154J148
$$ -13858 -15518 -10645 -6996 -8971 -11979 -10804 -12077 -19400 -22889 -12254 -1633 -3650 -8804 -7656
644g656k274j0683r49J3316N928r533m036Q712j96j0089K230J5915K306j5082
$$ -7656 -9930 -20613 -21562 -8246 -2318 -11851 -15887 -7175 -7371 -17460 -15230 685 2991 -12091
658a2091o368P173j41n917P744J6136l034j6493j980Q693j951n486Q170J0407
$$ -12091 -18459 -11286 -11427 -17344 -9600 6536 3502 -12991 -14971 -6278 -8229 -13715 -5545 4862
672D862p225j0495L499N853l759K117J2515n95j7372n666J3020O335p537R05J2683
$$ 4862 -2363 -12858 -9359 -3506 -7265 -5148 7367 6772 -10600 -16266 -3246 3089 -4448 -3543 9140
687I140p65j5686m575J0839N260k094L372K820r414o869Q493Q256o029j484J0910
$$ 9140 8375 -7311 -11886 -1047 4213 2119 5491 8311 -1103 -7972 521 8777 2748 1264 12174
702A2174j61j8192m643J8706R623j1693m473J1296M32j6127l771J7007Q548r178
$$ 12174 12013 -6179 -10822 7884 17507 5814 1341 12637 13069 -3058 -6829 10178 18726 9548
716I548n362M991j309o792L973J0157j151o309K159K436r160n506J2878J2339
$$ 9548 4186 9177 7868 1076 5049 15206 14055 7746 9905 12341 3181 -2325 10553 22892
730B2892q075j1937L259P578l302p478M171J0249L96r727o895L844P444M34l633
$$ 22892 14817 2880 6139 13717 10415 2937 7108 17357 17753 8026 1131 4975 12419 12853 9220
745I220O15M080k720q422q43Q624M002n915k687M604j978p311L066R429k422q449
$$ 9220 9835 13915 11195 2773 1930 10554 14556 8641 5954 10558 8580 1269 4335 13764 11342 2893
761B893M036O749j1204j2032J3623J6807j1373j7263J0932J6071j3460j9859J1931
$$ 2893 6929 13678 2474 -9558 4065 20872 9499 -7764 3168 19239 5779 -14080 -2149
774b149K0790r357j9652O994J5651q147j3227R671J2644j0579j2384P492O829
$$ -2149 18641 9284 -10368 -3374 12277 4130 -9097 574 13218 2639 -9745 -2253 4576
787D576j0994m302J5954P333j4921r120J0720N218j3176o204J4109R519j1223
$$ 4576 -6418 -10720 5234 12567 -2354 -11474 -754 4464 -8712 -14916 -807 8712 -2511
800b511j1569O554J0880l961q563K483P355l632j1402j799J1091P054m062l972
$$ -2511 -14080 -7526 3354 -607 -9170 -6687 668 -2964 -14366 -16165 -5074 1980 -2082 -6054
814f054L472K97r560n436Q891P625n429l949P507J322j1850j279J4940M024j6748
$$ -6054 -2582 -2285 -11845 -17281 -8390 -765 -6194 -10143 -2636 -1314 -13164 -14443 497 4521 -12227
829a2227o434J4494L211j6341m92K3583P146k1879j1324J5129N603j6433j885
$$ -12227 -18661 -4167 -956 -17297 -17789 5794 12940 -8939 -20263 -5134 469 -15964 -17849
842a7849K0841O074j8706o178J4102K499j3234L195J6140m629j9112J465J7607
$$ -17849 2992 9066 -9640 -15818 -1716 783 -12451 -9256 6884 2255 -16857 -15392 2215
855B215M38j1630M937J3722p768j8641K679J5890J247q072M596R240p765j3744
$$ 2215 2653 -8977 -4040 9682 1914 -16727 -14048 1842 3089 -4983 -387 8853 1088 -12656
869a2656L900J2475L86p089J417M617l648m782M029P374Q5m292k569j776k539
$$ -12656 -8756 3719 4105 -2984 -1567 3050 -598 -5380 -1351 6023 6108 1816 -753 -2529 -5068
884e068J300P065O462j031n528l421R6k92j241J583N982K866m514n601J157N685
$$ -5068 -3768 3297 9759 8728 3200 -221 -125 -417 -1658 -75 5907 8773 4259 -1342 -185 5500
900E500J757k726j575K79k962l178L366O709J609k440P85l33o707n380N479P651
$$ 5500 7257 4531 2956 3235 273 -2905 461 7170 8779 6339 7124 6791 84 -5296 183 7834
916G834l08m611R25L469k371m086J977L967k685m509J268L522j500j284N448L970
$$ 7834 7526 2915 3840 7309 4938 852 2829 6796 4111 -398 870 4392 2892 1608 7056 11026
932A1026m669p542k41L659l41j841K897M640o04l553p35M66k815j608L528K260
$$ 11026 6357 -1185 -1426 2233 1892 51 2948 7588 6984 3431 2696 3162 347 -1261 2267 4527
948D527l272k910M720M357k616m499J356K271l675m106J455L628J306R96J438
$$ 4527 1255 -1655 3065 7422 4806 307 1663 3934 259 -3847 -2392 1236 2542 3538 4976
963D976p45l541j978R54j09j901R57M036L54k818q36K394N80k306p77l26j992
$$ 4976 4231 690 -1288 -334 -443 -2344 -1387 2649 3003 185 -651 1743 2323 17 -760 -1086 -3078
980c078q56L026K593K31o04J028j384m026j977K056J553R15N10M80j486j682J766
$$ -3078 -3934 -908 1685 1916 1312 2340 956 -3070 -5047 -2991 -1438 -523 -13 467 -1019 -2701 -935
997i35J934j622l182R46J518j513j562K638L400o42k375j544p03j220Q71K916
$$ -935 999 -623 -3805 -2859 -1341 -2854 -4416 -1778 1622 980 -1395 -2939 -3642 -4862 -3991 -1075
1013a075O75j852k7J360m32k575K33J727N78k579r02J744J355J88J89J60j845
$$ -1075 -400 -2252 -2279 -919 -1351 -3926 -3693 -1966 -1388 -3967 -4869 -3125 -1770 -1582 -1393 -1233 -3078
1030c078j453Q45P77j50K99J555L79j773o75m6L20MK52n01l81O56J821P90j482
$$ -3078 -4531 -3686 -2909 -3059 -2760 -1205 -826 -2599 -3274 -3320 -3000 -2996 -2744 -3245 -3626 -2970 -1149 -359 -1841
1049a841o42L38l33j581j64J698J972j71Pk16q06n89N15M96j177n72J517J788
$$ -1841 -2483 -2145 -2478 -4059 -4223 -2525 -553 -724 -717 -933 -1739 -2328 -1813 -1317 -2494 -3066 -1549 239
1067B39l22m05J146J91j995j182O0Q08Q57Q21J093O2p69J67P8R4j545j81P87O34
$$ 239 -83 -488 658 849 -1146 -2328 -2268 -1460 -603 218 1311 1373 604 771 849 943 -602 -783 4 638
1087F38j65Q25J119L66n36o49o76r82M4J674P04K03P55K58P9m46o66r48n59O56
$$ 638 473 1298 2417 2783 2247 1598 922 -60 -16 1658 2362 2565 3320 3578 3657 3211 2545 1597 1038 1694
1107A694O65M8L42Q67K069l2k320j718OJ071l0k9O60J058N56l6j012j514j34J583
$$ 1694 2359 2407 2749 3616 5685 5653 3333 1615 1621 2692 2662 2633 3293 4351 4907 4871 3859 2345 2211 3794
1127C794o93j463m72K525J911o02j048k14l24j208j029k47N70J137J068J97M6
$$ 3794 3101 1638 1166 3691 5602 5000 3952 3738 3414 2206 1177 930 1500 2637 3705 3902 3948
1144C948j120j64k0j162j281M61O59o28J080J678J65k197j143Q80j61j342j524
$$ 3948 2828 2664 2644 1482 201 662 1321 693 1773 3451 3616 1419 276 1156 995 -347 -1871
1161a871J545K236K01q71j511K06Q27n42k050j449Q78K155J055j495q55J231P35
$$ -1871 -326 1910 2111 1240 -271 -65 762 220 -1830 -3279 -2401 -246 809 -686 -1541 -310 425
1178D25j490k726o60K020J254R3j292OJ533K91k118j562Q91L82q52r30J639J956
$$ 425 -1065 -3791 -4451 -2431 -1177 -1084 -2376 -2370 -837 -546 -2664 -4226 -3335 -2953 -3805 -4735 -3096 -1140
1196a140l39j091k4P05j519k527o03K694J656q4p66L43K75K65p63k167j040K221
$$ -1140 -1479 -2570 -2594 -1889 -3408 -5935 -6538 -3844 -2188 -2272 -3038 -2695 -2420 -2155 -2918 -5085 -6125 -3904
1214c904J915r25k242J337M373L59m131k728J823J927j477j506K471L128j67j826
$$ -3904 -1989 -2914 -5156 -3819 554 913 -3218 -5946 -4123 -2196 -3673 -5179 -2708 420 253 -1573
1230a573j481Q75l25m14N77j49J82Q03Q60j33J35J211K48j924k415K34K327J429
$$ -1573 -3054 -2179 -2504 -2918 -2341 -2490 -2308 -1505 -645 -778 -643 568 816 -1108 -3523 -3289 -962 467
1248D67j357R12L011N62m097l530K578L581l97k580P24K963Q6k320j212K077J559
$$ 467 -890 22 3033 3595 -502 -4032 -1454 2127 1730 -850 -126 2837 2923 603 -609 1468 3027
1265C027j211j395p50j38J241K808J266j963j184J044q14l684L14N183K704l355
$$ 3027 1816 421 -329 -467 774 3582 4848 2885 1701 2745 1931 -1753 -1439 3744 6448 3093
1281C093k380K193J880l679k816L943M131k835m598J034L660P65j261Q86l4k195
$$ 3093 713 2906 4786 1107 -1709 2234 6365 3530 -1068 -34 3626 4391 3130 4016 3982 1787
1297A787j428O86m13n4L597L566k206n648j153L334Q14k808N31L461P76l657j573
$$ 1787 359 1045 632 578 4175 7741 5535 -113 -1266 2068 2882 74 605 4066 4842 1185 -388
1314c88K769J324q21m03l06j654j911L88K443K355R40m85k414k674r74M66J179
$$ -388 2381 3705 2884 2481 2175 521 -1390 -1002 1441 3796 4736 4251 1837 -837 -1811 -1345 -166
1331a66J003K412M67j994k947j63P94J809J633q79k973j601K008J343q94L87M392
$$ -166 837 3249 3716 1722 -1225 -1388 -594 1215 2848 1969 -1004 -2605 -597 746 -148 239 4631
1348D631L49o887n553L305M519j41J61M022q97o351k497M198J383k561J756M547
$$ 4631 4980 -1907 -7460 -4155 364 223 384 4406 3509 -2842 -5339 -1141 242 -2319 -563 3984
1364C984l141q086J214Q312J520m795O66K908n871p532N059R920q43m740K551
$$ 3984 843 -7243 -6029 2283 3803 -992 -326 2582 -3289 -10821 -5762 4158 3315 -1425 1126
1379A126K428q296o822P454R179l083n205K117J349o244j264R094M033o488l989
$$ 1126 3554 -4742 -11564 -4110 5069 1986 -3219 -1102 247 -5997 -7261 1833 5866 -622 -4611
1394d611K786j386n935K784J1369K633q575m601K013j080k965M739P718j470o542
$$ -4611 -1825 -3211 -9146 -6362 5007 7640 -935 -5536 -3523 -4603 -7568 -2829 4889 3419 -3123
1409c123r69P94k074K82O653L228m812n414n01J379J238L257L897p13n014l195
$$ -3123 -4092 -3298 -5372 -5090 1563 4791 -21 -5435 -5936 -4557 -3319 -62 3835 3122 -1892 -5087
1425e087r15M92K598N464J769l777l317q42j333j54N466M142l119n105J104J508
$$ -5087 -6002 -5510 -2912 2552 4321 544 -2773 -3615 -4948 -5102 364 4506 1387 -3718 -2614 -1106
1441a106l061O03P300L036p404n646L427J821k766K901Q352q03j0243k158O109
$$ -1106 -4167 -3564 3736 6772 -632 -6278 -2851 -1030 -3796 -895 7457 6654 -3589 -5747 362
1456C62k96n082N183R455m247j1658Q94Q696j065n468N917O289p016j0213N191
$$ 362 66 -5016 167 9622 5375 -6283 -5389 3307 2242 -3226 2691 8980 1964 -8249 -3058
1471c058Q964k942m279O831N008j0527r352P345R044k939m270N893K891r117n864
$$ -3058 5906 2964 -1315 5516 10524 -3 -9355 -2010 7034 4095 -175 5718 8609 -508 -6372
1486f372P409O809m332l002M403O18p298k643Q189O082l716m865R92O61l632j559
$$ -6372 1037 7846 3514 512 4915 5533 -1765 -4408 3781 9863 6147 1282 2274 2935 -697 -2256
1502b256N484N812j846m338j349O13j441j249L887M798j750o142j500M084J190
$$ -2256 3228 9040 7194 2856 1507 2120 679 -570 3317 8115 6365 223 -1277 2807 3997
1517C997k737J863M214k047p386j517O090K311l059J246M748k831r106n93Q588
$$ 3997 1260 3123 7337 5290 -2096 -3613 2477 4788 1729 2975 7723 4892 -4214 -4807 3781
1532C781K027n607j81N695j505q090n02Q373K252o284j714M020j269o297J993
$$ 3781 5808 201 20 5715 4210 -3880 -4382 3991 6243 -41 -1755 2265 996 -5301 -3308
1547c308Q039P28o270k087L431j468m534K166O850J79n561j620K689n04l739J547
$$ -3308 4731 5459 -811 -2898 533 -935 -5469 -3303 3547 3726 -1835 -3455 -766 -1270 -5009 -3462
1563c462N664K36o722k128M536K162l618p05M838O56o083l822L959M193j555j987
$$ -3462 2202 2438 -4284 -6412 -1876 286 -3332 -4037 801 1457 -4626 -8448 -4489 -296 -1851 -3838
1579c838L242J119n941l140M978L561l592j989N081J345o673k846O743L879n789
$$ -3838 -596 523 -5418 -8558 -3580 -19 -3611 -5600 -519 826 -5847 -8693 -1950 1929 -3860
1594c860l622N097J694o104j263P908L556o439l831M818Q88o072n84P527K260
$$ -3860 -7482 -2385 -691 -6795 -8058 -150 3406 -3033 -6864 -2046 -1158 -7230 -7814 -287 1973
1609A973n839j345M384R8m862Q79N622j003n732R37N345p09m072K312N159k244
$$ 1973 -3866 -5211 -827 -729 -5591 -4712 910 -93 -5825 -4888 457 -252 -4324 -2012 3147 903
1625I03o175P8M737l0k171J499L377j193k870K56J566o01q36J499P57q22j017
$$ 903 -5272 -5194 -457 -487 -2658 -1159 2218 1025 -1845 -1589 -23 -624 -1460 39 796 -26 -1043
1642a043J683J391l25q15k27j49o84j9N54J340J036q7q32l87N24p57j165P89K451
$$ -1043 640 2031 1706 891 664 515 -169 -188 366 1706 2742 2655 1823 1436 1960 1203 38 827 3278
1661C278j50k283K30K722K25k292k44K310m04k858O38K650o43n64J065J303j951
$$ 3278 3128 845 1075 3797 4022 1730 1486 3796 3392 534 1172 3822 3179 2615 3680 4983 3032
1678C032k827J881J965j478j606K486J939k232k600K327J702j869k323K517J254
$$ 3032 205 2086 4051 2573 967 3453 5392 3160 560 2887 4589 2720 397 2914 4168
1693D168j612j193J982J521k333j017J321M53k075L69J692K30j536j09J371l89
$$ 4168 2556 1363 3345 4866 2533 1516 2837 3290 1215 1584 3276 3506 1970 1861 3232 2843
1709B843j696m68J759M98j830J65J378L89j815k07R12J66j729M1J093P5r4k33
$$ 2843 1147 679 2438 2936 1106 1271 2649 3038 1223 1016 1928 2094 365 406 1499 1574 1480 1247
1727A247M16k75j012m83N35rl08K15J035Jj596K73M69n0j267k83R08M01m43Q9
$$ 1247 1663 1388 376 -107 428 419 111 326 1361 1362 -234 39 508 458 -809 -1092 -184 217 -226 -137
1747a37P92k28r17n98K60l63k61K89R81M1p37j71L94l09q40k68N84l50m07O79
$$ -137 655 427 -490 -1088 -828 -1191 -1452 -1163 -182 -141 -878 -1049 -655 -964 -1804 -2072 -1488 -1838 -2245 -1566
1767a566J200l97r11O63k13j516n73Q67M19J67n0N25Q3p69n26K46l40p05N54P09
$$ -1566 -366 -763 -1674 -1011 -1224 -2740 -3313 -2446 -2027 -1860 -1910 -1385 -1302 -2071 -2597 -2351 -2691 -3396 -2842 -2133
1787b133k23n52J073J045j220r41J25J18r38P3J259L84l96M90L07q34j232n1J469
$$ -2133 -2356 -2908 -1835 -790 -2010 -2951 -2826 -2708 -3646 -3573 -2314 -1930 -2326 -1836 -1529 -2363 -3595 -3646 -2177
1806b177m45n03L98R45m60m33Q25L48j521n57J200J98j181M24J978L71j211j068
$$ -2177 -2622 -3125 -2727 -1782 -2242 -2675 -1850 -1502 -3023 -3580 -2380 -2182 -3363 -2939 -961 -590 -1801 -2869
1824b869J357k20j347O04J551j34j259J060Q86j100n53J058Q19j243j338J188
$$ -2869 -1512 -1732 -3079 -2475 -924 -1058 -2317 -1257 -371 -1471 -2024 -966 -147 -1390 -2728 -1540
1840a540J120k33j39J528O1k039n49J622q9q24P70J597Q0j361j38J088P5q18K27
$$ -1540 -420 -653 -792 736 797 -1242 -1791 -169 -258 -1082 -312 1285 1365 4 -134 954 1029 211 438
1859D38J63k06N4P87J158m00l96J43J99p53q71R14J337K69p1m89j48J58M49l61
$$ 438 601 395 449 1236 2394 1994 1598 1741 1940 1187 316 1230 2567 2836 2765 2276 2128 2286 2735 2374
1879B374k46N31J64n39Q6N16O25k98m2N40q72j094K14J907M60j365L67J384o47
$$ 2374 2128 2659 2823 2284 2370 2886 3511 3213 3171 3711 2839 1745 1959 3866 4326 2961 3328 4712 4065
1898D065k133K62J727k92j708J061J360j046j670J569K299j719k770J270J963
$$ 4065 1932 2194 3921 3629 1921 2982 4342 3296 1626 3195 5494 3775 1005 2275 4238
1913D238j363j603J588J938j557j500Q84P69k039j084K466J243k036j275J972
$$ 4238 2875 1272 2860 4798 3241 1741 2625 3394 1355 271 2737 3980 1944 669 2641
1928B641J069j933j685J102J423j503j920J840R83o65j103J193L39j342j425L94
$$ 2641 3710 1777 92 1194 2617 1114 -806 1034 2017 1352 249 1442 1781 439 -986 -592
1944e92J063k87o62J74J286m80j901n21J350L36j213n56J693L10j872l58J792
$$ -592 471 184 -478 -304 982 502 -1399 -1920 -570 -234 -1447 -2003 -310 0 -1872 -2230 -438
1961d38R34k888j406K573N42k952m55M092Q36l955j385L259M86m118k42M599N76
$$ -438 496 -2392 -3798 -1225 -683 -3635 -4090 2 838 -3117 -4502 -1243 -757 -4875 -5117 -518 58
1978E8m553j65M073p1m225k75N195j382m918O87M961R3m558J165M719j716n523
$$ 58 -4495 -4660 -587 -658 -4883 -5158 37 -1345 -6263 -5576 -615 -522 -5080 -3915 804 -912 -6435
1995f435Q56M888o74m185J483M844j696m309J604L510j548l757J787L147j901
$$ -6435 -5579 -691 -1365 -5550 -4067 777 -919 -5228 -3624 -114 -1662 -5419 -3632 -485 -2386
2010b386k854K759L650j682l891J509K110j745k126K347K899r98k620J311K101
$$ -2386 -5240 -2481 1169 -513 -4404 -2895 -785 -2530 -4656 -2309 590 -408 -3028 -1717 384
2025C84j366k248Q61K307p1k226M70K135O31j707l56J877l22k199o15K172Q53
$$ 384 -982 -3230 -2369 -62 -133 -2359 -1889 246 877 -830 -1186 691 369 -1830 -2445 -273 580
2042E80n24n3K189nk929j243K666J182k627q61L479J470l073j907L199K135l235
$$ 580 56 3 2192 2187 -742 -1985 681 1863 -764 -1625 1854 3324 251 -1656 1543 3678 443
2059D43k466L068J890k791j399M057J824l431k084L288Q62m472o66M757J904l885
$$ 443 -2023 1045 2935 144 -1255 2802 4626 1195 -889 2399 3261 -1211 -1877 2880 4784 899
2075H99j266M043R25m881j378M903O15m297q27N044R53m220p26M950J88n230j513
$$ 899 -367 3676 4601 -280 -1658 3245 3860 -437 -1264 3780 4733 513 -213 4737 4925 -305 -1818
2092a818M606Q58l666K21M371p0m030o51L514n96m011J131M491j90m494O03L878
$$ -1818 2788 3646 -20 201 4572 4502 472 -179 3335 2739 -1272 -141 4350 4160 -334 269 4147
2109D147m51m035NL757k42m000RL935O41k858k66L109j376l453j93L235J072k419
$$ 4147 3696 -339 -334 3423 3181 -819 -810 3125 3766 908 642 3751 2375 -1078 -1271 1964 3036 617
2127F17p7K894q40l211m94L447Q12l144n70K861k65l575Q60M281K25m232j135
$$ 617 540 3434 2594 -617 -1111 2336 3148 4 -566 2295 2030 -1545 -685 3596 3821 -411 -1546
2144a546K801J42l798J066M529O65m362j534L201j53k873P81M063o32m677l17
$$ -1546 1255 1397 -2401 -1335 3194 3859 -503 -2037 1164 1011 -1862 -1081 2982 2350 -2327 -2644
2160b644M110j08l281J021L626j608m967O14M054K70k677J108K880k140m696P63
$$ -2644 1466 1358 -1923 -902 2724 1116 -3851 -3237 817 1087 -1590 -482 2398 258 -4438 -3675
2176c675M343O5k690N91K531j615l922J219M304k82l281j54J880r52k754J786
$$ -3675 668 733 -1957 -1366 1165 -450 -4372 -3153 1151 869 -2412 -2566 -686 -1638 -4392 -2606
2192b606L986n8l705j056J837j22k464J404L857j00l578j744K460R31k065n9L554
$$ -2606 1380 1322 -2383 -3439 -1602 -1724 -4188 -2784 1073 973 -2605 -4349 -1889 -958 -3023 -3082 472
2209D72p3m013j572L684J788k433r61L359K65m801j831M669L067l433j490L299
$$ 472 399 -3614 -5186 -1502 286 -2147 -3108 251 516 -4285 -6116 -1447 1620 -1813 -3303 -4
2225dQ27n347j436N695K438m699j599M184J042n414m08O068J476n564j691M591
$$ -4 823 -4524 -5960 -265 2173 -2526 -4125 59 1101 -4313 -4721 1347 2823 -2741 -4432 159
2241A59O03m681K4O548J073o287j488N152M99m975L76O207n3o144n31N225N92
$$ 159 762 -3919 -3895 2653 3726 -2561 -4049 1103 1602 -3373 -2997 3210 3157 -2987 -3518 1707 2299
2258B299m236J86M526k80n021K7M491O31l502M70L503q99m121M50L880K76k904
$$ 2299 -1937 -1751 2775 2495 -2526 -2499 1992 2623 -879 -409 3094 2195 -1926 -1476 2404 2680 -224
2275b24J75K995m44l316M33K744O39j923j188J942M67j484p70J888J902k174j368
$$ -224 -49 2946 2502 -814 -381 2363 3002 1079 -109 1833 2300 816 46 1934 3836 1662 294
2292B94J200J254j076j734J544K722j849k049R54J989j118k596J928K650j393
$$ 294 1494 2748 1672 -62 1482 4204 2355 306 1260 3249 2131 -465 1463 4113 2720
2307B720l207J636K992j996k470J849K805j888l671J804L256j460k837J924K938
$$ 2720 -487 1149 4141 2145 -325 1524 4329 2441 -1230 574 3830 2370 -467 1457 4395
2322D395k255l165J896K343j575k658K147K873l104k596K687K554k218k947K100
$$ 4395 2140 -1025 871 3214 1639 -1019 1128 4001 897 -1699 988 3542 1324 -1623 477
2337D77K247j811k983K215K848k143k315J543K130k307j577J909J872j964j538
$$ 477 2724 913 -2070 145 2993 850 -1465 78 2208 -99 -1676 233 2105 141 -1397
2352a397J396J512k010j898K200J382j752j304J410J416j748j235J891R41j432
$$ -1397 -1 1511 -499 -2397 -197 1185 -567 -1871 -461 955 -793 -2028 -137 804 -628
2367f28j569J279J106j168o59P29J040p00j436Q54J189r89p29O91L92m08l90L45
$$ -628 -2197 -918 188 -980 -1639 -910 130 -570 -2006 -1152 37 -952 -1681 -990 -598 -1006 -1396 -1051
2385a051K49l72o53Q23J27j59l58L66lk18j71Q3P06m33l60k67O22O42o26l71J77
$$ -1051 -802 -1174 -1827 -1004 -877 -1036 -1394 -1028 -1031 -1249 -1420 -1337 -631 -1064 -1424 -1691 -1069 -427 -1053 -1424 -1247
2406a247N57l83n50K56N86k64k41K86M83k54r76P82Q00q03k59L2Q62m74m44N41
$$ -1247 -690 -1073 -1623 -1367 -781 -1045 -1286 -1000 -517 -771 -1747 -965 -165 -968 -1227 -1195 -333 -807 -1251 -710
2426g10O48p75o46Q90M61n51n94J166K86p14n81N08M56n82l78P15L76m98n48P90
$$ -710 -62 -837 -1483 -593 -132 -683 -1277 -111 175 -539 -1120 -612 -156 -738 -1116 -401 -25 -523 -1071 -281
2446b81J84l11k29N26K92n77k79R75r1n34K75L27Nm40L8Q7J09n01P75L01o85l50
$$ -281 -97 -408 -637 -111 181 -396 -675 300 209 -325 -50 277 282 -158 -120 -33 76 -425 350 651 -34 -384
2468c84L61K97n31L40M31Ml62K30m3k2q2j33O37k98l37L35M01j27q1J36L7l18
$$ -384 -23 274 -257 83 514 518 156 386 343 321 239 106 743 445 108 443 844 717 636 772 809 491
2490D91k20O57j95l90L62M81j67o02J8O96l93J12m7K57j83j43M18L11o47k38L97
$$ 491 271 928 733 343 705 1186 1019 417 435 1131 738 850 803 1060 877 734 1152 1463 816 578 975
2511I75K83l89j13O95J20m19k94L33j13j18l06K84J66l56J30N48k99N3l83L23
$$ 975 1258 869 756 1451 1571 1152 858 1191 1078 960 654 938 1104 748 878 1426 1127 1180 797 1120
2531A120J52l95M7N0rJ34M30n02k03j77J39O9n17O23k14J86J08n7j11m36n9J74
$$ 1120 1272 877 924 974 965 1099 1529 1027 824 647 786 855 338 961 747 933 1041 984 873 437 378 552
2553E52n15N6L13L23Q4m2l32O9k98j49m71N9J10M09J48l8J16l69m09R0r5n63M13
$$ 552 37 93 406 729 813 771 439 508 210 61 -410 -351 -241 168 316 278 394 25 -384 -294 -389 -952 -539
2576e39m91O84Q8L14m68j07L8m24k85Q4MK2M26L6R5k89jm3j87m13j34P5K01L50
$$ -539 -1030 -346 -258 56 -412 -519 -481 -905 -1190 -1106 -1102 -1080 -654 -618 -523 -812 -813 -856 -1043 -1456 -1590 -1515 -1314 -964
2600i64MM03m61n25Q0o1j12k01M94L13J37n12M82J61o11j78k17K86j11n5N55M87
$$ -964 -960 -557 -1018 -1543 -1463 -1524 -1636 -1837 -1343 -1030 -893 -1405 -923 -762 -1373 -1551 -1768 -1482 -1593 -1648 -1093 -606
2622f06n9l38J96k27p70K91L3R12l48k36K16N89m30l52j2M45o7m72J50Q92j24
$$ -606 -665 -1003 -807 -1034 -1804 -1513 -1480 -568 -916 -1152 -936 -347 -777 -1129 -1141 -696 -763 -1235 -1085 -193 -317
2643c17l57L84K44j06n23l68P18J91m71O22L56J9p60R8K60j39n04N01O94M9o36
$$ -317 -674 -290 -46 -152 -675 -1043 -325 -134 -605 17 373 392 -368 -270 -10 -149 -653 -152 542 591 -45
2664d5L26N43K2j108K43Q47l92j035P50J228r2o65L61O14q68p57L90P65m8l91
$$ -45 281 824 846 -262 -19 828 436 -599 151 1379 1287 622 983 1597 729 -28 362 1127 1079 688
2684F88N39M76p51n50M71M72oo42j32O01k20n14R51O46j27j062k42M30k85l03
$$ 688 1227 1703 952 402 873 1345 1339 697 565 1166 946 432 1383 2029 1902 840 598 1028 743 440
2704D40N78P87n2p54n28J66L86n48J69O16L6r57M7M01K02K53p35Q77n44q86l35
$$ 440 1018 1805 1753 999 471 637 1023 475 644 1260 1296 339 386 787 989 1242 507 1384 840 -46 -381
2725c81O40J020m95l07O77r0j461m31R03J046n92p29N92K98p29p17J424N67r40
$$ -381 259 1279 784 477 1154 1064 -397 -828 75 1121 529 -200 392 690 -39 -756 668 1235 295
2744B95p86L18L30p24Q9J186P37j374j049L80L70m39j31J585L94j728p43Q80N04
$$ 295 -491 -173 157 -567 -478 708 1445 71 -978 -598 -228 -667 -798 787 1181 -547 -1290 -410 94
2763I4q19l62J125K67j242m35Q46Q72n12o0N48k45j625k43J360P84m57k26L46
$$ 94 -725 -1087 38 305 -937 -1372 -526 346 -166 -226 322 77 -1548 -1791 -431 353 -104 -330 16
2782A6j68p10k31J41J088L9r27J4N15j43n80L25J259l38j442o36Q68N62j13P9
$$ 16 -152 -862 -1093 -952 136 175 -752 -738 -223 -366 -946 -621 638 300 -1142 -1778 -910 -348 -461 -382
2802c82Q79l1j053r49L83R68l97p4Q82M06j374j69Q48M26q37m41O57M57j354o30
$$ -382 497 466 -587 -1536 -1153 -185 -582 -656 226 632 -742 -911 -63 363 -474 -915 -258 199 -1155 -1785
2822a785K131O14r33r12P79O70j584p68J495J273j072p29J063N08j285r61J327
$$ -1785 346 960 27 -885 -106 564 -1020 -1788 -293 980 -92 -821 242 750 -535 -1496 -169
2839a69R96j578n54J317Q32j327m36J299M70j160j146P88J038q64l84J379J082
$$ -169 827 -751 -1305 12 844 -483 -919 380 850 -310 -1456 -668 370 -494 -878 501 1583
2856A583j434j067P78O08q10o96R33R55m31o15K89Q87p87o51K87P46o57q04L98
$$ 1583 149 -918 -140 468 -342 -1038 -105 850 419 -196 93 980 193 -458 -171 575 -82 -886 -488
2875d88J255O6p62K61N90n83j189q1J170N19m44j58Q68j33j425k6J253N90j229
$$ -488 767 833 71 332 922 339 -850 -931 239 758 314 156 1024 891 -534 -560 693 1283 54
2894E4n16J195K33j094J26J193O49j385j365Q30P98r68J75J376Q47j622o59M72
$$ 54 -462 733 966 -128 -2 1191 1840 455 -910 -80 718 -250 -75 1301 2148 526 -133 339
2912C39O80j166M8J252P06j341j247J576N60n36q62J008J98j765n94J544J060
$$ 339 1019 -147 -99 1153 1859 518 -729 847 1407 871 9 1017 1215 -550 -1144 400 1460
2929A460n39p71Q06L20j462n44J109J142o78p52P93k4o51m63J087K84q12j010
$$ 1460 921 150 956 1276 -186 -730 379 1521 843 91 884 860 209 -254 833 1117 305 -705
2947g05M26Q44m02j81Q99O90j065j470M26K96Pl86P20O49n52p28n7J065m13o24
$$ -705 -279 565 163 -18 881 1571 506 -964 -538 -242 -235 -621 99 748 196 -532 -589 476 63 -561
2967e61R3Q39o27p47M74J047k00p43m88K54L46q30J04Q05L92p18j4K73j90n65
$$ -561 -468 371 -256 -1003 -529 518 318 -425 -913 -659 -313 -1143 -1039 -234 158 -560 -574 -301 -491 -1056
2987a056K07O45P4j129L27P24J37n07l00N53J03r71o63N95J033n38k92R87O5j063
$$ -1056 -849 -204 -130 -1259 -932 -208 -71 -578 -878 -325 -222 -1193 -1856 -1261 -228 -766 -1058 -71 -6 -1069
3007a069o20J073M52l87n07O93O90j188k75P60K43o79k31N59K85p43J90N97N82
$$ -1069 -1689 -616 -164 -551 -1058 -365 325 -863 -1138 -378 -135 -814 -1045 -486 -201 -944 -754 -157 425
3026D25r32j90O11Ko13P5P19J89l45k19L88m5n21j14N91j44K83l61L43L05n12
$$ 425 -507 -697 -86 -84 -697 -622 97 286 -59 -278 110 65 -456 -570 21 -123 160 -201 142 447 -65
3047f5K96j95K43k84m13K30L35L85k62L28J48k04j5k65K58q6m8q2K31M59o00J66
$$ -65 231 36 279 -5 -418 -188 147 532 270 598 746 542 527 262 520 434 386 304 535 994 394 560
3069E60L79j37l94m07L99J94j60l93N50L68k06n18J42L63p90K18N59l1n5l19R7
$$ 560 939 802 408 1 400 594 434 41 591 959 753 235 377 740 -50 168 727 696 641 322 419
3090D19L27p50L25N3J05k28K4J51K33J4k16r3L04l63m18K72mJ3mML60k49k86J00
$$ 419 746 -4 321 374 479 251 275 426 659 673 457 364 668 305 -113 159 155 168 164 168 528 279 -7 93
3114I3o8L36n00J15L13j21k15j05O12r9o00j00L06J28n82K92N18l56k62j33M17
$$ 93 25 361 -139 -24 289 168 -47 -152 460 361 -239 -339 -33 95 -487 -195 323 -33 -295 -428 -11
3135a1J54p01J08K71J20o46L12P76n56Mj65L5N7m05O86J46l92o1J44J03j76k53
$$ -11 143 -558 -450 -179 -59 -705 -393 383 -173 -169 -334 -299 -242 -647 39 185 -207 -268 -124 -21 -197 -450
3157d50j6K58o4l34L25M4K12R0M4k22j99k57M48k13K37k88K88r4j51k43K61O8
$$ -450 -466 -208 -272 -606 -281 -237 -25 65 109 -113 -312 -569 -121 -334 -97 -385 -97 -191 -342 -585 -324 -256
3179b56L62J37p14N6M08M17n47j17K16L7k22k61N02J50J13o85Q41j86n58Q1K94
$$ -256 106 243 -471 -415 -7 410 -137 -254 -38 -1 -223 -484 18 168 281 -404 437 251 -307 -226 68
3200F8L68n76K31J54J16j71n5K41n98j73P03j88k93K5L00M01j29n00M9J72k64
$$ 68 436 -140 91 245 361 190 135 376 -222 -395 308 120 -173 -148 152 553 424 -76 -27 145 -119
3221a19k99M62j09jP4M25m53q5L32m4k99k65K36O3L36J11j06q7K3m22P6k64j62
$$ -119 -418 44 -65 -66 8 433 -20 -105 227 183 -116 -381 -145 -82 254 365 259 172 195 -227 -151 -415 -577
3244e77M62K68J12k54oK36k87j61J35R0j48k88M59lj10J26L98k67m03k5J54J73
$$ -577 -115 153 265 11 5 241 -46 -207 -72 18 -130 -418 41 38 -72 54 452 185 -218 -243 -89 84
3266H4j91J30L84j92l44J42l8j07k78K78L49k98j15N18mn45K65J24k02p9R2K1
$$ 84 -107 23 407 215 -129 13 -25 -132 -410 -132 217 -81 -196 322 318 -227 38 162 -40 -119 -27 -6
3288fQ7R6J01J37n52O7L77l90j82N94O1j32n4m9N04k94l83n8M26k23k33N60j31
$$ -6 81 177 278 415 -137 -70 307 -83 -265 329 390 258 204 155 659 365 -18 -76 350 127 -106 454 323
3311C23k53K69J53N4m61l28N71k13l22K77O74n06k68J25J78Nk87L4K28m31J06
$$ 323 70 339 492 546 85 -243 328 115 -207 70 744 238 -30 95 273 278 -9 25 253 -178 -72
3332g2j07N07Q9l28k3j17k48J45j40Q02o03R1O3j25j20r6M59k10m4p0j48K4K11
$$ -72 -179 328 417 89 66 -51 -299 -154 -294 508 -95 -4 59 -66 -186 -282 177 -33 -77 -147 -295 -271 -60
3355f0r3J78p6J65o53l21L71J08J43R1M1J58k16l46J88K3K29o95O06L25l16o81
$$ -60 -153 25 -51 114 -539 -860 -489 -381 -238 -147 -106 52 -164 -510 -322 -299 -70 -765 -159 166 -150 -831
3377h31N21N59n28k94L35J93n76M5N12M86o21l19L54Q8l65o09J316M28j137l80
$$ -831 -310 249 -279 -573 -238 -45 -621 -576 -64 422 -199 -518 -164 -76 -441 -1050 266 694 -443 -823
3397h23P50K45n04n59J032K65j194K05O65L31n03l79P39Q1q64j60N89M12l39j84
$$ -823 -73 172 -332 -891 141 406 -788 -583 82 413 -90 -469 270 351 -513 -673 -84 328 -11 -195
3417a95J15N57o13m29N92M10j74o33M23K54r1m88L92J015n29p16K50Q49m79p89
$$ -195 -80 477 -136 -565 27 437 263 -370 53 307 216 -272 120 1135 606 -110 140 989 510 -279
3437b79L83J099n39r20K80J068n32p18K68J178n67j237N59Q93k02q98J94J022
$$ -279 104 1203 664 -256 24 1092 560 -158 110 1288 721 -516 43 936 734 -164 30 1052
3455A052m99n03N0J291r32r99O62Q44p80q16O67J125l78j217N95R22o49n87K50
$$ 1052 553 50 100 1391 459 -540 122 966 186 -630 37 1162 784 -433 162 1084 435 -152 98
3474I8P12l86r32O72J021p81j001N41Q78k26j065L04R58n20r73M06R56j50p64
$$ 98 810 424 -508 164 1185 404 -597 -56 822 596 -469 -165 793 273 -700 -294 662 512 -252
3493b52j81Q87l78o26l4J214l0j211j38J146nj059j30J309m5r12o26J092L19j020
$$ -252 -433 454 76 -550 -584 630 600 -611 -749 397 392 -667 -797 512 467 -445 -1071 21 340 -680
3513f80m5J015O60j761o5J029l3r49j27J223L48j591k95J528N39j671l02J287
$$ -680 -725 290 950 -811 -876 153 120 -829 -956 267 615 -976 -1271 257 796 -875 -1177 110
3531A10L11j335m58J543M36j181l28J215l9j437j23J517J73j117L91O82l24j168
$$ 110 421 -914 -1372 171 607 -574 -902 313 274 -1163 -1286 231 404 -713 -322 360 36 -1132
3549a132j28J619K99j392P3P98n1p30j96J436J66j137o55Q17L53l68k62R39L90
$$ -1132 -1260 359 658 -734 -661 137 86 -644 -840 596 762 -375 -1030 -213 140 -228 -490 449 839
3568H39j107q05J070M48m66j19M60K89r29m07N73Q79l60n91N66N03j074o06R74
$$ 839 -268 -1073 -3 445 -21 -140 320 609 -320 -727 -154 725 365 -226 340 843 -231 -837 137
3587A37R52n28r20M54K23j44r93J162Q03n09j070K78P26p04l17P37P58o21r39
$$ 137 1089 561 -359 95 318 174 -819 343 1146 637 -433 -155 571 -133 -450 287 1045 424 -515
3606e15K14P72j40l40L84P70j129o81M97R26m92p09O37R53n49j514P65P95j39
$$ -515 -301 471 331 -9 375 1145 16 -665 -168 758 266 -443 194 1147 598 -916 -151 644 505
3625E05p03j0O93k71r39P27J042m86q36M73K53j68q65N37R54o33p25O16M68p26
$$ 505 -198 -208 485 214 -725 2 1044 558 -278 195 448 280 -585 -48 906 273 -452 164 632 -94
3645i4m30L37Q69n26n59K67N08n26l25P39M26m83m91K2L72j24k20K62P25m40q38
$$ -94 -524 -187 682 156 -403 -136 372 -154 -479 260 686 203 -288 -266 106 -18 -238 24 749 309 -529
3666e29M70O90p23n6L94K43k42p56N71M72m14k72J49L31m30r7K09N17k01m18J93
$$ -529 -59 631 -92 -148 246 489 247 -509 62 534 120 -152 -3 328 -102 -199 10 527 326 -92 101
3687A01L94l45k64O6N24k73j56K62j5k35l20L40L02m41j93L17M11n38P4q5K90
$$ 101 495 150 -114 -48 476 203 47 309 294 59 -261 79 381 -60 -253 64 475 -63 11 -74 216
3708B16j01m11L85K00n43o6J54J27L98l49l8q3n5j8K28J93k14k80M23l99K51l03
$$ 216 115 -296 89 289 -254 -320 -166 -39 359 10 -28 -111 -166 -184 44 237 23 -257 166 -233 18 -285
3730b85K40K18k96O3k29M00j50k24J71J28k60l14J99J14O6j61Q3%J04n85L27N96
$$ -285 -45 173 -123 -60 -289 111 -39 -263 -92 36 -224 -538 -339 -225 -159 -320 -237 -237 -133 -718 -391 205
3752B05m37k19J77J47j23l61L32L49j78l23l1M83n77m00P69L61l90l36K96O56
$$ 205 -232 -451 -274 -127 -250 -611 -279 70 -108 -431 -462 21 -556 -956 -187 174 -216 -552 -256 400
3772D00q62j46N47j92k08%K77K28l07j15M09R3k67j02Q2K39n33J18OL56k01k86
$$ 400 -462 -608 -61 -253 -461 -461 -184 44 -263 -378 31 124 -143 -245 -163 76 -457 -339 -333 23 -178 -464
3794d64N37ko17J05M91P0m00L57L3J1m7k34J87J71n7k41J05L19p0j75K15K0q9
$$ -464 73 71 -546 -441 50 120 -280 77 110 121 74 -160 27 198 141 -100 5 324 254 79 294 314 225
3817B25j54J31L47k77j15K37jp5k42O6N43m15P0k76J10L53k37k60K92L31l45o3
$$ 225 71 202 549 272 157 394 393 318 76 142 685 270 340 64 174 527 290 30 322 653 308 245
3839B45K66k72L29l29J15M08o42N9L25k6k93j23P03k90k87J21M04n66R0k21M98
$$ 245 511 239 568 239 354 762 120 179 504 478 185 62 765 475 188 309 713 147 237 16 514
3860E14k10k68L05K32l35j16Q4Q4P0K3l01J90j49l32J54M40j86m05M58M3l64j47
$$ 514 304 36 341 573 238 122 206 290 360 383 82 272 123 -209 -55 385 199 -206 252 295 -69 -216
3882b16M31m22O04l73k35L35l29Mo1L12j19j71L4R0K05O9m9l29P3k4j54J99j2
$$ -216 215 -207 397 24 -211 124 -205 -201 -262 50 -69 -240 -206 -116 89 158 109 -220 -147 -171 -325 -126 -138
3905a38k3qO5k05j94K49P2l3q9P8j40K57k35j22L91j39j76m4M56k74k9j92L02
$$ -138 -161 -169 -104 -309 -503 -254 -182 -215 -304 -226 -366 -109 -344 -466 -75 -214 -390 -434 22 -252 -281 -473 -171
3928a71j04m31L81j71L90j94L4k83M72n53O82j09J04k06O4j03K13j20K63N6m20
$$ -171 -275 -706 -325 -496 -106 -300 -266 -549 -77 -630 52 -57 47 -159 -95 -198 15 -105 158 214 -206
3949b06j98L84j35Jn4L1j90K33m1O9m0LL9n7M57j12L9m08o5J28pl9J3j00R8K84
$$ -206 -404 -20 -155 -154 -208 -177 -367 -134 -175 -106 -146 -143 -104 -161 296 184 223 -185 -250 -122 -129 -168 -155 -255 -157 127
3975A27j00L36k13L7m35J93P0Q9k04J10j00l01J42M81j72l24M8L32j48j42M13
$$ 127 27 363 150 187 -248 -55 15 104 -100 10 -90 -391 -249 232 60 -264 -216 116 -32 -174 239
3996B39O9k72j54L03j87m0o4N1J36l29J51j1K94l95K07K53j21j76j20Q6p5L6K89
$$ 239 308 36 -118 185 -2 -42 -106 -55 81 -248 -97 -108 186 -209 -2 251 130 -46 -166 -80 -155 -119 170
4019A70O1j9j53l08K54J48j50J72j0j38J52P9P1n03j21K82L80k54l62k1M40J15
$$ 170 231 212 59 -249 5 153 3 175 165 27 179 258 329 -174 -295 -13 367 113 -249 -270 170 285
4041B85l43RL19j50j78R2N2L14m55j81M73l68j55J43L4L17l17P2J15K94m36L60
$$ 285 -58 -49 270 120 -58 34 86 400 -55 -236 237 -131 -286 -143 -109 208 -109 -37 78 372 -64 296
4063B96R9j9l40N2L9L15m56K99J01q2l89Q7L85L7o7k49J47L69p13J37J20j7R7
$$ 296 395 376 36 88 127 442 -14 285 386 304 -85 2 387 424 357 108 255 624 -89 48 168 151 248
4086B48j74M17K2k60m69P41N7n05J97K14m38k82K50L77p7o93J43Q67o10j70p5
$$ 248 74 491 513 253 -216 525 582 77 274 488 50 -232 18 395 318 -375 -232 635 25 -145 -220
4107b20K01J42k52l9K92kj66m8L19M7l10m39O14o1m61N67J45k35j05m51J70L78
$$ -220 -19 123 -129 -168 124 122 -44 -92 227 274 -36 -475 139 78 -383 184 329 94 -11 -462 -292 86
4129H6o52rN83n1m61mM17J34q29O10j07N65p22k08N24L65l14n77Q01j15o35o3
$$ 86 -566 -575 8 -43 -504 -508 -91 43 -786 -176 -283 282 -440 -648 -124 241 -73 -650 151 36 -599 -662
4151f62K03M71k03m39N67Ml65j20M46J22k90k57L51r8j96J54K19J69o20P1K49
$$ -662 -459 12 -191 -630 -63 -59 -424 -544 -98 24 -266 -523 -172 -270 -466 -312 -93 76 -544 -473 -224
4172b24J9m72Q1R01k19l05l40P54j8l91n42O85Q7l55j98L75M21l23k15K48J93
$$ -224 -205 -677 -596 305 86 -219 -559 195 177 -214 -756 -71 16 -339 -537 -162 259 -64 -279 -31 162
4193A62k80m51O41J10o87L49O33J58n47l61N66n2l24l22P19J98o32J22N21j67
$$ 162 -118 -569 72 182 -505 -156 477 635 88 -273 293 241 -83 -405 314 512 -120 2 523 356
4213C56m90j48R83j04m52k34L95M03q26J78L6M87n44k94L57N05o11r6O86L8o02
$$ 356 -134 -282 701 597 145 -89 306 709 -117 61 97 584 40 -254 103 608 -3 -99 587 625 23
4234B3j68N96j4k44k47L55N64q18k0O95k51o00p9L68Q5m39J27L12M69n80k29L66
$$ 23 -145 451 437 193 -54 301 865 47 27 722 471 -129 -208 160 245 -194 -67 245 714 134 -95 271
4256B71j27k50k96J078l73o26K1K23K91m34k79O37K65n58j20L50K62k94j74L95
$$ 271 144 -106 -402 676 303 -323 -302 -79 212 -222 -501 136 401 -157 -277 73 335 41 -133 262
4276B62j33n17q7L45K50j28l79M75J77p21J85J61L42k94m54P65Kn00p0M55M41
$$ 262 129 -388 -475 -130 120 -8 -387 88 265 -456 -271 -110 232 -62 -516 249 251 -249 -319 136 577
4297E77q03l18M62L62q03J71K82L32n73j91L21J76m0k75L88M4k67j61L14L05l23
$$ 577 -226 -544 -82 280 -523 -352 -70 262 -311 -502 -181 -5 -45 -320 68 112 -155 -316 -2 303 -20
4318b0n91N91K82m22m93L50L86j42m71L94P67p44j69p5N18k67k78M08J78j04m96
$$ -20 -611 -20 262 -160 -653 -303 83 -59 -530 -136 631 -113 -282 -357 161 -106 -384 24 202 98 -398
4339c98L95K11j98j84j8M43k09l76K37L32k95k68M49o6k45j81R0M21j27l38M19
$$ -398 -3 208 10 -174 -192 251 42 -334 -97 235 -60 -328 121 55 -190 -371 -281 140 13 -325 94
4360I4J84o92M90k37M8j54J24k09N99j89j34Oo0J37k63N3K20j2l11J79K58p0r9
$$ 94 278 -414 76 -161 -113 -267 -143 -352 247 58 -76 -70 -130 7 -256 -203 17 5 -306 -127 131 61 -38
4383c8m59L50k5O1n0Q1J05l30K53Q0j00l30K80L17m55j62K07J47J91j43j2K32
$$ -38 -497 -147 -172 -111 -161 -80 25 -305 -52 28 -72 -402 -122 195 -260 -422 -215 -68 123 -20 -32 200
4405B00l50n3J09O0J96R0m38J15R1j80j0K80k63J39m1k2mj14K01P7rk62J05r1
$$ 200 -150 -203 -94 -34 162 252 -186 -71 20 -160 -170 110 -153 -14 -55 -77 -81 -195 6 83 74 -188 -83 -174
4429a74M0P0j32L88l53J32L03j82j10j47L80j68k4k58L22J58J4m9m45L33n8o8
$$ -174 -134 -64 -196 192 -161 -29 274 92 -18 -165 215 47 23 -235 87 245 259 210 -235 98 40 -28
4451b8J93J7o7r8K89J8j38k70L92k5k30K23k28J57m3l17L07M0k69J38K30q5L5
$$ -28 165 182 115 17 306 324 186 -84 308 283 53 276 48 205 162 -155 152 192 -77 61 291 206 241
4474B41k38L10J07j50j63J64k56J39K04k40K22j57P6qj17J4j51K55L9j56R5k92
$$ 241 3 313 420 270 107 271 15 154 358 118 340 183 259 251 134 148 -3 252 291 135 230 -62
4496f2M58J26m86M2J13o12M30J76p7L2r6l7J05o3n1j04p9O6j27L24J80k50J26
$$ -62 396 522 36 78 191 -421 9 185 108 140 44 7 112 49 -2 -106 -185 -119 -246 78 258 8 134
4519A34j22K27l67k05P6j12L73k43K33Q3k68K0J83j44N0Q0j23J5qJ48j6k17O0
$$ 134 12 239 -128 -333 -257 -369 4 -239 -6 77 -191 -171 12 -132 -82 -2 -125 -110 -118 30 14 -203 -143
4542a43l44J51J59l37J60K82r9j5P1J52p6k09J5l79Q4M81J17j42Jj11k79M32n15
$$ -143 -487 -336 -177 -514 -354 -72 -171 -186 -115 37 -39 -248 -233 -612 -528 -47 70 -72 -71 -182 -461 -29 -544
4565e44J76Q4L1j8K32p8J74j65P4l39L10l3r5J86m09L92L25m79P3k20L13J51m54
$$ -544 -368 -284 -253 -271 -39 -117 57 -108 -34 -373 -63 -96 -191 -5 -414 -22 303 -176 -103 -323 -10 141 -313
4588c13J39q3O66n29J10K59Jj08j00m2k80J00J73n6M5J3K43j40Q7k33J99j07N1
$$ -313 -174 -257 409 -120 -10 249 250 142 42 0 -280 -180 -7 -63 -18 -5 238 98 185 -48 151 44 95
4611I5p9K10Q3k49m9j97K62N6p0OL03m50K87M1j33M9J70q2r2j55P8J01k82J16
$$ 95 16 226 309 60 11 -186 76 132 62 68 371 -79 208 249 116 165 335 253 161 6 84 185 -97 19
4635A9K44k5j41J08k24lj3J77r9m19P00r4P2l17J7k3K37k76J64Q8n7k14J53j10
$$ 19 263 238 97 205 -19 -22 -35 142 43 -376 324 230 302 -15 2 -21 216 -60 104 192 135 -79 74 -36
4659c6O3p0K26N9k30k89L74L3k3P3j53l0O0R6j86m8O8l6J78K1j61p4j4J93j09
$$ -36 27 -43 183 242 12 -277 97 130 107 180 27 -3 57 153 -33 -81 -13 -49 129 150 -11 -85 -99 94 -15
4684a5N6K41j03l3l17K92j68j23k5m1O2K3J20L39q1k82L7J44k40l61K79J88K21
$$ -15 41 282 179 146 -171 121 -47 -170 -195 -236 -174 -151 -31 308 227 -55 -18 126 -114 -475 -196 -8 213
4707B13j8k1m44P72l17j78j82M88k53j68J25q8K35Q0m3O5j81m18K57j1ML09p8
$$ 213 195 174 -270 502 185 7 -175 313 60 -108 17 -71 164 244 201 266 85 -333 -76 -87 -83 226 148
4730A48n2N2p2J36k34J99k97L6M13j45l46J78n8P5m6L35k49q0%m4p6o8K42J17
$$ 148 96 148 76 212 -22 177 -120 -84 329 184 -162 16 -42 33 -13 322 73 -7 -7 -51 -127 -195 47 164
4754A64J17l72J32J51l11mk26L57m58L41K67m11J73p5nM3K6J52K82o68J97Q9q4
$$ 164 281 -91 41 192 -119 -123 -349 8 -450 -109 158 -253 -80 -155 -160 -117 -91 61 343 -325 -128 -39 -123
4777a23k46J07K56J76l29J75l46J48L85l99m1j18J2l8M24Q1m02R6K03Kk84L5K01
$$ -123 -369 -262 -6 170 -159 16 -330 -182 203 -196 -237 -355 -343 -381 43 124 -278 -182 21 23 -261 -226 -25
4800b5l6jj37m0J7J23J82j37P1l84o2K82K8N6R8j08pR3m7J06j17l05J60J22k55
$$ -25 -61 -62 -199 -239 -222 -99 83 -54 17 -367 -429 -147 -119 -63 35 -73 -80 13 -34 72 -45 -350 -190 -68 -323
4825c23K02P0jK40l18J65j89L32p3j31K6M4P8j25M6J95l40M2K89o2J20J35n35
$$ -323 -121 -51 -52 188 -130 35 -154 178 105 -26 0 44 122 -3 43 238 -102 -60 229 167 287 422 -113
4848a13K23lj24K02J2k98r8K67Q4K60K9l08K53m34P3N9j36J21n7J54k40J72K7
$$ -113 110 107 -17 185 197 -101 -199 68 152 412 441 133 386 -48 25 84 -52 69 12 166 -74 98 125
4871A25n7l0O1j43L31l61O6M41k16j80J05J65q5j51r4K91k3j46p1K75J08n90L89
$$ 125 68 38 99 -44 287 -74 -8 433 217 37 142 307 222 71 -23 268 245 99 28 303 411 -179 210
4894B10k30P8R5j60j77K35J26l38K31L8j09J05k18J04r9N8l5o6K24J8o8J52m32
$$ 210 -20 58 153 -7 -184 51 177 -161 70 108 -1 104 -114 -10 -109 -51 -86 -152 72 90 22 174 -258
4917b58L36j53Q6J1k55K77p4P3j57j1M4Q2k42J42O5K32k33n3J69J97j32l81K90
$$ -258 78 -75 11 22 -233 44 -30 43 -114 -125 -81 1 -241 -99 -34 198 -35 -88 81 278 146 -235 55
4940E5k47K3K7nK56j74j81K84L99n30n4q0K17l57O41k41K62J8n16lJ64j69L55
$$ 55 -192 -169 -142 -147 109 -65 -246 38 437 -93 -147 -227 -10 -367 274 33 295 313 -203 -206 -42 -211 144
4963A44l04J04K52j65K8l51L38rn2J27m42L94J70j82P5k63j2j80N82k64J14L3
$$ 144 -160 -56 196 31 59 -292 46 37 -15 112 -330 64 234 52 127 -136 -148 -328 254 -10 104 137
4985A37nK60l05j38J64j03l7K86k16L04o06K83K85k25pJ08J36k39l92M01m6k21
$$ 137 132 392 87 -51 113 10 -27 259 43 347 -259 24 309 84 77 185 321 82 -310 91 45 -176
5007a76K41q7M42l24J22j69k3K53k93J81q7Q2j06Qk63L67l84M64j53k99N1J57
$$ -176 65 -22 420 96 218 49 26 279 -14 167 80 162 56 64 -199 168 -216 248 95 -204 -153 4
5029DJ47j21l9L04k43J31l39M6J99k13q5L18Q7j79j18r9K76J18j38q5l5p2j8L27
$$ 4 151 30 -9 295 52 183 -156 -110 89 -124 -209 109 196 17 -101 -200 76 194 56 -29 -64 -136 -154 173
5053A73k2j40l40J25l22N09P7l11K0K65O1l0j19Jq9K08r2j40j15J6M92r0n6j62
$$ 173 151 11 -329 -204 -526 -17 60 -251 -231 34 95 65 -54 -53 -142 66 -26 -166 -281 -265 227 137 81 -81
5077h1Mj29%J32L8L40k03R3j13O4J06k53l4j55J16n0J64K1O7l23J61K62j46j16
$$ -81 -77 -206 -206 -74 -36 304 101 194 81 145 251 -2 -36 -191 -75 -125 39 60 127 -196 -35 227 81 -35
5101c5q2M34rj24j17J56j8j27k00n1M99k99K75l5j50l68M56o9K3o5K9p3J97k09
$$ -35 -117 317 308 184 67 223 205 78 -122 -173 326 27 302 267 117 -251 205 136 159 94 123 50 247 38
5125C8j14L93m32J05J50J52j73j79k3p3K57q5K19k24J50j16k31L36L11m48l02
$$ 38 -76 317 -115 -10 140 292 119 -60 -83 -156 101 16 235 11 161 45 -186 150 461 13 -289
5146b89N25j0Q1m51K63k28K20r4j4k43L13j31J42J26k40j38j50M18j26q1p3J47
$$ -289 236 226 307 -144 119 -109 111 17 3 -240 73 -58 84 210 -30 -168 -318 100 -26 -107 -180 -33
5168c3J35j37J20l1l74K7L10k88J38k1K00k0p7K45m29K79j75k65J65J92j85mQ5
$$ -33 102 -35 85 54 -320 -293 17 -271 -133 -154 46 26 -51 194 -235 44 -131 -396 -231 -39 -224 -228 -143
5191a43O3J59j86K10m36L84lp3J8n8o8K86k68M8K11l63N8M17l90j43N33m4l00
$$ -143 -80 79 -107 103 -333 51 48 -25 -7 -65 -133 153 -115 -67 144 -219 -161 256 -134 -277 256 212 -88
5214h8J68j88L25j1p4j93J53k16J1J86K14m07K30q5J70k94j53Q2L56r1j4j02K62
$$ -88 80 -108 217 206 132 -61 92 -124 -113 73 287 -120 110 25 195 -99 -252 -170 186 95 81 -21 241
5237B41M7K21o14P5j44L87j31p9L6J67k8j39K64j07m48M47n5J5M0k55J17K20k22
$$ 241 288 509 -105 -30 -174 213 82 3 39 206 178 39 303 196 -252 195 140 155 195 -60 57 277 55
5260E5J17k58k26L76k56L15j29J87o4J12q5j90j53M89k09j6n7J58j26%P4k48M2
$$ 55 172 -86 -312 64 -192 123 -6 181 117 229 144 -46 -199 290 81 65 8 166 40 40 114 -134 -92
5283i2m8J48k41J28K2Q8j74J90J01j96P5Q2r2j64K37K53j07j61K6j22j5K30m71
$$ -92 -140 8 -233 -105 -83 5 -169 21 122 -74 1 83 -9 -173 64 317 210 49 75 -47 -62 168 -303
5306c03M24N6k83m2Q0j88K44m28L25M3p7O3j8l3m9J99j03M83o49J53O4o4J29k2
$$ -303 121 177 -106 -148 -68 -256 -12 -440 -115 -72 -149 -86 -104 -137 -186 13 -90 393 -256 -103 -39 -103 26 4
5330Dl90M19o4N8k14K3Q2p9n0K5J9J53n04J78M08J69j66j58K05j62k9K19k64Q4
$$ 4 -386 33 -31 27 -187 -164 -82 -161 -211 -186 -167 -14 -518 -340 68 237 71 -87 118 -44 -73 146 -118 -34
5354c4J98l90L05j13K9J09r5J97l3j29j24J79l22K94l39K22K28l85N7K90r3N2
$$ -34 164 -226 79 -34 -5 104 9 206 173 44 -80 99 -223 71 -268 -46 182 -203 -146 144 51 103
5376A03k45J44J89k39L35j04k5q6p6K50l8j38pj3R2m11L25j61K71j48j37K69k39
$$ 103 -142 2 191 -48 287 183 158 72 -4 246 208 70 63 50 142 -269 56 -105 166 18 -119 150 -89
5399h9O5j76K00J01m69K57L12k13k77L55l6j7L86n31K21l57L58j72n9K66n5k94
$$ -89 -24 -200 0 101 -368 -111 201 -12 -289 66 30 13 399 -132 89 -268 90 -82 -141 125 70 -224
5421b24K45K9m2r2J96l8N2j02J23J09j95j15l9J86k91L48r0j46J21j24j61J11
$$ -224 21 50 8 -84 112 74 126 24 147 256 61 -54 -93 93 -198 150 60 -86 35 -89 -250 -139
5443a39Q7j01J1M1o7j8J95J81m44M2M45j93kp8k28M23j13K40j86P5l40n0m9L10
$$ -139 -52 -153 -142 -101 -168 -186 9 190 -254 -212 233 40 38 -40 -268 155 42 282 96 171 -169 -219 -268 42
5467D2j61j81L71J20r6j60K91k02M4j62N1j1J79k19K7r5P0k62M00O2j51P4P9L6
$$ 42 -119 -300 71 191 95 -65 226 24 68 -94 -43 -54 125 -94 -67 -162 -92 -354 46 108 -43 31 110 146
5491A46m2J03k10K13r8j22Q7O7j2k70jQ5o5k3J66K17k02J24m64K88K1q4K58O0
$$ 146 104 207 -3 210 112 -10 77 144 132 -138 -139 -54 -119 -142 24 241 39 163 -301 -13 8 -76 182 242
5515B42l3m00K46L8J6o8R4J8m69J00K40J45l13M0J76j10J10k59J62M02k65j64
$$ 242 209 -191 55 93 109 41 135 153 -316 -216 24 169 -144 -104 72 -38 72 -187 -25 377 112 -52
5537e2J07J4j46j47L57k18k71M21k89J95j34j89M52Q7j40j60j54L51J22n45K23
$$ -52 55 69 -77 -224 133 -85 -356 65 -224 -29 -163 -352 100 187 47 -113 -267 84 206 -339 -116
5558a16K38k70J7K37l5o9j83K17o5k53j2K07j6N8Q6k06K09j78J01r5M6J57j36
$$ -116 122 -148 -131 106 71 2 -181 36 -29 -282 -294 -87 -103 -45 41 -165 44 -134 -33 -128 -82 75 -61
5581f1J5R4j04p8m2L2N4j7J34nj00j76M8M8K41n8r3k59L90k92L06k30j55K52p
$$ -61 -46 48 -56 -134 -176 -144 -90 -107 27 22 -78 -254 -206 -158 83 25 -68 -327 63 -229 77 -153 -308 -56 -63
5606f3J55N8k49J37O5P7n24L74%q0N5p3K9q5M9k1J21J43j37K7K99m29p6J9L53
$$ -63 92 150 -99 38 103 180 -344 30 30 -50 5 -68 -39 -124 -75 -96 25 168 31 58 357 -72 -148 -129 224
5631B24J05l51lk7k8m1PQ9j4K15J2k5o1M0j37J25r9j3J0j86j30P2L78j07m26L12
$$ 224 329 -22 -25 -52 -80 -121 -114 -25 -39 176 188 163 102 142 5 130 31 18 28 -158 -288 -216 162 55 -371 -59
5657e9J86j85j69N6L68r9%j85J90l69K21j02J74J88k98j12p5M01k90J9M14j42
$$ -59 127 -58 -227 -171 197 98 98 -87 103 -266 -45 -147 27 215 -83 -195 -270 131 -159 -140 274 132
5679A32l04q5K38K25k10O2k83K86k70K04j38K54l86j24M38K60m25o5L1K29l06
$$ 132 -172 -257 -19 206 -4 58 -225 61 -209 -5 -143 111 -275 -399 39 299 -126 -191 -160 69 -237
5700b37q7L54j2k53J27m6M0Rj42K23K3j53N9J34L05m05K4R3N5m4k06l4M63k47
$$ -237 -324 30 18 -235 -108 -154 -114 -105 -247 -24 -1 -154 -95 39 344 -61 -37 56 111 67 -139 -173 290 43
5724D3k28L97j38j48n0M79k12M0ok32K42j20j52K3L4K39l58L35K36m68r9K10J96
$$ 43 -185 212 74 -74 -124 355 143 183 177 -55 187 67 -85 -62 -28 211 -147 188 424 -44 -143 67 263
5747B63J04m27N9J89%m11L22j50O01l78j59J18m8l38L52j36J06l42M23L06n15
$$ 263 367 -60 -1 188 188 -223 99 -51 550 172 13 131 83 -255 97 -39 67 -275 148 454 -61
5768f1J52O5K91o22QjN17k54j98K69j0n7j50J59K41k38l76L20K78n82M18k37L09
$$ -61 91 156 447 -175 -167 -168 349 95 -103 166 156 99 -51 108 349 111 -265 55 333 -249 169 -68 241
5791B41M3m88Q5K49J6l68Q0K30k68J42j93Q6Q5jP7n1j96M11k87j7L09j52M5O2
$$ 241 284 -204 -119 130 146 -222 -142 88 -180 -38 -231 -145 -60 -61 16 -35 -231 180 -107 -124 185 33 78 140
5815A40p9l94K80K98k43q4q1N48k51k83J72m1rj74M03j27J25n91J87M11j14l43
$$ 140 61 -333 -53 245 2 -82 -163 385 134 -149 23 -18 -27 -201 202 75 200 -391 -204 207 93 -250
5837b50J46J35j04j83K79p0J02l06J80K09nk2J04k62N8o7q7J03Q3k60J52P5R3
$$ -250 -104 31 -73 -256 23 -47 55 -251 -71 138 133 111 215 -47 11 -56 -143 -40 43 -217 -65 10 103
5860A03l9j07o8K43Mj53K75l22J57j08m3M2K22K4l8r2l00K79K05j58j86K18l07
$$ 103 64 -43 -111 132 136 -17 258 -64 93 -15 -58 -16 206 230 192 100 -200 79 284 126 -60 158 -149
5883a49JK02K60j64o9p1j13J35N5L0k0j94K64k78J9J17j10K82j07k86J70N85o34
$$ -149 -148 54 314 150 81 10 -103 32 87 117 97 -97 167 -111 -92 25 -85 197 90 -196 -26 559 -75
5906g5J01lQ7L8j74Q9K4L1r3k59L25k19J26L3n9j07J48J23p7j26K88J9k86J77
$$ -75 26 23 110 148 -26 63 87 118 25 -234 91 -128 -2 31 -28 -135 13 136 59 -67 221 240 -46 131
5930A31q4J14r9P4k63M09m25k2K13J83m34J8j23O8K27M6R2j69J48j23o5j23J21
$$ 131 47 161 62 136 -127 282 -143 -165 48 231 -203 -185 -308 -240 -13 33 125 -44 104 -19 -84 -207 -86
5953h6l36K54J11M3J08L5L1l9k61L09p6m93K52L11k54K7J06k21J69L4J3j12M1
$$ -86 -422 -168 -57 -14 94 129 160 121 -140 169 93 -400 -148 163 -91 -64 42 -179 -10 24 37 -75 -34
5976c4j26L08l4N2k3j84o1J2J98K24l17J49j21n4l09K05J63p1J49k30J36J8J3
$$ -34 -160 148 114 166 143 -41 -102 -90 108 332 15 164 43 -11 -320 -115 48 -23 126 -104 32 50 63
5999F3M2l47J66J65j40O3p3qP1j8K23j42k26K21K25l03J40j35J40J50r3k66o5
$$ 63 105 -242 -76 89 -51 12 -61 -69 2 -16 207 65 -161 60 285 -18 122 -13 127 277 184 -82 -147
6022a47K50l06K46K70l52L72n49K05j02J85l3n0j42L03k1o7q4j07K08K45j42k64
$$ -147 103 -203 43 313 -39 333 -216 -11 -113 72 39 -11 -153 150 129 62 -22 -129 79 324 182 -82
6044h2K27j74J35o0m9Ok07L82j26m2l06M27j34J78Q2k03j8j47J94j97K96j79J03
$$ -82 145 -29 106 46 -3 3 -204 178 52 10 -296 131 -3 175 257 54 36 -111 83 -114 182 3 106
6067A06j70K5J62j51J97J10j91n6l2k46M76l28J60j93K88r8j32O0m65L64K59N
$$ 106 -64 -39 123 -28 169 279 88 32 0 -246 230 -98 62 -131 157 59 -73 -13 -478 -114 145 150
6089A50l39K41j05Q8P5p9j05M3l32L25J42j38Q8j91J46l7k14L69j57k24M57k55
$$ 150 -189 52 -53 35 110 31 -74 -31 -363 -38 104 -34 54 -137 9 -28 -242 127 -30 -254 203 -52
6111e2K80j27j58L09k05Oj57l6K89j94j25L59k1p7k20R7j27K35j27L5L15Rm01
$$ -52 228 101 -57 252 47 53 -104 -140 149 -45 -170 189 168 91 -129 -32 -159 76 -51 -16 299 308 -93
6134i3p3N28l26j64k12O03m09M0K01j41P7r6lM16k25j60O5j36L72l30L2R0m4j45
$$ -93 -166 362 36 -128 -340 263 -146 -106 95 -46 31 -65 -68 348 123 -37 28 -108 264 -66 -34 56 12 -133
6158a33M27j52P4l34K62rp8KJ17r1j26k24L92j76K51j54K26r7j19L2l69K34l3
$$ -133 294 142 216 -118 144 135 57 59 176 85 -41 -265 127 -49 202 48 274 177 58 90 -279 -45 -78
6181g8p4j56N29m5k76J65j2n2j40L4J09p1m2J87p8J35m25o7L08R9l05P5K91m0
$$ -78 -152 -308 221 176 -100 65 53 1 -139 -105 4 -67 -109 78 0 135 -290 -357 -49 50 -255 -180 111 71
6205G1j59Q9k32K94j81J62m6r8J49j65o0P4Q7J5K0k06j41J92J56q9l6ko1K85l40
$$ 71 -88 1 -231 63 -118 44 -2 -100 49 -116 -176 -102 -15 0 20 -186 -327 -135 21 -68 -104 -106 -167 118 -222
6230b22J4L38N9j49n5o8J43k33J52p4j40J90N9J04j78j60L83o4j73k0K47Lj16
$$ -222 -208 130 189 40 -15 -83 60 -173 -21 -95 -235 -45 14 118 -60 -220 163 99 -74 -94 153 156 40
6253D0j23J04K9l3j90J17K50j90O6K8j19J17k81K00K24N1m39k30N33k1P0k72J10
$$ 40 -83 21 50 17 -173 -56 194 4 70 98 -21 96 -185 15 239 290 -149 -379 154 133 203 -69 41
6276D1K3j49J07P0j30m3j8M17k02k60j0K27K30o12L78l48M32P7J46j44m02J86
$$ 41 64 -85 22 92 -38 -81 -99 318 116 -144 -154 73 303 -309 69 -279 153 230 376 232 -170 16
6298A6k20J02K99Q9m58K90j41J13j5k57M74n58K05J72J94n23K33L15r8j95l13
$$ 16 -204 -102 197 286 -172 118 -23 90 75 -182 292 -266 -61 111 305 -218 15 330 232 37 -276
6319b76%m1M06j12j6L46l66m0K86k05K04j14O3k35J32K2pP9j77kM5P5j54j36J80
$$ -276 -276 -317 89 -23 -39 307 -59 -99 187 -18 186 72 135 -100 32 54 47 126 -51 -53 -8 67 -87 -223 -43
6344d3J07O7m59K46P2K01l79J34K58k66k90K42o7K42j6K82k00n8l72K10m1qk84
$$ -43 64 131 -328 -82 -10 191 -188 -54 204 -62 -352 -110 -177 65 49 331 131 73 -299 -89 -130 -138 -422
6367d22M30%l7r2L0k5j27k48N78K07l27Q2j08J94k29J02J34O0p7o88N99J69l65
$$ -422 8 8 -29 -121 -91 -116 -243 -491 87 294 -33 49 -59 135 -94 8 142 202 125 -563 36 205 -160
6390a60L46n5j87O0Q7k7J39p9J08k70J73k43O9Q3L26j29J33l63q2L6O3J63K5j73
$$ -160 186 131 -56 4 91 64 203 124 232 -38 135 -108 -39 44 370 241 374 11 -71 -35 28 191 216 43
6414D3R8l51J80L40j78j24J57o0k1j76M01j92k29R9K21k74r7K74m6N2k29K24p9
$$ 43 141 -210 -30 310 132 8 165 105 84 -92 309 117 -112 -13 208 -66 -163 111 65 117 -112 112 33
6437C3n2j98J77J28J1J10l11L63j65j63M28m30J79L2k66J96k72J32O7J83l1l6
$$ 33 -19 -217 -40 88 99 209 -102 261 96 -67 361 -69 110 142 -124 72 -200 -68 -1 182 151 115
6459A15n86L86J70j89L13j51J27k37J89j20q7k45J66J22J15J07n13O5L44m08K45
$$ 115 -471 -85 85 -104 209 58 185 -52 137 17 -70 -315 -149 -27 88 195 -318 -253 91 -317 -72
6480g2kJ00m40Q3L52kq0l64M23j25p4L01k87J48j44L38m9p0k35j09J25L32m9j59
$$ -72 -74 26 -414 -331 21 19 -61 -425 -2 -127 -201 100 -187 -39 -183 155 106 36 -199 -308 -183 149 100 -59
6504e9K18j53j40K79k19q9Q3o7K55j76K10L5N6m30J77o1J79j01M19k55j44j10
$$ -59 159 6 -134 145 -74 -163 -80 -147 108 -68 142 177 233 -197 -20 -81 98 -3 416 161 17 -93
6526i3J55l94N82Q3m57L70k07l50M34r9J57j71J15M8K15l04l14R3q8J53L20l28
$$ -93 62 -332 250 333 -124 246 39 -311 123 24 181 10 125 173 388 84 -230 -137 -225 -72 248 -80
6548h0Q5J00J25L0k70J9J77j93o2J35k68J06pL50P4j28l72K53p8J13r9O8j90j52
$$ -80 5 105 230 260 -10 9 186 -7 -69 66 -202 -96 -103 247 321 193 -179 74 -4 109 10 78 -112 -264
6572b64M33q9l66J99j80M17j23mL04l78l5k94K51J48k86O6O7R5l9j5K27m01K29
$$ -264 169 80 -286 -87 -267 150 27 23 327 -51 -86 -380 -129 19 -267 -201 -134 -39 -78 -93 134 -267 -38
6595c8j81O5M08j57j74j58Q1j80K44j91M58N9k66j7k34K36j69K27p3j98N31l09
$$ -38 -219 -154 254 97 -77 -235 -154 -334 -90 -281 177 236 -30 -47 -281 -45 -214 13 -60 -258 273 -36
6617c6J54k45M66m63L06k95M64k29k25P4Q9j8n0J09n1Q8j24k92P4K09K93k11m66
$$ -36 118 -127 339 -124 182 -113 351 122 -103 -29 60 42 -8 101 50 138 14 -278 -204 5 298 87 -379
6640c79M55rM4j49J92l29J51j15m1M01j87j3J04k3Q9k04j5J64j76J27m2pJ19o3
$$ -379 76 67 111 -38 154 -175 -24 -139 -180 221 34 21 125 102 191 -13 -28 136 -40 87 45 38 157 94
6664I4k52J02m7K01k59J84J26j08J04j76l6j17J40J98j43p8j51J33K3j25J63J35
$$ 94 -158 -56 -103 98 -161 23 149 41 145 -31 -67 -184 -44 154 11 -67 -218 -85 -62 -187 -24 111
6686A11r3K86n7k78p3K09j62j21P8K21M5j13o9Q1L1k6j04K23l4j90Kj19J15K14
$$ 111 18 304 247 -31 -104 105 -57 -178 -100 121 166 53 -16 65 96 70 -34 189 155 -35 -33 -152 -37 177
6710A77k30o4M7j17K80k41K15j14k66K07M0r9J66k25nK60j13R9j14P0j6j15K27
$$ 177 -53 -117 -70 -187 93 -148 67 -47 -313 -106 -66 -165 1 -224 -229 31 -82 17 -97 -27 -43 -158 69
6733F9K6l1n6j37n2K00qj22J5K7Q4O0m5q2k51K73O0k55k3m7K54K60k13K3j27K82
$$ 69 95 64 8 -129 -181 19 11 -111 -96 -69 15 75 30 -52 -303 -30 30 -225 -248 -295 -41 219 6 29 -98 184
6759A84k75J04L1j27J47J61p1k72o5K35q8J92Pl75M48q7k33M5M8r7o6K86j63J85
$$ 184 -91 13 44 -83 64 225 154 -118 -183 52 -36 156 163 -212 236 149 -84 -39 9 -88 -154 132 -31 154
6783A54q9K31k49J22l92Q8J20R6p9J96k2j60o2J53K20l67K49k46Nn9M53n48P9
$$ 154 65 296 47 169 -223 -135 -15 81 2 198 176 16 -46 107 327 -40 209 -37 -32 -91 362 -186 -107
6806a07J98j55k2K07j10j53P0K72k73R6J09p2q5P4J32j24k00j67K58O6p9j35J76
$$ -107 91 -64 -86 121 11 -142 -72 200 -73 23 132 60 -25 49 181 57 -143 -310 -52 14 -65 -200 -24
6829b4J41l16J75L26l10R1r2l2O1j69K10j10Q5n9K05j86J80j79j21J12m3J09p
$$ -24 117 -199 -24 302 -8 83 -9 -41 20 -149 61 -49 36 -23 182 -4 176 -3 -124 -12 -55 54 47
6852D7n9j27J2K95j13J71k93k20K67j28J75k85K61k11J78J16k09m6N0j25K84J28
$$ 47 -12 -139 -127 168 55 226 -67 -287 -20 -148 27 -258 3 -208 -30 86 -123 -169 -119 -244 40 168
6874A68l76J49J77P7r5j93J82J97j40k56J4P6j67K5K83k07N6j1j73K00k32L5J58
$$ 168 -208 -59 118 195 100 -93 89 286 146 -110 -96 -20 -187 -162 121 -86 -30 -41 -214 -14 -246 -211 -53
6897e3L20k24n3k5Jr4q8L7q8O6L80k67l26L20K84k42j03J48M5O1p5n0p8O1J5p5
$$ -53 267 43 -10 -35 -34 -128 -216 -179 -267 -201 179 -88 -414 -94 190 -52 -155 -7 38 99 24 -26 -104 -43 -28 -103
6923a03L62j73k2j50K17n9R1j01j81K38j39K6j01J66J23R6j38k31N3M29m85J02
$$ -103 259 86 64 -86 131 72 163 62 -119 119 -20 6 -95 71 194 290 152 -79 -26 403 -82 20
6945B0kj01J28j68J28k31K59j79J30N7j17M8J51j26n0J65p1l06K95q8K79n08J85
$$ 20 18 -83 45 -123 5 -226 33 -146 -16 41 -76 -28 123 -3 -53 112 41 -265 30 -58 221 -287 -102
6968a02J42j33K31r1m6lK3l24J92r9J26J94R1J69j60j89q2K35j27n7k0L7k5m36
$$ -102 40 -93 138 47 1 -2 21 -303 -111 -210 -84 110 201 370 210 21 -61 174 47 -10 -30 7 -18 -454
6992d54N23K4l42K45K41j98o1j49J67J23j59J88j23J00ll03J93o2j09K94j48O
$$ -454 69 93 -249 -4 237 39 -22 -171 -4 119 -40 148 25 125 122 -181 12 -50 -159 135 -13 -7
7014gk23Q4L53k31l20L09J8M50o94M75k25J42k57N6j08K35j46Q3j2L5j49J86n3
$$ -7 -230 -146 207 -24 -344 -35 -17 433 -261 214 -11 131 -126 -70 -178 57 -89 -6 -18 17 -132 54 1
7037Ao5j35J63J57k00j46P1L03j85m2J17M7J09k81R5k9k3O8J70J5j77k43M4M23
$$ 1 -64 -199 -36 121 -79 -225 -154 149 -36 -78 39 86 195 -86 9 -20 -43 25 195 210 33 -210 -166 257
7061B57l50K85k24R5pJ07j09RN7j06P7M9k64Q1J09M6J67l93l18L61o4J96N9l15
$$ 257 -93 192 -32 63 56 163 54 63 120 14 91 140 -124 -43 66 112 279 -114 -432 -71 -135 61 120 -195
7085a95L66k39o4N7J15Q3k55J80j33J23l35J92K29l08J89m8K76m40Q0l4J75n0
$$ -195 171 -68 -132 -75 40 123 -132 48 -85 38 -297 -105 124 -184 5 -43 233 -207 -127 -161 14 -36
7107c6j15k0lJ24r8K09O5q0K44m63j11Q8m8J03L17l51Q6L1j98K82P5j62J42k98
$$ -36 -151 -171 -174 -50 -148 61 126 46 290 -173 -284 -196 -244 -141 176 -175 -89 -58 -256 26 101 -61 81 -217
7131b17K60J21k67n4J53j24K52J09m36K87l55M51k63j43K99L5k17J5J60j67J93
$$ -217 43 164 -103 -157 -4 -128 124 233 -203 84 -271 180 -83 -226 73 108 -109 -94 66 -101 92
7152I2k67L57L7m20J60J13k03k08J68O0K32k74L25k9n6j52R4J39j33j04K86l46
$$ 92 -175 182 219 -201 -41 72 -131 -339 -171 -111 121 -153 172 143 87 -65 29 168 35 -69 217 -129
7174a29j6M38j45j60J05r4L91q0k04Q1k34k1K06r4pJ35l0J50m06J56J21k20Q6
$$ -129 -145 293 148 -12 93 -1 390 310 106 187 -47 -68 138 44 37 172 142 292 -114 42 163 -57 29
7197B9j69K10K9o7q9j7L49m76K23k95K62K09j64Q5j58K13J69k48j42K5O4p4P4
$$ 29 -140 70 99 32 -57 -74 275 -201 22 -273 -11 198 34 119 -39 174 343 95 -47 -22 42 -32 42
7220D2j72J72l00J96J17k04K03Qj5J37m40K52k6J58q8o3K38k20j35k4L44j32n0
$$ 42 -130 42 -258 -62 55 -149 54 62 47 184 -256 -4 -30 128 40 -23 215 -5 -140 -164 180 48 -2
7243bk46M91k72P4J36p4R3m14K30O2k49J78o3j46K46L3L9j93o3K5j3M43l57P6
$$ -2 -248 243 -29 45 181 107 200 -214 16 78 -171 7 -56 -202 44 77 116 -77 -140 -115 -128 315 -42 34
7267C4l30J16J58k7j31jO6N6K3M0J42k49Q9O4N4j15K25k92L67k43k78M35k45K97
$$ 34 -296 -180 -22 -49 -180 -181 -115 -59 -36 4 146 -103 -14 50 104 -11 214 -78 289 46 -232 203 -42 255
7291B55m75L65L6j16k49R7L66Ol52r9J62k80L75r2J02r5k08K10j01K5J63J23M2
$$ 255 -220 145 181 65 -184 -87 279 285 -67 -166 -4 -284 91 -1 101 6 -202 8 -93 -68 95 218 260
7314B60j69n9m6k46N14j21l0m30L63O8j63K71k68j6O5J37o0q7J62j03O9k84J94
$$ 260 91 32 -14 -260 254 133 103 -327 36 104 -59 212 -56 -72 -7 130 70 -17 145 42 111 -173 21
7337B1j6N4J65j14K53l71rL4M8j15k4J36r9M5Q0k31K03k16J61k0j07P3r7K58J85
$$ 21 5 59 224 110 363 -8 -17 17 65 -50 -74 62 -37 8 88 -143 60 -156 5 -15 -122 -49 -146 112 297
7362B97m62K25j54L8L43m69K00m07L26q6K28k47K72L0j14Pj06n8K12R2l8k32m4
$$ 297 -165 60 -94 -56 287 -182 18 -389 -63 -149 79 -168 104 134 20 27 -79 -137 75 167 129 -103 -147
7385a47O5K00mp6j19K8P2j6j09k9J94K6Pj42o6L1l3P0q6M59k37q5M88l59k31N0
$$ -147 -82 118 114 38 -81 -53 19 3 -106 -135 59 85 92 -50 -116 -85 -118 -48 -134 325 88 3 491 132 -99 -49
7411d9K90j56n5J59k18J00M5r9rk9q0K03j19l09J49L87j02q6k8J55J45m63J27
$$ -49 241 85 30 189 -29 71 116 17 8 -21 -101 102 -17 -326 -177 210 108 22 -6 149 294 -169 -42
7434d2L15l49K25j92J8k0J04k55J75J57m20J95P7Q3m8j47J40k40J02L34k4l16
$$ -42 273 -76 149 -43 -25 -45 59 -196 -21 136 -284 -89 -12 71 23 -124 16 -224 -122 212 188 -128
7456a28K96k89J55nJ17K23k42j9n0J09j74Rl3J08M6M0m40K68j2N4J0p6R4N4r5
$$ -128 168 -121 34 29 146 369 127 108 58 167 -7 2 -31 77 123 163 -277 -9 -21 33 43 -33 61 115 20
7481B0j54J06L1m2J45Q9j57J00j46r9J62l03O3j9J64O6j00J9L2O0p6J15l41Q4
$$ 20 -134 -28 3 -39 106 195 38 138 -8 -107 55 -248 -185 -204 -40 26 -74 -55 -23 37 -39 76 -265 -181
7505a81K69l1j36p0K33Rj9j07jKJ31k11O7J13m64L23J62l9J15Kl05K70k05O6j06
$$ -181 88 57 -79 -149 84 93 74 -33 -34 -32 99 -112 -45 68 -396 -73 89 50 165 167 -138 132 -73 -7 -113
7530a13N8m2j51M21J43n37M80l02J27k28l8L79l36J70K17l67K96j97K37k4k14
$$ -113 -55 -97 -248 173 316 -221 259 -43 84 -144 -182 197 -139 31 248 -119 177 -20 217 193 -21
7551b1R2J38k51j40L03q9j24Q1j08J22J8J16j85P8J40P0k93J50j44J64m01O41
$$ -21 71 209 -42 -182 121 32 -92 -11 -119 3 21 137 -48 30 170 240 -53 97 -47 117 -284 357
7573C57l76J75l10M2j4J65N1j14l8p0L0K79j76j7j39Q5J88n49O75k30J55K5l02
$$ 357 -19 156 -154 -112 -126 39 90 -24 -62 -132 -102 177 1 -16 -155 -70 118 -431 244 14 169 194 -108
7596a08J36K5J53N9l1k7l92k4M71o6J12n45K94J93k24j15j64K58J33k0j83L19
$$ -108 28 53 206 265 234 207 -185 -209 262 196 308 -237 57 250 26 -89 -253 5 138 118 -65 254
7618B54j73l44Jk3M29l56K28K61j03Nk46R1p3o0k7M5K32k54lL14k69K86k63q4
$$ 254 81 -263 -262 -285 144 -212 16 277 174 179 -67 24 -49 -109 -136 -91 141 -113 -116 198 -71 215 -48 -132
7642a32Q5J7m48M84k28M6P5J11Q9j17n9j00J55o1N7l2J92k30J12L7j26J20J1j74
$$ -132 -47 -30 -478 6 -222 -176 -101 10 99 -18 -77 -177 -22 -83 -26 -58 134 -96 16 53 -73 47 58 -116
7666a16M38j85k62L0L0J31L2Pk16J08k22M81qk85j57J26Q6R8k40Q9K30k73M2K31
$$ -116 322 137 -125 -95 -65 66 98 105 -111 -3 -225 256 248 -37 -194 -68 18 116 -124 -35 195 -78 -36 195
7690A95p6o2q5J7J63m97J21K58L33n54K23l73L51J06k72O2M07k77j9J07j21j25
$$ 195 119 57 -28 -11 152 -345 -224 34 367 -187 36 -337 14 120 -152 -90 317 40 21 128 7 -118
7712a18M6k5J41K0K1m05O52k24%k7J7n0J16k55J58j87n37P33K01l35P3K69k00
$$ -118 -72 -97 44 64 85 -320 332 108 108 81 98 48 164 -91 67 -120 -657 76 277 -58 15 284 84
7735H4K6m00M93n00J54O2M8j7j5o4j00K97q3J24j89L54k97k69M95j85l1k3L08
$$ 84 110 -290 203 -297 -143 -81 -33 -50 -65 -129 -229 68 -15 109 -80 274 -23 -292 203 18 -13 -36 272
7758B72k99j8k1K22j51j35R7q5J22j51R5K07j31j37o5L96l68k1J89l7o2J10M0
$$ 272 -27 -45 -66 156 5 -130 -33 -118 4 -147 -52 155 24 -113 -178 218 -150 -171 18 -19 -81 29 69
7781F9k26K25l93K10N5Q3j66K6J98J9j70j5N0K74j75l14J24J04K9ML4j30K6K16
$$ 69 -157 68 -325 -115 -60 23 -143 -117 81 100 -70 -85 -35 239 64 -250 -126 -22 7 11 45 -85 -59 157
7805A57m14N02l50K81Pk05j12K16k73K2L15p0J39j70p7k44J92R8o0J36k25K69
$$ 157 -257 245 -105 176 183 -22 -134 82 -191 -169 146 76 215 45 -32 -276 -84 14 -46 90 -135 134
7827A34K3KP8j40k41j22M33P0l36J67j37J56j18j45k6L27j39P6o6J10mk50J44
$$ 134 157 159 237 97 -144 -266 167 237 -99 68 -69 87 -31 -176 -202 125 -14 62 -4 106 102 -148 -4
7850dK42l97K61J93j65j83K09j6k71P0j70K72J85N6k87k11K22pJ67j78j41R5K7
$$ -4 238 -159 102 295 130 -53 156 140 -131 -61 -231 41 226 282 -5 -216 6 -1 166 -12 -153 -58 -31
7873c1k40J98K44q8K24K3k75j39J99r9j74J19R9n5J57k40J3K30k87j4QJ94r8K01
$$ -31 -271 -73 171 83 307 330 55 -84 115 16 -158 -39 60 5 162 -78 -65 165 -122 -136 -128 66 -32 169
7897A69j92n5R2K83l08n2k19K60K1K86j91j49J21j33j63M0L59l05Q3K34K45l51
$$ 169 -23 -78 14 297 -11 -63 -282 -22 -1 285 94 -55 66 -67 -230 -190 169 -136 -53 181 426 75
7919G5n7o4N6O1R3j49JJ64K4j63p9J52q4j19J79l46M44j28j77J13k5J8o8N0M6
$$ 75 18 -46 10 71 164 15 16 180 204 41 -38 114 30 -89 90 -256 188 60 -117 -4 -29 -11 -79 -29 17
7944A7j30L13j90K69m70K84Q6j37Nk62O15l80j00J54j1j40j12J75O0k81K29o6
$$ 17 -113 200 10 279 -191 93 179 42 47 -215 400 20 -80 74 63 -77 -189 -14 46 -235 -6 -72
7966g2M38l41N3j43PK90l85L50l77m4j26J01L27p8j7j76L01J74l58k50L44n2k10
$$ -72 366 25 78 -65 -58 232 -153 197 -180 -224 -350 -249 78 0 -17 -193 108 282 -76 -326 18 -34 -244
7989b44K13j10J39rM2Po9k11K15K14j0O2l94J19K48k99J09J00k50J45m9m20M92
$$ -244 -31 -141 -2 -11 31 38 -31 -242 -27 187 177 239 -155 -36 212 -87 22 122 -128 17 -32 -452 40
8012D0O3l86L36Jl07q5M57j56K23m0k67J03J13l23K02j40J49N7j56L02l19J82
$$ 40 103 -283 53 54 -253 -338 119 -37 186 146 -121 -18 95 -228 -26 -166 -17 40 -116 186 -133 49
8034D9q7K45k79j45J29J44L8j98k2J26K44j04l2j73pM2J95l00K3j34J77p1J13
$$ 49 -38 207 -72 -217 -88 56 94 -104 -126 0 244 140 108 -65 -72 -30 165 -135 -112 -246 -69 -140 -27
8057b7J44l9J49k30r7J99Kl79L92J10j89j1K22l98N18k76J44l54j3j28L11q5R3
$$ -27 117 78 227 -3 -100 99 101 -278 114 224 35 24 246 -152 366 90 234 -120 -133 -261 50 -35 58
8080E8J18o2N7j36k31K09K46j5Rl23n8L27k83Mk15L73k2j29K58j70j52J6L70l31
$$ 58 176 114 171 35 -196 13 259 244 253 -70 -128 199 -84 -80 -295 78 56 -73 185 15 -137 -121 249 -82
8104h2N7p8K61N1l1k90K60p4J6j34K3j89L19k63l1j59M48q6l4kj8J27k57K71L4
$$ -82 -25 -103 158 209 178 -112 148 74 90 -44 -21 -210 109 -154 -185 -344 104 18 -16 -18 -36 91 -166 105 139
8129A39j62J84n4o5J03k46j12L04k4Q5q1j17j8L4K8j20K84l44N8L12o3j90O1j42
$$ 139 -23 161 107 42 145 -101 -213 91 67 152 71 -46 -64 -30 -2 -122 162 -182 -124 188 125 -65 -4 -146
8153a46R0O6J98k8j26J26j33J76j57n4j63J06j60kp9L19o4M7R5l3l22K05L8m3
$$ -146 -56 10 208 180 54 180 47 223 66 12 -151 -45 -205 -207 -286 33 -31 16 111 78 -244 -39 -1 -44
8177d4n5L50m07N3K61k20j16j74L85j29J8M9p1J28
$$ -44 -99 251 -156 -103 158 -62 -178 -352 33 -96 -78 -29 -100 28
8191B8
$$ Imaginary data points
##PAGE= N=2
##DATA TABLE= (X++(I..I)), XYDATA
0@%%%qJ6j6J6k4L9m7N6p2Q8j04J28j59J91k24K64l12L68m28M92n71O58p54Q61
$$ 0 0 0 0 -8 8 -8 8 -16 23 -24 32 -40 48 -56 72 -87 104 -120 144 -168 200 -228 264 -307 351 -403 458
27D58r76J108j254J410j586J781j992K223k479K760l066L402l772M180m627N122
$$ 458 -518 590 -664 746 -840 941 -1051 1172 -1307 1453 -1613 1789 -1983 2197 -2430 2692
43B692n672O283o967P737q614R619j0782J2150j3785J5782j8287K1532k5923L2238
$$ 2692 -2980 3303 -3664 4073 -4541 5078 -5704 6446 -7339 8443 -9844 11688 -14235 18003
57A8003m2152O0059j02412L74179L36046p60303q3295M23315L8940m56145P5959
$$ 18003 -24149 35910 -66502 307677 643723 -116580 -199875 223440 262380 -193765 -117806
68a17806M43722J2954l77302L0167K48235q5241j96288K19041K03473k77015l17440
$$ -117806 325916 338870 -38432 -8265 239970 154729 -41559 177482 380955 103940 -213500
79b13500J88756K62077j03775j11955K24308J15666k78292k25159J59481J61957
$$ -213500 -24744 237333 133558 21603 245911 361577 83285 -141874 17607 179564
89A79564r9376o2764J64240P8950j74777j53584Q6527J56702J5188j04016p9661
$$ 179564 80188 17424 181664 260614 85837 -67747 18780 175482 190670 86654 6993
100F993J3464N7109L193m1543L3756J08392L146j51384j10020M0388O3306K0069
$$ 6993 20457 77566 80759 39216 72972 181364 184510 33126 -76894 -36506 26800 46869
112D6869O1230N6912q1168j13877M3988P4958r7770r1809J40181J33660j50582
$$ 46869 108099 165011 83843 -30034 13954 88912 -8858 -100667 39514 173174 22592
123B2592j73734J28815J86570q9307j45398R1337Q9751j70653j48249J51440J70166
$$ 22592 -151142 -22327 164243 74936 -70462 20875 110626 -60027 -208276 -56836 113330
134A13330q8469r7439J19649P1676j72621j27520J21343J06870r0017n5439J01912
$$ 113330 24861 -72578 47071 118747 -53874 -181394 -60051 46819 -43198 -98637 3275
145C275K7928j20369j7051J34999J8514j40897l4548J12324M575j30925m122J61011
$$ 3275 31203 -89166 -106217 28782 47296 -93601 -128149 -15825 -11250 -142175 -146297 14714
157A4714O0475j19102p5900N9160K4606p6629k3796Q8674N2776n2378l9399L4502
$$ 14714 75189 -43913 -119813 -60653 -36047 -112676 -136472 -47798 4978 -47400 -86799 -52297
169e2297J0436n2620j3797N9394K0720o2297l3276N7449M6474l5659k7454M6306
$$ -52297 -41861 -94481 -108278 -48884 -28164 -90461 -123737 -66288 -19814 -55473 -82927 -36621
181c6621K0826p5012n8961N0303O0590k2433j6782O2316L1062p6833o2160M7478
$$ -36621 -15795 -90807 -149768 -99465 -38875 -61308 -78090 -15774 15288 -61545 -123705 -76227
193g6227M5503m6314l1719O0719M3963m8113l1284N5780L4952n1641l4849L3792
$$ -76227 -30724 -77038 -108757 -48038 -4075 -52188 -83472 -27692 7260 -44381 -79230 -45438
205d5438N479n2360J664P8227L3123m3724j4158L6170j1009o0485p727N2049K0010
$$ -45438 -39959 -92319 -90655 -12428 20695 -23029 -37187 -1017 -12026 -72511 -80238 -28189 -8179
218h179k2788M850L0316k273k5500M061K0008q566k2859J276J4884K894M081J9428
$$ -8179 -30967 -26117 4199 1926 -23574 -19513 495 -8071 -30930 -29654 -14770 -11876 -7795 11633
232A1633J4796p039j5332j2179r071P95J3973J3376P907J1054N129j5558j6218
$$ 11633 26429 19390 4058 -8121 -17192 -16397 -2424 10952 18859 29913 35042 19484 3266
245C266Q270J0526j2224q225J9002J2758j2952r90K6865J0025k7415j4982J4173
$$ 3266 11536 22062 9838 1613 20615 33373 20421 19431 46296 56321 28906 13924 28097
258B8097j956k4213Q813M2779J1554k5763l314K1385j3550l6670N710L5471j971
$$ 28097 26141 1928 10741 53520 65074 39311 35997 57382 43832 7162 12872 48343 46372
271D6372k4528J5002L1148j1373k7336J2603J9571k3636k8469J7178K5102j1554
$$ 46372 21844 36846 67994 56621 29285 41888 61459 37823 9354 26532 51634 40080
283D0080r268K8475J8330k9674k7156J4225R815k3972p340L3506J7485k1388r152
$$ 40080 30812 59287 77617 47943 20787 35012 44827 20855 13515 47021 64506 43118 33966
296C3966K1195M03l0256r883J8945J581j8834N019K7659M102j8146j878J0228
$$ 33966 55161 55564 25308 15425 34370 35951 17117 22136 49795 53897 35751 33873 44101
309D4101j3576k5854O09J9841K042q540J1003J6964q504k0893l035M549j1546
$$ 44101 30525 4671 5280 25121 27163 18623 29626 46590 38086 17193 14158 18707 7161
322G161j1779R386J4297k19l506P821M012j3303j4714l215M97n897l44J2294J1565
$$ 7161 -4618 4768 19065 18846 15340 23161 27173 13870 -844 -4059 -3562 -9459 -9803 2491 14056
337A4056j611n461q82m657j3148j0051J432M436K442M765P596K095m141n305n784
$$ 14056 12445 6984 6102 1445 -11703 -21754 -20322 -15886 -13444 -8679 -1083 1012 -3129 -8434 -14218
352a4218r455p465K86N015M343M983N670L067m358r090p792n067l936P61N606
$$ -14218 -23673 -31138 -30852 -25837 -21494 -16511 -10841 -7774 -12132 -21222 -29014 -34081 -38017 -37256 -31650
367c1650O037M314M315J050o697q439l472k266n519j258Q442R824L355J16J507
$$ -31650 -25613 -21299 -16984 -15934 -22631 -31070 -34542 -36808 -42327 -43585 -35143 -25319 -21964 -21848 -20341
382b0341k847r739q539j746J823K248O248R282N003k430l992j216m575p473k438
$$ -20341 -23188 -32927 -41466 -43212 -41389 -39141 -32893 -23611 -18608 -21038 -25030 -26246 -30821 -38294 -40732
397d0732N032L489K804P452Q425N13n912m693l759n983l436M949J0463P764K430
$$ -40732 -35700 -32211 -29407 -21955 -13530 -13017 -18929 -23622 -27381 -33364 -36800 -31851 -21388 -13624 -11194
412a1194L34m17k274m971k677j89K60J454N080O024L663K674K342j519p713p769
$$ -11194 -10860 -11277 -13551 -18522 -21199 -21388 -21128 -19674 -14594 -8570 -4907 -2233 109 -1410 -9123 -16892
428a6892n78N952O783M833M063L753J40n640n008L42J522M38J424L442J962K474
$$ -16892 -17470 -11518 -4735 98 4161 7914 8054 2414 -2594 -2252 -730 -292 1132 4574 6536 9010
444I010N905M246l922q024k706J498j542j29R148J2491J427q257m035J252k936
$$ 9010 14915 19161 15239 7215 4509 6007 4465 4336 13484 25975 27402 19145 15110 16362 13426
459A3426n668L281Q436M56l335M891O783j898m127J990j300j0527n476Q275R208
$$ 13426 7758 11039 19475 19931 16596 21487 28270 26372 22245 24235 22935 12408 6932 15207 24415
474B4415m87Q37Q214J089j3286r200O557N895o987m233R203P278n948m669O403
$$ 24415 23928 24765 32979 34068 20782 11582 18139 24034 17047 12814 22017 29295 23347 18678 25081
489B5081M672o496p723j195p77q09M583O293j1k768P76N25p426p502L093Q660
$$ 25081 29753 23257 15534 14339 13562 12753 17336 23629 23618 20850 21626 22151 14725 7223 10316 18976
505A8976J17p761k461O712L419m361n478J002M185j625p495m170O264P950k153
$$ 18976 19093 11332 8871 15583 19002 14641 9163 10165 14350 12725 5230 1060 7324 15274 13121
520A3121p822K43L770n332p545K859Q507n16m789J430J907n578n350L560L739
$$ 13121 5299 5542 9312 3980 -3565 -706 7801 7285 2496 3926 5833 255 -5095 -1535 2204
535B204n143l262N791J754q797q24J2855K353j5914p696J2560M677j6532o155
$$ 2204 -2939 -6201 -410 1344 -7453 -8277 4578 6931 -8983 -16679 -4119 558 -15974 -22129
549b2129K0070J2632j5061j4437R508R217j1199r902R074Q147q284n761Q309M162
$$ -22129 -2059 10573 -4488 -18925 -9417 -200 -11399 -21301 -12227 -4080 -12364 -18125 -9816 -5654
563e654q388K58J2807k612j9659l752J7510L828j6025q9J9939L630k0893q312
$$ -5654 -14042 -13784 -977 -3589 -23248 -27000 -9490 -5662 -21687 -21776 -1837 1793 -19100 -27412
577b7412J6431P155j3448n529J3754M192j5294n112J5868O892j1427m574R174
$$ -27412 -10981 -3826 -17274 -22803 -9049 -4857 -20151 -25263 -9395 -2503 -13930 -18504 -9330
590i330L02j2849n27J4267L777q699O2O914n805j2162N519J6062m1j3061m02J1363
$$ -9330 -9028 -21877 -22404 -8137 -4360 -13059 -12997 -6083 -11888 -24050 -18531 -2469 -2510 -15571 -15973 -4610
606d610j515j2291O82J4715L694j1545o072N123M282L9L601L610j445n475l846
$$ -4610 -6125 -18416 -17734 -3019 675 -10870 -16942 -11819 -7537 -7498 -3897 -287 -1732 -7207 -11053
621a1053j192N93M225O228L172j287m215l703P55N256L491l512l718J303R68l602
$$ -11053 -12245 -11652 -7427 -1199 1973 686 -3529 -7232 -6477 -1221 2270 -1242 -4960 -3657 -2689 -6291
637f291K61J1393P952n922r467k82P39m731J834J3789M487j0896n574Q781K273
$$ -6291 -6030 5363 13315 7393 -2074 -2356 -1617 -6348 -4514 9275 13762 2866 -2708 6073 8346
652H346q635K121J3253q52j6568m997J2139M851m800N498J1608o921j7767m96
$$ 8346 -289 1832 15085 14233 -2335 -7332 4807 9658 4858 10356 21964 15043 -2724 -3220
666c220J2695J695o061N838P661q420j0834N254R212k012j181P452k399j5863
$$ -3220 9475 11170 5109 10947 18608 10188 -646 4608 13820 11808 10627 18079 15680 -183
680a83l011J6443P585r792k585R416k318j5077j718J4320O032n757j708J780p347
$$ -183 -3194 13249 20834 11042 8457 17873 15555 478 -1240 13080 19112 13355 11647 13427 6080
695F080m911R395Q577o971n270P215m88j4867j985J9511P971j5007q271J0389
$$ 6080 1169 10564 19141 12170 6900 14115 13627 -1240 -3225 16286 24257 9250 979 11368
709A1368J098j3983j128J7567O299j3466p754N377J360n271L509Q566l223r241
$$ 11368 12466 -1517 -2645 14922 21221 7755 1 5378 6738 1467 4976 13542 10319 1078
723A078P85L668o283l070J2310Q498j1409j3460M822R684l133p337L970Q055k645
$$ 1078 1863 5531 -752 -3822 8488 16986 5577 -7883 -3061 6623 3490 -3847 123 8178 5533
738E533j1046m193P356P163r99n944r79L014k561o689R90R236K569q138l691M577
$$ 5533 -5513 -9706 -2350 4813 3814 -2130 -3109 -95 -2656 -9345 -8355 881 3450 -4688 -8379 -3802
754c802J01n630K379Q520k879j0022K603P323q091r192J3193J4564j2678j7443
$$ -3802 -3701 -9331 -6952 1568 -1311 -11333 -8730 -1407 -9498 -18690 -5497 9067 -3611 -21054
768b1054J0122J5914j2206j7696J3297K0365j0857k0441Q102J7276p198j3933
$$ -21054 -10932 4982 -7224 -24920 -11623 8742 -2115 -22556 -14454 2822 -4376 -18309
780a8309Q869J2313j0432j3185R164R669q217m539J4060N498j6751q841J2389
$$ -18309 -9440 2873 -7559 -20744 -11580 -1911 -10128 -14667 -607 4891 -11860 -20701 -8312
793h312P455j1422m498J4118Q095j2761j0578Q950J1342m984r743L100P619l187
$$ -8312 -857 -12279 -16777 -2659 5436 -7325 -17903 -8953 2389 -2595 -12338 -9238 -1619 -4806
807d806r090K132J2729N355p646o124K083J682o371k059J0723P481n886o086N979
$$ -4806 -13896 -11764 965 6320 -1326 -7450 -5367 -3685 -10056 -12115 -1392 6089 203 -5883 96
822I6K070r127q35J3592K842j6416n066J5535N601j3781o58K0343L308k4357j0181
$$ 96 2166 -6961 -7796 5796 8638 -7778 -12844 2691 8292 -5489 -6147 14196 17504 -6853 -17034
837a7034J8233R405j3624k818J9216L936k0613o575J6080N083j3076M43J4390
$$ -17034 1199 10604 -3020 -5838 13378 17314 -3299 -9874 6206 11289 -1787 -1344 13046
850A3046m170j7462L641J9330K24j4440K368J0902p597j6014N872J8797P92j2017
$$ 13046 8876 -8586 -4945 14385 14609 169 2537 13439 5842 -10172 -4300 14497 15289 3272
864C272J390P257p540j1336O602J4208j617r892L84M924k697m084M573N868k565
$$ 3272 4662 11919 4379 -6957 -355 13853 12236 2344 2728 7652 4955 871 5444 11312 8747
879H747o651k119J054P66K948O024K792n087p867k393K450K344rJ635L962J3n299
$$ 8747 2096 -23 1031 1797 4745 10769 13561 8474 607 -1786 664 3008 2999 4634 8596 8609 3310
896C310m956K687N919J10m910k092R01q45j222M456N455j128n348j680l52m329
$$ 3310 -1646 1041 6960 7070 2160 68 969 124 -1098 3358 8813 7685 2337 657 305 -4024
912d024j948P024P463k446o505n7L062k061l729K166L982k829m173J919M638j405
$$ -4024 -5972 1052 8515 6069 -436 -493 2569 508 -3221 -1055 2927 98 -4075 -2156 2482 1077
928A077j955L214K118o224o851K181O463Q33k216K233K846k536m725j124J322
$$ 1077 -878 2336 4454 -1770 -8621 -6440 23 856 -1360 873 3719 1183 -3542 -4666 -3344
943c344p20m64L073K419l267k235M167L570m389n103J741K808k238l239K865N218
$$ -3344 -4064 -4528 -1455 964 -2303 -4538 -371 3199 -1190 -6293 -4552 -1744 -3982 -7221 -4356 862
959H62O96j503m82j975l140r53K225J189p90J231L234Ml832j097K393L88k600
$$ 862 1558 55 -427 -2402 -5542 -6495 -4270 -3081 -3871 -2640 594 598 -3234 -4331 -1938 -1550 -4150
976d150j292J056J44j28L326K653j577j796m64j162k982J21L201K633K76o43l26
$$ -4150 -5442 -4386 -4242 -4370 -1044 1609 32 -1764 -2228 -3390 -6372 -6251 -3050 -417 -141 -784 -1110
993a110j642r97J122J894j555k596J183K672o22j468K736K486j744m298m60R79
$$ -1110 -2752 -3749 -2627 -733 -2288 -4884 -3701 -1029 -1651 -3119 -383 2103 359 -3939 -4399 -3420
1009c420J51J395L143k64k413l85J231j78j980O44K176L17k063l59J741J596q40
$$ -3420 -3269 -1874 1269 1005 -1408 -1793 -562 -740 -2720 -2076 100 417 -1646 -2005 -264 1332 492
1026D92l11m74j416o98J793J701l03J57J199n78j450r43R06Q32%k72K77j1L83
$$ 492 181 -293 -1709 -2407 -614 1087 784 941 2140 1562 112 -831 75 907 907 635 912 901 1284
1045A284J429pj477p46N08R6m79M69J894R43m41q75o97k80p26O07Q99m92l49J759
$$ 1284 2713 2706 1229 483 991 1087 608 1077 2971 3914 3473 2598 1901 1621 895 1502 2401 1909 1560 3319
1065C319J719j283r66N41k99j481q66J030J718M97M30j41p4j448k78J65j77o45
$$ 3319 5038 3755 2789 3330 3031 1550 684 1714 3432 3929 4359 4218 4144 2696 2418 2583 2406 1761
1083A761rJ711L51l26N66Q06r77j583n10l57m79O76J671J161j324pj1m13r69n74
$$ 1761 1752 3463 3814 3488 4054 4860 3883 2300 1790 1433 954 1630 3301 4462 3138 3131 3120 2707 1738 1164
1103A164o07J73Q27O16L79l13M26N63j466k334j507J236K106J20M7R0J71k57p63
$$ 1164 557 730 1557 2173 2552 2239 2665 3228 1762 -572 -2079 -843 1263 1383 1430 1520 1691 1434 671
1122F71j345j493O90P36L00j376L34K248R66j427k201k88j02o74l76O73J074O80
$$ 671 -674 -2167 -1477 -741 -441 -1817 -1483 765 1731 304 -1897 -2185 -2287 -2961 -3337 -2664 -1590 -910
1140i10K72j91j059r97n82J72o04q5O25J214k3L96P45n34k612j289J303J105j341
$$ -910 -638 -829 -1888 -2885 -3467 -3295 -3899 -3984 -3359 -2145 -2168 -1772 -1027 -1561 -4173 -5462 -4159 -3054 -4395
1159d395m24J686K150l61k141j025O11J109p22j599j93J752K526L36k081j409
$$ -4395 -4819 -3133 -983 -1344 -3485 -4510 -3899 -2790 -3512 -5111 -5304 -3552 -1026 -690 -2771 -4180
1175d180J175O23j866j698J194K516J375k91j394J35J014Lk027j287J606J226
$$ -4180 -3005 -2382 -4248 -5946 -4752 -2236 -861 -1152 -2546 -2411 -1397 -1394 -3421 -4708 -3102 -1876
1191a876m2m91J619J482n85k019n04R16n97j242R91L005J521j289j007k27L87
$$ -1876 -1918 -2409 -790 692 107 -1912 -2416 -1500 -2097 -3339 -2348 657 2178 889 -118 -345 42
1208D2k10l50j178J12K289K026q74k328J671L426j286m459j606L069K607j439
$$ 42 -168 -518 -1696 -1584 705 2731 1857 -471 1200 4626 3340 -1119 -2725 344 2951 1512
1224A512q48K463K442j471l306q13J660M43k02L36N87J13O61m2l00m54M49J06
$$ 1512 664 3127 5569 4098 792 -21 1639 2082 1880 2216 2803 2916 3577 3535 3235 2781 3230 3336
1242C336j695j459J465K542Q65j412j99J898p41m235j984L147M316j170k789K42
$$ 3336 1641 182 1647 4189 5054 3642 3443 5341 4600 365 -1619 1528 5844 4674 1885 2127
1258B127K720p4k935j302K328J255j856j326N7P28J231J778N2k881j826J015m0
$$ 2127 4847 4773 1838 536 2864 4119 2263 937 994 1722 2953 4731 4783 1902 76 1091 1051
1275A051j888O98N243R22m446l175K786J392k559k376M049L158l644m159J915
$$ 1051 -837 -139 5104 6026 1580 -1595 1191 2583 24 -2352 1697 4855 1211 -2948 -1033
1290a033M218j57k601l75K58j997r27J995Q28R4K176J436l908n150J99M898J063
$$ -1033 3185 3028 427 52 310 -1687 -2614 -619 209 303 2479 3915 7 -5143 -4944 -46 1017
1307A017k618J10K949k22l949j167L423J559j873j511j4p64p54J403L099J249
$$ 1017 -1601 -1491 1458 1236 -2713 -3880 -457 1102 -771 -2282 -2296 -3060 -3814 -2411 688 1937
1323A937j206j821k706j462M66K398J445P94R62o12k692k145P43J890J832j18
$$ 1937 731 -1090 -3796 -5258 -4792 -2394 -949 -155 807 195 -2497 -4642 -3899 -2009 -177 -295
1339b95j471k417m44L286J419j165j66K435j217o232l201O107N879j005k132J367
$$ -295 -1766 -4183 -4627 -1341 78 -1087 -1253 1182 -35 -6267 -9468 -3361 2518 1513 -619 748
1355G48r71o099j037N989K482k599J02L081l044o319K441Q983M65o857r36K889
$$ 748 -223 -6322 -7359 -1370 1112 -1487 -1385 1696 -1348 -7667 -5226 3757 4222 -2635 -3571 -682
1371f82l687m231O271R986k816p839J075K249o105m074R171Q799m936p855K046
$$ -682 -4369 -8600 -2329 7657 4841 -2998 -1923 326 -5779 -9853 -682 8117 3181 -4674 -2628
1386b628K956m111n26Q227K903q671m618M039K076l943L278R665n07j1171m922
$$ -2628 328 -3783 -4309 3918 6821 -1850 -6468 -2429 -353 -4296 -1018 8647 8140 -3031 -7953
1401g953N092K125j107L603N787l419q022n77L883J56M33M693J635o656n302K340
$$ -7953 -2861 -736 -1843 1760 7547 4128 -3894 -4471 -588 -432 1 4694 6329 -327 -5629 -3289
1417c289M190J814J414J347k449n117k451L015K219K888L313q15n493l609J293
$$ -3289 901 2715 4129 5476 3027 -2090 -4541 -1526 693 3581 6894 6079 586 -3023 -1730
1432a730J353J387M086K590m968n369J476L773j161Q6N501O62q355m647N060M581
$$ -1730 -377 1010 5096 7686 2718 -2651 -1175 2598 1437 1523 7024 7686 -669 -5316 -256 4325
1448D325j539Q03N201k576j0349j428Q847K053n057L339P135n471j1702K670J0472
$$ 4325 2786 3589 8790 6214 -4135 -5563 3284 5337 280 3619 10754 5283 -6419 -3749 6723
1463F723n66o409L277N565p755q371O733J0433l179p317M807L746r822o923R286
$$ 6723 6157 -252 3025 8590 835 -7536 -803 9630 6451 -866 3941 7687 -2135 -9058 228
1478B28J0178m235o991L994K530q246m369Q726P184n848n379L427K172n759j638
$$ 228 10406 6171 -820 3174 5704 -2542 -6911 1815 8999 3151 -2228 1199 3371 -2388 -4026
1493d026Q191M657o446o084J051K728k183l79N670L735m322o262m66K502J41l34
$$ -4026 4165 8822 2376 -3708 -2657 71 -2112 -2491 3179 6914 2592 -3670 -4136 -1634 -1493 -1827
1509a827L178L254l650o029NM724J880k783o08L302k503n973K2P656K554m440
$$ -1827 1351 4605 955 -5074 -5069 -345 1535 -1248 -1856 1446 -1057 -7030 -7008 648 3202 -1238
1525a238j194L320l169p369J422R865J410o889j343N370j389p177J328Q428J629
$$ -1238 -2432 888 -2281 -9650 -8228 1637 3047 -3842 -5185 185 -1204 -8381 -7053 1375 3004
1540C004p686k568M897J6m578J939P299l29q101j601L956O54l345K659O285j274
$$ 3004 -4682 -7250 -2353 -2337 -6915 -4976 2323 1994 -6107 -7708 -3752 -3098 -6443 -3784 2501 1227
1556A227o830j479L733J229l023J236N551j601o087j429N632K843l828j299L904
$$ 1227 -5603 -7082 -3349 -2120 -5143 -3907 1644 43 -6044 -7473 -1841 1002 -2826 -4125 -221
1571b21O06n600k229N720M531k630k485J639O72m498j975N872L936l856k491M116
$$ -221 385 -5215 -7444 -1724 2807 177 -2308 -669 3 -4495 -6470 -598 3338 -518 -3009 1107
1587A107J051n374k147P389L084o192l422M971K851n028j230P146L079p928l873
$$ 1107 2158 -3216 -5363 2026 5110 -1082 -4504 467 3318 -1710 -2940 4206 7285 -643 -4516
1602d516N423K557n030K81O806J657o656k532N085P62m688Q89N609j211n819J125
$$ -4516 907 3464 -1566 -1285 5521 7178 522 -2010 3075 3837 -851 38 5647 4436 -1383 -258
1618b58N884n18m403J533M184k451n782J238N680M19l032Q77K592j828l218N51
$$ -258 5626 5108 705 2238 6422 3971 -1811 -573 5107 5526 2494 3371 5963 4135 917 1468
1634A468K134m69q91J367J119j630p69J278J608j700j275J85j59k76L67R18O60
$$ 1468 3602 3133 2242 3609 4728 3098 2329 3607 5215 3515 2240 2425 2266 1990 2357 3275 3935
1651C935N77j105j196o37N91j48n89J210J394l67k532J43K401l52k795m22K771
$$ 3935 4512 3407 2211 1574 2165 2017 1428 2638 4032 3665 1133 1276 3677 3325 530 108 2879
1668B879o34k245M06K573l03j662L18R14j887k039J783K213j587k020K252J954
$$ 2879 2245 0 406 2979 2676 1014 1332 2246 359 -1680 103 2316 729 -1291 961 2915
1684B915k955k264K106J954j993j755J654J922j768j755J741J170k055j603J867
$$ 2915 -40 -2304 -198 1756 -237 -1992 -338 1584 -184 -1939 -198 972 -1083 -2686 -819
1699h19Q40j921l20K482j07j803o06J226K28k084L77J925j2j651m55J832j15j744
$$ -819 21 -1900 -2220 262 155 -1648 -2254 -1028 -800 -2884 -2507 -582 -594 -2245 -2700 -868 -983 -2727
1717b727l10J429Q9j464J62J148K91o64l82K45m12o57n5P70M03p4N1P18n34j130
$$ -2727 -3037 -1608 -1519 -2983 -2821 -1673 -1382 -2046 -2428 -2183 -2595 -3252 -3307 -2537 -2134 -2208 -2157 -1439 -1973 -3103
1737c103k47J197m2j238K03J078L43m19m10N62J62j104n52Q44L69m02M49J034
$$ -3103 -3350 -2153 -2195 -3433 -3230 -2152 -1809 -2228 -2638 -2076 -1914 -3018 -3570 -2726 -2357 -2759 -2310 -1276
1755a276l6j061j54N29q13m53R19M10kk91Q19O21q71m30J77J11r99p8J296J292
$$ -1276 -1312 -2373 -2527 -1998 -2811 -3264 -2345 -1935 -1937 -2228 -1409 -788 -1659 -2089 -1912 -1801 -2800 -2878 -1582 -290
1775b90m22l41O09m12r01j41N17N7m23N68J071k20o40P10O62q18j186O00N88k34
$$ -290 -712 -1053 -444 -856 -1757 -1898 -1381 -1324 -1747 -1179 -108 -328 -968 -258 404 -414 -1600 -1000 -412 -646
1795f46M47J328j76m82p5L31r32p58O40J256%n91O74Q81l18p96M39K10o85r64
$$ -646 -199 1129 953 471 396 727 -205 -963 -323 933 933 342 1016 1897 1579 783 1222 1432 747 -217
1815b17J445P32q64L56J508K9j863k78Q08N4m38K17J969m39j393O86R94r77j030
$$ -217 1228 1960 1096 1452 2960 2989 1126 848 1656 1710 1272 1489 3458 3019 1626 2312 3306 2329 1299
1834A299J183Q13r66j113J623J226n02r80R57j63j969m0J627N43j050O78R72j15
$$ 1299 2482 3295 2329 1216 2839 4065 3563 2583 3540 3377 1408 1368 2995 3538 2488 3166 4138 4023
1852D023j863k33J553r6q95j47N52k15j06Q35O94q08r68O3o3o49m58J301J294
$$ 4023 2160 1927 3480 3384 2489 2342 2894 2679 2573 3408 4102 3294 2326 2389 2326 1677 1219 2520 3814
1871C814n09r62l79j53L96j51j74n93N93M16m11o16R22lp43l79l02k33r20P60
$$ 3814 3305 2343 1964 1811 2207 2056 1882 1289 1882 2298 1887 1271 2193 2190 1447 1068 766 533 -387 373
1891C73J463J30j347p53J515p28k115N79J794l12k005N60J659j006k038J165K120
$$ 373 1836 1966 619 -134 1381 653 -1462 -883 911 599 -1406 -846 813 -193 -2231 -1066 1054
1908A054k153k298J111K493j058j977J530J440j757k061J367J201j481j197K091
$$ 1054 -1099 -3397 -2286 207 -851 -2828 -1298 142 -1615 -3676 -2309 -1108 -2589 -3786 -1695
1923a695R32j995r41J576J114k139j546J966J297j894j344J386J543j145q82N99
$$ -1695 -763 -2758 -3699 -2123 -1009 -3148 -4694 -2728 -1431 -3325 -4669 -3283 -1740 -2885 -3767 -3168
1939c168O33r23j416R23J150L91q88J93P57l85j586j97J450P18j520J30J399L42
$$ -3168 -2535 -3458 -4874 -3951 -2801 -2410 -3298 -3105 -2348 -2733 -4319 -4516 -3066 -2348 -3868 -3738 -2339 -1997
1957a997j463k19J943L13k479r34L055O13k593%L494J021m495j300L828O54l124
$$ -1997 -3460 -3679 -1736 -1423 -3902 -4836 -1781 -1168 -3761 -3761 -267 754 -3741 -5041 -1213 -559 -3683
1974c683j74M620M93m198q43M559K46m657J57M316J14m972J343N281j8m962P35
$$ -3683 -3857 763 1256 -2942 -3785 774 1020 -3637 -3480 836 950 -4022 -2679 2602 2584 -2378 -1643
1991a643M376j650n200J668N391l59m428J367M319j866m447J958L921j836l128
$$ -1643 2733 1083 -4117 -2449 2942 2583 -1845 -478 3841 1975 -2472 -514 3407 1571 -1557
2006a557J541L656j302l384K485L221j847l952J182L248j414k241K308L133j795
$$ -1557 -16 3640 2338 -1046 1439 4660 2813 -1139 43 3291 1877 -364 1944 5077 3282
2021C282k837P71K095j408j596J002K752p98k075K52K670kk440l95J596Ok091
$$ 3282 445 1216 3311 1903 307 1309 4061 3263 1188 1440 4110 4108 1668 1273 2869 2875 784
2038G84j44K701Q88j151r19J162K9k675m97K437J043k123j087L110J360l480j728
$$ 784 640 3341 4229 3078 2159 3321 3350 675 178 2615 3658 1535 448 3558 4918 1438 -290
2055b90L226J233l145k282L252K233k845j131L231J322m005k128L124J397l493
$$ -290 2936 4169 1024 -1258 1994 4227 1382 251 3482 4804 799 -1329 1795 3192 -301
2070c01p55M285K008m974j695L918J131m700j159M675R08m232n63M822M77n063
$$ -301 -1056 3229 5237 263 -1432 2486 3617 -1083 -2242 2433 3341 -891 -1454 3368 3845 -1218
2086a218n62M412L30n339o92M785J217l756j70L768l49m720o44L872j22l001J027
$$ -1218 -1780 2632 2962 -2377 -3069 1716 2933 -823 -993 2775 2426 -2294 -2938 934 812 -2189 -1162
2103a162M220j117m710L68M451l62m467L47L702k70l838o2M529L09l510o92K493
$$ -1162 3058 1941 -2769 -2401 2050 1688 -2779 -2432 1270 1000 -2838 -2900 1629 1938 -1572 -2264 229
2120B29p49l455Q43L768N37k789m32K408n58l397J09M138j9l578k47K728N62l101
$$ 229 -520 -3975 -3132 636 1173 -1616 -2048 360 -198 -3595 -3486 652 633 -2945 -3192 -464 98 -3003
2138c003N85L737n16m553q92L575J174l363O05M050k05m646j385L303J062k987
$$ -3003 -2418 1319 803 -3750 -4642 -1067 107 -3256 -2651 1399 1194 -3452 -4837 -1534 -472 -3459
2154c459N94L803n61m444j16L991O02l432L82L024j279m346J060M787N52l626
$$ -3459 -2865 938 377 -4067 -4183 -192 410 -3022 -2640 384 -895 -5241 -4181 606 1158 -2468
2170b468J13K419j528l939J288N184J70l606m52K887j317k788J038M482o66l440
$$ -2468 -2355 64 -1464 -5403 -4115 1069 1239 -2367 -2819 68 -1249 -4037 -2999 1483 817 -2623
2186b623l88K446l94k001K000K965q36m188n27K472Q60j740J017L311q90m187
$$ -2623 -3011 -565 -959 -2960 -960 2005 1169 -3019 -3546 -1074 -214 -1954 -937 2374 1484 -2703
2202b703q84L092J755k164j8K566j89l860o16L965K127k940j672K976L84m271
$$ -2703 -3587 -495 1260 -904 -922 1644 1455 -2405 -3021 944 3071 131 -1541 1435 1819 -2452
2218b452n87N242K633m002k390L162R90m426o04N776K022n362j964M411J225m773
$$ -2452 -3039 2203 4836 834 -1556 1606 2596 -1830 -2434 3342 5364 2 -1962 2449 3674 -1099
2234a099j02N540J047o006j901N290J448m726R2O015j11o859r37N710J146m943
$$ -1099 -1201 4339 5386 -620 -2521 2769 4217 -509 -417 5598 5487 -1372 -2309 3401 4547 -396
2250c96J89N825o71o025o59N940P30n051J38M447o80m674J84N237Jl586o91L816
$$ -396 -207 5618 4947 -1078 -1737 4203 4933 -118 20 4467 3787 -887 -703 4534 4535 949 258 4074
2268D074j020m248R06L909L81l562J34K215k41k601j69L170J00k448r21K014N19
$$ 4074 3054 -1194 -288 3621 4002 440 574 2789 2548 -53 -222 2948 3048 600 -321 1693 2212
2285B212j762p64K135J018j961j787J336J385j172j223R93K261j812k364J362
$$ 2212 450 -314 1821 2839 878 -909 427 1812 640 -583 410 2671 859 -1505 -143
2300a43J942j079k550J436K789j668l121J635K923j691k948J267L144k016l562
$$ -143 1799 720 -1830 -394 2395 727 -2394 -759 2164 473 -2475 -1208 1936 -80 -3642
2315c642J729L727j475l197J545K911k452k836J979L120j765l222K193K570k539
$$ -3642 -1913 1814 339 -2858 -1313 1598 -854 -3690 -1711 1409 -356 -3578 -1385 1185 -1354
$$ [...]
8191e2
##END NTUPLES=NMR FID
##END=
