##TITLE=1H_SR77_kr
 CDCl3,8 sc, 
 29.9.2021
##JCAMPDX= 6.0         $$ Bruker NMR JCAMP-DX V2.0
##DATA TYPE= NMR FID
##DATA CLASS= NTUPLES
##ORIGIN= UXNMR, Bruker Analytische Messtechnik GmbH
##OWNER= root
$$ XWIN-NMR		Version 3.5
$$ Wed Sep 29 12:29:10 2021 Russian Standard Time (UT+4h)  she@DPX200
##.OBSERVE FREQUENCY= 200.1314
##.OBSERVE NUCLEUS= ^1H
##.DELAY= (6, 6)
##.ACQUISITION MODE= SIMULTANEOUS
##.ACQUISITION SCHEME= undefined
##.AVERAGES= 8
##.DIGITISER RES= 18
##SPECTROMETER/DATA SYSTEM= spect
##.PULSE SEQUENCE= zg30
##.SOLVENT NAME= CDCl3
##.SHIFT REFERENCE= (INTERNAL, CDCl3, 0, 15.7039)
##AUDIT TRAIL= $$ (NUMBER, WHEN, WHO, WHERE, WHAT)
$$ ##TITLE= Audit trail, XWIN-NMR		Version 3.5
$$ ##JCAMPDX= 5.01
$$ ##ORIGIN= Bruker BioSpin GmbH
$$ ##OWNER= she
$$ F:/spectra/data/she/nmr/H-F/1/audita.txt
$$ ##AUDIT TRAIL=  $$ (NUMBER, WHEN, WHO, WHERE, WHAT)
(   1,<2021-09-29 12:28:00.43 +0400>,<she>,<DPX200>,
      <created by zg, POWCHK disabled, PULCHK disabled
       configuration hash MD5:
       00 E9 B6 7A A2 85 ED C7 34 08 36 98 17 FE 4E 26
       data hash MD5: 16K
       E2 93 1C 8B 94 75 45 90 1E 95 AF 9A B2 BD 96 49>)
$$ ##END=
$$ 
$$ hash MD5
$$ 5E 4B 76 C7 F1 5D 2B 10 7A 9D 24 BE 03 6E 94 86
##$RELAX= 
##$RELAX= 
##$RELAX= 
##$RELAX= 
##$RELAX= 
##$RELAX= 
$$ Bruker specific parameters
$$ --------------------------
##$DU= <F:/spectra>
##$EXPNO= 1
##$NAME= <H-F>
##$PROCNO= 1
##$TYPE= <nmr>
##$USER= <she>
##$AMP= (0..31)
100 100 100 100 100 100 100 100 100 100 100 100 100 100 100 100 100 100 
100 100 100 100 100 100 100 100 100 100 100 100 100 100 
##$AQSEQ= 0
##$AQ_mod= 1
##$AUNM= <au_zg>
##$AUTOPOS= <>
##$BF1= 200.13
##$BF2= 200.13
##$BF3= 200.13
##$BF4= 200.13
##$BF5= 200.13
##$BF6= 200.13
##$BF7= 200.13
##$BF8= 200.13
##$BYTORDA= 1
##$CFDGTYP= 0
##$CFRGTYP= 5
##$CHEMSTR= <none>
##$CNST= (0..31)
1 1 145 1 1 1 1 1 1 1 1 1 1 1 1 1 1 1 1 1 1 1 1 1 1 1 1 1 1 1 1 1 
##$CPDPRG= <>
##$CPDPRG1= <>
##$CPDPRG2= <>
##$CPDPRG3= <>
##$CPDPRG4= <mlev>
##$CPDPRG5= <mlev>
##$CPDPRG6= <mlev>
##$CPDPRG7= <mlev>
##$CPDPRG8= <mlev>
##$CPDPRGB= <>
##$CPDPRGT= <>
##$D= (0..31)
0 1.2 0 0 0 0 0 0 0 0.06 0 0.03 0 0 0 0 0.0002 0 0 0 0 0 0 0 0 0 0 0 0 
0 0 0 
##$DATE= 1632904079
##$DBL= (0..7)
120 120 120 120 120 120 120 120 
##$DBP= (0..7)
150 150 150 150 150 150 150 150 
##$DBP07= 0
##$DBPNAM0= <>
##$DBPNAM1= <>
##$DBPNAM2= <>
##$DBPNAM3= <>
##$DBPNAM4= <>
##$DBPNAM5= <>
##$DBPNAM6= <>
##$DBPNAM7= <>
##$DBPOAL= (0..7)
0.5 0.5 0.5 0.5 0.5 0.5 0.5 0.5 
##$DBPOFFS= (0..7)
0 0 0 0 0 0 0 0 
##$DE= 6
##$DECBNUC= <off>
##$DECIM= 32
##$DECNUC= <off>
##$DECSTAT= 4
##$DIGMOD= 1
##$DIGTYP= 9
##$DL= (0..7)
0 120 120 120 120 120 120 120 
##$DP= (0..7)
150 150 150 150 150 150 150 150 
##$DP07= 0
##$DPNAME0= <>
##$DPNAME1= <>
##$DPNAME2= <>
##$DPNAME3= <>
##$DPNAME4= <>
##$DPNAME5= <>
##$DPNAME6= <>
##$DPNAME7= <>
##$DPOAL= (0..7)
0.5 0.5 0.5 0.5 0.5 0.5 0.5 0.5 
##$DPOFFS= (0..7)
0 0 0 0 0 0 0 0 
##$DQDMODE= 0
##$DR= 18
##$DS= 0
##$DSLIST= <SSSSSSSSSSSSSSS>
$$ [...]
##$SUBNAM2= <"">
##$SUBNAM3= <"">
##$SUBNAM4= <"">
##$SUBNAM5= <"">
##$SUBNAM6= <"">
##$SUBNAM7= <"">
##$SUBNAM8= <"">
##$SUBNAM9= <"">
##$SW= 16.9725446903124
##$SWIBOX= (0..15)
0 0 2 0 0 0 0 0 0 0 0 0 0 0 0 0 
##$SW_h= 3396.73913043478
##$TD= 16384
##$TD0= 1
##$TE= 0
##$TE2= 300
##$TE3= 300
##$TEG= 300
##$TL= (0..7)
0 120 120 120 120 120 120 120 
##$TP= (0..7)
150 150 150 150 150 150 150 150 
##$TP07= 0
##$TPNAME0= <>
##$TPNAME1= <>
##$TPNAME2= <>
##$TPNAME3= <>
##$TPNAME4= <>
##$TPNAME5= <>
##$TPNAME6= <>
##$TPNAME7= <>
##$TPOAL= (0..7)
0.5 0.5 0.5 0.5 0.5 0.5 0.5 0.5 
##$TPOFFS= (0..7)
0 0 0 0 0 0 0 0 
##$TUNHIN= 0
##$TUNHOUT= 0
##$TUNXOUT= 0
##$USERA1= <user>
##$USERA2= <user>
##$USERA3= <user>
##$USERA4= <user>
##$USERA5= <user>
##$V9= 5
##$VALIST= <valist>
##$VCLIST= <CCCCCCCCCCCCCCC>
##$VD= 0
##$VDLIST= <DDDDDDDDDDDDDDD>
##$VPLIST= <PPPPPPPPPPPPPPP>
##$VTLIST= <TTTTTTTTTTTTTTT>
##$WBST= 1024
##$WBSW= 4
##$XGAIN= (0..3)
0 0 0 0 
##$XL= 0
##$YL= 0
##$YMAX_a= 64261
##$YMIN_a= -44202
##$ZGOPTNS= <>
##$ZL1= 120
##$ZL2= 120
##$ZL3= 120
##$ZL4= 120
##$ABSF1= 10
##$ABSF2= 0
##$ABSG= 5
##$ABSL= 3
##$ALPHA= 0
##$AQORDER= 0
##$ASSFAC= 0
##$ASSFACI= 0
##$ASSFACX= 0
##$ASSWID= 0
##$AUNMP= <proc_1d>
##$AZFE= 0.1
##$AZFW= 0.1
##$BCFW= 1
##$BC_mod= 2
##$BYTORDP= 1
##$COROFFS= 0
##$CY= 11.3945322036743
##$DATMOD= 1
##$DC= 2
##$DFILT= <>
##$DTYPP= 0
##$F1P= 2.36226072786647
##$F2P= -0.459571619588291
##$FCOR= 0.5
##$FTSIZE= 0
##$FT_mod= 4
##$GAMMA= 1
##$GB= 0.15
##$INTBC= 1
##$INTSCL= 1
##$ISEN= 128
##$LB= 0.24
##$LEV0= 0
##$LPBIN= 0
##$MAXI= 10000
##$MC2= 0
##$MEAN= 0
##$ME_mod= 0
##$MI= 1.114404
##$NCOEF= 0
##$NC_proc= 0
##$NLEV= 6
##$NOISF1= 3.799351
##$NOISF2= 2.8
##$NSP= 1
##$NTH_PI= 0
##$NZP= 0
##$OFFSET= 15.70392
##$PC= 1
##$PHC0= -14081.5
##$PHC1= 18.40088
##$PH_mod= 1
##$PKNL= yes
##$PPARMOD= 0
##$PSCAL= 0
##$PSIGN= 0
##$REVERSE= no
##$SF= 200.130013532006
##$SI= 16384
##$SIGF1= 3
##$SIGF2= 2
##$SINO= 400
##$SIOLD= 16384
##$SREGLST= <1H.CDCl3>
##$SSB= 0
##$STSI= 0
##$STSR= 0
##$SW_p= 3612.71676300578
##$SYMM= 0
##$S_DEV= 0
##$TDeff= 0
##$TDoff= 0
##$TI= <>
##$TILT= no
##$TM1= 0
##$TM2= 0
##$TOPLEV= 0
##$USERP1= <user>
##$USERP2= <user>
##$USERP3= <user>
##$USERP4= <user>
##$USERP5= <user>
##$WDW= 1
##$XDIM= 8192
##$YMAX_p= 0
##$YMIN_p= 0
$$ End of Bruker specific parameters
$$ ---------------------------------
##NTUPLES= NMR FID
##VAR_NAME=  TIME,          FID/REAL,        FID/IMAG
##SYMBOL=    X,             R,               I
##VAR_TYPE=  INDEPENDENT,   DEPENDENT,       DEPENDENT
##VAR_FORM=  AFFN,          ASDF,            ASDF
##VAR_DIM=   8192,          8192,            8192
##UNITS=     SECONDS,       ARBITRARY UNITS, ARBITRARY UNITS
##FACTOR=    0.0002944,     1,               1
##FIRST=     0,             0,               0
##LAST=      2.4114304,     0,               0
##MIN=       0,             -44202,          0
##MAX=       2.4114304,     64261,           0
$$ Real data points
##PAGE= N=1
##DATA TABLE= (X++(R..R)), XYDATA
$$ [...]
$$ plain form
1715 -106 -165 120 -105 -157 150 -163 -252 -77 -20 -80 -83 -56 67 21 -115 32 9 40 50 -35 36 -46 76 24 128
1740 128 -38 -29 215 -283 -31 22 -83 119 -128 -233 -102 10 28 108 -43 70 -296 -317 -256 108 -20 91
1762 91 158 -89 -118 130 -94 -114 26 68 -45 -84 -66 39 -156 95 -31 78 93 -172 68 -7 263 92 259
1785 259 -253 49 123 -140 -131 1 23 25 123 20 -205 6 -126 -147 59 89 -70 93 174 -167 112 -42 -58 56
1809 56 104 -20 -157 -71 -345 -229 11 -44 160 -199 -249 166 -46 4 84 5 -65 63 -155 -203 -127 97 -50 83
1833 83 185 86 73 150 -97 -8 20 28 18 220 152 -65 78 119 38 -106 -88 82 149 356 -2 -191 138 136 -16
1858 -16 -26 61 -237 -16 -333 -17 44 -80 40 -127 -162 105 -74 -8 -111 -62 0 -115 2 -71 -174 56 -248
1881 -248 -6 190 -49 -159 -4 -159 -116 -51 13 -62 -27 -55 -70 -60 -131 193 62 216 82 -27 148 76 39 -22
$$ packed form
1715a06n9K85k25n2L07l13q9J75N7o0lK7J23m6j36J47k3L1J0q5P1q2J22n2J04
1740A28j66RK44m98K52N3j05K02k47j05J31J12J8Q0j51J13l66k1O1L64j28J11
1762I1O7k47k9K48k24k0J40M2j13l9J8J05j95K51j26J09J5k65K40p5K70j71J67
1785B59n12L02P4k63RJ32K2KR8j03k25K11j32k1K06L0j59J63Q1l41K79j54j6J14
1809E6M8j24j37Q6k74J16K40n5K04l59n0M15k12N0Q0p9p0J28k18m8P6K24j47J33
1833H3J02r9j3P7k47Q9K8Qj0K02o8k17J43M1q1j44J8J70O7K07l58j89L29kj52
1858a6j0Q7k98K21l17L16O1j24J20j67l5K67j79O6j03M9O2j15J17p3j03K30l04
1881b48K42J96k39j10J55j55M3O5O4p5L5k8j5J0p1L24j31J54j34j09J75p2l7o1
$$ plain form
1905 -22 -35 -157 50 -222 -82 -12 141 7 -10 192 -48 48 -67 80 33 59 -183 -189 197 37 126 143 -65 -72
1929 -72 -208 213 -239 -151 -69 86 -131 201 178 64 -151 188 51 -64 -101 -80 -362 137 83 -20 347 -21
1951 -21 84 -74 159 50 207 183 -21 -60 58 64 -27 -271 -25 -108 79 -33 -351 -53 54 10 -23 -236 -135
1974 -135 -8 -243 -161 -78 190 -41 -106 114 100 -48 -60 5 79 -106 -44 -186 -33 -21 -22 -196 -37 -126 135 33
1998 33 -16 180 -161 -8 194 -10 -31 41 -88 120 -86 14 -79 -246 130 52 36 -99 -87 17 -132 145 -45
2021 -45 -349 -117 -19 -125 -219 47 37 -141 74 68 131 -40 -116 -207 -8 -114 -51 4 24 -205 -159 -172 103 -247 10
2046 10 -33 176 25 198 -139 -76 192 184 -107 113 22 106 1 79 -123 45 92 -237 -35 -46 86 220 -128
2069 -128 -54 -62 -32 79 -12 101 -51 42 15 -37 -35 2 51 90 -53 251 6 -7 -165 117 -18 -132 -117 -90 -7 187
$$ packed form
1905b2j3j22K07k72J40P0J53j34j7K02k40R6j15J47m7K6k42oL86j60Q9J7k08p
1929g2j36M21m52Q8Q2J55k17L32k3j14k15L39j37j15l7K1k82M99n4j03L67l68
1951b1J05j58K33j09J57k4k04l9J18Or1k44K46q3J87j12l18K98J07m4l3k13J01
1974a35J27k35Q2Q3K68k31o5K20j4j48j2O5P4j85O2j42J53J2jj74J59q9K61j02
1998C3m9J96l41J53K02k04k1P2j29K08k06J00r3j67L76p8j6j35J2J04j49K77j90
2021d5l04K32R8j06r4K66j0j78K15oO3j71p6r1J99j06O3N5K0k29M6j3K75l50K57
2046A0m3K09j51J73l37O3K68qk91K20r1Q4j05P8k02J68M7l29K02j1J32J34l48
2069a28P4qL0J11r1J13j52R3k7n2KL7M9L9j43L04k45j3j58K82j35j14J5K7Q3J94
$$ plain form
2095 187 101 129 -72 -37 -23 -160 144 -66 -23 68 13 -115 -68 39 -13 162 130 -87 -52 63 -139 29 145 113
2119 113 117 -38 -131 -217 40 -32 -93 -16 101 -352 235 46 58 213 3 -191 109 204 41 -79 -171 -97 47 71
2143 71 -6 14 13 -48 -129 -300 237 70 -64 25 -121 66 26 -20 -118 47 145 -137 156 -277 66 103 -55 -164
2167 -164 -241 -101 33 148 88 -158 49 -36 24 32 159 77 159 323 -323 -182 -156 54 154 185 39 -30 -36 122
2191 122 -216 -58 -305 34 -189 126 -257 167 71 -114 -163 -138 65 14 -16 265 12 -199 33 -14 -86 -67 161
2214 161 -219 -38 -52 -8 135 150 -208 47 -109 -7 57 65 50 -228 169 -190 121 20 130 52 -48 -310 72
2237 72 183 53 235 -16 -63 -24 -63 -25 -99 74 87 75 -164 -6 -33 -83 31 -24 130 22 -63 -247 -61 97
2261 97 -124 -72 19 39 -79 -58 -21 -110 -33 -36 223 -130 -108 -172 130 -27 -126 181 173 -79 -243 -140 125 52 322
$$ packed form
2095A87q6K8k01L5J4j37L04k10M3R1n5j28M7J07n2J75l2k17L5J15k02J68J16l2
2119A13Mj55r3q6K57p2o1P7J17m53N87j89J2J55k10j94L00R5j63j20r2P4J44K4
2143G1p7K0jo1q1j71N37j67j34Q9j46J87m0m6r8J65R8k82K93m33L43L7j58j09
2167a64p7J40J34J15o0k46K07q5O0QJ27q2Q2J64o46J41K6K10J00L1j46o9oJ58
2191A22l38J58k47L39k23L15l83M24r6j85m9K5K03n1l0K81k53k11K32m7p2J9K28
2214A61l80J81j4M4J43J5l58K55j56J02O4Qj5k78L97l59L11j01J10p8j00k62L82
2237G2J11j30J82k51m7L9l9L8p4J73J3j2k39J58k7n0J14n5J54j08q5j84J86J58
2261I7k21N2R1K0j18K1L7q9P7lK59l53K2o4L02j57r9L07qk52j64J03K65p3K70
$$ plain form
2286 322 -6 -5 61 151 142 -23 162 -176 4 37 13 -39 64 -75 -145 11 82 271 43 35 -133 16 -9 -12 39 36
2312 36 11 -184 -112 -32 141 -150 54 118 301 175 -117 76 15 -84 -11 108 -92 -115 -21 70 287 -59 116 -164
2336 -164 93 84 -133 134 184 -218 -46 -18 56 33 -40 100 -365 58 140 90 -262 -137 -197 135 298 165 -109
2359 -109 86 59 -35 97 -121 -18 -169 51 -25 139 -163 84 219 -185 -102 341 16 7 -154 55 18 -59 -121
2382 -121 113 115 159 -226 126 108 25 126 101 184 -169 20 -46 -150 96 78 36 -107 133 -202 -40 -24 109 -212
2406 -212 -337 -31 156 266 -348 -132 4 274 197 110 -219 71 191 30 -68 167 72 130 74 -43 -45 -256 99
2429 99 41 152 148 -137 -12 -60 -99 16 -11 87 -76 -270 52 44 238 -51 -137 79 36 -184 33 -66 -157 149 18
2454 18 -201 95 -145 -6 0 126 -281 238 247 -21 -33 2 70 -7 79 25 113 -113 -8 -211 -80 251 73 -52
$$ packed form
2286C22l28JO6R0rj65J85l38J80L3k4n2J03j39p0J56P1J89k28qj68J49k5lN1l
2312C6k5j95P2Q0J73k91K04O4J83j26k92J93o1r9P3J19k00k3R4R1K17l46J75k80
2336a64K57rk17K67N0m02J72K8P4k3p3J40m65M23Q2n0l52J25o0L32J63j33k74
2359a09J95k7r4J32k18J03j51K20p6J64l02K47J35m04Q3M43l25rj61K09l7p7o2
2382a21K34KM4l85L52j8q3J01k5Q3l53J89o6j04K46j8m2j43K40l35J62J6J33l21
2406b12j25L06J87J10o14K16J36K70p7q7l29K90J20j61r8K35r5N8n6j17kk11L55
2429I9n8J11mk85J25m8l9J15k7R8j63j94L22qJ94k89q6K16m3k20K17r9r1L06j31
2454A8k19K96k40J39OJ26m07N19Rk68j2L5O8p7Q6n4Q8k26J05k03J31L31j78j25
$$ plain form
2478 -52 83 -278 96 -339 7 -93 -104 209 3 44 -69 22 120 -20 46 -148 -41 40 -104 -94 136 -70 3
2501 3 -164 -112 -16 96 1 -57 17 -10 127 -55 41 88 219 -146 -3 97 53 -77 -34 -116 -67 -254 2 106 -30
2526 -30 -124 68 249 38 116 -118 -244 30 84 -16 55 -8 -75 -353 -56 131 92 148 22 53 -157 -123 100 -57
2550 -57 -111 138 3 -9 119 219 -135 55 22 -48 167 218 -182 -187 -94 44 -139 -214 22 22 185 27 -13 -2 86
2575 86 -26 136 166 68 145 176 372 -216 33 -183 -35 -316 -30 -45 -143 95 -144 71 -48 256 -48 7 -62
2598 -62 90 15 -69 26 78 -36 118 73 -33 -11 138 -19 144 16 -196 -196 33 -59 197 31 16 206 -154 -8
2622 -8 -98 71 -10 -175 -70 30 -8 38 73 -199 58 114 -44 11 0 -142 -195 -67 -108 1 -28 -2 -66 167 -132
2647 -132 -75 176 46 239 40 -232 80 29 -79 -77 40 -192 -101 140 -18 115 -54 61 -151 100 -19 -199
$$ packed form
2478e2J35l61L74m35L46j00j1L13k06M1j13R1R8j40O6j94J07Q1j44J0K30k06P3
2501Cj67N2R6J12r5n8P4k7J37j82R6M7J31l65J43J00m4j30M3q2M9j87K56J04j36
2526c0r4J92J81k11P8k34j26K74N4j00P1o3o7k78K97J87l9N6j26L1k10L4K23j57
2550e7n4K49j35j2J28J00l54J90l3p0K15N1m00nR3J38j83p5K36%J63j58m0J1Q8
2575H6j12J62L0r8P7L1J96n88K49k16J48k81K86j5r8K38k39K15j19L04l04N5o9
2598f2J52p5q4R5N2j14J54m5j06K2J49j57J63j28k12%K29r2K56j66j5J90l60J46
2622hr0J69q1j65J05J00l8M6L5k72K57N6j58N5j1j42n3J28m1J09k9K6o4K33k99
2647a32N7K51j30J93j99k72L12n1j08KJ17k32R1K41j58J33j69J15k12K51j19j80
$$ plain form
2669 -199 138 25 48 -131 99 56 -31 -105 -6 -42 255 -241 55 -236 -12 -73 413 183 200 -68 142 -1 -235
2692 -235 30 34 122 160 244 -50 -39 68 -108 152 -113 -130 144 -184 94 -38 -4 -94 119 -129 103 160 -147
2715 -147 -4 -50 -53 -55 -47 104 8 -19 55 82 94 96 27 -47 269 159 -82 -46 13 23 -31 232 49 133 34 124 101 138
2743 138 36 -241 -70 -161 139 244 35 80 43 -33 -193 175 83 17 -45 -334 38 43 -42 -167 -226 -94 16 38
2767 38 42 -116 65 9 -138 -168 115 49 -158 69 -34 -40 -33 -65 -90 -1 -5 -10 240 145 31 -152 -29 75 186 64
2793 64 -44 107 92 149 254 143 -72 286 7 -264 117 178 126 -126 38 -214 100 42 150 -332 279 132
2815 132 -28 -141 -147 251 -8 48 3 -7 -118 -57 -82 43 163 100 156 -170 41 338 62 19 30 248 93 122
2839 122 -97 -84 -122 56 47 102 9 -89 -49 -217 45 -31 -147 -232 -171 8 165 -59 -46 275 24 154 -154 240
$$ packed form
2669a99L37j13K3j79K30m3q7p4R9l6K97m96K96k91K24o1M86k30J7k68K10j43k34
2692b35K65MQ8L8Q4k94J1J07j76K60k65j7K74l28K78j32L4r0K13k48K32N7l07
2715a47J43m6lkQJ51r6k7P4K7J2Ko9p4L16j10k41L6N9J0n4K63j83Q4r9R0k3L7
2743A38j02k77J71r1L00J05k09M5l7p6j60L68r2o6o2k89L72Nq5j25n9J32J10K2
2767C8Mj58J81n6j47l0K83o6k07K27j03oPl2k5Q9mnK50r5j14j83J23J04J11j22
2793F4j08J51j5N7J05j11k15L58k79k71L81O1n2k52J64k52L14n8J08m82O11j47
2815A32j60j13oL98k59N6m5j0j11O1k5J25J20o3N6l26K11K97k76m3J1K18j55K9
2839A22k19J3l8J78rN5r3r8M0j68K62p6j16q5O1J79J57k24J3L21k51J30l08L94
$$ plain form
2863 240 141 83 -125 80 -173 194 -95 -9 -21 -29 -39 -33 7 -76 -90 -28 -6 -33 -51 264 75 -19 -146 6 5 -11 -121
2890 -121 -25 -14 37 -34 74 194 -246 -15 -92 -112 27 -89 -69 37 203 97 -46 31 -222 229 11 -126 -55
2913 -55 142 83 -99 -25 -265 -190 -189 88 58 32 132 114 -74 25 -162 -63 -56 282 68 -292 -109 -209 -22 100
2937 100 -146 -216 -16 -7 1 6 30 67 189 63 -110 148 65 -3 20 43 -89 117 -149 -166 -93 15 -124 71 12
2962 12 -144 58 -161 -141 166 -192 40 90 -10 -171 -84 94 -40 -120 -312 85 -16 153 -151 155 -26 -48
2984 -48 -53 68 39 -11 120 278 82 53 92 32 47 -55 113 133 -16 -8 -97 -112 -118 -38 -307 -184 81 297 -37 97
3010 97 -53 -121 -43 -5 -32 -36 63 -28 63 -149 202 45 117 133 -365 117 9 11 -41 33 -172 -73 28 -18 61 82 137
3037 137 39 19 80 -3 -76 37 226 371 57 233 15 78 82 -11 -257 7 -127 123 -52 94 -8 -10 -152 46
$$ packed form
2863B40r9n8k08K05k53L67k89Q6j2qj0OM0q3j4O2K2k7j8L15j89r4j27J52jj6j10
2890a21R6J1N1p1J08J20m40K31p7k0J39j16K0J06J66j06j43P7k53M51k18j37P1
2913e5J97n9j82P4k40P5JK77l0k6J00j8j88R9j87R9PL38k14l60J83j00J87J22
2937A00k46p0K00RQNK4L7J22j26j73K58q3o8K3K3j32K06k66j7P3J08j39J95n9
2962A2j56K02k19K0L07l58K32N0j00j61Q7J78j34q0j92L97j01J69l04L06j81k2
2984d8nJ21k9n0J31J58j96k9L9o0J5j02J68K0j49Qq9j5oQ0k69J23K65K16l34J34
3010I7j50o8P8L8k7mR9r1R1k12L51j57P2J6m98M82j08Kn2P4k05R9J01m6P9K1N5
3037A37r8k0O1q3p3J13J89J45l14J76k18O3Mr3k46K64j34K50j75J46j02kj42J98
$$ plain form
3061 46 301 80 24 63 218 -128 -189 15 32 28 128 -35 -166 104 60 62 183 27 -143 -53 -252 143 -49 -106
3085 -106 133 35 -111 65 -72 -13 149 114 -37 20 -70 75 -65 62 -107 65 14 -80 23 -247 80 1 -130
3108 -130 -155 42 148 -124 -99 98 -63 -270 -53 190 -72 -17 73 7 -306 -246 41 273 -23 -122 -91 -236 166
3131 166 -132 82 -95 -44 -161 -179 347 88 200 -19 115 46 79 11 -285 -41 146 -25 -126 294 -172 -158
3153 -158 107 183 145 -21 -143 -130 62 0 -35 183 170 -187 133 -15 -201 -125 20 69 -61 77 -305 111 29
3176 29 48 -96 -85 -34 330 -204 123 56 54 53 -52 138 -94 -70 84 121 47 -162 38 25 54 86 -11 -38 -368 -16
3202 -16 -89 3 -14 68 33 147 63 -54 -27 -2 -68 -56 118 127 -119 -104 -62 91 -61 -141 -25 198 -183 79 51 -126
3228 -126 244 -25 -89 -24 38 67 47 -191 -59 178 -124 -41 -221 74 5 72 -145 39 43 -72 13 114 67 -88
$$ packed form
3061D6K55k21n6L9J55l46o1K04J7mJ00j63j31K70m4KJ21j56j70R0j99L95j92n7
3085a06K39r8j46J76j37N9J62l5j51N7r0J45j40J27j69J72n1r4J03k70L27p9j31
3108a30k5J97J06k72K5J97j61k07K17K43k62N5R0o6l13O0K87K32k96r9L1j45M02
3131A66k98K14j77N1j17j8N26k59J12k19J34o9L3o8k96K44J87j71j01M20m66J4
3153a58K65P6l8j66j22J3J92o2l5K18j3l57L20j48j86P6J45M9j30J38l82M16q2
3176B9J9j44J1N1L64n34L27o7kjj05J90k32K4J54L7p4k09K00j3K9L2r7k7l30L52
3202a6p3R2j7Q2l5J14q4j17K7K5o6J2J74Rk46J5M2J53j52q0J16K23l81K62k8j77
3228a26L70k69o4O5O2K9k0k38J32K37l02Q3j80K95o9O7k17J84Mj15Q5J01m7j55
$$ plain form
3252 -88 -9 186 -13 -48 -50 -63 84 -39 48 13 -110 69 10 63 -159 -4 258 134 -24 14 -24 276 -84 0
3276 0 327 -23 4 128 39 195 -33 -77 8 -68 11 -169 -64 45 168 -102 -237 283 22 92 -207 142 -235
3299 -235 99 182 -45 -201 191 186 -12 168 -126 96 13 -119 35 5 32 66 -23 -154 -166 -179 127 6 210
3322 210 -81 -128 20 -17 191 134 125 -45 153 -31 57 -27 -132 175 -45 -65 129 95 36 -190 -54 -8 186 76
3346 76 61 285 146 -74 -110 69 28 21 111 -254 -165 -325 -10 -71 13 -45 -50 -176 -100 281 -95 -135 1 -158 22
3371 22 42 155 -248 147 -188 -99 1 -107 64 -97 -42 84 -89 207 -2 -23 159 -90 49 -91 -38 -61
3393 -61 179 -32 -77 -161 65 -182 96 227 112 -284 52 95 19 207 125 -68 -44 -175 -6 24 -163 -54 -140
3416 -140 -34 -249 36 10 81 30 39 333 -73 110 -98 -5 160 211 71 -114 -88 151 83 106 54 -75 105 -56
$$ packed form
3252h8P9J95j99l5kj3J47j23Q7l5j23J79n9N3k22J55K62j24j58L8l8L00l60Q4
3276@L27l50K7J24q9J56k28m4Q5p6P9j80J05J09J23k70j35N20k61P0k99L49l77
3299b35L34Q3k27j56L92nj98J80k94K22q3j32J54l0K7L4q9j31j2j3L06j21K04
3322B10k91m7J48l7K08n7rj70J98j84Q8q4j05L07k20k0J94l4n9k26J36M6J94j10
3346G6j5K24j39k20l6J79m1pR0l65Q9j60L15o1Q4n8nj26P6L81l76m0J36j59J80
3371B2K0J13m03L95l35Q9J00j08J71j61N5J26j73K96k09k1J82k49J39j40N3k3
3393f1K40k11m5q4K26k47K78J31j15l96L36M3p6J88q2j93K4j31J69L0j87J09q6
3416a40J06k15K85k6P1n1RK94m06J83k08R3J65N1j40j85K6K39o8K3n2j29J80j61
$$ plain form
3440 -56 32 93 -158 -36 -46 -100 -26 64 -51 173 46 49 -21 -184 7 29 208 -24 28 2 113 80 63 23 174
3465 174 62 -186 -204 353 -140 -142 47 -196 150 5 89 -11 -172 10 -14 -111 271 -233 -7 8 -54 -6 -149
3488 -149 -30 -22 -235 -89 3 -109 5 166 -9 -158 -287 36 -36 52 -229 5 -161 -295 67 121 179 72
3510 72 -269 213 203 40 22 29 130 -147 372 82 67 -81 50 -60 69 195 53 -22 -141 -280 16 -121
3532 -121 234 255 88 -80 -17 44 -221 59 -227 46 -83 52 57 183 -42 49 150 -172 -217 334 -37 204
3554 204 -83 29 45 171 40 -160 -191 54 5 -41 117 -21 -81 114 -73 -57 0 -3 99 102 54 386 97 125
3578 125 75 -184 -62 -223 6 91 -206 6 -119 75 73 -145 -99 33 145 20 83 137 -92 196 181 -52 -36
3601 -36 -140 106 99 -137 -178 109 174 -31 193 -34 -75 181 22 -69 -120 121 247 99 -71 116 -166 142 -217
$$ packed form
3440e6Q8O1k51J22j0n4P4R0j15K24j27Lp0j63J91K2J79k32N2k6J11l3j7m0J51
3465A74j12k48j8N57m93kJ89k43L46j45Q4j00j61J82k4r7L82n04K26J5o2M8j43
3488a49J19Qk13J46R2j12J14J61j75j49j29L23p2Q8k81K34j66j34L62N4N8j07
3510G2l41M82j0j63j8PJ01k77N19k90j5j48J31j10J29J26j42p5j19j39K96j37
3532a21L55K1j67j68O3O1k65K80k86K73j29J35NJ26k25R1J01l22m5N51l71K41
3554B04k87J12J6J26j31k00l1K45m9m6J58j38o0J95j87J6N7lJ02Lm8L32k89K8
3578A25n0k59J22j61K29Q5k97K12j25J94kk18M6J32J12j25O3N4k29K88j5k33J6
3601c6j04K46pk36m1K87O5k05K24k27m1K56j59r1n1K41J26j48j70J87k82L08l59
$$ plain form
3624 -217 -137 -32 -145 243 -67 64 207 300 35 71 219 241 -106 55 -101 65 -1 -149 -6 -332 48 -97
3646 -97 6 -141 -8 106 40 -164 -84 -16 -5 -55 -226 -5 47 -114 -22 -25 166 -103 10 -123 -130 28 50 10 23
3671 23 -21 -1 123 -205 -5 -182 0 211 -288 -30 66 199 -113 -51 -88 78 -20 -28 178 -72 143 -149 26
3694 26 206 10 -7 112 12 -6 206 178 194 151 -46 -34 32 31 63 57 48 -113 35 -143 33 187 -30 25 -7 149
3720 149 117 142 -210 148 161 -88 -56 -66 -92 -274 82 125 164 117 -370 62 35 -105 -92 172 -138 -61 202 -129
3744 -129 -214 -19 -10 -152 -177 -1 33 -195 247 64 -84 -96 -114 -280 6 165 303 -149 131 -87 -27 -119 94
3767 94 49 -133 -48 -136 105 -96 195 -18 -53 -139 -97 56 -83 133 -11 42 168 183 -16 87 -135 -91 -46 122
3791 122 -72 -64 -143 -231 -114 128 -32 116 6 -339 234 130 -91 -193 48 -137 -39 119 -171 311 -205 -15
$$ packed form
3624b17Q0J05j13L88l10J31J43R3k65L6J48K2l47J61j56J66o6j48J43l26L80j45
3646i7J03j47J33J14o6k04Q0O8J1n0j71K21N2j61R2lJ91k69J13j33pJ58K2m0J3
3671B3m4K0J24l28K00j77J82K11m99K58R6J33l12O2l7J66r8qK06k50K15k92J75
3694B6J80j96j7J19j00j8K12k8J6m3j97J2O6jL2orj61J48j78J76J54k17N5l2J56
3720A49l2K5l52L58J3k49L2j0k6j82L56M3L9m7m87M32k7j40J3K64l10P7K63l31
3744a29q5J95Rj42k5J76L4k28M42j83j48j2j8j66K86J59J38m52K80k18O0r2K13
3767I4m5j82Q5q8K41k01K91k13l5q6M2J53j39K16j44N3J26J5j99J03k22M4M5J68
3791A22j94Qp9q8J17K42j60J48j10l45N73j04k21j02K41j85R8J58k90M82n16J90
$$ plain form
3813 -15 -50 -114 162 163 -27 -74 68 -247 -257 113 85 29 -69 -113 -212 443 -34 90 -143 -167 83 -141 127 -55
3837 -55 114 -119 -73 -1 4 41 -135 -120 -68 -163 -126 105 -219 -94 -37 270 175 131 119 167 -27 -77 -205 19 166
3862 166 117 273 -187 -88 194 -84 111 -28 42 59 -94 74 -33 -100 3 -98 234 -67 60 -44 -66 -190
3884 -190 -129 227 -9 18 -178 68 18 43 35 -132 131 -54 -25 -335 44 66 -44 -63 -28 49 52 69 -120 240 20
3909 20 -120 161 -64 -23 -182 -187 165 -20 -89 33 -116 -17 110 99 -35 -48 -12 -19 263 -81 20 -18 -26 51 -124
3934 -124 -33 41 -149 92 4 83 159 13 195 -35 134 282 44 196 131 18 -118 8 -21 -6 -6 -49 -10 29
3958 29 -41 91 -99 136 -63 184 83 -170 -53 3 -33 -103 151 -406 36 -27 46 -36 232 151 172 -14 234
3981 234 60 -50 184 18 3 -118 131 45 33 26 27 22 82 -17 82 -15 -63 141 -95 210 -69 -239 13 42 -168
$$ packed form
3813a5l5o4K76Jj90m7J42l15j0L70k8n6r8m4r9O55m77J24k33k4K50k24K68j82
3837e5J69k33M6P2NL7j76J5N2r5L7K31l24J25N7L07r5m4j2M8j94n0j28K24J47
3862A66m9J56m60R9K82k78J95j39P0J7j53J68j07o7J03j01L32l01J27j04k2j24
3884a90O1L56k36K7j96K46n0K5qj67K63j85K9l10L79K2j10j9L5P7LJ7j89L60k20
3909B0j40K81k25M1j59nL52j85o9J22j49R9J27j1j34j3L6pK82l44J01l8qP7j75
3934a24R1P4j90K41q8P9P6j46J82k30J69J48k38J52o5j13j36J26k9J5%m3L9L9
3958B9p0J32j90K35j99K47j01k53J17N6l6p0K54n57M42o3P3q2K68q1K1j86K48
3981B34j74j10K34j66j5j21K49q6j2pJnO0r9R9r7m8K04k36L05k79j70K52K9k10
$$ plain form
4006 -168 64 145 59 -21 -153 139 -255 -7 -19 11 35 40 -200 -27 105 354 -15 87 -97 62 21 -66 329
4029 329 -87 -137 -110 -49 289 -145 -69 -14 52 7 87 -69 -24 212 -154 -199 -126 53 86 -155 -175 61 -184 -67
4053 -67 -83 -72 -22 -93 97 25 -26 218 225 -61 24 -146 17 -112 -105 37 -459 184 104 192 158 40 220 -75 23
4078 23 94 -161 -39 65 -68 -241 -159 153 -162 -141 60 119 -10 35 118 55 61 -88 -74 55 23 -2 -67 24 -160
4103 -160 184 112 -74 100 -168 107 -119 -40 82 -244 -44 50 116 -317 218 -91 43 -29 273 -84 -101 138
4125 138 94 208 159 -67 -222 -24 23 52 -217 -26 48 -25 242 -102 -56 138 17 -232 -54 -243 -227 131 -35
4148 -35 -300 -9 150 33 -26 -147 -160 53 -199 57 -192 -136 89 159 272 264 38 -240 -126 10 201 -93
4170 -93 -13 31 -66 -14 -62 -92 7 19 43 -22 -33 25 205 21 -86 271 -137 79 181 14 278 -133 148 21
$$ packed form
4006a68K32Q1q6q0j32K92l94K48j2L0K4Nk40J73J32K49l69J02j84J59m1q7L95
4029C29m16n0K7O1L38m34P6N5O6m5Q0j56M5K36l66m5P3J79L3k41k0K36k45J17
4053f7j6J1N0p1J90p2n1K44Pk86Q5j70J63j29PJ42m96O43q0Q8l4j18J80k95R8
4078B3P1k55J22J04j33j73Q2L12l15K1K01N9j29M5Q3o3Oj49J4J29l2k5o5R1j84
4103a60L44p2j86J74k68K75k26P9J22l26K00R4O6m33N35l09J34p2L02l57j7K39
4125A38m4J14m9k26j55J98M7K9k69J91P4p3K67l44M6J94j21k49J78j89J6L58j66
4148c5k65K91J59j17n9j21j3K13k52K56k49N6K25P0J13qk26k78J14J36J91k94
4170i3Q0M4r7N2m8l0R9J2K4o5j1N8J80j84j07L57m08K16J02j67K64m11K81j27
$$ plain form
4194 21 38 -169 -10 -323 106 164 251 -235 -12 230 -48 144 64 -152 91 -39 -34 9 40 59 -141 81 199
4217 199 94 -119 171 231 203 -93 102 -102 120 30 -85 -156 276 -278 46 -191 -191 54 34 -202 -120 131 -105
4240 -105 -87 -163 27 58 -14 217 -160 -19 -87 135 -81 -114 62 -114 -150 -58 23 -67 -39 291 155 -4 34 17
4264 17 -173 -211 -157 129 -193 -145 -154 -3 19 -42 108 -62 -93 142 100 -207 -6 140 86 -107 -156 -52 -56 82 163
4289 163 -59 50 42 80 -9 -203 85 221 85 -102 41 -148 -9 -31 -81 -17 -50 43 -111 79 -84 -149 181
4312 181 -8 -74 -20 197 -153 18 -20 143 -90 -123 152 239 -150 187 -94 28 -256 64 -2 329 -36 -16
4334 -16 166 251 224 -270 19 -157 -135 -195 89 82 -25 -167 152 19 -200 -93 69 -47 -119 36 205 -29 -137
4357 -137 -154 -78 19 28 -84 -214 -403 -67 -2 203 100 51 142 281 -111 -23 108 54 -69 -118 40 -16 -213 -108
$$ packed form
4194B1J7k07J59l13M29N8Q7m86K23K42k78J92q0k16K43j30NM3L1J9k00K22J18
4217A99j05k13K90O0k8k96J95k04K22r0j15p1M32n54L24k37%K45k0k36Q2K51k36
4240a05J8p6J90L1p2K31l77J41o8K22k16l3J76j76l6R2Q1r0K8L30j36j59L8j7
4264A7j90l8N4K86l22M8rJ51K2o1J50j70l1K35m2l07K01J46n4j93m9J04mJ38Q1
4289A63k22J09qL8q9j94K88J36j36j87J43j89J39k2n0O4l3R3j54J90j63o5L30
4312A81j89o6N4K17l50J71l8J63k33l3K75Q7l89L37k81J22k84L20o6L31l65K0
4334a6J82Q5k7m94K89j76K2o0K84pj07j42L19j33k19J07J62j16p2J55J69k34j08
4357a37j7P6R7Rj12j30j89L36O5K05j03m9R1J39l92Q8J31n4j23m9J58n6j97J05
$$ plain form
4381 -108 44 -86 215 57 72 -272 -42 279 131 -296 276 -24 -57 78 -59 -13 -44 -210 122 -87 52
4402 52 40 -86 -76 62 -16 82 90 14 -214 -118 194 21 -115 106 -129 -46 -23 178 -246 134 -59 83 -108 -233
4426 -233 -100 -33 -110 -33 51 -150 191 -56 114 -234 32 -44 141 -320 -201 -97 -169 -29 -15 -6 -99 -87 -26 141
4450 141 -122 87 208 -88 122 -156 -391 -206 -210 -150 -192 -17 205 221 -38 104 80 -253 -160 -274 190 -126
4472 -126 -167 168 2 165 192 5 51 -30 -338 127 103 3 86 -41 3 69 -10 2 33 18 45 138 63 46 -89
4497 -89 -122 102 220 126 96 -42 117 -294 -176 -98 157 69 26 114 14 39 -33 -21 55 113 96 49 -71 190 -28
4522 -28 -126 68 -10 -85 207 -76 -71 203 10 -156 -164 -96 97 -90 147 13 14 -25 -103 99 167 -17 18 -176 -64
4547 -64 -58 -33 98 -51 -45 29 -120 -294 46 -266 28 -122 -138 36 -14 -127 140 -92 -161 91 90 200 167 95 -126
$$ packed form
4381a08J52j30L01j58J5l44K30L21j48m27N72l00l3J35j37M6l1j66L32k09J39
4402E2j2j26J0J38p8R8Qp6k28R6L12j73j36K21k35Q3K3K01m24L80j93J42j91j25
4426b33J33O7p7P7Q4k01L41k47J70l48K66p6J85m61J19J04p2J40J4Rr3J2O1J67
4450A41k63K09J21k96K10k78k35J85mO0m2J75K22J6k59J42k4l33R3j14M64l16
4472a26m1L35j66J63K7j87M6q1l08M65k4j00Q3j27M4O6p9J2L1j5K7R3p5j7j35
4497h9l3K24J18r4l0j38J59m11J18P8K55q8m3Q8j00K5p2J2P6N8j7m7j20K61k18
4522b8r8J94p8p5K92k83NK74j93j66qO8J93j87K37j34Jl9p8K02O8j84L5j94J12
4547f4OK5J31j49OP4j49j74L40l12K94j50j6J74n0j13K67k32o9K52jJ10l3p2k21
$$ plain form
4572 -126 143 -240 -93 -23 -158 -34 78 23 -215 110 71 180 -14 -75 284 36 -53 -83 24 70 94 -6 -127
4595 -127 277 -139 -65 -80 -89 -121 -131 -109 -121 137 -193 146 -47 58 156 -151 -43 -62 102 -65 -76 89 178 -2
4619 -2 -118 -131 31 -63 28 204 84 -56 54 -95 196 2 -47 -246 32 -35 -152 31 -19 2 10 65 49 191
4643 191 36 60 3 -64 -53 -119 19 61 -114 -258 -116 -20 86 274 24 -112 -37 105 108 172 -107 125 1 -116
4667 -116 133 -86 -63 -79 8 -94 -68 146 -105 -251 -118 -34 -133 62 -41 -171 242 130 129 248 113 182 5
4690 5 -88 269 -235 91 102 -75 354 -112 -82 127 55 125 -8 -6 -91 200 147 10 213 -177 -102 -170 -60 14 79
4715 79 236 70 -39 60 -9 -90 -46 -102 67 -166 116 -17 12 -37 60 -326 -40 165 -179 174 149 107 -80 142
4739 142 188 -206 85 84 115 -8 6 -25 -123 54 108 -106 -13 49 -38 -192 33 -66 87 391 40 -6 47 -3 -130
$$ packed form
4572a26K69l83J47P0j35J24J12n5k38L25l9J09j94o1L59k48q9l0J07M6K4j00j21
4595a27M04m16P4j5rl2j0K2j2K58l30L39j93J05R8l07J08j9J64j67j1J65Q9j80
4619bj16j3J62r4R1J76j20j40J10j49K91j94m9j99K78o7j17J83n0K1QN5j6J42
4643A91j55K4n7o7J1o6J38M2j75j44J42R6J06J88k50j36P5J42LO4k79K32j24j17
4667a16K49k19K3j6Q7j02K6K14k51j46J33Q4r9J95j03j30M13j12jJ19j35O9j77
4690Er3L57n04L26J1j77M29m66L0K09p2P0j33Kq5K91n3j37K03l90P5o8J10P4O5
4715G9J57j66j09R9o9q1M4n6J69k33K82j33K9m9R7l86K86K05l44L53k5m2j87K22
4739A42M6l94K91jL1j23J4l1r8J77N4k14R3O2q7j54K25r9J53L04l51m6N3n0j27
$$ plain form
4764 -130 324 51 43 24 28 10 -65 -26 -221 77 -47 -67 115 26 68 71 -114 -246 -265 -3 4 -195 314 -290 -66
4789 -66 228 254 -188 -89 45 -132 97 55 -111 -40 -82 20 -111 -93 -84 48 35 -9 44 -77 -99 157 -101 186
4813 186 -149 80 -121 -64 41 2 -25 36 151 -75 92 -14 -170 -13 -21 -150 -17 -100 -175 -91 -41 36 147 74
4837 74 -177 -62 -147 67 -72 -49 194 -344 -139 -58 92 -17 117 24 33 107 -132 172 -5 221 27 -113 78
4860 78 -197 13 -138 191 -123 34 41 -247 -99 -71 179 106 33 0 121 65 278 -89 103 105 -9 -12 227 38
4884 38 121 -101 -3 -18 -138 -68 -109 240 -284 -6 16 50 435 -42 25 -124 -145 -2 195 -179 46 -19 -27 -65 -84
4909 -84 -167 199 18 -41 75 54 -78 -199 29 -234 -83 -65 372 -203 -81 131 -73 -160 48 -70 -182 -47
4931 -47 148 -93 -157 1 84 -113 60 -134 170 46 -135 -29 -45 111 -215 -185 -2 59 -53 -94 12 0 -154
$$ packed form
4764a30M54k73qj9Mj8p5L9j95K98j24k0J82q9M2Lj85j32j9K62Pj99N09o04K24
4789f6K94K6m42R9J34j77K29m2j66P1m2J02j31J8RJ32j3m4N3j21k2K56k58K87
4813A86l35K29k01N7J05l9k7O1J15k26J67j06j56J57qj29J33q3p5Q4N0P7J11p3
4837G4k51J15q5K14j39K3K43n38K05Q1J50j09J34r3RP4k39L04j77K26j94j40J91
4860G8k75K10j51L29l14J57Pk88J48K8K50p3p3l3J21n6K13l67J92Kj14lK39j89
4884C8Q3k22R8j5j20P0m1L49n24K78K2L4L85m77O7j49k1J43J97l74K25o5ql8j9
4909h4q3L66j81n9J16k1j32j21K28k63J51J8M37n75J22K12k04q7K08j18j12J35
4931d7J95k41o4J58Q3j97J73j94L04j24j81J06j6J56l26L0J83O1j12m1J06j2j54
$$ plain form
4954 -154 128 6 107 -55 9 -20 373 -11 -29 -78 295 51 -142 -83 149 19 -178 142 63 -210 90 141
4976 141 -145 -212 148 293 -71 -92 1 173 174 -58 -33 66 -119 -130 -258 -203 204 0 -5 3 7 -3 259 12 82 -30
5002 -30 -270 -97 -66 85 187 -92 -44 65 38 -20 10 -157 -67 67 -78 -49 -102 135 96 184 -12 56 -97 -193
5026 -193 50 -12 127 250 -47 -204 -67 56 88 -71 -23 26 -81 68 33 1 338 -195 180 -33 3 -39 -90
5049 -90 -104 -160 41 -136 188 38 -97 265 -27 -103 58 93 54 -37 254 30 -214 -26 123 22 20 50 -75
5072 -75 -128 -116 -261 -46 36 -18 -171 -143 226 -190 56 -39 143 -80 -133 92 165 -40 -291 167 -92 -13 -115
5095 -115 244 55 18 139 -79 43 -22 41 2 -213 153 38 -269 225 20 -64 -46 117 226 -201 110 31
5117 31 -28 -39 166 202 146 135 169 -40 -40 -86 -67 113 -261 83 -86 307 -84 -208 -118 -33 26 92 108 -89 -73 -28
$$ packed form
4954a54K82j22J01j62O4k9L93l84j8m9L73k44j93N9K32j30j97L20p9k73L00N1
4976A41k86o7L60J45l64k1R3J72Jk32K5R9j85j1j28N5M07k04nQMj0K62k47P0j12
5002c0k40J73L1J51J02k79M8J09k7n8L0j67R0J34j45K9n3K37l9Q8j96O8j53r6
5026a93K43o2J39J23k97j57J37J23L2j59M8M9j07J49l5l2L37n33L75k13L6m2n1
5049i0j4n6K01j77L24j50j35L62k92p6J61L5l9r1K91k24k44J88J49j01kL0j25
5072g5n3J2j45K15Q2n4j53K8L69m16K46r5J82k23n3K25P3k05k51M58k59P9j02
5095a15L59j89l7J21k18J22o5O3l9k15L66j15l07M94k05q4J8J63J09m27L11p9
5117C1n9j1K05L6n6j1L4k09%m6J9J80l74L44j69L93l91j24R0Q5N9O6J6j97J6M5
$$ plain form
5143 -28 182 27 107 -72 315 -77 -32 -203 -62 120 130 -118 150 -181 249 -33 -39 -59 120 -67 -3 206 -133
5166 -133 9 237 73 68 130 -225 251 -4 -91 181 56 -46 123 -5 -73 -87 -153 -252 -254 14 165 -113 -189 76
5190 76 -49 21 -100 -6 151 335 15 -55 -112 190 -113 33 222 -25 46 -25 233 133 53 -109 106 69 -133
5213 -133 -131 -280 150 -91 -19 96 -240 -131 23 -151 -410 -42 203 85 52 21 169 9 57 47 -138 56
5235 56 -110 360 288 164 -35 -16 -27 -33 -118 -26 -60 17 -7 -269 68 -92 45 -111 99 -18 26 178 95 242
5259 242 3 198 62 -155 -77 -182 -112 -37 -4 54 -1 -96 -42 95 -53 163 39 143 -139 100 13 77 150 -121
5283 -121 17 108 -43 72 -203 99 -133 80 -262 -85 173 -50 -161 -46 -94 -314 -81 -180 -139 101 317
5304 317 226 19 149 220 191 199 -74 130 36 145 124 187 27 117 179 -71 -30 164 -146 101 223 -16 -99 -88
$$ packed form
5143b8K10j55Q0j79L87l92M5j71J41J82J0k48K68l31M30k82ok0J79j87O4K09l39
5166a33J42K28j64nO2l55M76k55q7K72j25j02J69j28o8j4o6r9kK68J51k78p6K65
5190G6j25P0j21R4J57J84l20p0n7L02l03J46J89k47P1p1K58j00q0j62K15l7k02
5213a33Kj49M30k41P2J15l36J09J54j74k59L68K45j18l3l1J48j60M8j0j85J94
5235E6j66M70p2j24j99J9j1oq5R2l4P7k4k62L37j60J37j56K10j17M4J52q3J47
5259B42k39J95j36k17P8j05P0P5L3N8n5r5N4J37j48K16j24J04k82K39q7O4P3k71
5283a21J38R1j51J15k75L02k32K13l42J77K58k23j11J15m8k20K33r9M1K40K16
5304C17r1k07J30P1k9Qk73K04r4J09k1O3j60R0O2k50M1J94l10K47J22k39q3J1
$$ plain form
5328 -88 149 54 68 105 -9 73 96 210 -28 -116 141 145 -73 -107 -176 -206 41 -17 143 125 -43 -1 11 190 18
5353 18 -114 -47 107 -9 -55 56 178 -91 -89 -169 -278 -11 -66 -83 -177 -69 201 123 37 199 21 -49 164 -93
5377 -93 9 60 32 -158 -153 29 58 63 98 -21 -24 141 -33 63 -20 120 -30 -102 98 4 -72 -39 -17 153 153 -103 39
5404 39 -171 261 107 -117 211 -99 -134 25 110 99 36 -21 157 -166 173 187 21 216 20 6 -72 -147 -47
5427 -47 -104 52 161 21 -272 -2 45 -138 -36 -9 298 -171 13 -186 -156 154 21 179 -136 -128 41 -125
5449 -125 51 -8 -95 -134 -71 -65 237 -103 -133 -87 17 34 290 105 59 -177 12 337 287 99 69 -26 43 29 6
5474 6 -103 -20 -178 11 -70 -120 -270 115 -3 69 -25 -3 -61 -186 115 42 -6 -36 67 -30 125 -87 -129 60 127
5499 127 -76 57 24 -198 -182 -87 112 180 106 306 71 -104 55 13 -235 -74 76 9 2 -310 -79 -176 -181 -79
$$ packed form
5328h8K37r5J4L7j14Q2K3J14k38q8K57Mk18l4o9l0K47n8J60j8j68M2J2J79j72
5353A8j32O7J54j16m6J11J22k69Kq0j09K67n5j7r4J08K70p8q6J62j78p0K13k57
5377i3J02N1k8j90NJ82K9NL5j19lJ65j74R6q3J40j50p2K00r4p6L3K2J70%k56J42
5404C9k10M32j54k24L28l10l5J59Q5j1o3n7J78l23L39J4j66J95j96j4p8p5J00
5427d7n7J56J09j40k93K70M7j83J02K7L07m69J84j99L0L10j33J58l15QJ69j66
5449a25J76n9q7l9O3OL02l40l0M6J04J7K56j85m6k36J89L25n0j88l0r5O9j4k3
5474Fj09Q3j58J89q1n0j50L85j18P2r4K2n8j25L01p3m8l0J03r7J55k12m2J89O7
5499A27k03J33l3k22J6R5J99O8p4K00k35j75J59m2k48J61J50o7pl12K31r7nJ02
$$ plain form
5523 -79 -38 49 127 -88 -4 33 -118 -156 -57 118 17 -74 -263 174 -137 -115 11 -35 5 40 -234 -225 131 211 -133
5548 -133 196 -11 60 29 179 171 200 158 -50 96 137 86 -23 -55 14 -221 -212 -12 -97 100 -71 -123 19 88 178
5573 178 -126 42 -225 91 70 57 -63 -89 -142 -32 81 -212 -12 -65 207 104 67 -26 81 210 -39 -57 165
5596 165 -102 419 165 -96 -101 131 -30 129 -48 -102 4 -240 -74 47 -206 83 85 300 -25 -271 115 -26
5618 -26 149 170 -42 -197 14 29 -9 67 87 56 23 76 -159 108 -107 -2 -94 -95 24 132 97 -196 105 25 -61
5643 -61 -11 -47 -128 175 114 8 117 59 -241 20 155 -92 88 135 13 -75 -141 56 212 -196 -100 223 -26
5666 -26 -346 79 103 147 -31 -35 171 -33 145 -259 -206 -114 35 -70 -13 -165 5 147 -136 122 2 59 91
5689 91 -26 -30 -57 320 63 -215 -102 -306 -82 -42 0 -299 11 -140 2 -246 10 -128 76 -176 -242 176
$$ packed form
5523g9M1Q7P8k15Q4L7j51l8R9J75j01r1j89M37l11K2J26m6M0L5k74RL56Q0l44
5548a33L29k07P1l1J50qK9m2k08J46M1n1j09l2O9k35RK00q5J97j71n2J42O9R0
5573A78l04J68k67L16k1j3j20k6n3J10J13k93K00n3K72j03l7r3J07J29k49j8K22
5596A65k67N21k54k61nK32j61J59j77n4J06k44J66J21k53K89KK15l25k46L86j41
5618b6J75K1k12j55K11J5l8P6K0l1l3N3k35K67k15J05r2jJ19J08l5k93L01q0q6
5643f1N0l6q1L03o1j06J09n8l00K61J35k47J80M7j22q8o6J97J56m08R6L23k49
5666b6l20M25K4M4j78mK06k04J78m04N3R2J49j05N7j52J70J42k83K58j20N7L2
5689I1j17mk7L77k57k78J13k04K24M0M2k99L10j51J42k48K56j38K04k52o6M18
$$ plain form
5711 176 5 30 -115 -150 145 247 211 50 -149 -62 126 198 -25 143 -86 273 -129 -89 40 -49 25 92 -151
5734 -151 30 -154 -170 -60 58 58 124 -24 9 61 79 -140 -11 39 -38 196 92 27 -141 -110 -147 106 29 149
5758 149 -225 -322 113 -44 -149 -303 -31 49 14 232 -81 -12 2 48 18 -63 156 -82 92 -54 87 44 32
5781 32 -43 0 161 -76 -50 144 134 57 -20 -146 179 158 137 -94 44 35 42 -30 -86 -12 -76 -34 75 -72 150 -6
5807 -6 30 -78 92 63 -107 46 -99 361 126 95 70 46 -106 -8 73 356 -17 -227 -23 177 -9 99 -82
5830 -82 27 330 -24 61 53 98 -210 -145 212 -13 -170 -106 -33 80 36 -54 -122 53 52 -80 161 -185 -30 -146
5854 -146 51 204 -109 -22 -99 -340 -132 -22 20 346 -42 140 -153 -210 37 28 125 -81 117 -41 62 -73
5876 -73 79 -12 -169 93 -101 9 109 -22 105 48 125 126 23 35 -153 -151 21 -6 177 -184 119 -47 43 72
$$ packed form
5711A76j71K5j45l5K95J02l6j61j99Q7J88P2k23J68k29L59m02M0J29q9P4O7k43
5734a51J81j84j6J10J18%O6j48L3N2J8k19J29N0p7K34j04o5j68L1l7K53p7J20
5758A49l74r7M35j57j05j54K72Q0l5K18l13O9J4M6l0q1K19k38J74j46J41m3j2
5781C2p5M3J61k37K6J94j0p7p7j26L25k1k1k31J38rPp2n6P4o4M2J09j47K22j56
5807fL6j08J70k9j70J53j45M60k35l1k5k4j52R8Q1K83l73k10K04K00j86J08j81
5830h2J09L03l54Q5qM5l08O5L57k25j57O4P3J13m4r0o8J75jj32K41l46J55j16
5854a46J97J53l13Q7p7k41K08J10M2L26l88J82k93n7K47rR7k06J98j58J03j35
5876g3J52r1j57K62j94J10J00j31J27n7P7Jj03J2j88KJ72k7J83l61L03j66R0K9
$$ plain form
5900 72 -305 78 87 -119 127 150 -82 -116 -134 95 -35 -114 -10 -141 -61 173 -41 -44 -22 -66 170 112 60 -160 -23
5925 -23 -227 -2 -165 66 -132 111 -82 -4 86 -83 -130 48 -268 101 99 -89 219 -122 255 9 173 198
5947 198 91 20 98 10 -28 60 142 -31 104 229 -206 41 83 35 153 58 170 22 43 -42 52 153 156 -13 272
5972 272 -86 53 -10 53 158 -36 27 4 76 -185 22 277 200 -62 54 -96 -152 -176 -203 21 -153 -78 -5 -13
5996 -13 -57 -23 -171 -34 -27 -193 -135 111 -143 23 222 94 -144 -159 110 102 23 15 -21 76 25 98 194 23 -305 -49
6022 -49 123 -240 -207 -150 -53 -134 24 -31 68 81 80 98 -150 20 -20 -122 -5 -87 -85 153 158 -96 46 144 100 37 44
6049 44 -42 -30 -99 -95 -73 -51 10 -149 -95 57 50 140 64 85 -98 127 -25 -104 -152 93 -128 49 -79 93 -3 211
6075 211 116 136 180 43 -190 -134 -212 -31 -127 -53 152 -168 -78 -153 -38 -43 142 -46 -185 -15 107 43 282 -17
$$ packed form
5900G2l77L83Rk06K46K3k32l4j8K29j30p9J04j31Q0K34k14lK2m4K36n8n2k20J37
5925b3k04K25j63K31j98K43j93P8R0j69m7J78l16L69kj88L08l41L77k46J64K5
5947A98j07p1P8q8l8Q8Q2j73J35J25m35K47M2m8J18r5J12j48K1q5R4J01Lj69K85
5972B72l58J39o3O3J05j94O3k3P2k61K07K55p7k62J16j50n6k4k7K24j74P5P3q
5996a3m4L4j48J37Pj66N8K46k54J66J99j28k38j5K69qp9ql6R7n1P3R6j71l28K56
6022d9J72l63L3N7R7q1J58n5R9J3jJ8k48J70m0j02J17q2KK38Nk54J42R8m4o3P
6049D4q6J2o9MK2K2O1j59N4J52pR0p6K1j83K25j52p9m8K45k21J77j28J72r6K14
6075B11r5K0M4j37k33N6p8J81r6P4K05l20R0p5J15nJ85j88j39J70J22o4K39k99
$$ plain form
6099 -17 90 -52 -209 -90 192 -53 -9 -42 240 -205 99 -31 -250 141 -63 86 -86 -141 -83 214 -17 -131
6121 -131 128 -164 171 31 66 -10 23 42 -210 -90 -2 -60 -109 107 -172 138 -195 29 5 -308 -55 -40 -190
6144 -190 44 27 -91 162 -6 -3 -231 35 35 -80 193 -201 117 196 191 -22 -49 -172 3 133 100 -184 -89 119
6168 119 -209 -193 72 -85 -123 99 178 -130 -78 20 -169 -81 41 -134 130 75 56 -127 -134 -76 117 72 8 -253
6192 -253 -98 139 -183 -147 141 86 26 48 154 184 132 31 5 14 18 355 -77 -4 -74 31 14 -128 -93 34 -55
6217 -55 -142 -63 -163 135 -61 194 160 13 -127 -25 -123 187 -23 7 -60 87 -10 -154 101 37 -33 39 -112 37
6241 37 156 -214 55 -99 225 -224 142 -135 3 232 36 293 -17 -74 251 173 41 78 284 -200 59
6262 59 -159 -146 -88 107 -235 37 -24 -123 157 58 -41 -156 -229 215 193 200 -45 72 -105 -77 131 -116 -33 0 118
$$ packed form
6099a7J07j42j57J19K82k45M4l3K82m45L04j30k19L91k04J49j72n5N8K97k31j14
6121a31K59k92L35j40L5p6L3J9k52J20Q8n8m9K16k79L10l33K24k4l13K53J5j50
6144a90K34j7j18K53j68Lk28K66%j15K73l94L18P9nk13k7j23J75J30l3k84R5K08
6168A19l28J6K65j57l8K22P9l08N2R8j89Q8J22j75K64n5j9j83pN8J93m5o4k61
6192b53J55K37l22L6K88n5o0K2J06L0n2j01k6RML37m32P3p0J05j7j42L5J27q9
6217e5q7P9j00K98j96K55l4j47j40J02r8L10k10L0o7J47r7j44K55o4p0P2j51J49
6241C7J19l70K69j54L24m49L66k77J38K29j96K57l10n7L25p8j32L7K06m84K59
6262E9k18J3N8J95l42K72o1r9K80r9r9j15p3M44k2Pk45J17j77K8K08k47Q3L3J18
$$ plain form
6287 118 -35 -66 41 22 -180 297 40 -225 -346 0 76 98 66 43 96 63 23 -124 86 -152 -9 -90 25
6310 25 47 -72 -277 -58 113 97 -41 -149 183 -129 16 89 -398 35 -222 -44 397 63 -83 -34 -73 -146
6332 -146 -8 252 -15 -80 -319 -59 -55 -166 91 76 -31 97 101 -43 -85 -4 230 74 73 58 -109 -206 24 147
6356 147 -245 48 -174 -385 175 87 93 48 -132 66 61 -225 91 -62 101 82 6 58 23 100 1 -63 50 144 312
6381 312 -35 87 147 262 -54 23 -144 458 -206 -176 -163 69 46 79 70 -14 -213 10 -3 50 -117 37 58 15
6405 15 309 213 22 -6 143 113 -63 121 -32 -180 29 -35 -12 -140 12 189 -90 20 353 168 90 -184
6427 -184 -63 -99 118 -174 38 -89 -184 140 -61 274 15 36 119 -97 -55 42 87 149 158 -188 -129 66 53 -28
6451 -28 -99 144 60 -153 56 170 134 177 -49 -157 -166 60 210 54 41 -220 -109 -44 221 338 175 -23 -13
$$ packed form
6287A18j53l1J07j9k02M77k57k65j21L46P6K2l2k3N3l3m0j47K10k38J43q1J15
6310B5K2j19k05K19J71j6j38j08L32l12J45P3m87M33k57J78M41l34j46M9l9p3
6332a46J38K60k67o5k39K60Mj11K57j5j07J28Mj44m2Q1K34j56jj5j67r7K30J23
6356A47l92K93k22k11N60q8Om5j80J98nk86L16j53J63j9p6N2l5P7r9o4J13R4J68
6381C12l47J22O0J15l16P7j67O02o64L0J3K32k3L3rq4j99K23j3N3j67J54K1m3
6405A5K94r6j91k8J49l0j76J84j53j48K09o4K3j28J52J77k79J10L33j85p8k74
6427a84J21l6K17k92K12j27r5L24k01L35k59K1Q3k16M2R7M5O2Rl46N9J95j3q1
6451b8p1K43q4k13K09J14l6M3k26j08rK26J50j56j3k61J11O5K65J17j63j98J0
$$ plain form
6474 -13 -115 140 164 -4 -74 4 155 44 -128 57 3 -186 -177 76 -141 -47 -28 -156 -80 11 -108 -81 160 247
6498 247 -54 -9 172 -148 -192 -99 274 122 243 -179 19 -88 -54 -184 -144 -261 -96 -43 -71 49 -55 94
6520 94 129 48 22 -88 -195 144 101 209 68 -19 -130 116 89 180 -84 83 -138 31 10 -109 -51 -140 -218 -19
6544 -19 45 -205 -15 -47 172 89 75 81 -74 78 94 -41 -172 94 -74 80 -147 58 32 -244 128 38 -87
6567 -87 185 20 -65 240 242 124 60 126 123 33 -27 13 37 141 154 84 -77 47 74 -15 -248 120 -137 -98 66 56
6593 56 49 31 2 -59 90 -21 -281 58 40 24 -327 32 55 249 -196 -110 202 -279 46 64 188 -3 -152 -103
6617 -103 -114 -126 180 111 -31 -262 -91 -237 -196 82 205 -1 -186 -21 184 -211 -106 -2 80 84 -82 -95 25
6640 25 52 -41 -91 -337 -247 66 -253 28 -10 41 54 -75 163 87 -101 -62 -71 -120 169 11 -110 62 130 -70 130
$$ packed form
6474a3j02K55K4j68p0P8J51j11j72J85n4j89RK53k17R4J9j28P6R1j19K7K41Q7
6498B47l01M5J81l20m4R3L73j52J21m22J98j07L4j30M0j17J65N3k8J20j04J49
6520I4L5q1k6j10j07L39m3J08j41q7j11K46k7R1k64J67k21J69k1j19N8q9p8J99
6544a9O4k50J90l2K19q3j4Oj55J52J6j35j31K66j68J54k27K05k6k76L72r0j25
6567h7K72j65q5L05Kj18o4O6lr0o0M0K4J04J3p0j61J24K7q9k33L68k57L9J64j0
6593E6pj8k9o1J49j11k60L39j8j6l51L59K3J94m45Q6L12m81L25J8J24j91j49M9
6617a03j1j2L06o9j42k31J71j46M1K78J23k06j85J65K05l95J05J04Q2Mj66j3J20
6640B5K7r3n0k46R0L13l19K81l8N1J3j29K38p6j88L9rm9K89j58j21J72O8k00K00
$$ plain form
6665 130 117 17 133 47 -207 -51 3 128 140 82 -26 9 283 -45 171 -203 -176 2 69 -16 45 -224 -125 42
6689 42 -102 72 157 302 -176 212 -48 91 110 -44 124 130 79 -57 64 113 100 -110 -28 54 -71 184 47
6712 47 -88 83 -118 29 -295 -6 155 -186 49 -55 -67 -184 55 46 -62 -135 -203 -101 69 -54 -23 138
6734 138 34 133 27 -51 -212 39 -136 -143 19 165 -22 -183 -115 -84 -16 -59 -182 72 -100 -20 -151 84 85 -204
6758 -204 53 51 -69 128 -83 95 91 118 -112 -56 -171 51 58 69 217 -180 -27 -68 -43 -93 -34 -51 -145 119 26
6783 26 -106 -71 -66 95 -37 -125 202 239 -210 -21 150 62 -323 35 -178 -108 168 -19 271 250 66 -240 -19
6806 -19 122 -282 -89 94 35 213 123 188 28 14 36 -16 196 -88 -113 90 -86 -233 79 -164 133 30 -20
6829 -20 -132 34 19 -89 65 -347 -29 96 11 16 2 48 197 -22 220 160 -134 -69 191 -106 -5 10 -98
$$ packed form
6665A30j3j00J16q6k54J56N4J25J2n8j08L5K74l28K16l74K7J78O7q5O1k69R9J67
6689D2j44J74Q5J45m78L88k60J39J9j54J68On1j36J21M9j3k10Q2Q2j25K55j37
6712D7j35J71k01J47l24K89J61l41K35j04j2j17K39rj08p3o8J02J70j23L1J61
6734A38j04R9j06p8j61K51j75pJ62J46j87j61O8L1O8m3j23K54j72Q0j31K35Jk89
6758b04K57kj20J97k11J78mK7k30N6j15K22PJ1J48l97J53m1K5n0N9j7r4K64r3
6783B6j32L5NJ61j32q8L27L7m49J89J71q8l85L58k13P0K76j87K90k1j84l06K21
6806a9J41m04J93J83n9J78r0O5j60j4K2n2K12k84k5K03j76j47L12k43K97j03n0
6829b0j12J66j5j08J54m12L18J25q5Nj4M6J49k19K42o0k94O5K60k97J01J5j08
$$ plain form
6852 -98 -76 72 -160 -149 -87 -173 99 -29 27 -65 -67 -54 -221 -14 -116 -240 -15 -75 -13 101 36 46 78 -69 -140
6877 -140 -22 136 -145 -143 77 -49 -235 42 -54 56 -46 23 106 -101 -62 -142 -34 23 -114 -67 180 99 231
6900 231 -133 55 -380 -10 151 147 76 -148 313 69 -65 -53 -29 -169 37 65 65 -111 -101 261 54 17 247
6923 247 81 -198 84 10 -55 10 -149 -2 -60 -139 275 203 106 -73 -123 10 99 -92 -228 -385 127 -36 18
6946 18 -66 -157 -199 -85 110 -48 241 108 5 38 13 62 -39 -44 -9 -21 26 -329 -31 -128 -50 -308 -240 -15 -112
6971 -112 -35 21 -185 -158 -94 -133 161 -48 69 1 -107 -81 -43 -208 131 22 176 150 -22 -85 35 -146 93
6994 93 50 -27 107 133 -240 -105 -191 -53 -40 56 -84 -32 -21 113 -9 241 166 143 76 -145 -98 -47 69 144 152 27
7020 27 -49 115 94 -147 85 46 26 -211 56 -54 -108 -122 -108 -49 151 46 35 -181 146 18 -144 219 -87
$$ packed form
6852i8K2J48k32J1O2q6K72j28N6r2kJ3j67K07j02j24K25o0O2J14o5J0L2j47p1
6877a40J18J58k81KK20j26j86K77r6J10j02O9Q3k07L9q0J08N7j37M7K47q1J32
6900B31l64J88m35L70J61mp1k24M61k44j34J2K4j40K06K8%j76J0L62k07l7K30
6923B47j66k79K82p4o5O5j59J47n8p9M14p2r7j79n0J33Q9j91j36j57N12j63N4
6946A8q4r1m2J14J95j58K89j33j03L3k5M9j01nL5j2M7l55K98r7P8k58O8K25r7
6971a12P7N6k06K7O4l9K94k09J17o8j08K6L8j65L39j09J54k6j72o3J20j81K39
6994I3m3p7J34K6l73J35q6J38J3R6j40N2J1J34j22K50p5k3o7k21M7N1J16P5Qj25
7020B7p6J64k1k41K32l9k0k37K67j10n4j4J4N9K00j05j1k16L27j28j62L63l06
$$ plain form
7043 -87 -271 10 -21 -192 -7 -235 299 146 196 120 109 94 -123 72 -98 -163 -30 -3 47 -94 30 102 142 -50
7067 -50 101 -59 8 14 131 240 98 -108 -1 -79 180 96 -77 -119 -11 -162 -55 -3 84 -113 -187 118 -101
7090 -101 10 -113 204 99 -53 -58 -89 114 -67 465 330 121 -4 -38 -156 -3 78 -104 -35 5 2 -92 218
7113 218 -108 -64 163 37 -79 -223 -208 -15 -348 106 -289 -125 90 -27 -164 -45 17 -7 393 241 128
7134 128 -213 85 -158 -109 276 34 85 56 38 210 -99 1 -85 136 -73 -137 -14 181 -178 -118 217 245 43
7157 43 -297 -234 156 52 31 153 29 -121 40 -51 -190 -143 -274 -176 -9 126 183 -121 -26 75 58 146 -165
7180 -165 35 -3 -52 78 -21 85 -1 -53 -265 -44 186 99 -24 27 215 -60 142 85 9 -2 247 25 -129
7203 -129 32 -70 106 183 151 143 144 122 -234 -77 -157 59 -96 59 188 13 -139 210 114 -168 87 35 -36 -56
$$ packed form
7043h7j84K81l1j71J85k28N34j53N0p6j1j5k17J95j70o5J33K7N0j41J24P2M0j92
7067e0J51j60O7OJ17J09j42k06J07p8K59q4j73m2J08j51J07N2Q7j97p4L05k19
7090a01J11j23L17j05j52nl1K03j81N32j35k09j25l4j18J53Q1j82O9M0lr4L10
7113B18l26M4K27j26j16j44J5J93l33M54l95J64K15j17j37J19O2k4M00j52j13
7134A28l41K98k43M9L85k42N1k9j8J72l09J00q6K21k09o4J23J95l59O0L35K8k02
7157D3l40O3L90j04k1J22j24j50J61r1j39M7j31R8J67J35N7l04R5J01j7Q8l11
7180a65K00l8m9J30r9J06q6n2k12K21K30q7j23N1J88k75K02n7p6j1K49k22j54
7203a29J61j02J76P7l2qJk2l56J57q0K16j55J55J29j75j52L49r6k82K55n2p1k0
$$ plain form
7227 -56 -29 132 44 -199 -154 -133 26 122 -42 34 -163 -130 54 -108 -107 102 -105 172 220 -140 -17 -106 -24 159
7251 159 -76 -15 1 99 263 105 121 -90 -331 51 -49 209 5 120 187 -53 -70 10 -184 -297 49 -61
7273 -61 -25 94 124 -122 -133 -25 -115 14 -46 -60 -69 132 -83 -42 -184 -117 13 -24 -57 -266 -135 -128 174 5 -119
7298 -119 -193 -40 -78 -296 198 -72 -266 167 142 90 -79 -19 -216 37 -221 68 -63 -196 -55 -24 -13 -47 175
7321 175 -137 8 -53 -57 -47 -87 -60 140 55 1 54 37 -126 -162 -51 54 21 -159 -2 26 -77 58 30 61 95
7346 95 -2 52 -72 -222 60 218 -254 -162 30 -65 187 -80 245 190 92 0 -88 -9 -180 -36 10 171 275 228
7370 228 -76 24 -155 65 2 12 169 -22 -205 -228 99 12 14 -82 101 -42 -20 -14 -98 125 -157 125 14 -100
7394 -100 49 -104 -24 -75 9 -137 -274 -138 -220 161 154 -147 100 32 -133 139 199 30 -98 -38 47 67 -223 -97
$$ packed form
7227e6K7J61q8k43M5K1J59R6j64P6j97L3J84j62JK09k07K77M8l60J23q9Q2J83
7251A59k35O1J6R8J64j58J6k11k41L82j00K58k04J15O7k40j7Q0j94j13L46j10
7273f1L6J19L0k46j1J08r0J29o0j4rK01k15M1j42O7J30l7l3k09J31PL02j69j24
7298a19p4J53l8k18M94k70j94M33k5n2j69O0j97K53k58K89j31j33J41L1J1l4K22
7321A75l12J45o1mJ0m0K7K00q5n4N3j7j63l6J11J05l3j80J57K8j03J35k8L1L4
7346I5r7N4j24j50K82J58m72R2J92r5K52k67L25n5r8r2q8P9j71J44M6J61J04m7
7370B28l04J00j79K20o3J0J57j91j83k3L27q7Kr6J83j43K2Oq4K23k82K82j11j14
7394a00J49j53Q0n1Q4j46j37J36q2L81pl01K47o8j65K72O0j69j28O0Q5K0k90J26
$$ plain form
7418 -97 -223 66 38 26 -32 -181 -209 69 -69 5 203 -149 119 -114 -96 -80 -29 71 97 134 -53 -217 -85 -85
7442 -85 113 8 -36 -26 181 109 194 66 80 -53 40 145 78 -24 -91 -134 -12 242 -67 107 150 -196 198 270
7466 270 -101 -63 -6 87 -97 58 107 -33 -1 -76 -102 239 -33 -40 8 164 -43 -147 134 -121 -224 133 170 -80
7490 -80 -172 -40 36 37 26 237 -102 0 35 13 -40 -41 76 103 -67 -139 -66 29 4 -229 28 33 118 -265 9 -99
7516 -99 -199 -17 153 152 -163 132 155 -65 -123 5 -131 -78 401 264 -172 295 47 92 -122 121 -38 -64 85
7539 85 231 242 -183 -71 -40 175 -32 -102 -121 -26 -93 106 -49 55 -12 -52 -4 -212 19 -334 104 138 100 -50
7563 -50 98 -6 -16 166 -145 210 -146 293 42 211 -201 -21 -123 -5 -13 -51 109 -104 201 217 76 -60
7585 -60 39 46 60 90 -238 30 68 139 190 -17 -152 -102 59 -32 -80 147 76 -29 -51 -106 -25 1 -187 -139 68 -45
$$ packed form
7418i7j26K89k8j2n8j49k8K78j38P4J98l52K68k33J8J6N1J00K6L7j87j64J32%
7442h5J98j05m4J0K07p2Q5j28J4j33R3J05o7j02o7m3J22K54l09J74M3l46L94P2
7466B70l71L8N7R3j84J55M9j40L2p5k6L41k72pM8J56k07j04K81k55j03L57L7k50
7490h0r2J32P6Jj1K11l39J02L5k2n3jJ17K7j70p2P3R5k5k33K57NQ5l83K74j08
7516i9j00J82J70jl15K95K3k20n8J28j36N3M79j37m36M67k48M5k14K43j59k6J49
7539H5J46J1m25J12L1K15k07p0j9R5o7J99j55J04o7m0M8k08K31l53M38L4l8j50
7563e0J48j04j0J82l11L55l56M39k51J69m12J80j02J18ql8J60k13L05J6j41j36
7585f0R9PJ4L0l28K68L8P1N1k07j35N0J61r1m8K27p1j05k2n5Q1K6j88M8K07j13
$$ plain form
7611 -45 171 -152 167 -48 114 -15 241 45 -247 -42 174 -177 59 -17 -97 -89 -82 -95 -90 -76 -36 64 -140 32
7635 32 137 62 64 212 -21 84 -119 -30 -79 43 129 -126 175 -19 336 -177 -226 60 -33 31 257 -83 28
7658 28 86 -176 -30 -65 -35 34 -34 223 164 23 -249 -117 59 134 32 152 -68 221 -18 -155 -63 -98 11
7681 11 -137 -251 176 17 58 147 -70 -171 -170 137 -262 -20 40 13 -43 39 127 104 -81 -66 1 132 -96 67
7705 67 57 151 111 80 74 49 13 -70 -16 -4 2 36 -50 -179 20 104 -185 15 161 -235 -173 78 183 96 127 212 47
7732 47 -54 -14 -113 46 -78 -104 143 -32 -292 187 -84 -104 -82 -24 213 -305 21 -65 -95 -120 157 127 90 -33
7756 -33 18 -20 117 141 -52 -150 -58 172 -119 -113 -93 172 -145 297 -70 -184 -174 164 95 -201 -65 106 -41 -211
7780 -211 -267 96 117 133 7 5 -63 129 57 -50 111 -118 143 50 156 41 58 -63 -44 -165 11 27 101 -84
$$ packed form
7611d5K16l23L19k15J62j29K56j96k92K05K16l51K36p6q0QPj3NJ4M0J00k04J72
7635C2J05p5KJ48k33J05k03Q9m9J22Q6k55L01j94L55n13m9K86r3O4K26l40J11
7658B8N8k62J46l5L0O9o8K57n9j41k72J32J76P5j02J20k20K89k39j37R2l5J09
7681A1j48j14M27j59M1Q9k17j01JL07l99K42O0k7n6Q2Q8k3j85J5O7J31k28J63
7705F7j0R4m0l1ok5l6q3N4J2OL4q6j29J99Q4k89K00J46l96O2K51J05q7L1Q5j65
7732D7j01M0r9J59j24k6K47j75k60M79k71k0K2N8K37n18L26q6l0k5K77l0l7j23
7756c3N1l8J37K4j93r8R2K30k91OK0K65l17M42l67j14J0L38o9k96J36J71j47j70
7780b11n6L63K1J6j26ko8J92p2j07J61k29K61r3J06j15J7j21J9j21J76J6P4j85
$$ plain form
7804 -84 159 11 -177 71 34 -31 -230 -326 364 -88 147 -139 -253 -26 -36 -37 32 220 -43 -46 -166 -47 19 68
7828 68 -173 -35 -65 164 -3 -125 -3 21 -62 110 -156 178 -48 -242 44 210 405 25 -218 -144 138 -29
7850 -29 124 2 241 180 196 -160 -38 -215 -53 -87 -36 4 -26 136 206 -190 -6 83 -198 -32 -142 -206 -108 46
7874 46 -13 27 -67 -33 -122 -15 64 -89 -109 -126 73 51 -15 -23 79 46 -63 45 13 -160 143 -236 -20 -118 70
7899 70 -70 257 176 150 -38 29 -154 28 52 -52 -63 84 138 299 5 -213 -22 -111 47 270 40 -14 171
7922 171 116 -117 -15 50 -166 -4 224 -71 118 86 193 -11 214 32 46 -125 288 -129 3 123 7
7943 7 234 62 124 -30 -78 -20 -11 -7 -49 45 5 -114 -24 79 64 85 99 -35 27 147 86 -164 256 172 -154 -231 108
7970 108 165 -82 -100 -8 83 299 -140 43 30 70 16 -156 -41 0 -77 -33 -52 -197 -131 198 174 -70 96 50 28
$$ packed form
7804h4K43j48j88K48l7o5j99r6O90m52K35k86j14K27j0jO9J88k63lj20J19O6M9
7828F8k41J38l0K29j67j22J22K4q3J72k66L34k26j94K86J66J95l80k43P4K82j67
7850b9J53j22K39o1J6l56J22j77J62l4N1M0l0J62P0l96J84Q9k81J66j10o4R8J54
7874D6n9M0r4L4q9J07P9j53k0j7J99k2o6qJ02l3j09J08l2j73L03l79K16r8J88
7899G0j40L27q1k6j88O7j83J82K4j04j1J47N4J61k94k18J91q9J58K23k30n4J85
7922A71n5k33J02O5k16J62K28k95J89l2J07k04K25j82J4j71M13m17J32J20j16
7943GK27j72O2j54m8N8RMm2R4m0j19R0J03j5K1J4j34O2J20o1k50M20q4l26p7L39
7970A08N7k47j8R2R1K16m39J83j3M0n4j72J15M1p7M4j9j45O6L29k4k44J66m6k2
$$ plain form
7995 28 -95 41 1 44 17 375 127 167 73 -92 -18 -186 -250 -92 45 -179 93 116 88 -89 -153 43 -133 58
8019 58 106 53 54 109 88 104 -55 -19 -78 -215 -92 -75 27 120 248 -46 83 16 14 -247 -14 -53 -3 -8 -20 -10 9
8046 9 173 61 207 27 -195 112 169 84 234 -1 104 137 172 23 -51 15 42 24 -59 -207 -29 -197 277 -195
8070 -195 -8 -96 73 82 -80 70 -206 -102 75 -132 -26 30 -169 24 -94 -4 -167 -147 -42 -120 227 122
8092 122 181 131 -152 21 -189 -95 138 54 -82 -87 -152 69 -197 -171 22 -48 -122 -186 -46 66 34 -66 21 -51 148
8117 148 -32 -64 76 -141 47 -196 165 42 -54 -101 -31 186 43 -177 -256 -162 -64 73 -358 -8 -169 195
8139 195 -90 25 -64 87 -183 -113 61 -158 -46 -47 -153 119 -102 -323 164 62 -45 -125 7 -47 -129 31
8161 31 -285 21 -4 69 63 -213 7 -22 164 44 60 -330 -22 -71 -72 -131 123 -124 43 283 -193 -43 131 185
$$ packed form
7995B8j23J36m0M3k7L58k48M0r4j65P4j68o4J58J37k24K72K3k8j77o4J96j76J91
8019E8M8n3JN5k1J6j59L6n9j37J23J7J02R3J28k94J29o7kk61K33l9N0nj2J0J9
8046IJ64j12J46j80k22L07N7q5J50k35J05L3L5j49p4O6K7j8q3j48J78j68M74m72
8070a95J87q8J69Rj62J50k76J04J77k07J06N6j99J93j18R0j63K0J05p8L47j05
8092A22N9n0k83J73k10R4K33q4j36no5K21k66K6J93p0p4o4J40J12l2j00Q7p2J99
8117A48j80l2J40k17J88k43L61j23r6m7P0K17j43k20p9R4R8J37m31L50j61L64
8139A95k85J15q9J51k70P0J74k19J12jj06K72k21k21M87j02j07q0J32n4q2J60
8161C1l16L06k5P3ok76K20k9J86j20J6l90L08m9jn9K54k47J67K40m76J50J74N4
$$ plain form
8185 185 -173 -60 -59 85 218 100
$$ packed form
8185A85l58J13JJ44J33j18
8191A00
$$ Imaginary data points
##PAGE= N=2
##DATA TABLE= (X++(I..I)), XYDATA
$$ plain form
0 0 0 0 0 0 0 0 0 0 0 0 0 0 0 0 0 0 0 0 8 -8 8 -8 8 -8 11 -16 16 -16 24 -24 27 -32 35 -40 46 -51 56 -64 71 -79
40 -79 88 -99 107 -119 131 -146 161 -177 194 -216 236 -260 288 -318 351 -390 434 -484 542 -615
60 -615 700 -808 945 -1126 1381 -1762 2385 -3593 6700 -31158 -44202 50354 6406 3413
74 3413 56805 7795 -1297 31615 -20475 -15142 12738 -25864 -7755 25928 -5054 10403 32212
87 32212 2062 8876 24207 -6515 -2055 13835 -12734 -7411 12966 -13183 -8472 14914 -10983
100 -10983 -7131 15524 -12257 -6834 13083 -18453 -9218 10246 -23234 -8555 12128 -19651 -2427
113 -2427 14311 -16200 1649 11954 -16870 2870 10286 -14905 5974 10697 -11533 7344 9503
126 9503 -9797 7071 8173 -8305 7804 8503 -7885 6387 7187 -9042 4362 6869 -9393
$$ packed form
0@%%%%%%%%%%%%%%%%%%Qj6J6j6J6j6J9k7L2l2M0m8N1n9O7p5Q6r7J07j20J35j50
40g9J67j87K06k26K50k77L07l38L71m10M52m96N48o06O69p41Q24r18J026j157
60f15J315j508J753k071K507l143M147n978J0293l7858j3044R4556m3948k993
74C413N3392m9010r092L2912n2090N333K7880l8602J8109L3683l0982J5457K1809
87C2212l0150O814J5331l0722M460J5890k6569N323K0377k6149M711K3386k5897
100a0983L852K2655k7781N423J9917l1536R235J9464l3480J4679K0683l1779J7224
113b427J6738l0511J7849J0305k8824J9740P416k5191K0879M723k2230J8877K159
126I503j9300J6868J102j6478J6109O99j6388J4272Q00j6229J3404K507j6262
$$ plain form
139 -9393 3976 7098 -9163 3783 6448 -11159 2997 5619 -11952 4074 5432 -11682 5019
152 5019 4962 -11574 6118 3506 -10779 7178 2668 -9813 8442 2263 -9107 7913 911 -8467
166 -8467 7930 412 -7209 7638 -316 -6940 6237 -1310 -7373 5660 -1288 -6822 5626 -1035
180 -1035 -7122 5017 -1469 -7384 5148 -1424 -7010 6099 -1187 -6103 6585 -1093 -5389 7071
194 7071 -1258 -4332 8435 -843 -3319 8725 -1105 -2791 8767 -1022 -2211 8548 -1440 -1422 8090
209 8090 -1991 -1634 7243 -3246 -2347 6135 -3639 -2364 5269 -4259 -3146 4351 -4843 -3500 3626
224 3626 -5513 -3870 3693 -5618 -3440 3397 -6013 -2877 3915 -5411 -2239 4270 -5112 -1308 4784
239 4784 -4343 -332 5308 -4036 607 5570 -3344 1600 5794 -3285 2258 5567 -3211 2261 5361
$$ packed form
139i393J3369L122j6261J2946K665j7607J4156K622j7571J6026J358j7114J6701
152E019n7j6536J7692k612j4285J7957m510j2481J8255o179j1370J7020p002r378
166h467J6397p518p621J4847p954o624J3177p547o063J3033o948n534J2448o661
180a035o087J2139o486n915J2532o572n586J3109p286m916J2688p678m296J2460
194G071q329l074J2767r278k476J2044r830j686J1558r789j189J0759r988J8R512
209H090j0081L57Q877j0489Q99Q482r774J275P633r528J113P497r194J343P126
224C626r139J643P563r311K178O837r410L136O792r326L172O509r382L804O092
239D784r127M011N640r344M643M963q914M944M194r079N543L309q778N472L100
$$ plain form
254 5361 -2868 2224 4690 -3299 2295 4053 -3736 1740 3743 -3939 1704 3066 -4942 935 2257
269 2257 -5303 973 1600 -5396 951 1048 -5648 1111 1116 -5508 1051 954 -5033 1496 1425 -4815 1744 1160
287 1160 -4336 2117 1399 -4121 2282 1181 -3597 2786 1385 -3275 3085 1461 -2952 3578 1351
302 1351 -3110 3952 1040 -3083 3880 1175 -2686 3853 948 -2706 3953 729 -2553 3283 51
317 51 -2516 3228 -166 -2740 3305 -617 -2945 2733 -1053 -2879 2697 -919 -2754 2611 -1163 -2926
333 -2926 2381 -1881 -2899 2412 -1970 -2624 2534 -1881 -2396 2646 -1911 -2497 2681 -1766 -1946 2763
349 2763 -1646 -1385 3071 -1655 -893 3405 -1506 -620 3337 -1312 -288 3678 -1390 18 3643 -1283
365 -1283 91 3333 -1232 126 3209 -1255 149 3148 -1961 219 2638 -2104 -46 2360 -2325
$$ packed form
254E361q229N092K466p989N594J758p789N476K003p682N643J362q008N877J322
269B257p560O276O27o996O347R7o696O759No624O559r7n987O529p1o240O559n84
287A160n496O453p18n520O403j101m778O383j401m660O360j624m413O530k227
302A351m461P062k912m123O963k705l861O539k905l654O659l224l282N836l232
317E1k567N744l394k574O045l922k328N678l786j826N576l616j835N365l774j763
333b926N307m262j018N311m382o54N158m415n15N042m557n86N178m447j80M709
349B763m409K61M456m726P62M298m911Q86L957m649J024L966n068J408L625m926
365a283J374L242m565J358L083m464J404K999n109K180K419m742K058K406m685
$$ plain form
380 -2325 -486 2212 -2740 -465 1870 -3076 -289 1420 -2977 -484 1303 -2986 -387 1245 -3065
395 -3065 200 1245 -2941 10 1008 -2618 256 1066 -2511 654 1376 -2009 1247 1395 -1947 1274
411 1274 1855 -1895 1832 1891 -1604 1864 1777 -1550 1820 1736 -1705 1898 1439 -1690 1799 1320 -1710
428 -1710 1824 947 -1906 1625 547 -2123 1321 246 -2270 1159 -120 -2253 1128 -195 -2263
443 -2263 982 -530 -2472 1016 -589 -2007 1005 -681 -2029 1154 -581 -1854 1336 -473 -1737
458 -1737 1520 -239 -1565 1954 -10 -1004 2045 104 -705 2080 -55 -763 2020 -7 -791 2555
474 2555 96 -484 2149 -269 -564 2279 -702 -386 2004 -372 -427 1725 -963 -674 1571 -1213 -713
491 -713 1420 -1074 -748 821 -1357 -614 929 -1710 -846 803 -1627 -769 810 -1628 -530 914
$$ packed form
380b325J839K698m952K275K335m946K787J709m397K493J787m289K599J632m310
395c065L265J045m186K951R98l626K874Q10l577L165P22l385L256J48l342L221
411A274N81l750L727N9l495L468q7l327L370q4l441L603m59l129L489m79l030
428a710L534q77k853L531j078k670L444j075k516L429j279k133L381j323k068
443b263L245j512j942L488j605j418L012j686j348L183j735j273L190j809j264
458a737L257j759j326L519j964r94L049j941q09K785k135p08K783k027p84L346
474B555k459n80K633k418k95K843k981L16K390k376n5K152k688K89K245k784N00
491g13K133k494L26J569k178P43J543k639Q64J649k430Q58J579k438J098J444
$$ plain form
507 914 -1590 -552 1016 -1360 -401 1255 -1174 -137 1270 -1174 23 1379 -733 -27 1471 -946
523 -946 616 1506 -1111 791 1360 -789 854 1227 -823 1151 1233 -1020 903 1172 -1215 503 948
540 948 -923 630 478 -1517 493 407 -1312 354 287 -1354 248 127 -1612 94 -77 -1545 95
557 95 -166 -1627 195 145 -1823 367 -40 -1540 544 219 -1607 756 221 -1397 977 68 -1023
574 -1023 1052 328 -642 1343 256 -522 1401 230 -577 1198 58 -368 1179 280 -176 1368 91
591 91 -399 1121 117 -323 858 148 -711 1105 -414 -745 522 -306 -665 322 -402 -1020 670 -589
609 -589 -1053 559 -896 -638 600 -834 -1133 968 -1132 -467 644 -964 -351 752 -849 -256 677
626 677 -733 -56 688 -821 156 835 -399 123 1011 -414 65 1062 -352 510 1049 -323 153 1105
$$ packed form
507I14k504J038J568k376R59J656k429J037J407k444J197J356k112P06J498k417
523i46J562Q90k617J902N69k149J643L73k050J974Q2k253J923K69k387J718M45
540I48j871J553j52j995K010q6j719J666o7j641J602j21j739J706j71j468J640
557I5k61j461J822n0j968K190m07j500K084l25j826K363n35j618K374r09j091
574a023K075p24r70J985j087p78J923j171q07J775j140m26J547q99m56J544j277
591I1m90J520j004m40J181p10q59J816j519l31J267q28l59R87p24o18J690j259
609e89m64J612j455K58J238j434k99K101k100O65J111j608O13J103j601N93R33
626F77j410O77P44j509R77O79j234N22Q88j425M79R97j414Q62N39j372M76R52
$$ plain form
644 1105 -286 282 983 -303 238 946 -533 218 778 -617 214 441 -956 41 317 -782 -10 130
662 130 -1073 99 4 -963 52 259 -1094 -50 36 -836 -190 71 -814 -35 6 -748 409 620 -761
681 -761 277 377 -810 213 404 -411 543 709 -640 671 543 -326 785 467 -360 1047 609 -367
699 -367 649 496 -621 928 259 -391 619 97 -602 644 -141 -732 461 -150 -654 503 -349 -590
717 -590 371 -368 -618 28 -431 -719 335 -450 -885 -84 -142 -508 335 -479 -592 335 -332 -545 589 -244
737 -244 -270 578 29 -397 832 -245 -224 822 -35 219 857 182 96 708 -122 82 780 -320 95 664
757 664 -292 126 680 -190 70 449 -445 130 266 -320 -90 346 -623 33 240 -865 -373 115 -729 -501
777 -501 78 -797 -100 97 -693 -129 150 -581 -13 343 -618 -24 216 -84 220 306 -620 213 234 -420 347
$$ packed form
644A105j391N68P01j286N41P08j479P51N60j395Q31K27j397R97K76j099P72J40
662A30j203J172r5r67J015K07j353J044Q6q72O46K61q85P79M1p54J157K11j381
681g61J038J00j187J023J91q15R54J66j349J311j28q69J111l18q27J407m38r76
699c67J016j53j117J549o69o50J010n22o99J246p85n91J193o11n04J157q52k41
717e90R61p39k50O46m59k88J054p85m35Q01n8l66Q43q14j13R27o67k13J134q33
737b44k6Q48n49m26J229j077K1J046q57K54O38o75q6O12q30K04O98j100M15N69
757F64r56M18N54q70K60L79q94N75J36n86K30M36r69O56K07j105M92M88q44K28
777e01N79q75O97J97p90N64K79p31N68L56r61N94K40l00L04Q6r26Q33K1o54P67
$$ plain form
798 347 435 -163 425 487 9 531 307 -218 582 318 -175 487 449 -216 185 303 -374 559 513 -54 223 223
820 223 -346 268 -87 -616 205 44 -680 -198 -272 -601 272 -36 -725 58 -162 -836 -96 -153 -389 -66 -256
841 -256 -487 530 -219 -670 318 -1 -225 500 -82 66 372 47 -115 511 16 118 779 185 -121 709
861 709 24 1 478 13 194 581 -69 -82 557 -269 300 503 37 -66 270 -80 114 -6 -396 -328 287
882 287 -592 -172 170 -293 -261 -18 -540 -446 282 -479 -167 -21 -217 -11 125 -289 183 161 -329 134 476
903 476 -20 -101 340 -282 210 264 -153 207 263 121 346 132 28 270 449 -117 439 254 -22 277 381
924 381 -66 65 607 -207 -141 378 -336 140 -114 -172 147 -1 -225 -107 -148 -412 70 -122 -545 -130 -85 -537
946 -537 -30 -100 -365 -171 141 -361 -71 -6 -257 75 39 -242 341 9 -315 396 -41 38 499 5 -432 407
$$ packed form
798C47Q8n98N88O2m78N22k24n25Q00k64m93O62l8o65M01J18o77R33m6n67K77%
820B23n69O14l55n29Q21j61p24M82p4l29Q73l08o89P83k20o74P40n7k36L23j90
841b56k31J017p49m51R88l19k24P25n82J48L06l25j62O26m95J02O61n94l06Q30
861G09o85k3M77m65J81L87o50j3O39q26N69K03m66j03L36l50J94j20l90O8O15
882B87q79M20L42m63L2K43n22R4P28p61L12J46j96K06J36m14M72k2m90M63L42
903D76m96q1M41o22M92N4m17L60N6j42K25k14j04K42J79n66N56j85k76K99J04
924C81m47J31N42q14O6N19p14M76k54n8L19j48k24J18m1k64M82j92m23M15M5m52
946e37N07p0k65J94L12n02K90O5k51L32l6k81N83l32l24P11m37P9M61m94m37Q39
$$ plain form
968 407 229 -162 353 261 318 579 191 -82 336 -15 99 532 31 -306 291 74 -130 262 36 -216 51
989 51 -327 -98 181 34 -159 102 -396 -225 -68 -319 -131 1 -305 -424 -29 -207 -381 97 -293 -324 256
1010 256 -27 -52 332 -37 -229 499 -128 107 246 -264 91 476 -36 129 412 -25 333 346 145 196 53
1031 53 -128 203 126 -25 73 126 9 143 0 -393 285 33 -71 -224 93 -219 59 83 -485 -49 -148 -383
1053 -383 -510 -147 32 -8 52 -256 53 -70 -153 -26 -12 -261 90 66 -59 116 -65 -288 89 108 -106 230
1075 230 38 105 331 175 -25 444 148 -72 216 -261 -33 338 198 73 225 146 -140 78 188 -53 -142
1096 -142 -133 -174 266 -118 -153 122 -199 -231 -24 54 -228 69 -150 -182 51 -350 61 -52 -139 -298 -27 -58 -311
1119 -311 136 -113 -67 -44 -99 -147 400 -2 0 182 93 -85 165 -32 58 233 80 -17 218 138 331 288 -10 129
$$ packed form
968D07j78l91N15r2N7K61l88k73M18l51J14M33n01l37N97k17k04L92k26k52K67
989E1l78K29K79j47j93K61m98J71J57k51J88J32l06j19L95j78j74M78l90l1N80
1010B56k83k5L84l69j92P28o27K35J39n10L55L85n12J65K83m37L58J3k01N1j43
1031E3j81L31p7j51R8N3j17J34j43l93O78k52j04j53L17l12K78K4n68M36r9k35
1053c83j27L63J79m0O0l08L09j23q3J27J4k49L51k4j25J75j81k23L77J9k14L36
1075B30j92O7K26j56k00M69k96k20K88m77K28L71j40j25J52p9k86K18J10k41q9
1096a42Rm1M40l84l5K75l21l2K07P8k82K97k19l2K33m01M11j13q7j59K71l1k53
1119c11M47k49M6K3n5m8N47m02KJ82q9j78K50j97R0J75j53r7K35q0J93m3k98J39
$$ plain form
1143 129 167 -129 37 233 -216 -71 164 52 269 210 -304 -226 140 -233 -105 65 -410 -193 110 -273 -170
1164 -170 2 -205 168 -176 -126 68 -94 -91 83 -150 -257 -95 47 5 -76 91 -2 143 109 -124 73 156 -156
1187 -156 177 111 10 118 127 87 371 46 19 121 114 142 340 -75 -59 -77 -57 -167 257 -100 103 -128 -78 -129
1211 -129 -8 122 3 -109 -14 -193 -28 -187 -122 -160 -121 -324 5 -70 142 -48 -19 -155 -106 -120 -88 191 13
1234 13 38 -99 -134 -289 301 -2 -181 136 104 -41 194 54 114 88 267 28 350 73 214 121 8 37 61
1257 61 -109 8 21 -20 -190 66 133 -120 -66 -128 -184 -188 -44 13 127 211 -60 -65 -2 -336 213 38 -211 -72 -308
1282 -308 -131 -359 -211 -9 99 59 -109 49 -160 -211 251 -49 237 -103 -154 -212 121 -50 50 204 34
1303 34 229 217 -109 159 137 -102 230 76 -30 51 215 -167 202 185 115 -127 -201 -280 16 -52 1 -67 -87 65
$$ packed form
1143A29L8k96J66J96m49J45K35j12K17n9n14P8L66l73J28J70m75K17L03l83J03
1164a70J72k07L73l44N0J94j62LJ74k33j07J62J42m2q1J67r3J45l4k33J97Q3l12
1187a56L33o6j01J08Rm0K84l25k7J02pK8J98m15J6j8K0j10M24l57K03k31N0n1
1211a29J21J30j19j12R5j79J65j59O5l8L9k03L29p5K12j90K9j36M9j4L2K79j78
1234A3K5j37l5j55N90l03j79L17l2j45K35j40O0k6J79k39L22k77J41r3j13K9K4
1257F1j70J17J3m1j70K56O7k53N4o2n6mJ44N7J14Q4k71nO3l34N49j75k49J39k36
1282c08J77k28J48K02J08m0j68J58k09n1M62l00K86l40n1n8L33j71J00J54j70
1303C4J95j2l26K68k2k39L32j54j06Q1J64l82L69j7p0k42p4p9K96o8N3o8k0J52
$$ plain form
1327 65 -23 -266 -92 -161 -315 -217 -57 -101 -4 -309 167 152 -29 -108 -147 -114 135 -23 38 -246 -260 224 -123 3
1351 3 258 183 -202 191 -206 15 283 -105 188 272 -63 -109 218 149 -133 122 27 99 47 13 -84 -65 -279 -82
1375 -82 -14 -238 -174 154 -87 -74 -124 16 -287 -113 -170 101 122 -309 -166 -97 -131 -173 198 -184 53 51 -82 178
1399 178 -210 -240 -16 165 -92 -12 278 -67 148 114 -11 76 -59 -86 158 105 102 177 -19 72 216 99 217
1422 217 85 222 27 -162 382 213 5 178 -93 176 -207 -148 28 -191 42 26 5 -7 68 126 96 -150
1444 -150 -209 -99 -176 -17 -267 -287 -265 -323 -58 -237 117 161 195 149 308 200 124 28 78 158 200 203 -331 171 -79
1469 -79 -72 -37 -22 82 -136 88 50 -81 85 -56 211 60 26 -134 106 -56 -1 165 158 -120 -124 -115 -230 32 -80
1494 -80 -59 0 198 -71 -310 110 37 68 -66 127 -100 -121 -54 9 -95 16 -231 77 52 -7 171 -150 31
$$ packed form
1327F5q8k43J74o9j54R8J60m4R7l05M76j5j81p9l9L3K49j58O1k84j4M84l47J26
1351CK55p5l85L93l97K21K68l88K93Q4l35m6L27o9k82K55r5P2n2l4r7J9k14J97
1375h2O8k24O4L28k41J3n0J40l03J74n7K71K1m31J43O9l4m2L71l82K37kj33K60
1399A78l88l0K24J81k57Q0K90l45K15l4j25Q7j35k7K44n3lP5j96R1J44j17J18
1422B17j32J37j95j89N44j69k08J73k71K69l83N9J76k19K33j6k1j2P5N8l0k46
1444a50n9J10p7J59k50k0K2n8K65j79L54M4L4m6J59j08p6r6N0Q0M2Ln34N02k50
1469g9PL5J5J04k18K24l8j31J66j41K67j51l4j60K40j62N5J66pk78mRj15K62j12
1494h0K1N9J98k69k39M20p3L1j34J93k27k1O7O3j04J11k47L08k5n9J78l21J81
$$ plain form
1517 31 -118 316 -55 326 15 -135 121 49 -102 16 105 334 -73 41 28 -18 234 95 -7 -198 161 331
1539 331 125 69 -240 96 -2 -57 91 14 -34 -290 -246 89 42 -81 25 -27 -44 -221 -37 -89 -124 -34 -30 -65 96
1564 96 -260 -45 250 -56 -173 -96 -99 37 363 -307 -89 2 113 69 22 -149 -172 -250 -76 64 188 124 83 155
1588 155 -125 310 66 -110 -30 4 51 -39 -139 16 118 -37 69 -126 -177 122 -70 74 -71 -86 -65 -44 -53
1611 -53 -42 28 91 11 191 17 -50 -156 -1 -40 -6 307 107 -27 -12 53 -109 -99 117 -91 -12 -48 126 70 50
1636 50 46 -184 16 51 -121 144 12 42 147 -20 -298 153 -1 -17 -60 -16 -96 -39 -223 -12 192 232 202 -124
1660 -124 218 87 -242 54 -35 -212 -117 -333 25 -30 22 44 -46 86 -53 -69 -169 -106 25 -51 -13 19 209 -151
1684 -151 -22 240 -61 266 126 59 176 108 107 -17 -49 310 112 97 82 11 -118 107 173 -190 -57 -158 -74
$$ packed form
1517C1j49M34l71L81l11j50K56p2j51J18Q9K29m07J14j3m6K52j39j02j91L59J70
1539C31k06n6l09L36r8n5J48p7m8k56M4L35m7j23J06n2j7j77J84n2l5R0Ml5J61
1564I6l56K15K95l06j17P7lJ36L26o70K18R1J11m4m7j71k3p8J74J40J24o4m1P2
1588A55k80M35k44j76Q0L4M7r0j00J55J02j55J06j95n1K99j92J44j45j5K1K1r
1611e3J1P0O3q0J80j74o7j06J55l9L4L13k00j34J5O5j62J0K16k08P9l6J74n6k0
1636E0mk30K00L5j72K65j32L0J05j67k78M51j54j6m3M4q0N7j84K11K04M0l0l26
1660a24L42j31l29K96q9j77R5k16L58n5N2K2r0J32j39j6j00O3J31p6L8L2J90l60
1684a51J29K62l01L27j40o7J17o8jj24l2L59j98j5j5p1j29K25O6l63J33j01Q4
$$ plain form
1707 -74 -152 -18 93 -22 -32 -4 -204 46 80 120 -25 -177 -68 -40 -29 254 -180 -249 -49 -283 175 41 66
1730 66 -195 -159 -153 12 -306 111 124 -112 100 24 -160 187 -23 25 133 178 -196 263 70 -206 53 -237 -38
1753 -38 134 33 236 -157 -96 -29 -83 -163 -122 333 -54 -93 149 -51 3 267 -108 -96 -295 99 -93 -161 -24
1776 -24 16 -85 -294 33 -187 -85 95 72 -115 134 -92 123 42 -113 -159 44 77 98 38 -109 -114 -118 55 127
1800 127 44 -191 -76 213 133 84 76 149 132 -203 -4 -142 13 -14 -95 31 -141 7 93 295 -184 21 3 -185
1824 -185 196 157 -59 -88 136 -58 -37 -110 28 211 -107 -53 198 -204 67 -190 -180 2 10 -113 0 -100 -60
1847 -60 -111 -264 138 265 52 29 133 67 -142 16 -96 82 150 -215 112 -102 160 339 15 42 114 -173
1869 -173 158 -225 -55 -67 -133 -10 55 -338 215 -155 88 -179 -41 -3 -7 -58 -127 160 -110 21 -58 80 -51
$$ packed form
1707g4p8J34J11j15j0K8k00K50L4M0j45j52J09K8J1K83m34o9K00k34M58j34K5
1730F6k61L6OJ65l18M17J3k36K12p6j84L47k10M8J08M5l74M59j93k76K59k90J99
1753c8J72j01K03l93O1O7n4q0M1M55l87l9K42k00N4K64l75J2j99L94j92o8J37
1776b4M0j01k09L27k20J02J80k3j87K49k26K15q1j55m6K03L3K1o0j47nmJ73P2
1800A27q3k35J15K89q0m9qP3j7l35J99j38J55k7q1J26j72J48Q6K02m79K05j8j88
1824a85L81l9k16k9K24j94K1p3J38J83l18N4K51m02K71k57J0J82Qj23J13j00M0
1847f0n1j53M02J27k13k3J04o6k09J58j12J78O8l65L27k14K62J79l24K7P2k87
1869a73L31l83J70j2o6J23O5l93N53l70K43k67J38L8mn1o9K87k70J31p9J38j31
$$ plain form
1892 -51 -82 141 -42 142 -109 -87 190 -29 43 136 57 -114 -38 39 178 276 23 45 -102 161 -204 54 198
1915 198 -22 204 -29 13 -22 -172 104 37 -289 -162 60 62 59 103 137 -135 -119 -141 -82 -69 160 -77 -124 -91 -70
1940 -70 95 252 -29 73 -65 35 73 17 167 -80 -112 288 190 94 81 172 -103 36 -30 101 222 -94 -147
1963 -147 30 71 3 -53 -164 -57 125 94 -59 -98 312 -39 -175 -66 -124 -14 124 44 -67 248 -14 41 -159
1986 -159 57 391 16 205 -1 -83 -14 -238 -142 -2 -209 5 -90 -66 -78 -37 164 -94 -21 170 -129 221 108
2009 108 -136 -299 -6 164 83 -40 -166 49 164 33 -49 120 -102 227 -40 -9 33 -23 233 45 76 -105
2031 -105 171 -85 137 38 -143 -225 -26 -57 208 24 44 -168 -139 -19 258 50 47 89 17 73 218 -123 -239
2054 -239 -15 -168 229 45 311 -74 206 -261 63 136 35 -183 -157 -15 100 -122 -161 260 133 -176 19
$$ packed form
1892e1l1K23j83J84k51K2K77k19P2R3p9j71P6P7J39R8k53K2j47K63l65K58J44
1915A98k20K26k33M2l5j50K76o7l26J27K22KlM4L4k72J6k2N9J3K29k37m7L3K1
1940g0J65J57k81J02j38J00L8n6J50k47l2M00r8r6j3R1k75J39o6J31J21l16n3
1963a47J77M1o8n6j11J07J82l1j53l9M10l51j36J09n8J10J38q0j11L15k62N5k00
1986a59K16L34l75J89k06q2O9k24R6J40k07K14r5K4j2M1K01k58P3J91k99L50j13
2009A08k44j63K93J70q1j23j26K15J15j31q2J69k22L29k67L1M2n6K56j88L1j81
2031a05K76k56K22r9j81q2J99l1K65j84K0k12K9J20K77k08lM2p2N6J45l41j16
2054b39K24j53L97j84K66l85K80m67L24P3j01k18K6J42J15k22l9M21j27l09J95
$$ plain form
2075 19 -108 -11 -60 -5 265 -203 -121 -161 -114 69 -39 -116 53 -235 107 165 -139 -114 296 -160 30 25 -371 -76
2099 -76 -60 10 112 -95 -5 -23 299 194 -2 122 21 100 200 -90 23 -191 155 -61 13 -13 -11 38 -97 -98
2123 -98 71 -139 72 182 -31 -4 97 -25 -78 44 100 -90 -35 -193 190 7 -152 215 13 -30 -208 164
2145 164 93 34 -71 -140 88 82 -48 213 242 201 -47 31 -37 21 -46 58 22 -4 -42 66 6 -89 59 -27 40 -94
2171 -94 -98 248 219 6 -1 -61 -19 -231 28 56 119 98 101 33 77 18 108 189 210 117 -304 -56 -210 -33 -18 164 256
2198 256 44 54 144 -27 111 -116 47 178 -52 12 -179 43 -122 -110 74 93 121 27 -106 -8 -12 -99 227 88
2222 88 -178 -2 74 -39 -12 33 -105 50 52 106 145 -148 273 110 -189 43 -120 -51 78 116 215 57 -17 84
2246 84 -88 -24 -75 -150 -30 -351 -144 130 -9 -22 58 -118 3 -105 -80 -157 -25 -134 -46 85 86 41 -60 -10
$$ packed form
2075A9j27R7m9N5K70m68Q2m0M7J83j08p7J69k88L42N8l04K5M10m56J90nl96K95
2099g6J6P0J02k07R0j8L22j05j96J24j01P9J00k90J13k14L46k16P4k6KM9j35j
2123i8J69k10K11J10k13K7J01j22n3J22N6j90N5j58L83j83j59L67k02m3j78L72
2145A64p1n9j05o9K28oj30K61K9m1k48P8o8N8o7J04l6k6l8J08o0r5J48q6O7j34
2171i4mL46k9k13po0M2k12K59K8O3k1Lo8M4n9R0Q1K1r3m21K48j54J77J5J82R2
2198B56k12J0R0j71J38k27J63J31k30O4j91K22j65J2J84J9K8r4j33R8mq7L26j39
2222H8k66J76P6j13K7M5j38J55KN4L9k93M21j63k99K32j63O9J29L8R9j58p4J01
2246H4j72O4n1p5J20l21K07K74j39j3Q0j76J21j08K5p7J32j09Q8J31Jm5j01N0
$$ plain form
2270 -10 -46 0 -136 -233 -9 313 -307 -69 -152 -110 135 -59 -65 28 -148 -320 -46 -77 -168 176 -3 -43 -83 -291
2294 -291 -3 -105 94 150 -196 -112 158 -4 94 -42 -77 53 69 -18 -282 76 5 -75 165 127 -35 -195 4
2317 4 -32 -57 271 227 13 -21 -230 -189 -97 -60 10 -129 36 28 -26 52 -142 128 -16 -187 121 -221 160 -111 -127
2342 -127 154 169 264 -13 94 -33 -9 -10 2 -187 18 88 4 -167 -54 12 -92 -103 -61 131 -79 -160 -351 -35
2366 -35 -224 -334 -45 140 -234 122 -62 -28 -73 115 68 60 28 -29 259 96 -51 140 -73 -66 -7 -98 -48 93
2390 93 61 40 -125 117 -99 28 -164 -7 41 168 -198 -90 -78 107 -37 -220 -216 -190 272 97 46 -55 -201
2413 -201 193 -60 92 1 -303 -35 27 -113 -98 91 378 163 103 53 -118 -31 45 52 -250 -35 30 183 117 -126
2437 -126 32 10 172 76 128 64 -86 -12 -65 19 90 -167 105 70 99 3 161 -194 -1 187 8 126 -112 108
$$ packed form
2270a0l6M6j36r7K24L22o20K38q3M2K45j94oR3j76j72K74l1r1L44j79m0m0k08
2294b91K88j02J99N6l46Q4K70j62R8j36l5J30J6q7k64L58p1q0K40l8j62j60J99
2317Dl6k5L28m4k14l4k09M1R2L7P0j39J65qn4P8j94K70j44j71L08l42L81k71j6
2342a27K81J5R5k77J07j27K4jJ2j89K05P0q4j71J13O6j04j1M2J92k10q1j91L16
2366c5j89j10K89J85l74L56j84L4m5J88m7ql2n7K88j63j47J91k13PN9r1N0J41
2390I3l2k1j65K42k16J27j92J57M8J27l66J08J2J85j44j83MK6M62j75n1j01j46
2413b01L94k53J52r1l04K68O2j40J5J89K87k15o0n0j71Q7P6Pl02K15O5J53o6k43
2437a26J58k2J62r6N2o4j50P4n3Q4P1k57K72l5K9r6J58l55J93J88j79J18k38K20
$$ plain form
2461 108 -59 -18 142 168 28 -126 10 262 -246 118 -54 245 29 7 112 -61 66 101 19 74 -97 -73
2483 -73 61 199 51 -89 191 71 44 -139 38 -165 21 197 64 57 -110 -209 40 -14 -131 -39 2 -175 -120
2506 -120 -208 31 64 0 142 60 -128 -220 -93 78 10 -80 -4 135 -69 80 9 -31 -110 60 -5 80 109 48 180
2531 180 171 -172 108 -29 59 12 63 92 -84 -33 -4 -17 -61 -12 163 -237 -122 -5 -148 51 112 -12 -125 8
2555 8 -72 6 -20 1 -98 -53 -70 84 35 389 204 164 10 85 -309 170 -104 -182 -115 84 -18 -49 -17 58 209 -51
2581 -51 73 141 -2 -66 24 55 -97 -4 -135 -291 -77 87 158 -7 153 19 -13 -4 110 -105 -73 -10 -111 33
2605 33 81 247 -140 -66 250 6 81 9 2 -148 -109 98 264 56 50 107 -121 77 -133 110 184 113 179 82 189
2630 189 -85 -75 -327 243 -82 -97 -11 -39 -117 -244 -14 -26 23 4 14 194 -99 91 111 38 80 29 205 -60
$$ packed form
2461A08j67M1J60K6j40j54J36K52n08L64j72K99k16k2J05j73J27L5q2N5j71K4
2483g3J34J38j48j40K80j20k7j83J77k03J86J76j33pj67r9K49n4j17R2M1j77N5
2506a20q8K39L3o4J42q2j88r2J27J71o8r0P6J39k04J49p1m0p9J70o5Q5K9o1J32
2531A80rl43K80j37Q8m7N1K9j76N1K9j3m4M9J75m00J15J17j43J99O1j24j13J33
2555Hq0P8k6K1r9M5j7J54m9L54j85m0j54P5l94M79k74p8O7J99j02l1L2P5J51k60
2581e1J24O8j43o4R0L1j52R3j31j56K14J64P1j65J60j34l2RJ14k15L2O3j01J44
2605C3M8J66l87P4L16k44P5p2pj50L9K07J66k08oN7k28J98k10K43P4p1O6r7J07
2630A89k74J0k52N70l25j5Q6k8p8j27K30j2M9j9J0J80k93J90K0p3M2n1J76k65
$$ plain form
2654 -60 -52 -184 12 34 122 -62 94 -149 -245 44 303 -75 35 -71 67 284 14 -181 -85 129 64 -210 -145
2677 -145 20 1 68 157 262 -34 -15 52 -91 119 -86 -70 150 -17 -173 38 -52 267 -265 -156 41 -271
2699 -271 -199 -79 159 -105 -2 38 -119 112 -18 -55 282 23 -179 -214 72 -33 -51 -12 65 -129 22 -142
2721 -142 121 23 -31 -28 206 115 -282 71 -276 -16 -130 -68 187 -56 -22 83 -5 -31 -18 141 -46 83 117 1
2745 1 231 -85 -13 -39 -143 -54 -111 26 -32 -120 -61 108 0 -15 -7 -133 -317 88 -26 -146 -128 -217 -2 -217 -154
2770 -154 -127 57 108 5 -83 131 -179 57 12 -176 17 -83 -126 158 11 -77 -84 -51 230 174 -24 -89 89 154
2794 154 110 -37 -288 -85 145 -60 19 164 4 128 7 -148 -22 -49 -190 -117 -90 -22 -54 -168 108 59 78
2817 78 49 -144 -213 -51 151 -77 -76 -98 -56 -139 158 62 200 -123 235 123 120 103 -7 -27 38 -93 -29 -98 90
$$ packed form
2654f0Qj32J96K2Q8j84J56k43r6K89K59l78J10j06J38K17k70j95R6K14o5k74O5
2677a45J65j9O7Q9J05k96J9O7j43K10k05J6K20j67j56K11r0L19n32J09J97l12
2699b71P2J20K38k64J03M0j57K31j30l7L37k59k02l5K86j05j8L9P7j94J51j64
2721a42K63r8n4LK34r1l97L53l47K60j14O2K55k43L4J05q8k6J3J59j87J29L4j16
2745AK30l16P2k6j04Q9n7J37n8q8N9J69j08j5Qj26j84M05j14j20J8q9K15k15O3
2770a54K7J84N1j03q8K14l10K36m5j88J93j00m3K84j47q8pL3K81n6j98o5J78O5
2794A54m4j47k51K03K30k05P9J45j60J24j21j55J26k7j41P3K7O8l2j14K76m9J9
2817G8k9j93o9J62K02k28Jk2M2q3K97r6J38l23L58j12lj7j10k0O5j31O4o9J88
$$ plain form
2842 90 -57 -144 64 -30 187 112 28 98 63 -17 117 -129 155 -129 228 31 104 43 -297 -70 120 80 152 -198
2866 -198 305 40 -55 254 -80 -29 79 -32 196 -174 -56 -22 75 28 38 119 -187 229 -111 -330 89 -63
2888 -63 8 -172 295 -150 -136 32 26 35 116 115 78 318 36 -142 59 209 -39 -56 84 30 -36 -166 95 -3 -333
2913 -333 -42 293 -83 -184 150 -201 2 -32 -180 92 9 -32 37 -209 -5 62 69 -107 59 13 117 71 231
2936 231 -197 224 99 220 32 31 0 -156 -123 -71 59 -32 5 -131 44 -74 97 -18 37 -34 -61 64 -50
2959 -50 -85 -66 -62 -132 105 -103 76 -106 -72 47 -85 -148 -41 107 -237 52 -90 -139 13 -6 27 -97 0 27
2983 27 77 -50 154 61 -23 -175 45 65 -135 50 -50 -16 -117 1 -84 -7 -12 -10 5 19 -30 -207 51 144 -256
3008 -256 -81 -13 -47 -171 -95 -82 -43 -53 64 -2 85 -94 -131 215 100 -332 51 -35 30 135 -116 137 -151 209
$$ packed form
2842I0j47q7K08r4K17p5q4P0l5q0J34k46K84k84L57j97P3o1l40K27J90m0P2l50
2866a98N03k65r5L09l34N1J08j11K28l70J18L4R7m7J0Q1l06M16l40k19M19j52
2888f3P1j80M67m45J4J68oRQ1jl7K40k82j78K01J50k48j7J40n4o6j30K61r8l30
2913c33K91L35l76j01L34l51K03l4j48K72q3m1O9k46K04O7Pj76J66m6J04m6J60
2936B31m28M21j25J21j88jl1j56L3N2J30r1L7j36J75j18J71j15N5p1k7J25j14
2959e0l5J9Mp0K37k08J79j82L4J19j32o3J07J48l44K89j42m9J52j9L3j24R7K7
2983B7N0j27K04r3q4j52K20K0k00J85j00L4j01J18q5P7nKJ5J4m9j77K58R3m00
3008b56J75O8l4j24P6J3L9j0J17o6Q7j79l7L46j15m32L83q6O5J05k51K53k88L60
$$ plain form
3032 209 -218 -28 -223 76 25 -63 312 15 -97 -22 -234 -57 -205 15 -29 32 -138 96 212 -104 -179 -146
3054 -146 171 -200 191 195 -166 37 -91 130 34 102 27 -145 235 -104 259 -5 -87 134 -70 241 108 2
3076 2 44 -202 -28 57 -69 -189 153 9 -174 -184 -18 -25 136 -111 89 -146 -95 -36 61 48 -111 -24 -161 -55
3100 -55 102 56 188 167 30 225 -113 -59 138 134 -178 -107 125 89 -249 209 -6 -191 -157 10 120 135 -104
3123 -104 -304 -284 -318 19 13 -39 -149 207 38 28 122 2 21 7 -4 -130 191 153 209 44 6 285 73 -38
3147 -38 9 162 8 -94 -126 34 -103 -134 -77 -145 -117 38 20 11 150 103 265 114 219 116 20 81 -92 -21 202
3172 202 32 -39 115 -151 23 -157 -35 -211 42 -20 -81 44 178 -2 25 -3 -126 -27 -122 5 195 83
3194 83 166 203 -28 -182 154 -78 164 112 68 125 42 317 -143 108 46 118 -213 3 297 -44 -141 -106 81 40
$$ packed form
3032B09m27J90j95K99n1q8L75k97j12P5k12J77j48K20m4O1j70K34J16l16p5L3
3054a46L17l71L91Ml61K03j28K21r6O8p5j72L80l39L63k64q2K21k04L11j33j06
3076BM2k46J74Q5j26j20L42j44j83j0J66pJ61k47K00k35N1N9R7j3j59Q7j37J06
3100e5J57m6J32k1j37J95l38N4J97ml12P1K32l6l38M58k15j85L4J67J10J5k39
3123a04k00K0l4L37on2j10L56j69j0R4j20J9j4j1j26L21l8N6j65l8K79k12j11
3147c8M7J53j54j02l2J60j37l1N7o8K8J55j8rJ39m7J62j51J05j03r6O1j73P1K23
3172B02j70p1J54k66J74j80J22j76K53o2o1J25J34j80K7k8j23R9r5J27J90j12
3194H3Q3L7k31j54L36k32K42n2m4N7q3K75m60K51o2P2l31K16K94l41r7L5J87m1
$$ plain form
3218 40 282 47 -25 -22 153 -166 -54 -184 18 -54 73 105 -126 8 39 -274 122 96 49 -22 167 -5 21 129
3242 129 126 -35 -80 132 -31 103 -71 7 2 -197 -35 -70 -135 68 -56 125 -111 -139 -250 40 -56 66 -96
3265 -96 -129 -24 -53 27 -10 -118 -103 -16 -79 -175 -245 -76 51 74 -49 -205 272 -44 189 -226 164 1 -60 -36
3289 -36 -158 -11 -14 49 -67 145 250 218 128 7 202 46 81 207 -85 -3 -38 47 -87 7 237 120 -34 49
3313 49 97 89 26 -276 -130 183 -233 219 -9 -255 -52 305 -4 -181 -35 -60 -70 83 91 -98 42 227 -17
3336 -17 -305 122 3 27 23 128 87 -29 -138 178 55 -14 96 14 144 -244 -182 253 -138 7 -157 -312 -69
3359 -69 84 -77 -14 -163 -213 154 109 135 -23 135 38 -95 -156 216 -201 96 -4 36 -63 37 107 -168 99
3382 99 196 -15 -17 134 22 -55 131 -175 208 -175 -148 80 -213 -19 3 117 -12 156 271 -161 -77 63 -70
$$ packed form
3218D0K42k35p2LJ75l19J12j30K02p2J27L2k31J34L1l13L96k6m7p1J89j72K6J08
3242A29lj61m5K12j63J34j74P8nj99J62l5o5K03j24J81k36k8j11K90r6J22j62
3265i6l3J05k9Q0l7j08J5Q7o3r6p0J69J27K3j23j56M77l16K33m15L90j63o1K4
3289c6j22J47lO3j16K12J05l2r0j21J95j56L5J26k92Q2l5Q5j34R4K30j17j54Q3
3313D9M8qo3l02J46L13m16M52k28k46K03L57l09j77J46k5j0J53Qj89J40J85k44
3336a7k88M27j19K4mJ05m1j16j09L16j23o9J10q2J30l88O2M35l91J45j64j55K43
3359f9J53j61O3j49n0L67m5K6j58J58r7j33o1L72m17K97j00M0r9J00P0k75K67
3382I9R7k11kJ51j12p7J86l06L83l83K7K28k93J94K2J14j29J68J15m32Q4J40j33
$$ plain form
3405 -70 8 159 122 -45 -54 74 -55 -216 -150 31 -91 122 28 -46 89 -24 -88 121 75 11 231 267 -86 92
3429 92 37 -2 210 38 70 328 -28 -97 -292 7 -132 -108 139 -46 -24 47 -70 -64 207 -226 -9 -66 -11 120
3453 120 236 -91 9 48 68 -11 84 42 -119 0 16 456 274 -20 -58 -212 -10 -57 -93 -141 45 4 147 -84
3477 -84 -102 -154 146 -55 -28 -19 -22 9 87 -52 44 49 33 -191 -139 -143 17 6 50 47 110 -154 171 21 104 162 243 -193
3505 -193 5 -30 -114 158 77 68 97 321 103 56 160 64 -10 75 149 245 -39 78 -1 105 86 136 -126 112 5
3530 5 141 99 21 -84 161 66 24 -30 -10 -13 68 -17 191 -83 -157 90 -80 311 321 21 47 -218 99 2 -177
3555 -177 -104 195 83 -101 -92 -187 -109 56 160 112 57 -29 241 -88 -303 94 46 -202 -78 -90 -238 -125 72
3578 72 42 -68 210 92 -86 -133 343 -69 -108 11 -122 106 -52 -129 -181 -53 4 154 25 -70 -246 6 -155
$$ packed form
3405g0P8J51l7j67rJ28j29j61O6J81j22K13r4p4J35j13o4K09m6o4K20L6l53J78
3429I2n5l9K12j72L2K58l56o9j95K99j39K4K47j85K2P1j17OK71m33K17n7N5J31
3453A20J16l27J00L9K0p9R5m2j61J19J6M40j82k94l8j54K02m7l6m8J86m1J43k31
3477h4j8n2L00k01K7RlL1P8j39R6Nj6k24N2mJ60j1M4lO3k64L25j50Q3N8Q1m36
3505a93J98l5q4K72q1rK9K24k18m7J04r6p4Q5P4R6k84J17p9J06j9N0k62K38j07
3530EJ36m2p8j05K45r5m2n4K0lQ1q5K08k74p4K47j70L91J0l00K6k65L17r7j79
3555a77P3K99j12j84Rr5P8J65J04m8n5q6K70l29k15L97m8k48J24j2j48J13J97
3578G2l0j10K78j18j78m7M76m12l9J19j33K28j58p7n2J28N7J50j29r5j76K52j61
$$ plain form
3601 -155 -64 108 -244 66 -17 33 -27 -260 124 131 224 -93 -74 -145 -208 200 -81 -112 47 133 68 -49 -31 -61 102
3626 102 19 -183 81 195 42 162 -35 70 128 -44 38 -87 -172 -24 -22 116 -46 -407 52 -108 193 -36
3648 -36 -176 -44 -147 8 63 19 268 -170 141 -343 -46 -109 38 223 -22 -206 2 -126 -46 62 190 -99
3670 -99 74 -5 139 -187 -294 289 70 33 -20 -67 146 -80 -195 -79 -33 -135 -89 -54 -44 1 288 193 -87 122
3694 122 -61 -139 96 -70 -138 -133 -112 146 129 0 -91 34 31 122 -192 -27 -31 -281 241 -105 42 -13 7 117 36
3719 36 -175 -31 -131 175 -22 95 110 -58 -177 71 -145 -218 45 -210 284 -6 -192 131 306 -90 -160
3740 -160 75 -32 -355 -145 -33 -27 357 37 10 174 -99 166 9 1 -72 85 -247 5 153 -59 -47 47 202
3763 202 9 -62 -135 -89 210 -55 96 -45 123 -227 -47 -31 4 -219 2 -280 -16 18 33 91 56 89 31 39
$$ packed form
3601a55R1J72l52L10q3N0o0k33L84PR3l17J9p1o3M08k81l1J59Q6o5j17J8l0J63
3626A02q3k02K64J14j53J20j97J05N8j72Q2j25q5J48KJ38j62l61M59j60L01k29
3648c6j40J32j03J55N5m4K49m38L11m84K97o3J47J85k45j84K08j28Q0J08J28k89
3670i9J73p9J44l26j07N83k19l7n3m7K13k26j15J16M6j02M6L5J0M5K87r5k80K09
3694A22j83p8K35j66o8NK1K58j7j29r1J25lR1l14J65mk50N22l46J47n5K0J10q1
3719C6k11J44j00L06j97J17J5j68j19K48k16p3K63k55M94k90j86L23J75l96p0
3740a60K35j07l23K10J12OL84l20k7J64k73K65j57qp3J57l32K52J48k12J2R4J55
3763B02j93p1p3M6K99k65J51j41J68l50J80J6L5k23K21k82K64L4J5N8l5L3n8Q
$$ plain form
3787 39 31 75 -96 98 -126 81 -4 187 115 59 -269 -21 -42 -18 -36 -102 325 -7 85 -153 118 -44 74 71 17
3812 17 105 47 -29 36 94 -154 -84 -139 13 -132 45 -9 180 144 -45 96 106 232 -36 -6 -205 -76 180 110
3836 110 -158 -144 5 78 -114 -195 193 -33 21 136 -209 0 -147 -39 26 248 27 57 31 157 61 72 257
3859 257 152 41 34 14 174 -2 122 198 44 76 -83 127 -43 -107 -35 56 44 179 -1 149 55 146 73 -97
3883 -97 96 38 -242 -13 -98 100 205 -106 108 -85 -25 -102 216 107 -20 -254 33 -46 -59 206 -37 -14 -19
3906 -19 116 -82 -315 -92 80 57 -91 -112 -168 136 -26 155 134 -50 -138 -184 -183 -35 -114 199 77 -138 196
3929 196 44 -120 -11 76 92 -85 -85 357 -330 62 92 -84 21 -52 -2 -133 3 103 50 48 -247 -125 -13
3952 -13 270 -37 237 49 -75 139 -102 88 -20 -423 24 -24 94 41 -122 -141 -68 -214 -91 -98 -54 73 -131
$$ packed form
3787C9qM4j71J94k24K07q5J91p2n6l28K48k1K4j8o6M27l32R2k38K71j62J18ln4
3812A7Q8n8p6O5N8k48P0n5J52j45J77n4J89l6j89J41J0J26k68L0j99J29K56p0
3836A10k68J4J49P3j92q1L88k26N4J15l45K09j47J08O5K22k21L0k6J26r6J1J85
3859B57j05j11pk0J60j76J24P6j54L2j59K10j70o4P2R1j2J35j80J50r4R1p3j70
3883i7J93n8k80K29q5J98J05l11K14j93O0p7L18j09j27k34K87p9j3K65k43K3n
3906a9J35j98k33K23J72k3j48k1n6L04j62J81k1j84q8m6JJ48p9L13j22k15L34
3929A96j52j64J09Q7J6j77%M42o87L92L0j76J05p3N0j31J36J00n3kk95J22J12
3952a3K83l07K74j88j24K14k41J90j08m03M47m8J18n3j63j9P3j46J23pM4J27k04
$$ plain form
3975 -131 79 -34 5 125 16 -10 55 62 137 -134 -223 57 -219 -13 273 -110 -48 38 -60 -257 -29 133 21
3998 21 -113 121 206 78 281 -177 -135 -187 17 40 26 -258 -96 70 30 63 27 -44 -79 98 32 34 -191 46 119
4023 119 -182 99 133 6 -52 -181 -109 -184 214 20 -31 -104 -292 -188 169 -11 -254 -87 28 5 -261 -116
4045 -116 5 -174 190 50 69 -7 30 44 -66 -145 -395 104 16 96 65 147 -187 247 133 -190 21 -203 159
4068 159 -154 45 4 -103 -56 112 32 78 38 -89 315 -151 -119 171 154 -178 -51 -75 -204 31 90 -159 21
4091 21 -56 -113 300 13 -56 -95 -54 -67 186 -106 256 21 198 -146 -12 -93 117 -363 -405 82 -9 -37 -73 144
4115 144 -66 -8 184 -119 125 216 -292 120 -93 -158 148 96 129 48 -166 131 -66 -132 30 -37 -192 -146 107
4138 107 85 -166 80 -36 -93 28 47 -189 109 -56 69 -37 -56 -73 142 45 -51 -77 47 -171 -100 -48 -147 -220
$$ packed form
3975a31K10j13L9J20j09k6O5PP5k71q9K80k76K06K86l83O2Q6r8j97K28J62j12
3998B1j34K34Q5j28K03m58M2n2K04K3j4k84J62J66m0L3l6p1l5J77o6Kk25K37P3
4023A19l01K81L4j27n8j29P2p5L98j94n1p3j88J04L57j80k43J67J15k3k66J45
4045a16J21j79L64j40J9p6L7J4j10p9k50M99q8Q0l1Q2l34M34j14l23K11k24L62
4068A59l13J99m1j07M7J68q0M6m0j27M04m66L2K90j7l32J27k4j29K35N9k49J80
4091B1p7n7M13k87o9l9M1j3K53k92L62k35J77l44J34q1K10m80m2M87r1k8l6K17
4115A44k10N8J92l03K44R1n08M12k13o5L06n2L3q1k14K97j97o6J62o7j55M6K53
4138A07k2k51K46j16n7J21J9k36K98j65J25j06j9j7K15r7r6k6J24k18P1N2r9p3
$$ plain form
4162 -220 178 201 -146 -88 -84 50 -103 234 -9 131 55 109 -37 -8 -5 68 -74 151 -48 -75 43 -355 -52 19
4186 19 69 -32 25 9 -140 -21 123 19 -38 8 56 -106 84 60 -109 202 -79 -107 50 -241 43 -12 -115
4209 -115 283 -102 -116 -371 73 100 26 -74 44 60 -55 167 78 301 170 -141 -14 -68 -226 62 -80 82
4231 82 -156 117 23 147 34 -90 -165 -32 63 204 -46 16 -171 40 -256 106 79 -142 68 -139 -60 44
4253 44 -129 -58 128 38 136 7 -113 67 -196 -130 -18 -125 -206 -62 -225 -132 -67 -280 238 -43 -108 -181 -120 -9
4277 -9 -360 228 -87 33 -128 -243 102 -39 -36 -118 11 122 149 -92 -212 44 -123 39 133 -130 -145 35 -102
4300 -102 -57 -4 104 219 -158 -77 -84 -47 81 -73 -76 -312 -126 -113 9 111 55 89 193 23 -148 -285 -278 241
4324 241 -9 -71 -146 115 -44 113 -57 -149 -27 -264 49 56 -39 -10 -20 -276 -52 154 -91 -209 266 -93 -236
$$ packed form
4162b20L98K3l47N8MJ34j53L37k43J40p6N4j46K9LP3j42K25j99k7J18l98L03P1
4186A9N0j01N7j6j49J19J44j04n7M6M8j62J90k4j69L11k81k8J57k91K84n5j03
4209a15L98l85j4k55M44K7p4j00J18J6j15K22q9K23j31l11J27n4j58K88j42J62
4231H2k38K73r4J24j13j24p5J33R5J41k50O2j87K11k96L62k7k21K10k07P9J04
4253D4j73P1J86r0R8j29j20J80k63O6J12j07q1J44j63R3O5k13N18k81o5p3O1J11
4277il51N88l15J20j61j15L45j41Lq2J29J11K7k41j20K56j67J62R4k63j5J80j37
4300a02M5N3J08J15l77Q1pL7J28j54lk36J86J3J22J02n6L4J04j70j71j37PN19
4324B41k50o2p5K61j59J57j70r2J22k37L13Pr5K9j0k56K24K06k45j18M75l59j43
$$ plain form
4347 -236 132 21 -199 208 111 -5 192 -142 145 -204 70 149 -59 -32 -288 81 15 -51 114 -328 -172 -38
4369 -38 134 -224 -94 3 -105 152 -7 136 145 224 63 -71 110 110 -103 107 50 29 27 103 276 48 -29 184
4393 184 25 -9 -13 -82 -322 -204 -106 -21 -4 26 48 -50 -53 -142 -243 -39 -152 -178 -207 -68 -40 -45 148 -65 -84 -265
4419 -265 57 -147 -128 235 82 34 181 -73 -23 -72 -28 77 129 73 -124 -232 -16 -18 -210 149 -167 -12 13
4442 13 -183 -19 -25 119 -78 -145 46 -37 34 -29 -21 -35 41 -131 -46 28 -44 -43 -13 168 40 -134 29 100 86 -65
4468 -65 -21 -35 -88 -334 -104 -33 149 -91 29 72 -44 105 -95 -64 -23 -377 -75 -74 77 -176 -118 102 156 -57
4492 -57 132 88 6 -96 -40 101 -98 128 -147 62 -74 -116 -13 -138 -28 262 -10 -20 13 151 -237 -45
4514 -45 1 -249 15 -243 -195 -61 32 -35 -146 58 -132 -101 -73 -28 -213 -127 52 45 122 46 -78 75 219 -45
$$ packed form
4347b36L68j11k20M07r7j16J97l34K87l49K74P9k08K7k56L69o6o6J65m42J56J34
4369c8J72l58J30R7j08K57j59J43RP9j61j34J81%k13K10n7k1kP6J73k28p7K13
4393A84j59l4mo9k40J18R8Q5J7L0K2r8lq9j01K04j13k6k9J39K8nJ93k13j9j81
4419b65L22k04J9L63j53m8J47k54N0m9M4J05N2n6j97j08K16kj92L59l16J55K5
4442A3j96J64oJ44j97o7J91q3P1o3Qj4P6j72Q5P4p2JL0J81j28j74J63P1j4j51
4468f5M4j4n3k46K30P1J82k40J20M3j16J49k00L1M1l54L02JJ51k53N8K20N4k13
4492e7J89m4q2j02N6J41j99K26k75K09j36m2J03j25J10K90k72j0L3J38l88J92
4514d5M6k50K64k58M8J34R3o7j11K04j90L1K8M5j85Q6J79pP7p6j24J53J44k64
$$ plain form
4538 -45 134 56 40 -112 182 62 -117 433 -49 85 -5 -158 -147 -235 -124 -163 -44 115 189 39 18 -112 -20
4561 -20 20 -9 -311 35 -95 -182 -103 -235 -140 213 6 -87 253 38 174 -59 -180 -23 140 51 25 163 47
4584 47 -117 11 -169 -278 25 63 23 -82 58 -90 -90 210 -96 68 65 51 84 101 -14 -148 58 88 117 -23
4608 -23 -189 -130 170 70 47 25 -76 44 198 -33 -72 -89 -77 -81 13 231 -35 -78 102 113 -394 -109 61 -56
4632 -56 112 -117 -333 -14 45 -59 -123 -105 -65 -142 -91 84 -196 -40 167 -111 182 40 -143 324 -166 -74 25
4655 25 -146 -133 33 -115 31 -16 -198 -115 -258 392 -108 -356 147 -75 -28 48 -5 119 -52 61 62 98 150 56
4679 56 -144 -120 193 142 -23 -169 -44 -164 225 -79 -50 -100 103 141 161 30 119 -51 -155 77 -74 63 123
4702 123 -195 -135 99 -142 -74 -79 14 -35 -100 -11 111 -200 -10 88 147 69 98 -182 0 78 -105 91 107 149 -131
$$ packed form
4538d5J79p8j6j52K94j20j79N50m82J34r0j53J1q8J11l9J19J59P4j50k1j30R2
4561b0M0k9l02L46j30q7P9j32R5L53k07r3L40k15J36k33j21J57J63q9k6J38j16
4584D7j64J28j80j09L03L8m0j05J40j48%L00l06J64lj4L3J7j15j34K06L0K9j40
4608b3j66N9L00j00k3k2j01J20J54k31l9j7J2mR4K18k66m3J80J1n07K85J70j17
4632e6J68k29k16L19N9j04o4J8M0p7N1J75k80J56K07k78K93j42j83M67m90R2R9
4655B5j71J3J66j48J46m7j82Q3j43O50n00k48N03k22M7P6n3J24j71J13JL6N2r4
4679E6k00K4L13n1j65j46J25j20L89l04K9n0K03L8K0j31Q9j70j04K32j51J37O0
4702A23l18O0K34k41O8nR3m9o5Q9J22l11J90R8N9p8K9k80J82P8j83J96J6M2k80
$$ plain form
4727 -131 -24 -80 124 103 -14 -133 -45 23 7 80 -50 -56 -141 -59 -294 -51 -61 -175 -153 -80 -72 -35 150 73 106 -183
4753 -183 -139 21 -205 -108 -51 -173 -105 -193 77 15 144 190 83 50 127 -91 -83 88 248 127 -4 118 50 322
4777 322 -25 84 -62 -15 -103 -203 92 -202 -109 132 9 -101 -133 -81 -161 -73 174 -323 214 -120 -78 12 155
4800 155 -92 90 -56 -12 189 57 -130 -29 -67 -53 58 -66 47 22 -12 -52 40 -45 252 230 43 -61 -108
4823 -108 242 -31 129 -134 190 139 -185 205 80 -202 -155 -50 -69 131 -148 232 205 -83 -44 -228 -104 -16
4845 -16 -123 -427 -26 -16 144 152 32 -51 -2 -9 55 83 50 -32 -30 -56 -73 -11 -95 2 -58 -228 -47 -96 -32 -1 52 -127
4873 -127 -27 -24 -137 186 52 -78 -133 108 11 57 -226 -13 219 52 105 149 -94 127 -212 21 -109 -272
4895 -272 63 -109 32 -12 -99 179 233 -76 -83 63 31 -261 -129 -65 103 63 -60 81 81 16 -41 78 146 -145
$$ packed form
4727a31J07n6K04k1j17j19Q8O8j6P3j30oq5Q2k35K43j0j14K2P3QL7J85p7L3k89
4753a83M4J60k26R7N7j22O8q8K70o2J29M6j07l3P7k18QJ71J60j21j31J22o8K72
4777C22l47J09j46M7q8j00K95k94R3K41j23j10l2N2q0Q8K47m97N37l34M2R0J43
4800A55k47J82j46M4K01j32j87J01l8J4J11j24J13k5l4m0R2q5K97k2j87j04m7
4823a08L50k73J60k63L24n1l24L90j25k82M7J05j9K00k79L80k7k88L9j84J24Q8
4845a6j07l04M01J0J60Qj20q3M9pO4K8l3q2Kk6j7O2q4R7o0j70J81m9O4L1N3j79
4873a27J00Lj13L23j34j30n5K41r7M6k83K13K32j67N3M4k43K21l39K33j30j63
4895b72L35j72J41m4q7K78N4l09pJ46l2k92J32O4J68m0j23J41%o5n7J19O8k91
$$ plain form
4919 -145 -92 4 -51 75 -86 -208 100 -287 -16 -99 41 -3 -37 102 -197 -9 63 -75 -140 -373 -204 125 206
4942 206 44 121 54 238 -85 48 -13 -157 71 229 -88 -53 -63 192 -19 -41 166 -176 9 28 -141 -11
4964 -11 -125 43 61 48 8 194 72 -182 42 -52 130 135 269 -17 -144 207 -45 -182 24 -127 114 -96
4986 -96 -127 -148 -196 20 -40 -199 -91 135 101 115 -134 26 181 -96 37 265 117 -46 204 -249 -171 86 42
5009 42 232 63 -203 -229 142 108 -56 0 66 58 112 -141 170 194 135 -86 274 52 46 337 22 120 85 78 -77
5034 -77 61 53 206 -1 -41 -350 -24 95 -145 124 141 -65 50 50 -166 321 -142 -139 117 -28 -63 79 -71
5057 -71 153 -188 -28 243 -100 78 -136 -175 29 -75 253 -66 172 -31 31 -250 -28 -33 30 -164 36 -48
5079 -48 91 160 -141 131 41 25 -222 -190 -152 27 187 -9 202 -85 -33 -112 79 25 -95 -170 116 142 96 -121
$$ packed form
4919a45N3R6n5J26j61j22L08l87K71q3J40m4l4J39k99J88P2j38o5k33J69L29Q1
4942B06j62P7o7J84l23J33o1j44K28J58l17L5j0K55k11k2K07l42J85J9j69J30
4964a1j14J68J8j3m0J86j22k54K24r4J82NJ34k86j27L51k52j37K06j51K41k10
4986i6l1k1m8K16o0j59J08K26l4J4k49J60J55k77J33K28j48j63K50m53P8K57m4
5009D2J90j69k66k6L71l4j64N6O6qN4k53L11K4n9k21L60k22oK91l15R8l5pj55
5034g7J38qJ53k07m0l09L26J19k40K69J7k06J15%k16M87m63LK56j45l5J42j50
5057g1K24l41J60K71l43J78k14l9K04j04L28l19K38k03O2k81K22nO3j94K00q4
5079d8J39O9l01K72r0j6k47L2L8J79J60j96K11k87N2p9J91n4j20p5K86K6m6k17
$$ plain form
5103 -121 -27 141 -104 -21 -215 60 9 227 -22 101 67 -133 -176 63 -86 -52 88 192 87 89 14 100 -44
5126 -44 -250 -168 104 173 -50 21 52 -26 -89 73 -94 -68 11 161 21 -14 63 170 -323 -47 -44 74 -54 -193
5150 -193 -106 43 48 201 64 -52 -58 113 43 -177 -116 129 64 -192 67 -32 61 -10 -61 56 53 213 2 -98 99
5175 99 -152 -8 -17 70 -107 -253 -27 -51 -30 232 -41 119 -36 -236 -134 -300 97 -205 -20 16 -42 102 -197
5198 -197 35 133 160 -10 60 159 -265 234 -42 -112 24 -51 -263 128 52 12 16 -46 -120 116 138 -69 150 72 -219
5223 -219 -115 37 -37 -385 -201 63 222 -120 14 41 -193 122 -19 -12 -222 213 -86 0 -153 -129 -144 67
5245 67 -6 -1 30 -381 -113 -12 226 39 -180 -34 -100 47 172 56 160 221 96 -250 -61 189 -22 -268
5267 -268 -165 -85 326 71 319 -55 64 52 25 -60 -175 -181 240 -226 -100 170 -132 109 -275 -9 -84 29
$$ packed form
5103a21R4J68k45Q3j94K75n1K18k49J23l4k00m3K39j49L4J40J04j05Kp5Q6j44
5126d4k06Q2K72O9k23P1L1p8o3J62j67K6P9J50j40l5P7J07m93K76LJ18j28j39
5150a93Q7J49NJ53j37j16oJ71p0k20O1K45o5k56K59r9R3p1n1J17lJ60k11j00J97
5175I9k51J44rQ7j77j46K26k4K1K62k73J60j55k00J02j66L97l02J85L6n8J44k99
5198a97K32R8K7j70P0R9m24M99k76p0J36p5k12L91p6m0Mo2p4K36K2k07K19p8k91
5223b19J04J52p4l48J84K64J59l42J34K7k34L15j41Pk10M35k99Q6j53K4j5K11
5245F7p3NL1m11K68J01K38j87k19J46o6J47J25j16J04O1j25l46J89K50k11k46
5267b68J03Q0M11k55K48l74J19j2k7q5j15oM21m66J26K70l02K41l84K66p5J13
$$ plain form
5289 29 -24 165 147 417 34 -53 81 141 11 96 -245 -61 -171 124 47 -86 -286 40 -211 -295 192 -68 -64
5312 -64 -22 94 -107 -45 -29 -85 114 -243 168 37 -155 83 -235 -91 -123 41 208 66 78 -68 32 96 -257
5335 -257 272 -66 52 -37 -248 76 157 -97 140 43 64 -92 -14 -127 99 -82 -101 68 35 6 15 -114 128
5358 128 -176 422 -68 -167 -79 -131 438 -75 10 63 -81 -43 -22 -105 -16 41 148 -242 46 -57 441 149 -123
5381 -123 68 -34 -272 -150 321 -170 -21 89 185 70 -227 -58 261 304 13 -186 -194 -64 -131 4 -65 170
5403 170 0 -96 -63 97 29 -29 -65 -116 -263 167 72 166 14 -213 72 141 51 -57 -96 323 101 82 -45 43
5427 43 219 -191 77 163 -6 -61 -55 7 148 -18 65 -206 -97 -147 41 48 -281 -32 -24 89 -151 -154 304 -186 -6
5452 -6 114 127 -53 474 -140 -7 -29 -52 30 35 115 -113 116 -244 261 -34 -67 -31 126 -12 66 33 -241 13
$$ packed form
5289B9n3J89j8K70l83q7J34O0j30Q5l41J84j10K95p7j33k00L26k51q4M87k60M
5312f4M2J16k01O2J6n6J99l57M11j31j92K38l18J44l2J64J67j42J2j46J00O4l53
5335b57N29l38J18q9k11L24Q1k54K37r7K1j56P8j13K26j81j9J69l3k9Rj29K42
5358A28l04N98m90r9Q8n2N69n13Q5N3j44L8K1q3Q9N7J07l90K88j03M98k92k72
5381a23J91j02k38J22M71m91J49J10R6j15k97J69L19M3k91j99qJ30o7J35o9K35
5403A70j70r6L3J60o8n8l6n1j47M30r5R4j52k27K85O9r0j08l9M19k22j9j27Q8
5427D3J76m10K68Q6j69n5OO2J41j66Q3k71J09n0J88Pl29K49QJ13k40lM58m90J80
5452fJ20J3j80N27o14J33k2k3Q2NQ0k28K29l60N05k95l3L6J57j38P8l3k74K54
$$ plain form
5476 13 -56 68 118 -3 201 80 107 -174 -106 171 -155 -38 -56 -129 80 73 119 -168 -80 68 48 227 172 126 158
5501 158 -27 69 -21 118 -55 -136 45 -166 -120 67 -149 163 -40 104 -37 169 -51 -137 103 57 -71 134
5523 134 -90 -223 14 -307 91 -172 30 87 147 -337 17 133 -31 35 149 247 6 -128 -30 106 96 -37
5545 -37 -6 -17 -61 -193 58 -119 -232 -72 -159 203 70 75 -83 -57 -74 170 6 110 -71 -108 136 -47 108
5568 108 -42 -49 -123 -43 -60 66 16 -112 -179 -186 -16 -140 98 224 -170 -97 91 -186 -182 -32 113 -5 -62 -83 -44
5593 -44 17 -24 -238 -43 -212 1 -77 -18 216 -224 110 -84 45 262 191 23 229 -183 -136 -191 -51 123 244
5616 244 -208 -54 -147 241 132 -120 212 -32 139 -50 -137 -23 -38 -162 -48 -66 49 -99 -5 -201 51 -82
5638 -82 35 20 -57 -140 -205 -104 82 115 -193 69 -46 -20 -57 34 -57 -45 211 -15 -219 -181 -52 -32 234 -116
$$ packed form
5476A3o9J24N0j21K04j21K7k81O8K77l26J17j8p3K09pM6k87Q8J48k0J79n5m6L2
5501A58j85R6r0J39j73q1J81k11M6J87k16L12k03J44j41K06k20q6K40m6j28K05
5523A34k24j33K37l21L98k63K02N7O0m84L54J16j64O6J14R8k41j34R8J36j0j33
5545c7L1j1m4j32K51j77j13J60q7L62j33Nj58K6j7K44j64J04j81l7K44j83J55
5568A08j50pp4Q0j7J26n0j28o7pJ70j24K38J26l94P3J88k77MJ50J45j18n7k1L9
5593d4O1m1k14J95j69K13p8N9K34m40L34j94J29K17p1j68K06m12M7n5J40J74J21
5616B44m52J54r3L88j09k52L32k44J71j89q7J14j5j24J14j8J15j48R4j96K52j33
5638h2J17j5p7q3o5J01J86L3l08K62j15K6l7R1r1J2K56k26k04L8J29K0K66l50
$$ plain form
5662 -116 282 17 -178 86 -66 -25 -81 207 58 222 -37 12 -133 152 -11 -17 -6 230 -3 -15 159 -145
5684 -145 59 134 208 -4 -58 160 60 120 63 -53 49 -30 -110 51 328 -258 22 -23 101 3 -266 101 -111
5707 -111 8 -44 -116 51 168 -12 176 -212 -173 -68 -60 -135 -64 -66 -189 23 13 -61 -92 70 -249 159 -34 -49
5731 -49 -26 85 -121 0 -185 100 -34 -56 -15 -12 -85 -21 -90 -93 -89 176 25 214 -17 72 127 36 83 139 -154 -188
5757 -188 62 -2 -55 16 -124 -115 -152 -89 20 -49 157 209 -83 -116 -132 -72 -102 -58 190 -217 133 184 -126 24 82
5782 82 -6 -52 77 -6 129 51 -37 102 -86 -75 -178 -77 40 26 -11 32 -15 -3 -39 37 110 112 8 171 -64 -165
5808 -165 -2 120 -139 29 28 204 -26 76 -72 -26 167 -47 -42 -13 -52 98 3 66 -65 -16 -86 -61 104 33
5832 33 -96 57 324 -166 131 46 -37 33 45 -25 -45 38 -75 197 50 -154 -33 -157 -250 -205 143 67 14 107
$$ packed form
5662a16L98k65j95K64j52M1n6K88j49J64k59M9j45K85j63oJ1K36k33j2J74l04
5684a45K04P5P4k12n4K18j00O0n7j16J02p9q0J61K77n86K80m5J24r8k69L67k12
5707a11J19n2p2J67J17j80J88l88L9J05Qp5P1kj23K12j0p4l1J62l19M08j93j5
5731d9K3J11k06J21j85K85j34k2M1Lp3O4o9lMK65j51J89k31Q9N5r1M7N6k93l4
5757a88K50o4n3P1j40Rl7O3J09o9K06N2k92l3j6O0l0M4K48m07L50N1l10J50N8
5782H2q8m6J29q3J35p8q8J39j88J1j03J01J17j4l7M3m7J2l6P6P3Kj04J63k35j01
5808a65J63J22k59J68jJ76k30J02j48M6J93k14NK9l9J50r5O3j31M9p0K5J65p1
5832C3j29J53K67m90K97q5q3P0J2p0k0Q3j13K72j47k04J21j24r3M5L48p6n3R3
$$ plain form
5856 107 -1 -32 89 189 291 136 -169 18 -9 187 33 -26 18 51 26 -61 115 206 11 -13 42 106 -130 -81
5880 -81 -83 -26 98 72 71 17 -40 -262 114 278 113 201 74 91 -314 42 -126 202 -127 -54 116 -31 90 307
5904 307 42 150 37 -57 -51 184 -99 -49 -117 95 -30 256 -192 -61 131 105 115 92 121 -249 -205 153 -244
5927 -244 299 121 -61 -178 95 51 -23 3 -65 103 -156 63 32 -98 -205 -25 131 18 38 -107 20 -26
5949 -26 -16 -55 40 -6 77 -101 101 5 -295 127 -210 -160 14 -123 -115 -96 23 -61 -56 -71 -4 -30 67 -117 96 15
5975 15 183 54 155 -50 -118 -211 2 72 135 -33 -5 125 -27 84 167 -371 101 -227 -103 118 235 138 -4
5998 -4 -88 146 -176 -275 3 -97 128 -15 9 181 -77 165 67 -175 -86 114 54 111 -167 -85 -113 -13 115 105
6022 105 150 -66 31 180 266 -262 236 -106 35 -156 136 78 141 -45 -85 156 213 21 265 85 79 118 56 -166
$$ packed form
5856A07j08l1J21J00J02j55l05J87k7J96j54n9M4L3k5q7J76R1j95k4N5O4k36M9
5880h1kN7J24k6jn4n7k22L76J64j65Q8j27J7m05L56j68L28l29P3J70j47J21K17
5904C07k65J08j13r4OK35k83N0o8K12j25K86m48J31J92k6J0k3K9l70M4L58l97
5927b44N43j78j82j17K73m4p4K6o8J68k59K19l1j30j07J80J56j13K0j45J27m6
5949b6J0l9R5m6Q3j78K02r6l00M22l37N0J74j37QJ9J19q4Nj5O7k6R7j84K13q1
5975A5J68j29J01k05o8r3K13P0O3j68K8J30j52J11Q3n38M72l28J24K21J17r7j42
5998dq4K34l22r9K78j00K25j43K4J72k58K42r8k42Q9K00o0N7k78Q2k8J00J28j0
6022A05M5k16R7J49Q6n28M98l42J41j91K92n8O3j86m0K41N7j92K44j80oL9o2k22
$$ plain form
6046 -166 78 -145 -115 487 -127 -29 78 19 285 -200 -68 -83 81 -88 204 -16 29 30 58 -131 162 71 -274
6069 -274 -72 -246 113 -211 185 -113 -41 -64 11 170 196 273 34 323 -2 -27 10 -158 -163 -126 -10 -55 19 -100
6093 -100 30 45 -53 208 -70 -160 -290 -36 105 26 14 -51 -196 35 -150 71 230 17 -137 168 -3 -183
6115 -183 73 113 -69 -7 -88 136 43 -45 -63 23 -143 -102 -26 -62 -78 -294 91 -185 185 47 -135 -293 -184 244
6139 244 -262 -182 -32 60 -98 72 42 -90 -48 -164 15 -47 -113 -82 147 -94 -69 -180 -86 -179 -141 117 12 90
6163 90 173 180 -19 -267 -28 228 45 81 -54 -232 106 -122 -119 -38 5 67 -80 101 220 97 77 249 -9 55
6187 55 126 235 -14 -59 26 50 66 -151 -23 -36 -233 -126 160 319 -90 -5 -130 -11 106 70 13 12 -367 34
6211 34 77 119 230 -35 -164 -1 -160 -20 138 80 -83 -57 251 -92 12 153 -209 168 -16 -77 -94 -19 271
$$ packed form
6046a66K44k23L0O02o14R8J07n9K66m85J32j5J64j69K92k20M5JK8j89K93r1l45
6069b74K02j74L59l24L96k98P2k3P5J59K6P7k39K89l25k5L7j68nL7J16m5P4j19
6093a00J30J5r8K61k78r0j30K54J41p9j2o5j45K31j85K21J59k13j54L05j71j80
6115a83K56M0j82O2q1K24r3q8j8Q6j66M1P6l6j6k16L85k76L70j38j82j58J09M28
6139B44n06Q0J50R2j58J70l0j32M2j16J79o2o6L1K29k41K5j11R4r3L8K58j05P8
6163I0Q3Pj99k48K39K56j83L6j35j78L38k28LQ1M3O2j47J81J19j23k0J72k58O4
6187E5P1J09k49m5Q5K4J6k17J28j3j97J07K86J59m09Q5j25J19J17l6n7jl79M01
6211C4M3M2J11k65j29J63j59J40J58n8j63K6L08l43J04J41l62L77j84o1j7P5K90
$$ plain form
6234 271 -150 31 112 -177 -46 -189 -26 -13 -151 -115 -99 -17 92 -111 -167 35 23 91 35 18 65 -120 -134 -90
6258 -90 -25 98 -141 -3 -154 13 -162 21 -135 209 6 150 -67 137 -124 -128 112 -95 293 -190 -4
6279 -4 -45 -24 129 -86 -168 1 78 97 -53 357 -211 54 -88 117 -51 -176 -58 37 -287 -45 43 5 211
6302 211 89 107 -27 -169 -33 157 174 -9 -58 144 8 116 108 -6 251 227 126 -258 -248 -133 -70 63 -12
6325 -12 -86 33 127 105 75 -135 21 -114 -16 -158 52 -142 -90 50 -32 -30 57 -12 85 23 64 -161 -152 27 139 311
6351 311 182 39 10 -65 -54 -171 -198 -88 135 26 -404 -37 -103 -61 -79 -236 102 -164 0 -102 -35 -43 118
6374 118 287 234 196 -99 -27 187 -86 37 42 19 -3 72 -4 -25 -22 157 -195 -10 152 68 -256 131 238 20
$$ packed form
6234B71m21J81Q1k89J31j43J63J3j38L6J6Q2J09k03n6K02j2O8n6j7M7j85j4M4
6258i0O5J23k39J38j51J67j75J83j56L44k03J44k17K04k61mK40k07L88m83J86
6279dm1K1J53k15q2J69P7J9j50M10n68K65j42K05j68j25J18R5l24K42Q8l8K06
6302B11j22J8j34j42J36J90J7j83m9K02j36J08qj14K57k4j01l84J0J15O3J33p5
6325a2p4J19R4k2l0k10J56j35R8j42K10j94N2J40q2KQ7o9R7o2M1k25RJ79J12J72
6351C11j29j43k9p5J1j17k7J10K23j09m30L67o6M2j8j57L38k66J64j02O7qJ61
6374A18J69n3l8k95P2K14k73J23Nk3k2P5p6k1LJ79l52J85J62q4l24L87J07k18
$$ [...]
8191b2
##END NTUPLES=NMR FID
##END=
